%!PS-Adobe-3.0 EPSF-3.0
%%Creator: (MATLAB, The Mathworks, Inc. Version 9.8.0.1323502 \(R2020a\). Operating System: Mac OS X)
%%Title: /Users/kosciessa/Desktop/mntTardisLNDG/LNDG/stateswitch/stsw_multimodal/figures/correlations/f_pupil_theta.eps
%%CreationDate: 2022-03-11T15:12:22
%%Pages: (atend)
%%BoundingBox:     3     0   235   194
%%LanguageLevel: 3
%%EndComments
%%BeginProlog
%%BeginResource: procset (Apache XML Graphics Std ProcSet) 1.2 0
%%Version: 1.2 0
%%Copyright: (Copyright 2001-2003,2010 The Apache Software Foundation. License terms: http://www.apache.org/licenses/LICENSE-2.0)
/bd{bind def}bind def
/ld{load def}bd
/GR/grestore ld
/GS/gsave ld
/RM/rmoveto ld
/C/curveto ld
/t/show ld
/L/lineto ld
/ML/setmiterlimit ld
/CT/concat ld
/f/fill ld
/N/newpath ld
/S/stroke ld
/CC/setcmykcolor ld
/A/ashow ld
/cp/closepath ld
/RC/setrgbcolor ld
/LJ/setlinejoin ld
/GC/setgray ld
/LW/setlinewidth ld
/M/moveto ld
/re {4 2 roll M
1 index 0 rlineto
0 exch rlineto
neg 0 rlineto
cp } bd
/_ctm matrix def
/_tm matrix def
/BT { _ctm currentmatrix pop matrix _tm copy pop 0 0 moveto } bd
/ET { _ctm setmatrix } bd
/iTm { _ctm setmatrix _tm concat } bd
/Tm { _tm astore pop iTm 0 0 moveto } bd
/ux 0.0 def
/uy 0.0 def
/F {
  /Tp exch def
  /Tf exch def
  Tf findfont Tp scalefont setfont
  /cf Tf def  /cs Tp def
} bd
/ULS {currentpoint /uy exch def /ux exch def} bd
/ULE {
  /Tcx currentpoint pop def
  gsave
  newpath
  cf findfont cs scalefont dup
  /FontMatrix get 0 get /Ts exch def /FontInfo get dup
  /UnderlinePosition get Ts mul /To exch def
  /UnderlineThickness get Ts mul /Tt exch def
  ux uy To add moveto  Tcx uy To add lineto
  Tt setlinewidth stroke
  grestore
} bd
/OLE {
  /Tcx currentpoint pop def
  gsave
  newpath
  cf findfont cs scalefont dup
  /FontMatrix get 0 get /Ts exch def /FontInfo get dup
  /UnderlinePosition get Ts mul /To exch def
  /UnderlineThickness get Ts mul /Tt exch def
  ux uy To add cs add moveto Tcx uy To add cs add lineto
  Tt setlinewidth stroke
  grestore
} bd
/SOE {
  /Tcx currentpoint pop def
  gsave
  newpath
  cf findfont cs scalefont dup
  /FontMatrix get 0 get /Ts exch def /FontInfo get dup
  /UnderlinePosition get Ts mul /To exch def
  /UnderlineThickness get Ts mul /Tt exch def
  ux uy To add cs 10 mul 26 idiv add moveto Tcx uy To add cs 10 mul 26 idiv add lineto
  Tt setlinewidth stroke
  grestore
} bd
/QT {
/Y22 exch store
/X22 exch store
/Y21 exch store
/X21 exch store
currentpoint
/Y21 load 2 mul add 3 div exch
/X21 load 2 mul add 3 div exch
/X21 load 2 mul /X22 load add 3 div
/Y21 load 2 mul /Y22 load add 3 div
/X22 load /Y22 load curveto
} bd
/SSPD {
dup length /d exch dict def
{
/v exch def
/k exch def
currentpagedevice k known {
/cpdv currentpagedevice k get def
v cpdv ne {
/upd false def
/nullv v type /nulltype eq def
/nullcpdv cpdv type /nulltype eq def
nullv nullcpdv or
{
/upd true def
} {
/sametype v type cpdv type eq def
sametype {
v type /arraytype eq {
/vlen v length def
/cpdvlen cpdv length def
vlen cpdvlen eq {
0 1 vlen 1 sub {
/i exch def
/obj v i get def
/cpdobj cpdv i get def
obj cpdobj ne {
/upd true def
exit
} if
} for
} {
/upd true def
} ifelse
} {
v type /dicttype eq {
v {
/dv exch def
/dk exch def
/cpddv cpdv dk get def
dv cpddv ne {
/upd true def
exit
} if
} forall
} {
/upd true def
} ifelse
} ifelse
} if
} ifelse
upd true eq {
d k v put
} if
} if
} if
} forall
d length 0 gt {
d setpagedevice
} if
} bd
/RE { % /NewFontName [NewEncodingArray] /FontName RE -
  findfont dup length dict begin
  {
    1 index /FID ne
    {def} {pop pop} ifelse
  } forall
  /Encoding exch def
  /FontName 1 index def
  currentdict definefont pop
  end
} bind def
%%EndResource
%%BeginResource: procset (Apache XML Graphics EPS ProcSet) 1.0 0
%%Version: 1.0 0
%%Copyright: (Copyright 2002-2003 The Apache Software Foundation. License terms: http://www.apache.org/licenses/LICENSE-2.0)
/BeginEPSF { %def
/b4_Inc_state save def         % Save state for cleanup
/dict_count countdictstack def % Count objects on dict stack
/op_count count 1 sub def      % Count objects on operand stack
userdict begin                 % Push userdict on dict stack
/showpage { } def              % Redefine showpage, { } = null proc
0 setgray 0 setlinecap         % Prepare graphics state
1 setlinewidth 0 setlinejoin
10 setmiterlimit [ ] 0 setdash newpath
/languagelevel where           % If level not equal to 1 then
{pop languagelevel             % set strokeadjust and
1 ne                           % overprint to their defaults.
{false setstrokeadjust false setoverprint
} if
} if
} bd
/EndEPSF { %def
count op_count sub {pop} repeat            % Clean up stacks
countdictstack dict_count sub {end} repeat
b4_Inc_state restore
} bd
%%EndResource
%FOPBeginFontDict
%%IncludeResource: font Courier-Oblique
%%IncludeResource: font Courier-BoldOblique
%%IncludeResource: font Courier-Bold
%%IncludeResource: font ZapfDingbats
%%IncludeResource: font Symbol
%%IncludeResource: font Helvetica
%%IncludeResource: font Helvetica-Oblique
%%IncludeResource: font Helvetica-Bold
%%IncludeResource: font Helvetica-BoldOblique
%%IncludeResource: font Times-Roman
%%IncludeResource: font Times-Italic
%%IncludeResource: font Times-Bold
%%IncludeResource: font Times-BoldItalic
%%IncludeResource: font Courier
%FOPEndFontDict
%%BeginResource: encoding WinAnsiEncoding
/WinAnsiEncoding [
/.notdef /.notdef /.notdef /.notdef /.notdef
/.notdef /.notdef /.notdef /.notdef /.notdef
/.notdef /.notdef /.notdef /.notdef /.notdef
/.notdef /.notdef /.notdef /.notdef /.notdef
/.notdef /.notdef /.notdef /.notdef /.notdef
/.notdef /.notdef /.notdef /.notdef /.notdef
/.notdef /.notdef /space /exclam /quotedbl
/numbersign /dollar /percent /ampersand /quotesingle
/parenleft /parenright /asterisk /plus /comma
/hyphen /period /slash /zero /one
/two /three /four /five /six
/seven /eight /nine /colon /semicolon
/less /equal /greater /question /at
/A /B /C /D /E
/F /G /H /I /J
/K /L /M /N /O
/P /Q /R /S /T
/U /V /W /X /Y
/Z /bracketleft /backslash /bracketright /asciicircum
/underscore /quoteleft /a /b /c
/d /e /f /g /h
/i /j /k /l /m
/n /o /p /q /r
/s /t /u /v /w
/x /y /z /braceleft /bar
/braceright /asciitilde /bullet /Euro /bullet
/quotesinglbase /florin /quotedblbase /ellipsis /dagger
/daggerdbl /circumflex /perthousand /Scaron /guilsinglleft
/OE /bullet /Zcaron /bullet /bullet
/quoteleft /quoteright /quotedblleft /quotedblright /bullet
/endash /emdash /asciitilde /trademark /scaron
/guilsinglright /oe /bullet /zcaron /Ydieresis
/space /exclamdown /cent /sterling /currency
/yen /brokenbar /section /dieresis /copyright
/ordfeminine /guillemotleft /logicalnot /sfthyphen /registered
/macron /degree /plusminus /twosuperior /threesuperior
/acute /mu /paragraph /middot /cedilla
/onesuperior /ordmasculine /guillemotright /onequarter /onehalf
/threequarters /questiondown /Agrave /Aacute /Acircumflex
/Atilde /Adieresis /Aring /AE /Ccedilla
/Egrave /Eacute /Ecircumflex /Edieresis /Igrave
/Iacute /Icircumflex /Idieresis /Eth /Ntilde
/Ograve /Oacute /Ocircumflex /Otilde /Odieresis
/multiply /Oslash /Ugrave /Uacute /Ucircumflex
/Udieresis /Yacute /Thorn /germandbls /agrave
/aacute /acircumflex /atilde /adieresis /aring
/ae /ccedilla /egrave /eacute /ecircumflex
/edieresis /igrave /iacute /icircumflex /idieresis
/eth /ntilde /ograve /oacute /ocircumflex
/otilde /odieresis /divide /oslash /ugrave
/uacute /ucircumflex /udieresis /yacute /thorn
/ydieresis
] def
%%EndResource
%FOPBeginFontReencode
/Courier-Oblique findfont
dup length dict begin
  {1 index /FID ne {def} {pop pop} ifelse} forall
  /Encoding WinAnsiEncoding def
  currentdict
end
/Courier-Oblique exch definefont pop
/Courier-BoldOblique findfont
dup length dict begin
  {1 index /FID ne {def} {pop pop} ifelse} forall
  /Encoding WinAnsiEncoding def
  currentdict
end
/Courier-BoldOblique exch definefont pop
/Courier-Bold findfont
dup length dict begin
  {1 index /FID ne {def} {pop pop} ifelse} forall
  /Encoding WinAnsiEncoding def
  currentdict
end
/Courier-Bold exch definefont pop
/Helvetica findfont
dup length dict begin
  {1 index /FID ne {def} {pop pop} ifelse} forall
  /Encoding WinAnsiEncoding def
  currentdict
end
/Helvetica exch definefont pop
/Helvetica-Oblique findfont
dup length dict begin
  {1 index /FID ne {def} {pop pop} ifelse} forall
  /Encoding WinAnsiEncoding def
  currentdict
end
/Helvetica-Oblique exch definefont pop
/Helvetica-Bold findfont
dup length dict begin
  {1 index /FID ne {def} {pop pop} ifelse} forall
  /Encoding WinAnsiEncoding def
  currentdict
end
/Helvetica-Bold exch definefont pop
/Helvetica-BoldOblique findfont
dup length dict begin
  {1 index /FID ne {def} {pop pop} ifelse} forall
  /Encoding WinAnsiEncoding def
  currentdict
end
/Helvetica-BoldOblique exch definefont pop
/Times-Roman findfont
dup length dict begin
  {1 index /FID ne {def} {pop pop} ifelse} forall
  /Encoding WinAnsiEncoding def
  currentdict
end
/Times-Roman exch definefont pop
/Times-Italic findfont
dup length dict begin
  {1 index /FID ne {def} {pop pop} ifelse} forall
  /Encoding WinAnsiEncoding def
  currentdict
end
/Times-Italic exch definefont pop
/Times-Bold findfont
dup length dict begin
  {1 index /FID ne {def} {pop pop} ifelse} forall
  /Encoding WinAnsiEncoding def
  currentdict
end
/Times-Bold exch definefont pop
/Times-BoldItalic findfont
dup length dict begin
  {1 index /FID ne {def} {pop pop} ifelse} forall
  /Encoding WinAnsiEncoding def
  currentdict
end
/Times-BoldItalic exch definefont pop
/Courier findfont
dup length dict begin
  {1 index /FID ne {def} {pop pop} ifelse} forall
  /Encoding WinAnsiEncoding def
  currentdict
end
/Courier exch definefont pop
%FOPEndFontReencode
%%EndProlog
%%Page: 1 1
%%PageBoundingBox: 0 0 255 198
%%BeginPageSetup
[1 0 0 -1 0 198] CT
%%EndPageSetup
GS
[1.00046 0 0 1.00215 0 -0.4252] CT
1 GC
N
0 0 255 198 re
f
GR
GS
[1.00046 0 0 1.00215 0 -0.4252] CT
1 GC
N
0 0 255 198 re
f
GR
GS
[1.00046 0 0 1.00215 0 -0.4252] CT
0.2 GC
N
66.5 143 M
231.5 143 L
231.5 21 L
66.5 21 L
cp
f
GR
GS
[1.00046 0 0 1.00215 0 -0.4252] CT
0.149 GC
2 setlinecap
1 LJ
0.5 LW
N
66.5 143 M
231.5 143 L
S
GR
GS
[1.00046 0 0 1.00215 0 -0.4252] CT
0.149 GC
2 setlinecap
1 LJ
0.5 LW
N
66.5 143 M
66.5 141.35 L
S
GR
GS
[1.00046 0 0 1.00215 0 -0.4252] CT
0.149 GC
2 setlinecap
1 LJ
0.5 LW
N
117.301 143 M
117.301 141.35 L
S
GR
GS
[1.00046 0 0 1.00215 0 -0.4252] CT
0.149 GC
2 setlinecap
1 LJ
0.5 LW
N
168.103 143 M
168.103 141.35 L
S
GR
GS
[1.00046 0 0 1.00215 0 -0.4252] CT
0.149 GC
2 setlinecap
1 LJ
0.5 LW
N
218.904 143 M
218.904 141.35 L
S
GR
GS
[1.00046 0 0 1.00215 66.5308 147.6922] CT
0.149 GC
/Helvetica 14 F
GS
[1 0 0 1 0 0] CT
-7 14 moveto 
1 -1 scale
(-5) t 
GR
GR
GS
[1.00046 0 0 1.00215 117.35567 147.6922] CT
0.149 GC
/Helvetica 14 F
GS
[1 0 0 1 0 0] CT
-4 14 moveto 
1 -1 scale
(0) t 
GR
GR
GS
[1.00046 0 0 1.00215 168.18055 147.6922] CT
0.149 GC
/Helvetica 14 F
GS
[1 0 0 1 0 0] CT
-4 14 moveto 
1 -1 scale
(5) t 
GR
GR
GS
[1.00046 0 0 1.00215 219.00542 147.6922] CT
0.149 GC
/Helvetica 14 F
GS
[1 0 0 1 0 0] CT
-8 14 moveto 
1 -1 scale
(10) t 
GR
GR
GS
[1.00046 0 0 1.00215 149.06909 165.22978] CT
0.149 GC
/Helvetica 14 F
GS
[1 0 0 1 0 0] CT
-25 14 moveto 
1 -1 scale
(pupil bs) t 
GR
GR
GS
[1.00046 0 0 1.00215 149.06909 165.22978] CT
0.149 GC
/Helvetica 14 F
GS
[1 0 0 1 0 0] CT
-57.5 31 moveto 
1 -1 scale
(\(linear modulation\)) t 
GR
GR
GS
[1.00046 0 0 1.00215 0 -0.4252] CT
0.149 GC
2 setlinecap
1 LJ
0.5 LW
N
66.5 143 M
66.5 21 L
S
GR
GS
[1.00046 0 0 1.00215 0 -0.4252] CT
0.149 GC
2 setlinecap
1 LJ
0.5 LW
N
66.5 130.292 M
68.15 130.292 L
S
GR
GS
[1.00046 0 0 1.00215 0 -0.4252] CT
0.149 GC
2 setlinecap
1 LJ
0.5 LW
N
66.5 102.012 M
68.15 102.012 L
S
GR
GS
[1.00046 0 0 1.00215 0 -0.4252] CT
0.149 GC
2 setlinecap
1 LJ
0.5 LW
N
66.5 73.732 M
68.15 73.732 L
S
GR
GS
[1.00046 0 0 1.00215 0 -0.4252] CT
0.149 GC
2 setlinecap
1 LJ
0.5 LW
N
66.5 45.452 M
68.15 45.452 L
S
GR
GS
[1.00046 0 0 1.00215 61.72858 130.14688] CT
0.149 GC
/Helvetica 14 F
GS
[1 0 0 1 0 0] CT
-25 5.5 moveto 
1 -1 scale
(-0.1) t 
GR
GR
GS
[1.00046 0 0 1.00215 61.72858 101.80606] CT
0.149 GC
/Helvetica 14 F
GS
[1 0 0 1 0 0] CT
-8 5.5 moveto 
1 -1 scale
(0) t 
GR
GR
GS
[1.00046 0 0 1.00215 61.72858 73.46525] CT
0.149 GC
/Helvetica 14 F
GS
[1 0 0 1 0 0] CT
-20 5.5 moveto 
1 -1 scale
(0.1) t 
GR
GR
GS
[1.00046 0 0 1.00215 61.72858 45.12443] CT
0.149 GC
/Helvetica 14 F
GS
[1 0 0 1 0 0] CT
-20 5.5 moveto 
1 -1 scale
(0.2) t 
GR
GR
GS
[0 -1.00215 1.00046 0 33.71561 81.75083] CT
0.149 GC
/Helvetica 14 F
GS
[1 0 0 1 0 0] CT
-16 -20 moveto 
1 -1 scale
(theta) t 
GR
GR
GS
[0 -1.00215 1.00046 0 33.71561 81.75083] CT
0.149 GC
/Helvetica 14 F
GS
[1 0 0 1 0 0] CT
-57.5 -3 moveto 
1 -1 scale
(\(linear modulation\)) t 
GR
GR
GS
[1.00046 0 0 1.00215 149.06915 18.86614] CT
/Helvetica-Bold 14 F
GS
[1 0 0 1 0 0] CT
-52.5 -4 moveto 
1 -1 scale
(r = 0.28 p = 0.01) t 
GR
GR
GS
[1.00046 0 0 1.00215 89.53587 108.48087] CT
0.8 0.502 0.502 RC
N
0.5 0 M
0.5 -0.276 0.276 -0.5 0 -0.5 C
-0.276 -0.5 -0.5 -0.276 -0.5 0 C
-0.5 0.276 -0.276 0.5 0 0.5 C
0.276 0.5 0.5 0.276 0.5 0 C
cp
f
GR
GS
[1.00046 0 0 1.00215 207.37411 112.61133] CT
0.8 0.502 0.502 RC
N
/f-2105962265{0.5 0 M
0.5 -0.276 0.276 -0.5 0 -0.5 C
-0.276 -0.5 -0.5 -0.276 -0.5 0 C
-0.5 0.276 -0.276 0.5 0 0.5 C
0.276 0.5 0.5 0.276 0.5 0 C
cp}def
f-2105962265
f
GR
GS
[1.00046 0 0 1.00215 147.91955 55.99116] CT
0.8 0.502 0.502 RC
N
f-2105962265
f
GR
GS
[1.00046 0 0 1.00215 121.92865 73.72936] CT
0.8 0.502 0.502 RC
N
f-2105962265
f
GR
GS
[1.00046 0 0 1.00215 168.13212 97.34456] CT
0.8 0.502 0.502 RC
N
f-2105962265
f
GR
GS
[1.00046 0 0 1.00215 213.97261 83.02491] CT
0.8 0.502 0.502 RC
N
f-2105962265
f
GR
GS
[1.00046 0 0 1.00215 184.89642 81.72351] CT
0.8 0.502 0.502 RC
N
f-2105962265
f
GR
GS
[1.00046 0 0 1.00215 188.24104 61.98687] CT
0.8 0.502 0.502 RC
N
f-2105962265
f
GR
GS
[1.00046 0 0 1.00215 149.65389 99.24954] CT
0.8 0.502 0.502 RC
N
f-2105962265
f
GR
GS
[1.00046 0 0 1.00215 126.49417 74.59047] CT
0.8 0.502 0.502 RC
N
f-2105962265
f
GR
GS
[1.00046 0 0 1.00215 149.09969 66.107] CT
0.8 0.502 0.502 RC
N
f-2105962265
f
GR
GS
[1.00046 0 0 1.00215 137.53388 90.09654] CT
0.8 0.502 0.502 RC
N
f-2105962265
f
GR
GS
[1.00046 0 0 1.00215 149.66326 85.32055] CT
0.8 0.502 0.502 RC
N
f-2105962265
f
GR
GS
[1.00046 0 0 1.00215 89.53587 91.63649] CT
0.8 0.502 0.502 RC
N
f-2105962265
f
GR
GS
[1.00046 0 0 1.00215 168.57419 65.01265] CT
0.8 0.502 0.502 RC
N
f-2105962265
f
GR
GS
[1.00046 0 0 1.00215 169.53974 113.28973] CT
0.8 0.502 0.502 RC
N
f-2105962265
f
GR
GS
[1.00046 0 0 1.00215 154.46207 93.54681] CT
0.8 0.502 0.502 RC
N
f-2105962265
f
GR
GS
[1.00046 0 0 1.00215 176.51146 92.99815] CT
0.8 0.502 0.502 RC
N
f-2105962265
f
GR
GS
[1.00046 0 0 1.00215 163.97045 65.2499] CT
0.8 0.502 0.502 RC
N
f-2105962265
f
GR
GS
[1.00046 0 0 1.00215 223.62536 103.82305] CT
0.8 0.502 0.502 RC
N
f-2105962265
f
GR
GS
[1.00046 0 0 1.00215 97.27478 85.55953] CT
0.8 0.502 0.502 RC
N
f-2105962265
f
GR
GS
[1.00046 0 0 1.00215 143.63675 37.84792] CT
0.8 0.502 0.502 RC
N
f-2105962265
f
GR
GS
[1.00046 0 0 1.00215 125.09607 104.23711] CT
0.8 0.502 0.502 RC
N
f-2105962265
f
GR
GS
[1.00046 0 0 1.00215 210.38896 55.4379] CT
0.8 0.502 0.502 RC
N
f-2105962265
f
GR
GS
[1.00046 0 0 1.00215 157.20873 48.4334] CT
0.8 0.502 0.502 RC
N
f-2105962265
f
GR
GS
[1.00046 0 0 1.00215 89.87522 109.02678] CT
0.8 0.502 0.502 RC
N
f-2105962265
f
GR
GS
[1.00046 0 0 1.00215 147.85539 62.13282] CT
0.8 0.502 0.502 RC
N
f-2105962265
f
GR
GS
[1.00046 0 0 1.00215 214.5028 69.40727] CT
0.8 0.502 0.502 RC
N
f-2105962265
f
GR
GS
[1.00046 0 0 1.00215 138.51449 71.4561] CT
0.8 0.502 0.502 RC
N
f-2105962265
f
GR
GS
[1.00046 0 0 1.00215 105.49429 50.34427] CT
0.8 0.502 0.502 RC
N
f-2105962265
f
GR
GS
[1.00046 0 0 1.00215 156.8206 61.42939] CT
0.8 0.502 0.502 RC
N
f-2105962265
f
GR
GS
[1.00046 0 0 1.00215 140.38116 30.80839] CT
0.8 0.502 0.502 RC
N
f-2105962265
f
GR
GS
[1.00046 0 0 1.00215 231.60722 39.3344] CT
0.8 0.502 0.502 RC
N
f-2105962265
f
GR
GS
[1.00046 0 0 1.00215 223.75758 33.37961] CT
0.8 0.502 0.502 RC
N
f-2105962265
f
GR
GS
[1.00046 0 0 1.00215 141.37836 30.80839] CT
0.8 0.502 0.502 RC
N
f-2105962265
f
GR
GS
[1.00046 0 0 1.00215 212.88675 36.11527] CT
0.8 0.502 0.502 RC
N
f-2105962265
f
GR
GS
[1.00046 0 0 1.00215 215.10574 106.71752] CT
0.8 0.502 0.502 RC
N
f-2105962265
f
GR
GS
[1.00046 0 0 1.00215 214.71317 81.56994] CT
0.8 0.502 0.502 RC
N
f-2105962265
f
GR
GS
[1.00046 0 0 1.00215 154.97948 95.75889] CT
0.8 0.502 0.502 RC
N
f-2105962265
f
GR
GS
[1.00046 0 0 1.00215 161.15593 82.76338] CT
0.8 0.502 0.502 RC
N
f-2105962265
f
GR
GS
[1.00046 0 0 1.00215 156.77158 84.71961] CT
0.8 0.502 0.502 RC
N
f-2105962265
f
GR
GS
[1.00046 0 0 1.00215 170.87609 100.10006] CT
0.8 0.502 0.502 RC
N
f-2105962265
f
GR
GS
[1.00046 0 0 1.00215 120.53425 97.10088] CT
0.8 0.502 0.502 RC
N
f-2105962265
f
GR
GS
[1.00046 0 0 1.00215 129.91641 94.46328] CT
0.8 0.502 0.502 RC
N
f-2105962265
f
GR
GS
[1.00046 0 0 1.00215 149.97243 78.95969] CT
0.8 0.502 0.502 RC
N
f-2105962265
f
GR
GS
[1.00046 0 0 1.00215 113.77375 115.73057] CT
0.8 0.502 0.502 RC
N
f-2105962265
f
GR
GS
[1.00046 0 0 1.00215 168.05344 91.15571] CT
0.8 0.502 0.502 RC
N
f-2105962265
f
GR
GS
[1.00046 0 0 1.00215 135.85044 101.50286] CT
0.8 0.502 0.502 RC
N
f-2105962265
f
GR
GS
[1.00046 0 0 1.00215 90.38136 100.84257] CT
0.8 0.502 0.502 RC
N
f-2105962265
f
GR
GS
[1.00046 0 0 1.00215 136.17159 73.43297] CT
0.8 0.502 0.502 RC
N
f-2105962265
f
GR
GS
[1.00046 0 0 1.00215 93.37517 100.75651] CT
0.8 0.502 0.502 RC
N
f-2105962265
f
GR
GS
[1.00046 0 0 1.00215 119.48022 79.17229] CT
0.8 0.502 0.502 RC
N
f-2105962265
f
GR
GS
[1.00046 0 0 1.00215 132.091 103.84747] CT
0.8 0.502 0.502 RC
N
f-2105962265
f
GR
GS
[1.00046 0 0 1.00215 101.17165 129.19614] CT
0.8 0.502 0.502 RC
N
f-2105962265
f
GR
GS
[1.00046 0 0 1.00215 135.648 90.761] CT
0.8 0.502 0.502 RC
N
f-2105962265
f
GR
GS
[1.00046 0 0 1.00215 116.77527 116.39967] CT
0.8 0.502 0.502 RC
N
f-2105962265
f
GR
GS
[1.00046 0 0 1.00215 157.24766 89.22511] CT
0.8 0.502 0.502 RC
N
f-2105962265
f
GR
GS
[1.00046 0 0 1.00215 151.73583 86.65459] CT
0.8 0.502 0.502 RC
N
f-2105962265
f
GR
GS
[1.00046 0 0 1.00215 172.8565 101.8546] CT
0.8 0.502 0.502 RC
N
f-2105962265
f
GR
GS
[1.00046 0 0 1.00215 167.84806 87.06472] CT
0.8 0.502 0.502 RC
N
f-2105962265
f
GR
GS
[1.00046 0 0 1.00215 148.26126 100.08757] CT
0.8 0.502 0.502 RC
N
f-2105962265
f
GR
GS
[1.00046 0 0 1.00215 115.69173 98.47725] CT
0.8 0.502 0.502 RC
N
f-2105962265
f
GR
GS
[1.00046 0 0 1.00215 174.85217 85.85932] CT
0.8 0.502 0.502 RC
N
f-2105962265
f
GR
GS
[1.00046 0 0 1.00215 157.19854 78.78412] CT
0.8 0.502 0.502 RC
N
f-2105962265
f
GR
GS
[1.00046 0 0 1.00215 134.54784 106.87266] CT
0.8 0.502 0.502 RC
N
f-2105962265
f
GR
GS
[1.00046 0 0 1.00215 137.22332 108.59893] CT
0.8 0.502 0.502 RC
N
f-2105962265
f
GR
GS
[1.00046 0 0 1.00215 164.41758 97.80701] CT
0.8 0.502 0.502 RC
N
f-2105962265
f
GR
GS
[1.00046 0 0 1.00215 156.46739 90.88808] CT
0.8 0.502 0.502 RC
N
f-2105962265
f
GR
GS
[1.00046 0 0 1.00215 201.03125 90.68835] CT
0.8 0.502 0.502 RC
N
f-2105962265
f
GR
GS
[1.00046 0 0 1.00215 129.04515 105.30109] CT
0.8 0.502 0.502 RC
N
f-2105962265
f
GR
GS
[1.00046 0 0 1.00215 139.46782 91.65686] CT
0.8 0.502 0.502 RC
N
f-2105962265
f
GR
GS
[1.00046 0 0 1.00215 160.14483 98.13427] CT
0.8 0.502 0.502 RC
N
f-2105962265
f
GR
GS
[1.00046 0 0 1.00215 202.07292 106.00566] CT
0.8 0.502 0.502 RC
N
f-2105962265
f
GR
GS
[1.00046 0 0 1.00215 214.4678 93.46622] CT
0.8 0.502 0.502 RC
N
f-2105962265
f
GR
GS
[1.00046 0 0 1.00215 150.65919 107.34651] CT
0.8 0.502 0.502 RC
N
f-2105962265
f
GR
GS
[1.00046 0 0 1.00215 154.4774 117.0971] CT
0.8 0.502 0.502 RC
N
f-2105962265
f
GR
GS
[1.00046 0 0 1.00215 129.99052 108.93224] CT
0.8 0.502 0.502 RC
N
f-2105962265
f
GR
GS
[1.00046 0 0 1.00215 115.10594 107.0152] CT
0.8 0.502 0.502 RC
N
f-2105962265
f
GR
GS
[1.00046 0 0 1.00215 202.8254 79.41571] CT
0.8 0.502 0.502 RC
N
f-2105962265
f
GR
GS
[1.00046 0 0 1.00215 158.10722 94.6781] CT
0.8 0.502 0.502 RC
N
f-2105962265
f
GR
GS
[1.00046 0 0 1.00215 108.06152 91.69141] CT
0.8 0.502 0.502 RC
N
f-2105962265
f
GR
GS
[1.00046 0 0 1.00215 160.25671 100.53499] CT
0.8 0.502 0.502 RC
N
f-2105962265
f
GR
GS
[1.00046 0 0 1.00215 132.04813 108.06405] CT
0.8 0.502 0.502 RC
N
f-2105962265
f
GR
GS
[1.00046 0 0 1.00215 152.77066 132.69338] CT
0.8 0.502 0.502 RC
N
f-2105962265
f
GR
GS
[1.00046 0 0 1.00215 166.13277 115.13423] CT
0.8 0.502 0.502 RC
N
f-2105962265
f
GR
GS
[1.00046 0 0 1.00215 162.99912 62.32694] CT
0.8 0.502 0.502 RC
N
f-2105962265
f
GR
GS
[1.00046 0 0 1.00215 139.18502 103.88554] CT
0.8 0.502 0.502 RC
N
f-2105962265
f
GR
GS
[1.00046 0 0 1.00215 143.39324 96.91022] CT
0.8 0.502 0.502 RC
N
f-2105962265
f
GR
GS
[1.00046 0 0 1.00215 194.84641 89.67107] CT
0.8 0.502 0.502 RC
N
f-2105962265
f
GR
GS
[1.00046 0 0 1.00215 148.97966 105.5131] CT
0.8 0.502 0.502 RC
N
f-2105962265
f
GR
GS
[1.00046 0 0 1.00215 105.2853 85.56326] CT
0.8 0.502 0.502 RC
N
f-2105962265
f
GR
GS
[1.00046 0 0 1.00215 184.50901 77.36943] CT
0.8 0.502 0.502 RC
N
f-2105962265
f
GR
GS
[1.00046 0 0 1.00215 112.8202 95.38899] CT
0.8 0.502 0.502 RC
N
f-2105962265
f
GR
GS
[1.00046 0 0 1.00215 124.76553 115.97436] CT
0.8 0.502 0.502 RC
N
f-2105962265
f
GR
GS
[1.00046 0 0 1.00215 146.78021 81.23171] CT
0.8 0.502 0.502 RC
N
f-2105962265
f
GR
GS
[1.00046 0 0 1.00215 0 -0.4252] CT
0.902 0.6 0.6 RC
1 LJ
3 LW
N
66.5 103.661 M
231.5 74.141 L
S
GR
GS
[1.00046 0 0 1.00215 89.53587 108.48087] CT
1 0.702 0.702 RC
N
/f227889816{-3 -3 M
-3 3 L
3 3 L
3 -3 L
cp}def
f227889816
f
GR
GS
[1.00046 0 0 1.00215 207.37411 112.61133] CT
1 0.702 0.702 RC
N
f227889816
f
GR
GS
[1.00046 0 0 1.00215 147.91955 55.99116] CT
1 0.702 0.702 RC
N
f227889816
f
GR
GS
[1.00046 0 0 1.00215 121.92865 73.72936] CT
1 0.702 0.702 RC
N
f227889816
f
GR
GS
[1.00046 0 0 1.00215 168.13212 97.34456] CT
1 0.702 0.702 RC
N
f227889816
f
GR
GS
[1.00046 0 0 1.00215 213.97261 83.02491] CT
1 0.702 0.702 RC
N
f227889816
f
GR
GS
[1.00046 0 0 1.00215 184.89642 81.72351] CT
1 0.702 0.702 RC
N
f227889816
f
GR
GS
[1.00046 0 0 1.00215 188.24104 61.98687] CT
1 0.702 0.702 RC
N
f227889816
f
GR
GS
[1.00046 0 0 1.00215 149.65389 99.24954] CT
1 0.702 0.702 RC
N
f227889816
f
GR
GS
[1.00046 0 0 1.00215 126.49417 74.59047] CT
1 0.702 0.702 RC
N
f227889816
f
GR
GS
[1.00046 0 0 1.00215 149.09969 66.107] CT
1 0.702 0.702 RC
N
f227889816
f
GR
GS
[1.00046 0 0 1.00215 137.53388 90.09654] CT
1 0.702 0.702 RC
N
f227889816
f
GR
GS
[1.00046 0 0 1.00215 149.66326 85.32055] CT
1 0.702 0.702 RC
N
f227889816
f
GR
GS
[1.00046 0 0 1.00215 89.53587 91.63649] CT
1 0.702 0.702 RC
N
f227889816
f
GR
GS
[1.00046 0 0 1.00215 168.57419 65.01265] CT
1 0.702 0.702 RC
N
f227889816
f
GR
GS
[1.00046 0 0 1.00215 169.53974 113.28973] CT
1 0.702 0.702 RC
N
f227889816
f
GR
GS
[1.00046 0 0 1.00215 154.46207 93.54681] CT
1 0.702 0.702 RC
N
f227889816
f
GR
GS
[1.00046 0 0 1.00215 176.51146 92.99815] CT
1 0.702 0.702 RC
N
f227889816
f
GR
GS
[1.00046 0 0 1.00215 163.97045 65.2499] CT
1 0.702 0.702 RC
N
f227889816
f
GR
GS
[1.00046 0 0 1.00215 223.62536 103.82305] CT
1 0.702 0.702 RC
N
f227889816
f
GR
GS
[1.00046 0 0 1.00215 97.27478 85.55953] CT
1 0.702 0.702 RC
N
f227889816
f
GR
GS
[1.00046 0 0 1.00215 143.63675 37.84792] CT
1 0.702 0.702 RC
N
f227889816
f
GR
GS
[1.00046 0 0 1.00215 125.09607 104.23711] CT
1 0.702 0.702 RC
N
f227889816
f
GR
GS
[1.00046 0 0 1.00215 210.38896 55.4379] CT
1 0.702 0.702 RC
N
f227889816
f
GR
GS
[1.00046 0 0 1.00215 157.20873 48.4334] CT
1 0.702 0.702 RC
N
f227889816
f
GR
GS
[1.00046 0 0 1.00215 89.87522 109.02678] CT
1 0.702 0.702 RC
N
f227889816
f
GR
GS
[1.00046 0 0 1.00215 147.85539 62.13282] CT
1 0.702 0.702 RC
N
f227889816
f
GR
GS
[1.00046 0 0 1.00215 214.5028 69.40727] CT
1 0.702 0.702 RC
N
f227889816
f
GR
GS
[1.00046 0 0 1.00215 138.51449 71.4561] CT
1 0.702 0.702 RC
N
f227889816
f
GR
GS
[1.00046 0 0 1.00215 105.49429 50.34427] CT
1 0.702 0.702 RC
N
f227889816
f
GR
GS
[1.00046 0 0 1.00215 156.8206 61.42939] CT
1 0.702 0.702 RC
N
f227889816
f
GR
GS
[1.00046 0 0 1.00215 140.38116 30.80839] CT
1 0.702 0.702 RC
N
f227889816
f
GR
GS
[1.00046 0 0 1.00215 231.60722 39.3344] CT
1 0.702 0.702 RC
N
f227889816
f
GR
GS
[1.00046 0 0 1.00215 223.75758 33.37961] CT
1 0.702 0.702 RC
N
f227889816
f
GR
GS
[1.00046 0 0 1.00215 141.37836 30.80839] CT
1 0.702 0.702 RC
N
f227889816
f
GR
GS
[1.00046 0 0 1.00215 212.88675 36.11527] CT
1 0.702 0.702 RC
N
f227889816
f
GR
GS
[1.00046 0 0 1.00215 215.10574 106.71752] CT
1 0.702 0.702 RC
N
f227889816
f
GR
GS
[1.00046 0 0 1.00215 214.71317 81.56994] CT
1 0.702 0.702 RC
N
f227889816
f
GR
GS
[1.00046 0 0 1.00215 154.97948 95.75889] CT
1 0.702 0.702 RC
N
f227889816
f
GR
GS
[1.00046 0 0 1.00215 161.15593 82.76338] CT
1 0.702 0.702 RC
N
f227889816
f
GR
GS
[1.00046 0 0 1.00215 156.77158 84.71961] CT
1 0.702 0.702 RC
N
f227889816
f
GR
GS
[1.00046 0 0 1.00215 170.87609 100.10006] CT
1 0.702 0.702 RC
N
f227889816
f
GR
GS
[1.00046 0 0 1.00215 120.53425 97.10088] CT
0.8 0.502 0.502 RC
N
/f-1969333140{-3.536 0 M
0 4.702 L
3.536 0 L
0 -4.702 L
cp}def
f-1969333140
f
GR
GS
[1.00046 0 0 1.00215 129.91641 94.46328] CT
0.8 0.502 0.502 RC
N
f-1969333140
f
GR
GS
[1.00046 0 0 1.00215 149.97243 78.95969] CT
0.8 0.502 0.502 RC
N
f-1969333140
f
GR
GS
[1.00046 0 0 1.00215 113.77375 115.73057] CT
0.8 0.502 0.502 RC
N
f-1969333140
f
GR
GS
[1.00046 0 0 1.00215 168.05344 91.15571] CT
0.8 0.502 0.502 RC
N
f-1969333140
f
GR
GS
[1.00046 0 0 1.00215 135.85044 101.50286] CT
0.8 0.502 0.502 RC
N
f-1969333140
f
GR
GS
[1.00046 0 0 1.00215 90.38136 100.84257] CT
0.8 0.502 0.502 RC
N
f-1969333140
f
GR
GS
[1.00046 0 0 1.00215 136.17159 73.43297] CT
0.8 0.502 0.502 RC
N
f-1969333140
f
GR
GS
[1.00046 0 0 1.00215 93.37517 100.75651] CT
0.8 0.502 0.502 RC
N
f-1969333140
f
GR
GS
[1.00046 0 0 1.00215 119.48022 79.17229] CT
0.8 0.502 0.502 RC
N
f-1969333140
f
GR
GS
[1.00046 0 0 1.00215 132.091 103.84747] CT
0.8 0.502 0.502 RC
N
f-1969333140
f
GR
GS
[1.00046 0 0 1.00215 101.17165 129.19614] CT
0.8 0.502 0.502 RC
N
f-1969333140
f
GR
GS
[1.00046 0 0 1.00215 135.648 90.761] CT
0.8 0.502 0.502 RC
N
f-1969333140
f
GR
GS
[1.00046 0 0 1.00215 116.77527 116.39967] CT
0.8 0.502 0.502 RC
N
f-1969333140
f
GR
GS
[1.00046 0 0 1.00215 157.24766 89.22511] CT
0.8 0.502 0.502 RC
N
f-1969333140
f
GR
GS
[1.00046 0 0 1.00215 151.73583 86.65459] CT
0.8 0.502 0.502 RC
N
f-1969333140
f
GR
GS
[1.00046 0 0 1.00215 172.8565 101.8546] CT
0.8 0.502 0.502 RC
N
f-1969333140
f
GR
GS
[1.00046 0 0 1.00215 167.84806 87.06472] CT
0.8 0.502 0.502 RC
N
f-1969333140
f
GR
GS
[1.00046 0 0 1.00215 148.26126 100.08757] CT
0.8 0.502 0.502 RC
N
f-1969333140
f
GR
GS
[1.00046 0 0 1.00215 115.69173 98.47725] CT
0.8 0.502 0.502 RC
N
f-1969333140
f
GR
GS
[1.00046 0 0 1.00215 174.85217 85.85932] CT
0.8 0.502 0.502 RC
N
f-1969333140
f
GR
GS
[1.00046 0 0 1.00215 157.19854 78.78412] CT
0.8 0.502 0.502 RC
N
f-1969333140
f
GR
GS
[1.00046 0 0 1.00215 134.54784 106.87266] CT
0.8 0.502 0.502 RC
N
f-1969333140
f
GR
GS
[1.00046 0 0 1.00215 137.22332 108.59893] CT
0.8 0.502 0.502 RC
N
f-1969333140
f
GR
GS
[1.00046 0 0 1.00215 164.41758 97.80701] CT
0.8 0.502 0.502 RC
N
f-1969333140
f
GR
GS
[1.00046 0 0 1.00215 156.46739 90.88808] CT
0.8 0.502 0.502 RC
N
f-1969333140
f
GR
GS
[1.00046 0 0 1.00215 201.03125 90.68835] CT
0.8 0.502 0.502 RC
N
f-1969333140
f
GR
GS
[1.00046 0 0 1.00215 129.04515 105.30109] CT
0.8 0.502 0.502 RC
N
f-1969333140
f
GR
GS
[1.00046 0 0 1.00215 139.46782 91.65686] CT
0.8 0.502 0.502 RC
N
f-1969333140
f
GR
GS
[1.00046 0 0 1.00215 160.14483 98.13427] CT
0.8 0.502 0.502 RC
N
f-1969333140
f
GR
GS
[1.00046 0 0 1.00215 202.07292 106.00566] CT
0.8 0.502 0.502 RC
N
f-1969333140
f
GR
GS
[1.00046 0 0 1.00215 214.4678 93.46622] CT
0.8 0.502 0.502 RC
N
f-1969333140
f
GR
GS
[1.00046 0 0 1.00215 150.65919 107.34651] CT
0.8 0.502 0.502 RC
N
f-1969333140
f
GR
GS
[1.00046 0 0 1.00215 154.4774 117.0971] CT
0.8 0.502 0.502 RC
N
f-1969333140
f
GR
GS
[1.00046 0 0 1.00215 129.99052 108.93224] CT
0.8 0.502 0.502 RC
N
f-1969333140
f
GR
GS
[1.00046 0 0 1.00215 115.10594 107.0152] CT
0.8 0.502 0.502 RC
N
f-1969333140
f
GR
GS
[1.00046 0 0 1.00215 202.8254 79.41571] CT
0.8 0.502 0.502 RC
N
f-1969333140
f
GR
GS
[1.00046 0 0 1.00215 158.10722 94.6781] CT
0.8 0.502 0.502 RC
N
f-1969333140
f
GR
GS
[1.00046 0 0 1.00215 108.06152 91.69141] CT
0.8 0.502 0.502 RC
N
f-1969333140
f
GR
GS
[1.00046 0 0 1.00215 160.25671 100.53499] CT
0.8 0.502 0.502 RC
N
f-1969333140
f
GR
GS
[1.00046 0 0 1.00215 132.04813 108.06405] CT
0.8 0.502 0.502 RC
N
f-1969333140
f
GR
GS
[1.00046 0 0 1.00215 152.77066 132.69338] CT
0.8 0.502 0.502 RC
N
f-1969333140
f
GR
GS
[1.00046 0 0 1.00215 166.13277 115.13423] CT
0.8 0.502 0.502 RC
N
f-1969333140
f
GR
GS
[1.00046 0 0 1.00215 162.99912 62.32694] CT
0.8 0.502 0.502 RC
N
f-1969333140
f
GR
GS
[1.00046 0 0 1.00215 139.18502 103.88554] CT
0.8 0.502 0.502 RC
N
f-1969333140
f
GR
GS
[1.00046 0 0 1.00215 143.39324 96.91022] CT
0.8 0.502 0.502 RC
N
f-1969333140
f
GR
GS
[1.00046 0 0 1.00215 194.84641 89.67107] CT
0.8 0.502 0.502 RC
N
f-1969333140
f
GR
GS
[1.00046 0 0 1.00215 148.97966 105.5131] CT
0.8 0.502 0.502 RC
N
f-1969333140
f
GR
GS
[1.00046 0 0 1.00215 105.2853 85.56326] CT
0.8 0.502 0.502 RC
N
f-1969333140
f
GR
GS
[1.00046 0 0 1.00215 184.50901 77.36943] CT
0.8 0.502 0.502 RC
N
f-1969333140
f
GR
GS
[1.00046 0 0 1.00215 112.8202 95.38899] CT
0.8 0.502 0.502 RC
N
f-1969333140
f
GR
GS
[1.00046 0 0 1.00215 124.76553 115.97436] CT
0.8 0.502 0.502 RC
N
f-1969333140
f
GR
GS
[1.00046 0 0 1.00215 146.78021 81.23171] CT
0.8 0.502 0.502 RC
N
f-1969333140
f
GR
%%Trailer
%%Pages: 1
%%EOF
