%!PS-Adobe-3.0 EPSF-3.0
%%Creator: (MATLAB, The Mathworks, Inc. Version 9.8.0.1323502 \(R2020a\). Operating System: Mac OS X)
%%Title: /Users/kosciessa/Desktop/mntTardisLNDG/LNDG/stateswitch/stsw_multimodal/figures/l1byage/l1comp_threshold.eps
%%CreationDate: 2022-03-02T14:36:41
%%Pages: (atend)
%%BoundingBox:     4     0   180   275
%%LanguageLevel: 3
%%EndComments
%%BeginProlog
%%BeginResource: procset (Apache XML Graphics Std ProcSet) 1.2 0
%%Version: 1.2 0
%%Copyright: (Copyright 2001-2003,2010 The Apache Software Foundation. License terms: http://www.apache.org/licenses/LICENSE-2.0)
/bd{bind def}bind def
/ld{load def}bd
/GR/grestore ld
/GS/gsave ld
/RM/rmoveto ld
/C/curveto ld
/t/show ld
/L/lineto ld
/ML/setmiterlimit ld
/CT/concat ld
/f/fill ld
/N/newpath ld
/S/stroke ld
/CC/setcmykcolor ld
/A/ashow ld
/cp/closepath ld
/RC/setrgbcolor ld
/LJ/setlinejoin ld
/GC/setgray ld
/LW/setlinewidth ld
/M/moveto ld
/re {4 2 roll M
1 index 0 rlineto
0 exch rlineto
neg 0 rlineto
cp } bd
/_ctm matrix def
/_tm matrix def
/BT { _ctm currentmatrix pop matrix _tm copy pop 0 0 moveto } bd
/ET { _ctm setmatrix } bd
/iTm { _ctm setmatrix _tm concat } bd
/Tm { _tm astore pop iTm 0 0 moveto } bd
/ux 0.0 def
/uy 0.0 def
/F {
  /Tp exch def
  /Tf exch def
  Tf findfont Tp scalefont setfont
  /cf Tf def  /cs Tp def
} bd
/ULS {currentpoint /uy exch def /ux exch def} bd
/ULE {
  /Tcx currentpoint pop def
  gsave
  newpath
  cf findfont cs scalefont dup
  /FontMatrix get 0 get /Ts exch def /FontInfo get dup
  /UnderlinePosition get Ts mul /To exch def
  /UnderlineThickness get Ts mul /Tt exch def
  ux uy To add moveto  Tcx uy To add lineto
  Tt setlinewidth stroke
  grestore
} bd
/OLE {
  /Tcx currentpoint pop def
  gsave
  newpath
  cf findfont cs scalefont dup
  /FontMatrix get 0 get /Ts exch def /FontInfo get dup
  /UnderlinePosition get Ts mul /To exch def
  /UnderlineThickness get Ts mul /Tt exch def
  ux uy To add cs add moveto Tcx uy To add cs add lineto
  Tt setlinewidth stroke
  grestore
} bd
/SOE {
  /Tcx currentpoint pop def
  gsave
  newpath
  cf findfont cs scalefont dup
  /FontMatrix get 0 get /Ts exch def /FontInfo get dup
  /UnderlinePosition get Ts mul /To exch def
  /UnderlineThickness get Ts mul /Tt exch def
  ux uy To add cs 10 mul 26 idiv add moveto Tcx uy To add cs 10 mul 26 idiv add lineto
  Tt setlinewidth stroke
  grestore
} bd
/QT {
/Y22 exch store
/X22 exch store
/Y21 exch store
/X21 exch store
currentpoint
/Y21 load 2 mul add 3 div exch
/X21 load 2 mul add 3 div exch
/X21 load 2 mul /X22 load add 3 div
/Y21 load 2 mul /Y22 load add 3 div
/X22 load /Y22 load curveto
} bd
/SSPD {
dup length /d exch dict def
{
/v exch def
/k exch def
currentpagedevice k known {
/cpdv currentpagedevice k get def
v cpdv ne {
/upd false def
/nullv v type /nulltype eq def
/nullcpdv cpdv type /nulltype eq def
nullv nullcpdv or
{
/upd true def
} {
/sametype v type cpdv type eq def
sametype {
v type /arraytype eq {
/vlen v length def
/cpdvlen cpdv length def
vlen cpdvlen eq {
0 1 vlen 1 sub {
/i exch def
/obj v i get def
/cpdobj cpdv i get def
obj cpdobj ne {
/upd true def
exit
} if
} for
} {
/upd true def
} ifelse
} {
v type /dicttype eq {
v {
/dv exch def
/dk exch def
/cpddv cpdv dk get def
dv cpddv ne {
/upd true def
exit
} if
} forall
} {
/upd true def
} ifelse
} ifelse
} if
} ifelse
upd true eq {
d k v put
} if
} if
} if
} forall
d length 0 gt {
d setpagedevice
} if
} bd
/RE { % /NewFontName [NewEncodingArray] /FontName RE -
  findfont dup length dict begin
  {
    1 index /FID ne
    {def} {pop pop} ifelse
  } forall
  /Encoding exch def
  /FontName 1 index def
  currentdict definefont pop
  end
} bind def
%%EndResource
%%BeginResource: procset (Apache XML Graphics EPS ProcSet) 1.0 0
%%Version: 1.0 0
%%Copyright: (Copyright 2002-2003 The Apache Software Foundation. License terms: http://www.apache.org/licenses/LICENSE-2.0)
/BeginEPSF { %def
/b4_Inc_state save def         % Save state for cleanup
/dict_count countdictstack def % Count objects on dict stack
/op_count count 1 sub def      % Count objects on operand stack
userdict begin                 % Push userdict on dict stack
/showpage { } def              % Redefine showpage, { } = null proc
0 setgray 0 setlinecap         % Prepare graphics state
1 setlinewidth 0 setlinejoin
10 setmiterlimit [ ] 0 setdash newpath
/languagelevel where           % If level not equal to 1 then
{pop languagelevel             % set strokeadjust and
1 ne                           % overprint to their defaults.
{false setstrokeadjust false setoverprint
} if
} if
} bd
/EndEPSF { %def
count op_count sub {pop} repeat            % Clean up stacks
countdictstack dict_count sub {end} repeat
b4_Inc_state restore
} bd
%%EndResource
%FOPBeginFontDict
%%IncludeResource: font Courier-Oblique
%%IncludeResource: font Courier-BoldOblique
%%IncludeResource: font Courier-Bold
%%IncludeResource: font ZapfDingbats
%%IncludeResource: font Symbol
%%IncludeResource: font Helvetica
%%IncludeResource: font Helvetica-Oblique
%%IncludeResource: font Helvetica-Bold
%%IncludeResource: font Helvetica-BoldOblique
%%IncludeResource: font Times-Roman
%%IncludeResource: font Times-Italic
%%IncludeResource: font Times-Bold
%%IncludeResource: font Times-BoldItalic
%%IncludeResource: font Courier
%FOPEndFontDict
%%BeginResource: encoding WinAnsiEncoding
/WinAnsiEncoding [
/.notdef /.notdef /.notdef /.notdef /.notdef
/.notdef /.notdef /.notdef /.notdef /.notdef
/.notdef /.notdef /.notdef /.notdef /.notdef
/.notdef /.notdef /.notdef /.notdef /.notdef
/.notdef /.notdef /.notdef /.notdef /.notdef
/.notdef /.notdef /.notdef /.notdef /.notdef
/.notdef /.notdef /space /exclam /quotedbl
/numbersign /dollar /percent /ampersand /quotesingle
/parenleft /parenright /asterisk /plus /comma
/hyphen /period /slash /zero /one
/two /three /four /five /six
/seven /eight /nine /colon /semicolon
/less /equal /greater /question /at
/A /B /C /D /E
/F /G /H /I /J
/K /L /M /N /O
/P /Q /R /S /T
/U /V /W /X /Y
/Z /bracketleft /backslash /bracketright /asciicircum
/underscore /quoteleft /a /b /c
/d /e /f /g /h
/i /j /k /l /m
/n /o /p /q /r
/s /t /u /v /w
/x /y /z /braceleft /bar
/braceright /asciitilde /bullet /Euro /bullet
/quotesinglbase /florin /quotedblbase /ellipsis /dagger
/daggerdbl /circumflex /perthousand /Scaron /guilsinglleft
/OE /bullet /Zcaron /bullet /bullet
/quoteleft /quoteright /quotedblleft /quotedblright /bullet
/endash /emdash /asciitilde /trademark /scaron
/guilsinglright /oe /bullet /zcaron /Ydieresis
/space /exclamdown /cent /sterling /currency
/yen /brokenbar /section /dieresis /copyright
/ordfeminine /guillemotleft /logicalnot /sfthyphen /registered
/macron /degree /plusminus /twosuperior /threesuperior
/acute /mu /paragraph /middot /cedilla
/onesuperior /ordmasculine /guillemotright /onequarter /onehalf
/threequarters /questiondown /Agrave /Aacute /Acircumflex
/Atilde /Adieresis /Aring /AE /Ccedilla
/Egrave /Eacute /Ecircumflex /Edieresis /Igrave
/Iacute /Icircumflex /Idieresis /Eth /Ntilde
/Ograve /Oacute /Ocircumflex /Otilde /Odieresis
/multiply /Oslash /Ugrave /Uacute /Ucircumflex
/Udieresis /Yacute /Thorn /germandbls /agrave
/aacute /acircumflex /atilde /adieresis /aring
/ae /ccedilla /egrave /eacute /ecircumflex
/edieresis /igrave /iacute /icircumflex /idieresis
/eth /ntilde /ograve /oacute /ocircumflex
/otilde /odieresis /divide /oslash /ugrave
/uacute /ucircumflex /udieresis /yacute /thorn
/ydieresis
] def
%%EndResource
%FOPBeginFontReencode
/Courier-Oblique findfont
dup length dict begin
  {1 index /FID ne {def} {pop pop} ifelse} forall
  /Encoding WinAnsiEncoding def
  currentdict
end
/Courier-Oblique exch definefont pop
/Courier-BoldOblique findfont
dup length dict begin
  {1 index /FID ne {def} {pop pop} ifelse} forall
  /Encoding WinAnsiEncoding def
  currentdict
end
/Courier-BoldOblique exch definefont pop
/Courier-Bold findfont
dup length dict begin
  {1 index /FID ne {def} {pop pop} ifelse} forall
  /Encoding WinAnsiEncoding def
  currentdict
end
/Courier-Bold exch definefont pop
/Helvetica findfont
dup length dict begin
  {1 index /FID ne {def} {pop pop} ifelse} forall
  /Encoding WinAnsiEncoding def
  currentdict
end
/Helvetica exch definefont pop
/Helvetica-Oblique findfont
dup length dict begin
  {1 index /FID ne {def} {pop pop} ifelse} forall
  /Encoding WinAnsiEncoding def
  currentdict
end
/Helvetica-Oblique exch definefont pop
/Helvetica-Bold findfont
dup length dict begin
  {1 index /FID ne {def} {pop pop} ifelse} forall
  /Encoding WinAnsiEncoding def
  currentdict
end
/Helvetica-Bold exch definefont pop
/Helvetica-BoldOblique findfont
dup length dict begin
  {1 index /FID ne {def} {pop pop} ifelse} forall
  /Encoding WinAnsiEncoding def
  currentdict
end
/Helvetica-BoldOblique exch definefont pop
/Times-Roman findfont
dup length dict begin
  {1 index /FID ne {def} {pop pop} ifelse} forall
  /Encoding WinAnsiEncoding def
  currentdict
end
/Times-Roman exch definefont pop
/Times-Italic findfont
dup length dict begin
  {1 index /FID ne {def} {pop pop} ifelse} forall
  /Encoding WinAnsiEncoding def
  currentdict
end
/Times-Italic exch definefont pop
/Times-Bold findfont
dup length dict begin
  {1 index /FID ne {def} {pop pop} ifelse} forall
  /Encoding WinAnsiEncoding def
  currentdict
end
/Times-Bold exch definefont pop
/Times-BoldItalic findfont
dup length dict begin
  {1 index /FID ne {def} {pop pop} ifelse} forall
  /Encoding WinAnsiEncoding def
  currentdict
end
/Times-BoldItalic exch definefont pop
/Courier findfont
dup length dict begin
  {1 index /FID ne {def} {pop pop} ifelse} forall
  /Encoding WinAnsiEncoding def
  currentdict
end
/Courier exch definefont pop
%FOPEndFontReencode
%%EndProlog
%%Page: 1 1
%%PageBoundingBox: 0 0 198 283
%%BeginPageSetup
[1 0 0 -1 0 283] CT
%%EndPageSetup
GS
[1.00215 0 0 1 0 0] CT
1 GC
N
0 0 198 283 re
f
GR
GS
[1.00215 0 0 1 0 0] CT
1 GC
N
0 0 198 283 re
f
GR
GS
[1.00215 0 0 1 0 0] CT
1 GC
N
61 228 M
179 228 L
179 32 L
61 32 L
cp
f
GR
GS
[1.00215 0 0 1 0 0] CT
0.149 GC
2 setlinecap
1 LJ
0.5 LW
N
61 228 M
179 228 L
S
GR
GS
[1.00215 0 0 1 0 0] CT
0.149 GC
2 setlinecap
1 LJ
0.5 LW
N
96.4 228 M
96.4 226.04 L
S
GR
GS
[1.00215 0 0 1 0 0] CT
0.149 GC
2 setlinecap
1 LJ
0.5 LW
N
143.6 228 M
143.6 226.04 L
S
GR
GS
[1.00215 0 0 1 96.60702 234] CT
0.149 GC
/Helvetica 20 F
GS
[1 0 0 1 0 0] CT
-13 20 moveto 
1 -1 scale
(YA) t 
GR
GR
GS
[1.00215 0 0 1 143.90838 234] CT
0.149 GC
/Helvetica 20 F
GS
[1 0 0 1 0 0] CT
-14.5 20 moveto 
1 -1 scale
(OA) t 
GR
GR
GS
[1.00215 0 0 1 120.25775 259] CT
0.149 GC
/Helvetica 20 F
GS
[1 0 0 1 0 0] CT
-49 20 moveto 
1 -1 scale
(Age Group) t 
GR
GR
GS
[1.00215 0 0 1 0 0] CT
0.149 GC
2 setlinecap
1 LJ
0.5 LW
N
61 228 M
61 32 L
S
GR
GS
[1.00215 0 0 1 0 0] CT
0.149 GC
2 setlinecap
1 LJ
0.5 LW
N
61 228 M
62.96 228 L
S
GR
GS
[1.00215 0 0 1 0 0] CT
0.149 GC
2 setlinecap
1 LJ
0.5 LW
N
61 165.505 M
62.96 165.505 L
S
GR
GS
[1.00215 0 0 1 0 0] CT
0.149 GC
2 setlinecap
1 LJ
0.5 LW
N
61 103.011 M
62.96 103.011 L
S
GR
GS
[1.00215 0 0 1 0 0] CT
0.149 GC
2 setlinecap
1 LJ
0.5 LW
N
61 40.516 M
62.96 40.516 L
S
GR
GS
[1.00215 0 0 1 55.11811 228] CT
0.149 GC
/Helvetica 20 F
GS
[1 0 0 1 0 0] CT
-12 7.5 moveto 
1 -1 scale
(0) t 
GR
GR
GS
[1.00215 0 0 1 55.11811 165.5054] CT
0.149 GC
/Helvetica 20 F
GS
[1 0 0 1 0 0] CT
-28 7.5 moveto 
1 -1 scale
(0.5) t 
GR
GR
GS
[1.00215 0 0 1 55.11811 103.01082] CT
0.149 GC
/Helvetica 20 F
GS
[1 0 0 1 0 0] CT
-12 7.5 moveto 
1 -1 scale
(1) t 
GR
GR
GS
[1.00215 0 0 1 55.11811 40.51623] CT
0.149 GC
/Helvetica 20 F
GS
[1 0 0 1 0 0] CT
-28 7.5 moveto 
1 -1 scale
(1.5) t 
GR
GR
GS
[0 -1 1.00215 0 24.05154 129.99991] CT
0.149 GC
/Helvetica 20 F
GS
[1 0 0 1 0 0] CT
-52.5 -5 moveto 
1 -1 scale
(threshold l1) t 
GR
GR
GS
[1.00215 0 0 1 120.25781 29.25] CT
/Helvetica-Bold 22 F
GS
[1 0 0 1 0 0] CT
-41 -5 moveto 
1 -1 scale
(p = 0.04) t 
GR
GR
GS
[1.00215 0 0 1 0 0] CT
0.149 GC
1 LJ
0.5 LW
N
61 228 M
179 228 L
S
GR
GS
[1.00215 0 0 1 0 0] CT
1 0.6 0.6 RC
N
115.28 228 M
115.28 105.912 L
77.52 105.912 L
77.52 228 L
cp
f
GR
GS
[1.00215 0 0 1 97.11198 117.02671] CT
0.302 GC
N
2.236 0 M
2.236 -1.235 1.235 -2.236 0 -2.236 C
-1.235 -2.236 -2.236 -1.235 -2.236 0 C
-2.236 1.235 -1.235 2.236 0 2.236 C
1.235 2.236 2.236 1.235 2.236 0 C
cp
f
GR
GS
[1.00215 0 0 1 98.39547 132.4122] CT
0.302 GC
N
/f-1586420743{2.236 0 M
2.236 -1.235 1.235 -2.236 0 -2.236 C
-1.235 -2.236 -2.236 -1.235 -2.236 0 C
-2.236 1.235 -1.235 2.236 0 2.236 C
1.235 2.236 2.236 1.235 2.236 0 C
cp}def
f-1586420743
f
GR
GS
[1.00215 0 0 1 94.92239 104.26176] CT
0.302 GC
N
f-1586420743
f
GR
GS
[1.00215 0 0 1 100.4331 113.42645] CT
0.302 GC
N
f-1586420743
f
GR
GS
[1.00215 0 0 1 88.84823 83.73775] CT
0.302 GC
N
f-1586420743
f
GR
GS
[1.00215 0 0 1 106.03106 133.03741] CT
0.302 GC
N
f-1586420743
f
GR
GS
[1.00215 0 0 1 92.50608 81.59093] CT
0.302 GC
N
f-1586420743
f
GR
GS
[1.00215 0 0 1 90.4866 120.77433] CT
0.302 GC
N
f-1586420743
f
GR
GS
[1.00215 0 0 1 103.03547 45.10792] CT
0.302 GC
N
f-1586420743
f
GR
GS
[1.00215 0 0 1 96.64987 93.17942] CT
0.302 GC
N
f-1586420743
f
GR
GS
[1.00215 0 0 1 89.38024 78.48308] CT
0.302 GC
N
f-1586420743
f
GR
GS
[1.00215 0 0 1 104.62036 104.54327] CT
0.302 GC
N
f-1586420743
f
GR
GS
[1.00215 0 0 1 101.14927 63.31136] CT
0.302 GC
N
f-1586420743
f
GR
GS
[1.00215 0 0 1 97.50898 91.53371] CT
0.302 GC
N
f-1586420743
f
GR
GS
[1.00215 0 0 1 89.47257 92.91496] CT
0.302 GC
N
f-1586420743
f
GR
GS
[1.00215 0 0 1 105.47006 81.54421] CT
0.302 GC
N
f-1586420743
f
GR
GS
[1.00215 0 0 1 87.7468 69.45471] CT
0.302 GC
N
f-1586420743
f
GR
GS
[1.00215 0 0 1 104.14806 77.89865] CT
0.302 GC
N
f-1586420743
f
GR
GS
[1.00215 0 0 1 105.4048 132.65007] CT
0.302 GC
N
f-1586420743
f
GR
GS
[1.00215 0 0 1 103.8964 145.30423] CT
0.302 GC
N
f-1586420743
f
GR
GS
[1.00215 0 0 1 87.65548 118.04554] CT
0.302 GC
N
f-1586420743
f
GR
GS
[1.00215 0 0 1 92.75362 106.63621] CT
0.302 GC
N
f-1586420743
f
GR
GS
[1.00215 0 0 1 102.40247 44.83121] CT
0.302 GC
N
f-1586420743
f
GR
GS
[1.00215 0 0 1 89.76014 132.95245] CT
0.302 GC
N
f-1586420743
f
GR
GS
[1.00215 0 0 1 101.76296 128.261] CT
0.302 GC
N
f-1586420743
f
GR
GS
[1.00215 0 0 1 104.70955 143.06789] CT
0.302 GC
N
f-1586420743
f
GR
GS
[1.00215 0 0 1 105.82115 109.81889] CT
0.302 GC
N
f-1586420743
f
GR
GS
[1.00215 0 0 1 100.39352 129.03621] CT
0.302 GC
N
f-1586420743
f
GR
GS
[1.00215 0 0 1 103.80946 106.65891] CT
0.302 GC
N
f-1586420743
f
GR
GS
[1.00215 0 0 1 93.07674 114.96398] CT
0.302 GC
N
f-1586420743
f
GR
GS
[1.00215 0 0 1 97.90969 98.25397] CT
0.302 GC
N
f-1586420743
f
GR
GS
[1.00215 0 0 1 90.41382 129.60028] CT
0.302 GC
N
f-1586420743
f
GR
GS
[1.00215 0 0 1 95.6461 124.16219] CT
0.302 GC
N
f-1586420743
f
GR
GS
[1.00215 0 0 1 103.19357 98.89984] CT
0.302 GC
N
f-1586420743
f
GR
GS
[1.00215 0 0 1 87.61792 132.53235] CT
0.302 GC
N
f-1586420743
f
GR
GS
[1.00215 0 0 1 103.05478 115.95533] CT
0.302 GC
N
f-1586420743
f
GR
GS
[1.00215 0 0 1 105.62069 111.09286] CT
0.302 GC
N
f-1586420743
f
GR
GS
[1.00215 0 0 1 92.4757 121.26362] CT
0.302 GC
N
f-1586420743
f
GR
GS
[1.00215 0 0 1 94.67662 101.37283] CT
0.302 GC
N
f-1586420743
f
GR
GS
[1.00215 0 0 1 103.57304 118.5541] CT
0.302 GC
N
f-1586420743
f
GR
GS
[1.00215 0 0 1 89.44325 122.09258] CT
0.302 GC
N
f-1586420743
f
GR
GS
[1.00215 0 0 1 91.40325 78.07899] CT
0.302 GC
N
f-1586420743
f
GR
GS
[1.00215 0 0 1 0 0] CT
1 0.6 0.6 RC
N
/f-1570745440{162.48 228 M
162.48 94.594 L
124.72 94.594 L
124.72 228 L
cp}def
f-1570745440
f
GR
GS
[1.00215 0 0 1 136.44913 113.77847] CT
0.302 GC
N
f-1586420743
f
GR
GS
[1.00215 0 0 1 146.11831 74.64886] CT
0.302 GC
N
f-1586420743
f
GR
GS
[1.00215 0 0 1 136.65525 95.86867] CT
0.302 GC
N
f-1586420743
f
GR
GS
[1.00215 0 0 1 147.0881 44.39042] CT
0.302 GC
N
f-1586420743
f
GR
GS
[1.00215 0 0 1 147.76181 97.19473] CT
0.302 GC
N
f-1586420743
f
GR
GS
[1.00215 0 0 1 145.54674 66.19064] CT
0.302 GC
N
f-1586420743
f
GR
GS
[1.00215 0 0 1 139.3915 99.0127] CT
0.302 GC
N
f-1586420743
f
GR
GS
[1.00215 0 0 1 140.35692 86.49924] CT
0.302 GC
N
f-1586420743
f
GR
GS
[1.00215 0 0 1 146.52214 102.49502] CT
0.302 GC
N
f-1586420743
f
GR
GS
[1.00215 0 0 1 142.71369 76.58023] CT
0.302 GC
N
f-1586420743
f
GR
GS
[1.00215 0 0 1 151.37718 45.30925] CT
0.302 GC
N
f-1586420743
f
GR
GS
[1.00215 0 0 1 136.20321 46.12782] CT
0.302 GC
N
f-1586420743
f
GR
GS
[1.00215 0 0 1 135.35482 140.6122] CT
0.302 GC
N
f-1586420743
f
GR
GS
[1.00215 0 0 1 146.24082 102.12283] CT
0.302 GC
N
f-1586420743
f
GR
GS
[1.00215 0 0 1 148.39782 91.40178] CT
0.302 GC
N
f-1586420743
f
GR
GS
[1.00215 0 0 1 145.06265 110.08758] CT
0.302 GC
N
f-1586420743
f
GR
GS
[1.00215 0 0 1 140.50289 129.65417] CT
0.302 GC
N
f-1586420743
f
GR
GS
[1.00215 0 0 1 134.53339 111.84528] CT
0.302 GC
N
f-1586420743
f
GR
GS
[1.00215 0 0 1 144.94275 156.86623] CT
0.302 GC
N
f-1586420743
f
GR
GS
[1.00215 0 0 1 152.6446 64.24097] CT
0.302 GC
N
f-1586420743
f
GR
GS
[1.00215 0 0 1 144.31075 94.69151] CT
0.302 GC
N
f-1586420743
f
GR
GS
[1.00215 0 0 1 151.55505 115.93103] CT
0.302 GC
N
f-1586420743
f
GR
GS
[1.00215 0 0 1 144.95443 88.38369] CT
0.302 GC
N
f-1586420743
f
GR
GS
[1.00215 0 0 1 135.11471 99.07532] CT
0.302 GC
N
f-1586420743
f
GR
GS
[1.00215 0 0 1 140.37114 91.84107] CT
0.302 GC
N
f-1586420743
f
GR
GS
[1.00215 0 0 1 147.01783 124.37507] CT
0.302 GC
N
f-1586420743
f
GR
GS
[1.00215 0 0 1 139.32265 129.07976] CT
0.302 GC
N
f-1586420743
f
GR
GS
[1.00215 0 0 1 147.48132 75.00168] CT
0.302 GC
N
f-1586420743
f
GR
GS
[1.00215 0 0 1 142.76075 102.64065] CT
0.302 GC
N
f-1586420743
f
GR
GS
[1.00215 0 0 1 148.33015 118.42915] CT
0.302 GC
N
f-1586420743
f
GR
GS
[1.00215 0 0 1 145.29915 84.69068] CT
0.302 GC
N
f-1586420743
f
GR
GS
[1.00215 0 0 1 149.33332 108.72194] CT
0.302 GC
N
f-1586420743
f
GR
GS
[1.00215 0 0 1 141.94724 90.46639] CT
0.302 GC
N
f-1586420743
f
GR
GS
[1.00215 0 0 1 153.14505 98.63035] CT
0.302 GC
N
f-1586420743
f
GR
GS
[1.00215 0 0 1 136.11752 51.14951] CT
0.302 GC
N
f-1586420743
f
GR
GS
[1.00215 0 0 1 141.84503 126.25833] CT
0.302 GC
N
f-1586420743
f
GR
GS
[1.00215 0 0 1 143.13998 32] CT
0.302 GC
N
f-1586420743
f
GR
GS
[1.00215 0 0 1 136.06752 77.4372] CT
0.302 GC
N
f-1586420743
f
GR
GS
[1.00215 0 0 1 136.60726 74.4706] CT
0.302 GC
N
f-1586420743
f
GR
GS
[1.00215 0 0 1 141.25363 101.33129] CT
0.302 GC
N
f-1586420743
f
GR
GS
[1.00215 0 0 1 152.7192 93.72392] CT
0.302 GC
N
f-1586420743
f
GR
GS
[1.00215 0 0 1 141.26611 99.86443] CT
0.302 GC
N
f-1586420743
f
GR
GS
[1.00215 0 0 1 134.95455 134.44421] CT
0.302 GC
N
f-1586420743
f
GR
GS
[1.00215 0 0 1 135.94087 59.75561] CT
0.302 GC
N
f-1586420743
f
GR
GS
[1.00215 0 0 1 140.10137 106.78848] CT
0.302 GC
N
f-1586420743
f
GR
GS
[1.00215 0 0 1 152.95403 84.06575] CT
0.302 GC
N
f-1586420743
f
GR
GS
[1.00215 0 0 1 142.54548 141.95233] CT
0.302 GC
N
f-1586420743
f
GR
GS
[1.00215 0 0 1 144.21876 65.15704] CT
0.302 GC
N
f-1586420743
f
GR
GS
[1.00215 0 0 1 141.01144 105.068] CT
0.302 GC
N
f-1586420743
f
GR
GS
[1.00215 0 0 1 135.42223 103.48574] CT
0.302 GC
N
f-1586420743
f
GR
GS
[1.00215 0 0 1 135.11768 91.96529] CT
0.302 GC
N
f-1586420743
f
GR
GS
[1.00215 0 0 1 149.97032 84.09582] CT
0.302 GC
N
f-1586420743
f
GR
GS
[1.00215 0 0 1 147.36029 103.56491] CT
0.302 GC
N
f-1586420743
f
GR
%%Trailer
%%Pages: 1
%%EOF
