%!PS-Adobe-3.0 EPSF-3.0
%%Creator: (MATLAB, The Mathworks, Inc. Version 9.8.0.1323502 \(R2020a\). Operating System: Mac OS X)
%%Title: /Users/kosciessa/Desktop/mntTardisLNDG/LNDG/stateswitch/stsw_multimodal/figures/correlations/f_alpha_fooof.eps
%%CreationDate: 2022-03-11T15:12:20
%%Pages: (atend)
%%BoundingBox:    11     0   241   194
%%LanguageLevel: 3
%%EndComments
%%BeginProlog
%%BeginResource: procset (Apache XML Graphics Std ProcSet) 1.2 0
%%Version: 1.2 0
%%Copyright: (Copyright 2001-2003,2010 The Apache Software Foundation. License terms: http://www.apache.org/licenses/LICENSE-2.0)
/bd{bind def}bind def
/ld{load def}bd
/GR/grestore ld
/GS/gsave ld
/RM/rmoveto ld
/C/curveto ld
/t/show ld
/L/lineto ld
/ML/setmiterlimit ld
/CT/concat ld
/f/fill ld
/N/newpath ld
/S/stroke ld
/CC/setcmykcolor ld
/A/ashow ld
/cp/closepath ld
/RC/setrgbcolor ld
/LJ/setlinejoin ld
/GC/setgray ld
/LW/setlinewidth ld
/M/moveto ld
/re {4 2 roll M
1 index 0 rlineto
0 exch rlineto
neg 0 rlineto
cp } bd
/_ctm matrix def
/_tm matrix def
/BT { _ctm currentmatrix pop matrix _tm copy pop 0 0 moveto } bd
/ET { _ctm setmatrix } bd
/iTm { _ctm setmatrix _tm concat } bd
/Tm { _tm astore pop iTm 0 0 moveto } bd
/ux 0.0 def
/uy 0.0 def
/F {
  /Tp exch def
  /Tf exch def
  Tf findfont Tp scalefont setfont
  /cf Tf def  /cs Tp def
} bd
/ULS {currentpoint /uy exch def /ux exch def} bd
/ULE {
  /Tcx currentpoint pop def
  gsave
  newpath
  cf findfont cs scalefont dup
  /FontMatrix get 0 get /Ts exch def /FontInfo get dup
  /UnderlinePosition get Ts mul /To exch def
  /UnderlineThickness get Ts mul /Tt exch def
  ux uy To add moveto  Tcx uy To add lineto
  Tt setlinewidth stroke
  grestore
} bd
/OLE {
  /Tcx currentpoint pop def
  gsave
  newpath
  cf findfont cs scalefont dup
  /FontMatrix get 0 get /Ts exch def /FontInfo get dup
  /UnderlinePosition get Ts mul /To exch def
  /UnderlineThickness get Ts mul /Tt exch def
  ux uy To add cs add moveto Tcx uy To add cs add lineto
  Tt setlinewidth stroke
  grestore
} bd
/SOE {
  /Tcx currentpoint pop def
  gsave
  newpath
  cf findfont cs scalefont dup
  /FontMatrix get 0 get /Ts exch def /FontInfo get dup
  /UnderlinePosition get Ts mul /To exch def
  /UnderlineThickness get Ts mul /Tt exch def
  ux uy To add cs 10 mul 26 idiv add moveto Tcx uy To add cs 10 mul 26 idiv add lineto
  Tt setlinewidth stroke
  grestore
} bd
/QT {
/Y22 exch store
/X22 exch store
/Y21 exch store
/X21 exch store
currentpoint
/Y21 load 2 mul add 3 div exch
/X21 load 2 mul add 3 div exch
/X21 load 2 mul /X22 load add 3 div
/Y21 load 2 mul /Y22 load add 3 div
/X22 load /Y22 load curveto
} bd
/SSPD {
dup length /d exch dict def
{
/v exch def
/k exch def
currentpagedevice k known {
/cpdv currentpagedevice k get def
v cpdv ne {
/upd false def
/nullv v type /nulltype eq def
/nullcpdv cpdv type /nulltype eq def
nullv nullcpdv or
{
/upd true def
} {
/sametype v type cpdv type eq def
sametype {
v type /arraytype eq {
/vlen v length def
/cpdvlen cpdv length def
vlen cpdvlen eq {
0 1 vlen 1 sub {
/i exch def
/obj v i get def
/cpdobj cpdv i get def
obj cpdobj ne {
/upd true def
exit
} if
} for
} {
/upd true def
} ifelse
} {
v type /dicttype eq {
v {
/dv exch def
/dk exch def
/cpddv cpdv dk get def
dv cpddv ne {
/upd true def
exit
} if
} forall
} {
/upd true def
} ifelse
} ifelse
} if
} ifelse
upd true eq {
d k v put
} if
} if
} if
} forall
d length 0 gt {
d setpagedevice
} if
} bd
/RE { % /NewFontName [NewEncodingArray] /FontName RE -
  findfont dup length dict begin
  {
    1 index /FID ne
    {def} {pop pop} ifelse
  } forall
  /Encoding exch def
  /FontName 1 index def
  currentdict definefont pop
  end
} bind def
%%EndResource
%%BeginResource: procset (Apache XML Graphics EPS ProcSet) 1.0 0
%%Version: 1.0 0
%%Copyright: (Copyright 2002-2003 The Apache Software Foundation. License terms: http://www.apache.org/licenses/LICENSE-2.0)
/BeginEPSF { %def
/b4_Inc_state save def         % Save state for cleanup
/dict_count countdictstack def % Count objects on dict stack
/op_count count 1 sub def      % Count objects on operand stack
userdict begin                 % Push userdict on dict stack
/showpage { } def              % Redefine showpage, { } = null proc
0 setgray 0 setlinecap         % Prepare graphics state
1 setlinewidth 0 setlinejoin
10 setmiterlimit [ ] 0 setdash newpath
/languagelevel where           % If level not equal to 1 then
{pop languagelevel             % set strokeadjust and
1 ne                           % overprint to their defaults.
{false setstrokeadjust false setoverprint
} if
} if
} bd
/EndEPSF { %def
count op_count sub {pop} repeat            % Clean up stacks
countdictstack dict_count sub {end} repeat
b4_Inc_state restore
} bd
%%EndResource
%FOPBeginFontDict
%%IncludeResource: font Courier-Oblique
%%IncludeResource: font Courier-BoldOblique
%%IncludeResource: font Courier-Bold
%%IncludeResource: font ZapfDingbats
%%IncludeResource: font Symbol
%%IncludeResource: font Helvetica
%%IncludeResource: font Helvetica-Oblique
%%IncludeResource: font Helvetica-Bold
%%IncludeResource: font Helvetica-BoldOblique
%%IncludeResource: font Times-Roman
%%IncludeResource: font Times-Italic
%%IncludeResource: font Times-Bold
%%IncludeResource: font Times-BoldItalic
%%IncludeResource: font Courier
%FOPEndFontDict
%%BeginResource: encoding WinAnsiEncoding
/WinAnsiEncoding [
/.notdef /.notdef /.notdef /.notdef /.notdef
/.notdef /.notdef /.notdef /.notdef /.notdef
/.notdef /.notdef /.notdef /.notdef /.notdef
/.notdef /.notdef /.notdef /.notdef /.notdef
/.notdef /.notdef /.notdef /.notdef /.notdef
/.notdef /.notdef /.notdef /.notdef /.notdef
/.notdef /.notdef /space /exclam /quotedbl
/numbersign /dollar /percent /ampersand /quotesingle
/parenleft /parenright /asterisk /plus /comma
/hyphen /period /slash /zero /one
/two /three /four /five /six
/seven /eight /nine /colon /semicolon
/less /equal /greater /question /at
/A /B /C /D /E
/F /G /H /I /J
/K /L /M /N /O
/P /Q /R /S /T
/U /V /W /X /Y
/Z /bracketleft /backslash /bracketright /asciicircum
/underscore /quoteleft /a /b /c
/d /e /f /g /h
/i /j /k /l /m
/n /o /p /q /r
/s /t /u /v /w
/x /y /z /braceleft /bar
/braceright /asciitilde /bullet /Euro /bullet
/quotesinglbase /florin /quotedblbase /ellipsis /dagger
/daggerdbl /circumflex /perthousand /Scaron /guilsinglleft
/OE /bullet /Zcaron /bullet /bullet
/quoteleft /quoteright /quotedblleft /quotedblright /bullet
/endash /emdash /asciitilde /trademark /scaron
/guilsinglright /oe /bullet /zcaron /Ydieresis
/space /exclamdown /cent /sterling /currency
/yen /brokenbar /section /dieresis /copyright
/ordfeminine /guillemotleft /logicalnot /sfthyphen /registered
/macron /degree /plusminus /twosuperior /threesuperior
/acute /mu /paragraph /middot /cedilla
/onesuperior /ordmasculine /guillemotright /onequarter /onehalf
/threequarters /questiondown /Agrave /Aacute /Acircumflex
/Atilde /Adieresis /Aring /AE /Ccedilla
/Egrave /Eacute /Ecircumflex /Edieresis /Igrave
/Iacute /Icircumflex /Idieresis /Eth /Ntilde
/Ograve /Oacute /Ocircumflex /Otilde /Odieresis
/multiply /Oslash /Ugrave /Uacute /Ucircumflex
/Udieresis /Yacute /Thorn /germandbls /agrave
/aacute /acircumflex /atilde /adieresis /aring
/ae /ccedilla /egrave /eacute /ecircumflex
/edieresis /igrave /iacute /icircumflex /idieresis
/eth /ntilde /ograve /oacute /ocircumflex
/otilde /odieresis /divide /oslash /ugrave
/uacute /ucircumflex /udieresis /yacute /thorn
/ydieresis
] def
%%EndResource
%FOPBeginFontReencode
/Courier-Oblique findfont
dup length dict begin
  {1 index /FID ne {def} {pop pop} ifelse} forall
  /Encoding WinAnsiEncoding def
  currentdict
end
/Courier-Oblique exch definefont pop
/Courier-BoldOblique findfont
dup length dict begin
  {1 index /FID ne {def} {pop pop} ifelse} forall
  /Encoding WinAnsiEncoding def
  currentdict
end
/Courier-BoldOblique exch definefont pop
/Courier-Bold findfont
dup length dict begin
  {1 index /FID ne {def} {pop pop} ifelse} forall
  /Encoding WinAnsiEncoding def
  currentdict
end
/Courier-Bold exch definefont pop
/Helvetica findfont
dup length dict begin
  {1 index /FID ne {def} {pop pop} ifelse} forall
  /Encoding WinAnsiEncoding def
  currentdict
end
/Helvetica exch definefont pop
/Helvetica-Oblique findfont
dup length dict begin
  {1 index /FID ne {def} {pop pop} ifelse} forall
  /Encoding WinAnsiEncoding def
  currentdict
end
/Helvetica-Oblique exch definefont pop
/Helvetica-Bold findfont
dup length dict begin
  {1 index /FID ne {def} {pop pop} ifelse} forall
  /Encoding WinAnsiEncoding def
  currentdict
end
/Helvetica-Bold exch definefont pop
/Helvetica-BoldOblique findfont
dup length dict begin
  {1 index /FID ne {def} {pop pop} ifelse} forall
  /Encoding WinAnsiEncoding def
  currentdict
end
/Helvetica-BoldOblique exch definefont pop
/Times-Roman findfont
dup length dict begin
  {1 index /FID ne {def} {pop pop} ifelse} forall
  /Encoding WinAnsiEncoding def
  currentdict
end
/Times-Roman exch definefont pop
/Times-Italic findfont
dup length dict begin
  {1 index /FID ne {def} {pop pop} ifelse} forall
  /Encoding WinAnsiEncoding def
  currentdict
end
/Times-Italic exch definefont pop
/Times-Bold findfont
dup length dict begin
  {1 index /FID ne {def} {pop pop} ifelse} forall
  /Encoding WinAnsiEncoding def
  currentdict
end
/Times-Bold exch definefont pop
/Times-BoldItalic findfont
dup length dict begin
  {1 index /FID ne {def} {pop pop} ifelse} forall
  /Encoding WinAnsiEncoding def
  currentdict
end
/Times-BoldItalic exch definefont pop
/Courier findfont
dup length dict begin
  {1 index /FID ne {def} {pop pop} ifelse} forall
  /Encoding WinAnsiEncoding def
  currentdict
end
/Courier exch definefont pop
%FOPEndFontReencode
%%EndProlog
%%Page: 1 1
%%PageBoundingBox: 0 0 255 198
%%BeginPageSetup
[1 0 0 -1 0 198] CT
%%EndPageSetup
GS
[1.00046 0 0 1.00215 0 -0.4252] CT
1 GC
N
0 0 255 198 re
f
GR
GS
[1.00046 0 0 1.00215 0 -0.4252] CT
1 GC
N
0 0 255 198 re
f
GR
GS
[1.00046 0 0 1.00215 0 -0.4252] CT
0.2 GC
N
74.5 143 M
231.5 143 L
231.5 21 L
74.5 21 L
cp
f
GR
GS
[1.00046 0 0 1.00215 0 -0.4252] CT
0.149 GC
2 setlinecap
1 LJ
0.5 LW
N
74.5 143 M
231.5 143 L
S
GR
GS
[1.00046 0 0 1.00215 0 -0.4252] CT
0.149 GC
2 setlinecap
1 LJ
0.5 LW
N
82.544 143 M
82.544 141.43 L
S
GR
GS
[1.00046 0 0 1.00215 0 -0.4252] CT
0.149 GC
2 setlinecap
1 LJ
0.5 LW
N
132.196 143 M
132.196 141.43 L
S
GR
GS
[1.00046 0 0 1.00215 0 -0.4252] CT
0.149 GC
2 setlinecap
1 LJ
0.5 LW
N
181.848 143 M
181.848 141.43 L
S
GR
GS
[1.00046 0 0 1.00215 0 -0.4252] CT
0.149 GC
2 setlinecap
1 LJ
0.5 LW
N
231.5 143 M
231.5 141.43 L
S
GR
GS
[1.00046 0 0 1.00215 82.58182 147.6922] CT
0.149 GC
/Helvetica 14 F
GS
[1 0 0 1 0 0] CT
-12.5 14 moveto 
1 -1 scale
(-0.2) t 
GR
GR
GS
[1.00046 0 0 1.00215 132.25695 147.6922] CT
0.149 GC
/Helvetica 14 F
GS
[1 0 0 1 0 0] CT
-4 14 moveto 
1 -1 scale
(0) t 
GR
GR
GS
[1.00046 0 0 1.00215 181.93208 147.6922] CT
0.149 GC
/Helvetica 14 F
GS
[1 0 0 1 0 0] CT
-10 14 moveto 
1 -1 scale
(0.2) t 
GR
GR
GS
[1.00046 0 0 1.00215 231.60722 147.6922] CT
0.149 GC
/Helvetica 14 F
GS
[1 0 0 1 0 0] CT
-10 14 moveto 
1 -1 scale
(0.4) t 
GR
GR
GS
[1.00046 0 0 1.00215 153.07094 165.22978] CT
0.149 GC
/Helvetica 14 F
GS
[1 0 0 1 0 0] CT
-27 14 moveto 
1 -1 scale
(alpha bs) t 
GR
GR
GS
[1.00046 0 0 1.00215 153.07094 165.22978] CT
0.149 GC
/Helvetica 14 F
GS
[1 0 0 1 0 0] CT
-57.5 31 moveto 
1 -1 scale
(\(linear modulation\)) t 
GR
GR
GS
[1.00046 0 0 1.00215 0 -0.4252] CT
0.149 GC
2 setlinecap
1 LJ
0.5 LW
N
74.5 143 M
74.5 21 L
S
GR
GS
[1.00046 0 0 1.00215 0 -0.4252] CT
0.149 GC
2 setlinecap
1 LJ
0.5 LW
N
74.5 138.301 M
76.07 138.301 L
S
GR
GS
[1.00046 0 0 1.00215 0 -0.4252] CT
0.149 GC
2 setlinecap
1 LJ
0.5 LW
N
74.5 96.287 M
76.07 96.287 L
S
GR
GS
[1.00046 0 0 1.00215 0 -0.4252] CT
0.149 GC
2 setlinecap
1 LJ
0.5 LW
N
74.5 54.274 M
76.07 54.274 L
S
GR
GS
[1.00046 0 0 1.00215 69.73229 138.17244] CT
0.149 GC
/Helvetica 14 F
GS
[1 0 0 1 0 0] CT
-25 5.5 moveto 
1 -1 scale
(-0.1) t 
GR
GR
GS
[1.00046 0 0 1.00215 69.73229 96.06896] CT
0.149 GC
/Helvetica 14 F
GS
[1 0 0 1 0 0] CT
-8 5.5 moveto 
1 -1 scale
(0) t 
GR
GR
GS
[1.00046 0 0 1.00215 69.73229 53.96548] CT
0.149 GC
/Helvetica 14 F
GS
[1 0 0 1 0 0] CT
-20 5.5 moveto 
1 -1 scale
(0.1) t 
GR
GR
GS
[0 -1.00215 1.00046 0 41.71931 81.75083] CT
0.149 GC
/Helvetica 14 F
GS
[1 0 0 1 0 0] CT
-16.5 -20 moveto 
1 -1 scale
(fooof) t 
GR
GR
GS
[0 -1.00215 1.00046 0 41.71931 81.75083] CT
0.149 GC
/Helvetica 14 F
GS
[1 0 0 1 0 0] CT
-57.5 -3 moveto 
1 -1 scale
(\(linear modulation\)) t 
GR
GR
GS
[1.00046 0 0 1.00215 153.07101 18.86614] CT
/Helvetica-Bold 14 F
GS
[1 0 0 1 0 0] CT
-63.5 -4 moveto 
1 -1 scale
(r = 0.44 p = 9.8e-06) t 
GR
GR
GS
[1.00046 0 0 1.00215 176.88961 104.792] CT
0.8 0.502 0.502 RC
N
0.5 0 M
0.5 -0.276 0.276 -0.5 0 -0.5 C
-0.276 -0.5 -0.5 -0.276 -0.5 0 C
-0.5 0.276 -0.276 0.5 0 0.5 C
0.276 0.5 0.5 0.276 0.5 0 C
cp
f
GR
GS
[1.00046 0 0 1.00215 124.57196 116.96661] CT
0.8 0.502 0.502 RC
N
/f-2105962265{0.5 0 M
0.5 -0.276 0.276 -0.5 0 -0.5 C
-0.276 -0.5 -0.5 -0.276 -0.5 0 C
-0.5 0.276 -0.276 0.5 0 0.5 C
0.276 0.5 0.5 0.276 0.5 0 C
cp}def
f-2105962265
f
GR
GS
[1.00046 0 0 1.00215 204.31332 61.016] CT
0.8 0.502 0.502 RC
N
f-2105962265
f
GR
GS
[1.00046 0 0 1.00215 184.24298 50.78592] CT
0.8 0.502 0.502 RC
N
f-2105962265
f
GR
GS
[1.00046 0 0 1.00215 123.7089 65.66401] CT
0.8 0.502 0.502 RC
N
f-2105962265
f
GR
GS
[1.00046 0 0 1.00215 139.64605 82.032] CT
0.8 0.502 0.502 RC
N
f-2105962265
f
GR
GS
[1.00046 0 0 1.00215 168.31996 86.55199] CT
0.8 0.502 0.502 RC
N
f-2105962265
f
GR
GS
[1.00046 0 0 1.00215 150.21564 78.02906] CT
0.8 0.502 0.502 RC
N
f-2105962265
f
GR
GS
[1.00046 0 0 1.00215 140.37532 78.15491] CT
0.8 0.502 0.502 RC
N
f-2105962265
f
GR
GS
[1.00046 0 0 1.00215 201.92415 56.0987] CT
0.8 0.502 0.502 RC
N
f-2105962265
f
GR
GS
[1.00046 0 0 1.00215 180.28546 80.60055] CT
0.8 0.502 0.502 RC
N
f-2105962265
f
GR
GS
[1.00046 0 0 1.00215 153.67592 90.63708] CT
0.8 0.502 0.502 RC
N
f-2105962265
f
GR
GS
[1.00046 0 0 1.00215 133.87628 109.81572] CT
0.8 0.502 0.502 RC
N
f-2105962265
f
GR
GS
[1.00046 0 0 1.00215 146.3684 106.55793] CT
0.8 0.502 0.502 RC
N
f-2105962265
f
GR
GS
[1.00046 0 0 1.00215 169.68517 34.97504] CT
0.8 0.502 0.502 RC
N
f-2105962265
f
GR
GS
[1.00046 0 0 1.00215 112.18653 102.50011] CT
0.8 0.502 0.502 RC
N
f-2105962265
f
GR
GS
[1.00046 0 0 1.00215 142.78267 92.23289] CT
0.8 0.502 0.502 RC
N
f-2105962265
f
GR
GS
[1.00046 0 0 1.00215 179.27593 71.96757] CT
0.8 0.502 0.502 RC
N
f-2105962265
f
GR
GS
[1.00046 0 0 1.00215 209.3412 69.06281] CT
0.8 0.502 0.502 RC
N
f-2105962265
f
GR
GS
[1.00046 0 0 1.00215 99.79578 66.72033] CT
0.8 0.502 0.502 RC
N
f-2105962265
f
GR
GS
[1.00046 0 0 1.00215 168.43744 30.80839] CT
0.8 0.502 0.502 RC
N
f-2105962265
f
GR
GS
[1.00046 0 0 1.00215 185.54511 58.88856] CT
0.8 0.502 0.502 RC
N
f-2105962265
f
GR
GS
[1.00046 0 0 1.00215 140.21017 89.49811] CT
0.8 0.502 0.502 RC
N
f-2105962265
f
GR
GS
[1.00046 0 0 1.00215 162.11436 92.32377] CT
0.8 0.502 0.502 RC
N
f-2105962265
f
GR
GS
[1.00046 0 0 1.00215 156.45771 61.48649] CT
0.8 0.502 0.502 RC
N
f-2105962265
f
GR
GS
[1.00046 0 0 1.00215 113.46363 62.83527] CT
0.8 0.502 0.502 RC
N
f-2105962265
f
GR
GS
[1.00046 0 0 1.00215 160.37318 66.7854] CT
0.8 0.502 0.502 RC
N
f-2105962265
f
GR
GS
[1.00046 0 0 1.00215 178.05102 95.83406] CT
0.8 0.502 0.502 RC
N
f-2105962265
f
GR
GS
[1.00046 0 0 1.00215 188.10547 71.56437] CT
0.8 0.502 0.502 RC
N
f-2105962265
f
GR
GS
[1.00046 0 0 1.00215 158.54482 73.0753] CT
0.8 0.502 0.502 RC
N
f-2105962265
f
GR
GS
[1.00046 0 0 1.00215 177.97077 93.02182] CT
0.8 0.502 0.502 RC
N
f-2105962265
f
GR
GS
[1.00046 0 0 1.00215 209.3412 30.80839] CT
0.8 0.502 0.502 RC
N
f-2105962265
f
GR
GS
[1.00046 0 0 1.00215 165.1927 95.54571] CT
0.8 0.502 0.502 RC
N
f-2105962265
f
GR
GS
[1.00046 0 0 1.00215 190.60606 103.64077] CT
0.8 0.502 0.502 RC
N
f-2105962265
f
GR
GS
[1.00046 0 0 1.00215 203.40146 84.12395] CT
0.8 0.502 0.502 RC
N
f-2105962265
f
GR
GS
[1.00046 0 0 1.00215 183.18247 68.60898] CT
0.8 0.502 0.502 RC
N
f-2105962265
f
GR
GS
[1.00046 0 0 1.00215 142.36133 95.78198] CT
0.8 0.502 0.502 RC
N
f-2105962265
f
GR
GS
[1.00046 0 0 1.00215 151.65248 96.19446] CT
0.8 0.502 0.502 RC
N
f-2105962265
f
GR
GS
[1.00046 0 0 1.00215 111.44853 114.56428] CT
0.8 0.502 0.502 RC
N
f-2105962265
f
GR
GS
[1.00046 0 0 1.00215 136.6955 74.42091] CT
0.8 0.502 0.502 RC
N
f-2105962265
f
GR
GS
[1.00046 0 0 1.00215 112.10599 108.80153] CT
0.8 0.502 0.502 RC
N
f-2105962265
f
GR
GS
[1.00046 0 0 1.00215 157.4558 100.33805] CT
0.8 0.502 0.502 RC
N
f-2105962265
f
GR
GS
[1.00046 0 0 1.00215 147.94491 107.16609] CT
0.8 0.502 0.502 RC
N
f-2105962265
f
GR
GS
[1.00046 0 0 1.00215 126.18181 112.64644] CT
0.8 0.502 0.502 RC
N
f-2105962265
f
GR
GS
[1.00046 0 0 1.00215 159.15008 98.52587] CT
0.8 0.502 0.502 RC
N
f-2105962265
f
GR
GS
[1.00046 0 0 1.00215 96.76129 81.80528] CT
0.8 0.502 0.502 RC
N
f-2105962265
f
GR
GS
[1.00046 0 0 1.00215 154.25256 78.83419] CT
0.8 0.502 0.502 RC
N
f-2105962265
f
GR
GS
[1.00046 0 0 1.00215 74.5345 85.67287] CT
0.8 0.502 0.502 RC
N
f-2105962265
f
GR
GS
[1.00046 0 0 1.00215 141.46217 93.97619] CT
0.8 0.502 0.502 RC
N
f-2105962265
f
GR
GS
[1.00046 0 0 1.00215 129.88938 85.69525] CT
0.8 0.502 0.502 RC
N
f-2105962265
f
GR
GS
[1.00046 0 0 1.00215 123.83643 111.71031] CT
0.8 0.502 0.502 RC
N
f-2105962265
f
GR
GS
[1.00046 0 0 1.00215 142.44622 82.09061] CT
0.8 0.502 0.502 RC
N
f-2105962265
f
GR
GS
[1.00046 0 0 1.00215 119.62328 112.21063] CT
0.8 0.502 0.502 RC
N
f-2105962265
f
GR
GS
[1.00046 0 0 1.00215 90.54688 127.84899] CT
0.8 0.502 0.502 RC
N
f-2105962265
f
GR
GS
[1.00046 0 0 1.00215 122.83068 132.69338] CT
0.8 0.502 0.502 RC
N
f-2105962265
f
GR
GS
[1.00046 0 0 1.00215 133.53614 78.88832] CT
0.8 0.502 0.502 RC
N
f-2105962265
f
GR
GS
[1.00046 0 0 1.00215 115.41079 103.39745] CT
0.8 0.502 0.502 RC
N
f-2105962265
f
GR
GS
[1.00046 0 0 1.00215 127.06089 111.20191] CT
0.8 0.502 0.502 RC
N
f-2105962265
f
GR
GS
[1.00046 0 0 1.00215 130.94119 85.29655] CT
0.8 0.502 0.502 RC
N
f-2105962265
f
GR
GS
[1.00046 0 0 1.00215 139.89808 90.48457] CT
0.8 0.502 0.502 RC
N
f-2105962265
f
GR
GS
[1.00046 0 0 1.00215 109.25901 112.13129] CT
0.8 0.502 0.502 RC
N
f-2105962265
f
GR
GS
[1.00046 0 0 1.00215 142.63714 88.40543] CT
0.8 0.502 0.502 RC
N
f-2105962265
f
GR
GS
[1.00046 0 0 1.00215 153.26187 110.47571] CT
0.8 0.502 0.502 RC
N
f-2105962265
f
GR
GS
[1.00046 0 0 1.00215 117.6547 80.72981] CT
0.8 0.502 0.502 RC
N
f-2105962265
f
GR
GS
[1.00046 0 0 1.00215 152.10311 92.18108] CT
0.8 0.502 0.502 RC
N
f-2105962265
f
GR
GS
[1.00046 0 0 1.00215 126.06632 87.83905] CT
0.8 0.502 0.502 RC
N
f-2105962265
f
GR
GS
[1.00046 0 0 1.00215 147.76735 89.98199] CT
0.8 0.502 0.502 RC
N
f-2105962265
f
GR
GS
[1.00046 0 0 1.00215 144.9722 112.84061] CT
0.8 0.502 0.502 RC
N
f-2105962265
f
GR
GS
[1.00046 0 0 1.00215 148.27378 71.23061] CT
0.8 0.502 0.502 RC
N
f-2105962265
f
GR
GS
[1.00046 0 0 1.00215 131.32624 91.28493] CT
0.8 0.502 0.502 RC
N
f-2105962265
f
GR
GS
[1.00046 0 0 1.00215 148.95833 98.88806] CT
0.8 0.502 0.502 RC
N
f-2105962265
f
GR
GS
[1.00046 0 0 1.00215 115.4323 105.51821] CT
0.8 0.502 0.502 RC
N
f-2105962265
f
GR
GS
[1.00046 0 0 1.00215 114.59103 86.03809] CT
0.8 0.502 0.502 RC
N
f-2105962265
f
GR
GS
[1.00046 0 0 1.00215 158.61096 122.55806] CT
0.8 0.502 0.502 RC
N
f-2105962265
f
GR
GS
[1.00046 0 0 1.00215 115.61526 52.83812] CT
0.8 0.502 0.502 RC
N
f-2105962265
f
GR
GS
[1.00046 0 0 1.00215 109.92376 84.60274] CT
0.8 0.502 0.502 RC
N
f-2105962265
f
GR
GS
[1.00046 0 0 1.00215 155.31174 82.70336] CT
0.8 0.502 0.502 RC
N
f-2105962265
f
GR
GS
[1.00046 0 0 1.00215 122.88971 101.90582] CT
0.8 0.502 0.502 RC
N
f-2105962265
f
GR
GS
[1.00046 0 0 1.00215 125.46855 92.46017] CT
0.8 0.502 0.502 RC
N
f-2105962265
f
GR
GS
[1.00046 0 0 1.00215 148.96335 110.05424] CT
0.8 0.502 0.502 RC
N
f-2105962265
f
GR
GS
[1.00046 0 0 1.00215 131.54956 91.4727] CT
0.8 0.502 0.502 RC
N
f-2105962265
f
GR
GS
[1.00046 0 0 1.00215 131.90846 111.86188] CT
0.8 0.502 0.502 RC
N
f-2105962265
f
GR
GS
[1.00046 0 0 1.00215 108.73533 95.4057] CT
0.8 0.502 0.502 RC
N
f-2105962265
f
GR
GS
[1.00046 0 0 1.00215 104.65085 112.90768] CT
0.8 0.502 0.502 RC
N
f-2105962265
f
GR
GS
[1.00046 0 0 1.00215 101.23358 106.55139] CT
0.8 0.502 0.502 RC
N
f-2105962265
f
GR
GS
[1.00046 0 0 1.00215 160.74316 101.40348] CT
0.8 0.502 0.502 RC
N
f-2105962265
f
GR
GS
[1.00046 0 0 1.00215 134.56377 70.23082] CT
0.8 0.502 0.502 RC
N
f-2105962265
f
GR
GS
[1.00046 0 0 1.00215 132.49163 124.57567] CT
0.8 0.502 0.502 RC
N
f-2105962265
f
GR
GS
[1.00046 0 0 1.00215 107.47301 107.39599] CT
0.8 0.502 0.502 RC
N
f-2105962265
f
GR
GS
[1.00046 0 0 1.00215 125.61361 68.97352] CT
0.8 0.502 0.502 RC
N
f-2105962265
f
GR
GS
[1.00046 0 0 1.00215 118.8634 100.55042] CT
0.8 0.502 0.502 RC
N
f-2105962265
f
GR
GS
[1.00046 0 0 1.00215 171.40864 68.63156] CT
0.8 0.502 0.502 RC
N
f-2105962265
f
GR
GS
[1.00046 0 0 1.00215 118.13962 106.48805] CT
0.8 0.502 0.502 RC
N
f-2105962265
f
GR
GS
[1.00046 0 0 1.00215 148.83686 52.83812] CT
0.8 0.502 0.502 RC
N
f-2105962265
f
GR
GS
[1.00046 0 0 1.00215 140.30587 99.34694] CT
0.8 0.502 0.502 RC
N
f-2105962265
f
GR
GS
[1.00046 0 0 1.00215 0 -0.4252] CT
0.902 0.6 0.6 RC
1 LJ
3 LW
N
74.5 111.253 M
231.5 60.643 L
S
GR
GS
[1.00046 0 0 1.00215 176.88961 104.792] CT
1 0.702 0.702 RC
N
/f227889816{-3 -3 M
-3 3 L
3 3 L
3 -3 L
cp}def
f227889816
f
GR
GS
[1.00046 0 0 1.00215 124.57196 116.96661] CT
1 0.702 0.702 RC
N
f227889816
f
GR
GS
[1.00046 0 0 1.00215 204.31332 61.016] CT
1 0.702 0.702 RC
N
f227889816
f
GR
GS
[1.00046 0 0 1.00215 184.24298 50.78592] CT
1 0.702 0.702 RC
N
f227889816
f
GR
GS
[1.00046 0 0 1.00215 123.7089 65.66401] CT
1 0.702 0.702 RC
N
f227889816
f
GR
GS
[1.00046 0 0 1.00215 139.64605 82.032] CT
1 0.702 0.702 RC
N
f227889816
f
GR
GS
[1.00046 0 0 1.00215 168.31996 86.55199] CT
1 0.702 0.702 RC
N
f227889816
f
GR
GS
[1.00046 0 0 1.00215 150.21564 78.02906] CT
1 0.702 0.702 RC
N
f227889816
f
GR
GS
[1.00046 0 0 1.00215 140.37532 78.15491] CT
1 0.702 0.702 RC
N
f227889816
f
GR
GS
[1.00046 0 0 1.00215 201.92415 56.0987] CT
1 0.702 0.702 RC
N
f227889816
f
GR
GS
[1.00046 0 0 1.00215 180.28546 80.60055] CT
1 0.702 0.702 RC
N
f227889816
f
GR
GS
[1.00046 0 0 1.00215 153.67592 90.63708] CT
1 0.702 0.702 RC
N
f227889816
f
GR
GS
[1.00046 0 0 1.00215 133.87628 109.81572] CT
1 0.702 0.702 RC
N
f227889816
f
GR
GS
[1.00046 0 0 1.00215 146.3684 106.55793] CT
1 0.702 0.702 RC
N
f227889816
f
GR
GS
[1.00046 0 0 1.00215 169.68517 34.97504] CT
1 0.702 0.702 RC
N
f227889816
f
GR
GS
[1.00046 0 0 1.00215 112.18653 102.50011] CT
1 0.702 0.702 RC
N
f227889816
f
GR
GS
[1.00046 0 0 1.00215 142.78267 92.23289] CT
1 0.702 0.702 RC
N
f227889816
f
GR
GS
[1.00046 0 0 1.00215 179.27593 71.96757] CT
1 0.702 0.702 RC
N
f227889816
f
GR
GS
[1.00046 0 0 1.00215 209.3412 69.06281] CT
1 0.702 0.702 RC
N
f227889816
f
GR
GS
[1.00046 0 0 1.00215 99.79578 66.72033] CT
1 0.702 0.702 RC
N
f227889816
f
GR
GS
[1.00046 0 0 1.00215 168.43744 30.80839] CT
1 0.702 0.702 RC
N
f227889816
f
GR
GS
[1.00046 0 0 1.00215 185.54511 58.88856] CT
1 0.702 0.702 RC
N
f227889816
f
GR
GS
[1.00046 0 0 1.00215 140.21017 89.49811] CT
1 0.702 0.702 RC
N
f227889816
f
GR
GS
[1.00046 0 0 1.00215 162.11436 92.32377] CT
1 0.702 0.702 RC
N
f227889816
f
GR
GS
[1.00046 0 0 1.00215 156.45771 61.48649] CT
1 0.702 0.702 RC
N
f227889816
f
GR
GS
[1.00046 0 0 1.00215 113.46363 62.83527] CT
1 0.702 0.702 RC
N
f227889816
f
GR
GS
[1.00046 0 0 1.00215 160.37318 66.7854] CT
1 0.702 0.702 RC
N
f227889816
f
GR
GS
[1.00046 0 0 1.00215 178.05102 95.83406] CT
1 0.702 0.702 RC
N
f227889816
f
GR
GS
[1.00046 0 0 1.00215 188.10547 71.56437] CT
1 0.702 0.702 RC
N
f227889816
f
GR
GS
[1.00046 0 0 1.00215 158.54482 73.0753] CT
1 0.702 0.702 RC
N
f227889816
f
GR
GS
[1.00046 0 0 1.00215 177.97077 93.02182] CT
1 0.702 0.702 RC
N
f227889816
f
GR
GS
[1.00046 0 0 1.00215 209.3412 30.80839] CT
1 0.702 0.702 RC
N
f227889816
f
GR
GS
[1.00046 0 0 1.00215 165.1927 95.54571] CT
1 0.702 0.702 RC
N
f227889816
f
GR
GS
[1.00046 0 0 1.00215 190.60606 103.64077] CT
1 0.702 0.702 RC
N
f227889816
f
GR
GS
[1.00046 0 0 1.00215 203.40146 84.12395] CT
1 0.702 0.702 RC
N
f227889816
f
GR
GS
[1.00046 0 0 1.00215 183.18247 68.60898] CT
1 0.702 0.702 RC
N
f227889816
f
GR
GS
[1.00046 0 0 1.00215 142.36133 95.78198] CT
1 0.702 0.702 RC
N
f227889816
f
GR
GS
[1.00046 0 0 1.00215 151.65248 96.19446] CT
1 0.702 0.702 RC
N
f227889816
f
GR
GS
[1.00046 0 0 1.00215 111.44853 114.56428] CT
1 0.702 0.702 RC
N
f227889816
f
GR
GS
[1.00046 0 0 1.00215 136.6955 74.42091] CT
1 0.702 0.702 RC
N
f227889816
f
GR
GS
[1.00046 0 0 1.00215 112.10599 108.80153] CT
1 0.702 0.702 RC
N
f227889816
f
GR
GS
[1.00046 0 0 1.00215 157.4558 100.33805] CT
1 0.702 0.702 RC
N
f227889816
f
GR
GS
[1.00046 0 0 1.00215 147.94491 107.16609] CT
0.8 0.502 0.502 RC
N
/f-1969333140{-3.536 0 M
0 4.702 L
3.536 0 L
0 -4.702 L
cp}def
f-1969333140
f
GR
GS
[1.00046 0 0 1.00215 126.18181 112.64644] CT
0.8 0.502 0.502 RC
N
f-1969333140
f
GR
GS
[1.00046 0 0 1.00215 159.15008 98.52587] CT
0.8 0.502 0.502 RC
N
f-1969333140
f
GR
GS
[1.00046 0 0 1.00215 96.76129 81.80528] CT
0.8 0.502 0.502 RC
N
f-1969333140
f
GR
GS
[1.00046 0 0 1.00215 154.25256 78.83419] CT
0.8 0.502 0.502 RC
N
f-1969333140
f
GR
GS
[1.00046 0 0 1.00215 74.5345 85.67287] CT
0.8 0.502 0.502 RC
N
f-1969333140
f
GR
GS
[1.00046 0 0 1.00215 141.46217 93.97619] CT
0.8 0.502 0.502 RC
N
f-1969333140
f
GR
GS
[1.00046 0 0 1.00215 129.88938 85.69525] CT
0.8 0.502 0.502 RC
N
f-1969333140
f
GR
GS
[1.00046 0 0 1.00215 123.83643 111.71031] CT
0.8 0.502 0.502 RC
N
f-1969333140
f
GR
GS
[1.00046 0 0 1.00215 142.44622 82.09061] CT
0.8 0.502 0.502 RC
N
f-1969333140
f
GR
GS
[1.00046 0 0 1.00215 119.62328 112.21063] CT
0.8 0.502 0.502 RC
N
f-1969333140
f
GR
GS
[1.00046 0 0 1.00215 90.54688 127.84899] CT
0.8 0.502 0.502 RC
N
f-1969333140
f
GR
GS
[1.00046 0 0 1.00215 122.83068 132.69338] CT
0.8 0.502 0.502 RC
N
f-1969333140
f
GR
GS
[1.00046 0 0 1.00215 133.53614 78.88832] CT
0.8 0.502 0.502 RC
N
f-1969333140
f
GR
GS
[1.00046 0 0 1.00215 115.41079 103.39745] CT
0.8 0.502 0.502 RC
N
f-1969333140
f
GR
GS
[1.00046 0 0 1.00215 127.06089 111.20191] CT
0.8 0.502 0.502 RC
N
f-1969333140
f
GR
GS
[1.00046 0 0 1.00215 130.94119 85.29655] CT
0.8 0.502 0.502 RC
N
f-1969333140
f
GR
GS
[1.00046 0 0 1.00215 139.89808 90.48457] CT
0.8 0.502 0.502 RC
N
f-1969333140
f
GR
GS
[1.00046 0 0 1.00215 109.25901 112.13129] CT
0.8 0.502 0.502 RC
N
f-1969333140
f
GR
GS
[1.00046 0 0 1.00215 142.63714 88.40543] CT
0.8 0.502 0.502 RC
N
f-1969333140
f
GR
GS
[1.00046 0 0 1.00215 153.26187 110.47571] CT
0.8 0.502 0.502 RC
N
f-1969333140
f
GR
GS
[1.00046 0 0 1.00215 117.6547 80.72981] CT
0.8 0.502 0.502 RC
N
f-1969333140
f
GR
GS
[1.00046 0 0 1.00215 152.10311 92.18108] CT
0.8 0.502 0.502 RC
N
f-1969333140
f
GR
GS
[1.00046 0 0 1.00215 126.06632 87.83905] CT
0.8 0.502 0.502 RC
N
f-1969333140
f
GR
GS
[1.00046 0 0 1.00215 147.76735 89.98199] CT
0.8 0.502 0.502 RC
N
f-1969333140
f
GR
GS
[1.00046 0 0 1.00215 144.9722 112.84061] CT
0.8 0.502 0.502 RC
N
f-1969333140
f
GR
GS
[1.00046 0 0 1.00215 148.27378 71.23061] CT
0.8 0.502 0.502 RC
N
f-1969333140
f
GR
GS
[1.00046 0 0 1.00215 131.32624 91.28493] CT
0.8 0.502 0.502 RC
N
f-1969333140
f
GR
GS
[1.00046 0 0 1.00215 148.95833 98.88806] CT
0.8 0.502 0.502 RC
N
f-1969333140
f
GR
GS
[1.00046 0 0 1.00215 115.4323 105.51821] CT
0.8 0.502 0.502 RC
N
f-1969333140
f
GR
GS
[1.00046 0 0 1.00215 114.59103 86.03809] CT
0.8 0.502 0.502 RC
N
f-1969333140
f
GR
GS
[1.00046 0 0 1.00215 158.61096 122.55806] CT
0.8 0.502 0.502 RC
N
f-1969333140
f
GR
GS
[1.00046 0 0 1.00215 115.61526 52.83812] CT
0.8 0.502 0.502 RC
N
f-1969333140
f
GR
GS
[1.00046 0 0 1.00215 109.92376 84.60274] CT
0.8 0.502 0.502 RC
N
f-1969333140
f
GR
GS
[1.00046 0 0 1.00215 155.31174 82.70336] CT
0.8 0.502 0.502 RC
N
f-1969333140
f
GR
GS
[1.00046 0 0 1.00215 122.88971 101.90582] CT
0.8 0.502 0.502 RC
N
f-1969333140
f
GR
GS
[1.00046 0 0 1.00215 125.46855 92.46017] CT
0.8 0.502 0.502 RC
N
f-1969333140
f
GR
GS
[1.00046 0 0 1.00215 148.96335 110.05424] CT
0.8 0.502 0.502 RC
N
f-1969333140
f
GR
GS
[1.00046 0 0 1.00215 131.54956 91.4727] CT
0.8 0.502 0.502 RC
N
f-1969333140
f
GR
GS
[1.00046 0 0 1.00215 131.90846 111.86188] CT
0.8 0.502 0.502 RC
N
f-1969333140
f
GR
GS
[1.00046 0 0 1.00215 108.73533 95.4057] CT
0.8 0.502 0.502 RC
N
f-1969333140
f
GR
GS
[1.00046 0 0 1.00215 104.65085 112.90768] CT
0.8 0.502 0.502 RC
N
f-1969333140
f
GR
GS
[1.00046 0 0 1.00215 101.23358 106.55139] CT
0.8 0.502 0.502 RC
N
f-1969333140
f
GR
GS
[1.00046 0 0 1.00215 160.74316 101.40348] CT
0.8 0.502 0.502 RC
N
f-1969333140
f
GR
GS
[1.00046 0 0 1.00215 134.56377 70.23082] CT
0.8 0.502 0.502 RC
N
f-1969333140
f
GR
GS
[1.00046 0 0 1.00215 132.49163 124.57567] CT
0.8 0.502 0.502 RC
N
f-1969333140
f
GR
GS
[1.00046 0 0 1.00215 107.47301 107.39599] CT
0.8 0.502 0.502 RC
N
f-1969333140
f
GR
GS
[1.00046 0 0 1.00215 125.61361 68.97352] CT
0.8 0.502 0.502 RC
N
f-1969333140
f
GR
GS
[1.00046 0 0 1.00215 118.8634 100.55042] CT
0.8 0.502 0.502 RC
N
f-1969333140
f
GR
GS
[1.00046 0 0 1.00215 171.40864 68.63156] CT
0.8 0.502 0.502 RC
N
f-1969333140
f
GR
GS
[1.00046 0 0 1.00215 118.13962 106.48805] CT
0.8 0.502 0.502 RC
N
f-1969333140
f
GR
GS
[1.00046 0 0 1.00215 148.83686 52.83812] CT
0.8 0.502 0.502 RC
N
f-1969333140
f
GR
GS
[1.00046 0 0 1.00215 140.30587 99.34694] CT
0.8 0.502 0.502 RC
N
f-1969333140
f
GR
%%Trailer
%%Pages: 1
%%EOF
