%!PS-Adobe-3.0 EPSF-3.0
%%Creator: (MATLAB, The Mathworks, Inc. Version 9.8.0.1323502 \(R2020a\). Operating System: Mac OS X)
%%Title: /Users/kosciessa/Desktop/mntTardisLNDG/LNDG/stateswitch/stsw_multimodal/figures/l1byage/l1comp_ssvep.eps
%%CreationDate: 2022-03-02T14:36:47
%%Pages: (atend)
%%BoundingBox:     4     0   180   275
%%LanguageLevel: 3
%%EndComments
%%BeginProlog
%%BeginResource: procset (Apache XML Graphics Std ProcSet) 1.2 0
%%Version: 1.2 0
%%Copyright: (Copyright 2001-2003,2010 The Apache Software Foundation. License terms: http://www.apache.org/licenses/LICENSE-2.0)
/bd{bind def}bind def
/ld{load def}bd
/GR/grestore ld
/GS/gsave ld
/RM/rmoveto ld
/C/curveto ld
/t/show ld
/L/lineto ld
/ML/setmiterlimit ld
/CT/concat ld
/f/fill ld
/N/newpath ld
/S/stroke ld
/CC/setcmykcolor ld
/A/ashow ld
/cp/closepath ld
/RC/setrgbcolor ld
/LJ/setlinejoin ld
/GC/setgray ld
/LW/setlinewidth ld
/M/moveto ld
/re {4 2 roll M
1 index 0 rlineto
0 exch rlineto
neg 0 rlineto
cp } bd
/_ctm matrix def
/_tm matrix def
/BT { _ctm currentmatrix pop matrix _tm copy pop 0 0 moveto } bd
/ET { _ctm setmatrix } bd
/iTm { _ctm setmatrix _tm concat } bd
/Tm { _tm astore pop iTm 0 0 moveto } bd
/ux 0.0 def
/uy 0.0 def
/F {
  /Tp exch def
  /Tf exch def
  Tf findfont Tp scalefont setfont
  /cf Tf def  /cs Tp def
} bd
/ULS {currentpoint /uy exch def /ux exch def} bd
/ULE {
  /Tcx currentpoint pop def
  gsave
  newpath
  cf findfont cs scalefont dup
  /FontMatrix get 0 get /Ts exch def /FontInfo get dup
  /UnderlinePosition get Ts mul /To exch def
  /UnderlineThickness get Ts mul /Tt exch def
  ux uy To add moveto  Tcx uy To add lineto
  Tt setlinewidth stroke
  grestore
} bd
/OLE {
  /Tcx currentpoint pop def
  gsave
  newpath
  cf findfont cs scalefont dup
  /FontMatrix get 0 get /Ts exch def /FontInfo get dup
  /UnderlinePosition get Ts mul /To exch def
  /UnderlineThickness get Ts mul /Tt exch def
  ux uy To add cs add moveto Tcx uy To add cs add lineto
  Tt setlinewidth stroke
  grestore
} bd
/SOE {
  /Tcx currentpoint pop def
  gsave
  newpath
  cf findfont cs scalefont dup
  /FontMatrix get 0 get /Ts exch def /FontInfo get dup
  /UnderlinePosition get Ts mul /To exch def
  /UnderlineThickness get Ts mul /Tt exch def
  ux uy To add cs 10 mul 26 idiv add moveto Tcx uy To add cs 10 mul 26 idiv add lineto
  Tt setlinewidth stroke
  grestore
} bd
/QT {
/Y22 exch store
/X22 exch store
/Y21 exch store
/X21 exch store
currentpoint
/Y21 load 2 mul add 3 div exch
/X21 load 2 mul add 3 div exch
/X21 load 2 mul /X22 load add 3 div
/Y21 load 2 mul /Y22 load add 3 div
/X22 load /Y22 load curveto
} bd
/SSPD {
dup length /d exch dict def
{
/v exch def
/k exch def
currentpagedevice k known {
/cpdv currentpagedevice k get def
v cpdv ne {
/upd false def
/nullv v type /nulltype eq def
/nullcpdv cpdv type /nulltype eq def
nullv nullcpdv or
{
/upd true def
} {
/sametype v type cpdv type eq def
sametype {
v type /arraytype eq {
/vlen v length def
/cpdvlen cpdv length def
vlen cpdvlen eq {
0 1 vlen 1 sub {
/i exch def
/obj v i get def
/cpdobj cpdv i get def
obj cpdobj ne {
/upd true def
exit
} if
} for
} {
/upd true def
} ifelse
} {
v type /dicttype eq {
v {
/dv exch def
/dk exch def
/cpddv cpdv dk get def
dv cpddv ne {
/upd true def
exit
} if
} forall
} {
/upd true def
} ifelse
} ifelse
} if
} ifelse
upd true eq {
d k v put
} if
} if
} if
} forall
d length 0 gt {
d setpagedevice
} if
} bd
/RE { % /NewFontName [NewEncodingArray] /FontName RE -
  findfont dup length dict begin
  {
    1 index /FID ne
    {def} {pop pop} ifelse
  } forall
  /Encoding exch def
  /FontName 1 index def
  currentdict definefont pop
  end
} bind def
%%EndResource
%%BeginResource: procset (Apache XML Graphics EPS ProcSet) 1.0 0
%%Version: 1.0 0
%%Copyright: (Copyright 2002-2003 The Apache Software Foundation. License terms: http://www.apache.org/licenses/LICENSE-2.0)
/BeginEPSF { %def
/b4_Inc_state save def         % Save state for cleanup
/dict_count countdictstack def % Count objects on dict stack
/op_count count 1 sub def      % Count objects on operand stack
userdict begin                 % Push userdict on dict stack
/showpage { } def              % Redefine showpage, { } = null proc
0 setgray 0 setlinecap         % Prepare graphics state
1 setlinewidth 0 setlinejoin
10 setmiterlimit [ ] 0 setdash newpath
/languagelevel where           % If level not equal to 1 then
{pop languagelevel             % set strokeadjust and
1 ne                           % overprint to their defaults.
{false setstrokeadjust false setoverprint
} if
} if
} bd
/EndEPSF { %def
count op_count sub {pop} repeat            % Clean up stacks
countdictstack dict_count sub {end} repeat
b4_Inc_state restore
} bd
%%EndResource
%FOPBeginFontDict
%%IncludeResource: font Courier-Oblique
%%IncludeResource: font Courier-BoldOblique
%%IncludeResource: font Courier-Bold
%%IncludeResource: font ZapfDingbats
%%IncludeResource: font Symbol
%%IncludeResource: font Helvetica
%%IncludeResource: font Helvetica-Oblique
%%IncludeResource: font Helvetica-Bold
%%IncludeResource: font Helvetica-BoldOblique
%%IncludeResource: font Times-Roman
%%IncludeResource: font Times-Italic
%%IncludeResource: font Times-Bold
%%IncludeResource: font Times-BoldItalic
%%IncludeResource: font Courier
%FOPEndFontDict
%%BeginResource: encoding WinAnsiEncoding
/WinAnsiEncoding [
/.notdef /.notdef /.notdef /.notdef /.notdef
/.notdef /.notdef /.notdef /.notdef /.notdef
/.notdef /.notdef /.notdef /.notdef /.notdef
/.notdef /.notdef /.notdef /.notdef /.notdef
/.notdef /.notdef /.notdef /.notdef /.notdef
/.notdef /.notdef /.notdef /.notdef /.notdef
/.notdef /.notdef /space /exclam /quotedbl
/numbersign /dollar /percent /ampersand /quotesingle
/parenleft /parenright /asterisk /plus /comma
/hyphen /period /slash /zero /one
/two /three /four /five /six
/seven /eight /nine /colon /semicolon
/less /equal /greater /question /at
/A /B /C /D /E
/F /G /H /I /J
/K /L /M /N /O
/P /Q /R /S /T
/U /V /W /X /Y
/Z /bracketleft /backslash /bracketright /asciicircum
/underscore /quoteleft /a /b /c
/d /e /f /g /h
/i /j /k /l /m
/n /o /p /q /r
/s /t /u /v /w
/x /y /z /braceleft /bar
/braceright /asciitilde /bullet /Euro /bullet
/quotesinglbase /florin /quotedblbase /ellipsis /dagger
/daggerdbl /circumflex /perthousand /Scaron /guilsinglleft
/OE /bullet /Zcaron /bullet /bullet
/quoteleft /quoteright /quotedblleft /quotedblright /bullet
/endash /emdash /asciitilde /trademark /scaron
/guilsinglright /oe /bullet /zcaron /Ydieresis
/space /exclamdown /cent /sterling /currency
/yen /brokenbar /section /dieresis /copyright
/ordfeminine /guillemotleft /logicalnot /sfthyphen /registered
/macron /degree /plusminus /twosuperior /threesuperior
/acute /mu /paragraph /middot /cedilla
/onesuperior /ordmasculine /guillemotright /onequarter /onehalf
/threequarters /questiondown /Agrave /Aacute /Acircumflex
/Atilde /Adieresis /Aring /AE /Ccedilla
/Egrave /Eacute /Ecircumflex /Edieresis /Igrave
/Iacute /Icircumflex /Idieresis /Eth /Ntilde
/Ograve /Oacute /Ocircumflex /Otilde /Odieresis
/multiply /Oslash /Ugrave /Uacute /Ucircumflex
/Udieresis /Yacute /Thorn /germandbls /agrave
/aacute /acircumflex /atilde /adieresis /aring
/ae /ccedilla /egrave /eacute /ecircumflex
/edieresis /igrave /iacute /icircumflex /idieresis
/eth /ntilde /ograve /oacute /ocircumflex
/otilde /odieresis /divide /oslash /ugrave
/uacute /ucircumflex /udieresis /yacute /thorn
/ydieresis
] def
%%EndResource
%FOPBeginFontReencode
/Courier-Oblique findfont
dup length dict begin
  {1 index /FID ne {def} {pop pop} ifelse} forall
  /Encoding WinAnsiEncoding def
  currentdict
end
/Courier-Oblique exch definefont pop
/Courier-BoldOblique findfont
dup length dict begin
  {1 index /FID ne {def} {pop pop} ifelse} forall
  /Encoding WinAnsiEncoding def
  currentdict
end
/Courier-BoldOblique exch definefont pop
/Courier-Bold findfont
dup length dict begin
  {1 index /FID ne {def} {pop pop} ifelse} forall
  /Encoding WinAnsiEncoding def
  currentdict
end
/Courier-Bold exch definefont pop
/Helvetica findfont
dup length dict begin
  {1 index /FID ne {def} {pop pop} ifelse} forall
  /Encoding WinAnsiEncoding def
  currentdict
end
/Helvetica exch definefont pop
/Helvetica-Oblique findfont
dup length dict begin
  {1 index /FID ne {def} {pop pop} ifelse} forall
  /Encoding WinAnsiEncoding def
  currentdict
end
/Helvetica-Oblique exch definefont pop
/Helvetica-Bold findfont
dup length dict begin
  {1 index /FID ne {def} {pop pop} ifelse} forall
  /Encoding WinAnsiEncoding def
  currentdict
end
/Helvetica-Bold exch definefont pop
/Helvetica-BoldOblique findfont
dup length dict begin
  {1 index /FID ne {def} {pop pop} ifelse} forall
  /Encoding WinAnsiEncoding def
  currentdict
end
/Helvetica-BoldOblique exch definefont pop
/Times-Roman findfont
dup length dict begin
  {1 index /FID ne {def} {pop pop} ifelse} forall
  /Encoding WinAnsiEncoding def
  currentdict
end
/Times-Roman exch definefont pop
/Times-Italic findfont
dup length dict begin
  {1 index /FID ne {def} {pop pop} ifelse} forall
  /Encoding WinAnsiEncoding def
  currentdict
end
/Times-Italic exch definefont pop
/Times-Bold findfont
dup length dict begin
  {1 index /FID ne {def} {pop pop} ifelse} forall
  /Encoding WinAnsiEncoding def
  currentdict
end
/Times-Bold exch definefont pop
/Times-BoldItalic findfont
dup length dict begin
  {1 index /FID ne {def} {pop pop} ifelse} forall
  /Encoding WinAnsiEncoding def
  currentdict
end
/Times-BoldItalic exch definefont pop
/Courier findfont
dup length dict begin
  {1 index /FID ne {def} {pop pop} ifelse} forall
  /Encoding WinAnsiEncoding def
  currentdict
end
/Courier exch definefont pop
%FOPEndFontReencode
%%EndProlog
%%Page: 1 1
%%PageBoundingBox: 0 0 198 283
%%BeginPageSetup
[1 0 0 -1 0 283] CT
%%EndPageSetup
GS
[1.00215 0 0 1 0 0] CT
1 GC
N
0 0 198 283 re
f
GR
GS
[1.00215 0 0 1 0 0] CT
1 GC
N
0 0 198 283 re
f
GR
GS
[1.00215 0 0 1 0 0] CT
1 GC
N
61 228 M
179 228 L
179 32 L
61 32 L
cp
f
GR
GS
[1.00215 0 0 1 0 0] CT
0.149 GC
2 setlinecap
1 LJ
0.5 LW
N
61 228 M
179 228 L
S
GR
GS
[1.00215 0 0 1 0 0] CT
0.149 GC
2 setlinecap
1 LJ
0.5 LW
N
96.4 228 M
96.4 226.04 L
S
GR
GS
[1.00215 0 0 1 0 0] CT
0.149 GC
2 setlinecap
1 LJ
0.5 LW
N
143.6 228 M
143.6 226.04 L
S
GR
GS
[1.00215 0 0 1 96.60702 234] CT
0.149 GC
/Helvetica 20 F
GS
[1 0 0 1 0 0] CT
-13 20 moveto 
1 -1 scale
(YA) t 
GR
GR
GS
[1.00215 0 0 1 143.90838 234] CT
0.149 GC
/Helvetica 20 F
GS
[1 0 0 1 0 0] CT
-14.5 20 moveto 
1 -1 scale
(OA) t 
GR
GR
GS
[1.00215 0 0 1 120.25775 259] CT
0.149 GC
/Helvetica 20 F
GS
[1 0 0 1 0 0] CT
-49 20 moveto 
1 -1 scale
(Age Group) t 
GR
GR
GS
[1.00215 0 0 1 0 0] CT
0.149 GC
2 setlinecap
1 LJ
0.5 LW
N
61 228 M
61 32 L
S
GR
GS
[1.00215 0 0 1 0 0] CT
0.149 GC
2 setlinecap
1 LJ
0.5 LW
N
61 214.086 M
62.96 214.086 L
S
GR
GS
[1.00215 0 0 1 0 0] CT
0.149 GC
2 setlinecap
1 LJ
0.5 LW
N
61 123.043 M
62.96 123.043 L
S
GR
GS
[1.00215 0 0 1 0 0] CT
0.149 GC
2 setlinecap
1 LJ
0.5 LW
N
61 32 M
62.96 32 L
S
GR
GS
[1.00215 0 0 1 55.11811 214.08629] CT
0.149 GC
/Helvetica 20 F
GS
[1 0 0 1 0 0] CT
-12 7.5 moveto 
1 -1 scale
(0) t 
GR
GR
GS
[1.00215 0 0 1 55.11811 123.04314] CT
0.149 GC
/Helvetica 20 F
GS
[1 0 0 1 0 0] CT
-28 7.5 moveto 
1 -1 scale
(0.5) t 
GR
GR
GS
[1.00215 0 0 1 55.11811 32] CT
0.149 GC
/Helvetica 20 F
GS
[1 0 0 1 0 0] CT
-12 7.5 moveto 
1 -1 scale
(1) t 
GR
GR
GS
[0 -1 1.00215 0 24.05154 129.99991] CT
0.149 GC
/Helvetica 20 F
GS
[1 0 0 1 0 0] CT
-37 -5 moveto 
1 -1 scale
(ssvep l1) t 
GR
GR
GS
[1.00215 0 0 1 120.25781 29.25] CT
/Helvetica-Bold 22 F
GS
[1 0 0 1 0 0] CT
-41 -5 moveto 
1 -1 scale
(p = 0.77) t 
GR
GR
GS
[1.00215 0 0 1 0 0] CT
0.149 GC
1 LJ
0.5 LW
N
61 214.086 M
179 214.086 L
S
GR
GS
[1.00215 0 0 1 0 0] CT
1 0.6 0.6 RC
N
115.28 214.086 M
115.28 163.233 L
77.52 163.233 L
77.52 214.086 L
cp
f
GR
GS
[1.00215 0 0 1 89.17762 219.7285] CT
0.302 GC
N
2.236 0 M
2.236 -1.235 1.235 -2.236 0 -2.236 C
-1.235 -2.236 -2.236 -1.235 -2.236 0 C
-2.236 1.235 -1.235 2.236 0 2.236 C
1.235 2.236 2.236 1.235 2.236 0 C
cp
f
GR
GS
[1.00215 0 0 1 95.91497 217.56868] CT
0.302 GC
N
/f-1586420743{2.236 0 M
2.236 -1.235 1.235 -2.236 0 -2.236 C
-1.235 -2.236 -2.236 -1.235 -2.236 0 C
-2.236 1.235 -1.235 2.236 0 2.236 C
1.235 2.236 2.236 1.235 2.236 0 C
cp}def
f-1586420743
f
GR
GS
[1.00215 0 0 1 92.28862 199.29739] CT
0.302 GC
N
f-1586420743
f
GR
GS
[1.00215 0 0 1 89.10598 190.51888] CT
0.302 GC
N
f-1586420743
f
GR
GS
[1.00215 0 0 1 100.50653 159.5896] CT
0.302 GC
N
f-1586420743
f
GR
GS
[1.00215 0 0 1 95.54773 55.29948] CT
0.302 GC
N
f-1586420743
f
GR
GS
[1.00215 0 0 1 99.59893 104.15653] CT
0.302 GC
N
f-1586420743
f
GR
GS
[1.00215 0 0 1 88.02687 194.38049] CT
0.302 GC
N
f-1586420743
f
GR
GS
[1.00215 0 0 1 102.60825 198.40688] CT
0.302 GC
N
f-1586420743
f
GR
GS
[1.00215 0 0 1 87.26298 171.73036] CT
0.302 GC
N
f-1586420743
f
GR
GS
[1.00215 0 0 1 94.76299 148.48938] CT
0.302 GC
N
f-1586420743
f
GR
GS
[1.00215 0 0 1 94.80014 168.61464] CT
0.302 GC
N
f-1586420743
f
GR
GS
[1.00215 0 0 1 93.24957 164.62303] CT
0.302 GC
N
f-1586420743
f
GR
GS
[1.00215 0 0 1 88.55841 151.26108] CT
0.302 GC
N
f-1586420743
f
GR
GS
[1.00215 0 0 1 94.50915 194.33073] CT
0.302 GC
N
f-1586420743
f
GR
GS
[1.00215 0 0 1 96.43164 195.76668] CT
0.302 GC
N
f-1586420743
f
GR
GS
[1.00215 0 0 1 97.89281 213.57204] CT
0.302 GC
N
f-1586420743
f
GR
GS
[1.00215 0 0 1 90.51286 197.26952] CT
0.302 GC
N
f-1586420743
f
GR
GS
[1.00215 0 0 1 103.43655 149.10631] CT
0.302 GC
N
f-1586420743
f
GR
GS
[1.00215 0 0 1 96.6964 192.52904] CT
0.302 GC
N
f-1586420743
f
GR
GS
[1.00215 0 0 1 95.86511 94.49298] CT
0.302 GC
N
f-1586420743
f
GR
GS
[1.00215 0 0 1 96.99891 55.29948] CT
0.302 GC
N
f-1586420743
f
GR
GS
[1.00215 0 0 1 100.30897 135.70215] CT
0.302 GC
N
f-1586420743
f
GR
GS
[1.00215 0 0 1 92.04505 152.84398] CT
0.302 GC
N
f-1586420743
f
GR
GS
[1.00215 0 0 1 94.42845 164.52808] CT
0.302 GC
N
f-1586420743
f
GR
GS
[1.00215 0 0 1 104.25631 137.14091] CT
0.302 GC
N
f-1586420743
f
GR
GS
[1.00215 0 0 1 93.14477 212.81926] CT
0.302 GC
N
f-1586420743
f
GR
GS
[1.00215 0 0 1 93.96286 193.66451] CT
0.302 GC
N
f-1586420743
f
GR
GS
[1.00215 0 0 1 103.06918 144.34579] CT
0.302 GC
N
f-1586420743
f
GR
GS
[1.00215 0 0 1 93.71492 196.82079] CT
0.302 GC
N
f-1586420743
f
GR
GS
[1.00215 0 0 1 106.03753 163.36017] CT
0.302 GC
N
f-1586420743
f
GR
GS
[1.00215 0 0 1 87.39746 226.67104] CT
0.302 GC
N
f-1586420743
f
GR
GS
[1.00215 0 0 1 104.56076 175.70319] CT
0.302 GC
N
f-1586420743
f
GR
GS
[1.00215 0 0 1 88.44812 201.60139] CT
0.302 GC
N
f-1586420743
f
GR
GS
[1.00215 0 0 1 88.90583 164.43405] CT
0.302 GC
N
f-1586420743
f
GR
GS
[1.00215 0 0 1 97.32889 201.75824] CT
0.302 GC
N
f-1586420743
f
GR
GS
[1.00215 0 0 1 93.95703 164.19131] CT
0.302 GC
N
f-1586420743
f
GR
GS
[1.00215 0 0 1 104.69329 199.09512] CT
0.302 GC
N
f-1586420743
f
GR
GS
[1.00215 0 0 1 90.75703 109.32108] CT
0.302 GC
N
f-1586420743
f
GR
GS
[1.00215 0 0 1 101.14925 55.29948] CT
0.302 GC
N
f-1586420743
f
GR
GS
[1.00215 0 0 1 95.71109 59.90322] CT
0.302 GC
N
f-1586420743
f
GR
GS
[1.00215 0 0 1 103.31312 160.57138] CT
0.302 GC
N
f-1586420743
f
GR
GS
[1.00215 0 0 1 0 0] CT
1 0.6 0.6 RC
N
/f-973082770{162.48 214.086 M
162.48 160.472 L
124.72 160.472 L
124.72 214.086 L
cp}def
f-973082770
f
GR
GS
[1.00215 0 0 1 150.14422 186.00812] CT
0.302 GC
N
f-1586420743
f
GR
GS
[1.00215 0 0 1 150.88334 212.22034] CT
0.302 GC
N
f-1586420743
f
GR
GS
[1.00215 0 0 1 139.60699 121.61066] CT
0.302 GC
N
f-1586420743
f
GR
GS
[1.00215 0 0 1 150.3324 166.77946] CT
0.302 GC
N
f-1586420743
f
GR
GS
[1.00215 0 0 1 141.42302 56.14147] CT
0.302 GC
N
f-1586420743
f
GR
GS
[1.00215 0 0 1 139.30764 197.93651] CT
0.302 GC
N
f-1586420743
f
GR
GS
[1.00215 0 0 1 136.14694 96.77259] CT
0.302 GC
N
f-1586420743
f
GR
GS
[1.00215 0 0 1 153.11737 129.717] CT
0.302 GC
N
f-1586420743
f
GR
GS
[1.00215 0 0 1 150.22553 222.15315] CT
0.302 GC
N
f-1586420743
f
GR
GS
[1.00215 0 0 1 148.72068 163.71895] CT
0.302 GC
N
f-1586420743
f
GR
GS
[1.00215 0 0 1 134.89464 195.3896] CT
0.302 GC
N
f-1586420743
f
GR
GS
[1.00215 0 0 1 139.29411 75.05531] CT
0.302 GC
N
f-1586420743
f
GR
GS
[1.00215 0 0 1 151.5111 184.56468] CT
0.302 GC
N
f-1586420743
f
GR
GS
[1.00215 0 0 1 152.59592 143.79291] CT
0.302 GC
N
f-1586420743
f
GR
GS
[1.00215 0 0 1 140.10652 228] CT
0.302 GC
N
f-1586420743
f
GR
GS
[1.00215 0 0 1 138.27247 206.7366] CT
0.302 GC
N
f-1586420743
f
GR
GS
[1.00215 0 0 1 145.345 157.18677] CT
0.302 GC
N
f-1586420743
f
GR
GS
[1.00215 0 0 1 142.49866 215.13403] CT
0.302 GC
N
f-1586420743
f
GR
GS
[1.00215 0 0 1 150.98601 216.52344] CT
0.302 GC
N
f-1586420743
f
GR
GS
[1.00215 0 0 1 139.15581 165.79189] CT
0.302 GC
N
f-1586420743
f
GR
GS
[1.00215 0 0 1 143.86356 154.89452] CT
0.302 GC
N
f-1586420743
f
GR
GS
[1.00215 0 0 1 149.3905 198.20776] CT
0.302 GC
N
f-1586420743
f
GR
GS
[1.00215 0 0 1 151.15473 175.04503] CT
0.302 GC
N
f-1586420743
f
GR
GS
[1.00215 0 0 1 135.84375 77.50448] CT
0.302 GC
N
f-1586420743
f
GR
GS
[1.00215 0 0 1 136.88441 222.04735] CT
0.302 GC
N
f-1586420743
f
GR
GS
[1.00215 0 0 1 149.7821 98.81582] CT
0.302 GC
N
f-1586420743
f
GR
GS
[1.00215 0 0 1 145.29036 174.44267] CT
0.302 GC
N
f-1586420743
f
GR
GS
[1.00215 0 0 1 143.9205 137.3949] CT
0.302 GC
N
f-1586420743
f
GR
GS
[1.00215 0 0 1 149.08482 70.21244] CT
0.302 GC
N
f-1586420743
f
GR
GS
[1.00215 0 0 1 139.40939 190.5811] CT
0.302 GC
N
f-1586420743
f
GR
GS
[1.00215 0 0 1 136.23835 173.21025] CT
0.302 GC
N
f-1586420743
f
GR
GS
[1.00215 0 0 1 146.52287 90.46882] CT
0.302 GC
N
f-1586420743
f
GR
GS
[1.00215 0 0 1 147.84452 128.4335] CT
0.302 GC
N
f-1586420743
f
GR
GS
[1.00215 0 0 1 151.79323 111.05923] CT
0.302 GC
N
f-1586420743
f
GR
GS
[1.00215 0 0 1 144.84508 175.06689] CT
0.302 GC
N
f-1586420743
f
GR
GS
[1.00215 0 0 1 137.52168 194.85184] CT
0.302 GC
N
f-1586420743
f
GR
GS
[1.00215 0 0 1 141.85332 144.33109] CT
0.302 GC
N
f-1586420743
f
GR
GS
[1.00215 0 0 1 136.43817 141.28899] CT
0.302 GC
N
f-1586420743
f
GR
GS
[1.00215 0 0 1 135.56181 204.4646] CT
0.302 GC
N
f-1586420743
f
GR
GS
[1.00215 0 0 1 146.07882 115.23624] CT
0.302 GC
N
f-1586420743
f
GR
GS
[1.00215 0 0 1 139.0561 118.47998] CT
0.302 GC
N
f-1586420743
f
GR
GS
[1.00215 0 0 1 146.18447 185.47971] CT
0.302 GC
N
f-1586420743
f
GR
GS
[1.00215 0 0 1 144.19908 212.57449] CT
0.302 GC
N
f-1586420743
f
GR
GS
[1.00215 0 0 1 136.93773 56.14147] CT
0.302 GC
N
f-1586420743
f
GR
GS
[1.00215 0 0 1 140.30056 187.50369] CT
0.302 GC
N
f-1586420743
f
GR
GS
[1.00215 0 0 1 147.15134 172.48457] CT
0.302 GC
N
f-1586420743
f
GR
GS
[1.00215 0 0 1 151.19449 143.97034] CT
0.302 GC
N
f-1586420743
f
GR
GS
[1.00215 0 0 1 136.58951 189.37209] CT
0.302 GC
N
f-1586420743
f
GR
GS
[1.00215 0 0 1 137.8358 196.65054] CT
0.302 GC
N
f-1586420743
f
GR
GS
[1.00215 0 0 1 135.8799 184.44377] CT
0.302 GC
N
f-1586420743
f
GR
GS
[1.00215 0 0 1 138.54161 179.76413] CT
0.302 GC
N
f-1586420743
f
GR
GS
[1.00215 0 0 1 136.98897 192.73811] CT
0.302 GC
N
f-1586420743
f
GR
GS
[1.00215 0 0 1 139.63828 166.633] CT
0.302 GC
N
f-1586420743
f
GR
%%Trailer
%%Pages: 1
%%EOF
