%!PS-Adobe-3.0 EPSF-3.0
%%Creator: (MATLAB, The Mathworks, Inc. Version 9.8.0.1323502 \(R2020a\). Operating System: Mac OS X)
%%Title: /Users/kosciessa/Desktop/mntTardisLNDG/LNDG/stateswitch/stsw_multimodal/figures/l1byage/l1comp_betathresh.eps
%%CreationDate: 2022-03-02T14:36:46
%%Pages: (atend)
%%BoundingBox:     4     0   180   275
%%LanguageLevel: 3
%%EndComments
%%BeginProlog
%%BeginResource: procset (Apache XML Graphics Std ProcSet) 1.2 0
%%Version: 1.2 0
%%Copyright: (Copyright 2001-2003,2010 The Apache Software Foundation. License terms: http://www.apache.org/licenses/LICENSE-2.0)
/bd{bind def}bind def
/ld{load def}bd
/GR/grestore ld
/GS/gsave ld
/RM/rmoveto ld
/C/curveto ld
/t/show ld
/L/lineto ld
/ML/setmiterlimit ld
/CT/concat ld
/f/fill ld
/N/newpath ld
/S/stroke ld
/CC/setcmykcolor ld
/A/ashow ld
/cp/closepath ld
/RC/setrgbcolor ld
/LJ/setlinejoin ld
/GC/setgray ld
/LW/setlinewidth ld
/M/moveto ld
/re {4 2 roll M
1 index 0 rlineto
0 exch rlineto
neg 0 rlineto
cp } bd
/_ctm matrix def
/_tm matrix def
/BT { _ctm currentmatrix pop matrix _tm copy pop 0 0 moveto } bd
/ET { _ctm setmatrix } bd
/iTm { _ctm setmatrix _tm concat } bd
/Tm { _tm astore pop iTm 0 0 moveto } bd
/ux 0.0 def
/uy 0.0 def
/F {
  /Tp exch def
  /Tf exch def
  Tf findfont Tp scalefont setfont
  /cf Tf def  /cs Tp def
} bd
/ULS {currentpoint /uy exch def /ux exch def} bd
/ULE {
  /Tcx currentpoint pop def
  gsave
  newpath
  cf findfont cs scalefont dup
  /FontMatrix get 0 get /Ts exch def /FontInfo get dup
  /UnderlinePosition get Ts mul /To exch def
  /UnderlineThickness get Ts mul /Tt exch def
  ux uy To add moveto  Tcx uy To add lineto
  Tt setlinewidth stroke
  grestore
} bd
/OLE {
  /Tcx currentpoint pop def
  gsave
  newpath
  cf findfont cs scalefont dup
  /FontMatrix get 0 get /Ts exch def /FontInfo get dup
  /UnderlinePosition get Ts mul /To exch def
  /UnderlineThickness get Ts mul /Tt exch def
  ux uy To add cs add moveto Tcx uy To add cs add lineto
  Tt setlinewidth stroke
  grestore
} bd
/SOE {
  /Tcx currentpoint pop def
  gsave
  newpath
  cf findfont cs scalefont dup
  /FontMatrix get 0 get /Ts exch def /FontInfo get dup
  /UnderlinePosition get Ts mul /To exch def
  /UnderlineThickness get Ts mul /Tt exch def
  ux uy To add cs 10 mul 26 idiv add moveto Tcx uy To add cs 10 mul 26 idiv add lineto
  Tt setlinewidth stroke
  grestore
} bd
/QT {
/Y22 exch store
/X22 exch store
/Y21 exch store
/X21 exch store
currentpoint
/Y21 load 2 mul add 3 div exch
/X21 load 2 mul add 3 div exch
/X21 load 2 mul /X22 load add 3 div
/Y21 load 2 mul /Y22 load add 3 div
/X22 load /Y22 load curveto
} bd
/SSPD {
dup length /d exch dict def
{
/v exch def
/k exch def
currentpagedevice k known {
/cpdv currentpagedevice k get def
v cpdv ne {
/upd false def
/nullv v type /nulltype eq def
/nullcpdv cpdv type /nulltype eq def
nullv nullcpdv or
{
/upd true def
} {
/sametype v type cpdv type eq def
sametype {
v type /arraytype eq {
/vlen v length def
/cpdvlen cpdv length def
vlen cpdvlen eq {
0 1 vlen 1 sub {
/i exch def
/obj v i get def
/cpdobj cpdv i get def
obj cpdobj ne {
/upd true def
exit
} if
} for
} {
/upd true def
} ifelse
} {
v type /dicttype eq {
v {
/dv exch def
/dk exch def
/cpddv cpdv dk get def
dv cpddv ne {
/upd true def
exit
} if
} forall
} {
/upd true def
} ifelse
} ifelse
} if
} ifelse
upd true eq {
d k v put
} if
} if
} if
} forall
d length 0 gt {
d setpagedevice
} if
} bd
/RE { % /NewFontName [NewEncodingArray] /FontName RE -
  findfont dup length dict begin
  {
    1 index /FID ne
    {def} {pop pop} ifelse
  } forall
  /Encoding exch def
  /FontName 1 index def
  currentdict definefont pop
  end
} bind def
%%EndResource
%%BeginResource: procset (Apache XML Graphics EPS ProcSet) 1.0 0
%%Version: 1.0 0
%%Copyright: (Copyright 2002-2003 The Apache Software Foundation. License terms: http://www.apache.org/licenses/LICENSE-2.0)
/BeginEPSF { %def
/b4_Inc_state save def         % Save state for cleanup
/dict_count countdictstack def % Count objects on dict stack
/op_count count 1 sub def      % Count objects on operand stack
userdict begin                 % Push userdict on dict stack
/showpage { } def              % Redefine showpage, { } = null proc
0 setgray 0 setlinecap         % Prepare graphics state
1 setlinewidth 0 setlinejoin
10 setmiterlimit [ ] 0 setdash newpath
/languagelevel where           % If level not equal to 1 then
{pop languagelevel             % set strokeadjust and
1 ne                           % overprint to their defaults.
{false setstrokeadjust false setoverprint
} if
} if
} bd
/EndEPSF { %def
count op_count sub {pop} repeat            % Clean up stacks
countdictstack dict_count sub {end} repeat
b4_Inc_state restore
} bd
%%EndResource
%FOPBeginFontDict
%%IncludeResource: font Courier-Oblique
%%IncludeResource: font Courier-BoldOblique
%%IncludeResource: font Courier-Bold
%%IncludeResource: font ZapfDingbats
%%IncludeResource: font Symbol
%%IncludeResource: font Helvetica
%%IncludeResource: font Helvetica-Oblique
%%IncludeResource: font Helvetica-Bold
%%IncludeResource: font Helvetica-BoldOblique
%%IncludeResource: font Times-Roman
%%IncludeResource: font Times-Italic
%%IncludeResource: font Times-Bold
%%IncludeResource: font Times-BoldItalic
%%IncludeResource: font Courier
%FOPEndFontDict
%%BeginResource: encoding WinAnsiEncoding
/WinAnsiEncoding [
/.notdef /.notdef /.notdef /.notdef /.notdef
/.notdef /.notdef /.notdef /.notdef /.notdef
/.notdef /.notdef /.notdef /.notdef /.notdef
/.notdef /.notdef /.notdef /.notdef /.notdef
/.notdef /.notdef /.notdef /.notdef /.notdef
/.notdef /.notdef /.notdef /.notdef /.notdef
/.notdef /.notdef /space /exclam /quotedbl
/numbersign /dollar /percent /ampersand /quotesingle
/parenleft /parenright /asterisk /plus /comma
/hyphen /period /slash /zero /one
/two /three /four /five /six
/seven /eight /nine /colon /semicolon
/less /equal /greater /question /at
/A /B /C /D /E
/F /G /H /I /J
/K /L /M /N /O
/P /Q /R /S /T
/U /V /W /X /Y
/Z /bracketleft /backslash /bracketright /asciicircum
/underscore /quoteleft /a /b /c
/d /e /f /g /h
/i /j /k /l /m
/n /o /p /q /r
/s /t /u /v /w
/x /y /z /braceleft /bar
/braceright /asciitilde /bullet /Euro /bullet
/quotesinglbase /florin /quotedblbase /ellipsis /dagger
/daggerdbl /circumflex /perthousand /Scaron /guilsinglleft
/OE /bullet /Zcaron /bullet /bullet
/quoteleft /quoteright /quotedblleft /quotedblright /bullet
/endash /emdash /asciitilde /trademark /scaron
/guilsinglright /oe /bullet /zcaron /Ydieresis
/space /exclamdown /cent /sterling /currency
/yen /brokenbar /section /dieresis /copyright
/ordfeminine /guillemotleft /logicalnot /sfthyphen /registered
/macron /degree /plusminus /twosuperior /threesuperior
/acute /mu /paragraph /middot /cedilla
/onesuperior /ordmasculine /guillemotright /onequarter /onehalf
/threequarters /questiondown /Agrave /Aacute /Acircumflex
/Atilde /Adieresis /Aring /AE /Ccedilla
/Egrave /Eacute /Ecircumflex /Edieresis /Igrave
/Iacute /Icircumflex /Idieresis /Eth /Ntilde
/Ograve /Oacute /Ocircumflex /Otilde /Odieresis
/multiply /Oslash /Ugrave /Uacute /Ucircumflex
/Udieresis /Yacute /Thorn /germandbls /agrave
/aacute /acircumflex /atilde /adieresis /aring
/ae /ccedilla /egrave /eacute /ecircumflex
/edieresis /igrave /iacute /icircumflex /idieresis
/eth /ntilde /ograve /oacute /ocircumflex
/otilde /odieresis /divide /oslash /ugrave
/uacute /ucircumflex /udieresis /yacute /thorn
/ydieresis
] def
%%EndResource
%FOPBeginFontReencode
/Courier-Oblique findfont
dup length dict begin
  {1 index /FID ne {def} {pop pop} ifelse} forall
  /Encoding WinAnsiEncoding def
  currentdict
end
/Courier-Oblique exch definefont pop
/Courier-BoldOblique findfont
dup length dict begin
  {1 index /FID ne {def} {pop pop} ifelse} forall
  /Encoding WinAnsiEncoding def
  currentdict
end
/Courier-BoldOblique exch definefont pop
/Courier-Bold findfont
dup length dict begin
  {1 index /FID ne {def} {pop pop} ifelse} forall
  /Encoding WinAnsiEncoding def
  currentdict
end
/Courier-Bold exch definefont pop
/Helvetica findfont
dup length dict begin
  {1 index /FID ne {def} {pop pop} ifelse} forall
  /Encoding WinAnsiEncoding def
  currentdict
end
/Helvetica exch definefont pop
/Helvetica-Oblique findfont
dup length dict begin
  {1 index /FID ne {def} {pop pop} ifelse} forall
  /Encoding WinAnsiEncoding def
  currentdict
end
/Helvetica-Oblique exch definefont pop
/Helvetica-Bold findfont
dup length dict begin
  {1 index /FID ne {def} {pop pop} ifelse} forall
  /Encoding WinAnsiEncoding def
  currentdict
end
/Helvetica-Bold exch definefont pop
/Helvetica-BoldOblique findfont
dup length dict begin
  {1 index /FID ne {def} {pop pop} ifelse} forall
  /Encoding WinAnsiEncoding def
  currentdict
end
/Helvetica-BoldOblique exch definefont pop
/Times-Roman findfont
dup length dict begin
  {1 index /FID ne {def} {pop pop} ifelse} forall
  /Encoding WinAnsiEncoding def
  currentdict
end
/Times-Roman exch definefont pop
/Times-Italic findfont
dup length dict begin
  {1 index /FID ne {def} {pop pop} ifelse} forall
  /Encoding WinAnsiEncoding def
  currentdict
end
/Times-Italic exch definefont pop
/Times-Bold findfont
dup length dict begin
  {1 index /FID ne {def} {pop pop} ifelse} forall
  /Encoding WinAnsiEncoding def
  currentdict
end
/Times-Bold exch definefont pop
/Times-BoldItalic findfont
dup length dict begin
  {1 index /FID ne {def} {pop pop} ifelse} forall
  /Encoding WinAnsiEncoding def
  currentdict
end
/Times-BoldItalic exch definefont pop
/Courier findfont
dup length dict begin
  {1 index /FID ne {def} {pop pop} ifelse} forall
  /Encoding WinAnsiEncoding def
  currentdict
end
/Courier exch definefont pop
%FOPEndFontReencode
%%EndProlog
%%Page: 1 1
%%PageBoundingBox: 0 0 198 283
%%BeginPageSetup
[1 0 0 -1 0 283] CT
%%EndPageSetup
GS
[1.00215 0 0 1 0 0] CT
1 GC
N
0 0 198 283 re
f
GR
GS
[1.00215 0 0 1 0 0] CT
1 GC
N
0 0 198 283 re
f
GR
GS
[1.00215 0 0 1 0 0] CT
1 GC
N
69 228 M
179 228 L
179 32 L
69 32 L
cp
f
GR
GS
[1.00215 0 0 1 0 0] CT
0.149 GC
2 setlinecap
1 LJ
0.5 LW
N
69 228 M
179 228 L
S
GR
GS
[1.00215 0 0 1 0 0] CT
0.149 GC
2 setlinecap
1 LJ
0.5 LW
N
102 228 M
102 226.04 L
S
GR
GS
[1.00215 0 0 1 0 0] CT
0.149 GC
2 setlinecap
1 LJ
0.5 LW
N
146 228 M
146 226.04 L
S
GR
GS
[1.00215 0 0 1 102.21904 234] CT
0.149 GC
/Helvetica 20 F
GS
[1 0 0 1 0 0] CT
-13 20 moveto 
1 -1 scale
(YA) t 
GR
GR
GS
[1.00215 0 0 1 146.31353 234] CT
0.149 GC
/Helvetica 20 F
GS
[1 0 0 1 0 0] CT
-14.5 20 moveto 
1 -1 scale
(OA) t 
GR
GR
GS
[1.00215 0 0 1 124.26634 259] CT
0.149 GC
/Helvetica 20 F
GS
[1 0 0 1 0 0] CT
-49 20 moveto 
1 -1 scale
(Age Group) t 
GR
GR
GS
[1.00215 0 0 1 0 0] CT
0.149 GC
2 setlinecap
1 LJ
0.5 LW
N
69 228 M
69 32 L
S
GR
GS
[1.00215 0 0 1 0 0] CT
0.149 GC
2 setlinecap
1 LJ
0.5 LW
N
69 228 M
70.96 228 L
S
GR
GS
[1.00215 0 0 1 0 0] CT
0.149 GC
2 setlinecap
1 LJ
0.5 LW
N
69 188.8 M
70.96 188.8 L
S
GR
GS
[1.00215 0 0 1 0 0] CT
0.149 GC
2 setlinecap
1 LJ
0.5 LW
N
69 149.6 M
70.96 149.6 L
S
GR
GS
[1.00215 0 0 1 0 0] CT
0.149 GC
2 setlinecap
1 LJ
0.5 LW
N
69 110.4 M
70.96 110.4 L
S
GR
GS
[1.00215 0 0 1 0 0] CT
0.149 GC
2 setlinecap
1 LJ
0.5 LW
N
69 71.2 M
70.96 71.2 L
S
GR
GS
[1.00215 0 0 1 63.13529 228] CT
0.149 GC
/Helvetica 20 F
GS
[1 0 0 1 0 0] CT
-36 7.5 moveto 
1 -1 scale
(-0.8) t 
GR
GR
GS
[1.00215 0 0 1 63.13529 188.8] CT
0.149 GC
/Helvetica 20 F
GS
[1 0 0 1 0 0] CT
-36 7.5 moveto 
1 -1 scale
(-0.6) t 
GR
GR
GS
[1.00215 0 0 1 63.13529 149.60001] CT
0.149 GC
/Helvetica 20 F
GS
[1 0 0 1 0 0] CT
-36 7.5 moveto 
1 -1 scale
(-0.4) t 
GR
GR
GS
[1.00215 0 0 1 63.13529 110.4] CT
0.149 GC
/Helvetica 20 F
GS
[1 0 0 1 0 0] CT
-36 7.5 moveto 
1 -1 scale
(-0.2) t 
GR
GR
GS
[1.00215 0 0 1 63.13529 71.2] CT
0.149 GC
/Helvetica 20 F
GS
[1 0 0 1 0 0] CT
-12 7.5 moveto 
1 -1 scale
(0) t 
GR
GR
GS
[0 -1 1.00215 0 24.05154 129.99991] CT
0.149 GC
/Helvetica 20 F
GS
[1 0 0 1 0 0] CT
-58.5 -5 moveto 
1 -1 scale
(betathresh l1) t 
GR
GR
GS
[1.00215 0 0 1 124.26641 29.25] CT
/Helvetica-Bold 22 F
GS
[1 0 0 1 0 0] CT
-58 -5 moveto 
1 -1 scale
(p = 1.0e-04) t 
GR
GR
GS
[1.00215 0 0 1 0 0] CT
0.149 GC
1 LJ
0.5 LW
N
69 71.2 M
179 71.2 L
S
GR
GS
[1.00215 0 0 1 0 0] CT
0.6 0.8 1 RC
N
84.4 71.2 M
84.4 93.946 L
119.6 93.946 L
119.6 71.2 L
cp
f
GR
GS
[1.00215 0 0 1 98.96852 97.35979] CT
0.302 GC
N
2.236 0 M
2.236 -1.235 1.235 -2.236 0 -2.236 C
-1.235 -2.236 -2.236 -1.235 -2.236 0 C
-2.236 1.235 -1.235 2.236 0 2.236 C
1.235 2.236 2.236 1.235 2.236 0 C
cp
f
GR
GS
[1.00215 0 0 1 97.23004 49.86626] CT
0.302 GC
N
/f-1586420743{2.236 0 M
2.236 -1.235 1.235 -2.236 0 -2.236 C
-1.235 -2.236 -2.236 -1.235 -2.236 0 C
-2.236 1.235 -1.235 2.236 0 2.236 C
1.235 2.236 2.236 1.235 2.236 0 C
cp}def
f-1586420743
f
GR
GS
[1.00215 0 0 1 93.64647 96.37935] CT
0.302 GC
N
f-1586420743
f
GR
GS
[1.00215 0 0 1 108.82795 72.86485] CT
0.302 GC
N
f-1586420743
f
GR
GS
[1.00215 0 0 1 107.62564 105.08504] CT
0.302 GC
N
f-1586420743
f
GR
GS
[1.00215 0 0 1 108.70882 117.47902] CT
0.302 GC
N
f-1586420743
f
GR
GS
[1.00215 0 0 1 98.19277 101.43732] CT
0.302 GC
N
f-1586420743
f
GR
GS
[1.00215 0 0 1 97.9143 49.14884] CT
0.302 GC
N
f-1586420743
f
GR
GS
[1.00215 0 0 1 97.26462 60.38126] CT
0.302 GC
N
f-1586420743
f
GR
GS
[1.00215 0 0 1 100.82672 52.39722] CT
0.302 GC
N
f-1586420743
f
GR
GS
[1.00215 0 0 1 100.91087 155.17809] CT
0.302 GC
N
f-1586420743
f
GR
GS
[1.00215 0 0 1 94.4184 59.92227] CT
0.302 GC
N
f-1586420743
f
GR
GS
[1.00215 0 0 1 97.12089 73.55228] CT
0.302 GC
N
f-1586420743
f
GR
GS
[1.00215 0 0 1 98.11209 92.83614] CT
0.302 GC
N
f-1586420743
f
GR
GS
[1.00215 0 0 1 96.86858 180.60085] CT
0.302 GC
N
f-1586420743
f
GR
GS
[1.00215 0 0 1 96.33877 119.99039] CT
0.302 GC
N
f-1586420743
f
GR
GS
[1.00215 0 0 1 98.79032 64.74239] CT
0.302 GC
N
f-1586420743
f
GR
GS
[1.00215 0 0 1 104.26182 61.18734] CT
0.302 GC
N
f-1586420743
f
GR
GS
[1.00215 0 0 1 94.54375 114.83965] CT
0.302 GC
N
f-1586420743
f
GR
GS
[1.00215 0 0 1 95.54637 112.92817] CT
0.302 GC
N
f-1586420743
f
GR
GS
[1.00215 0 0 1 98.92026 116.42049] CT
0.302 GC
N
f-1586420743
f
GR
GS
[1.00215 0 0 1 96.48001 69.93317] CT
0.302 GC
N
f-1586420743
f
GR
GS
[1.00215 0 0 1 101.993 65.31543] CT
0.302 GC
N
f-1586420743
f
GR
GS
[1.00215 0 0 1 106.51328 99.48722] CT
0.302 GC
N
f-1586420743
f
GR
GS
[1.00215 0 0 1 102.06 80.80354] CT
0.302 GC
N
f-1586420743
f
GR
GS
[1.00215 0 0 1 98.14697 147.11424] CT
0.302 GC
N
f-1586420743
f
GR
GS
[1.00215 0 0 1 95.02983 102.46097] CT
0.302 GC
N
f-1586420743
f
GR
GS
[1.00215 0 0 1 109.98192 83.90996] CT
0.302 GC
N
f-1586420743
f
GR
GS
[1.00215 0 0 1 108.87594 95.11479] CT
0.302 GC
N
f-1586420743
f
GR
GS
[1.00215 0 0 1 95.43874 139.48787] CT
0.302 GC
N
f-1586420743
f
GR
GS
[1.00215 0 0 1 96.12345 111.43523] CT
0.302 GC
N
f-1586420743
f
GR
GS
[1.00215 0 0 1 99.28347 114.82619] CT
0.302 GC
N
f-1586420743
f
GR
GS
[1.00215 0 0 1 97.7525 63.28283] CT
0.302 GC
N
f-1586420743
f
GR
GS
[1.00215 0 0 1 94.6795 165.99017] CT
0.302 GC
N
f-1586420743
f
GR
GS
[1.00215 0 0 1 108.19774 42.38915] CT
0.302 GC
N
f-1586420743
f
GR
GS
[1.00215 0 0 1 102.33159 67.90617] CT
0.302 GC
N
f-1586420743
f
GR
GS
[1.00215 0 0 1 94.00086 151.25816] CT
0.302 GC
N
f-1586420743
f
GR
GS
[1.00215 0 0 1 99.8857 84.15335] CT
0.302 GC
N
f-1586420743
f
GR
GS
[1.00215 0 0 1 94.54503 55.82312] CT
0.302 GC
N
f-1586420743
f
GR
GS
[1.00215 0 0 1 105.77862 38.08625] CT
0.302 GC
N
f-1586420743
f
GR
GS
[1.00215 0 0 1 101.96413 173.60497] CT
0.302 GC
N
f-1586420743
f
GR
GS
[1.00215 0 0 1 101.81276 38.73558] CT
0.302 GC
N
f-1586420743
f
GR
GS
[1.00215 0 0 1 0 0] CT
0.6 0.8 1 RC
N
/f-206815158{128.4 71.2 M
128.4 127.938 L
163.6 127.938 L
163.6 71.2 L
cp}def
f-206815158
f
GR
GS
[1.00215 0 0 1 141.78745 187.89449] CT
0.302 GC
N
f-1586420743
f
GR
GS
[1.00215 0 0 1 138.52193 71.72215] CT
0.302 GC
N
f-1586420743
f
GR
GS
[1.00215 0 0 1 151.88841 163.55823] CT
0.302 GC
N
f-1586420743
f
GR
GS
[1.00215 0 0 1 140.45569 98.68076] CT
0.302 GC
N
f-1586420743
f
GR
GS
[1.00215 0 0 1 149.73038 87.37543] CT
0.302 GC
N
f-1586420743
f
GR
GS
[1.00215 0 0 1 138.65064 139.65305] CT
0.302 GC
N
f-1586420743
f
GR
GS
[1.00215 0 0 1 141.70573 129.30734] CT
0.302 GC
N
f-1586420743
f
GR
GS
[1.00215 0 0 1 145.04741 148.52438] CT
0.302 GC
N
f-1586420743
f
GR
GS
[1.00215 0 0 1 142.85766 165.00093] CT
0.302 GC
N
f-1586420743
f
GR
GS
[1.00215 0 0 1 153.68766 178.86206] CT
0.302 GC
N
f-1586420743
f
GR
GS
[1.00215 0 0 1 154.53125 61.32596] CT
0.302 GC
N
f-1586420743
f
GR
GS
[1.00215 0 0 1 137.65876 152.58784] CT
0.302 GC
N
f-1586420743
f
GR
GS
[1.00215 0 0 1 138.91407 141.88313] CT
0.302 GC
N
f-1586420743
f
GR
GS
[1.00215 0 0 1 152.3557 176.7355] CT
0.302 GC
N
f-1586420743
f
GR
GS
[1.00215 0 0 1 145.86965 89.60644] CT
0.302 GC
N
f-1586420743
f
GR
GS
[1.00215 0 0 1 138.15777 95.77034] CT
0.302 GC
N
f-1586420743
f
GR
GS
[1.00215 0 0 1 153.16403 151.52858] CT
0.302 GC
N
f-1586420743
f
GR
GS
[1.00215 0 0 1 139.59291 170.90558] CT
0.302 GC
N
f-1586420743
f
GR
GS
[1.00215 0 0 1 142.49265 95.07137] CT
0.302 GC
N
f-1586420743
f
GR
GS
[1.00215 0 0 1 148.61473 184.18756] CT
0.302 GC
N
f-1586420743
f
GR
GS
[1.00215 0 0 1 149.17 98.97762] CT
0.302 GC
N
f-1586420743
f
GR
GS
[1.00215 0 0 1 140.35683 147.13977] CT
0.302 GC
N
f-1586420743
f
GR
GS
[1.00215 0 0 1 150.90837 160.59433] CT
0.302 GC
N
f-1586420743
f
GR
GS
[1.00215 0 0 1 138.53735 162.12645] CT
0.302 GC
N
f-1586420743
f
GR
GS
[1.00215 0 0 1 142.18555 143.41541] CT
0.302 GC
N
f-1586420743
f
GR
GS
[1.00215 0 0 1 148.8489 152.55695] CT
0.302 GC
N
f-1586420743
f
GR
GS
[1.00215 0 0 1 151.59502 107.08872] CT
0.302 GC
N
f-1586420743
f
GR
GS
[1.00215 0 0 1 143.66311 84.53745] CT
0.302 GC
N
f-1586420743
f
GR
GS
[1.00215 0 0 1 147.42855 160.59702] CT
0.302 GC
N
f-1586420743
f
GR
GS
[1.00215 0 0 1 146.91701 203.01494] CT
0.302 GC
N
f-1586420743
f
GR
GS
[1.00215 0 0 1 139.83907 141.22433] CT
0.302 GC
N
f-1586420743
f
GR
GS
[1.00215 0 0 1 137.99586 114.59222] CT
0.302 GC
N
f-1586420743
f
GR
GS
[1.00215 0 0 1 148.31835 145.61458] CT
0.302 GC
N
f-1586420743
f
GR
GS
[1.00215 0 0 1 144.82967 179.48618] CT
0.302 GC
N
f-1586420743
f
GR
GS
[1.00215 0 0 1 138.68141 42.20675] CT
0.302 GC
N
f-1586420743
f
GR
GS
[1.00215 0 0 1 146.04683 72.62592] CT
0.302 GC
N
f-1586420743
f
GR
GS
[1.00215 0 0 1 142.68081 194.62271] CT
0.302 GC
N
f-1586420743
f
GR
GS
[1.00215 0 0 1 143.25625 53.70969] CT
0.302 GC
N
f-1586420743
f
GR
GS
[1.00215 0 0 1 149.85752 64.35502] CT
0.302 GC
N
f-1586420743
f
GR
GS
[1.00215 0 0 1 138.25233 133.78539] CT
0.302 GC
N
f-1586420743
f
GR
GS
[1.00215 0 0 1 149.71682 98.67179] CT
0.302 GC
N
f-1586420743
f
GR
GS
[1.00215 0 0 1 143.98122 145.86153] CT
0.302 GC
N
f-1586420743
f
GR
GS
[1.00215 0 0 1 138.25794 155.52486] CT
0.302 GC
N
f-1586420743
f
GR
GS
[1.00215 0 0 1 153.35581 155.33659] CT
0.302 GC
N
f-1586420743
f
GR
GS
[1.00215 0 0 1 143.23782 56.26772] CT
0.302 GC
N
f-1586420743
f
GR
GS
[1.00215 0 0 1 139.92117 82.93793] CT
0.302 GC
N
f-1586420743
f
GR
GS
[1.00215 0 0 1 147.50285 53.16968] CT
0.302 GC
N
f-1586420743
f
GR
GS
[1.00215 0 0 1 152.63577 103.5134] CT
0.302 GC
N
f-1586420743
f
GR
GS
[1.00215 0 0 1 154.69907 182.85893] CT
0.302 GC
N
f-1586420743
f
GR
GS
[1.00215 0 0 1 137.83998 156.49966] CT
0.302 GC
N
f-1586420743
f
GR
GS
[1.00215 0 0 1 143.61395 124.52954] CT
0.302 GC
N
f-1586420743
f
GR
GS
[1.00215 0 0 1 142.42344 117.51233] CT
0.302 GC
N
f-1586420743
f
GR
GS
[1.00215 0 0 1 151.19996 95.56142] CT
0.302 GC
N
f-1586420743
f
GR
%%Trailer
%%Pages: 1
%%EOF
