%!PS-Adobe-3.0 EPSF-3.0
%%Creator: (MATLAB, The Mathworks, Inc. Version 9.8.0.1323502 \(R2020a\). Operating System: Mac OS X)
%%Title: /Users/kosciessa/Desktop/mntTardisLNDG/LNDG/stateswitch/stsw_multimodal/figures/linearbyage/linearcomp_bs_behav.eps
%%CreationDate: 2022-03-03T16:32:31
%%Pages: (atend)
%%BoundingBox:     4     0   180   275
%%LanguageLevel: 3
%%EndComments
%%BeginProlog
%%BeginResource: procset (Apache XML Graphics Std ProcSet) 1.2 0
%%Version: 1.2 0
%%Copyright: (Copyright 2001-2003,2010 The Apache Software Foundation. License terms: http://www.apache.org/licenses/LICENSE-2.0)
/bd{bind def}bind def
/ld{load def}bd
/GR/grestore ld
/GS/gsave ld
/RM/rmoveto ld
/C/curveto ld
/t/show ld
/L/lineto ld
/ML/setmiterlimit ld
/CT/concat ld
/f/fill ld
/N/newpath ld
/S/stroke ld
/CC/setcmykcolor ld
/A/ashow ld
/cp/closepath ld
/RC/setrgbcolor ld
/LJ/setlinejoin ld
/GC/setgray ld
/LW/setlinewidth ld
/M/moveto ld
/re {4 2 roll M
1 index 0 rlineto
0 exch rlineto
neg 0 rlineto
cp } bd
/_ctm matrix def
/_tm matrix def
/BT { _ctm currentmatrix pop matrix _tm copy pop 0 0 moveto } bd
/ET { _ctm setmatrix } bd
/iTm { _ctm setmatrix _tm concat } bd
/Tm { _tm astore pop iTm 0 0 moveto } bd
/ux 0.0 def
/uy 0.0 def
/F {
  /Tp exch def
  /Tf exch def
  Tf findfont Tp scalefont setfont
  /cf Tf def  /cs Tp def
} bd
/ULS {currentpoint /uy exch def /ux exch def} bd
/ULE {
  /Tcx currentpoint pop def
  gsave
  newpath
  cf findfont cs scalefont dup
  /FontMatrix get 0 get /Ts exch def /FontInfo get dup
  /UnderlinePosition get Ts mul /To exch def
  /UnderlineThickness get Ts mul /Tt exch def
  ux uy To add moveto  Tcx uy To add lineto
  Tt setlinewidth stroke
  grestore
} bd
/OLE {
  /Tcx currentpoint pop def
  gsave
  newpath
  cf findfont cs scalefont dup
  /FontMatrix get 0 get /Ts exch def /FontInfo get dup
  /UnderlinePosition get Ts mul /To exch def
  /UnderlineThickness get Ts mul /Tt exch def
  ux uy To add cs add moveto Tcx uy To add cs add lineto
  Tt setlinewidth stroke
  grestore
} bd
/SOE {
  /Tcx currentpoint pop def
  gsave
  newpath
  cf findfont cs scalefont dup
  /FontMatrix get 0 get /Ts exch def /FontInfo get dup
  /UnderlinePosition get Ts mul /To exch def
  /UnderlineThickness get Ts mul /Tt exch def
  ux uy To add cs 10 mul 26 idiv add moveto Tcx uy To add cs 10 mul 26 idiv add lineto
  Tt setlinewidth stroke
  grestore
} bd
/QT {
/Y22 exch store
/X22 exch store
/Y21 exch store
/X21 exch store
currentpoint
/Y21 load 2 mul add 3 div exch
/X21 load 2 mul add 3 div exch
/X21 load 2 mul /X22 load add 3 div
/Y21 load 2 mul /Y22 load add 3 div
/X22 load /Y22 load curveto
} bd
/SSPD {
dup length /d exch dict def
{
/v exch def
/k exch def
currentpagedevice k known {
/cpdv currentpagedevice k get def
v cpdv ne {
/upd false def
/nullv v type /nulltype eq def
/nullcpdv cpdv type /nulltype eq def
nullv nullcpdv or
{
/upd true def
} {
/sametype v type cpdv type eq def
sametype {
v type /arraytype eq {
/vlen v length def
/cpdvlen cpdv length def
vlen cpdvlen eq {
0 1 vlen 1 sub {
/i exch def
/obj v i get def
/cpdobj cpdv i get def
obj cpdobj ne {
/upd true def
exit
} if
} for
} {
/upd true def
} ifelse
} {
v type /dicttype eq {
v {
/dv exch def
/dk exch def
/cpddv cpdv dk get def
dv cpddv ne {
/upd true def
exit
} if
} forall
} {
/upd true def
} ifelse
} ifelse
} if
} ifelse
upd true eq {
d k v put
} if
} if
} if
} forall
d length 0 gt {
d setpagedevice
} if
} bd
/RE { % /NewFontName [NewEncodingArray] /FontName RE -
  findfont dup length dict begin
  {
    1 index /FID ne
    {def} {pop pop} ifelse
  } forall
  /Encoding exch def
  /FontName 1 index def
  currentdict definefont pop
  end
} bind def
%%EndResource
%%BeginResource: procset (Apache XML Graphics EPS ProcSet) 1.0 0
%%Version: 1.0 0
%%Copyright: (Copyright 2002-2003 The Apache Software Foundation. License terms: http://www.apache.org/licenses/LICENSE-2.0)
/BeginEPSF { %def
/b4_Inc_state save def         % Save state for cleanup
/dict_count countdictstack def % Count objects on dict stack
/op_count count 1 sub def      % Count objects on operand stack
userdict begin                 % Push userdict on dict stack
/showpage { } def              % Redefine showpage, { } = null proc
0 setgray 0 setlinecap         % Prepare graphics state
1 setlinewidth 0 setlinejoin
10 setmiterlimit [ ] 0 setdash newpath
/languagelevel where           % If level not equal to 1 then
{pop languagelevel             % set strokeadjust and
1 ne                           % overprint to their defaults.
{false setstrokeadjust false setoverprint
} if
} if
} bd
/EndEPSF { %def
count op_count sub {pop} repeat            % Clean up stacks
countdictstack dict_count sub {end} repeat
b4_Inc_state restore
} bd
%%EndResource
%FOPBeginFontDict
%%IncludeResource: font Courier-Oblique
%%IncludeResource: font Courier-BoldOblique
%%IncludeResource: font Courier-Bold
%%IncludeResource: font ZapfDingbats
%%IncludeResource: font Symbol
%%IncludeResource: font Helvetica
%%IncludeResource: font Helvetica-Oblique
%%IncludeResource: font Helvetica-Bold
%%IncludeResource: font Helvetica-BoldOblique
%%IncludeResource: font Times-Roman
%%IncludeResource: font Times-Italic
%%IncludeResource: font Times-Bold
%%IncludeResource: font Times-BoldItalic
%%IncludeResource: font Courier
%FOPEndFontDict
%%BeginResource: encoding WinAnsiEncoding
/WinAnsiEncoding [
/.notdef /.notdef /.notdef /.notdef /.notdef
/.notdef /.notdef /.notdef /.notdef /.notdef
/.notdef /.notdef /.notdef /.notdef /.notdef
/.notdef /.notdef /.notdef /.notdef /.notdef
/.notdef /.notdef /.notdef /.notdef /.notdef
/.notdef /.notdef /.notdef /.notdef /.notdef
/.notdef /.notdef /space /exclam /quotedbl
/numbersign /dollar /percent /ampersand /quotesingle
/parenleft /parenright /asterisk /plus /comma
/hyphen /period /slash /zero /one
/two /three /four /five /six
/seven /eight /nine /colon /semicolon
/less /equal /greater /question /at
/A /B /C /D /E
/F /G /H /I /J
/K /L /M /N /O
/P /Q /R /S /T
/U /V /W /X /Y
/Z /bracketleft /backslash /bracketright /asciicircum
/underscore /quoteleft /a /b /c
/d /e /f /g /h
/i /j /k /l /m
/n /o /p /q /r
/s /t /u /v /w
/x /y /z /braceleft /bar
/braceright /asciitilde /bullet /Euro /bullet
/quotesinglbase /florin /quotedblbase /ellipsis /dagger
/daggerdbl /circumflex /perthousand /Scaron /guilsinglleft
/OE /bullet /Zcaron /bullet /bullet
/quoteleft /quoteright /quotedblleft /quotedblright /bullet
/endash /emdash /asciitilde /trademark /scaron
/guilsinglright /oe /bullet /zcaron /Ydieresis
/space /exclamdown /cent /sterling /currency
/yen /brokenbar /section /dieresis /copyright
/ordfeminine /guillemotleft /logicalnot /sfthyphen /registered
/macron /degree /plusminus /twosuperior /threesuperior
/acute /mu /paragraph /middot /cedilla
/onesuperior /ordmasculine /guillemotright /onequarter /onehalf
/threequarters /questiondown /Agrave /Aacute /Acircumflex
/Atilde /Adieresis /Aring /AE /Ccedilla
/Egrave /Eacute /Ecircumflex /Edieresis /Igrave
/Iacute /Icircumflex /Idieresis /Eth /Ntilde
/Ograve /Oacute /Ocircumflex /Otilde /Odieresis
/multiply /Oslash /Ugrave /Uacute /Ucircumflex
/Udieresis /Yacute /Thorn /germandbls /agrave
/aacute /acircumflex /atilde /adieresis /aring
/ae /ccedilla /egrave /eacute /ecircumflex
/edieresis /igrave /iacute /icircumflex /idieresis
/eth /ntilde /ograve /oacute /ocircumflex
/otilde /odieresis /divide /oslash /ugrave
/uacute /ucircumflex /udieresis /yacute /thorn
/ydieresis
] def
%%EndResource
%FOPBeginFontReencode
/Courier-Oblique findfont
dup length dict begin
  {1 index /FID ne {def} {pop pop} ifelse} forall
  /Encoding WinAnsiEncoding def
  currentdict
end
/Courier-Oblique exch definefont pop
/Courier-BoldOblique findfont
dup length dict begin
  {1 index /FID ne {def} {pop pop} ifelse} forall
  /Encoding WinAnsiEncoding def
  currentdict
end
/Courier-BoldOblique exch definefont pop
/Courier-Bold findfont
dup length dict begin
  {1 index /FID ne {def} {pop pop} ifelse} forall
  /Encoding WinAnsiEncoding def
  currentdict
end
/Courier-Bold exch definefont pop
/Helvetica findfont
dup length dict begin
  {1 index /FID ne {def} {pop pop} ifelse} forall
  /Encoding WinAnsiEncoding def
  currentdict
end
/Helvetica exch definefont pop
/Helvetica-Oblique findfont
dup length dict begin
  {1 index /FID ne {def} {pop pop} ifelse} forall
  /Encoding WinAnsiEncoding def
  currentdict
end
/Helvetica-Oblique exch definefont pop
/Helvetica-Bold findfont
dup length dict begin
  {1 index /FID ne {def} {pop pop} ifelse} forall
  /Encoding WinAnsiEncoding def
  currentdict
end
/Helvetica-Bold exch definefont pop
/Helvetica-BoldOblique findfont
dup length dict begin
  {1 index /FID ne {def} {pop pop} ifelse} forall
  /Encoding WinAnsiEncoding def
  currentdict
end
/Helvetica-BoldOblique exch definefont pop
/Times-Roman findfont
dup length dict begin
  {1 index /FID ne {def} {pop pop} ifelse} forall
  /Encoding WinAnsiEncoding def
  currentdict
end
/Times-Roman exch definefont pop
/Times-Italic findfont
dup length dict begin
  {1 index /FID ne {def} {pop pop} ifelse} forall
  /Encoding WinAnsiEncoding def
  currentdict
end
/Times-Italic exch definefont pop
/Times-Bold findfont
dup length dict begin
  {1 index /FID ne {def} {pop pop} ifelse} forall
  /Encoding WinAnsiEncoding def
  currentdict
end
/Times-Bold exch definefont pop
/Times-BoldItalic findfont
dup length dict begin
  {1 index /FID ne {def} {pop pop} ifelse} forall
  /Encoding WinAnsiEncoding def
  currentdict
end
/Times-BoldItalic exch definefont pop
/Courier findfont
dup length dict begin
  {1 index /FID ne {def} {pop pop} ifelse} forall
  /Encoding WinAnsiEncoding def
  currentdict
end
/Courier exch definefont pop
%FOPEndFontReencode
%%EndProlog
%%Page: 1 1
%%PageBoundingBox: 0 0 198 283
%%BeginPageSetup
[1 0 0 -1 0 283] CT
%%EndPageSetup
GS
[1.00215 0 0 1 0 0] CT
1 GC
N
0 0 198 283 re
f
GR
GS
[1.00215 0 0 1 0 0] CT
1 GC
N
0 0 198 283 re
f
GR
GS
[1.00215 0 0 1 0 0] CT
1 GC
N
61 228 M
179 228 L
179 32 L
61 32 L
cp
f
GR
GS
[1.00215 0 0 1 0 0] CT
0.149 GC
2 setlinecap
1 LJ
0.5 LW
N
61 228 M
179 228 L
S
GR
GS
[1.00215 0 0 1 0 0] CT
0.149 GC
2 setlinecap
1 LJ
0.5 LW
N
96.4 228 M
96.4 226.04 L
S
GR
GS
[1.00215 0 0 1 0 0] CT
0.149 GC
2 setlinecap
1 LJ
0.5 LW
N
143.6 228 M
143.6 226.04 L
S
GR
GS
[1.00215 0 0 1 96.60702 234] CT
0.149 GC
/Helvetica 20 F
GS
[1 0 0 1 0 0] CT
-13 20 moveto 
1 -1 scale
(YA) t 
GR
GR
GS
[1.00215 0 0 1 143.90838 234] CT
0.149 GC
/Helvetica 20 F
GS
[1 0 0 1 0 0] CT
-14.5 20 moveto 
1 -1 scale
(OA) t 
GR
GR
GS
[1.00215 0 0 1 120.25775 259] CT
0.149 GC
/Helvetica 20 F
GS
[1 0 0 1 0 0] CT
-49 20 moveto 
1 -1 scale
(Age Group) t 
GR
GR
GS
[1.00215 0 0 1 0 0] CT
0.149 GC
2 setlinecap
1 LJ
0.5 LW
N
61 228 M
61 32 L
S
GR
GS
[1.00215 0 0 1 0 0] CT
0.149 GC
2 setlinecap
1 LJ
0.5 LW
N
61 228 M
62.96 228 L
S
GR
GS
[1.00215 0 0 1 0 0] CT
0.149 GC
2 setlinecap
1 LJ
0.5 LW
N
61 179 M
62.96 179 L
S
GR
GS
[1.00215 0 0 1 0 0] CT
0.149 GC
2 setlinecap
1 LJ
0.5 LW
N
61 130 M
62.96 130 L
S
GR
GS
[1.00215 0 0 1 0 0] CT
0.149 GC
2 setlinecap
1 LJ
0.5 LW
N
61 81 M
62.96 81 L
S
GR
GS
[1.00215 0 0 1 0 0] CT
0.149 GC
2 setlinecap
1 LJ
0.5 LW
N
61 32 M
62.96 32 L
S
GR
GS
[1.00215 0 0 1 55.11811 228] CT
0.149 GC
/Helvetica 20 F
GS
[1 0 0 1 0 0] CT
-19 7.5 moveto 
1 -1 scale
(-2) t 
GR
GR
GS
[1.00215 0 0 1 55.11811 179] CT
0.149 GC
/Helvetica 20 F
GS
[1 0 0 1 0 0] CT
-12 7.5 moveto 
1 -1 scale
(0) t 
GR
GR
GS
[1.00215 0 0 1 55.11811 130] CT
0.149 GC
/Helvetica 20 F
GS
[1 0 0 1 0 0] CT
-12 7.5 moveto 
1 -1 scale
(2) t 
GR
GR
GS
[1.00215 0 0 1 55.11811 81] CT
0.149 GC
/Helvetica 20 F
GS
[1 0 0 1 0 0] CT
-12 7.5 moveto 
1 -1 scale
(4) t 
GR
GR
GS
[1.00215 0 0 1 55.11811 32] CT
0.149 GC
/Helvetica 20 F
GS
[1 0 0 1 0 0] CT
-12 7.5 moveto 
1 -1 scale
(6) t 
GR
GR
GS
[0 -1 1.00215 0 19.0408 195] CT
0.149 GC
/Helvetica 20 F
GS
[1 0 0 1 0 0] CT
0 0 moveto 
1 -1 scale
(bs) t 
GR
GR
GS
[0 -1 1.00215 0 29.06228 173] CT
0.149 GC
/Helvetica 16 F
GS
[1 0 0 1 0 0] CT
0 0 moveto 
1 -1 scale
(b) t 
GR
GR
GS
[0 -1 1.00215 0 19.0408 163] CT
0.149 GC
/Helvetica 20 F
GS
[1 0 0 1 0 0] CT
0 0 moveto 
1 -1 scale
(ehav linear) t 
GR
GR
GS
[1.00215 0 0 1 120.25781 29.25] CT
/Helvetica-Bold 22 F
GS
[1 0 0 1 0 0] CT
-26 -5 moveto 
1 -1 scale
(p = 0) t 
GR
GR
GS
[1.00215 0 0 1 0 0] CT
0.149 GC
1 LJ
0.5 LW
N
61 179 M
179 179 L
S
GR
GS
[1.00215 0 0 1 0 0] CT
1 0.6 0.6 RC
N
115.28 179 M
115.28 130.762 L
77.52 130.762 L
77.52 179 L
cp
f
GR
GS
[1.00215 0 0 1 101.68226 198.44441] CT
0.302 GC
N
2.236 0 M
2.236 -1.235 1.235 -2.236 0 -2.236 C
-1.235 -2.236 -2.236 -1.235 -2.236 0 C
-2.236 1.235 -1.235 2.236 0 2.236 C
1.235 2.236 2.236 1.235 2.236 0 C
cp
f
GR
GS
[1.00215 0 0 1 92.34931 92.08189] CT
0.302 GC
N
/f-1586420743{2.236 0 M
2.236 -1.235 1.235 -2.236 0 -2.236 C
-1.235 -2.236 -2.236 -1.235 -2.236 0 C
-2.236 1.235 -1.235 2.236 0 2.236 C
1.235 2.236 2.236 1.235 2.236 0 C
cp}def
f-1586420743
f
GR
GS
[1.00215 0 0 1 89.53574 141.97554] CT
0.302 GC
N
f-1586420743
f
GR
GS
[1.00215 0 0 1 97.46678 167.81061] CT
0.302 GC
N
f-1586420743
f
GR
GS
[1.00215 0 0 1 98.97015 129.70837] CT
0.302 GC
N
f-1586420743
f
GR
GS
[1.00215 0 0 1 102.35772 83.31117] CT
0.302 GC
N
f-1586420743
f
GR
GS
[1.00215 0 0 1 102.71778 109.11236] CT
0.302 GC
N
f-1586420743
f
GR
GS
[1.00215 0 0 1 99.39921 104.4554] CT
0.302 GC
N
f-1586420743
f
GR
GS
[1.00215 0 0 1 96.89309 147.8383] CT
0.302 GC
N
f-1586420743
f
GR
GS
[1.00215 0 0 1 102.07513 162.61037] CT
0.302 GC
N
f-1586420743
f
GR
GS
[1.00215 0 0 1 98.89 142.15863] CT
0.302 GC
N
f-1586420743
f
GR
GS
[1.00215 0 0 1 90.38051 154.29419] CT
0.302 GC
N
f-1586420743
f
GR
GS
[1.00215 0 0 1 87.29252 146.46388] CT
0.302 GC
N
f-1586420743
f
GR
GS
[1.00215 0 0 1 105.31931 200.59615] CT
0.302 GC
N
f-1586420743
f
GR
GS
[1.00215 0 0 1 90.19626 123.01855] CT
0.302 GC
N
f-1586420743
f
GR
GS
[1.00215 0 0 1 89.32289 129.92622] CT
0.302 GC
N
f-1586420743
f
GR
GS
[1.00215 0 0 1 100.35922 139.92258] CT
0.302 GC
N
f-1586420743
f
GR
GS
[1.00215 0 0 1 92.13888 116.35613] CT
0.302 GC
N
f-1586420743
f
GR
GS
[1.00215 0 0 1 93.48038 125.27479] CT
0.302 GC
N
f-1586420743
f
GR
GS
[1.00215 0 0 1 103.24257 76.87408] CT
0.302 GC
N
f-1586420743
f
GR
GS
[1.00215 0 0 1 105.21741 186.85294] CT
0.302 GC
N
f-1586420743
f
GR
GS
[1.00215 0 0 1 91.72062 144.46434] CT
0.302 GC
N
f-1586420743
f
GR
GS
[1.00215 0 0 1 104.48784 169.44048] CT
0.302 GC
N
f-1586420743
f
GR
GS
[1.00215 0 0 1 105.07471 81.79945] CT
0.302 GC
N
f-1586420743
f
GR
GS
[1.00215 0 0 1 96.93255 132.39545] CT
0.302 GC
N
f-1586420743
f
GR
GS
[1.00215 0 0 1 88.06119 197.78557] CT
0.302 GC
N
f-1586420743
f
GR
GS
[1.00215 0 0 1 95.48271 144.25163] CT
0.302 GC
N
f-1586420743
f
GR
GS
[1.00215 0 0 1 100.6969 78.20789] CT
0.302 GC
N
f-1586420743
f
GR
GS
[1.00215 0 0 1 98.28598 150.39619] CT
0.302 GC
N
f-1586420743
f
GR
GS
[1.00215 0 0 1 96.34384 180.74112] CT
0.302 GC
N
f-1586420743
f
GR
GS
[1.00215 0 0 1 103.631 135.48061] CT
0.302 GC
N
f-1586420743
f
GR
GS
[1.00215 0 0 1 99.47824 142.97426] CT
0.302 GC
N
f-1586420743
f
GR
GS
[1.00215 0 0 1 102.82754 62.37939] CT
0.302 GC
N
f-1586420743
f
GR
GS
[1.00215 0 0 1 88.60209 69.85366] CT
0.302 GC
N
f-1586420743
f
GR
GS
[1.00215 0 0 1 88.83128 143.87637] CT
0.302 GC
N
f-1586420743
f
GR
GS
[1.00215 0 0 1 95.14839 77.95505] CT
0.302 GC
N
f-1586420743
f
GR
GS
[1.00215 0 0 1 96.25956 83.57269] CT
0.302 GC
N
f-1586420743
f
GR
GS
[1.00215 0 0 1 87.22742 80.10628] CT
0.302 GC
N
f-1586420743
f
GR
GS
[1.00215 0 0 1 90.35743 142.3354] CT
0.302 GC
N
f-1586420743
f
GR
GS
[1.00215 0 0 1 100.98813 131.97801] CT
0.302 GC
N
f-1586420743
f
GR
GS
[1.00215 0 0 1 98.23688 138.83151] CT
0.302 GC
N
f-1586420743
f
GR
GS
[1.00215 0 0 1 96.16915 124.07135] CT
0.302 GC
N
f-1586420743
f
GR
GS
[1.00215 0 0 1 0 0] CT
1 0.6 0.6 RC
N
/f235656558{162.48 179 M
162.48 150.084 L
124.72 150.084 L
124.72 179 L
cp}def
f235656558
f
GR
GS
[1.00215 0 0 1 148.53359 172.98723] CT
0.302 GC
N
f-1586420743
f
GR
GS
[1.00215 0 0 1 144.93217 164.22253] CT
0.302 GC
N
f-1586420743
f
GR
GS
[1.00215 0 0 1 138.76305 144.28658] CT
0.302 GC
N
f-1586420743
f
GR
GS
[1.00215 0 0 1 149.0267 183.76634] CT
0.302 GC
N
f-1586420743
f
GR
GS
[1.00215 0 0 1 142.84548 126.3547] CT
0.302 GC
N
f-1586420743
f
GR
GS
[1.00215 0 0 1 147.59195 162.28799] CT
0.302 GC
N
f-1586420743
f
GR
GS
[1.00215 0 0 1 147.18162 200.13243] CT
0.302 GC
N
f-1586420743
f
GR
GS
[1.00215 0 0 1 134.70382 157.79407] CT
0.302 GC
N
f-1586420743
f
GR
GS
[1.00215 0 0 1 150.98038 198.73405] CT
0.302 GC
N
f-1586420743
f
GR
GS
[1.00215 0 0 1 150.53333 172.49411] CT
0.302 GC
N
f-1586420743
f
GR
GS
[1.00215 0 0 1 150.14188 162.82997] CT
0.302 GC
N
f-1586420743
f
GR
GS
[1.00215 0 0 1 148.82482 195.77904] CT
0.302 GC
N
f-1586420743
f
GR
GS
[1.00215 0 0 1 142.21263 157.16109] CT
0.302 GC
N
f-1586420743
f
GR
GS
[1.00215 0 0 1 147.67853 176.68817] CT
0.302 GC
N
f-1586420743
f
GR
GS
[1.00215 0 0 1 149.09059 139.60645] CT
0.302 GC
N
f-1586420743
f
GR
GS
[1.00215 0 0 1 143.2921 142.32097] CT
0.302 GC
N
f-1586420743
f
GR
GS
[1.00215 0 0 1 153.03306 124.9658] CT
0.302 GC
N
f-1586420743
f
GR
GS
[1.00215 0 0 1 138.80974 128.37523] CT
0.302 GC
N
f-1586420743
f
GR
GS
[1.00215 0 0 1 146.64453 149.74167] CT
0.302 GC
N
f-1586420743
f
GR
GS
[1.00215 0 0 1 142.61632 179.52348] CT
0.302 GC
N
f-1586420743
f
GR
GS
[1.00215 0 0 1 142.98999 121.80087] CT
0.302 GC
N
f-1586420743
f
GR
GS
[1.00215 0 0 1 134.59953 138.60394] CT
0.302 GC
N
f-1586420743
f
GR
GS
[1.00215 0 0 1 152.48686 160.2717] CT
0.302 GC
N
f-1586420743
f
GR
GS
[1.00215 0 0 1 147.34397 159.64838] CT
0.302 GC
N
f-1586420743
f
GR
GS
[1.00215 0 0 1 140.40715 132.34962] CT
0.302 GC
N
f-1586420743
f
GR
GS
[1.00215 0 0 1 141.05665 138.73111] CT
0.302 GC
N
f-1586420743
f
GR
GS
[1.00215 0 0 1 152.38745 95.70455] CT
0.302 GC
N
f-1586420743
f
GR
GS
[1.00215 0 0 1 141.81119 165.80144] CT
0.302 GC
N
f-1586420743
f
GR
GS
[1.00215 0 0 1 137.28693 153.25174] CT
0.302 GC
N
f-1586420743
f
GR
GS
[1.00215 0 0 1 149.82811 135.78413] CT
0.302 GC
N
f-1586420743
f
GR
GS
[1.00215 0 0 1 146.60673 100.14941] CT
0.302 GC
N
f-1586420743
f
GR
GS
[1.00215 0 0 1 143.16973 84.17165] CT
0.302 GC
N
f-1586420743
f
GR
GS
[1.00215 0 0 1 150.5711 147.22685] CT
0.302 GC
N
f-1586420743
f
GR
GS
[1.00215 0 0 1 143.9293 143.33847] CT
0.302 GC
N
f-1586420743
f
GR
GS
[1.00215 0 0 1 149.27557 164.0383] CT
0.302 GC
N
f-1586420743
f
GR
GS
[1.00215 0 0 1 152.77282 179.99455] CT
0.302 GC
N
f-1586420743
f
GR
GS
[1.00215 0 0 1 146.21007 98.06168] CT
0.302 GC
N
f-1586420743
f
GR
GS
[1.00215 0 0 1 135.62694 138.19057] CT
0.302 GC
N
f-1586420743
f
GR
GS
[1.00215 0 0 1 151.90272 184.6118] CT
0.302 GC
N
f-1586420743
f
GR
GS
[1.00215 0 0 1 139.76931 136.45883] CT
0.302 GC
N
f-1586420743
f
GR
GS
[1.00215 0 0 1 146.52787 166.76692] CT
0.302 GC
N
f-1586420743
f
GR
GS
[1.00215 0 0 1 148.99908 147.60037] CT
0.302 GC
N
f-1586420743
f
GR
GS
[1.00215 0 0 1 139.25466 132.86401] CT
0.302 GC
N
f-1586420743
f
GR
GS
[1.00215 0 0 1 135.23867 130.89221] CT
0.302 GC
N
f-1586420743
f
GR
GS
[1.00215 0 0 1 137.82883 156.36996] CT
0.302 GC
N
f-1586420743
f
GR
GS
[1.00215 0 0 1 142.64969 152.6907] CT
0.302 GC
N
f-1586420743
f
GR
GS
[1.00215 0 0 1 144.76023 105.3399] CT
0.302 GC
N
f-1586420743
f
GR
GS
[1.00215 0 0 1 147.10163 147.03456] CT
0.302 GC
N
f-1586420743
f
GR
GS
[1.00215 0 0 1 147.7712 186.36586] CT
0.302 GC
N
f-1586420743
f
GR
GS
[1.00215 0 0 1 141.36009 111.7753] CT
0.302 GC
N
f-1586420743
f
GR
GS
[1.00215 0 0 1 152.16888 179.60271] CT
0.302 GC
N
f-1586420743
f
GR
GS
[1.00215 0 0 1 143.05649 169.84857] CT
0.302 GC
N
f-1586420743
f
GR
GS
[1.00215 0 0 1 152.38584 149.07005] CT
0.302 GC
N
f-1586420743
f
GR
%%Trailer
%%Pages: 1
%%EOF
