%!PS-Adobe-3.0 EPSF-3.0
%%Creator: (MATLAB, The Mathworks, Inc. Version 9.8.0.1323502 \(R2020a\). Operating System: Mac OS X)
%%Title: /Users/kosciessa/Desktop/mntTardisLNDG/LNDG/stateswitch/stsw_multimodal/figures/linearbyage/linearcomp_nondecision.eps
%%CreationDate: 2022-03-03T16:32:24
%%Pages: (atend)
%%BoundingBox:     4     0   180   275
%%LanguageLevel: 3
%%EndComments
%%BeginProlog
%%BeginResource: procset (Apache XML Graphics Std ProcSet) 1.2 0
%%Version: 1.2 0
%%Copyright: (Copyright 2001-2003,2010 The Apache Software Foundation. License terms: http://www.apache.org/licenses/LICENSE-2.0)
/bd{bind def}bind def
/ld{load def}bd
/GR/grestore ld
/GS/gsave ld
/RM/rmoveto ld
/C/curveto ld
/t/show ld
/L/lineto ld
/ML/setmiterlimit ld
/CT/concat ld
/f/fill ld
/N/newpath ld
/S/stroke ld
/CC/setcmykcolor ld
/A/ashow ld
/cp/closepath ld
/RC/setrgbcolor ld
/LJ/setlinejoin ld
/GC/setgray ld
/LW/setlinewidth ld
/M/moveto ld
/re {4 2 roll M
1 index 0 rlineto
0 exch rlineto
neg 0 rlineto
cp } bd
/_ctm matrix def
/_tm matrix def
/BT { _ctm currentmatrix pop matrix _tm copy pop 0 0 moveto } bd
/ET { _ctm setmatrix } bd
/iTm { _ctm setmatrix _tm concat } bd
/Tm { _tm astore pop iTm 0 0 moveto } bd
/ux 0.0 def
/uy 0.0 def
/F {
  /Tp exch def
  /Tf exch def
  Tf findfont Tp scalefont setfont
  /cf Tf def  /cs Tp def
} bd
/ULS {currentpoint /uy exch def /ux exch def} bd
/ULE {
  /Tcx currentpoint pop def
  gsave
  newpath
  cf findfont cs scalefont dup
  /FontMatrix get 0 get /Ts exch def /FontInfo get dup
  /UnderlinePosition get Ts mul /To exch def
  /UnderlineThickness get Ts mul /Tt exch def
  ux uy To add moveto  Tcx uy To add lineto
  Tt setlinewidth stroke
  grestore
} bd
/OLE {
  /Tcx currentpoint pop def
  gsave
  newpath
  cf findfont cs scalefont dup
  /FontMatrix get 0 get /Ts exch def /FontInfo get dup
  /UnderlinePosition get Ts mul /To exch def
  /UnderlineThickness get Ts mul /Tt exch def
  ux uy To add cs add moveto Tcx uy To add cs add lineto
  Tt setlinewidth stroke
  grestore
} bd
/SOE {
  /Tcx currentpoint pop def
  gsave
  newpath
  cf findfont cs scalefont dup
  /FontMatrix get 0 get /Ts exch def /FontInfo get dup
  /UnderlinePosition get Ts mul /To exch def
  /UnderlineThickness get Ts mul /Tt exch def
  ux uy To add cs 10 mul 26 idiv add moveto Tcx uy To add cs 10 mul 26 idiv add lineto
  Tt setlinewidth stroke
  grestore
} bd
/QT {
/Y22 exch store
/X22 exch store
/Y21 exch store
/X21 exch store
currentpoint
/Y21 load 2 mul add 3 div exch
/X21 load 2 mul add 3 div exch
/X21 load 2 mul /X22 load add 3 div
/Y21 load 2 mul /Y22 load add 3 div
/X22 load /Y22 load curveto
} bd
/SSPD {
dup length /d exch dict def
{
/v exch def
/k exch def
currentpagedevice k known {
/cpdv currentpagedevice k get def
v cpdv ne {
/upd false def
/nullv v type /nulltype eq def
/nullcpdv cpdv type /nulltype eq def
nullv nullcpdv or
{
/upd true def
} {
/sametype v type cpdv type eq def
sametype {
v type /arraytype eq {
/vlen v length def
/cpdvlen cpdv length def
vlen cpdvlen eq {
0 1 vlen 1 sub {
/i exch def
/obj v i get def
/cpdobj cpdv i get def
obj cpdobj ne {
/upd true def
exit
} if
} for
} {
/upd true def
} ifelse
} {
v type /dicttype eq {
v {
/dv exch def
/dk exch def
/cpddv cpdv dk get def
dv cpddv ne {
/upd true def
exit
} if
} forall
} {
/upd true def
} ifelse
} ifelse
} if
} ifelse
upd true eq {
d k v put
} if
} if
} if
} forall
d length 0 gt {
d setpagedevice
} if
} bd
/RE { % /NewFontName [NewEncodingArray] /FontName RE -
  findfont dup length dict begin
  {
    1 index /FID ne
    {def} {pop pop} ifelse
  } forall
  /Encoding exch def
  /FontName 1 index def
  currentdict definefont pop
  end
} bind def
%%EndResource
%%BeginResource: procset (Apache XML Graphics EPS ProcSet) 1.0 0
%%Version: 1.0 0
%%Copyright: (Copyright 2002-2003 The Apache Software Foundation. License terms: http://www.apache.org/licenses/LICENSE-2.0)
/BeginEPSF { %def
/b4_Inc_state save def         % Save state for cleanup
/dict_count countdictstack def % Count objects on dict stack
/op_count count 1 sub def      % Count objects on operand stack
userdict begin                 % Push userdict on dict stack
/showpage { } def              % Redefine showpage, { } = null proc
0 setgray 0 setlinecap         % Prepare graphics state
1 setlinewidth 0 setlinejoin
10 setmiterlimit [ ] 0 setdash newpath
/languagelevel where           % If level not equal to 1 then
{pop languagelevel             % set strokeadjust and
1 ne                           % overprint to their defaults.
{false setstrokeadjust false setoverprint
} if
} if
} bd
/EndEPSF { %def
count op_count sub {pop} repeat            % Clean up stacks
countdictstack dict_count sub {end} repeat
b4_Inc_state restore
} bd
%%EndResource
%FOPBeginFontDict
%%IncludeResource: font Courier-Oblique
%%IncludeResource: font Courier-BoldOblique
%%IncludeResource: font Courier-Bold
%%IncludeResource: font ZapfDingbats
%%IncludeResource: font Symbol
%%IncludeResource: font Helvetica
%%IncludeResource: font Helvetica-Oblique
%%IncludeResource: font Helvetica-Bold
%%IncludeResource: font Helvetica-BoldOblique
%%IncludeResource: font Times-Roman
%%IncludeResource: font Times-Italic
%%IncludeResource: font Times-Bold
%%IncludeResource: font Times-BoldItalic
%%IncludeResource: font Courier
%FOPEndFontDict
%%BeginResource: encoding WinAnsiEncoding
/WinAnsiEncoding [
/.notdef /.notdef /.notdef /.notdef /.notdef
/.notdef /.notdef /.notdef /.notdef /.notdef
/.notdef /.notdef /.notdef /.notdef /.notdef
/.notdef /.notdef /.notdef /.notdef /.notdef
/.notdef /.notdef /.notdef /.notdef /.notdef
/.notdef /.notdef /.notdef /.notdef /.notdef
/.notdef /.notdef /space /exclam /quotedbl
/numbersign /dollar /percent /ampersand /quotesingle
/parenleft /parenright /asterisk /plus /comma
/hyphen /period /slash /zero /one
/two /three /four /five /six
/seven /eight /nine /colon /semicolon
/less /equal /greater /question /at
/A /B /C /D /E
/F /G /H /I /J
/K /L /M /N /O
/P /Q /R /S /T
/U /V /W /X /Y
/Z /bracketleft /backslash /bracketright /asciicircum
/underscore /quoteleft /a /b /c
/d /e /f /g /h
/i /j /k /l /m
/n /o /p /q /r
/s /t /u /v /w
/x /y /z /braceleft /bar
/braceright /asciitilde /bullet /Euro /bullet
/quotesinglbase /florin /quotedblbase /ellipsis /dagger
/daggerdbl /circumflex /perthousand /Scaron /guilsinglleft
/OE /bullet /Zcaron /bullet /bullet
/quoteleft /quoteright /quotedblleft /quotedblright /bullet
/endash /emdash /asciitilde /trademark /scaron
/guilsinglright /oe /bullet /zcaron /Ydieresis
/space /exclamdown /cent /sterling /currency
/yen /brokenbar /section /dieresis /copyright
/ordfeminine /guillemotleft /logicalnot /sfthyphen /registered
/macron /degree /plusminus /twosuperior /threesuperior
/acute /mu /paragraph /middot /cedilla
/onesuperior /ordmasculine /guillemotright /onequarter /onehalf
/threequarters /questiondown /Agrave /Aacute /Acircumflex
/Atilde /Adieresis /Aring /AE /Ccedilla
/Egrave /Eacute /Ecircumflex /Edieresis /Igrave
/Iacute /Icircumflex /Idieresis /Eth /Ntilde
/Ograve /Oacute /Ocircumflex /Otilde /Odieresis
/multiply /Oslash /Ugrave /Uacute /Ucircumflex
/Udieresis /Yacute /Thorn /germandbls /agrave
/aacute /acircumflex /atilde /adieresis /aring
/ae /ccedilla /egrave /eacute /ecircumflex
/edieresis /igrave /iacute /icircumflex /idieresis
/eth /ntilde /ograve /oacute /ocircumflex
/otilde /odieresis /divide /oslash /ugrave
/uacute /ucircumflex /udieresis /yacute /thorn
/ydieresis
] def
%%EndResource
%FOPBeginFontReencode
/Courier-Oblique findfont
dup length dict begin
  {1 index /FID ne {def} {pop pop} ifelse} forall
  /Encoding WinAnsiEncoding def
  currentdict
end
/Courier-Oblique exch definefont pop
/Courier-BoldOblique findfont
dup length dict begin
  {1 index /FID ne {def} {pop pop} ifelse} forall
  /Encoding WinAnsiEncoding def
  currentdict
end
/Courier-BoldOblique exch definefont pop
/Courier-Bold findfont
dup length dict begin
  {1 index /FID ne {def} {pop pop} ifelse} forall
  /Encoding WinAnsiEncoding def
  currentdict
end
/Courier-Bold exch definefont pop
/Helvetica findfont
dup length dict begin
  {1 index /FID ne {def} {pop pop} ifelse} forall
  /Encoding WinAnsiEncoding def
  currentdict
end
/Helvetica exch definefont pop
/Helvetica-Oblique findfont
dup length dict begin
  {1 index /FID ne {def} {pop pop} ifelse} forall
  /Encoding WinAnsiEncoding def
  currentdict
end
/Helvetica-Oblique exch definefont pop
/Helvetica-Bold findfont
dup length dict begin
  {1 index /FID ne {def} {pop pop} ifelse} forall
  /Encoding WinAnsiEncoding def
  currentdict
end
/Helvetica-Bold exch definefont pop
/Helvetica-BoldOblique findfont
dup length dict begin
  {1 index /FID ne {def} {pop pop} ifelse} forall
  /Encoding WinAnsiEncoding def
  currentdict
end
/Helvetica-BoldOblique exch definefont pop
/Times-Roman findfont
dup length dict begin
  {1 index /FID ne {def} {pop pop} ifelse} forall
  /Encoding WinAnsiEncoding def
  currentdict
end
/Times-Roman exch definefont pop
/Times-Italic findfont
dup length dict begin
  {1 index /FID ne {def} {pop pop} ifelse} forall
  /Encoding WinAnsiEncoding def
  currentdict
end
/Times-Italic exch definefont pop
/Times-Bold findfont
dup length dict begin
  {1 index /FID ne {def} {pop pop} ifelse} forall
  /Encoding WinAnsiEncoding def
  currentdict
end
/Times-Bold exch definefont pop
/Times-BoldItalic findfont
dup length dict begin
  {1 index /FID ne {def} {pop pop} ifelse} forall
  /Encoding WinAnsiEncoding def
  currentdict
end
/Times-BoldItalic exch definefont pop
/Courier findfont
dup length dict begin
  {1 index /FID ne {def} {pop pop} ifelse} forall
  /Encoding WinAnsiEncoding def
  currentdict
end
/Courier exch definefont pop
%FOPEndFontReencode
%%EndProlog
%%Page: 1 1
%%PageBoundingBox: 0 0 198 283
%%BeginPageSetup
[1 0 0 -1 0 283] CT
%%EndPageSetup
GS
[1.00215 0 0 1 0 0] CT
1 GC
N
0 0 198 283 re
f
GR
GS
[1.00215 0 0 1 0 0] CT
1 GC
N
0 0 198 283 re
f
GR
GS
[1.00215 0 0 1 0 0] CT
1 GC
N
72 228 M
179 228 L
179 32 L
72 32 L
cp
f
GR
GS
[1.00215 0 0 1 0 0] CT
0.149 GC
2 setlinecap
1 LJ
0.5 LW
N
72 228 M
179 228 L
S
GR
GS
[1.00215 0 0 1 0 0] CT
0.149 GC
2 setlinecap
1 LJ
0.5 LW
N
104.1 228 M
104.1 226.04 L
S
GR
GS
[1.00215 0 0 1 0 0] CT
0.149 GC
2 setlinecap
1 LJ
0.5 LW
N
146.9 228 M
146.9 226.04 L
S
GR
GS
[1.00215 0 0 1 104.32355 234] CT
0.149 GC
/Helvetica 20 F
GS
[1 0 0 1 0 0] CT
-13 20 moveto 
1 -1 scale
(YA) t 
GR
GR
GS
[1.00215 0 0 1 147.21546 234] CT
0.149 GC
/Helvetica 20 F
GS
[1 0 0 1 0 0] CT
-14.5 20 moveto 
1 -1 scale
(OA) t 
GR
GR
GS
[1.00215 0 0 1 125.76956 259] CT
0.149 GC
/Helvetica 20 F
GS
[1 0 0 1 0 0] CT
-49 20 moveto 
1 -1 scale
(Age Group) t 
GR
GR
GS
[1.00215 0 0 1 0 0] CT
0.149 GC
2 setlinecap
1 LJ
0.5 LW
N
72 228 M
72 32 L
S
GR
GS
[1.00215 0 0 1 0 0] CT
0.149 GC
2 setlinecap
1 LJ
0.5 LW
N
72 219.079 M
73.96 219.079 L
S
GR
GS
[1.00215 0 0 1 0 0] CT
0.149 GC
2 setlinecap
1 LJ
0.5 LW
N
72 129.577 M
73.96 129.577 L
S
GR
GS
[1.00215 0 0 1 0 0] CT
0.149 GC
2 setlinecap
1 LJ
0.5 LW
N
72 40.074 M
73.96 40.074 L
S
GR
GS
[1.00215 0 0 1 66.14173 219.07918] CT
0.149 GC
/Helvetica 20 F
GS
[1 0 0 1 0 0] CT
-12 7.5 moveto 
1 -1 scale
(0) t 
GR
GR
GS
[1.00215 0 0 1 66.14173 129.57681] CT
0.149 GC
/Helvetica 20 F
GS
[1 0 0 1 0 0] CT
-39 7.5 moveto 
1 -1 scale
(0.05) t 
GR
GR
GS
[1.00215 0 0 1 66.14173 40.07445] CT
0.149 GC
/Helvetica 20 F
GS
[1 0 0 1 0 0] CT
-28 7.5 moveto 
1 -1 scale
(0.1) t 
GR
GR
GS
[0 -1 1.00215 0 24.05154 129.99991] CT
0.149 GC
/Helvetica 20 F
GS
[1 0 0 1 0 0] CT
-81.5 -5 moveto 
1 -1 scale
(nondecision linear) t 
GR
GR
GS
[1.00215 0 0 1 125.76963 29.25] CT
/Helvetica-Bold 22 F
GS
[1 0 0 1 0 0] CT
-58 -5 moveto 
1 -1 scale
(p = 5.2e-04) t 
GR
GR
GS
[1.00215 0 0 1 0 0] CT
0.149 GC
1 LJ
0.5 LW
N
72 219.079 M
179 219.079 L
S
GR
GS
[1.00215 0 0 1 0 0] CT
1 0.6 0.6 RC
N
121.22 219.079 M
121.22 120.28 L
86.98 120.28 L
86.98 219.079 L
cp
f
GR
GS
[1.00215 0 0 1 97.41728 94.23434] CT
0.302 GC
N
2.236 0 M
2.236 -1.235 1.235 -2.236 0 -2.236 C
-1.235 -2.236 -2.236 -1.235 -2.236 0 C
-2.236 1.235 -1.235 2.236 0 2.236 C
1.235 2.236 2.236 1.235 2.236 0 C
cp
f
GR
GS
[1.00215 0 0 1 112.15283 134.04097] CT
0.302 GC
N
/f-1586420743{2.236 0 M
2.236 -1.235 1.235 -2.236 0 -2.236 C
-1.235 -2.236 -2.236 -1.235 -2.236 0 C
-2.236 1.235 -1.235 2.236 0 2.236 C
1.235 2.236 2.236 1.235 2.236 0 C
cp}def
f-1586420743
f
GR
GS
[1.00215 0 0 1 108.6291 51.53094] CT
0.302 GC
N
f-1586420743
f
GR
GS
[1.00215 0 0 1 107.59771 115.7345] CT
0.302 GC
N
f-1586420743
f
GR
GS
[1.00215 0 0 1 97.50459 140.63637] CT
0.302 GC
N
f-1586420743
f
GR
GS
[1.00215 0 0 1 103.50777 137.99768] CT
0.302 GC
N
f-1586420743
f
GR
GS
[1.00215 0 0 1 103.06209 41.48613] CT
0.302 GC
N
f-1586420743
f
GR
GS
[1.00215 0 0 1 110.4403 140.87675] CT
0.302 GC
N
f-1586420743
f
GR
GS
[1.00215 0 0 1 98.44766 96.86176] CT
0.302 GC
N
f-1586420743
f
GR
GS
[1.00215 0 0 1 97.23009 92.77696] CT
0.302 GC
N
f-1586420743
f
GR
GS
[1.00215 0 0 1 98.77477 93.46492] CT
0.302 GC
N
f-1586420743
f
GR
GS
[1.00215 0 0 1 103.34624 101.70821] CT
0.302 GC
N
f-1586420743
f
GR
GS
[1.00215 0 0 1 107.91531 109.94675] CT
0.302 GC
N
f-1586420743
f
GR
GS
[1.00215 0 0 1 110.88696 88.23047] CT
0.302 GC
N
f-1586420743
f
GR
GS
[1.00215 0 0 1 109.31332 125.21942] CT
0.302 GC
N
f-1586420743
f
GR
GS
[1.00215 0 0 1 105.94362 168.58473] CT
0.302 GC
N
f-1586420743
f
GR
GS
[1.00215 0 0 1 102.56349 72.18437] CT
0.302 GC
N
f-1586420743
f
GR
GS
[1.00215 0 0 1 100.87807 91.9945] CT
0.302 GC
N
f-1586420743
f
GR
GS
[1.00215 0 0 1 99.21288 167.63272] CT
0.302 GC
N
f-1586420743
f
GR
GS
[1.00215 0 0 1 104.46025 120.11186] CT
0.302 GC
N
f-1586420743
f
GR
GS
[1.00215 0 0 1 112.78223 69.78036] CT
0.302 GC
N
f-1586420743
f
GR
GS
[1.00215 0 0 1 102.12805 129.46246] CT
0.302 GC
N
f-1586420743
f
GR
GS
[1.00215 0 0 1 106.25932 72.72237] CT
0.302 GC
N
f-1586420743
f
GR
GS
[1.00215 0 0 1 103.64584 217.67157] CT
0.302 GC
N
f-1586420743
f
GR
GS
[1.00215 0 0 1 104.81406 154.03539] CT
0.302 GC
N
f-1586420743
f
GR
GS
[1.00215 0 0 1 106.68663 140.0788] CT
0.302 GC
N
f-1586420743
f
GR
GS
[1.00215 0 0 1 105.35424 114.37164] CT
0.302 GC
N
f-1586420743
f
GR
GS
[1.00215 0 0 1 104.77281 168.80858] CT
0.302 GC
N
f-1586420743
f
GR
GS
[1.00215 0 0 1 96.22483 87.39514] CT
0.302 GC
N
f-1586420743
f
GR
GS
[1.00215 0 0 1 98.79013 135.45161] CT
0.302 GC
N
f-1586420743
f
GR
GS
[1.00215 0 0 1 103.55564 115.17886] CT
0.302 GC
N
f-1586420743
f
GR
GS
[1.00215 0 0 1 101.44132 214.70619] CT
0.302 GC
N
f-1586420743
f
GR
GS
[1.00215 0 0 1 110.31093 123.23725] CT
0.302 GC
N
f-1586420743
f
GR
GS
[1.00215 0 0 1 98.38059 93.63719] CT
0.302 GC
N
f-1586420743
f
GR
GS
[1.00215 0 0 1 112.84955 152.5793] CT
0.302 GC
N
f-1586420743
f
GR
GS
[1.00215 0 0 1 106.43208 116.19219] CT
0.302 GC
N
f-1586420743
f
GR
GS
[1.00215 0 0 1 98.78795 171.52875] CT
0.302 GC
N
f-1586420743
f
GR
GS
[1.00215 0 0 1 111.17363 145.38863] CT
0.302 GC
N
f-1586420743
f
GR
GS
[1.00215 0 0 1 105.14784 99.68729] CT
0.302 GC
N
f-1586420743
f
GR
GS
[1.00215 0 0 1 100.66427 126.48034] CT
0.302 GC
N
f-1586420743
f
GR
GS
[1.00215 0 0 1 98.67165 128.03746] CT
0.302 GC
N
f-1586420743
f
GR
GS
[1.00215 0 0 1 103.35754 90.06556] CT
0.302 GC
N
f-1586420743
f
GR
GS
[1.00215 0 0 1 0 0] CT
1 0.6 0.6 RC
N
/f-1606211890{164.02 219.079 M
164.02 152.461 L
129.78 152.461 L
129.78 219.079 L
cp}def
f-1606211890
f
GR
GS
[1.00215 0 0 1 154.31015 195.35452] CT
0.302 GC
N
f-1586420743
f
GR
GS
[1.00215 0 0 1 148.47502 122.83238] CT
0.302 GC
N
f-1586420743
f
GR
GS
[1.00215 0 0 1 142.26333 32] CT
0.302 GC
N
f-1586420743
f
GR
GS
[1.00215 0 0 1 144.81493 151.66585] CT
0.302 GC
N
f-1586420743
f
GR
GS
[1.00215 0 0 1 152.46153 142.35826] CT
0.302 GC
N
f-1586420743
f
GR
GS
[1.00215 0 0 1 153.96644 206.29567] CT
0.302 GC
N
f-1586420743
f
GR
GS
[1.00215 0 0 1 147.99846 181.72719] CT
0.302 GC
N
f-1586420743
f
GR
GS
[1.00215 0 0 1 143.00635 162.01903] CT
0.302 GC
N
f-1586420743
f
GR
GS
[1.00215 0 0 1 142.43903 182.17599] CT
0.302 GC
N
f-1586420743
f
GR
GS
[1.00215 0 0 1 148.74206 124.65136] CT
0.302 GC
N
f-1586420743
f
GR
GS
[1.00215 0 0 1 146.34768 50.34527] CT
0.302 GC
N
f-1586420743
f
GR
GS
[1.00215 0 0 1 154.97678 107.12733] CT
0.302 GC
N
f-1586420743
f
GR
GS
[1.00215 0 0 1 142.45663 228] CT
0.302 GC
N
f-1586420743
f
GR
GS
[1.00215 0 0 1 142.08361 141.95493] CT
0.302 GC
N
f-1586420743
f
GR
GS
[1.00215 0 0 1 140.44755 138.32512] CT
0.302 GC
N
f-1586420743
f
GR
GS
[1.00215 0 0 1 139.41897 140.0891] CT
0.302 GC
N
f-1586420743
f
GR
GS
[1.00215 0 0 1 140.02384 115.87814] CT
0.302 GC
N
f-1586420743
f
GR
GS
[1.00215 0 0 1 155.78911 195.61256] CT
0.302 GC
N
f-1586420743
f
GR
GS
[1.00215 0 0 1 151.7207 222.81055] CT
0.302 GC
N
f-1586420743
f
GR
GS
[1.00215 0 0 1 149.25827 190.67216] CT
0.302 GC
N
f-1586420743
f
GR
GS
[1.00215 0 0 1 139.80301 157.94144] CT
0.302 GC
N
f-1586420743
f
GR
GS
[1.00215 0 0 1 144.13906 137.29686] CT
0.302 GC
N
f-1586420743
f
GR
GS
[1.00215 0 0 1 139.52113 164.46774] CT
0.302 GC
N
f-1586420743
f
GR
GS
[1.00215 0 0 1 152.22219 184.45895] CT
0.302 GC
N
f-1586420743
f
GR
GS
[1.00215 0 0 1 153.89223 136.42831] CT
0.302 GC
N
f-1586420743
f
GR
GS
[1.00215 0 0 1 152.80483 221.46988] CT
0.302 GC
N
f-1586420743
f
GR
GS
[1.00215 0 0 1 151.21263 128.05496] CT
0.302 GC
N
f-1586420743
f
GR
GS
[1.00215 0 0 1 141.04229 129.90309] CT
0.302 GC
N
f-1586420743
f
GR
GS
[1.00215 0 0 1 145.34841 143.27617] CT
0.302 GC
N
f-1586420743
f
GR
GS
[1.00215 0 0 1 141.63681 79.16485] CT
0.302 GC
N
f-1586420743
f
GR
GS
[1.00215 0 0 1 154.69757 204.82513] CT
0.302 GC
N
f-1586420743
f
GR
GS
[1.00215 0 0 1 149.09274 126.35894] CT
0.302 GC
N
f-1586420743
f
GR
GS
[1.00215 0 0 1 152.68398 75.24284] CT
0.302 GC
N
f-1586420743
f
GR
GS
[1.00215 0 0 1 148.31946 216.13927] CT
0.302 GC
N
f-1586420743
f
GR
GS
[1.00215 0 0 1 144.79722 144.62445] CT
0.302 GC
N
f-1586420743
f
GR
GS
[1.00215 0 0 1 154.67006 152.89027] CT
0.302 GC
N
f-1586420743
f
GR
GS
[1.00215 0 0 1 145.79943 133.91119] CT
0.302 GC
N
f-1586420743
f
GR
GS
[1.00215 0 0 1 142.13135 179.4985] CT
0.302 GC
N
f-1586420743
f
GR
GS
[1.00215 0 0 1 155.10815 93.50253] CT
0.302 GC
N
f-1586420743
f
GR
GS
[1.00215 0 0 1 155.3609 185.85817] CT
0.302 GC
N
f-1586420743
f
GR
GS
[1.00215 0 0 1 149.68445 225.32936] CT
0.302 GC
N
f-1586420743
f
GR
GS
[1.00215 0 0 1 155.58017 202.39604] CT
0.302 GC
N
f-1586420743
f
GR
GS
[1.00215 0 0 1 147.19556 186.52509] CT
0.302 GC
N
f-1586420743
f
GR
GS
[1.00215 0 0 1 142.22982 118.46725] CT
0.302 GC
N
f-1586420743
f
GR
GS
[1.00215 0 0 1 142.64478 140.48175] CT
0.302 GC
N
f-1586420743
f
GR
GS
[1.00215 0 0 1 143.07788 68.96867] CT
0.302 GC
N
f-1586420743
f
GR
GS
[1.00215 0 0 1 150.63574 223.66357] CT
0.302 GC
N
f-1586420743
f
GR
GS
[1.00215 0 0 1 150.47163 125.68164] CT
0.302 GC
N
f-1586420743
f
GR
GS
[1.00215 0 0 1 144.86825 207.31976] CT
0.302 GC
N
f-1586420743
f
GR
GS
[1.00215 0 0 1 155.41877 91.57874] CT
0.302 GC
N
f-1586420743
f
GR
GS
[1.00215 0 0 1 153.0878 131.79242] CT
0.302 GC
N
f-1586420743
f
GR
GS
[1.00215 0 0 1 138.79541 137.56161] CT
0.302 GC
N
f-1586420743
f
GR
GS
[1.00215 0 0 1 141.98916 193.45738] CT
0.302 GC
N
f-1586420743
f
GR
%%Trailer
%%Pages: 1
%%EOF
