%!PS-Adobe-3.0 EPSF-3.0
%%Creator: (MATLAB, The Mathworks, Inc. Version 9.8.0.1323502 \(R2020a\). Operating System: Mac OS X)
%%Title: /Users/kosciessa/Desktop/mntTardisLNDG/LNDG/stateswitch/stsw_multimodal/figures/linearbyage/linearcomp_bs_brain.eps
%%CreationDate: 2022-03-03T16:32:31
%%Pages: (atend)
%%BoundingBox:     4     0   192   275
%%LanguageLevel: 3
%%EndComments
%%BeginProlog
%%BeginResource: procset (Apache XML Graphics Std ProcSet) 1.2 0
%%Version: 1.2 0
%%Copyright: (Copyright 2001-2003,2010 The Apache Software Foundation. License terms: http://www.apache.org/licenses/LICENSE-2.0)
/bd{bind def}bind def
/ld{load def}bd
/GR/grestore ld
/GS/gsave ld
/RM/rmoveto ld
/C/curveto ld
/t/show ld
/L/lineto ld
/ML/setmiterlimit ld
/CT/concat ld
/f/fill ld
/N/newpath ld
/S/stroke ld
/CC/setcmykcolor ld
/A/ashow ld
/cp/closepath ld
/RC/setrgbcolor ld
/LJ/setlinejoin ld
/GC/setgray ld
/LW/setlinewidth ld
/M/moveto ld
/re {4 2 roll M
1 index 0 rlineto
0 exch rlineto
neg 0 rlineto
cp } bd
/_ctm matrix def
/_tm matrix def
/BT { _ctm currentmatrix pop matrix _tm copy pop 0 0 moveto } bd
/ET { _ctm setmatrix } bd
/iTm { _ctm setmatrix _tm concat } bd
/Tm { _tm astore pop iTm 0 0 moveto } bd
/ux 0.0 def
/uy 0.0 def
/F {
  /Tp exch def
  /Tf exch def
  Tf findfont Tp scalefont setfont
  /cf Tf def  /cs Tp def
} bd
/ULS {currentpoint /uy exch def /ux exch def} bd
/ULE {
  /Tcx currentpoint pop def
  gsave
  newpath
  cf findfont cs scalefont dup
  /FontMatrix get 0 get /Ts exch def /FontInfo get dup
  /UnderlinePosition get Ts mul /To exch def
  /UnderlineThickness get Ts mul /Tt exch def
  ux uy To add moveto  Tcx uy To add lineto
  Tt setlinewidth stroke
  grestore
} bd
/OLE {
  /Tcx currentpoint pop def
  gsave
  newpath
  cf findfont cs scalefont dup
  /FontMatrix get 0 get /Ts exch def /FontInfo get dup
  /UnderlinePosition get Ts mul /To exch def
  /UnderlineThickness get Ts mul /Tt exch def
  ux uy To add cs add moveto Tcx uy To add cs add lineto
  Tt setlinewidth stroke
  grestore
} bd
/SOE {
  /Tcx currentpoint pop def
  gsave
  newpath
  cf findfont cs scalefont dup
  /FontMatrix get 0 get /Ts exch def /FontInfo get dup
  /UnderlinePosition get Ts mul /To exch def
  /UnderlineThickness get Ts mul /Tt exch def
  ux uy To add cs 10 mul 26 idiv add moveto Tcx uy To add cs 10 mul 26 idiv add lineto
  Tt setlinewidth stroke
  grestore
} bd
/QT {
/Y22 exch store
/X22 exch store
/Y21 exch store
/X21 exch store
currentpoint
/Y21 load 2 mul add 3 div exch
/X21 load 2 mul add 3 div exch
/X21 load 2 mul /X22 load add 3 div
/Y21 load 2 mul /Y22 load add 3 div
/X22 load /Y22 load curveto
} bd
/SSPD {
dup length /d exch dict def
{
/v exch def
/k exch def
currentpagedevice k known {
/cpdv currentpagedevice k get def
v cpdv ne {
/upd false def
/nullv v type /nulltype eq def
/nullcpdv cpdv type /nulltype eq def
nullv nullcpdv or
{
/upd true def
} {
/sametype v type cpdv type eq def
sametype {
v type /arraytype eq {
/vlen v length def
/cpdvlen cpdv length def
vlen cpdvlen eq {
0 1 vlen 1 sub {
/i exch def
/obj v i get def
/cpdobj cpdv i get def
obj cpdobj ne {
/upd true def
exit
} if
} for
} {
/upd true def
} ifelse
} {
v type /dicttype eq {
v {
/dv exch def
/dk exch def
/cpddv cpdv dk get def
dv cpddv ne {
/upd true def
exit
} if
} forall
} {
/upd true def
} ifelse
} ifelse
} if
} ifelse
upd true eq {
d k v put
} if
} if
} if
} forall
d length 0 gt {
d setpagedevice
} if
} bd
/RE { % /NewFontName [NewEncodingArray] /FontName RE -
  findfont dup length dict begin
  {
    1 index /FID ne
    {def} {pop pop} ifelse
  } forall
  /Encoding exch def
  /FontName 1 index def
  currentdict definefont pop
  end
} bind def
%%EndResource
%%BeginResource: procset (Apache XML Graphics EPS ProcSet) 1.0 0
%%Version: 1.0 0
%%Copyright: (Copyright 2002-2003 The Apache Software Foundation. License terms: http://www.apache.org/licenses/LICENSE-2.0)
/BeginEPSF { %def
/b4_Inc_state save def         % Save state for cleanup
/dict_count countdictstack def % Count objects on dict stack
/op_count count 1 sub def      % Count objects on operand stack
userdict begin                 % Push userdict on dict stack
/showpage { } def              % Redefine showpage, { } = null proc
0 setgray 0 setlinecap         % Prepare graphics state
1 setlinewidth 0 setlinejoin
10 setmiterlimit [ ] 0 setdash newpath
/languagelevel where           % If level not equal to 1 then
{pop languagelevel             % set strokeadjust and
1 ne                           % overprint to their defaults.
{false setstrokeadjust false setoverprint
} if
} if
} bd
/EndEPSF { %def
count op_count sub {pop} repeat            % Clean up stacks
countdictstack dict_count sub {end} repeat
b4_Inc_state restore
} bd
%%EndResource
%FOPBeginFontDict
%%IncludeResource: font Courier-Oblique
%%IncludeResource: font Courier-BoldOblique
%%IncludeResource: font Courier-Bold
%%IncludeResource: font ZapfDingbats
%%IncludeResource: font Symbol
%%IncludeResource: font Helvetica
%%IncludeResource: font Helvetica-Oblique
%%IncludeResource: font Helvetica-Bold
%%IncludeResource: font Helvetica-BoldOblique
%%IncludeResource: font Times-Roman
%%IncludeResource: font Times-Italic
%%IncludeResource: font Times-Bold
%%IncludeResource: font Times-BoldItalic
%%IncludeResource: font Courier
%FOPEndFontDict
%%BeginResource: encoding WinAnsiEncoding
/WinAnsiEncoding [
/.notdef /.notdef /.notdef /.notdef /.notdef
/.notdef /.notdef /.notdef /.notdef /.notdef
/.notdef /.notdef /.notdef /.notdef /.notdef
/.notdef /.notdef /.notdef /.notdef /.notdef
/.notdef /.notdef /.notdef /.notdef /.notdef
/.notdef /.notdef /.notdef /.notdef /.notdef
/.notdef /.notdef /space /exclam /quotedbl
/numbersign /dollar /percent /ampersand /quotesingle
/parenleft /parenright /asterisk /plus /comma
/hyphen /period /slash /zero /one
/two /three /four /five /six
/seven /eight /nine /colon /semicolon
/less /equal /greater /question /at
/A /B /C /D /E
/F /G /H /I /J
/K /L /M /N /O
/P /Q /R /S /T
/U /V /W /X /Y
/Z /bracketleft /backslash /bracketright /asciicircum
/underscore /quoteleft /a /b /c
/d /e /f /g /h
/i /j /k /l /m
/n /o /p /q /r
/s /t /u /v /w
/x /y /z /braceleft /bar
/braceright /asciitilde /bullet /Euro /bullet
/quotesinglbase /florin /quotedblbase /ellipsis /dagger
/daggerdbl /circumflex /perthousand /Scaron /guilsinglleft
/OE /bullet /Zcaron /bullet /bullet
/quoteleft /quoteright /quotedblleft /quotedblright /bullet
/endash /emdash /asciitilde /trademark /scaron
/guilsinglright /oe /bullet /zcaron /Ydieresis
/space /exclamdown /cent /sterling /currency
/yen /brokenbar /section /dieresis /copyright
/ordfeminine /guillemotleft /logicalnot /sfthyphen /registered
/macron /degree /plusminus /twosuperior /threesuperior
/acute /mu /paragraph /middot /cedilla
/onesuperior /ordmasculine /guillemotright /onequarter /onehalf
/threequarters /questiondown /Agrave /Aacute /Acircumflex
/Atilde /Adieresis /Aring /AE /Ccedilla
/Egrave /Eacute /Ecircumflex /Edieresis /Igrave
/Iacute /Icircumflex /Idieresis /Eth /Ntilde
/Ograve /Oacute /Ocircumflex /Otilde /Odieresis
/multiply /Oslash /Ugrave /Uacute /Ucircumflex
/Udieresis /Yacute /Thorn /germandbls /agrave
/aacute /acircumflex /atilde /adieresis /aring
/ae /ccedilla /egrave /eacute /ecircumflex
/edieresis /igrave /iacute /icircumflex /idieresis
/eth /ntilde /ograve /oacute /ocircumflex
/otilde /odieresis /divide /oslash /ugrave
/uacute /ucircumflex /udieresis /yacute /thorn
/ydieresis
] def
%%EndResource
%FOPBeginFontReencode
/Courier-Oblique findfont
dup length dict begin
  {1 index /FID ne {def} {pop pop} ifelse} forall
  /Encoding WinAnsiEncoding def
  currentdict
end
/Courier-Oblique exch definefont pop
/Courier-BoldOblique findfont
dup length dict begin
  {1 index /FID ne {def} {pop pop} ifelse} forall
  /Encoding WinAnsiEncoding def
  currentdict
end
/Courier-BoldOblique exch definefont pop
/Courier-Bold findfont
dup length dict begin
  {1 index /FID ne {def} {pop pop} ifelse} forall
  /Encoding WinAnsiEncoding def
  currentdict
end
/Courier-Bold exch definefont pop
/Helvetica findfont
dup length dict begin
  {1 index /FID ne {def} {pop pop} ifelse} forall
  /Encoding WinAnsiEncoding def
  currentdict
end
/Helvetica exch definefont pop
/Helvetica-Oblique findfont
dup length dict begin
  {1 index /FID ne {def} {pop pop} ifelse} forall
  /Encoding WinAnsiEncoding def
  currentdict
end
/Helvetica-Oblique exch definefont pop
/Helvetica-Bold findfont
dup length dict begin
  {1 index /FID ne {def} {pop pop} ifelse} forall
  /Encoding WinAnsiEncoding def
  currentdict
end
/Helvetica-Bold exch definefont pop
/Helvetica-BoldOblique findfont
dup length dict begin
  {1 index /FID ne {def} {pop pop} ifelse} forall
  /Encoding WinAnsiEncoding def
  currentdict
end
/Helvetica-BoldOblique exch definefont pop
/Times-Roman findfont
dup length dict begin
  {1 index /FID ne {def} {pop pop} ifelse} forall
  /Encoding WinAnsiEncoding def
  currentdict
end
/Times-Roman exch definefont pop
/Times-Italic findfont
dup length dict begin
  {1 index /FID ne {def} {pop pop} ifelse} forall
  /Encoding WinAnsiEncoding def
  currentdict
end
/Times-Italic exch definefont pop
/Times-Bold findfont
dup length dict begin
  {1 index /FID ne {def} {pop pop} ifelse} forall
  /Encoding WinAnsiEncoding def
  currentdict
end
/Times-Bold exch definefont pop
/Times-BoldItalic findfont
dup length dict begin
  {1 index /FID ne {def} {pop pop} ifelse} forall
  /Encoding WinAnsiEncoding def
  currentdict
end
/Times-BoldItalic exch definefont pop
/Courier findfont
dup length dict begin
  {1 index /FID ne {def} {pop pop} ifelse} forall
  /Encoding WinAnsiEncoding def
  currentdict
end
/Courier exch definefont pop
%FOPEndFontReencode
%%EndProlog
%%Page: 1 1
%%PageBoundingBox: 0 0 198 283
%%BeginPageSetup
[1 0 0 -1 0 283] CT
%%EndPageSetup
GS
[1.00215 0 0 1 0 0] CT
1 GC
N
0 0 198 283 re
f
GR
GS
[1.00215 0 0 1 0 0] CT
1 GC
N
0 0 198 283 re
f
GR
GS
[1.00215 0 0 1 0 0] CT
1 GC
N
98 228 M
179 228 L
179 32 L
98 32 L
cp
f
GR
GS
[1.00215 0 0 1 0 0] CT
0.149 GC
2 setlinecap
1 LJ
0.5 LW
N
98 228 M
179 228 L
S
GR
GS
[1.00215 0 0 1 0 0] CT
0.149 GC
2 setlinecap
1 LJ
0.5 LW
N
122.3 228 M
122.3 226.04 L
S
GR
GS
[1.00215 0 0 1 0 0] CT
0.149 GC
2 setlinecap
1 LJ
0.5 LW
N
154.7 228 M
154.7 226.04 L
S
GR
GS
[1.00215 0 0 1 122.56264 234] CT
0.149 GC
/Helvetica 20 F
GS
[1 0 0 1 0 0] CT
-13 20 moveto 
1 -1 scale
(YA) t 
GR
GR
GS
[1.00215 0 0 1 155.03221 234] CT
0.149 GC
/Helvetica 20 F
GS
[1 0 0 1 0 0] CT
-14.5 20 moveto 
1 -1 scale
(OA) t 
GR
GR
GS
[1.00215 0 0 1 138.79747 259] CT
0.149 GC
/Helvetica 20 F
GS
[1 0 0 1 0 0] CT
-49 20 moveto 
1 -1 scale
(Age Group) t 
GR
GR
GS
[1.00215 0 0 1 0 0] CT
0.149 GC
2 setlinecap
1 LJ
0.5 LW
N
98 228 M
98 32 L
S
GR
GS
[1.00215 0 0 1 0 0] CT
0.149 GC
2 setlinecap
1 LJ
0.5 LW
N
98 228 M
99.96 228 L
S
GR
GS
[1.00215 0 0 1 0 0] CT
0.149 GC
2 setlinecap
1 LJ
0.5 LW
N
98 179 M
99.96 179 L
S
GR
GS
[1.00215 0 0 1 0 0] CT
0.149 GC
2 setlinecap
1 LJ
0.5 LW
N
98 130 M
99.96 130 L
S
GR
GS
[1.00215 0 0 1 0 0] CT
0.149 GC
2 setlinecap
1 LJ
0.5 LW
N
98 81 M
99.96 81 L
S
GR
GS
[1.00215 0 0 1 0 0] CT
0.149 GC
2 setlinecap
1 LJ
0.5 LW
N
98 32 M
99.96 32 L
S
GR
GS
[1.00215 0 0 1 92.19757 228] CT
0.149 GC
/Helvetica 20 F
GS
[1 0 0 1 0 0] CT
-53 7.5 moveto 
1 -1 scale
(-5000) t 
GR
GR
GS
[1.00215 0 0 1 92.19757 179] CT
0.149 GC
/Helvetica 20 F
GS
[1 0 0 1 0 0] CT
-12 7.5 moveto 
1 -1 scale
(0) t 
GR
GR
GS
[1.00215 0 0 1 92.19757 130] CT
0.149 GC
/Helvetica 20 F
GS
[1 0 0 1 0 0] CT
-45 7.5 moveto 
1 -1 scale
(5000) t 
GR
GR
GS
[1.00215 0 0 1 92.19757 81] CT
0.149 GC
/Helvetica 20 F
GS
[1 0 0 1 0 0] CT
-56 7.5 moveto 
1 -1 scale
(10000) t 
GR
GR
GS
[1.00215 0 0 1 92.19757 32] CT
0.149 GC
/Helvetica 20 F
GS
[1 0 0 1 0 0] CT
-56 7.5 moveto 
1 -1 scale
(15000) t 
GR
GR
GS
[0 -1 1.00215 0 19.0408 190] CT
0.149 GC
/Helvetica 20 F
GS
[1 0 0 1 0 0] CT
0 0 moveto 
1 -1 scale
(bs) t 
GR
GR
GS
[0 -1 1.00215 0 29.06228 168] CT
0.149 GC
/Helvetica 16 F
GS
[1 0 0 1 0 0] CT
0 0 moveto 
1 -1 scale
(b) t 
GR
GR
GS
[0 -1 1.00215 0 19.0408 158] CT
0.149 GC
/Helvetica 20 F
GS
[1 0 0 1 0 0] CT
0 0 moveto 
1 -1 scale
(rain linear) t 
GR
GR
GS
[1.00215 0 0 1 138.79756 29.25] CT
/Helvetica-Bold 22 F
GS
[1 0 0 1 0 0] CT
-58 -5 moveto 
1 -1 scale
(p = 1.3e-10) t 
GR
GR
GS
[1.00215 0 0 1 0 0] CT
0.149 GC
1 LJ
0.5 LW
N
98 179 M
179 179 L
S
GR
GS
[1.00215 0 0 1 0 0] CT
1 0.6 0.6 RC
N
135.26 179 M
135.26 124.366 L
109.34 124.366 L
109.34 179 L
cp
f
GR
GS
[1.00215 0 0 1 117.49581 151.20152] CT
0.302 GC
N
2.236 0 M
2.236 -1.235 1.235 -2.236 0 -2.236 C
-1.235 -2.236 -2.236 -1.235 -2.236 0 C
-2.236 1.235 -1.235 2.236 0 2.236 C
1.235 2.236 2.236 1.235 2.236 0 C
cp
f
GR
GS
[1.00215 0 0 1 122.00496 160.49541] CT
0.302 GC
N
/f-1586420743{2.236 0 M
2.236 -1.235 1.235 -2.236 0 -2.236 C
-1.235 -2.236 -2.236 -1.235 -2.236 0 C
-2.236 1.235 -1.235 2.236 0 2.236 C
1.235 2.236 2.236 1.235 2.236 0 C
cp}def
f-1586420743
f
GR
GS
[1.00215 0 0 1 124.1904 115.15343] CT
0.302 GC
N
f-1586420743
f
GR
GS
[1.00215 0 0 1 127.94847 122.66483] CT
0.302 GC
N
f-1586420743
f
GR
GS
[1.00215 0 0 1 116.52185 150.62395] CT
0.302 GC
N
f-1586420743
f
GR
GS
[1.00215 0 0 1 125.43426 126.49648] CT
0.302 GC
N
f-1586420743
f
GR
GS
[1.00215 0 0 1 128.45764 85.66305] CT
0.302 GC
N
f-1586420743
f
GR
GS
[1.00215 0 0 1 126.92165 85.52066] CT
0.302 GC
N
f-1586420743
f
GR
GS
[1.00215 0 0 1 121.5914 180.0807] CT
0.302 GC
N
f-1586420743
f
GR
GS
[1.00215 0 0 1 127.34267 100.80934] CT
0.302 GC
N
f-1586420743
f
GR
GS
[1.00215 0 0 1 118.46085 130.67586] CT
0.302 GC
N
f-1586420743
f
GR
GS
[1.00215 0 0 1 118.28886 104.42246] CT
0.302 GC
N
f-1586420743
f
GR
GS
[1.00215 0 0 1 124.83656 150.83096] CT
0.302 GC
N
f-1586420743
f
GR
GS
[1.00215 0 0 1 121.01884 136.06746] CT
0.302 GC
N
f-1586420743
f
GR
GS
[1.00215 0 0 1 117.24974 146.50256] CT
0.302 GC
N
f-1586420743
f
GR
GS
[1.00215 0 0 1 117.32279 168.94154] CT
0.302 GC
N
f-1586420743
f
GR
GS
[1.00215 0 0 1 123.36558 141.17738] CT
0.302 GC
N
f-1586420743
f
GR
GS
[1.00215 0 0 1 123.13972 138.00938] CT
0.302 GC
N
f-1586420743
f
GR
GS
[1.00215 0 0 1 126.64547 140.56122] CT
0.302 GC
N
f-1586420743
f
GR
GS
[1.00215 0 0 1 120.23494 125.26473] CT
0.302 GC
N
f-1586420743
f
GR
GS
[1.00215 0 0 1 126.64499 123.25508] CT
0.302 GC
N
f-1586420743
f
GR
GS
[1.00215 0 0 1 124.16063 169.55791] CT
0.302 GC
N
f-1586420743
f
GR
GS
[1.00215 0 0 1 122.27879 152.25131] CT
0.302 GC
N
f-1586420743
f
GR
GS
[1.00215 0 0 1 116.31138 109.83052] CT
0.302 GC
N
f-1586420743
f
GR
GS
[1.00215 0 0 1 125.9901 113.75143] CT
0.302 GC
N
f-1586420743
f
GR
GS
[1.00215 0 0 1 119.9552 159.67758] CT
0.302 GC
N
f-1586420743
f
GR
GS
[1.00215 0 0 1 125.77041 141.21097] CT
0.302 GC
N
f-1586420743
f
GR
GS
[1.00215 0 0 1 127.02125 109.9627] CT
0.302 GC
N
f-1586420743
f
GR
GS
[1.00215 0 0 1 117.06418 132.99861] CT
0.302 GC
N
f-1586420743
f
GR
GS
[1.00215 0 0 1 124.60997 145.7085] CT
0.302 GC
N
f-1586420743
f
GR
GS
[1.00215 0 0 1 123.47893 94.95926] CT
0.302 GC
N
f-1586420743
f
GR
GS
[1.00215 0 0 1 119.14416 86.82552] CT
0.302 GC
N
f-1586420743
f
GR
GS
[1.00215 0 0 1 127.86075 39.56287] CT
0.302 GC
N
f-1586420743
f
GR
GS
[1.00215 0 0 1 122.46253 73.96355] CT
0.302 GC
N
f-1586420743
f
GR
GS
[1.00215 0 0 1 119.81738 163.06319] CT
0.302 GC
N
f-1586420743
f
GR
GS
[1.00215 0 0 1 117.91181 70.39944] CT
0.302 GC
N
f-1586420743
f
GR
GS
[1.00215 0 0 1 119.25392 81.00378] CT
0.302 GC
N
f-1586420743
f
GR
GS
[1.00215 0 0 1 121.54379 106.58425] CT
0.302 GC
N
f-1586420743
f
GR
GS
[1.00215 0 0 1 126.07204 112.29477] CT
0.302 GC
N
f-1586420743
f
GR
GS
[1.00215 0 0 1 119.02462 134.71486] CT
0.302 GC
N
f-1586420743
f
GR
GS
[1.00215 0 0 1 121.21027 138.17442] CT
0.302 GC
N
f-1586420743
f
GR
GS
[1.00215 0 0 1 124.58098 102.44571] CT
0.302 GC
N
f-1586420743
f
GR
GS
[1.00215 0 0 1 0 0] CT
1 0.6 0.6 RC
N
/f-926704978{167.66 179 M
167.66 160.801 L
141.74 160.801 L
141.74 179 L
cp}def
f-926704978
f
GR
GS
[1.00215 0 0 1 153.87507 164.85629] CT
0.302 GC
N
f-1586420743
f
GR
GS
[1.00215 0 0 1 158.8347 166.93291] CT
0.302 GC
N
f-1586420743
f
GR
GS
[1.00215 0 0 1 157.22839 145.40776] CT
0.302 GC
N
f-1586420743
f
GR
GS
[1.00215 0 0 1 151.36612 177.05183] CT
0.302 GC
N
f-1586420743
f
GR
GS
[1.00215 0 0 1 149.81479 160.5287] CT
0.302 GC
N
f-1586420743
f
GR
GS
[1.00215 0 0 1 157.60136 175.41949] CT
0.302 GC
N
f-1586420743
f
GR
GS
[1.00215 0 0 1 153.14988 174.53862] CT
0.302 GC
N
f-1586420743
f
GR
GS
[1.00215 0 0 1 155.66167 177.94376] CT
0.302 GC
N
f-1586420743
f
GR
GS
[1.00215 0 0 1 159.6035 172.49854] CT
0.302 GC
N
f-1586420743
f
GR
GS
[1.00215 0 0 1 157.87481 142.39606] CT
0.302 GC
N
f-1586420743
f
GR
GS
[1.00215 0 0 1 155.50773 165.22112] CT
0.302 GC
N
f-1586420743
f
GR
GS
[1.00215 0 0 1 157.49466 188.88023] CT
0.302 GC
N
f-1586420743
f
GR
GS
[1.00215 0 0 1 159.51527 164.30029] CT
0.302 GC
N
f-1586420743
f
GR
GS
[1.00215 0 0 1 151.58744 162.10637] CT
0.302 GC
N
f-1586420743
f
GR
GS
[1.00215 0 0 1 152.45513 128.23946] CT
0.302 GC
N
f-1586420743
f
GR
GS
[1.00215 0 0 1 154.20369 150.79686] CT
0.302 GC
N
f-1586420743
f
GR
GS
[1.00215 0 0 1 161.19755 153.36877] CT
0.302 GC
N
f-1586420743
f
GR
GS
[1.00215 0 0 1 149.94173 162.34776] CT
0.302 GC
N
f-1586420743
f
GR
GS
[1.00215 0 0 1 148.87504 180.5705] CT
0.302 GC
N
f-1586420743
f
GR
GS
[1.00215 0 0 1 158.68822 187.05785] CT
0.302 GC
N
f-1586420743
f
GR
GS
[1.00215 0 0 1 151.68234 147.8322] CT
0.302 GC
N
f-1586420743
f
GR
GS
[1.00215 0 0 1 160.25998 170.08318] CT
0.302 GC
N
f-1586420743
f
GR
GS
[1.00215 0 0 1 154.59145 175.26311] CT
0.302 GC
N
f-1586420743
f
GR
GS
[1.00215 0 0 1 151.59548 163.32899] CT
0.302 GC
N
f-1586420743
f
GR
GS
[1.00215 0 0 1 155.71689 152.23586] CT
0.302 GC
N
f-1586420743
f
GR
GS
[1.00215 0 0 1 152.42045 177.0253] CT
0.302 GC
N
f-1586420743
f
GR
GS
[1.00215 0 0 1 149.29227 120.22905] CT
0.302 GC
N
f-1586420743
f
GR
GS
[1.00215 0 0 1 149.87798 179.94316] CT
0.302 GC
N
f-1586420743
f
GR
GS
[1.00215 0 0 1 152.18517 137.46494] CT
0.302 GC
N
f-1586420743
f
GR
GS
[1.00215 0 0 1 148.9646 136.57907] CT
0.302 GC
N
f-1586420743
f
GR
GS
[1.00215 0 0 1 149.79253 157.672] CT
0.302 GC
N
f-1586420743
f
GR
GS
[1.00215 0 0 1 155.63736 169.56706] CT
0.302 GC
N
f-1586420743
f
GR
GS
[1.00215 0 0 1 149.41807 181.81114] CT
0.302 GC
N
f-1586420743
f
GR
GS
[1.00215 0 0 1 159.48017 168.07338] CT
0.302 GC
N
f-1586420743
f
GR
GS
[1.00215 0 0 1 159.91626 139.96111] CT
0.302 GC
N
f-1586420743
f
GR
GS
[1.00215 0 0 1 151.42694 141.25357] CT
0.302 GC
N
f-1586420743
f
GR
GS
[1.00215 0 0 1 154.89846 195.87689] CT
0.302 GC
N
f-1586420743
f
GR
GS
[1.00215 0 0 1 149.59687 143.86414] CT
0.302 GC
N
f-1586420743
f
GR
GS
[1.00215 0 0 1 155.86631 146.2469] CT
0.302 GC
N
f-1586420743
f
GR
GS
[1.00215 0 0 1 156.58897 156.13434] CT
0.302 GC
N
f-1586420743
f
GR
GS
[1.00215 0 0 1 160.77566 187.5186] CT
0.302 GC
N
f-1586420743
f
GR
GS
[1.00215 0 0 1 152.80137 187.93884] CT
0.302 GC
N
f-1586420743
f
GR
GS
[1.00215 0 0 1 161.47835 180.26399] CT
0.302 GC
N
f-1586420743
f
GR
GS
[1.00215 0 0 1 157.45043 129.64679] CT
0.302 GC
N
f-1586420743
f
GR
GS
[1.00215 0 0 1 160.50763 149.71187] CT
0.302 GC
N
f-1586420743
f
GR
GS
[1.00215 0 0 1 151.80874 165.12421] CT
0.302 GC
N
f-1586420743
f
GR
GS
[1.00215 0 0 1 152.69809 125.09019] CT
0.302 GC
N
f-1586420743
f
GR
GS
[1.00215 0 0 1 149.28086 161.2245] CT
0.302 GC
N
f-1586420743
f
GR
GS
[1.00215 0 0 1 161.092 152.21916] CT
0.302 GC
N
f-1586420743
f
GR
GS
[1.00215 0 0 1 148.90099 152.66637] CT
0.302 GC
N
f-1586420743
f
GR
GS
[1.00215 0 0 1 156.83461 155.18437] CT
0.302 GC
N
f-1586420743
f
GR
GS
[1.00215 0 0 1 150.36627 156.41125] CT
0.302 GC
N
f-1586420743
f
GR
GS
[1.00215 0 0 1 156.33351 158.54486] CT
0.302 GC
N
f-1586420743
f
GR
%%Trailer
%%Pages: 1
%%EOF
