%!PS-Adobe-3.0 EPSF-3.0
%%Creator: (MATLAB, The Mathworks, Inc. Version 9.8.0.1323502 \(R2020a\). Operating System: Mac OS X)
%%Title: /Users/kosciessa/Desktop/mntTardisLNDG/LNDG/stateswitch/stsw_multimodal/figures/l1byage/l1comp_theta.eps
%%CreationDate: 2022-03-02T14:36:42
%%Pages: (atend)
%%BoundingBox:     4     0   180   275
%%LanguageLevel: 3
%%EndComments
%%BeginProlog
%%BeginResource: procset (Apache XML Graphics Std ProcSet) 1.2 0
%%Version: 1.2 0
%%Copyright: (Copyright 2001-2003,2010 The Apache Software Foundation. License terms: http://www.apache.org/licenses/LICENSE-2.0)
/bd{bind def}bind def
/ld{load def}bd
/GR/grestore ld
/GS/gsave ld
/RM/rmoveto ld
/C/curveto ld
/t/show ld
/L/lineto ld
/ML/setmiterlimit ld
/CT/concat ld
/f/fill ld
/N/newpath ld
/S/stroke ld
/CC/setcmykcolor ld
/A/ashow ld
/cp/closepath ld
/RC/setrgbcolor ld
/LJ/setlinejoin ld
/GC/setgray ld
/LW/setlinewidth ld
/M/moveto ld
/re {4 2 roll M
1 index 0 rlineto
0 exch rlineto
neg 0 rlineto
cp } bd
/_ctm matrix def
/_tm matrix def
/BT { _ctm currentmatrix pop matrix _tm copy pop 0 0 moveto } bd
/ET { _ctm setmatrix } bd
/iTm { _ctm setmatrix _tm concat } bd
/Tm { _tm astore pop iTm 0 0 moveto } bd
/ux 0.0 def
/uy 0.0 def
/F {
  /Tp exch def
  /Tf exch def
  Tf findfont Tp scalefont setfont
  /cf Tf def  /cs Tp def
} bd
/ULS {currentpoint /uy exch def /ux exch def} bd
/ULE {
  /Tcx currentpoint pop def
  gsave
  newpath
  cf findfont cs scalefont dup
  /FontMatrix get 0 get /Ts exch def /FontInfo get dup
  /UnderlinePosition get Ts mul /To exch def
  /UnderlineThickness get Ts mul /Tt exch def
  ux uy To add moveto  Tcx uy To add lineto
  Tt setlinewidth stroke
  grestore
} bd
/OLE {
  /Tcx currentpoint pop def
  gsave
  newpath
  cf findfont cs scalefont dup
  /FontMatrix get 0 get /Ts exch def /FontInfo get dup
  /UnderlinePosition get Ts mul /To exch def
  /UnderlineThickness get Ts mul /Tt exch def
  ux uy To add cs add moveto Tcx uy To add cs add lineto
  Tt setlinewidth stroke
  grestore
} bd
/SOE {
  /Tcx currentpoint pop def
  gsave
  newpath
  cf findfont cs scalefont dup
  /FontMatrix get 0 get /Ts exch def /FontInfo get dup
  /UnderlinePosition get Ts mul /To exch def
  /UnderlineThickness get Ts mul /Tt exch def
  ux uy To add cs 10 mul 26 idiv add moveto Tcx uy To add cs 10 mul 26 idiv add lineto
  Tt setlinewidth stroke
  grestore
} bd
/QT {
/Y22 exch store
/X22 exch store
/Y21 exch store
/X21 exch store
currentpoint
/Y21 load 2 mul add 3 div exch
/X21 load 2 mul add 3 div exch
/X21 load 2 mul /X22 load add 3 div
/Y21 load 2 mul /Y22 load add 3 div
/X22 load /Y22 load curveto
} bd
/SSPD {
dup length /d exch dict def
{
/v exch def
/k exch def
currentpagedevice k known {
/cpdv currentpagedevice k get def
v cpdv ne {
/upd false def
/nullv v type /nulltype eq def
/nullcpdv cpdv type /nulltype eq def
nullv nullcpdv or
{
/upd true def
} {
/sametype v type cpdv type eq def
sametype {
v type /arraytype eq {
/vlen v length def
/cpdvlen cpdv length def
vlen cpdvlen eq {
0 1 vlen 1 sub {
/i exch def
/obj v i get def
/cpdobj cpdv i get def
obj cpdobj ne {
/upd true def
exit
} if
} for
} {
/upd true def
} ifelse
} {
v type /dicttype eq {
v {
/dv exch def
/dk exch def
/cpddv cpdv dk get def
dv cpddv ne {
/upd true def
exit
} if
} forall
} {
/upd true def
} ifelse
} ifelse
} if
} ifelse
upd true eq {
d k v put
} if
} if
} if
} forall
d length 0 gt {
d setpagedevice
} if
} bd
/RE { % /NewFontName [NewEncodingArray] /FontName RE -
  findfont dup length dict begin
  {
    1 index /FID ne
    {def} {pop pop} ifelse
  } forall
  /Encoding exch def
  /FontName 1 index def
  currentdict definefont pop
  end
} bind def
%%EndResource
%%BeginResource: procset (Apache XML Graphics EPS ProcSet) 1.0 0
%%Version: 1.0 0
%%Copyright: (Copyright 2002-2003 The Apache Software Foundation. License terms: http://www.apache.org/licenses/LICENSE-2.0)
/BeginEPSF { %def
/b4_Inc_state save def         % Save state for cleanup
/dict_count countdictstack def % Count objects on dict stack
/op_count count 1 sub def      % Count objects on operand stack
userdict begin                 % Push userdict on dict stack
/showpage { } def              % Redefine showpage, { } = null proc
0 setgray 0 setlinecap         % Prepare graphics state
1 setlinewidth 0 setlinejoin
10 setmiterlimit [ ] 0 setdash newpath
/languagelevel where           % If level not equal to 1 then
{pop languagelevel             % set strokeadjust and
1 ne                           % overprint to their defaults.
{false setstrokeadjust false setoverprint
} if
} if
} bd
/EndEPSF { %def
count op_count sub {pop} repeat            % Clean up stacks
countdictstack dict_count sub {end} repeat
b4_Inc_state restore
} bd
%%EndResource
%FOPBeginFontDict
%%IncludeResource: font Courier-Oblique
%%IncludeResource: font Courier-BoldOblique
%%IncludeResource: font Courier-Bold
%%IncludeResource: font ZapfDingbats
%%IncludeResource: font Symbol
%%IncludeResource: font Helvetica
%%IncludeResource: font Helvetica-Oblique
%%IncludeResource: font Helvetica-Bold
%%IncludeResource: font Helvetica-BoldOblique
%%IncludeResource: font Times-Roman
%%IncludeResource: font Times-Italic
%%IncludeResource: font Times-Bold
%%IncludeResource: font Times-BoldItalic
%%IncludeResource: font Courier
%FOPEndFontDict
%%BeginResource: encoding WinAnsiEncoding
/WinAnsiEncoding [
/.notdef /.notdef /.notdef /.notdef /.notdef
/.notdef /.notdef /.notdef /.notdef /.notdef
/.notdef /.notdef /.notdef /.notdef /.notdef
/.notdef /.notdef /.notdef /.notdef /.notdef
/.notdef /.notdef /.notdef /.notdef /.notdef
/.notdef /.notdef /.notdef /.notdef /.notdef
/.notdef /.notdef /space /exclam /quotedbl
/numbersign /dollar /percent /ampersand /quotesingle
/parenleft /parenright /asterisk /plus /comma
/hyphen /period /slash /zero /one
/two /three /four /five /six
/seven /eight /nine /colon /semicolon
/less /equal /greater /question /at
/A /B /C /D /E
/F /G /H /I /J
/K /L /M /N /O
/P /Q /R /S /T
/U /V /W /X /Y
/Z /bracketleft /backslash /bracketright /asciicircum
/underscore /quoteleft /a /b /c
/d /e /f /g /h
/i /j /k /l /m
/n /o /p /q /r
/s /t /u /v /w
/x /y /z /braceleft /bar
/braceright /asciitilde /bullet /Euro /bullet
/quotesinglbase /florin /quotedblbase /ellipsis /dagger
/daggerdbl /circumflex /perthousand /Scaron /guilsinglleft
/OE /bullet /Zcaron /bullet /bullet
/quoteleft /quoteright /quotedblleft /quotedblright /bullet
/endash /emdash /asciitilde /trademark /scaron
/guilsinglright /oe /bullet /zcaron /Ydieresis
/space /exclamdown /cent /sterling /currency
/yen /brokenbar /section /dieresis /copyright
/ordfeminine /guillemotleft /logicalnot /sfthyphen /registered
/macron /degree /plusminus /twosuperior /threesuperior
/acute /mu /paragraph /middot /cedilla
/onesuperior /ordmasculine /guillemotright /onequarter /onehalf
/threequarters /questiondown /Agrave /Aacute /Acircumflex
/Atilde /Adieresis /Aring /AE /Ccedilla
/Egrave /Eacute /Ecircumflex /Edieresis /Igrave
/Iacute /Icircumflex /Idieresis /Eth /Ntilde
/Ograve /Oacute /Ocircumflex /Otilde /Odieresis
/multiply /Oslash /Ugrave /Uacute /Ucircumflex
/Udieresis /Yacute /Thorn /germandbls /agrave
/aacute /acircumflex /atilde /adieresis /aring
/ae /ccedilla /egrave /eacute /ecircumflex
/edieresis /igrave /iacute /icircumflex /idieresis
/eth /ntilde /ograve /oacute /ocircumflex
/otilde /odieresis /divide /oslash /ugrave
/uacute /ucircumflex /udieresis /yacute /thorn
/ydieresis
] def
%%EndResource
%FOPBeginFontReencode
/Courier-Oblique findfont
dup length dict begin
  {1 index /FID ne {def} {pop pop} ifelse} forall
  /Encoding WinAnsiEncoding def
  currentdict
end
/Courier-Oblique exch definefont pop
/Courier-BoldOblique findfont
dup length dict begin
  {1 index /FID ne {def} {pop pop} ifelse} forall
  /Encoding WinAnsiEncoding def
  currentdict
end
/Courier-BoldOblique exch definefont pop
/Courier-Bold findfont
dup length dict begin
  {1 index /FID ne {def} {pop pop} ifelse} forall
  /Encoding WinAnsiEncoding def
  currentdict
end
/Courier-Bold exch definefont pop
/Helvetica findfont
dup length dict begin
  {1 index /FID ne {def} {pop pop} ifelse} forall
  /Encoding WinAnsiEncoding def
  currentdict
end
/Helvetica exch definefont pop
/Helvetica-Oblique findfont
dup length dict begin
  {1 index /FID ne {def} {pop pop} ifelse} forall
  /Encoding WinAnsiEncoding def
  currentdict
end
/Helvetica-Oblique exch definefont pop
/Helvetica-Bold findfont
dup length dict begin
  {1 index /FID ne {def} {pop pop} ifelse} forall
  /Encoding WinAnsiEncoding def
  currentdict
end
/Helvetica-Bold exch definefont pop
/Helvetica-BoldOblique findfont
dup length dict begin
  {1 index /FID ne {def} {pop pop} ifelse} forall
  /Encoding WinAnsiEncoding def
  currentdict
end
/Helvetica-BoldOblique exch definefont pop
/Times-Roman findfont
dup length dict begin
  {1 index /FID ne {def} {pop pop} ifelse} forall
  /Encoding WinAnsiEncoding def
  currentdict
end
/Times-Roman exch definefont pop
/Times-Italic findfont
dup length dict begin
  {1 index /FID ne {def} {pop pop} ifelse} forall
  /Encoding WinAnsiEncoding def
  currentdict
end
/Times-Italic exch definefont pop
/Times-Bold findfont
dup length dict begin
  {1 index /FID ne {def} {pop pop} ifelse} forall
  /Encoding WinAnsiEncoding def
  currentdict
end
/Times-Bold exch definefont pop
/Times-BoldItalic findfont
dup length dict begin
  {1 index /FID ne {def} {pop pop} ifelse} forall
  /Encoding WinAnsiEncoding def
  currentdict
end
/Times-BoldItalic exch definefont pop
/Courier findfont
dup length dict begin
  {1 index /FID ne {def} {pop pop} ifelse} forall
  /Encoding WinAnsiEncoding def
  currentdict
end
/Courier exch definefont pop
%FOPEndFontReencode
%%EndProlog
%%Page: 1 1
%%PageBoundingBox: 0 0 198 283
%%BeginPageSetup
[1 0 0 -1 0 283] CT
%%EndPageSetup
GS
[1.00215 0 0 1 0 0] CT
1 GC
N
0 0 198 283 re
f
GR
GS
[1.00215 0 0 1 0 0] CT
1 GC
N
0 0 198 283 re
f
GR
GS
[1.00215 0 0 1 0 0] CT
1 GC
N
63.5 228 M
179 228 L
179 32 L
63.5 32 L
cp
f
GR
GS
[1.00215 0 0 1 0 0] CT
0.149 GC
2 setlinecap
1 LJ
0.5 LW
N
63.5 228 M
179 228 L
S
GR
GS
[1.00215 0 0 1 0 0] CT
0.149 GC
2 setlinecap
1 LJ
0.5 LW
N
98.15 228 M
98.15 226.04 L
S
GR
GS
[1.00215 0 0 1 0 0] CT
0.149 GC
2 setlinecap
1 LJ
0.5 LW
N
144.35 228 M
144.35 226.04 L
S
GR
GS
[1.00215 0 0 1 98.36078 234] CT
0.149 GC
/Helvetica 20 F
GS
[1 0 0 1 0 0] CT
-13 20 moveto 
1 -1 scale
(YA) t 
GR
GR
GS
[1.00215 0 0 1 144.66 234] CT
0.149 GC
/Helvetica 20 F
GS
[1 0 0 1 0 0] CT
-14.5 20 moveto 
1 -1 scale
(OA) t 
GR
GR
GS
[1.00215 0 0 1 121.51044 259] CT
0.149 GC
/Helvetica 20 F
GS
[1 0 0 1 0 0] CT
-49 20 moveto 
1 -1 scale
(Age Group) t 
GR
GR
GS
[1.00215 0 0 1 0 0] CT
0.149 GC
2 setlinecap
1 LJ
0.5 LW
N
63.5 228 M
63.5 32 L
S
GR
GS
[1.00215 0 0 1 0 0] CT
0.149 GC
2 setlinecap
1 LJ
0.5 LW
N
63.5 228 M
65.46 228 L
S
GR
GS
[1.00215 0 0 1 0 0] CT
0.149 GC
2 setlinecap
1 LJ
0.5 LW
N
63.5 179 M
65.46 179 L
S
GR
GS
[1.00215 0 0 1 0 0] CT
0.149 GC
2 setlinecap
1 LJ
0.5 LW
N
63.5 130 M
65.46 130 L
S
GR
GS
[1.00215 0 0 1 0 0] CT
0.149 GC
2 setlinecap
1 LJ
0.5 LW
N
63.5 81 M
65.46 81 L
S
GR
GS
[1.00215 0 0 1 0 0] CT
0.149 GC
2 setlinecap
1 LJ
0.5 LW
N
63.5 32 M
65.46 32 L
S
GR
GS
[1.00215 0 0 1 57.62348 228] CT
0.149 GC
/Helvetica 20 F
GS
[1 0 0 1 0 0] CT
-31 7.5 moveto 
1 -1 scale
(-20) t 
GR
GR
GS
[1.00215 0 0 1 57.62348 179] CT
0.149 GC
/Helvetica 20 F
GS
[1 0 0 1 0 0] CT
-31 7.5 moveto 
1 -1 scale
(-15) t 
GR
GR
GS
[1.00215 0 0 1 57.62348 130] CT
0.149 GC
/Helvetica 20 F
GS
[1 0 0 1 0 0] CT
-31 7.5 moveto 
1 -1 scale
(-10) t 
GR
GR
GS
[1.00215 0 0 1 57.62348 81] CT
0.149 GC
/Helvetica 20 F
GS
[1 0 0 1 0 0] CT
-19 7.5 moveto 
1 -1 scale
(-5) t 
GR
GR
GS
[1.00215 0 0 1 57.62348 32] CT
0.149 GC
/Helvetica 20 F
GS
[1 0 0 1 0 0] CT
-12 7.5 moveto 
1 -1 scale
(0) t 
GR
GR
GS
[0 -1 1.00215 0 24.05154 129.99991] CT
0.149 GC
/Helvetica 20 F
GS
[1 0 0 1 0 0] CT
-33.5 -5 moveto 
1 -1 scale
(theta l1) t 
GR
GR
GS
[1.00215 0 0 1 121.5105 29.25] CT
/Helvetica-Bold 22 F
GS
[1 0 0 1 0 0] CT
-58 -5 moveto 
1 -1 scale
(p = 2.5e-11) t 
GR
GR
GS
[1.00215 0 0 1 0 0] CT
0.149 GC
1 LJ
0.5 LW
N
63.5 32 M
179 32 L
S
GR
GS
[1.00215 0 0 1 0 0] CT
0.6 0.8 1 RC
N
79.67 32 M
79.67 173.728 L
116.63 173.728 L
116.63 32 L
cp
f
GR
GS
[1.00215 0 0 1 100.94175 183.96255] CT
0.302 GC
N
2.236 0 M
2.236 -1.235 1.235 -2.236 0 -2.236 C
-1.235 -2.236 -2.236 -1.235 -2.236 0 C
-2.236 1.235 -1.235 2.236 0 2.236 C
1.235 2.236 2.236 1.235 2.236 0 C
cp
f
GR
GS
[1.00215 0 0 1 97.91558 176.8425] CT
0.302 GC
N
/f-1586420743{2.236 0 M
2.236 -1.235 1.235 -2.236 0 -2.236 C
-1.235 -2.236 -2.236 -1.235 -2.236 0 C
-2.236 1.235 -1.235 2.236 0 2.236 C
1.235 2.236 2.236 1.235 2.236 0 C
cp}def
f-1586420743
f
GR
GS
[1.00215 0 0 1 104.75309 185.68857] CT
0.302 GC
N
f-1586420743
f
GR
GS
[1.00215 0 0 1 107.39455 176.91013] CT
0.302 GC
N
f-1586420743
f
GR
GS
[1.00215 0 0 1 103.06212 177.58127] CT
0.302 GC
N
f-1586420743
f
GR
GS
[1.00215 0 0 1 103.4143 167.23956] CT
0.302 GC
N
f-1586420743
f
GR
GS
[1.00215 0 0 1 89.19032 178.2514] CT
0.302 GC
N
f-1586420743
f
GR
GS
[1.00215 0 0 1 101.56405 176.87326] CT
0.302 GC
N
f-1586420743
f
GR
GS
[1.00215 0 0 1 95.50437 194.60579] CT
0.302 GC
N
f-1586420743
f
GR
GS
[1.00215 0 0 1 95.55012 167.66833] CT
0.302 GC
N
f-1586420743
f
GR
GS
[1.00215 0 0 1 107.00824 185.99361] CT
0.302 GC
N
f-1586420743
f
GR
GS
[1.00215 0 0 1 102.95185 162.79045] CT
0.302 GC
N
f-1586420743
f
GR
GS
[1.00215 0 0 1 93.32339 178.67514] CT
0.302 GC
N
f-1586420743
f
GR
GS
[1.00215 0 0 1 105.72816 165.18504] CT
0.302 GC
N
f-1586420743
f
GR
GS
[1.00215 0 0 1 91.76615 175.04953] CT
0.302 GC
N
f-1586420743
f
GR
GS
[1.00215 0 0 1 92.04322 156.26755] CT
0.302 GC
N
f-1586420743
f
GR
GS
[1.00215 0 0 1 96.76925 178.24205] CT
0.302 GC
N
f-1586420743
f
GR
GS
[1.00215 0 0 1 92.11531 169.34256] CT
0.302 GC
N
f-1586420743
f
GR
GS
[1.00215 0 0 1 90.21166 174.61086] CT
0.302 GC
N
f-1586420743
f
GR
GS
[1.00215 0 0 1 95.15632 180.00113] CT
0.302 GC
N
f-1586420743
f
GR
GS
[1.00215 0 0 1 93.80034 167.30899] CT
0.302 GC
N
f-1586420743
f
GR
GS
[1.00215 0 0 1 98.87329 163.75873] CT
0.302 GC
N
f-1586420743
f
GR
GS
[1.00215 0 0 1 92.41041 168.62486] CT
0.302 GC
N
f-1586420743
f
GR
GS
[1.00215 0 0 1 95.17711 169.45663] CT
0.302 GC
N
f-1586420743
f
GR
GS
[1.00215 0 0 1 101.85132 183.99898] CT
0.302 GC
N
f-1586420743
f
GR
GS
[1.00215 0 0 1 102.70893 174.30365] CT
0.302 GC
N
f-1586420743
f
GR
GS
[1.00215 0 0 1 105.70146 160.51901] CT
0.302 GC
N
f-1586420743
f
GR
GS
[1.00215 0 0 1 100.78594 189.53816] CT
0.302 GC
N
f-1586420743
f
GR
GS
[1.00215 0 0 1 93.48931 179.83763] CT
0.302 GC
N
f-1586420743
f
GR
GS
[1.00215 0 0 1 90.72742 165.76953] CT
0.302 GC
N
f-1586420743
f
GR
GS
[1.00215 0 0 1 103.6451 160.34683] CT
0.302 GC
N
f-1586420743
f
GR
GS
[1.00215 0 0 1 91.74125 171.94794] CT
0.302 GC
N
f-1586420743
f
GR
GS
[1.00215 0 0 1 106.82309 174.88934] CT
0.302 GC
N
f-1586420743
f
GR
GS
[1.00215 0 0 1 97.25644 168.07947] CT
0.302 GC
N
f-1586420743
f
GR
GS
[1.00215 0 0 1 92.69022 185.69397] CT
0.302 GC
N
f-1586420743
f
GR
GS
[1.00215 0 0 1 92.35342 165.62546] CT
0.302 GC
N
f-1586420743
f
GR
GS
[1.00215 0 0 1 107.61678 190.10876] CT
0.302 GC
N
f-1586420743
f
GR
GS
[1.00215 0 0 1 101.29023 166.98065] CT
0.302 GC
N
f-1586420743
f
GR
GS
[1.00215 0 0 1 98.62859 171.99294] CT
0.302 GC
N
f-1586420743
f
GR
GS
[1.00215 0 0 1 89.69111 164.51608] CT
0.302 GC
N
f-1586420743
f
GR
GS
[1.00215 0 0 1 90.61711 165.63538] CT
0.302 GC
N
f-1586420743
f
GR
GS
[1.00215 0 0 1 98.78681 175.8768] CT
0.302 GC
N
f-1586420743
f
GR
GS
[1.00215 0 0 1 0 0] CT
0.6 0.8 1 RC
N
/f-1285059364{125.87 32 M
125.87 189.937 L
162.83 189.937 L
162.83 32 L
cp}def
f-1285059364
f
GR
GS
[1.00215 0 0 1 151.63347 193.84198] CT
0.302 GC
N
f-1586420743
f
GR
GS
[1.00215 0 0 1 148.97795 170.61226] CT
0.302 GC
N
f-1586420743
f
GR
GS
[1.00215 0 0 1 137.84935 184.9281] CT
0.302 GC
N
f-1586420743
f
GR
GS
[1.00215 0 0 1 145.98219 186.67093] CT
0.302 GC
N
f-1586420743
f
GR
GS
[1.00215 0 0 1 152.9979 206.23567] CT
0.302 GC
N
f-1586420743
f
GR
GS
[1.00215 0 0 1 152.2241 197.61275] CT
0.302 GC
N
f-1586420743
f
GR
GS
[1.00215 0 0 1 148.54387 201.0983] CT
0.302 GC
N
f-1586420743
f
GR
GS
[1.00215 0 0 1 143.02438 206.93919] CT
0.302 GC
N
f-1586420743
f
GR
GS
[1.00215 0 0 1 150.19867 209.03168] CT
0.302 GC
N
f-1586420743
f
GR
GS
[1.00215 0 0 1 149.87712 185.37042] CT
0.302 GC
N
f-1586420743
f
GR
GS
[1.00215 0 0 1 140.78727 202.86542] CT
0.302 GC
N
f-1586420743
f
GR
GS
[1.00215 0 0 1 143.01233 217.37912] CT
0.302 GC
N
f-1586420743
f
GR
GS
[1.00215 0 0 1 151.0925 190.13219] CT
0.302 GC
N
f-1586420743
f
GR
GS
[1.00215 0 0 1 145.92098 184.32449] CT
0.302 GC
N
f-1586420743
f
GR
GS
[1.00215 0 0 1 153.30034 203.08215] CT
0.302 GC
N
f-1586420743
f
GR
GS
[1.00215 0 0 1 142.78141 188.67865] CT
0.302 GC
N
f-1586420743
f
GR
GS
[1.00215 0 0 1 143.19107 187.77274] CT
0.302 GC
N
f-1586420743
f
GR
GS
[1.00215 0 0 1 144.99902 199.94272] CT
0.302 GC
N
f-1586420743
f
GR
GS
[1.00215 0 0 1 144.77739 190.8638] CT
0.302 GC
N
f-1586420743
f
GR
GS
[1.00215 0 0 1 136.75622 189.50217] CT
0.302 GC
N
f-1586420743
f
GR
GS
[1.00215 0 0 1 141.73495 195.15448] CT
0.302 GC
N
f-1586420743
f
GR
GS
[1.00215 0 0 1 142.8551 204.91518] CT
0.302 GC
N
f-1586420743
f
GR
GS
[1.00215 0 0 1 153.6002 209.71863] CT
0.302 GC
N
f-1586420743
f
GR
GS
[1.00215 0 0 1 143.55793 174.59053] CT
0.302 GC
N
f-1586420743
f
GR
GS
[1.00215 0 0 1 142.82865 166.97125] CT
0.302 GC
N
f-1586420743
f
GR
GS
[1.00215 0 0 1 149.25625 197.92166] CT
0.302 GC
N
f-1586420743
f
GR
GS
[1.00215 0 0 1 145.5004 183.73418] CT
0.302 GC
N
f-1586420743
f
GR
GS
[1.00215 0 0 1 152.95002 190.85063] CT
0.302 GC
N
f-1586420743
f
GR
GS
[1.00215 0 0 1 140.7695 176.05807] CT
0.302 GC
N
f-1586420743
f
GR
GS
[1.00215 0 0 1 144.5708 183.29373] CT
0.302 GC
N
f-1586420743
f
GR
GS
[1.00215 0 0 1 138.32183 182.74411] CT
0.302 GC
N
f-1586420743
f
GR
GS
[1.00215 0 0 1 152.34257 207.68086] CT
0.302 GC
N
f-1586420743
f
GR
GS
[1.00215 0 0 1 150.28027 186.60057] CT
0.302 GC
N
f-1586420743
f
GR
GS
[1.00215 0 0 1 141.90632 191.93831] CT
0.302 GC
N
f-1586420743
f
GR
GS
[1.00215 0 0 1 138.92178 183.13873] CT
0.302 GC
N
f-1586420743
f
GR
GS
[1.00215 0 0 1 138.75385 175.32355] CT
0.302 GC
N
f-1586420743
f
GR
GS
[1.00215 0 0 1 140.45473 178.86342] CT
0.302 GC
N
f-1586420743
f
GR
GS
[1.00215 0 0 1 148.11531 177.45088] CT
0.302 GC
N
f-1586420743
f
GR
GS
[1.00215 0 0 1 140.85671 189.54155] CT
0.302 GC
N
f-1586420743
f
GR
GS
[1.00215 0 0 1 142.26012 170.20853] CT
0.302 GC
N
f-1586420743
f
GR
GS
[1.00215 0 0 1 147.26511 182.79089] CT
0.302 GC
N
f-1586420743
f
GR
GS
[1.00215 0 0 1 135.95766 198.62617] CT
0.302 GC
N
f-1586420743
f
GR
GS
[1.00215 0 0 1 142.15773 193.49263] CT
0.302 GC
N
f-1586420743
f
GR
GS
[1.00215 0 0 1 140.89024 181.73203] CT
0.302 GC
N
f-1586420743
f
GR
GS
[1.00215 0 0 1 138.52536 191.70711] CT
0.302 GC
N
f-1586420743
f
GR
GS
[1.00215 0 0 1 144.91373 197.86966] CT
0.302 GC
N
f-1586420743
f
GR
GS
[1.00215 0 0 1 146.78821 178.20161] CT
0.302 GC
N
f-1586420743
f
GR
GS
[1.00215 0 0 1 138.06391 191.79422] CT
0.302 GC
N
f-1586420743
f
GR
GS
[1.00215 0 0 1 137.03631 177.58687] CT
0.302 GC
N
f-1586420743
f
GR
GS
[1.00215 0 0 1 143.66481 181.36317] CT
0.302 GC
N
f-1586420743
f
GR
GS
[1.00215 0 0 1 139.45013 178.35062] CT
0.302 GC
N
f-1586420743
f
GR
GS
[1.00215 0 0 1 136.24005 197.18167] CT
0.302 GC
N
f-1586420743
f
GR
GS
[1.00215 0 0 1 137.37311 192.40497] CT
0.302 GC
N
f-1586420743
f
GR
%%Trailer
%%Pages: 1
%%EOF
