%!PS-Adobe-3.0 EPSF-3.0
%%Creator: (MATLAB, The Mathworks, Inc. Version 9.8.0.1323502 \(R2020a\). Operating System: Mac OS X)
%%Title: /Users/kosciessa/Desktop/mntTardisLNDG/LNDG/stateswitch/stsw_multimodal/figures/linearbyage/linearcomp_1f.eps
%%CreationDate: 2022-03-03T16:32:30
%%Pages: (atend)
%%BoundingBox:     4     0   180   275
%%LanguageLevel: 3
%%EndComments
%%BeginProlog
%%BeginResource: procset (Apache XML Graphics Std ProcSet) 1.2 0
%%Version: 1.2 0
%%Copyright: (Copyright 2001-2003,2010 The Apache Software Foundation. License terms: http://www.apache.org/licenses/LICENSE-2.0)
/bd{bind def}bind def
/ld{load def}bd
/GR/grestore ld
/GS/gsave ld
/RM/rmoveto ld
/C/curveto ld
/t/show ld
/L/lineto ld
/ML/setmiterlimit ld
/CT/concat ld
/f/fill ld
/N/newpath ld
/S/stroke ld
/CC/setcmykcolor ld
/A/ashow ld
/cp/closepath ld
/RC/setrgbcolor ld
/LJ/setlinejoin ld
/GC/setgray ld
/LW/setlinewidth ld
/M/moveto ld
/re {4 2 roll M
1 index 0 rlineto
0 exch rlineto
neg 0 rlineto
cp } bd
/_ctm matrix def
/_tm matrix def
/BT { _ctm currentmatrix pop matrix _tm copy pop 0 0 moveto } bd
/ET { _ctm setmatrix } bd
/iTm { _ctm setmatrix _tm concat } bd
/Tm { _tm astore pop iTm 0 0 moveto } bd
/ux 0.0 def
/uy 0.0 def
/F {
  /Tp exch def
  /Tf exch def
  Tf findfont Tp scalefont setfont
  /cf Tf def  /cs Tp def
} bd
/ULS {currentpoint /uy exch def /ux exch def} bd
/ULE {
  /Tcx currentpoint pop def
  gsave
  newpath
  cf findfont cs scalefont dup
  /FontMatrix get 0 get /Ts exch def /FontInfo get dup
  /UnderlinePosition get Ts mul /To exch def
  /UnderlineThickness get Ts mul /Tt exch def
  ux uy To add moveto  Tcx uy To add lineto
  Tt setlinewidth stroke
  grestore
} bd
/OLE {
  /Tcx currentpoint pop def
  gsave
  newpath
  cf findfont cs scalefont dup
  /FontMatrix get 0 get /Ts exch def /FontInfo get dup
  /UnderlinePosition get Ts mul /To exch def
  /UnderlineThickness get Ts mul /Tt exch def
  ux uy To add cs add moveto Tcx uy To add cs add lineto
  Tt setlinewidth stroke
  grestore
} bd
/SOE {
  /Tcx currentpoint pop def
  gsave
  newpath
  cf findfont cs scalefont dup
  /FontMatrix get 0 get /Ts exch def /FontInfo get dup
  /UnderlinePosition get Ts mul /To exch def
  /UnderlineThickness get Ts mul /Tt exch def
  ux uy To add cs 10 mul 26 idiv add moveto Tcx uy To add cs 10 mul 26 idiv add lineto
  Tt setlinewidth stroke
  grestore
} bd
/QT {
/Y22 exch store
/X22 exch store
/Y21 exch store
/X21 exch store
currentpoint
/Y21 load 2 mul add 3 div exch
/X21 load 2 mul add 3 div exch
/X21 load 2 mul /X22 load add 3 div
/Y21 load 2 mul /Y22 load add 3 div
/X22 load /Y22 load curveto
} bd
/SSPD {
dup length /d exch dict def
{
/v exch def
/k exch def
currentpagedevice k known {
/cpdv currentpagedevice k get def
v cpdv ne {
/upd false def
/nullv v type /nulltype eq def
/nullcpdv cpdv type /nulltype eq def
nullv nullcpdv or
{
/upd true def
} {
/sametype v type cpdv type eq def
sametype {
v type /arraytype eq {
/vlen v length def
/cpdvlen cpdv length def
vlen cpdvlen eq {
0 1 vlen 1 sub {
/i exch def
/obj v i get def
/cpdobj cpdv i get def
obj cpdobj ne {
/upd true def
exit
} if
} for
} {
/upd true def
} ifelse
} {
v type /dicttype eq {
v {
/dv exch def
/dk exch def
/cpddv cpdv dk get def
dv cpddv ne {
/upd true def
exit
} if
} forall
} {
/upd true def
} ifelse
} ifelse
} if
} ifelse
upd true eq {
d k v put
} if
} if
} if
} forall
d length 0 gt {
d setpagedevice
} if
} bd
/RE { % /NewFontName [NewEncodingArray] /FontName RE -
  findfont dup length dict begin
  {
    1 index /FID ne
    {def} {pop pop} ifelse
  } forall
  /Encoding exch def
  /FontName 1 index def
  currentdict definefont pop
  end
} bind def
%%EndResource
%%BeginResource: procset (Apache XML Graphics EPS ProcSet) 1.0 0
%%Version: 1.0 0
%%Copyright: (Copyright 2002-2003 The Apache Software Foundation. License terms: http://www.apache.org/licenses/LICENSE-2.0)
/BeginEPSF { %def
/b4_Inc_state save def         % Save state for cleanup
/dict_count countdictstack def % Count objects on dict stack
/op_count count 1 sub def      % Count objects on operand stack
userdict begin                 % Push userdict on dict stack
/showpage { } def              % Redefine showpage, { } = null proc
0 setgray 0 setlinecap         % Prepare graphics state
1 setlinewidth 0 setlinejoin
10 setmiterlimit [ ] 0 setdash newpath
/languagelevel where           % If level not equal to 1 then
{pop languagelevel             % set strokeadjust and
1 ne                           % overprint to their defaults.
{false setstrokeadjust false setoverprint
} if
} if
} bd
/EndEPSF { %def
count op_count sub {pop} repeat            % Clean up stacks
countdictstack dict_count sub {end} repeat
b4_Inc_state restore
} bd
%%EndResource
%FOPBeginFontDict
%%IncludeResource: font Courier-Oblique
%%IncludeResource: font Courier-BoldOblique
%%IncludeResource: font Courier-Bold
%%IncludeResource: font ZapfDingbats
%%IncludeResource: font Symbol
%%IncludeResource: font Helvetica
%%IncludeResource: font Helvetica-Oblique
%%IncludeResource: font Helvetica-Bold
%%IncludeResource: font Helvetica-BoldOblique
%%IncludeResource: font Times-Roman
%%IncludeResource: font Times-Italic
%%IncludeResource: font Times-Bold
%%IncludeResource: font Times-BoldItalic
%%IncludeResource: font Courier
%FOPEndFontDict
%%BeginResource: encoding WinAnsiEncoding
/WinAnsiEncoding [
/.notdef /.notdef /.notdef /.notdef /.notdef
/.notdef /.notdef /.notdef /.notdef /.notdef
/.notdef /.notdef /.notdef /.notdef /.notdef
/.notdef /.notdef /.notdef /.notdef /.notdef
/.notdef /.notdef /.notdef /.notdef /.notdef
/.notdef /.notdef /.notdef /.notdef /.notdef
/.notdef /.notdef /space /exclam /quotedbl
/numbersign /dollar /percent /ampersand /quotesingle
/parenleft /parenright /asterisk /plus /comma
/hyphen /period /slash /zero /one
/two /three /four /five /six
/seven /eight /nine /colon /semicolon
/less /equal /greater /question /at
/A /B /C /D /E
/F /G /H /I /J
/K /L /M /N /O
/P /Q /R /S /T
/U /V /W /X /Y
/Z /bracketleft /backslash /bracketright /asciicircum
/underscore /quoteleft /a /b /c
/d /e /f /g /h
/i /j /k /l /m
/n /o /p /q /r
/s /t /u /v /w
/x /y /z /braceleft /bar
/braceright /asciitilde /bullet /Euro /bullet
/quotesinglbase /florin /quotedblbase /ellipsis /dagger
/daggerdbl /circumflex /perthousand /Scaron /guilsinglleft
/OE /bullet /Zcaron /bullet /bullet
/quoteleft /quoteright /quotedblleft /quotedblright /bullet
/endash /emdash /asciitilde /trademark /scaron
/guilsinglright /oe /bullet /zcaron /Ydieresis
/space /exclamdown /cent /sterling /currency
/yen /brokenbar /section /dieresis /copyright
/ordfeminine /guillemotleft /logicalnot /sfthyphen /registered
/macron /degree /plusminus /twosuperior /threesuperior
/acute /mu /paragraph /middot /cedilla
/onesuperior /ordmasculine /guillemotright /onequarter /onehalf
/threequarters /questiondown /Agrave /Aacute /Acircumflex
/Atilde /Adieresis /Aring /AE /Ccedilla
/Egrave /Eacute /Ecircumflex /Edieresis /Igrave
/Iacute /Icircumflex /Idieresis /Eth /Ntilde
/Ograve /Oacute /Ocircumflex /Otilde /Odieresis
/multiply /Oslash /Ugrave /Uacute /Ucircumflex
/Udieresis /Yacute /Thorn /germandbls /agrave
/aacute /acircumflex /atilde /adieresis /aring
/ae /ccedilla /egrave /eacute /ecircumflex
/edieresis /igrave /iacute /icircumflex /idieresis
/eth /ntilde /ograve /oacute /ocircumflex
/otilde /odieresis /divide /oslash /ugrave
/uacute /ucircumflex /udieresis /yacute /thorn
/ydieresis
] def
%%EndResource
%FOPBeginFontReencode
/Courier-Oblique findfont
dup length dict begin
  {1 index /FID ne {def} {pop pop} ifelse} forall
  /Encoding WinAnsiEncoding def
  currentdict
end
/Courier-Oblique exch definefont pop
/Courier-BoldOblique findfont
dup length dict begin
  {1 index /FID ne {def} {pop pop} ifelse} forall
  /Encoding WinAnsiEncoding def
  currentdict
end
/Courier-BoldOblique exch definefont pop
/Courier-Bold findfont
dup length dict begin
  {1 index /FID ne {def} {pop pop} ifelse} forall
  /Encoding WinAnsiEncoding def
  currentdict
end
/Courier-Bold exch definefont pop
/Helvetica findfont
dup length dict begin
  {1 index /FID ne {def} {pop pop} ifelse} forall
  /Encoding WinAnsiEncoding def
  currentdict
end
/Helvetica exch definefont pop
/Helvetica-Oblique findfont
dup length dict begin
  {1 index /FID ne {def} {pop pop} ifelse} forall
  /Encoding WinAnsiEncoding def
  currentdict
end
/Helvetica-Oblique exch definefont pop
/Helvetica-Bold findfont
dup length dict begin
  {1 index /FID ne {def} {pop pop} ifelse} forall
  /Encoding WinAnsiEncoding def
  currentdict
end
/Helvetica-Bold exch definefont pop
/Helvetica-BoldOblique findfont
dup length dict begin
  {1 index /FID ne {def} {pop pop} ifelse} forall
  /Encoding WinAnsiEncoding def
  currentdict
end
/Helvetica-BoldOblique exch definefont pop
/Times-Roman findfont
dup length dict begin
  {1 index /FID ne {def} {pop pop} ifelse} forall
  /Encoding WinAnsiEncoding def
  currentdict
end
/Times-Roman exch definefont pop
/Times-Italic findfont
dup length dict begin
  {1 index /FID ne {def} {pop pop} ifelse} forall
  /Encoding WinAnsiEncoding def
  currentdict
end
/Times-Italic exch definefont pop
/Times-Bold findfont
dup length dict begin
  {1 index /FID ne {def} {pop pop} ifelse} forall
  /Encoding WinAnsiEncoding def
  currentdict
end
/Times-Bold exch definefont pop
/Times-BoldItalic findfont
dup length dict begin
  {1 index /FID ne {def} {pop pop} ifelse} forall
  /Encoding WinAnsiEncoding def
  currentdict
end
/Times-BoldItalic exch definefont pop
/Courier findfont
dup length dict begin
  {1 index /FID ne {def} {pop pop} ifelse} forall
  /Encoding WinAnsiEncoding def
  currentdict
end
/Courier exch definefont pop
%FOPEndFontReencode
%%EndProlog
%%Page: 1 1
%%PageBoundingBox: 0 0 198 283
%%BeginPageSetup
[1 0 0 -1 0 283] CT
%%EndPageSetup
GS
[1.00215 0 0 1 0 0] CT
1 GC
N
0 0 198 283 re
f
GR
GS
[1.00215 0 0 1 0 0] CT
1 GC
N
0 0 198 283 re
f
GR
GS
[1.00215 0 0 1 0 0] CT
1 GC
N
69 228 M
179 228 L
179 32 L
69 32 L
cp
f
GR
GS
[1.00215 0 0 1 0 0] CT
0.149 GC
2 setlinecap
1 LJ
0.5 LW
N
69 228 M
179 228 L
S
GR
GS
[1.00215 0 0 1 0 0] CT
0.149 GC
2 setlinecap
1 LJ
0.5 LW
N
102 228 M
102 226.04 L
S
GR
GS
[1.00215 0 0 1 0 0] CT
0.149 GC
2 setlinecap
1 LJ
0.5 LW
N
146 228 M
146 226.04 L
S
GR
GS
[1.00215 0 0 1 102.21904 234] CT
0.149 GC
/Helvetica 20 F
GS
[1 0 0 1 0 0] CT
-13 20 moveto 
1 -1 scale
(YA) t 
GR
GR
GS
[1.00215 0 0 1 146.31353 234] CT
0.149 GC
/Helvetica 20 F
GS
[1 0 0 1 0 0] CT
-14.5 20 moveto 
1 -1 scale
(OA) t 
GR
GR
GS
[1.00215 0 0 1 124.26634 259] CT
0.149 GC
/Helvetica 20 F
GS
[1 0 0 1 0 0] CT
-49 20 moveto 
1 -1 scale
(Age Group) t 
GR
GR
GS
[1.00215 0 0 1 0 0] CT
0.149 GC
2 setlinecap
1 LJ
0.5 LW
N
69 228 M
69 32 L
S
GR
GS
[1.00215 0 0 1 0 0] CT
0.149 GC
2 setlinecap
1 LJ
0.5 LW
N
69 228 M
70.96 228 L
S
GR
GS
[1.00215 0 0 1 0 0] CT
0.149 GC
2 setlinecap
1 LJ
0.5 LW
N
69 162.667 M
70.96 162.667 L
S
GR
GS
[1.00215 0 0 1 0 0] CT
0.149 GC
2 setlinecap
1 LJ
0.5 LW
N
69 97.333 M
70.96 97.333 L
S
GR
GS
[1.00215 0 0 1 0 0] CT
0.149 GC
2 setlinecap
1 LJ
0.5 LW
N
69 32 M
70.96 32 L
S
GR
GS
[1.00215 0 0 1 63.13529 228] CT
0.149 GC
/Helvetica 20 F
GS
[1 0 0 1 0 0] CT
-36 7.5 moveto 
1 -1 scale
(-0.1) t 
GR
GR
GS
[1.00215 0 0 1 63.13529 162.66667] CT
0.149 GC
/Helvetica 20 F
GS
[1 0 0 1 0 0] CT
-12 7.5 moveto 
1 -1 scale
(0) t 
GR
GR
GS
[1.00215 0 0 1 63.13529 97.33334] CT
0.149 GC
/Helvetica 20 F
GS
[1 0 0 1 0 0] CT
-28 7.5 moveto 
1 -1 scale
(0.1) t 
GR
GR
GS
[1.00215 0 0 1 63.13529 32] CT
0.149 GC
/Helvetica 20 F
GS
[1 0 0 1 0 0] CT
-28 7.5 moveto 
1 -1 scale
(0.2) t 
GR
GR
GS
[0 -1 1.00215 0 24.05154 129.99991] CT
0.149 GC
/Helvetica 20 F
GS
[1 0 0 1 0 0] CT
-35.5 -5 moveto 
1 -1 scale
(1f linear) t 
GR
GR
GS
[1.00215 0 0 1 124.26641 29.24999] CT
/Helvetica-Bold 22 F
GS
[1 0 0 1 0 0] CT
-58 -5 moveto 
1 -1 scale
(p = 2.4e-04) t 
GR
GR
GS
[1.00215 0 0 1 0 0] CT
0.149 GC
1 LJ
0.5 LW
N
69 162.667 M
179 162.667 L
S
GR
GS
[1.00215 0 0 1 0 0] CT
1 0.6 0.6 RC
N
119.6 162.667 M
119.6 138.253 L
84.4 138.253 L
84.4 162.667 L
cp
f
GR
GS
[1.00215 0 0 1 106.25141 176.20248] CT
0.302 GC
N
2.236 0 M
2.236 -1.235 1.235 -2.236 0 -2.236 C
-1.235 -2.236 -2.236 -1.235 -2.236 0 C
-2.236 1.235 -1.235 2.236 0 2.236 C
1.235 2.236 2.236 1.235 2.236 0 C
cp
f
GR
GS
[1.00215 0 0 1 107.87317 195.09424] CT
0.302 GC
N
/f-1586420743{2.236 0 M
2.236 -1.235 1.235 -2.236 0 -2.236 C
-1.235 -2.236 -2.236 -1.235 -2.236 0 C
-2.236 1.235 -1.235 2.236 0 2.236 C
1.235 2.236 2.236 1.235 2.236 0 C
cp}def
f-1586420743
f
GR
GS
[1.00215 0 0 1 101.64032 108.27386] CT
0.302 GC
N
f-1586420743
f
GR
GS
[1.00215 0 0 1 105.87397 92.39951] CT
0.302 GC
N
f-1586420743
f
GR
GS
[1.00215 0 0 1 100.40577 115.48634] CT
0.302 GC
N
f-1586420743
f
GR
GS
[1.00215 0 0 1 96.1271 140.88506] CT
0.302 GC
N
f-1586420743
f
GR
GS
[1.00215 0 0 1 100.49374 147.89888] CT
0.302 GC
N
f-1586420743
f
GR
GS
[1.00215 0 0 1 97.99773 134.67358] CT
0.302 GC
N
f-1586420743
f
GR
GS
[1.00215 0 0 1 110.3425 134.86885] CT
0.302 GC
N
f-1586420743
f
GR
GS
[1.00215 0 0 1 110.57632 100.64352] CT
0.302 GC
N
f-1586420743
f
GR
GS
[1.00215 0 0 1 110.26791 138.66385] CT
0.302 GC
N
f-1586420743
f
GR
GS
[1.00215 0 0 1 108.74725 154.23784] CT
0.302 GC
N
f-1586420743
f
GR
GS
[1.00215 0 0 1 94.10845 183.99797] CT
0.302 GC
N
f-1586420743
f
GR
GS
[1.00215 0 0 1 110.51118 178.94275] CT
0.302 GC
N
f-1586420743
f
GR
GS
[1.00215 0 0 1 101.85275 67.86526] CT
0.302 GC
N
f-1586420743
f
GR
GS
[1.00215 0 0 1 98.47608 172.64609] CT
0.302 GC
N
f-1586420743
f
GR
GS
[1.00215 0 0 1 108.89826 156.71411] CT
0.302 GC
N
f-1586420743
f
GR
GS
[1.00215 0 0 1 106.52697 125.26776] CT
0.302 GC
N
f-1586420743
f
GR
GS
[1.00215 0 0 1 96.31455 120.76036] CT
0.302 GC
N
f-1586420743
f
GR
GS
[1.00215 0 0 1 104.6952 117.12546] CT
0.302 GC
N
f-1586420743
f
GR
GS
[1.00215 0 0 1 96.24123 61.39973] CT
0.302 GC
N
f-1586420743
f
GR
GS
[1.00215 0 0 1 110.88143 104.97264] CT
0.302 GC
N
f-1586420743
f
GR
GS
[1.00215 0 0 1 95.92921 152.47046] CT
0.302 GC
N
f-1586420743
f
GR
GS
[1.00215 0 0 1 100.1241 156.85513] CT
0.302 GC
N
f-1586420743
f
GR
GS
[1.00215 0 0 1 105.39167 109.00393] CT
0.302 GC
N
f-1586420743
f
GR
GS
[1.00215 0 0 1 100.91179 111.09687] CT
0.302 GC
N
f-1586420743
f
GR
GS
[1.00215 0 0 1 110.96202 117.22643] CT
0.302 GC
N
f-1586420743
f
GR
GS
[1.00215 0 0 1 104.96707 162.30217] CT
0.302 GC
N
f-1586420743
f
GR
GS
[1.00215 0 0 1 101.72745 124.64211] CT
0.302 GC
N
f-1586420743
f
GR
GS
[1.00215 0 0 1 107.42636 126.98667] CT
0.302 GC
N
f-1586420743
f
GR
GS
[1.00215 0 0 1 94.88229 157.93834] CT
0.302 GC
N
f-1586420743
f
GR
GS
[1.00215 0 0 1 99.94623 61.39973] CT
0.302 GC
N
f-1586420743
f
GR
GS
[1.00215 0 0 1 110.2558 161.85474] CT
0.302 GC
N
f-1586420743
f
GR
GS
[1.00215 0 0 1 107.18631 174.41609] CT
0.302 GC
N
f-1586420743
f
GR
GS
[1.00215 0 0 1 104.58183 144.13121] CT
0.302 GC
N
f-1586420743
f
GR
GS
[1.00215 0 0 1 109.06306 120.05612] CT
0.302 GC
N
f-1586420743
f
GR
GS
[1.00215 0 0 1 102.05474 162.22136] CT
0.302 GC
N
f-1586420743
f
GR
GS
[1.00215 0 0 1 103.27018 162.8614] CT
0.302 GC
N
f-1586420743
f
GR
GS
[1.00215 0 0 1 110.93289 191.36646] CT
0.302 GC
N
f-1586420743
f
GR
GS
[1.00215 0 0 1 99.28564 129.07469] CT
0.302 GC
N
f-1586420743
f
GR
GS
[1.00215 0 0 1 100.74288 182.42422] CT
0.302 GC
N
f-1586420743
f
GR
GS
[1.00215 0 0 1 98.93131 169.29117] CT
0.302 GC
N
f-1586420743
f
GR
GS
[1.00215 0 0 1 0 0] CT
0.6 GC
N
/f1405844048{163.6 162.667 M
163.6 162.134 L
128.4 162.134 L
128.4 162.667 L
cp}def
f1405844048
f
GR
GS
[1.00215 0 0 1 146.30434 179.88644] CT
0.302 GC
N
f-1586420743
f
GR
GS
[1.00215 0 0 1 141.37428 188.39047] CT
0.302 GC
N
f-1586420743
f
GR
GS
[1.00215 0 0 1 148.74439 166.47914] CT
0.302 GC
N
f-1586420743
f
GR
GS
[1.00215 0 0 1 142.32392 140.53326] CT
0.302 GC
N
f-1586420743
f
GR
GS
[1.00215 0 0 1 142.00793 135.92291] CT
0.302 GC
N
f-1586420743
f
GR
GS
[1.00215 0 0 1 138.12584 146.53473] CT
0.302 GC
N
f-1586420743
f
GR
GS
[1.00215 0 0 1 151.3571 159.41924] CT
0.302 GC
N
f-1586420743
f
GR
GS
[1.00215 0 0 1 152.76016 146.56944] CT
0.302 GC
N
f-1586420743
f
GR
GS
[1.00215 0 0 1 145.08519 186.93787] CT
0.302 GC
N
f-1586420743
f
GR
GS
[1.00215 0 0 1 151.54872 140.97601] CT
0.302 GC
N
f-1586420743
f
GR
GS
[1.00215 0 0 1 149.48879 187.71423] CT
0.302 GC
N
f-1586420743
f
GR
GS
[1.00215 0 0 1 151.47945 211.98077] CT
0.302 GC
N
f-1586420743
f
GR
GS
[1.00215 0 0 1 141.49643 219.49799] CT
0.302 GC
N
f-1586420743
f
GR
GS
[1.00215 0 0 1 153.05102 136.00691] CT
0.302 GC
N
f-1586420743
f
GR
GS
[1.00215 0 0 1 151.44761 174.03853] CT
0.302 GC
N
f-1586420743
f
GR
GS
[1.00215 0 0 1 147.8463 186.14897] CT
0.302 GC
N
f-1586420743
f
GR
GS
[1.00215 0 0 1 139.64403 145.95078] CT
0.302 GC
N
f-1586420743
f
GR
GS
[1.00215 0 0 1 142.79735 154.00119] CT
0.302 GC
N
f-1586420743
f
GR
GS
[1.00215 0 0 1 154.00337 187.59111] CT
0.302 GC
N
f-1586420743
f
GR
GS
[1.00215 0 0 1 140.49135 150.77492] CT
0.302 GC
N
f-1586420743
f
GR
GS
[1.00215 0 0 1 154.67846 185.02208] CT
0.302 GC
N
f-1586420743
f
GR
GS
[1.00215 0 0 1 152.45861 138.86443] CT
0.302 GC
N
f-1586420743
f
GR
GS
[1.00215 0 0 1 143.72042 156.63373] CT
0.302 GC
N
f-1586420743
f
GR
GS
[1.00215 0 0 1 141.50984 149.89604] CT
0.302 GC
N
f-1586420743
f
GR
GS
[1.00215 0 0 1 141.13781 153.22133] CT
0.302 GC
N
f-1586420743
f
GR
GS
[1.00215 0 0 1 151.91726 188.69179] CT
0.302 GC
N
f-1586420743
f
GR
GS
[1.00215 0 0 1 143.62187 124.12421] CT
0.302 GC
N
f-1586420743
f
GR
GS
[1.00215 0 0 1 139.31121 155.24313] CT
0.302 GC
N
f-1586420743
f
GR
GS
[1.00215 0 0 1 147.98071 167.04115] CT
0.302 GC
N
f-1586420743
f
GR
GS
[1.00215 0 0 1 145.68924 177.32938] CT
0.302 GC
N
f-1586420743
f
GR
GS
[1.00215 0 0 1 146.76254 147.10146] CT
0.302 GC
N
f-1586420743
f
GR
GS
[1.00215 0 0 1 149.51497 203.77068] CT
0.302 GC
N
f-1586420743
f
GR
GS
[1.00215 0 0 1 145.10434 95.58398] CT
0.302 GC
N
f-1586420743
f
GR
GS
[1.00215 0 0 1 151.40232 144.87418] CT
0.302 GC
N
f-1586420743
f
GR
GS
[1.00215 0 0 1 154.92959 141.92685] CT
0.302 GC
N
f-1586420743
f
GR
GS
[1.00215 0 0 1 152.1278 171.72391] CT
0.302 GC
N
f-1586420743
f
GR
GS
[1.00215 0 0 1 147.09793 157.06679] CT
0.302 GC
N
f-1586420743
f
GR
GS
[1.00215 0 0 1 150.80448 184.36809] CT
0.302 GC
N
f-1586420743
f
GR
GS
[1.00215 0 0 1 147.17225 155.5345] CT
0.302 GC
N
f-1586420743
f
GR
GS
[1.00215 0 0 1 143.13518 187.17305] CT
0.302 GC
N
f-1586420743
f
GR
GS
[1.00215 0 0 1 149.65403 161.63747] CT
0.302 GC
N
f-1586420743
f
GR
GS
[1.00215 0 0 1 146.07751 188.79587] CT
0.302 GC
N
f-1586420743
f
GR
GS
[1.00215 0 0 1 149.34508 178.9326] CT
0.302 GC
N
f-1586420743
f
GR
GS
[1.00215 0 0 1 154.98068 170.94441] CT
0.302 GC
N
f-1586420743
f
GR
GS
[1.00215 0 0 1 145.87913 122.57279] CT
0.302 GC
N
f-1586420743
f
GR
GS
[1.00215 0 0 1 139.07232 206.90146] CT
0.302 GC
N
f-1586420743
f
GR
GS
[1.00215 0 0 1 152.44435 180.24319] CT
0.302 GC
N
f-1586420743
f
GR
GS
[1.00215 0 0 1 145.79527 120.6218] CT
0.302 GC
N
f-1586420743
f
GR
GS
[1.00215 0 0 1 143.30775 169.6207] CT
0.302 GC
N
f-1586420743
f
GR
GS
[1.00215 0 0 1 147.77756 120.09117] CT
0.302 GC
N
f-1586420743
f
GR
GS
[1.00215 0 0 1 143.26444 178.8343] CT
0.302 GC
N
f-1586420743
f
GR
GS
[1.00215 0 0 1 140.34128 95.58398] CT
0.302 GC
N
f-1586420743
f
GR
GS
[1.00215 0 0 1 141.2364 167.75322] CT
0.302 GC
N
f-1586420743
f
GR
%%Trailer
%%Pages: 1
%%EOF
