%!PS-Adobe-3.0 EPSF-3.0
%%Creator: (MATLAB, The Mathworks, Inc. Version 9.8.0.1323502 \(R2020a\). Operating System: Mac OS X)
%%Title: /Users/kosciessa/Desktop/mntTardisLNDG/LNDG/stateswitch/stsw_multimodal/figures/correlations/f_sampen_alpha.eps
%%CreationDate: 2022-03-11T15:12:19
%%Pages: (atend)
%%BoundingBox:     6     0   241   194
%%LanguageLevel: 3
%%EndComments
%%BeginProlog
%%BeginResource: procset (Apache XML Graphics Std ProcSet) 1.2 0
%%Version: 1.2 0
%%Copyright: (Copyright 2001-2003,2010 The Apache Software Foundation. License terms: http://www.apache.org/licenses/LICENSE-2.0)
/bd{bind def}bind def
/ld{load def}bd
/GR/grestore ld
/GS/gsave ld
/RM/rmoveto ld
/C/curveto ld
/t/show ld
/L/lineto ld
/ML/setmiterlimit ld
/CT/concat ld
/f/fill ld
/N/newpath ld
/S/stroke ld
/CC/setcmykcolor ld
/A/ashow ld
/cp/closepath ld
/RC/setrgbcolor ld
/LJ/setlinejoin ld
/GC/setgray ld
/LW/setlinewidth ld
/M/moveto ld
/re {4 2 roll M
1 index 0 rlineto
0 exch rlineto
neg 0 rlineto
cp } bd
/_ctm matrix def
/_tm matrix def
/BT { _ctm currentmatrix pop matrix _tm copy pop 0 0 moveto } bd
/ET { _ctm setmatrix } bd
/iTm { _ctm setmatrix _tm concat } bd
/Tm { _tm astore pop iTm 0 0 moveto } bd
/ux 0.0 def
/uy 0.0 def
/F {
  /Tp exch def
  /Tf exch def
  Tf findfont Tp scalefont setfont
  /cf Tf def  /cs Tp def
} bd
/ULS {currentpoint /uy exch def /ux exch def} bd
/ULE {
  /Tcx currentpoint pop def
  gsave
  newpath
  cf findfont cs scalefont dup
  /FontMatrix get 0 get /Ts exch def /FontInfo get dup
  /UnderlinePosition get Ts mul /To exch def
  /UnderlineThickness get Ts mul /Tt exch def
  ux uy To add moveto  Tcx uy To add lineto
  Tt setlinewidth stroke
  grestore
} bd
/OLE {
  /Tcx currentpoint pop def
  gsave
  newpath
  cf findfont cs scalefont dup
  /FontMatrix get 0 get /Ts exch def /FontInfo get dup
  /UnderlinePosition get Ts mul /To exch def
  /UnderlineThickness get Ts mul /Tt exch def
  ux uy To add cs add moveto Tcx uy To add cs add lineto
  Tt setlinewidth stroke
  grestore
} bd
/SOE {
  /Tcx currentpoint pop def
  gsave
  newpath
  cf findfont cs scalefont dup
  /FontMatrix get 0 get /Ts exch def /FontInfo get dup
  /UnderlinePosition get Ts mul /To exch def
  /UnderlineThickness get Ts mul /Tt exch def
  ux uy To add cs 10 mul 26 idiv add moveto Tcx uy To add cs 10 mul 26 idiv add lineto
  Tt setlinewidth stroke
  grestore
} bd
/QT {
/Y22 exch store
/X22 exch store
/Y21 exch store
/X21 exch store
currentpoint
/Y21 load 2 mul add 3 div exch
/X21 load 2 mul add 3 div exch
/X21 load 2 mul /X22 load add 3 div
/Y21 load 2 mul /Y22 load add 3 div
/X22 load /Y22 load curveto
} bd
/SSPD {
dup length /d exch dict def
{
/v exch def
/k exch def
currentpagedevice k known {
/cpdv currentpagedevice k get def
v cpdv ne {
/upd false def
/nullv v type /nulltype eq def
/nullcpdv cpdv type /nulltype eq def
nullv nullcpdv or
{
/upd true def
} {
/sametype v type cpdv type eq def
sametype {
v type /arraytype eq {
/vlen v length def
/cpdvlen cpdv length def
vlen cpdvlen eq {
0 1 vlen 1 sub {
/i exch def
/obj v i get def
/cpdobj cpdv i get def
obj cpdobj ne {
/upd true def
exit
} if
} for
} {
/upd true def
} ifelse
} {
v type /dicttype eq {
v {
/dv exch def
/dk exch def
/cpddv cpdv dk get def
dv cpddv ne {
/upd true def
exit
} if
} forall
} {
/upd true def
} ifelse
} ifelse
} if
} ifelse
upd true eq {
d k v put
} if
} if
} if
} forall
d length 0 gt {
d setpagedevice
} if
} bd
/RE { % /NewFontName [NewEncodingArray] /FontName RE -
  findfont dup length dict begin
  {
    1 index /FID ne
    {def} {pop pop} ifelse
  } forall
  /Encoding exch def
  /FontName 1 index def
  currentdict definefont pop
  end
} bind def
%%EndResource
%%BeginResource: procset (Apache XML Graphics EPS ProcSet) 1.0 0
%%Version: 1.0 0
%%Copyright: (Copyright 2002-2003 The Apache Software Foundation. License terms: http://www.apache.org/licenses/LICENSE-2.0)
/BeginEPSF { %def
/b4_Inc_state save def         % Save state for cleanup
/dict_count countdictstack def % Count objects on dict stack
/op_count count 1 sub def      % Count objects on operand stack
userdict begin                 % Push userdict on dict stack
/showpage { } def              % Redefine showpage, { } = null proc
0 setgray 0 setlinecap         % Prepare graphics state
1 setlinewidth 0 setlinejoin
10 setmiterlimit [ ] 0 setdash newpath
/languagelevel where           % If level not equal to 1 then
{pop languagelevel             % set strokeadjust and
1 ne                           % overprint to their defaults.
{false setstrokeadjust false setoverprint
} if
} if
} bd
/EndEPSF { %def
count op_count sub {pop} repeat            % Clean up stacks
countdictstack dict_count sub {end} repeat
b4_Inc_state restore
} bd
%%EndResource
%FOPBeginFontDict
%%IncludeResource: font Courier-Oblique
%%IncludeResource: font Courier-BoldOblique
%%IncludeResource: font Courier-Bold
%%IncludeResource: font ZapfDingbats
%%IncludeResource: font Symbol
%%IncludeResource: font Helvetica
%%IncludeResource: font Helvetica-Oblique
%%IncludeResource: font Helvetica-Bold
%%IncludeResource: font Helvetica-BoldOblique
%%IncludeResource: font Times-Roman
%%IncludeResource: font Times-Italic
%%IncludeResource: font Times-Bold
%%IncludeResource: font Times-BoldItalic
%%IncludeResource: font Courier
%FOPEndFontDict
%%BeginResource: encoding WinAnsiEncoding
/WinAnsiEncoding [
/.notdef /.notdef /.notdef /.notdef /.notdef
/.notdef /.notdef /.notdef /.notdef /.notdef
/.notdef /.notdef /.notdef /.notdef /.notdef
/.notdef /.notdef /.notdef /.notdef /.notdef
/.notdef /.notdef /.notdef /.notdef /.notdef
/.notdef /.notdef /.notdef /.notdef /.notdef
/.notdef /.notdef /space /exclam /quotedbl
/numbersign /dollar /percent /ampersand /quotesingle
/parenleft /parenright /asterisk /plus /comma
/hyphen /period /slash /zero /one
/two /three /four /five /six
/seven /eight /nine /colon /semicolon
/less /equal /greater /question /at
/A /B /C /D /E
/F /G /H /I /J
/K /L /M /N /O
/P /Q /R /S /T
/U /V /W /X /Y
/Z /bracketleft /backslash /bracketright /asciicircum
/underscore /quoteleft /a /b /c
/d /e /f /g /h
/i /j /k /l /m
/n /o /p /q /r
/s /t /u /v /w
/x /y /z /braceleft /bar
/braceright /asciitilde /bullet /Euro /bullet
/quotesinglbase /florin /quotedblbase /ellipsis /dagger
/daggerdbl /circumflex /perthousand /Scaron /guilsinglleft
/OE /bullet /Zcaron /bullet /bullet
/quoteleft /quoteright /quotedblleft /quotedblright /bullet
/endash /emdash /asciitilde /trademark /scaron
/guilsinglright /oe /bullet /zcaron /Ydieresis
/space /exclamdown /cent /sterling /currency
/yen /brokenbar /section /dieresis /copyright
/ordfeminine /guillemotleft /logicalnot /sfthyphen /registered
/macron /degree /plusminus /twosuperior /threesuperior
/acute /mu /paragraph /middot /cedilla
/onesuperior /ordmasculine /guillemotright /onequarter /onehalf
/threequarters /questiondown /Agrave /Aacute /Acircumflex
/Atilde /Adieresis /Aring /AE /Ccedilla
/Egrave /Eacute /Ecircumflex /Edieresis /Igrave
/Iacute /Icircumflex /Idieresis /Eth /Ntilde
/Ograve /Oacute /Ocircumflex /Otilde /Odieresis
/multiply /Oslash /Ugrave /Uacute /Ucircumflex
/Udieresis /Yacute /Thorn /germandbls /agrave
/aacute /acircumflex /atilde /adieresis /aring
/ae /ccedilla /egrave /eacute /ecircumflex
/edieresis /igrave /iacute /icircumflex /idieresis
/eth /ntilde /ograve /oacute /ocircumflex
/otilde /odieresis /divide /oslash /ugrave
/uacute /ucircumflex /udieresis /yacute /thorn
/ydieresis
] def
%%EndResource
%FOPBeginFontReencode
/Courier-Oblique findfont
dup length dict begin
  {1 index /FID ne {def} {pop pop} ifelse} forall
  /Encoding WinAnsiEncoding def
  currentdict
end
/Courier-Oblique exch definefont pop
/Courier-BoldOblique findfont
dup length dict begin
  {1 index /FID ne {def} {pop pop} ifelse} forall
  /Encoding WinAnsiEncoding def
  currentdict
end
/Courier-BoldOblique exch definefont pop
/Courier-Bold findfont
dup length dict begin
  {1 index /FID ne {def} {pop pop} ifelse} forall
  /Encoding WinAnsiEncoding def
  currentdict
end
/Courier-Bold exch definefont pop
/Helvetica findfont
dup length dict begin
  {1 index /FID ne {def} {pop pop} ifelse} forall
  /Encoding WinAnsiEncoding def
  currentdict
end
/Helvetica exch definefont pop
/Helvetica-Oblique findfont
dup length dict begin
  {1 index /FID ne {def} {pop pop} ifelse} forall
  /Encoding WinAnsiEncoding def
  currentdict
end
/Helvetica-Oblique exch definefont pop
/Helvetica-Bold findfont
dup length dict begin
  {1 index /FID ne {def} {pop pop} ifelse} forall
  /Encoding WinAnsiEncoding def
  currentdict
end
/Helvetica-Bold exch definefont pop
/Helvetica-BoldOblique findfont
dup length dict begin
  {1 index /FID ne {def} {pop pop} ifelse} forall
  /Encoding WinAnsiEncoding def
  currentdict
end
/Helvetica-BoldOblique exch definefont pop
/Times-Roman findfont
dup length dict begin
  {1 index /FID ne {def} {pop pop} ifelse} forall
  /Encoding WinAnsiEncoding def
  currentdict
end
/Times-Roman exch definefont pop
/Times-Italic findfont
dup length dict begin
  {1 index /FID ne {def} {pop pop} ifelse} forall
  /Encoding WinAnsiEncoding def
  currentdict
end
/Times-Italic exch definefont pop
/Times-Bold findfont
dup length dict begin
  {1 index /FID ne {def} {pop pop} ifelse} forall
  /Encoding WinAnsiEncoding def
  currentdict
end
/Times-Bold exch definefont pop
/Times-BoldItalic findfont
dup length dict begin
  {1 index /FID ne {def} {pop pop} ifelse} forall
  /Encoding WinAnsiEncoding def
  currentdict
end
/Times-BoldItalic exch definefont pop
/Courier findfont
dup length dict begin
  {1 index /FID ne {def} {pop pop} ifelse} forall
  /Encoding WinAnsiEncoding def
  currentdict
end
/Courier exch definefont pop
%FOPEndFontReencode
%%EndProlog
%%Page: 1 1
%%PageBoundingBox: 0 0 255 198
%%BeginPageSetup
[1 0 0 -1 0 198] CT
%%EndPageSetup
GS
[1.00046 0 0 1.00215 0 -0.4252] CT
1 GC
N
0 0 255 198 re
f
GR
GS
[1.00046 0 0 1.00215 0 -0.4252] CT
1 GC
N
0 0 255 198 re
f
GR
GS
[1.00046 0 0 1.00215 0 -0.4252] CT
0.2 GC
N
74.5 143 M
231.5 143 L
231.5 21 L
74.5 21 L
cp
f
GR
GS
[1.00046 0 0 1.00215 0 -0.4252] CT
0.149 GC
2 setlinecap
1 LJ
0.5 LW
N
74.5 143 M
231.5 143 L
S
GR
GS
[1.00046 0 0 1.00215 0 -0.4252] CT
0.149 GC
2 setlinecap
1 LJ
0.5 LW
N
82.544 143 M
82.544 141.43 L
S
GR
GS
[1.00046 0 0 1.00215 0 -0.4252] CT
0.149 GC
2 setlinecap
1 LJ
0.5 LW
N
132.196 143 M
132.196 141.43 L
S
GR
GS
[1.00046 0 0 1.00215 0 -0.4252] CT
0.149 GC
2 setlinecap
1 LJ
0.5 LW
N
181.848 143 M
181.848 141.43 L
S
GR
GS
[1.00046 0 0 1.00215 0 -0.4252] CT
0.149 GC
2 setlinecap
1 LJ
0.5 LW
N
231.5 143 M
231.5 141.43 L
S
GR
GS
[1.00046 0 0 1.00215 82.58182 147.6922] CT
0.149 GC
/Helvetica 14 F
GS
[1 0 0 1 0 0] CT
-12.5 14 moveto 
1 -1 scale
(-0.2) t 
GR
GR
GS
[1.00046 0 0 1.00215 132.25695 147.6922] CT
0.149 GC
/Helvetica 14 F
GS
[1 0 0 1 0 0] CT
-4 14 moveto 
1 -1 scale
(0) t 
GR
GR
GS
[1.00046 0 0 1.00215 181.93208 147.6922] CT
0.149 GC
/Helvetica 14 F
GS
[1 0 0 1 0 0] CT
-10 14 moveto 
1 -1 scale
(0.2) t 
GR
GR
GS
[1.00046 0 0 1.00215 231.60722 147.6922] CT
0.149 GC
/Helvetica 14 F
GS
[1 0 0 1 0 0] CT
-10 14 moveto 
1 -1 scale
(0.4) t 
GR
GR
GS
[1.00046 0 0 1.00215 153.07094 165.22978] CT
0.149 GC
/Helvetica 14 F
GS
[1 0 0 1 0 0] CT
-27 14 moveto 
1 -1 scale
(alpha bs) t 
GR
GR
GS
[1.00046 0 0 1.00215 153.07094 165.22978] CT
0.149 GC
/Helvetica 14 F
GS
[1 0 0 1 0 0] CT
-57.5 31 moveto 
1 -1 scale
(\(linear modulation\)) t 
GR
GR
GS
[1.00046 0 0 1.00215 0 -0.4252] CT
0.149 GC
2 setlinecap
1 LJ
0.5 LW
N
74.5 143 M
74.5 21 L
S
GR
GS
[1.00046 0 0 1.00215 0 -0.4252] CT
0.149 GC
2 setlinecap
1 LJ
0.5 LW
N
74.5 117.905 M
76.07 117.905 L
S
GR
GS
[1.00046 0 0 1.00215 0 -0.4252] CT
0.149 GC
2 setlinecap
1 LJ
0.5 LW
N
74.5 86.968 M
76.07 86.968 L
S
GR
GS
[1.00046 0 0 1.00215 0 -0.4252] CT
0.149 GC
2 setlinecap
1 LJ
0.5 LW
N
74.5 56.031 M
76.07 56.031 L
S
GR
GS
[1.00046 0 0 1.00215 0 -0.4252] CT
0.149 GC
2 setlinecap
1 LJ
0.5 LW
N
74.5 25.095 M
76.07 25.095 L
S
GR
GS
[1.00046 0 0 1.00215 69.73229 117.73314] CT
0.149 GC
/Helvetica 14 F
GS
[1 0 0 1 0 0] CT
-33 5.5 moveto 
1 -1 scale
(-0.02) t 
GR
GR
GS
[1.00046 0 0 1.00215 69.73229 86.72986] CT
0.149 GC
/Helvetica 14 F
GS
[1 0 0 1 0 0] CT
-8 5.5 moveto 
1 -1 scale
(0) t 
GR
GR
GS
[1.00046 0 0 1.00215 69.73229 55.72658] CT
0.149 GC
/Helvetica 14 F
GS
[1 0 0 1 0 0] CT
-28 5.5 moveto 
1 -1 scale
(0.02) t 
GR
GR
GS
[1.00046 0 0 1.00215 69.73229 24.72329] CT
0.149 GC
/Helvetica 14 F
GS
[1 0 0 1 0 0] CT
-28 5.5 moveto 
1 -1 scale
(0.04) t 
GR
GR
GS
[0 -1.00215 1.00046 0 33.71561 81.75084] CT
0.149 GC
/Helvetica 14 F
GS
[1 0 0 1 0 0] CT
-25.5 -20 moveto 
1 -1 scale
(sampen) t 
GR
GR
GS
[0 -1.00215 1.00046 0 33.71561 81.75084] CT
0.149 GC
/Helvetica 14 F
GS
[1 0 0 1 0 0] CT
-57.5 -3 moveto 
1 -1 scale
(\(linear modulation\)) t 
GR
GR
GS
[1.00046 0 0 1.00215 153.07101 18.86614] CT
/Helvetica-Bold 14 F
GS
[1 0 0 1 0 0] CT
-52.5 -4 moveto 
1 -1 scale
(r = 0.24 p = 0.02) t 
GR
GR
GS
[1.00046 0 0 1.00215 176.88961 131.85707] CT
0.8 0.502 0.502 RC
N
0.5 0 M
0.5 -0.276 0.276 -0.5 0 -0.5 C
-0.276 -0.5 -0.5 -0.276 -0.5 0 C
-0.5 0.276 -0.276 0.5 0 0.5 C
0.276 0.5 0.5 0.276 0.5 0 C
cp
f
GR
GS
[1.00046 0 0 1.00215 124.57196 75.39684] CT
0.8 0.502 0.502 RC
N
/f-2105962265{0.5 0 M
0.5 -0.276 0.276 -0.5 0 -0.5 C
-0.276 -0.5 -0.5 -0.276 -0.5 0 C
-0.5 0.276 -0.276 0.5 0 0.5 C
0.276 0.5 0.5 0.276 0.5 0 C
cp}def
f-2105962265
f
GR
GS
[1.00046 0 0 1.00215 204.31332 60.03881] CT
0.8 0.502 0.502 RC
N
f-2105962265
f
GR
GS
[1.00046 0 0 1.00215 184.24298 30.8084] CT
0.8 0.502 0.502 RC
N
f-2105962265
f
GR
GS
[1.00046 0 0 1.00215 123.7089 43.13606] CT
0.8 0.502 0.502 RC
N
f-2105962265
f
GR
GS
[1.00046 0 0 1.00215 139.64605 85.08416] CT
0.8 0.502 0.502 RC
N
f-2105962265
f
GR
GS
[1.00046 0 0 1.00215 168.31996 53.40582] CT
0.8 0.502 0.502 RC
N
f-2105962265
f
GR
GS
[1.00046 0 0 1.00215 150.21564 81.88872] CT
0.8 0.502 0.502 RC
N
f-2105962265
f
GR
GS
[1.00046 0 0 1.00215 140.37532 78.43472] CT
0.8 0.502 0.502 RC
N
f-2105962265
f
GR
GS
[1.00046 0 0 1.00215 201.92415 91.77978] CT
0.8 0.502 0.502 RC
N
f-2105962265
f
GR
GS
[1.00046 0 0 1.00215 180.28546 60.8944] CT
0.8 0.502 0.502 RC
N
f-2105962265
f
GR
GS
[1.00046 0 0 1.00215 153.67592 93.78901] CT
0.8 0.502 0.502 RC
N
f-2105962265
f
GR
GS
[1.00046 0 0 1.00215 133.87628 80.29475] CT
0.8 0.502 0.502 RC
N
f-2105962265
f
GR
GS
[1.00046 0 0 1.00215 146.3684 93.36733] CT
0.8 0.502 0.502 RC
N
f-2105962265
f
GR
GS
[1.00046 0 0 1.00215 169.68517 30.8084] CT
0.8 0.502 0.502 RC
N
f-2105962265
f
GR
GS
[1.00046 0 0 1.00215 112.18653 85.42824] CT
0.8 0.502 0.502 RC
N
f-2105962265
f
GR
GS
[1.00046 0 0 1.00215 142.78267 82.48259] CT
0.8 0.502 0.502 RC
N
f-2105962265
f
GR
GS
[1.00046 0 0 1.00215 179.27593 68.06299] CT
0.8 0.502 0.502 RC
N
f-2105962265
f
GR
GS
[1.00046 0 0 1.00215 209.3412 97.02531] CT
0.8 0.502 0.502 RC
N
f-2105962265
f
GR
GS
[1.00046 0 0 1.00215 99.79578 85.89688] CT
0.8 0.502 0.502 RC
N
f-2105962265
f
GR
GS
[1.00046 0 0 1.00215 168.43744 30.8084] CT
0.8 0.502 0.502 RC
N
f-2105962265
f
GR
GS
[1.00046 0 0 1.00215 185.54511 86.12182] CT
0.8 0.502 0.502 RC
N
f-2105962265
f
GR
GS
[1.00046 0 0 1.00215 140.21017 85.32622] CT
0.8 0.502 0.502 RC
N
f-2105962265
f
GR
GS
[1.00046 0 0 1.00215 162.11436 53.46848] CT
0.8 0.502 0.502 RC
N
f-2105962265
f
GR
GS
[1.00046 0 0 1.00215 156.45771 78.50756] CT
0.8 0.502 0.502 RC
N
f-2105962265
f
GR
GS
[1.00046 0 0 1.00215 113.46363 61.91445] CT
0.8 0.502 0.502 RC
N
f-2105962265
f
GR
GS
[1.00046 0 0 1.00215 160.37318 53.21041] CT
0.8 0.502 0.502 RC
N
f-2105962265
f
GR
GS
[1.00046 0 0 1.00215 178.05102 91.10896] CT
0.8 0.502 0.502 RC
N
f-2105962265
f
GR
GS
[1.00046 0 0 1.00215 188.10547 51.61919] CT
0.8 0.502 0.502 RC
N
f-2105962265
f
GR
GS
[1.00046 0 0 1.00215 158.54482 66.73009] CT
0.8 0.502 0.502 RC
N
f-2105962265
f
GR
GS
[1.00046 0 0 1.00215 177.97077 83.03369] CT
0.8 0.502 0.502 RC
N
f-2105962265
f
GR
GS
[1.00046 0 0 1.00215 209.3412 30.8084] CT
0.8 0.502 0.502 RC
N
f-2105962265
f
GR
GS
[1.00046 0 0 1.00215 165.1927 91.66144] CT
0.8 0.502 0.502 RC
N
f-2105962265
f
GR
GS
[1.00046 0 0 1.00215 190.60606 82.60282] CT
0.8 0.502 0.502 RC
N
f-2105962265
f
GR
GS
[1.00046 0 0 1.00215 203.40146 93.82636] CT
0.8 0.502 0.502 RC
N
f-2105962265
f
GR
GS
[1.00046 0 0 1.00215 183.18247 49.02468] CT
0.8 0.502 0.502 RC
N
f-2105962265
f
GR
GS
[1.00046 0 0 1.00215 142.36133 83.76942] CT
0.8 0.502 0.502 RC
N
f-2105962265
f
GR
GS
[1.00046 0 0 1.00215 151.65248 87.78276] CT
0.8 0.502 0.502 RC
N
f-2105962265
f
GR
GS
[1.00046 0 0 1.00215 111.44853 104.65811] CT
0.8 0.502 0.502 RC
N
f-2105962265
f
GR
GS
[1.00046 0 0 1.00215 136.6955 79.89119] CT
0.8 0.502 0.502 RC
N
f-2105962265
f
GR
GS
[1.00046 0 0 1.00215 112.10599 104.62063] CT
0.8 0.502 0.502 RC
N
f-2105962265
f
GR
GS
[1.00046 0 0 1.00215 157.4558 72.62171] CT
0.8 0.502 0.502 RC
N
f-2105962265
f
GR
GS
[1.00046 0 0 1.00215 147.94491 132.69338] CT
0.8 0.502 0.502 RC
N
f-2105962265
f
GR
GS
[1.00046 0 0 1.00215 126.18181 117.71863] CT
0.8 0.502 0.502 RC
N
f-2105962265
f
GR
GS
[1.00046 0 0 1.00215 159.15008 71.02947] CT
0.8 0.502 0.502 RC
N
f-2105962265
f
GR
GS
[1.00046 0 0 1.00215 96.76129 88.02168] CT
0.8 0.502 0.502 RC
N
f-2105962265
f
GR
GS
[1.00046 0 0 1.00215 154.25256 80.43746] CT
0.8 0.502 0.502 RC
N
f-2105962265
f
GR
GS
[1.00046 0 0 1.00215 74.5345 57.05141] CT
0.8 0.502 0.502 RC
N
f-2105962265
f
GR
GS
[1.00046 0 0 1.00215 141.46217 132.69338] CT
0.8 0.502 0.502 RC
N
f-2105962265
f
GR
GS
[1.00046 0 0 1.00215 129.88938 132.69338] CT
0.8 0.502 0.502 RC
N
f-2105962265
f
GR
GS
[1.00046 0 0 1.00215 123.83643 83.22358] CT
0.8 0.502 0.502 RC
N
f-2105962265
f
GR
GS
[1.00046 0 0 1.00215 142.44622 65.69005] CT
0.8 0.502 0.502 RC
N
f-2105962265
f
GR
GS
[1.00046 0 0 1.00215 119.62328 75.05886] CT
0.8 0.502 0.502 RC
N
f-2105962265
f
GR
GS
[1.00046 0 0 1.00215 90.54688 95.04699] CT
0.8 0.502 0.502 RC
N
f-2105962265
f
GR
GS
[1.00046 0 0 1.00215 122.83068 98.90869] CT
0.8 0.502 0.502 RC
N
f-2105962265
f
GR
GS
[1.00046 0 0 1.00215 133.53614 85.08863] CT
0.8 0.502 0.502 RC
N
f-2105962265
f
GR
GS
[1.00046 0 0 1.00215 115.41079 52.28458] CT
0.8 0.502 0.502 RC
N
f-2105962265
f
GR
GS
[1.00046 0 0 1.00215 127.06089 64.75137] CT
0.8 0.502 0.502 RC
N
f-2105962265
f
GR
GS
[1.00046 0 0 1.00215 130.94119 94.02353] CT
0.8 0.502 0.502 RC
N
f-2105962265
f
GR
GS
[1.00046 0 0 1.00215 139.89808 62.68482] CT
0.8 0.502 0.502 RC
N
f-2105962265
f
GR
GS
[1.00046 0 0 1.00215 109.25901 110.74291] CT
0.8 0.502 0.502 RC
N
f-2105962265
f
GR
GS
[1.00046 0 0 1.00215 142.63714 111.17299] CT
0.8 0.502 0.502 RC
N
f-2105962265
f
GR
GS
[1.00046 0 0 1.00215 153.26187 61.37461] CT
0.8 0.502 0.502 RC
N
f-2105962265
f
GR
GS
[1.00046 0 0 1.00215 117.6547 55.27674] CT
0.8 0.502 0.502 RC
N
f-2105962265
f
GR
GS
[1.00046 0 0 1.00215 152.10311 74.09319] CT
0.8 0.502 0.502 RC
N
f-2105962265
f
GR
GS
[1.00046 0 0 1.00215 126.06632 82.69396] CT
0.8 0.502 0.502 RC
N
f-2105962265
f
GR
GS
[1.00046 0 0 1.00215 147.76735 82.59275] CT
0.8 0.502 0.502 RC
N
f-2105962265
f
GR
GS
[1.00046 0 0 1.00215 144.9722 102.25542] CT
0.8 0.502 0.502 RC
N
f-2105962265
f
GR
GS
[1.00046 0 0 1.00215 148.27378 39.58149] CT
0.8 0.502 0.502 RC
N
f-2105962265
f
GR
GS
[1.00046 0 0 1.00215 131.32624 92.16373] CT
0.8 0.502 0.502 RC
N
f-2105962265
f
GR
GS
[1.00046 0 0 1.00215 148.95833 96.52712] CT
0.8 0.502 0.502 RC
N
f-2105962265
f
GR
GS
[1.00046 0 0 1.00215 115.4323 76.38103] CT
0.8 0.502 0.502 RC
N
f-2105962265
f
GR
GS
[1.00046 0 0 1.00215 114.59103 81.46554] CT
0.8 0.502 0.502 RC
N
f-2105962265
f
GR
GS
[1.00046 0 0 1.00215 158.61096 132.69338] CT
0.8 0.502 0.502 RC
N
f-2105962265
f
GR
GS
[1.00046 0 0 1.00215 115.61526 78.07947] CT
0.8 0.502 0.502 RC
N
f-2105962265
f
GR
GS
[1.00046 0 0 1.00215 109.92376 75.92027] CT
0.8 0.502 0.502 RC
N
f-2105962265
f
GR
GS
[1.00046 0 0 1.00215 155.31174 79.53729] CT
0.8 0.502 0.502 RC
N
f-2105962265
f
GR
GS
[1.00046 0 0 1.00215 122.88971 81.60255] CT
0.8 0.502 0.502 RC
N
f-2105962265
f
GR
GS
[1.00046 0 0 1.00215 125.46855 62.32787] CT
0.8 0.502 0.502 RC
N
f-2105962265
f
GR
GS
[1.00046 0 0 1.00215 148.96335 97.75] CT
0.8 0.502 0.502 RC
N
f-2105962265
f
GR
GS
[1.00046 0 0 1.00215 131.54956 106.58572] CT
0.8 0.502 0.502 RC
N
f-2105962265
f
GR
GS
[1.00046 0 0 1.00215 131.90846 97.77877] CT
0.8 0.502 0.502 RC
N
f-2105962265
f
GR
GS
[1.00046 0 0 1.00215 108.73533 91.40042] CT
0.8 0.502 0.502 RC
N
f-2105962265
f
GR
GS
[1.00046 0 0 1.00215 104.65085 93.32376] CT
0.8 0.502 0.502 RC
N
f-2105962265
f
GR
GS
[1.00046 0 0 1.00215 101.23358 89.97769] CT
0.8 0.502 0.502 RC
N
f-2105962265
f
GR
GS
[1.00046 0 0 1.00215 160.74316 86.63778] CT
0.8 0.502 0.502 RC
N
f-2105962265
f
GR
GS
[1.00046 0 0 1.00215 134.56377 81.13907] CT
0.8 0.502 0.502 RC
N
f-2105962265
f
GR
GS
[1.00046 0 0 1.00215 132.49163 119.84188] CT
0.8 0.502 0.502 RC
N
f-2105962265
f
GR
GS
[1.00046 0 0 1.00215 107.47301 88.09157] CT
0.8 0.502 0.502 RC
N
f-2105962265
f
GR
GS
[1.00046 0 0 1.00215 125.61361 86.36635] CT
0.8 0.502 0.502 RC
N
f-2105962265
f
GR
GS
[1.00046 0 0 1.00215 118.8634 132.69338] CT
0.8 0.502 0.502 RC
N
f-2105962265
f
GR
GS
[1.00046 0 0 1.00215 171.40864 42.82459] CT
0.8 0.502 0.502 RC
N
f-2105962265
f
GR
GS
[1.00046 0 0 1.00215 118.13962 91.98025] CT
0.8 0.502 0.502 RC
N
f-2105962265
f
GR
GS
[1.00046 0 0 1.00215 148.83686 39.58149] CT
0.8 0.502 0.502 RC
N
f-2105962265
f
GR
GS
[1.00046 0 0 1.00215 140.30587 100.66477] CT
0.8 0.502 0.502 RC
N
f-2105962265
f
GR
GS
[1.00046 0 0 1.00215 0 -0.4252] CT
0.902 0.6 0.6 RC
1 LJ
3 LW
N
74.5 95.365 M
231.5 64.248 L
S
GR
GS
[1.00046 0 0 1.00215 176.88961 131.85707] CT
1 0.702 0.702 RC
N
/f227889816{-3 -3 M
-3 3 L
3 3 L
3 -3 L
cp}def
f227889816
f
GR
GS
[1.00046 0 0 1.00215 124.57196 75.39684] CT
1 0.702 0.702 RC
N
f227889816
f
GR
GS
[1.00046 0 0 1.00215 204.31332 60.03881] CT
1 0.702 0.702 RC
N
f227889816
f
GR
GS
[1.00046 0 0 1.00215 184.24298 30.8084] CT
1 0.702 0.702 RC
N
f227889816
f
GR
GS
[1.00046 0 0 1.00215 123.7089 43.13606] CT
1 0.702 0.702 RC
N
f227889816
f
GR
GS
[1.00046 0 0 1.00215 139.64605 85.08416] CT
1 0.702 0.702 RC
N
f227889816
f
GR
GS
[1.00046 0 0 1.00215 168.31996 53.40582] CT
1 0.702 0.702 RC
N
f227889816
f
GR
GS
[1.00046 0 0 1.00215 150.21564 81.88872] CT
1 0.702 0.702 RC
N
f227889816
f
GR
GS
[1.00046 0 0 1.00215 140.37532 78.43472] CT
1 0.702 0.702 RC
N
f227889816
f
GR
GS
[1.00046 0 0 1.00215 201.92415 91.77978] CT
1 0.702 0.702 RC
N
f227889816
f
GR
GS
[1.00046 0 0 1.00215 180.28546 60.8944] CT
1 0.702 0.702 RC
N
f227889816
f
GR
GS
[1.00046 0 0 1.00215 153.67592 93.78901] CT
1 0.702 0.702 RC
N
f227889816
f
GR
GS
[1.00046 0 0 1.00215 133.87628 80.29475] CT
1 0.702 0.702 RC
N
f227889816
f
GR
GS
[1.00046 0 0 1.00215 146.3684 93.36733] CT
1 0.702 0.702 RC
N
f227889816
f
GR
GS
[1.00046 0 0 1.00215 169.68517 30.8084] CT
1 0.702 0.702 RC
N
f227889816
f
GR
GS
[1.00046 0 0 1.00215 112.18653 85.42824] CT
1 0.702 0.702 RC
N
f227889816
f
GR
GS
[1.00046 0 0 1.00215 142.78267 82.48259] CT
1 0.702 0.702 RC
N
f227889816
f
GR
GS
[1.00046 0 0 1.00215 179.27593 68.06299] CT
1 0.702 0.702 RC
N
f227889816
f
GR
GS
[1.00046 0 0 1.00215 209.3412 97.02531] CT
1 0.702 0.702 RC
N
f227889816
f
GR
GS
[1.00046 0 0 1.00215 99.79578 85.89688] CT
1 0.702 0.702 RC
N
f227889816
f
GR
GS
[1.00046 0 0 1.00215 168.43744 30.8084] CT
1 0.702 0.702 RC
N
f227889816
f
GR
GS
[1.00046 0 0 1.00215 185.54511 86.12182] CT
1 0.702 0.702 RC
N
f227889816
f
GR
GS
[1.00046 0 0 1.00215 140.21017 85.32622] CT
1 0.702 0.702 RC
N
f227889816
f
GR
GS
[1.00046 0 0 1.00215 162.11436 53.46848] CT
1 0.702 0.702 RC
N
f227889816
f
GR
GS
[1.00046 0 0 1.00215 156.45771 78.50756] CT
1 0.702 0.702 RC
N
f227889816
f
GR
GS
[1.00046 0 0 1.00215 113.46363 61.91445] CT
1 0.702 0.702 RC
N
f227889816
f
GR
GS
[1.00046 0 0 1.00215 160.37318 53.21041] CT
1 0.702 0.702 RC
N
f227889816
f
GR
GS
[1.00046 0 0 1.00215 178.05102 91.10896] CT
1 0.702 0.702 RC
N
f227889816
f
GR
GS
[1.00046 0 0 1.00215 188.10547 51.61919] CT
1 0.702 0.702 RC
N
f227889816
f
GR
GS
[1.00046 0 0 1.00215 158.54482 66.73009] CT
1 0.702 0.702 RC
N
f227889816
f
GR
GS
[1.00046 0 0 1.00215 177.97077 83.03369] CT
1 0.702 0.702 RC
N
f227889816
f
GR
GS
[1.00046 0 0 1.00215 209.3412 30.8084] CT
1 0.702 0.702 RC
N
f227889816
f
GR
GS
[1.00046 0 0 1.00215 165.1927 91.66144] CT
1 0.702 0.702 RC
N
f227889816
f
GR
GS
[1.00046 0 0 1.00215 190.60606 82.60282] CT
1 0.702 0.702 RC
N
f227889816
f
GR
GS
[1.00046 0 0 1.00215 203.40146 93.82636] CT
1 0.702 0.702 RC
N
f227889816
f
GR
GS
[1.00046 0 0 1.00215 183.18247 49.02468] CT
1 0.702 0.702 RC
N
f227889816
f
GR
GS
[1.00046 0 0 1.00215 142.36133 83.76942] CT
1 0.702 0.702 RC
N
f227889816
f
GR
GS
[1.00046 0 0 1.00215 151.65248 87.78276] CT
1 0.702 0.702 RC
N
f227889816
f
GR
GS
[1.00046 0 0 1.00215 111.44853 104.65811] CT
1 0.702 0.702 RC
N
f227889816
f
GR
GS
[1.00046 0 0 1.00215 136.6955 79.89119] CT
1 0.702 0.702 RC
N
f227889816
f
GR
GS
[1.00046 0 0 1.00215 112.10599 104.62063] CT
1 0.702 0.702 RC
N
f227889816
f
GR
GS
[1.00046 0 0 1.00215 157.4558 72.62171] CT
1 0.702 0.702 RC
N
f227889816
f
GR
GS
[1.00046 0 0 1.00215 147.94491 132.69338] CT
0.8 0.502 0.502 RC
N
/f-1969333140{-3.536 0 M
0 4.702 L
3.536 0 L
0 -4.702 L
cp}def
f-1969333140
f
GR
GS
[1.00046 0 0 1.00215 126.18181 117.71863] CT
0.8 0.502 0.502 RC
N
f-1969333140
f
GR
GS
[1.00046 0 0 1.00215 159.15008 71.02947] CT
0.8 0.502 0.502 RC
N
f-1969333140
f
GR
GS
[1.00046 0 0 1.00215 96.76129 88.02168] CT
0.8 0.502 0.502 RC
N
f-1969333140
f
GR
GS
[1.00046 0 0 1.00215 154.25256 80.43746] CT
0.8 0.502 0.502 RC
N
f-1969333140
f
GR
GS
[1.00046 0 0 1.00215 74.5345 57.05141] CT
0.8 0.502 0.502 RC
N
f-1969333140
f
GR
GS
[1.00046 0 0 1.00215 141.46217 132.69338] CT
0.8 0.502 0.502 RC
N
f-1969333140
f
GR
GS
[1.00046 0 0 1.00215 129.88938 132.69338] CT
0.8 0.502 0.502 RC
N
f-1969333140
f
GR
GS
[1.00046 0 0 1.00215 123.83643 83.22358] CT
0.8 0.502 0.502 RC
N
f-1969333140
f
GR
GS
[1.00046 0 0 1.00215 142.44622 65.69005] CT
0.8 0.502 0.502 RC
N
f-1969333140
f
GR
GS
[1.00046 0 0 1.00215 119.62328 75.05886] CT
0.8 0.502 0.502 RC
N
f-1969333140
f
GR
GS
[1.00046 0 0 1.00215 90.54688 95.04699] CT
0.8 0.502 0.502 RC
N
f-1969333140
f
GR
GS
[1.00046 0 0 1.00215 122.83068 98.90869] CT
0.8 0.502 0.502 RC
N
f-1969333140
f
GR
GS
[1.00046 0 0 1.00215 133.53614 85.08863] CT
0.8 0.502 0.502 RC
N
f-1969333140
f
GR
GS
[1.00046 0 0 1.00215 115.41079 52.28458] CT
0.8 0.502 0.502 RC
N
f-1969333140
f
GR
GS
[1.00046 0 0 1.00215 127.06089 64.75137] CT
0.8 0.502 0.502 RC
N
f-1969333140
f
GR
GS
[1.00046 0 0 1.00215 130.94119 94.02353] CT
0.8 0.502 0.502 RC
N
f-1969333140
f
GR
GS
[1.00046 0 0 1.00215 139.89808 62.68482] CT
0.8 0.502 0.502 RC
N
f-1969333140
f
GR
GS
[1.00046 0 0 1.00215 109.25901 110.74291] CT
0.8 0.502 0.502 RC
N
f-1969333140
f
GR
GS
[1.00046 0 0 1.00215 142.63714 111.17299] CT
0.8 0.502 0.502 RC
N
f-1969333140
f
GR
GS
[1.00046 0 0 1.00215 153.26187 61.37461] CT
0.8 0.502 0.502 RC
N
f-1969333140
f
GR
GS
[1.00046 0 0 1.00215 117.6547 55.27674] CT
0.8 0.502 0.502 RC
N
f-1969333140
f
GR
GS
[1.00046 0 0 1.00215 152.10311 74.09319] CT
0.8 0.502 0.502 RC
N
f-1969333140
f
GR
GS
[1.00046 0 0 1.00215 126.06632 82.69396] CT
0.8 0.502 0.502 RC
N
f-1969333140
f
GR
GS
[1.00046 0 0 1.00215 147.76735 82.59275] CT
0.8 0.502 0.502 RC
N
f-1969333140
f
GR
GS
[1.00046 0 0 1.00215 144.9722 102.25542] CT
0.8 0.502 0.502 RC
N
f-1969333140
f
GR
GS
[1.00046 0 0 1.00215 148.27378 39.58149] CT
0.8 0.502 0.502 RC
N
f-1969333140
f
GR
GS
[1.00046 0 0 1.00215 131.32624 92.16373] CT
0.8 0.502 0.502 RC
N
f-1969333140
f
GR
GS
[1.00046 0 0 1.00215 148.95833 96.52712] CT
0.8 0.502 0.502 RC
N
f-1969333140
f
GR
GS
[1.00046 0 0 1.00215 115.4323 76.38103] CT
0.8 0.502 0.502 RC
N
f-1969333140
f
GR
GS
[1.00046 0 0 1.00215 114.59103 81.46554] CT
0.8 0.502 0.502 RC
N
f-1969333140
f
GR
GS
[1.00046 0 0 1.00215 158.61096 132.69338] CT
0.8 0.502 0.502 RC
N
f-1969333140
f
GR
GS
[1.00046 0 0 1.00215 115.61526 78.07947] CT
0.8 0.502 0.502 RC
N
f-1969333140
f
GR
GS
[1.00046 0 0 1.00215 109.92376 75.92027] CT
0.8 0.502 0.502 RC
N
f-1969333140
f
GR
GS
[1.00046 0 0 1.00215 155.31174 79.53729] CT
0.8 0.502 0.502 RC
N
f-1969333140
f
GR
GS
[1.00046 0 0 1.00215 122.88971 81.60255] CT
0.8 0.502 0.502 RC
N
f-1969333140
f
GR
GS
[1.00046 0 0 1.00215 125.46855 62.32787] CT
0.8 0.502 0.502 RC
N
f-1969333140
f
GR
GS
[1.00046 0 0 1.00215 148.96335 97.75] CT
0.8 0.502 0.502 RC
N
f-1969333140
f
GR
GS
[1.00046 0 0 1.00215 131.54956 106.58572] CT
0.8 0.502 0.502 RC
N
f-1969333140
f
GR
GS
[1.00046 0 0 1.00215 131.90846 97.77877] CT
0.8 0.502 0.502 RC
N
f-1969333140
f
GR
GS
[1.00046 0 0 1.00215 108.73533 91.40042] CT
0.8 0.502 0.502 RC
N
f-1969333140
f
GR
GS
[1.00046 0 0 1.00215 104.65085 93.32376] CT
0.8 0.502 0.502 RC
N
f-1969333140
f
GR
GS
[1.00046 0 0 1.00215 101.23358 89.97769] CT
0.8 0.502 0.502 RC
N
f-1969333140
f
GR
GS
[1.00046 0 0 1.00215 160.74316 86.63778] CT
0.8 0.502 0.502 RC
N
f-1969333140
f
GR
GS
[1.00046 0 0 1.00215 134.56377 81.13907] CT
0.8 0.502 0.502 RC
N
f-1969333140
f
GR
GS
[1.00046 0 0 1.00215 132.49163 119.84188] CT
0.8 0.502 0.502 RC
N
f-1969333140
f
GR
GS
[1.00046 0 0 1.00215 107.47301 88.09157] CT
0.8 0.502 0.502 RC
N
f-1969333140
f
GR
GS
[1.00046 0 0 1.00215 125.61361 86.36635] CT
0.8 0.502 0.502 RC
N
f-1969333140
f
GR
GS
[1.00046 0 0 1.00215 118.8634 132.69338] CT
0.8 0.502 0.502 RC
N
f-1969333140
f
GR
GS
[1.00046 0 0 1.00215 171.40864 42.82459] CT
0.8 0.502 0.502 RC
N
f-1969333140
f
GR
GS
[1.00046 0 0 1.00215 118.13962 91.98025] CT
0.8 0.502 0.502 RC
N
f-1969333140
f
GR
GS
[1.00046 0 0 1.00215 148.83686 39.58149] CT
0.8 0.502 0.502 RC
N
f-1969333140
f
GR
GS
[1.00046 0 0 1.00215 140.30587 100.66477] CT
0.8 0.502 0.502 RC
N
f-1969333140
f
GR
%%Trailer
%%Pages: 1
%%EOF
