%!PS-Adobe-3.0 EPSF-3.0
%%Creator: (MATLAB, The Mathworks, Inc. Version 9.8.0.1323502 \(R2020a\). Operating System: Mac OS X)
%%Title: /Users/kosciessa/Desktop/mntTardisLNDG/LNDG/stateswitch/stsw_multimodal/figures/correlations/f_drift_cpp_linear.eps
%%CreationDate: 2022-03-06T14:46:19
%%Pages: (atend)
%%BoundingBox:   -13     0   278   196
%%LanguageLevel: 3
%%EndComments
%%BeginProlog
%%BeginResource: procset (Apache XML Graphics Std ProcSet) 1.2 0
%%Version: 1.2 0
%%Copyright: (Copyright 2001-2003,2010 The Apache Software Foundation. License terms: http://www.apache.org/licenses/LICENSE-2.0)
/bd{bind def}bind def
/ld{load def}bd
/GR/grestore ld
/GS/gsave ld
/RM/rmoveto ld
/C/curveto ld
/t/show ld
/L/lineto ld
/ML/setmiterlimit ld
/CT/concat ld
/f/fill ld
/N/newpath ld
/S/stroke ld
/CC/setcmykcolor ld
/A/ashow ld
/cp/closepath ld
/RC/setrgbcolor ld
/LJ/setlinejoin ld
/GC/setgray ld
/LW/setlinewidth ld
/M/moveto ld
/re {4 2 roll M
1 index 0 rlineto
0 exch rlineto
neg 0 rlineto
cp } bd
/_ctm matrix def
/_tm matrix def
/BT { _ctm currentmatrix pop matrix _tm copy pop 0 0 moveto } bd
/ET { _ctm setmatrix } bd
/iTm { _ctm setmatrix _tm concat } bd
/Tm { _tm astore pop iTm 0 0 moveto } bd
/ux 0.0 def
/uy 0.0 def
/F {
  /Tp exch def
  /Tf exch def
  Tf findfont Tp scalefont setfont
  /cf Tf def  /cs Tp def
} bd
/ULS {currentpoint /uy exch def /ux exch def} bd
/ULE {
  /Tcx currentpoint pop def
  gsave
  newpath
  cf findfont cs scalefont dup
  /FontMatrix get 0 get /Ts exch def /FontInfo get dup
  /UnderlinePosition get Ts mul /To exch def
  /UnderlineThickness get Ts mul /Tt exch def
  ux uy To add moveto  Tcx uy To add lineto
  Tt setlinewidth stroke
  grestore
} bd
/OLE {
  /Tcx currentpoint pop def
  gsave
  newpath
  cf findfont cs scalefont dup
  /FontMatrix get 0 get /Ts exch def /FontInfo get dup
  /UnderlinePosition get Ts mul /To exch def
  /UnderlineThickness get Ts mul /Tt exch def
  ux uy To add cs add moveto Tcx uy To add cs add lineto
  Tt setlinewidth stroke
  grestore
} bd
/SOE {
  /Tcx currentpoint pop def
  gsave
  newpath
  cf findfont cs scalefont dup
  /FontMatrix get 0 get /Ts exch def /FontInfo get dup
  /UnderlinePosition get Ts mul /To exch def
  /UnderlineThickness get Ts mul /Tt exch def
  ux uy To add cs 10 mul 26 idiv add moveto Tcx uy To add cs 10 mul 26 idiv add lineto
  Tt setlinewidth stroke
  grestore
} bd
/QT {
/Y22 exch store
/X22 exch store
/Y21 exch store
/X21 exch store
currentpoint
/Y21 load 2 mul add 3 div exch
/X21 load 2 mul add 3 div exch
/X21 load 2 mul /X22 load add 3 div
/Y21 load 2 mul /Y22 load add 3 div
/X22 load /Y22 load curveto
} bd
/SSPD {
dup length /d exch dict def
{
/v exch def
/k exch def
currentpagedevice k known {
/cpdv currentpagedevice k get def
v cpdv ne {
/upd false def
/nullv v type /nulltype eq def
/nullcpdv cpdv type /nulltype eq def
nullv nullcpdv or
{
/upd true def
} {
/sametype v type cpdv type eq def
sametype {
v type /arraytype eq {
/vlen v length def
/cpdvlen cpdv length def
vlen cpdvlen eq {
0 1 vlen 1 sub {
/i exch def
/obj v i get def
/cpdobj cpdv i get def
obj cpdobj ne {
/upd true def
exit
} if
} for
} {
/upd true def
} ifelse
} {
v type /dicttype eq {
v {
/dv exch def
/dk exch def
/cpddv cpdv dk get def
dv cpddv ne {
/upd true def
exit
} if
} forall
} {
/upd true def
} ifelse
} ifelse
} if
} ifelse
upd true eq {
d k v put
} if
} if
} if
} forall
d length 0 gt {
d setpagedevice
} if
} bd
/RE { % /NewFontName [NewEncodingArray] /FontName RE -
  findfont dup length dict begin
  {
    1 index /FID ne
    {def} {pop pop} ifelse
  } forall
  /Encoding exch def
  /FontName 1 index def
  currentdict definefont pop
  end
} bind def
%%EndResource
%%BeginResource: procset (Apache XML Graphics EPS ProcSet) 1.0 0
%%Version: 1.0 0
%%Copyright: (Copyright 2002-2003 The Apache Software Foundation. License terms: http://www.apache.org/licenses/LICENSE-2.0)
/BeginEPSF { %def
/b4_Inc_state save def         % Save state for cleanup
/dict_count countdictstack def % Count objects on dict stack
/op_count count 1 sub def      % Count objects on operand stack
userdict begin                 % Push userdict on dict stack
/showpage { } def              % Redefine showpage, { } = null proc
0 setgray 0 setlinecap         % Prepare graphics state
1 setlinewidth 0 setlinejoin
10 setmiterlimit [ ] 0 setdash newpath
/languagelevel where           % If level not equal to 1 then
{pop languagelevel             % set strokeadjust and
1 ne                           % overprint to their defaults.
{false setstrokeadjust false setoverprint
} if
} if
} bd
/EndEPSF { %def
count op_count sub {pop} repeat            % Clean up stacks
countdictstack dict_count sub {end} repeat
b4_Inc_state restore
} bd
%%EndResource
%FOPBeginFontDict
%%IncludeResource: font Courier-Oblique
%%IncludeResource: font Courier-BoldOblique
%%IncludeResource: font Courier-Bold
%%IncludeResource: font ZapfDingbats
%%IncludeResource: font Symbol
%%IncludeResource: font Helvetica
%%IncludeResource: font Helvetica-Oblique
%%IncludeResource: font Helvetica-Bold
%%IncludeResource: font Helvetica-BoldOblique
%%IncludeResource: font Times-Roman
%%IncludeResource: font Times-Italic
%%IncludeResource: font Times-Bold
%%IncludeResource: font Times-BoldItalic
%%IncludeResource: font Courier
%FOPEndFontDict
%%BeginResource: encoding WinAnsiEncoding
/WinAnsiEncoding [
/.notdef /.notdef /.notdef /.notdef /.notdef
/.notdef /.notdef /.notdef /.notdef /.notdef
/.notdef /.notdef /.notdef /.notdef /.notdef
/.notdef /.notdef /.notdef /.notdef /.notdef
/.notdef /.notdef /.notdef /.notdef /.notdef
/.notdef /.notdef /.notdef /.notdef /.notdef
/.notdef /.notdef /space /exclam /quotedbl
/numbersign /dollar /percent /ampersand /quotesingle
/parenleft /parenright /asterisk /plus /comma
/hyphen /period /slash /zero /one
/two /three /four /five /six
/seven /eight /nine /colon /semicolon
/less /equal /greater /question /at
/A /B /C /D /E
/F /G /H /I /J
/K /L /M /N /O
/P /Q /R /S /T
/U /V /W /X /Y
/Z /bracketleft /backslash /bracketright /asciicircum
/underscore /quoteleft /a /b /c
/d /e /f /g /h
/i /j /k /l /m
/n /o /p /q /r
/s /t /u /v /w
/x /y /z /braceleft /bar
/braceright /asciitilde /bullet /Euro /bullet
/quotesinglbase /florin /quotedblbase /ellipsis /dagger
/daggerdbl /circumflex /perthousand /Scaron /guilsinglleft
/OE /bullet /Zcaron /bullet /bullet
/quoteleft /quoteright /quotedblleft /quotedblright /bullet
/endash /emdash /asciitilde /trademark /scaron
/guilsinglright /oe /bullet /zcaron /Ydieresis
/space /exclamdown /cent /sterling /currency
/yen /brokenbar /section /dieresis /copyright
/ordfeminine /guillemotleft /logicalnot /sfthyphen /registered
/macron /degree /plusminus /twosuperior /threesuperior
/acute /mu /paragraph /middot /cedilla
/onesuperior /ordmasculine /guillemotright /onequarter /onehalf
/threequarters /questiondown /Agrave /Aacute /Acircumflex
/Atilde /Adieresis /Aring /AE /Ccedilla
/Egrave /Eacute /Ecircumflex /Edieresis /Igrave
/Iacute /Icircumflex /Idieresis /Eth /Ntilde
/Ograve /Oacute /Ocircumflex /Otilde /Odieresis
/multiply /Oslash /Ugrave /Uacute /Ucircumflex
/Udieresis /Yacute /Thorn /germandbls /agrave
/aacute /acircumflex /atilde /adieresis /aring
/ae /ccedilla /egrave /eacute /ecircumflex
/edieresis /igrave /iacute /icircumflex /idieresis
/eth /ntilde /ograve /oacute /ocircumflex
/otilde /odieresis /divide /oslash /ugrave
/uacute /ucircumflex /udieresis /yacute /thorn
/ydieresis
] def
%%EndResource
%FOPBeginFontReencode
/Courier-Oblique findfont
dup length dict begin
  {1 index /FID ne {def} {pop pop} ifelse} forall
  /Encoding WinAnsiEncoding def
  currentdict
end
/Courier-Oblique exch definefont pop
/Courier-BoldOblique findfont
dup length dict begin
  {1 index /FID ne {def} {pop pop} ifelse} forall
  /Encoding WinAnsiEncoding def
  currentdict
end
/Courier-BoldOblique exch definefont pop
/Courier-Bold findfont
dup length dict begin
  {1 index /FID ne {def} {pop pop} ifelse} forall
  /Encoding WinAnsiEncoding def
  currentdict
end
/Courier-Bold exch definefont pop
/Helvetica findfont
dup length dict begin
  {1 index /FID ne {def} {pop pop} ifelse} forall
  /Encoding WinAnsiEncoding def
  currentdict
end
/Helvetica exch definefont pop
/Helvetica-Oblique findfont
dup length dict begin
  {1 index /FID ne {def} {pop pop} ifelse} forall
  /Encoding WinAnsiEncoding def
  currentdict
end
/Helvetica-Oblique exch definefont pop
/Helvetica-Bold findfont
dup length dict begin
  {1 index /FID ne {def} {pop pop} ifelse} forall
  /Encoding WinAnsiEncoding def
  currentdict
end
/Helvetica-Bold exch definefont pop
/Helvetica-BoldOblique findfont
dup length dict begin
  {1 index /FID ne {def} {pop pop} ifelse} forall
  /Encoding WinAnsiEncoding def
  currentdict
end
/Helvetica-BoldOblique exch definefont pop
/Times-Roman findfont
dup length dict begin
  {1 index /FID ne {def} {pop pop} ifelse} forall
  /Encoding WinAnsiEncoding def
  currentdict
end
/Times-Roman exch definefont pop
/Times-Italic findfont
dup length dict begin
  {1 index /FID ne {def} {pop pop} ifelse} forall
  /Encoding WinAnsiEncoding def
  currentdict
end
/Times-Italic exch definefont pop
/Times-Bold findfont
dup length dict begin
  {1 index /FID ne {def} {pop pop} ifelse} forall
  /Encoding WinAnsiEncoding def
  currentdict
end
/Times-Bold exch definefont pop
/Times-BoldItalic findfont
dup length dict begin
  {1 index /FID ne {def} {pop pop} ifelse} forall
  /Encoding WinAnsiEncoding def
  currentdict
end
/Times-BoldItalic exch definefont pop
/Courier findfont
dup length dict begin
  {1 index /FID ne {def} {pop pop} ifelse} forall
  /Encoding WinAnsiEncoding def
  currentdict
end
/Courier exch definefont pop
%FOPEndFontReencode
%%EndProlog
%%Page: 1 1
%%PageBoundingBox: 0 0 227 198
%%BeginPageSetup
[1 0 0 -1 0 198] CT
%%EndPageSetup
GS
[0.99899 0 0 1.00215 0 -0.4252] CT
N
0 0 M
227 0 L
227 198 L
0 198 L
0 0 L
cp
clip
1 GC
N
0 0 227 198 re
f
GR
GS
[0.99899 0 0 1.00215 0 -0.4252] CT
1 GC
N
0 0 227 198 re
f
GR
GS
[0.99899 0 0 1.00215 0 -0.4252] CT
0.2 GC
N
55 143 M
205.5 143 L
205.5 21 L
55 21 L
cp
f
GR
GS
[0.99899 0 0 1.00215 0 -0.4252] CT
0.149 GC
2 setlinecap
1 LJ
0.5 LW
N
55 143 M
205.5 143 L
S
GR
GS
[0.99899 0 0 1.00215 0 -0.4252] CT
0.149 GC
2 setlinecap
1 LJ
0.5 LW
N
55 143 M
55 141.495 L
S
GR
GS
[0.99899 0 0 1.00215 0 -0.4252] CT
0.149 GC
2 setlinecap
1 LJ
0.5 LW
N
105.034 143 M
105.034 141.495 L
S
GR
GS
[0.99899 0 0 1.00215 0 -0.4252] CT
0.149 GC
2 setlinecap
1 LJ
0.5 LW
N
155.067 143 M
155.067 141.495 L
S
GR
GS
[0.99899 0 0 1.00215 0 -0.4252] CT
0.149 GC
2 setlinecap
1 LJ
0.5 LW
N
205.101 143 M
205.101 141.495 L
S
GR
GS
[0.99899 0 0 1.00215 54.94467 147.6922] CT
0.149 GC
/Helvetica 14 F
GS
[1 0 0 1 0 0] CT
-12.5 14 moveto 
1 -1 scale
(-0.6) t 
GR
GR
GS
[0.99899 0 0 1.00215 104.92802 147.6922] CT
0.149 GC
/Helvetica 14 F
GS
[1 0 0 1 0 0] CT
-12.5 14 moveto 
1 -1 scale
(-0.4) t 
GR
GR
GS
[0.99899 0 0 1.00215 154.91136 147.6922] CT
0.149 GC
/Helvetica 14 F
GS
[1 0 0 1 0 0] CT
-12.5 14 moveto 
1 -1 scale
(-0.2) t 
GR
GR
GS
[0.99899 0 0 1.00215 204.89471 147.6922] CT
0.149 GC
/Helvetica 14 F
GS
[1 0 0 1 0 0] CT
-4 14 moveto 
1 -1 scale
(0) t 
GR
GR
GS
[0.99899 0 0 1.00215 130.11905 165.22978] CT
0.149 GC
/Helvetica 14 F
GS
[1 0 0 1 0 0] CT
-26.5 14 moveto 
1 -1 scale
(drift rate) t 
GR
GR
GS
[0.99899 0 0 1.00215 130.11905 165.22978] CT
0.149 GC
/Helvetica 14 F
GS
[1 0 0 1 0 0] CT
-20.5 31 moveto 
1 -1 scale
(\(linear\)) t 
GR
GR
GS
[0.99899 0 0 1.00215 0 -0.4252] CT
0.149 GC
2 setlinecap
1 LJ
0.5 LW
N
55 143 M
55 21 L
S
GR
GS
[0.99899 0 0 1.00215 0 -0.4252] CT
0.149 GC
2 setlinecap
1 LJ
0.5 LW
N
55 141.364 M
56.505 141.364 L
S
GR
GS
[0.99899 0 0 1.00215 0 -0.4252] CT
0.149 GC
2 setlinecap
1 LJ
0.5 LW
N
55 119.277 M
56.505 119.277 L
S
GR
GS
[0.99899 0 0 1.00215 0 -0.4252] CT
0.149 GC
2 setlinecap
1 LJ
0.5 LW
N
55 97.191 M
56.505 97.191 L
S
GR
GS
[0.99899 0 0 1.00215 0 -0.4252] CT
0.149 GC
2 setlinecap
1 LJ
0.5 LW
N
55 75.104 M
56.505 75.104 L
S
GR
GS
[0.99899 0 0 1.00215 0 -0.4252] CT
0.149 GC
2 setlinecap
1 LJ
0.5 LW
N
55 53.017 M
56.505 53.017 L
S
GR
GS
[0.99899 0 0 1.00215 0 -0.4252] CT
0.149 GC
2 setlinecap
1 LJ
0.5 LW
N
55 30.931 M
56.505 30.931 L
S
GR
GS
[0.99899 0 0 1.00215 50.1495 141.24234] CT
0.149 GC
/Helvetica 14 F
GS
[1 0 0 1 0 0] CT
-14 5.5 moveto 
1 -1 scale
(-8) t 
GR
GR
GS
[0.99899 0 0 1.00215 50.1495 119.10822] CT
0.149 GC
/Helvetica 14 F
GS
[1 0 0 1 0 0] CT
-14 5.5 moveto 
1 -1 scale
(-6) t 
GR
GR
GS
[0.99899 0 0 1.00215 50.1495 96.9741] CT
0.149 GC
/Helvetica 14 F
GS
[1 0 0 1 0 0] CT
-14 5.5 moveto 
1 -1 scale
(-4) t 
GR
GR
GS
[0.99899 0 0 1.00215 50.1495 74.83997] CT
0.149 GC
/Helvetica 14 F
GS
[1 0 0 1 0 0] CT
-14 5.5 moveto 
1 -1 scale
(-2) t 
GR
GR
GS
[0.99899 0 0 1.00215 50.1495 52.70585] CT
0.149 GC
/Helvetica 14 F
GS
[1 0 0 1 0 0] CT
-8 5.5 moveto 
1 -1 scale
(0) t 
GR
GR
GS
[0.99899 0 0 1.00215 50.1495 30.57173] CT
0.149 GC
/Helvetica 14 F
GS
[1 0 0 1 0 0] CT
-8 5.5 moveto 
1 -1 scale
(2) t 
GR
GR
GS
[0 -1.00215 0.99899 0 33.6661 81.75083] CT
0.149 GC
/Helvetica 14 F
GS
[1 0 0 1 0 0] CT
-31 -20 moveto 
1 -1 scale
(cpp slope) t 
GR
GR
GS
[0 -1.00215 0.99899 0 33.6661 81.75083] CT
0.149 GC
/Helvetica 14 F
GS
[1 0 0 1 0 0] CT
-20.5 -3 moveto 
1 -1 scale
(\(linear\)) t 
GR
GR
GS
[0.99899 0 0 1.00215 54.94467 17.61345] CT
0.149 GC
N
2.063 -0.406 M
2.063 -0.516 2.125 -0.609 QT
5.031 -3.5 L
2.125 -6.406 L
2.063 -6.484 2.063 -6.594 QT
2.063 -6.703 2.141 -6.789 QT
2.219 -6.875 2.344 -6.875 QT
2.438 -6.875 2.547 -6.781 QT
5.453 -3.891 L
8.328 -6.781 L
8.453 -6.875 8.531 -6.875 QT
8.656 -6.875 8.734 -6.797 QT
8.813 -6.719 8.813 -6.594 QT
8.813 -6.484 8.75 -6.406 QT
5.844 -3.5 L
8.75 -0.609 L
8.813 -0.516 8.813 -0.406 QT
8.813 -0.281 8.734 -0.203 QT
8.656 -0.125 8.531 -0.125 QT
8.438 -0.125 8.328 -0.219 QT
5.453 -3.109 L
2.547 -0.219 L
2.453 -0.125 2.344 -0.125 QT
2.219 -0.125 2.141 -0.211 QT
2.063 -0.297 2.063 -0.406 QT
cp
f
GR
GS
[0.99899 0 0 1.00215 65.93361 17.61345] CT
0.149 GC
/Helvetica 14 F
GS
[1 0 0 1 0 0] CT
0 0 moveto 
1 -1 scale
(10) t 
GR
GR
GS
[0.99899 0 0 1.00215 81.91751 10.59842] CT
0.149 GC
/Helvetica 11.2 F
GS
[1 0 0 1 0 0] CT
0 0 moveto 
1 -1 scale
(-6) t 
GR
GR
GS
[0.99899 0 0 1.00215 130.1191 18.86614] CT
/Helvetica-Bold 14 F
GS
[1 0 0 1 0 0] CT
-145 -4 moveto 
1 -1 scale
(r\(93\) = 0.45, 95%CI = [0.27,0.59], p = 6.1e-06) t 
GR
GR
GS
[0.99899 0 0 1.00215 111.50771 45.31045] CT
0.502 0.702 0.8 RC
N
0.5 0 M
0.5 -0.276 0.276 -0.5 0 -0.5 C
-0.276 -0.5 -0.5 -0.276 -0.5 0 C
-0.5 0.276 -0.276 0.5 0 0.5 C
0.276 0.5 0.5 0.276 0.5 0 C
cp
f
GR
GS
[0.99899 0 0 1.00215 115.32692 78.81165] CT
0.502 0.702 0.8 RC
N
/f-2105962265{0.5 0 M
0.5 -0.276 0.276 -0.5 0 -0.5 C
-0.276 -0.5 -0.5 -0.276 -0.5 0 C
-0.5 0.276 -0.276 0.5 0 0.5 C
0.276 0.5 0.5 0.276 0.5 0 C
cp}def
f-2105962265
f
GR
GS
[0.99899 0 0 1.00215 147.82195 53.74735] CT
0.502 0.702 0.8 RC
N
f-2105962265
f
GR
GS
[0.99899 0 0 1.00215 154.11884 76.23966] CT
0.502 0.702 0.8 RC
N
f-2105962265
f
GR
GS
[0.99899 0 0 1.00215 166.9212 53.84664] CT
0.502 0.702 0.8 RC
N
f-2105962265
f
GR
GS
[0.99899 0 0 1.00215 109.55045 33.70386] CT
0.502 0.702 0.8 RC
N
f-2105962265
f
GR
GS
[0.99899 0 0 1.00215 115.45539 72.76429] CT
0.502 0.702 0.8 RC
N
f-2105962265
f
GR
GS
[0.99899 0 0 1.00215 86.82336 72.79132] CT
0.502 0.702 0.8 RC
N
f-2105962265
f
GR
GS
[0.99899 0 0 1.00215 193.99381 62.39716] CT
0.502 0.702 0.8 RC
N
f-2105962265
f
GR
GS
[0.99899 0 0 1.00215 144.22472 78.04113] CT
0.502 0.702 0.8 RC
N
f-2105962265
f
GR
GS
[0.99899 0 0 1.00215 138.51122 90.82526] CT
0.502 0.702 0.8 RC
N
f-2105962265
f
GR
GS
[0.99899 0 0 1.00215 118.17141 98.4389] CT
0.502 0.702 0.8 RC
N
f-2105962265
f
GR
GS
[0.99899 0 0 1.00215 167.06516 56.5156] CT
0.502 0.702 0.8 RC
N
f-2105962265
f
GR
GS
[0.99899 0 0 1.00215 143.60291 62.53696] CT
0.502 0.702 0.8 RC
N
f-2105962265
f
GR
GS
[0.99899 0 0 1.00215 121.22559 35.21783] CT
0.502 0.702 0.8 RC
N
f-2105962265
f
GR
GS
[0.99899 0 0 1.00215 161.27285 64.41981] CT
0.502 0.702 0.8 RC
N
f-2105962265
f
GR
GS
[0.99899 0 0 1.00215 131.07076 80.4984] CT
0.502 0.702 0.8 RC
N
f-2105962265
f
GR
GS
[0.99899 0 0 1.00215 107.54006 81.33407] CT
0.502 0.702 0.8 RC
N
f-2105962265
f
GR
GS
[0.99899 0 0 1.00215 104.20171 84.38213] CT
0.502 0.702 0.8 RC
N
f-2105962265
f
GR
GS
[0.99899 0 0 1.00215 108.86099 68.05369] CT
0.502 0.702 0.8 RC
N
f-2105962265
f
GR
GS
[0.99899 0 0 1.00215 62.82397 75.42669] CT
0.502 0.702 0.8 RC
N
f-2105962265
f
GR
GS
[0.99899 0 0 1.00215 117.60263 90.06081] CT
0.502 0.702 0.8 RC
N
f-2105962265
f
GR
GS
[0.99899 0 0 1.00215 165.17119 65.805] CT
0.502 0.702 0.8 RC
N
f-2105962265
f
GR
GS
[0.99899 0 0 1.00215 59.91655 33.70386] CT
0.502 0.702 0.8 RC
N
f-2105962265
f
GR
GS
[0.99899 0 0 1.00215 93.05135 78.71147] CT
0.502 0.702 0.8 RC
N
f-2105962265
f
GR
GS
[0.99899 0 0 1.00215 64.70579 93.67313] CT
0.502 0.702 0.8 RC
N
f-2105962265
f
GR
GS
[0.99899 0 0 1.00215 146.48203 91.89332] CT
0.502 0.702 0.8 RC
N
f-2105962265
f
GR
GS
[0.99899 0 0 1.00215 62.13335 95.27559] CT
0.502 0.702 0.8 RC
N
f-2105962265
f
GR
GS
[0.99899 0 0 1.00215 113.53615 111.24203] CT
0.502 0.702 0.8 RC
N
f-2105962265
f
GR
GS
[0.99899 0 0 1.00215 101.15489 111.30873] CT
0.502 0.702 0.8 RC
N
f-2105962265
f
GR
GS
[0.99899 0 0 1.00215 145.12535 63.11915] CT
0.502 0.702 0.8 RC
N
f-2105962265
f
GR
GS
[0.99899 0 0 1.00215 67.98766 132.69338] CT
0.502 0.702 0.8 RC
N
f-2105962265
f
GR
GS
[0.99899 0 0 1.00215 76.80877 99.84294] CT
0.502 0.702 0.8 RC
N
f-2105962265
f
GR
GS
[0.99899 0 0 1.00215 106.58478 83.24158] CT
0.502 0.702 0.8 RC
N
f-2105962265
f
GR
GS
[0.99899 0 0 1.00215 81.42512 66.52131] CT
0.502 0.702 0.8 RC
N
f-2105962265
f
GR
GS
[0.99899 0 0 1.00215 70.66359 82.08835] CT
0.502 0.702 0.8 RC
N
f-2105962265
f
GR
GS
[0.99899 0 0 1.00215 113.63856 68.25238] CT
0.502 0.702 0.8 RC
N
f-2105962265
f
GR
GS
[0.99899 0 0 1.00215 69.43637 109.83272] CT
0.502 0.702 0.8 RC
N
f-2105962265
f
GR
GS
[0.99899 0 0 1.00215 151.17907 67.07614] CT
0.502 0.702 0.8 RC
N
f-2105962265
f
GR
GS
[0.99899 0 0 1.00215 105.7055 91.1701] CT
0.502 0.702 0.8 RC
N
f-2105962265
f
GR
GS
[0.99899 0 0 1.00215 127.15136 114.49174] CT
0.502 0.702 0.8 RC
N
f-2105962265
f
GR
GS
[0.99899 0 0 1.00215 124.06396 96.351] CT
0.502 0.702 0.8 RC
N
f-2105962265
f
GR
GS
[0.99899 0 0 1.00215 157.56022 83.6851] CT
0.502 0.702 0.8 RC
N
f-2105962265
f
GR
GS
[0.99899 0 0 1.00215 139.35632 66.85158] CT
0.502 0.702 0.8 RC
N
f-2105962265
f
GR
GS
[0.99899 0 0 1.00215 160.97453 90.13489] CT
0.502 0.702 0.8 RC
N
f-2105962265
f
GR
GS
[0.99899 0 0 1.00215 193.58399 56.33713] CT
0.502 0.702 0.8 RC
N
f-2105962265
f
GR
GS
[0.99899 0 0 1.00215 126.94336 65.18465] CT
0.502 0.702 0.8 RC
N
f-2105962265
f
GR
GS
[0.99899 0 0 1.00215 167.91592 50.21011] CT
0.502 0.702 0.8 RC
N
f-2105962265
f
GR
GS
[0.99899 0 0 1.00215 137.44444 61.6747] CT
0.502 0.702 0.8 RC
N
f-2105962265
f
GR
GS
[0.99899 0 0 1.00215 153.31027 58.46989] CT
0.502 0.702 0.8 RC
N
f-2105962265
f
GR
GS
[0.99899 0 0 1.00215 148.55698 69.76531] CT
0.502 0.702 0.8 RC
N
f-2105962265
f
GR
GS
[0.99899 0 0 1.00215 150.54192 69.33023] CT
0.502 0.702 0.8 RC
N
f-2105962265
f
GR
GS
[0.99899 0 0 1.00215 140.9279 54.4432] CT
0.502 0.702 0.8 RC
N
f-2105962265
f
GR
GS
[0.99899 0 0 1.00215 172.74229 55.96649] CT
0.502 0.702 0.8 RC
N
f-2105962265
f
GR
GS
[0.99899 0 0 1.00215 102.93926 53.38865] CT
0.502 0.702 0.8 RC
N
f-2105962265
f
GR
GS
[0.99899 0 0 1.00215 142.85249 59.16263] CT
0.502 0.702 0.8 RC
N
f-2105962265
f
GR
GS
[0.99899 0 0 1.00215 154.37725 56.56089] CT
0.502 0.702 0.8 RC
N
f-2105962265
f
GR
GS
[0.99899 0 0 1.00215 118.23257 72.14545] CT
0.502 0.702 0.8 RC
N
f-2105962265
f
GR
GS
[0.99899 0 0 1.00215 153.97715 65.921] CT
0.502 0.702 0.8 RC
N
f-2105962265
f
GR
GS
[0.99899 0 0 1.00215 151.90606 68.12524] CT
0.502 0.702 0.8 RC
N
f-2105962265
f
GR
GS
[0.99899 0 0 1.00215 168.56482 49.86727] CT
0.502 0.702 0.8 RC
N
f-2105962265
f
GR
GS
[0.99899 0 0 1.00215 197.10379 43.58091] CT
0.502 0.702 0.8 RC
N
f-2105962265
f
GR
GS
[0.99899 0 0 1.00215 158.19158 55.50231] CT
0.502 0.702 0.8 RC
N
f-2105962265
f
GR
GS
[0.99899 0 0 1.00215 150.07671 71.6597] CT
0.502 0.702 0.8 RC
N
f-2105962265
f
GR
GS
[0.99899 0 0 1.00215 165.14017 59.15536] CT
0.502 0.702 0.8 RC
N
f-2105962265
f
GR
GS
[0.99899 0 0 1.00215 177.2713 65.39128] CT
0.502 0.702 0.8 RC
N
f-2105962265
f
GR
GS
[0.99899 0 0 1.00215 163.51437 60.38754] CT
0.502 0.702 0.8 RC
N
f-2105962265
f
GR
GS
[0.99899 0 0 1.00215 141.96007 52.28554] CT
0.502 0.702 0.8 RC
N
f-2105962265
f
GR
GS
[0.99899 0 0 1.00215 124.12645 84.54697] CT
0.502 0.702 0.8 RC
N
f-2105962265
f
GR
GS
[0.99899 0 0 1.00215 156.06055 51.65661] CT
0.502 0.702 0.8 RC
N
f-2105962265
f
GR
GS
[0.99899 0 0 1.00215 125.05527 81.78878] CT
0.502 0.702 0.8 RC
N
f-2105962265
f
GR
GS
[0.99899 0 0 1.00215 122.67239 62.84221] CT
0.502 0.702 0.8 RC
N
f-2105962265
f
GR
GS
[0.99899 0 0 1.00215 179.51322 64.77281] CT
0.502 0.702 0.8 RC
N
f-2105962265
f
GR
GS
[0.99899 0 0 1.00215 129.48302 71.45589] CT
0.502 0.702 0.8 RC
N
f-2105962265
f
GR
GS
[0.99899 0 0 1.00215 177.65057 90.13489] CT
0.502 0.702 0.8 RC
N
f-2105962265
f
GR
GS
[0.99899 0 0 1.00215 150.69727 63.75825] CT
0.502 0.702 0.8 RC
N
f-2105962265
f
GR
GS
[0.99899 0 0 1.00215 159.18912 30.80839] CT
0.502 0.702 0.8 RC
N
f-2105962265
f
GR
GS
[0.99899 0 0 1.00215 170.67282 90.13489] CT
0.502 0.702 0.8 RC
N
f-2105962265
f
GR
GS
[0.99899 0 0 1.00215 184.91582 46.597] CT
0.502 0.702 0.8 RC
N
f-2105962265
f
GR
GS
[0.99899 0 0 1.00215 161.69419 66.72808] CT
0.502 0.702 0.8 RC
N
f-2105962265
f
GR
GS
[0.99899 0 0 1.00215 155.33821 48.81908] CT
0.502 0.702 0.8 RC
N
f-2105962265
f
GR
GS
[0.99899 0 0 1.00215 146.65454 62.83844] CT
0.502 0.702 0.8 RC
N
f-2105962265
f
GR
GS
[0.99899 0 0 1.00215 205.29328 57.18316] CT
0.502 0.702 0.8 RC
N
f-2105962265
f
GR
GS
[0.99899 0 0 1.00215 176.66044 56.61801] CT
0.502 0.702 0.8 RC
N
f-2105962265
f
GR
GS
[0.99899 0 0 1.00215 144.96028 53.04304] CT
0.502 0.702 0.8 RC
N
f-2105962265
f
GR
GS
[0.99899 0 0 1.00215 149.19431 46.08942] CT
0.502 0.702 0.8 RC
N
f-2105962265
f
GR
GS
[0.99899 0 0 1.00215 164.51077 42.95112] CT
0.502 0.702 0.8 RC
N
f-2105962265
f
GR
GS
[0.99899 0 0 1.00215 157.89451 51.69472] CT
0.502 0.702 0.8 RC
N
f-2105962265
f
GR
GS
[0.99899 0 0 1.00215 153.60108 90.13489] CT
0.502 0.702 0.8 RC
N
f-2105962265
f
GR
GS
[0.99899 0 0 1.00215 150.16543 51.40914] CT
0.502 0.702 0.8 RC
N
f-2105962265
f
GR
GS
[0.99899 0 0 1.00215 130.17416 61.17711] CT
0.502 0.702 0.8 RC
N
f-2105962265
f
GR
GS
[0.99899 0 0 1.00215 170.77372 46.53314] CT
0.502 0.702 0.8 RC
N
f-2105962265
f
GR
GS
[0.99899 0 0 1.00215 126.78027 57.41737] CT
0.502 0.702 0.8 RC
N
f-2105962265
f
GR
GS
[0.99899 0 0 1.00215 176.40583 72.01404] CT
0.502 0.702 0.8 RC
N
f-2105962265
f
GR
GS
[0.99899 0 0 1.00215 175.72683 56.44288] CT
0.502 0.702 0.8 RC
N
f-2105962265
f
GR
GS
[0.99899 0 0 1.00215 0 -0.4252] CT
0.6 0.8 0.902 RC
1 LJ
3 LW
N
55 90.507 M
205.5 51.841 L
S
GR
GS
[0.99899 0 0 1.00215 111.50771 45.31045] CT
0.702 0.898 1 RC
N
/f227889816{-3 -3 M
-3 3 L
3 3 L
3 -3 L
cp}def
f227889816
f
GR
GS
[0.99899 0 0 1.00215 115.32692 78.81165] CT
0.702 0.898 1 RC
N
f227889816
f
GR
GS
[0.99899 0 0 1.00215 147.82195 53.74735] CT
0.702 0.898 1 RC
N
f227889816
f
GR
GS
[0.99899 0 0 1.00215 154.11884 76.23966] CT
0.702 0.898 1 RC
N
f227889816
f
GR
GS
[0.99899 0 0 1.00215 166.9212 53.84664] CT
0.702 0.898 1 RC
N
f227889816
f
GR
GS
[0.99899 0 0 1.00215 109.55045 33.70386] CT
0.702 0.898 1 RC
N
f227889816
f
GR
GS
[0.99899 0 0 1.00215 115.45539 72.76429] CT
0.702 0.898 1 RC
N
f227889816
f
GR
GS
[0.99899 0 0 1.00215 86.82336 72.79132] CT
0.702 0.898 1 RC
N
f227889816
f
GR
GS
[0.99899 0 0 1.00215 193.99381 62.39716] CT
0.702 0.898 1 RC
N
f227889816
f
GR
GS
[0.99899 0 0 1.00215 144.22472 78.04113] CT
0.702 0.898 1 RC
N
f227889816
f
GR
GS
[0.99899 0 0 1.00215 138.51122 90.82526] CT
0.702 0.898 1 RC
N
f227889816
f
GR
GS
[0.99899 0 0 1.00215 118.17141 98.4389] CT
0.702 0.898 1 RC
N
f227889816
f
GR
GS
[0.99899 0 0 1.00215 167.06516 56.5156] CT
0.702 0.898 1 RC
N
f227889816
f
GR
GS
[0.99899 0 0 1.00215 143.60291 62.53696] CT
0.702 0.898 1 RC
N
f227889816
f
GR
GS
[0.99899 0 0 1.00215 121.22559 35.21783] CT
0.702 0.898 1 RC
N
f227889816
f
GR
GS
[0.99899 0 0 1.00215 161.27285 64.41981] CT
0.702 0.898 1 RC
N
f227889816
f
GR
GS
[0.99899 0 0 1.00215 131.07076 80.4984] CT
0.702 0.898 1 RC
N
f227889816
f
GR
GS
[0.99899 0 0 1.00215 107.54006 81.33407] CT
0.702 0.898 1 RC
N
f227889816
f
GR
GS
[0.99899 0 0 1.00215 104.20171 84.38213] CT
0.702 0.898 1 RC
N
f227889816
f
GR
GS
[0.99899 0 0 1.00215 108.86099 68.05369] CT
0.702 0.898 1 RC
N
f227889816
f
GR
GS
[0.99899 0 0 1.00215 62.82397 75.42669] CT
0.702 0.898 1 RC
N
f227889816
f
GR
GS
[0.99899 0 0 1.00215 117.60263 90.06081] CT
0.702 0.898 1 RC
N
f227889816
f
GR
GS
[0.99899 0 0 1.00215 165.17119 65.805] CT
0.702 0.898 1 RC
N
f227889816
f
GR
GS
[0.99899 0 0 1.00215 59.91655 33.70386] CT
0.702 0.898 1 RC
N
f227889816
f
GR
GS
[0.99899 0 0 1.00215 93.05135 78.71147] CT
0.702 0.898 1 RC
N
f227889816
f
GR
GS
[0.99899 0 0 1.00215 64.70579 93.67313] CT
0.702 0.898 1 RC
N
f227889816
f
GR
GS
[0.99899 0 0 1.00215 146.48203 91.89332] CT
0.702 0.898 1 RC
N
f227889816
f
GR
GS
[0.99899 0 0 1.00215 62.13335 95.27559] CT
0.702 0.898 1 RC
N
f227889816
f
GR
GS
[0.99899 0 0 1.00215 113.53615 111.24203] CT
0.702 0.898 1 RC
N
f227889816
f
GR
GS
[0.99899 0 0 1.00215 101.15489 111.30873] CT
0.702 0.898 1 RC
N
f227889816
f
GR
GS
[0.99899 0 0 1.00215 145.12535 63.11915] CT
0.702 0.898 1 RC
N
f227889816
f
GR
GS
[0.99899 0 0 1.00215 67.98766 132.69338] CT
0.702 0.898 1 RC
N
f227889816
f
GR
GS
[0.99899 0 0 1.00215 76.80877 99.84294] CT
0.702 0.898 1 RC
N
f227889816
f
GR
GS
[0.99899 0 0 1.00215 106.58478 83.24158] CT
0.702 0.898 1 RC
N
f227889816
f
GR
GS
[0.99899 0 0 1.00215 81.42512 66.52131] CT
0.702 0.898 1 RC
N
f227889816
f
GR
GS
[0.99899 0 0 1.00215 70.66359 82.08835] CT
0.702 0.898 1 RC
N
f227889816
f
GR
GS
[0.99899 0 0 1.00215 113.63856 68.25238] CT
0.702 0.898 1 RC
N
f227889816
f
GR
GS
[0.99899 0 0 1.00215 69.43637 109.83272] CT
0.702 0.898 1 RC
N
f227889816
f
GR
GS
[0.99899 0 0 1.00215 151.17907 67.07614] CT
0.702 0.898 1 RC
N
f227889816
f
GR
GS
[0.99899 0 0 1.00215 105.7055 91.1701] CT
0.702 0.898 1 RC
N
f227889816
f
GR
GS
[0.99899 0 0 1.00215 127.15136 114.49174] CT
0.702 0.898 1 RC
N
f227889816
f
GR
GS
[0.99899 0 0 1.00215 124.06396 96.351] CT
0.702 0.898 1 RC
N
f227889816
f
GR
GS
[0.99899 0 0 1.00215 157.56022 83.6851] CT
0.502 0.702 0.8 RC
N
/f-1969333140{-3.536 0 M
0 4.702 L
3.536 0 L
0 -4.702 L
cp}def
f-1969333140
f
GR
GS
[0.99899 0 0 1.00215 139.35632 66.85158] CT
0.502 0.702 0.8 RC
N
f-1969333140
f
GR
GS
[0.99899 0 0 1.00215 160.97453 90.13489] CT
0.502 0.702 0.8 RC
N
f-1969333140
f
GR
GS
[0.99899 0 0 1.00215 193.58399 56.33713] CT
0.502 0.702 0.8 RC
N
f-1969333140
f
GR
GS
[0.99899 0 0 1.00215 126.94336 65.18465] CT
0.502 0.702 0.8 RC
N
f-1969333140
f
GR
GS
[0.99899 0 0 1.00215 167.91592 50.21011] CT
0.502 0.702 0.8 RC
N
f-1969333140
f
GR
GS
[0.99899 0 0 1.00215 137.44444 61.6747] CT
0.502 0.702 0.8 RC
N
f-1969333140
f
GR
GS
[0.99899 0 0 1.00215 153.31027 58.46989] CT
0.502 0.702 0.8 RC
N
f-1969333140
f
GR
GS
[0.99899 0 0 1.00215 148.55698 69.76531] CT
0.502 0.702 0.8 RC
N
f-1969333140
f
GR
GS
[0.99899 0 0 1.00215 150.54192 69.33023] CT
0.502 0.702 0.8 RC
N
f-1969333140
f
GR
GS
[0.99899 0 0 1.00215 140.9279 54.4432] CT
0.502 0.702 0.8 RC
N
f-1969333140
f
GR
GS
[0.99899 0 0 1.00215 172.74229 55.96649] CT
0.502 0.702 0.8 RC
N
f-1969333140
f
GR
GS
[0.99899 0 0 1.00215 102.93926 53.38865] CT
0.502 0.702 0.8 RC
N
f-1969333140
f
GR
GS
[0.99899 0 0 1.00215 142.85249 59.16263] CT
0.502 0.702 0.8 RC
N
f-1969333140
f
GR
GS
[0.99899 0 0 1.00215 154.37725 56.56089] CT
0.502 0.702 0.8 RC
N
f-1969333140
f
GR
GS
[0.99899 0 0 1.00215 118.23257 72.14545] CT
0.502 0.702 0.8 RC
N
f-1969333140
f
GR
GS
[0.99899 0 0 1.00215 153.97715 65.921] CT
0.502 0.702 0.8 RC
N
f-1969333140
f
GR
GS
[0.99899 0 0 1.00215 151.90606 68.12524] CT
0.502 0.702 0.8 RC
N
f-1969333140
f
GR
GS
[0.99899 0 0 1.00215 168.56482 49.86727] CT
0.502 0.702 0.8 RC
N
f-1969333140
f
GR
GS
[0.99899 0 0 1.00215 197.10379 43.58091] CT
0.502 0.702 0.8 RC
N
f-1969333140
f
GR
GS
[0.99899 0 0 1.00215 158.19158 55.50231] CT
0.502 0.702 0.8 RC
N
f-1969333140
f
GR
GS
[0.99899 0 0 1.00215 150.07671 71.6597] CT
0.502 0.702 0.8 RC
N
f-1969333140
f
GR
GS
[0.99899 0 0 1.00215 165.14017 59.15536] CT
0.502 0.702 0.8 RC
N
f-1969333140
f
GR
GS
[0.99899 0 0 1.00215 177.2713 65.39128] CT
0.502 0.702 0.8 RC
N
f-1969333140
f
GR
GS
[0.99899 0 0 1.00215 163.51437 60.38754] CT
0.502 0.702 0.8 RC
N
f-1969333140
f
GR
GS
[0.99899 0 0 1.00215 141.96007 52.28554] CT
0.502 0.702 0.8 RC
N
f-1969333140
f
GR
GS
[0.99899 0 0 1.00215 124.12645 84.54697] CT
0.502 0.702 0.8 RC
N
f-1969333140
f
GR
GS
[0.99899 0 0 1.00215 156.06055 51.65661] CT
0.502 0.702 0.8 RC
N
f-1969333140
f
GR
GS
[0.99899 0 0 1.00215 125.05527 81.78878] CT
0.502 0.702 0.8 RC
N
f-1969333140
f
GR
GS
[0.99899 0 0 1.00215 122.67239 62.84221] CT
0.502 0.702 0.8 RC
N
f-1969333140
f
GR
GS
[0.99899 0 0 1.00215 179.51322 64.77281] CT
0.502 0.702 0.8 RC
N
f-1969333140
f
GR
GS
[0.99899 0 0 1.00215 129.48302 71.45589] CT
0.502 0.702 0.8 RC
N
f-1969333140
f
GR
GS
[0.99899 0 0 1.00215 177.65057 90.13489] CT
0.502 0.702 0.8 RC
N
f-1969333140
f
GR
GS
[0.99899 0 0 1.00215 150.69727 63.75825] CT
0.502 0.702 0.8 RC
N
f-1969333140
f
GR
GS
[0.99899 0 0 1.00215 159.18912 30.80839] CT
0.502 0.702 0.8 RC
N
f-1969333140
f
GR
GS
[0.99899 0 0 1.00215 170.67282 90.13489] CT
0.502 0.702 0.8 RC
N
f-1969333140
f
GR
GS
[0.99899 0 0 1.00215 184.91582 46.597] CT
0.502 0.702 0.8 RC
N
f-1969333140
f
GR
GS
[0.99899 0 0 1.00215 161.69419 66.72808] CT
0.502 0.702 0.8 RC
N
f-1969333140
f
GR
GS
[0.99899 0 0 1.00215 155.33821 48.81908] CT
0.502 0.702 0.8 RC
N
f-1969333140
f
GR
GS
[0.99899 0 0 1.00215 146.65454 62.83844] CT
0.502 0.702 0.8 RC
N
f-1969333140
f
GR
GS
[0.99899 0 0 1.00215 205.29328 57.18316] CT
0.502 0.702 0.8 RC
N
f-1969333140
f
GR
GS
[0.99899 0 0 1.00215 176.66044 56.61801] CT
0.502 0.702 0.8 RC
N
f-1969333140
f
GR
GS
[0.99899 0 0 1.00215 144.96028 53.04304] CT
0.502 0.702 0.8 RC
N
f-1969333140
f
GR
GS
[0.99899 0 0 1.00215 149.19431 46.08942] CT
0.502 0.702 0.8 RC
N
f-1969333140
f
GR
GS
[0.99899 0 0 1.00215 164.51077 42.95112] CT
0.502 0.702 0.8 RC
N
f-1969333140
f
GR
GS
[0.99899 0 0 1.00215 157.89451 51.69472] CT
0.502 0.702 0.8 RC
N
f-1969333140
f
GR
GS
[0.99899 0 0 1.00215 153.60108 90.13489] CT
0.502 0.702 0.8 RC
N
f-1969333140
f
GR
GS
[0.99899 0 0 1.00215 150.16543 51.40914] CT
0.502 0.702 0.8 RC
N
f-1969333140
f
GR
GS
[0.99899 0 0 1.00215 130.17416 61.17711] CT
0.502 0.702 0.8 RC
N
f-1969333140
f
GR
GS
[0.99899 0 0 1.00215 170.77372 46.53314] CT
0.502 0.702 0.8 RC
N
f-1969333140
f
GR
GS
[0.99899 0 0 1.00215 126.78027 57.41737] CT
0.502 0.702 0.8 RC
N
f-1969333140
f
GR
GS
[0.99899 0 0 1.00215 176.40583 72.01404] CT
0.502 0.702 0.8 RC
N
f-1969333140
f
GR
GS
[0.99899 0 0 1.00215 175.72683 56.44288] CT
0.502 0.702 0.8 RC
N
f-1969333140
f
GR
%%Trailer
%%Pages: 1
%%EOF
