%!PS-Adobe-3.0 EPSF-3.0
%%Creator: (MATLAB, The Mathworks, Inc. Version 9.8.0.1323502 \(R2020a\). Operating System: Mac OS X)
%%Title: /Users/kosciessa/Desktop/mntTardisLNDG/LNDG/stateswitch/stsw_multimodal/figures/correlations/f_drift-avg_stroop-rt-mismatch.eps
%%CreationDate: 2022-03-28T15:46:16
%%Pages: (atend)
%%BoundingBox:   -19     0   287   194
%%LanguageLevel: 3
%%EndComments
%%BeginProlog
%%BeginResource: procset (Apache XML Graphics Std ProcSet) 1.2 0
%%Version: 1.2 0
%%Copyright: (Copyright 2001-2003,2010 The Apache Software Foundation. License terms: http://www.apache.org/licenses/LICENSE-2.0)
/bd{bind def}bind def
/ld{load def}bd
/GR/grestore ld
/GS/gsave ld
/RM/rmoveto ld
/C/curveto ld
/t/show ld
/L/lineto ld
/ML/setmiterlimit ld
/CT/concat ld
/f/fill ld
/N/newpath ld
/S/stroke ld
/CC/setcmykcolor ld
/A/ashow ld
/cp/closepath ld
/RC/setrgbcolor ld
/LJ/setlinejoin ld
/GC/setgray ld
/LW/setlinewidth ld
/M/moveto ld
/re {4 2 roll M
1 index 0 rlineto
0 exch rlineto
neg 0 rlineto
cp } bd
/_ctm matrix def
/_tm matrix def
/BT { _ctm currentmatrix pop matrix _tm copy pop 0 0 moveto } bd
/ET { _ctm setmatrix } bd
/iTm { _ctm setmatrix _tm concat } bd
/Tm { _tm astore pop iTm 0 0 moveto } bd
/ux 0.0 def
/uy 0.0 def
/F {
  /Tp exch def
  /Tf exch def
  Tf findfont Tp scalefont setfont
  /cf Tf def  /cs Tp def
} bd
/ULS {currentpoint /uy exch def /ux exch def} bd
/ULE {
  /Tcx currentpoint pop def
  gsave
  newpath
  cf findfont cs scalefont dup
  /FontMatrix get 0 get /Ts exch def /FontInfo get dup
  /UnderlinePosition get Ts mul /To exch def
  /UnderlineThickness get Ts mul /Tt exch def
  ux uy To add moveto  Tcx uy To add lineto
  Tt setlinewidth stroke
  grestore
} bd
/OLE {
  /Tcx currentpoint pop def
  gsave
  newpath
  cf findfont cs scalefont dup
  /FontMatrix get 0 get /Ts exch def /FontInfo get dup
  /UnderlinePosition get Ts mul /To exch def
  /UnderlineThickness get Ts mul /Tt exch def
  ux uy To add cs add moveto Tcx uy To add cs add lineto
  Tt setlinewidth stroke
  grestore
} bd
/SOE {
  /Tcx currentpoint pop def
  gsave
  newpath
  cf findfont cs scalefont dup
  /FontMatrix get 0 get /Ts exch def /FontInfo get dup
  /UnderlinePosition get Ts mul /To exch def
  /UnderlineThickness get Ts mul /Tt exch def
  ux uy To add cs 10 mul 26 idiv add moveto Tcx uy To add cs 10 mul 26 idiv add lineto
  Tt setlinewidth stroke
  grestore
} bd
/QT {
/Y22 exch store
/X22 exch store
/Y21 exch store
/X21 exch store
currentpoint
/Y21 load 2 mul add 3 div exch
/X21 load 2 mul add 3 div exch
/X21 load 2 mul /X22 load add 3 div
/Y21 load 2 mul /Y22 load add 3 div
/X22 load /Y22 load curveto
} bd
/SSPD {
dup length /d exch dict def
{
/v exch def
/k exch def
currentpagedevice k known {
/cpdv currentpagedevice k get def
v cpdv ne {
/upd false def
/nullv v type /nulltype eq def
/nullcpdv cpdv type /nulltype eq def
nullv nullcpdv or
{
/upd true def
} {
/sametype v type cpdv type eq def
sametype {
v type /arraytype eq {
/vlen v length def
/cpdvlen cpdv length def
vlen cpdvlen eq {
0 1 vlen 1 sub {
/i exch def
/obj v i get def
/cpdobj cpdv i get def
obj cpdobj ne {
/upd true def
exit
} if
} for
} {
/upd true def
} ifelse
} {
v type /dicttype eq {
v {
/dv exch def
/dk exch def
/cpddv cpdv dk get def
dv cpddv ne {
/upd true def
exit
} if
} forall
} {
/upd true def
} ifelse
} ifelse
} if
} ifelse
upd true eq {
d k v put
} if
} if
} if
} forall
d length 0 gt {
d setpagedevice
} if
} bd
/RE { % /NewFontName [NewEncodingArray] /FontName RE -
  findfont dup length dict begin
  {
    1 index /FID ne
    {def} {pop pop} ifelse
  } forall
  /Encoding exch def
  /FontName 1 index def
  currentdict definefont pop
  end
} bind def
%%EndResource
%%BeginResource: procset (Apache XML Graphics EPS ProcSet) 1.0 0
%%Version: 1.0 0
%%Copyright: (Copyright 2002-2003 The Apache Software Foundation. License terms: http://www.apache.org/licenses/LICENSE-2.0)
/BeginEPSF { %def
/b4_Inc_state save def         % Save state for cleanup
/dict_count countdictstack def % Count objects on dict stack
/op_count count 1 sub def      % Count objects on operand stack
userdict begin                 % Push userdict on dict stack
/showpage { } def              % Redefine showpage, { } = null proc
0 setgray 0 setlinecap         % Prepare graphics state
1 setlinewidth 0 setlinejoin
10 setmiterlimit [ ] 0 setdash newpath
/languagelevel where           % If level not equal to 1 then
{pop languagelevel             % set strokeadjust and
1 ne                           % overprint to their defaults.
{false setstrokeadjust false setoverprint
} if
} if
} bd
/EndEPSF { %def
count op_count sub {pop} repeat            % Clean up stacks
countdictstack dict_count sub {end} repeat
b4_Inc_state restore
} bd
%%EndResource
%FOPBeginFontDict
%%IncludeResource: font Courier-Oblique
%%IncludeResource: font Courier-BoldOblique
%%IncludeResource: font Courier-Bold
%%IncludeResource: font ZapfDingbats
%%IncludeResource: font Symbol
%%IncludeResource: font Helvetica
%%IncludeResource: font Helvetica-Oblique
%%IncludeResource: font Helvetica-Bold
%%IncludeResource: font Helvetica-BoldOblique
%%IncludeResource: font Times-Roman
%%IncludeResource: font Times-Italic
%%IncludeResource: font Times-Bold
%%IncludeResource: font Times-BoldItalic
%%IncludeResource: font Courier
%FOPEndFontDict
%%BeginResource: encoding WinAnsiEncoding
/WinAnsiEncoding [
/.notdef /.notdef /.notdef /.notdef /.notdef
/.notdef /.notdef /.notdef /.notdef /.notdef
/.notdef /.notdef /.notdef /.notdef /.notdef
/.notdef /.notdef /.notdef /.notdef /.notdef
/.notdef /.notdef /.notdef /.notdef /.notdef
/.notdef /.notdef /.notdef /.notdef /.notdef
/.notdef /.notdef /space /exclam /quotedbl
/numbersign /dollar /percent /ampersand /quotesingle
/parenleft /parenright /asterisk /plus /comma
/hyphen /period /slash /zero /one
/two /three /four /five /six
/seven /eight /nine /colon /semicolon
/less /equal /greater /question /at
/A /B /C /D /E
/F /G /H /I /J
/K /L /M /N /O
/P /Q /R /S /T
/U /V /W /X /Y
/Z /bracketleft /backslash /bracketright /asciicircum
/underscore /quoteleft /a /b /c
/d /e /f /g /h
/i /j /k /l /m
/n /o /p /q /r
/s /t /u /v /w
/x /y /z /braceleft /bar
/braceright /asciitilde /bullet /Euro /bullet
/quotesinglbase /florin /quotedblbase /ellipsis /dagger
/daggerdbl /circumflex /perthousand /Scaron /guilsinglleft
/OE /bullet /Zcaron /bullet /bullet
/quoteleft /quoteright /quotedblleft /quotedblright /bullet
/endash /emdash /asciitilde /trademark /scaron
/guilsinglright /oe /bullet /zcaron /Ydieresis
/space /exclamdown /cent /sterling /currency
/yen /brokenbar /section /dieresis /copyright
/ordfeminine /guillemotleft /logicalnot /sfthyphen /registered
/macron /degree /plusminus /twosuperior /threesuperior
/acute /mu /paragraph /middot /cedilla
/onesuperior /ordmasculine /guillemotright /onequarter /onehalf
/threequarters /questiondown /Agrave /Aacute /Acircumflex
/Atilde /Adieresis /Aring /AE /Ccedilla
/Egrave /Eacute /Ecircumflex /Edieresis /Igrave
/Iacute /Icircumflex /Idieresis /Eth /Ntilde
/Ograve /Oacute /Ocircumflex /Otilde /Odieresis
/multiply /Oslash /Ugrave /Uacute /Ucircumflex
/Udieresis /Yacute /Thorn /germandbls /agrave
/aacute /acircumflex /atilde /adieresis /aring
/ae /ccedilla /egrave /eacute /ecircumflex
/edieresis /igrave /iacute /icircumflex /idieresis
/eth /ntilde /ograve /oacute /ocircumflex
/otilde /odieresis /divide /oslash /ugrave
/uacute /ucircumflex /udieresis /yacute /thorn
/ydieresis
] def
%%EndResource
%FOPBeginFontReencode
/Courier-Oblique findfont
dup length dict begin
  {1 index /FID ne {def} {pop pop} ifelse} forall
  /Encoding WinAnsiEncoding def
  currentdict
end
/Courier-Oblique exch definefont pop
/Courier-BoldOblique findfont
dup length dict begin
  {1 index /FID ne {def} {pop pop} ifelse} forall
  /Encoding WinAnsiEncoding def
  currentdict
end
/Courier-BoldOblique exch definefont pop
/Courier-Bold findfont
dup length dict begin
  {1 index /FID ne {def} {pop pop} ifelse} forall
  /Encoding WinAnsiEncoding def
  currentdict
end
/Courier-Bold exch definefont pop
/Helvetica findfont
dup length dict begin
  {1 index /FID ne {def} {pop pop} ifelse} forall
  /Encoding WinAnsiEncoding def
  currentdict
end
/Helvetica exch definefont pop
/Helvetica-Oblique findfont
dup length dict begin
  {1 index /FID ne {def} {pop pop} ifelse} forall
  /Encoding WinAnsiEncoding def
  currentdict
end
/Helvetica-Oblique exch definefont pop
/Helvetica-Bold findfont
dup length dict begin
  {1 index /FID ne {def} {pop pop} ifelse} forall
  /Encoding WinAnsiEncoding def
  currentdict
end
/Helvetica-Bold exch definefont pop
/Helvetica-BoldOblique findfont
dup length dict begin
  {1 index /FID ne {def} {pop pop} ifelse} forall
  /Encoding WinAnsiEncoding def
  currentdict
end
/Helvetica-BoldOblique exch definefont pop
/Times-Roman findfont
dup length dict begin
  {1 index /FID ne {def} {pop pop} ifelse} forall
  /Encoding WinAnsiEncoding def
  currentdict
end
/Times-Roman exch definefont pop
/Times-Italic findfont
dup length dict begin
  {1 index /FID ne {def} {pop pop} ifelse} forall
  /Encoding WinAnsiEncoding def
  currentdict
end
/Times-Italic exch definefont pop
/Times-Bold findfont
dup length dict begin
  {1 index /FID ne {def} {pop pop} ifelse} forall
  /Encoding WinAnsiEncoding def
  currentdict
end
/Times-Bold exch definefont pop
/Times-BoldItalic findfont
dup length dict begin
  {1 index /FID ne {def} {pop pop} ifelse} forall
  /Encoding WinAnsiEncoding def
  currentdict
end
/Times-BoldItalic exch definefont pop
/Courier findfont
dup length dict begin
  {1 index /FID ne {def} {pop pop} ifelse} forall
  /Encoding WinAnsiEncoding def
  currentdict
end
/Courier exch definefont pop
%FOPEndFontReencode
%%EndProlog
%%Page: 1 1
%%PageBoundingBox: 0 0 227 198
%%BeginPageSetup
[1 0 0 -1 0 198] CT
%%EndPageSetup
GS
[0.99899 0 0 1.00215 0 -0.4252] CT
N
0 0 M
227 0 L
227 198 L
0 198 L
0 0 L
cp
clip
1 GC
N
0 0 227 198 re
f
GR
GS
[0.99899 0 0 1.00215 0 -0.4252] CT
1 GC
N
0 0 227 198 re
f
GR
GS
[0.99899 0 0 1.00215 0 -0.4252] CT
0.2 GC
N
61 160 M
205.5 160 L
205.5 21 L
61 21 L
cp
f
GR
GS
[0.99899 0 0 1.00215 0 -0.4252] CT
0.149 GC
2 setlinecap
1 LJ
0.5 LW
N
61 160 M
205.5 160 L
S
GR
GS
[0.99899 0 0 1.00215 0 -0.4252] CT
0.149 GC
2 setlinecap
1 LJ
0.5 LW
N
97.212 160 M
97.212 158.555 L
S
GR
GS
[0.99899 0 0 1.00215 0 -0.4252] CT
0.149 GC
2 setlinecap
1 LJ
0.5 LW
N
134.351 160 M
134.351 158.555 L
S
GR
GS
[0.99899 0 0 1.00215 0 -0.4252] CT
0.149 GC
2 setlinecap
1 LJ
0.5 LW
N
171.491 160 M
171.491 158.555 L
S
GR
GS
[0.99899 0 0 1.00215 97.11396 164.72871] CT
0.149 GC
/Helvetica 14 F
GS
[1 0 0 1 0 0] CT
-10 14 moveto 
1 -1 scale
(1.6) t 
GR
GR
GS
[0.99899 0 0 1.00215 134.21597 164.72871] CT
0.149 GC
/Helvetica 14 F
GS
[1 0 0 1 0 0] CT
-10 14 moveto 
1 -1 scale
(1.8) t 
GR
GR
GS
[0.99899 0 0 1.00215 171.318 164.72871] CT
0.149 GC
/Helvetica 14 F
GS
[1 0 0 1 0 0] CT
-4 14 moveto 
1 -1 scale
(2) t 
GR
GR
GS
[0.99899 0 0 1.00215 133.11602 182.26629] CT
0.149 GC
/Helvetica 14 F
GS
[1 0 0 1 0 0] CT
-27 14 moveto 
1 -1 scale
(stroop rt) t 
GR
GR
GS
[0.99899 0 0 1.00215 0 -0.4252] CT
0.149 GC
2 setlinecap
1 LJ
0.5 LW
N
61 160 M
61 21 L
S
GR
GS
[0.99899 0 0 1.00215 0 -0.4252] CT
0.149 GC
2 setlinecap
1 LJ
0.5 LW
N
61 153.905 M
62.445 153.905 L
S
GR
GS
[0.99899 0 0 1.00215 0 -0.4252] CT
0.149 GC
2 setlinecap
1 LJ
0.5 LW
N
61 124.347 M
62.445 124.347 L
S
GR
GS
[0.99899 0 0 1.00215 0 -0.4252] CT
0.149 GC
2 setlinecap
1 LJ
0.5 LW
N
61 94.789 M
62.445 94.789 L
S
GR
GS
[0.99899 0 0 1.00215 0 -0.4252] CT
0.149 GC
2 setlinecap
1 LJ
0.5 LW
N
61 65.231 M
62.445 65.231 L
S
GR
GS
[0.99899 0 0 1.00215 0 -0.4252] CT
0.149 GC
2 setlinecap
1 LJ
0.5 LW
N
61 35.673 M
62.445 35.673 L
S
GR
GS
[0.99899 0 0 1.00215 56.14345 153.81066] CT
0.149 GC
/Helvetica 14 F
GS
[1 0 0 1 0 0] CT
-8 5.5 moveto 
1 -1 scale
(0) t 
GR
GR
GS
[0.99899 0 0 1.00215 56.14345 124.18905] CT
0.149 GC
/Helvetica 14 F
GS
[1 0 0 1 0 0] CT
-20 5.5 moveto 
1 -1 scale
(0.5) t 
GR
GR
GS
[0.99899 0 0 1.00215 56.14345 94.56743] CT
0.149 GC
/Helvetica 14 F
GS
[1 0 0 1 0 0] CT
-8 5.5 moveto 
1 -1 scale
(1) t 
GR
GR
GS
[0.99899 0 0 1.00215 56.14345 64.94581] CT
0.149 GC
/Helvetica 14 F
GS
[1 0 0 1 0 0] CT
-20 5.5 moveto 
1 -1 scale
(1.5) t 
GR
GR
GS
[0.99899 0 0 1.00215 56.14345 35.3242] CT
0.149 GC
/Helvetica 14 F
GS
[1 0 0 1 0 0] CT
-8 5.5 moveto 
1 -1 scale
(2) t 
GR
GR
GS
[0 -1.00215 0.99899 0 33.66609 90.26908] CT
0.149 GC
/Helvetica 14 F
GS
[1 0 0 1 0 0] CT
-26.5 -20 moveto 
1 -1 scale
(drift rate) t 
GR
GR
GS
[0 -1.00215 0.99899 0 33.66609 90.26908] CT
0.149 GC
/Helvetica 14 F
GS
[1 0 0 1 0 0] CT
-17 -3 moveto 
1 -1 scale
(\(avg.\)) t 
GR
GR
GS
[0.99899 0 0 1.00215 133.11608 18.86613] CT
/Helvetica-Bold 14 F
GS
[1 0 0 1 0 0] CT
-153.5 -4 moveto 
1 -1 scale
(r\(93\) = -0.65, 95%CI = [-0.75,-0.51], p = 1.2e-12) t 
GR
GR
GS
[0.99899 0 0 1.00215 125.92692 63.54547] CT
0.502 0.702 0.8 RC
N
0.5 0 M
0.5 -0.276 0.276 -0.5 0 -0.5 C
-0.276 -0.5 -0.5 -0.276 -0.5 0 C
-0.5 0.276 -0.276 0.5 0 0.5 C
0.276 0.5 0.5 0.276 0.5 0 C
cp
f
GR
GS
[0.99899 0 0 1.00215 104.81621 88.8123] CT
0.502 0.702 0.8 RC
N
/f-2105962265{0.5 0 M
0.5 -0.276 0.276 -0.5 0 -0.5 C
-0.276 -0.5 -0.5 -0.276 -0.5 0 C
-0.5 0.276 -0.276 0.5 0 0.5 C
0.276 0.5 0.5 0.276 0.5 0 C
cp}def
f-2105962265
f
GR
GS
[0.99899 0 0 1.00215 99.5748 55.72816] CT
0.502 0.702 0.8 RC
N
f-2105962265
f
GR
GS
[0.99899 0 0 1.00215 94.13148 67.88293] CT
0.502 0.702 0.8 RC
N
f-2105962265
f
GR
GS
[0.99899 0 0 1.00215 136.69997 100.38379] CT
0.502 0.702 0.8 RC
N
f-2105962265
f
GR
GS
[0.99899 0 0 1.00215 114.36303 66.14483] CT
0.502 0.702 0.8 RC
N
f-2105962265
f
GR
GS
[0.99899 0 0 1.00215 115.50091 64.71078] CT
0.502 0.702 0.8 RC
N
f-2105962265
f
GR
GS
[0.99899 0 0 1.00215 92.19646 59.82837] CT
0.502 0.702 0.8 RC
N
f-2105962265
f
GR
GS
[0.99899 0 0 1.00215 110.49508 81.27471] CT
0.502 0.702 0.8 RC
N
f-2105962265
f
GR
GS
[0.99899 0 0 1.00215 120.83485 58.88747] CT
0.502 0.702 0.8 RC
N
f-2105962265
f
GR
GS
[0.99899 0 0 1.00215 114.90567 79.8379] CT
0.502 0.702 0.8 RC
N
f-2105962265
f
GR
GS
[0.99899 0 0 1.00215 126.18561 57.01882] CT
0.502 0.702 0.8 RC
N
f-2105962265
f
GR
GS
[0.99899 0 0 1.00215 81.78308 69.78698] CT
0.502 0.702 0.8 RC
N
f-2105962265
f
GR
GS
[0.99899 0 0 1.00215 84.41639 64.53079] CT
0.502 0.702 0.8 RC
N
f-2105962265
f
GR
GS
[0.99899 0 0 1.00215 104.81621 103.10931] CT
0.502 0.702 0.8 RC
N
f-2105962265
f
GR
GS
[0.99899 0 0 1.00215 147.74853 133.56271] CT
0.502 0.702 0.8 RC
N
f-2105962265
f
GR
GS
[0.99899 0 0 1.00215 120.675 88.90474] CT
0.502 0.702 0.8 RC
N
f-2105962265
f
GR
GS
[0.99899 0 0 1.00215 131.52797 56.83765] CT
0.502 0.702 0.8 RC
N
f-2105962265
f
GR
GS
[0.99899 0 0 1.00215 72.96819 78.85661] CT
0.502 0.702 0.8 RC
N
f-2105962265
f
GR
GS
[0.99899 0 0 1.00215 99.5748 87.95059] CT
0.502 0.702 0.8 RC
N
f-2105962265
f
GR
GS
[0.99899 0 0 1.00215 79.47577 66.94655] CT
0.502 0.702 0.8 RC
N
f-2105962265
f
GR
GS
[0.99899 0 0 1.00215 104.90876 79.40337] CT
0.502 0.702 0.8 RC
N
f-2105962265
f
GR
GS
[0.99899 0 0 1.00215 94.23246 103.15708] CT
0.502 0.702 0.8 RC
N
f-2105962265
f
GR
GS
[0.99899 0 0 1.00215 77.94037 72.58275] CT
0.502 0.702 0.8 RC
N
f-2105962265
f
GR
GS
[0.99899 0 0 1.00215 106.88794 44.11846] CT
0.502 0.702 0.8 RC
N
f-2105962265
f
GR
GS
[0.99899 0 0 1.00215 95.40188 95.477] CT
0.502 0.702 0.8 RC
N
f-2105962265
f
GR
GS
[0.99899 0 0 1.00215 79.6819 76.53038] CT
0.502 0.702 0.8 RC
N
f-2105962265
f
GR
GS
[0.99899 0 0 1.00215 123.17792 54.69971] CT
0.502 0.702 0.8 RC
N
f-2105962265
f
GR
GS
[0.99899 0 0 1.00215 119.43826 51.17693] CT
0.502 0.702 0.8 RC
N
f-2105962265
f
GR
GS
[0.99899 0 0 1.00215 115.59976 89.70318] CT
0.502 0.702 0.8 RC
N
f-2105962265
f
GR
GS
[0.99899 0 0 1.00215 100.18266 56.2605] CT
0.502 0.702 0.8 RC
N
f-2105962265
f
GR
GS
[0.99899 0 0 1.00215 80.18038 40.39555] CT
0.502 0.702 0.8 RC
N
f-2105962265
f
GR
GS
[0.99899 0 0 1.00215 88.99105 58.52626] CT
0.502 0.702 0.8 RC
N
f-2105962265
f
GR
GS
[0.99899 0 0 1.00215 104.91296 41.4179] CT
0.502 0.702 0.8 RC
N
f-2105962265
f
GR
GS
[0.99899 0 0 1.00215 83.65291 70.41818] CT
0.502 0.702 0.8 RC
N
f-2105962265
f
GR
GS
[0.99899 0 0 1.00215 95.93612 32.2281] CT
0.502 0.702 0.8 RC
N
f-2105962265
f
GR
GS
[0.99899 0 0 1.00215 96.47033 79.08197] CT
0.502 0.702 0.8 RC
N
f-2105962265
f
GR
GS
[0.99899 0 0 1.00215 73.39937 51.79054] CT
0.502 0.702 0.8 RC
N
f-2105962265
f
GR
GS
[0.99899 0 0 1.00215 111.95898 93.75269] CT
0.502 0.702 0.8 RC
N
f-2105962265
f
GR
GS
[0.99899 0 0 1.00215 96.73746 58.74707] CT
0.502 0.702 0.8 RC
N
f-2105962265
f
GR
GS
[0.99899 0 0 1.00215 115.16439 83.7942] CT
0.502 0.702 0.8 RC
N
f-2105962265
f
GR
GS
[0.99899 0 0 1.00215 105.18428 63.47376] CT
0.502 0.702 0.8 RC
N
f-2105962265
f
GR
GS
[0.99899 0 0 1.00215 162.87541 122.05029] CT
0.502 0.702 0.8 RC
N
f-2105962265
f
GR
GS
[0.99899 0 0 1.00215 157.02406 114.69556] CT
0.502 0.702 0.8 RC
N
f-2105962265
f
GR
GS
[0.99899 0 0 1.00215 104.81621 93.98979] CT
0.502 0.702 0.8 RC
N
f-2105962265
f
GR
GS
[0.99899 0 0 1.00215 193.26371 148.31019] CT
0.502 0.702 0.8 RC
N
f-2105962265
f
GR
GS
[0.99899 0 0 1.00215 131.52797 110.29807] CT
0.502 0.702 0.8 RC
N
f-2105962265
f
GR
GS
[0.99899 0 0 1.00215 158.96328 125.47513] CT
0.502 0.702 0.8 RC
N
f-2105962265
f
GR
GS
[0.99899 0 0 1.00215 146.9472 92.73239] CT
0.502 0.702 0.8 RC
N
f-2105962265
f
GR
GS
[0.99899 0 0 1.00215 131.62472 117.39438] CT
0.502 0.702 0.8 RC
N
f-2105962265
f
GR
GS
[0.99899 0 0 1.00215 126.09518 117.62117] CT
0.502 0.702 0.8 RC
N
f-2105962265
f
GR
GS
[0.99899 0 0 1.00215 144.00891 103.64202] CT
0.502 0.702 0.8 RC
N
f-2105962265
f
GR
GS
[0.99899 0 0 1.00215 88.78914 110.69319] CT
0.502 0.702 0.8 RC
N
f-2105962265
f
GR
GS
[0.99899 0 0 1.00215 169.28623 136.22732] CT
0.502 0.702 0.8 RC
N
f-2105962265
f
GR
GS
[0.99899 0 0 1.00215 131.52797 96.37377] CT
0.502 0.702 0.8 RC
N
f-2105962265
f
GR
GS
[0.99899 0 0 1.00215 142.21269 107.062] CT
0.502 0.702 0.8 RC
N
f-2105962265
f
GR
GS
[0.99899 0 0 1.00215 137.06384 114.06894] CT
0.502 0.702 0.8 RC
N
f-2105962265
f
GR
GS
[0.99899 0 0 1.00215 115.50091 104.62491] CT
0.502 0.702 0.8 RC
N
f-2105962265
f
GR
GS
[0.99899 0 0 1.00215 136.87033 106.70204] CT
0.502 0.702 0.8 RC
N
f-2105962265
f
GR
GS
[0.99899 0 0 1.00215 147.55503 119.75354] CT
0.502 0.702 0.8 RC
N
f-2105962265
f
GR
GS
[0.99899 0 0 1.00215 121.84234 112.01287] CT
0.502 0.702 0.8 RC
N
f-2105962265
f
GR
GS
[0.99899 0 0 1.00215 126.91756 141.76238] CT
0.502 0.702 0.8 RC
N
f-2105962265
f
GR
GS
[0.99899 0 0 1.00215 137.59386 113.1126] CT
0.502 0.702 0.8 RC
N
f-2105962265
f
GR
GS
[0.99899 0 0 1.00215 115.50091 116.22159] CT
0.502 0.702 0.8 RC
N
f-2105962265
f
GR
GS
[0.99899 0 0 1.00215 136.87033 120.70193] CT
0.502 0.702 0.8 RC
N
f-2105962265
f
GR
GS
[0.99899 0 0 1.00215 115.86688 122.27105] CT
0.502 0.702 0.8 RC
N
f-2105962265
f
GR
GS
[0.99899 0 0 1.00215 147.55503 118.06418] CT
0.502 0.702 0.8 RC
N
f-2105962265
f
GR
GS
[0.99899 0 0 1.00215 142.84156 102.32397] CT
0.502 0.702 0.8 RC
N
f-2105962265
f
GR
GS
[0.99899 0 0 1.00215 119.70539 90.66376] CT
0.502 0.702 0.8 RC
N
f-2105962265
f
GR
GS
[0.99899 0 0 1.00215 139.46788 113.98392] CT
0.502 0.702 0.8 RC
N
f-2105962265
f
GR
GS
[0.99899 0 0 1.00215 129.44362 114.06982] CT
0.502 0.702 0.8 RC
N
f-2105962265
f
GR
GS
[0.99899 0 0 1.00215 148.81702 118.22523] CT
0.502 0.702 0.8 RC
N
f-2105962265
f
GR
GS
[0.99899 0 0 1.00215 152.8974 119.44661] CT
0.502 0.702 0.8 RC
N
f-2105962265
f
GR
GS
[0.99899 0 0 1.00215 142.21269 98.86587] CT
0.502 0.702 0.8 RC
N
f-2105962265
f
GR
GS
[0.99899 0 0 1.00215 110.15855 124.18072] CT
0.502 0.702 0.8 RC
N
f-2105962265
f
GR
GS
[0.99899 0 0 1.00215 144.54313 122.40614] CT
0.502 0.702 0.8 RC
N
f-2105962265
f
GR
GS
[0.99899 0 0 1.00215 142.21269 115.35316] CT
0.502 0.702 0.8 RC
N
f-2105962265
f
GR
GS
[0.99899 0 0 1.00215 111.42473 128.79526] CT
0.502 0.702 0.8 RC
N
f-2105962265
f
GR
GS
[0.99899 0 0 1.00215 110.26582 137.87074] CT
0.502 0.702 0.8 RC
N
f-2105962265
f
GR
GS
[0.99899 0 0 1.00215 122.37656 121.4091] CT
0.502 0.702 0.8 RC
N
f-2105962265
f
GR
GS
[0.99899 0 0 1.00215 169.01911 105.53456] CT
0.502 0.702 0.8 RC
N
f-2105962265
f
GR
GS
[0.99899 0 0 1.00215 151.92359 114.37197] CT
0.502 0.702 0.8 RC
N
f-2105962265
f
GR
GS
[0.99899 0 0 1.00215 175.52039 144.93521] CT
0.502 0.702 0.8 RC
N
f-2105962265
f
GR
GS
[0.99899 0 0 1.00215 149.61627 136.56599] CT
0.502 0.702 0.8 RC
N
f-2105962265
f
GR
GS
[0.99899 0 0 1.00215 126.18561 125.36595] CT
0.502 0.702 0.8 RC
N
f-2105962265
f
GR
GS
[0.99899 0 0 1.00215 140.80348 105.70415] CT
0.502 0.702 0.8 RC
N
f-2105962265
f
GR
GS
[0.99899 0 0 1.00215 136.87033 109.34787] CT
0.502 0.702 0.8 RC
N
f-2105962265
f
GR
GS
[0.99899 0 0 1.00215 121.04097 120.32454] CT
0.502 0.702 0.8 RC
N
f-2105962265
f
GR
GS
[0.99899 0 0 1.00215 111.42473 116.56342] CT
0.502 0.702 0.8 RC
N
f-2105962265
f
GR
GS
[0.99899 0 0 1.00215 137.59808 116.62322] CT
0.502 0.702 0.8 RC
N
f-2105962265
f
GR
GS
[0.99899 0 0 1.00215 104.81621 107.26764] CT
0.502 0.702 0.8 RC
N
f-2105962265
f
GR
GS
[0.99899 0 0 1.00215 127.4518 99.01724] CT
0.502 0.702 0.8 RC
N
f-2105962265
f
GR
GS
[0.99899 0 0 1.00215 85.05159 89.40049] CT
0.502 0.702 0.8 RC
N
f-2105962265
f
GR
GS
[0.99899 0 0 1.00215 179.60918 123.97451] CT
0.502 0.702 0.8 RC
N
f-2105962265
f
GR
GS
[0.99899 0 0 1.00215 123.17792 124.39058] CT
0.502 0.702 0.8 RC
N
f-2105962265
f
GR
GS
[0.99899 0 0 1.00215 0 -0.4252] CT
0.6 0.8 0.902 RC
1 LJ
3 LW
N
60.983 53.91 M
205.517 155.019 L
S
GR
GS
[0.99899 0 0 1.00215 125.92692 63.54547] CT
0.702 0.898 1 RC
N
/f227889816{-3 -3 M
-3 3 L
3 3 L
3 -3 L
cp}def
f227889816
f
GR
GS
[0.99899 0 0 1.00215 104.81621 88.8123] CT
0.702 0.898 1 RC
N
f227889816
f
GR
GS
[0.99899 0 0 1.00215 99.5748 55.72816] CT
0.702 0.898 1 RC
N
f227889816
f
GR
GS
[0.99899 0 0 1.00215 94.13148 67.88293] CT
0.702 0.898 1 RC
N
f227889816
f
GR
GS
[0.99899 0 0 1.00215 136.69997 100.38379] CT
0.702 0.898 1 RC
N
f227889816
f
GR
GS
[0.99899 0 0 1.00215 114.36303 66.14483] CT
0.702 0.898 1 RC
N
f227889816
f
GR
GS
[0.99899 0 0 1.00215 115.50091 64.71078] CT
0.702 0.898 1 RC
N
f227889816
f
GR
GS
[0.99899 0 0 1.00215 92.19646 59.82837] CT
0.702 0.898 1 RC
N
f227889816
f
GR
GS
[0.99899 0 0 1.00215 110.49508 81.27471] CT
0.702 0.898 1 RC
N
f227889816
f
GR
GS
[0.99899 0 0 1.00215 120.83485 58.88747] CT
0.702 0.898 1 RC
N
f227889816
f
GR
GS
[0.99899 0 0 1.00215 114.90567 79.8379] CT
0.702 0.898 1 RC
N
f227889816
f
GR
GS
[0.99899 0 0 1.00215 126.18561 57.01882] CT
0.702 0.898 1 RC
N
f227889816
f
GR
GS
[0.99899 0 0 1.00215 81.78308 69.78698] CT
0.702 0.898 1 RC
N
f227889816
f
GR
GS
[0.99899 0 0 1.00215 84.41639 64.53079] CT
0.702 0.898 1 RC
N
f227889816
f
GR
GS
[0.99899 0 0 1.00215 104.81621 103.10931] CT
0.702 0.898 1 RC
N
f227889816
f
GR
GS
[0.99899 0 0 1.00215 147.74853 133.56271] CT
0.702 0.898 1 RC
N
f227889816
f
GR
GS
[0.99899 0 0 1.00215 120.675 88.90474] CT
0.702 0.898 1 RC
N
f227889816
f
GR
GS
[0.99899 0 0 1.00215 131.52797 56.83765] CT
0.702 0.898 1 RC
N
f227889816
f
GR
GS
[0.99899 0 0 1.00215 72.96819 78.85661] CT
0.702 0.898 1 RC
N
f227889816
f
GR
GS
[0.99899 0 0 1.00215 99.5748 87.95059] CT
0.702 0.898 1 RC
N
f227889816
f
GR
GS
[0.99899 0 0 1.00215 79.47577 66.94655] CT
0.702 0.898 1 RC
N
f227889816
f
GR
GS
[0.99899 0 0 1.00215 104.90876 79.40337] CT
0.702 0.898 1 RC
N
f227889816
f
GR
GS
[0.99899 0 0 1.00215 94.23246 103.15708] CT
0.702 0.898 1 RC
N
f227889816
f
GR
GS
[0.99899 0 0 1.00215 77.94037 72.58275] CT
0.702 0.898 1 RC
N
f227889816
f
GR
GS
[0.99899 0 0 1.00215 106.88794 44.11846] CT
0.702 0.898 1 RC
N
f227889816
f
GR
GS
[0.99899 0 0 1.00215 95.40188 95.477] CT
0.702 0.898 1 RC
N
f227889816
f
GR
GS
[0.99899 0 0 1.00215 79.6819 76.53038] CT
0.702 0.898 1 RC
N
f227889816
f
GR
GS
[0.99899 0 0 1.00215 123.17792 54.69971] CT
0.702 0.898 1 RC
N
f227889816
f
GR
GS
[0.99899 0 0 1.00215 119.43826 51.17693] CT
0.702 0.898 1 RC
N
f227889816
f
GR
GS
[0.99899 0 0 1.00215 115.59976 89.70318] CT
0.702 0.898 1 RC
N
f227889816
f
GR
GS
[0.99899 0 0 1.00215 100.18266 56.2605] CT
0.702 0.898 1 RC
N
f227889816
f
GR
GS
[0.99899 0 0 1.00215 80.18038 40.39555] CT
0.702 0.898 1 RC
N
f227889816
f
GR
GS
[0.99899 0 0 1.00215 88.99105 58.52626] CT
0.702 0.898 1 RC
N
f227889816
f
GR
GS
[0.99899 0 0 1.00215 104.91296 41.4179] CT
0.702 0.898 1 RC
N
f227889816
f
GR
GS
[0.99899 0 0 1.00215 83.65291 70.41818] CT
0.702 0.898 1 RC
N
f227889816
f
GR
GS
[0.99899 0 0 1.00215 95.93612 32.2281] CT
0.702 0.898 1 RC
N
f227889816
f
GR
GS
[0.99899 0 0 1.00215 96.47033 79.08197] CT
0.702 0.898 1 RC
N
f227889816
f
GR
GS
[0.99899 0 0 1.00215 73.39937 51.79054] CT
0.702 0.898 1 RC
N
f227889816
f
GR
GS
[0.99899 0 0 1.00215 111.95898 93.75269] CT
0.702 0.898 1 RC
N
f227889816
f
GR
GS
[0.99899 0 0 1.00215 96.73746 58.74707] CT
0.702 0.898 1 RC
N
f227889816
f
GR
GS
[0.99899 0 0 1.00215 115.16439 83.7942] CT
0.702 0.898 1 RC
N
f227889816
f
GR
GS
[0.99899 0 0 1.00215 105.18428 63.47376] CT
0.702 0.898 1 RC
N
f227889816
f
GR
GS
[0.99899 0 0 1.00215 162.87541 122.05029] CT
0.502 0.702 0.8 RC
N
/f-1969333140{-3.536 0 M
0 4.702 L
3.536 0 L
0 -4.702 L
cp}def
f-1969333140
f
GR
GS
[0.99899 0 0 1.00215 157.02406 114.69556] CT
0.502 0.702 0.8 RC
N
f-1969333140
f
GR
GS
[0.99899 0 0 1.00215 104.81621 93.98979] CT
0.502 0.702 0.8 RC
N
f-1969333140
f
GR
GS
[0.99899 0 0 1.00215 193.26371 148.31019] CT
0.502 0.702 0.8 RC
N
f-1969333140
f
GR
GS
[0.99899 0 0 1.00215 131.52797 110.29807] CT
0.502 0.702 0.8 RC
N
f-1969333140
f
GR
GS
[0.99899 0 0 1.00215 158.96328 125.47513] CT
0.502 0.702 0.8 RC
N
f-1969333140
f
GR
GS
[0.99899 0 0 1.00215 146.9472 92.73239] CT
0.502 0.702 0.8 RC
N
f-1969333140
f
GR
GS
[0.99899 0 0 1.00215 131.62472 117.39438] CT
0.502 0.702 0.8 RC
N
f-1969333140
f
GR
GS
[0.99899 0 0 1.00215 126.09518 117.62117] CT
0.502 0.702 0.8 RC
N
f-1969333140
f
GR
GS
[0.99899 0 0 1.00215 144.00891 103.64202] CT
0.502 0.702 0.8 RC
N
f-1969333140
f
GR
GS
[0.99899 0 0 1.00215 88.78914 110.69319] CT
0.502 0.702 0.8 RC
N
f-1969333140
f
GR
GS
[0.99899 0 0 1.00215 169.28623 136.22732] CT
0.502 0.702 0.8 RC
N
f-1969333140
f
GR
GS
[0.99899 0 0 1.00215 131.52797 96.37377] CT
0.502 0.702 0.8 RC
N
f-1969333140
f
GR
GS
[0.99899 0 0 1.00215 142.21269 107.062] CT
0.502 0.702 0.8 RC
N
f-1969333140
f
GR
GS
[0.99899 0 0 1.00215 137.06384 114.06894] CT
0.502 0.702 0.8 RC
N
f-1969333140
f
GR
GS
[0.99899 0 0 1.00215 115.50091 104.62491] CT
0.502 0.702 0.8 RC
N
f-1969333140
f
GR
GS
[0.99899 0 0 1.00215 136.87033 106.70204] CT
0.502 0.702 0.8 RC
N
f-1969333140
f
GR
GS
[0.99899 0 0 1.00215 147.55503 119.75354] CT
0.502 0.702 0.8 RC
N
f-1969333140
f
GR
GS
[0.99899 0 0 1.00215 121.84234 112.01287] CT
0.502 0.702 0.8 RC
N
f-1969333140
f
GR
GS
[0.99899 0 0 1.00215 126.91756 141.76238] CT
0.502 0.702 0.8 RC
N
f-1969333140
f
GR
GS
[0.99899 0 0 1.00215 137.59386 113.1126] CT
0.502 0.702 0.8 RC
N
f-1969333140
f
GR
GS
[0.99899 0 0 1.00215 115.50091 116.22159] CT
0.502 0.702 0.8 RC
N
f-1969333140
f
GR
GS
[0.99899 0 0 1.00215 136.87033 120.70193] CT
0.502 0.702 0.8 RC
N
f-1969333140
f
GR
GS
[0.99899 0 0 1.00215 115.86688 122.27105] CT
0.502 0.702 0.8 RC
N
f-1969333140
f
GR
GS
[0.99899 0 0 1.00215 147.55503 118.06418] CT
0.502 0.702 0.8 RC
N
f-1969333140
f
GR
GS
[0.99899 0 0 1.00215 142.84156 102.32397] CT
0.502 0.702 0.8 RC
N
f-1969333140
f
GR
GS
[0.99899 0 0 1.00215 119.70539 90.66376] CT
0.502 0.702 0.8 RC
N
f-1969333140
f
GR
GS
[0.99899 0 0 1.00215 139.46788 113.98392] CT
0.502 0.702 0.8 RC
N
f-1969333140
f
GR
GS
[0.99899 0 0 1.00215 129.44362 114.06982] CT
0.502 0.702 0.8 RC
N
f-1969333140
f
GR
GS
[0.99899 0 0 1.00215 148.81702 118.22523] CT
0.502 0.702 0.8 RC
N
f-1969333140
f
GR
GS
[0.99899 0 0 1.00215 152.8974 119.44661] CT
0.502 0.702 0.8 RC
N
f-1969333140
f
GR
GS
[0.99899 0 0 1.00215 142.21269 98.86587] CT
0.502 0.702 0.8 RC
N
f-1969333140
f
GR
GS
[0.99899 0 0 1.00215 110.15855 124.18072] CT
0.502 0.702 0.8 RC
N
f-1969333140
f
GR
GS
[0.99899 0 0 1.00215 144.54313 122.40614] CT
0.502 0.702 0.8 RC
N
f-1969333140
f
GR
GS
[0.99899 0 0 1.00215 142.21269 115.35316] CT
0.502 0.702 0.8 RC
N
f-1969333140
f
GR
GS
[0.99899 0 0 1.00215 111.42473 128.79526] CT
0.502 0.702 0.8 RC
N
f-1969333140
f
GR
GS
[0.99899 0 0 1.00215 110.26582 137.87074] CT
0.502 0.702 0.8 RC
N
f-1969333140
f
GR
GS
[0.99899 0 0 1.00215 122.37656 121.4091] CT
0.502 0.702 0.8 RC
N
f-1969333140
f
GR
GS
[0.99899 0 0 1.00215 169.01911 105.53456] CT
0.502 0.702 0.8 RC
N
f-1969333140
f
GR
GS
[0.99899 0 0 1.00215 151.92359 114.37197] CT
0.502 0.702 0.8 RC
N
f-1969333140
f
GR
GS
[0.99899 0 0 1.00215 175.52039 144.93521] CT
0.502 0.702 0.8 RC
N
f-1969333140
f
GR
GS
[0.99899 0 0 1.00215 149.61627 136.56599] CT
0.502 0.702 0.8 RC
N
f-1969333140
f
GR
GS
[0.99899 0 0 1.00215 126.18561 125.36595] CT
0.502 0.702 0.8 RC
N
f-1969333140
f
GR
GS
[0.99899 0 0 1.00215 140.80348 105.70415] CT
0.502 0.702 0.8 RC
N
f-1969333140
f
GR
GS
[0.99899 0 0 1.00215 136.87033 109.34787] CT
0.502 0.702 0.8 RC
N
f-1969333140
f
GR
GS
[0.99899 0 0 1.00215 121.04097 120.32454] CT
0.502 0.702 0.8 RC
N
f-1969333140
f
GR
GS
[0.99899 0 0 1.00215 111.42473 116.56342] CT
0.502 0.702 0.8 RC
N
f-1969333140
f
GR
GS
[0.99899 0 0 1.00215 137.59808 116.62322] CT
0.502 0.702 0.8 RC
N
f-1969333140
f
GR
GS
[0.99899 0 0 1.00215 104.81621 107.26764] CT
0.502 0.702 0.8 RC
N
f-1969333140
f
GR
GS
[0.99899 0 0 1.00215 127.4518 99.01724] CT
0.502 0.702 0.8 RC
N
f-1969333140
f
GR
GS
[0.99899 0 0 1.00215 85.05159 89.40049] CT
0.502 0.702 0.8 RC
N
f-1969333140
f
GR
GS
[0.99899 0 0 1.00215 179.60918 123.97451] CT
0.502 0.702 0.8 RC
N
f-1969333140
f
GR
GS
[0.99899 0 0 1.00215 123.17792 124.39058] CT
0.502 0.702 0.8 RC
N
f-1969333140
f
GR
%%Trailer
%%Pages: 1
%%EOF
