%!PS-Adobe-3.0 EPSF-3.0
%%Creator: (MATLAB, The Mathworks, Inc. Version 9.8.0.1323502 \(R2020a\). Operating System: Mac OS X)
%%Title: /Users/kosciessa/Desktop/mntTardisLNDG/LNDG/stateswitch/stsw_multimodal/figures/linearbyage/linearcomp_pupil.eps
%%CreationDate: 2022-03-03T16:32:27
%%Pages: (atend)
%%BoundingBox:     4     0   180   275
%%LanguageLevel: 3
%%EndComments
%%BeginProlog
%%BeginResource: procset (Apache XML Graphics Std ProcSet) 1.2 0
%%Version: 1.2 0
%%Copyright: (Copyright 2001-2003,2010 The Apache Software Foundation. License terms: http://www.apache.org/licenses/LICENSE-2.0)
/bd{bind def}bind def
/ld{load def}bd
/GR/grestore ld
/GS/gsave ld
/RM/rmoveto ld
/C/curveto ld
/t/show ld
/L/lineto ld
/ML/setmiterlimit ld
/CT/concat ld
/f/fill ld
/N/newpath ld
/S/stroke ld
/CC/setcmykcolor ld
/A/ashow ld
/cp/closepath ld
/RC/setrgbcolor ld
/LJ/setlinejoin ld
/GC/setgray ld
/LW/setlinewidth ld
/M/moveto ld
/re {4 2 roll M
1 index 0 rlineto
0 exch rlineto
neg 0 rlineto
cp } bd
/_ctm matrix def
/_tm matrix def
/BT { _ctm currentmatrix pop matrix _tm copy pop 0 0 moveto } bd
/ET { _ctm setmatrix } bd
/iTm { _ctm setmatrix _tm concat } bd
/Tm { _tm astore pop iTm 0 0 moveto } bd
/ux 0.0 def
/uy 0.0 def
/F {
  /Tp exch def
  /Tf exch def
  Tf findfont Tp scalefont setfont
  /cf Tf def  /cs Tp def
} bd
/ULS {currentpoint /uy exch def /ux exch def} bd
/ULE {
  /Tcx currentpoint pop def
  gsave
  newpath
  cf findfont cs scalefont dup
  /FontMatrix get 0 get /Ts exch def /FontInfo get dup
  /UnderlinePosition get Ts mul /To exch def
  /UnderlineThickness get Ts mul /Tt exch def
  ux uy To add moveto  Tcx uy To add lineto
  Tt setlinewidth stroke
  grestore
} bd
/OLE {
  /Tcx currentpoint pop def
  gsave
  newpath
  cf findfont cs scalefont dup
  /FontMatrix get 0 get /Ts exch def /FontInfo get dup
  /UnderlinePosition get Ts mul /To exch def
  /UnderlineThickness get Ts mul /Tt exch def
  ux uy To add cs add moveto Tcx uy To add cs add lineto
  Tt setlinewidth stroke
  grestore
} bd
/SOE {
  /Tcx currentpoint pop def
  gsave
  newpath
  cf findfont cs scalefont dup
  /FontMatrix get 0 get /Ts exch def /FontInfo get dup
  /UnderlinePosition get Ts mul /To exch def
  /UnderlineThickness get Ts mul /Tt exch def
  ux uy To add cs 10 mul 26 idiv add moveto Tcx uy To add cs 10 mul 26 idiv add lineto
  Tt setlinewidth stroke
  grestore
} bd
/QT {
/Y22 exch store
/X22 exch store
/Y21 exch store
/X21 exch store
currentpoint
/Y21 load 2 mul add 3 div exch
/X21 load 2 mul add 3 div exch
/X21 load 2 mul /X22 load add 3 div
/Y21 load 2 mul /Y22 load add 3 div
/X22 load /Y22 load curveto
} bd
/SSPD {
dup length /d exch dict def
{
/v exch def
/k exch def
currentpagedevice k known {
/cpdv currentpagedevice k get def
v cpdv ne {
/upd false def
/nullv v type /nulltype eq def
/nullcpdv cpdv type /nulltype eq def
nullv nullcpdv or
{
/upd true def
} {
/sametype v type cpdv type eq def
sametype {
v type /arraytype eq {
/vlen v length def
/cpdvlen cpdv length def
vlen cpdvlen eq {
0 1 vlen 1 sub {
/i exch def
/obj v i get def
/cpdobj cpdv i get def
obj cpdobj ne {
/upd true def
exit
} if
} for
} {
/upd true def
} ifelse
} {
v type /dicttype eq {
v {
/dv exch def
/dk exch def
/cpddv cpdv dk get def
dv cpddv ne {
/upd true def
exit
} if
} forall
} {
/upd true def
} ifelse
} ifelse
} if
} ifelse
upd true eq {
d k v put
} if
} if
} if
} forall
d length 0 gt {
d setpagedevice
} if
} bd
/RE { % /NewFontName [NewEncodingArray] /FontName RE -
  findfont dup length dict begin
  {
    1 index /FID ne
    {def} {pop pop} ifelse
  } forall
  /Encoding exch def
  /FontName 1 index def
  currentdict definefont pop
  end
} bind def
%%EndResource
%%BeginResource: procset (Apache XML Graphics EPS ProcSet) 1.0 0
%%Version: 1.0 0
%%Copyright: (Copyright 2002-2003 The Apache Software Foundation. License terms: http://www.apache.org/licenses/LICENSE-2.0)
/BeginEPSF { %def
/b4_Inc_state save def         % Save state for cleanup
/dict_count countdictstack def % Count objects on dict stack
/op_count count 1 sub def      % Count objects on operand stack
userdict begin                 % Push userdict on dict stack
/showpage { } def              % Redefine showpage, { } = null proc
0 setgray 0 setlinecap         % Prepare graphics state
1 setlinewidth 0 setlinejoin
10 setmiterlimit [ ] 0 setdash newpath
/languagelevel where           % If level not equal to 1 then
{pop languagelevel             % set strokeadjust and
1 ne                           % overprint to their defaults.
{false setstrokeadjust false setoverprint
} if
} if
} bd
/EndEPSF { %def
count op_count sub {pop} repeat            % Clean up stacks
countdictstack dict_count sub {end} repeat
b4_Inc_state restore
} bd
%%EndResource
%FOPBeginFontDict
%%IncludeResource: font Courier-Oblique
%%IncludeResource: font Courier-BoldOblique
%%IncludeResource: font Courier-Bold
%%IncludeResource: font ZapfDingbats
%%IncludeResource: font Symbol
%%IncludeResource: font Helvetica
%%IncludeResource: font Helvetica-Oblique
%%IncludeResource: font Helvetica-Bold
%%IncludeResource: font Helvetica-BoldOblique
%%IncludeResource: font Times-Roman
%%IncludeResource: font Times-Italic
%%IncludeResource: font Times-Bold
%%IncludeResource: font Times-BoldItalic
%%IncludeResource: font Courier
%FOPEndFontDict
%%BeginResource: encoding WinAnsiEncoding
/WinAnsiEncoding [
/.notdef /.notdef /.notdef /.notdef /.notdef
/.notdef /.notdef /.notdef /.notdef /.notdef
/.notdef /.notdef /.notdef /.notdef /.notdef
/.notdef /.notdef /.notdef /.notdef /.notdef
/.notdef /.notdef /.notdef /.notdef /.notdef
/.notdef /.notdef /.notdef /.notdef /.notdef
/.notdef /.notdef /space /exclam /quotedbl
/numbersign /dollar /percent /ampersand /quotesingle
/parenleft /parenright /asterisk /plus /comma
/hyphen /period /slash /zero /one
/two /three /four /five /six
/seven /eight /nine /colon /semicolon
/less /equal /greater /question /at
/A /B /C /D /E
/F /G /H /I /J
/K /L /M /N /O
/P /Q /R /S /T
/U /V /W /X /Y
/Z /bracketleft /backslash /bracketright /asciicircum
/underscore /quoteleft /a /b /c
/d /e /f /g /h
/i /j /k /l /m
/n /o /p /q /r
/s /t /u /v /w
/x /y /z /braceleft /bar
/braceright /asciitilde /bullet /Euro /bullet
/quotesinglbase /florin /quotedblbase /ellipsis /dagger
/daggerdbl /circumflex /perthousand /Scaron /guilsinglleft
/OE /bullet /Zcaron /bullet /bullet
/quoteleft /quoteright /quotedblleft /quotedblright /bullet
/endash /emdash /asciitilde /trademark /scaron
/guilsinglright /oe /bullet /zcaron /Ydieresis
/space /exclamdown /cent /sterling /currency
/yen /brokenbar /section /dieresis /copyright
/ordfeminine /guillemotleft /logicalnot /sfthyphen /registered
/macron /degree /plusminus /twosuperior /threesuperior
/acute /mu /paragraph /middot /cedilla
/onesuperior /ordmasculine /guillemotright /onequarter /onehalf
/threequarters /questiondown /Agrave /Aacute /Acircumflex
/Atilde /Adieresis /Aring /AE /Ccedilla
/Egrave /Eacute /Ecircumflex /Edieresis /Igrave
/Iacute /Icircumflex /Idieresis /Eth /Ntilde
/Ograve /Oacute /Ocircumflex /Otilde /Odieresis
/multiply /Oslash /Ugrave /Uacute /Ucircumflex
/Udieresis /Yacute /Thorn /germandbls /agrave
/aacute /acircumflex /atilde /adieresis /aring
/ae /ccedilla /egrave /eacute /ecircumflex
/edieresis /igrave /iacute /icircumflex /idieresis
/eth /ntilde /ograve /oacute /ocircumflex
/otilde /odieresis /divide /oslash /ugrave
/uacute /ucircumflex /udieresis /yacute /thorn
/ydieresis
] def
%%EndResource
%FOPBeginFontReencode
/Courier-Oblique findfont
dup length dict begin
  {1 index /FID ne {def} {pop pop} ifelse} forall
  /Encoding WinAnsiEncoding def
  currentdict
end
/Courier-Oblique exch definefont pop
/Courier-BoldOblique findfont
dup length dict begin
  {1 index /FID ne {def} {pop pop} ifelse} forall
  /Encoding WinAnsiEncoding def
  currentdict
end
/Courier-BoldOblique exch definefont pop
/Courier-Bold findfont
dup length dict begin
  {1 index /FID ne {def} {pop pop} ifelse} forall
  /Encoding WinAnsiEncoding def
  currentdict
end
/Courier-Bold exch definefont pop
/Helvetica findfont
dup length dict begin
  {1 index /FID ne {def} {pop pop} ifelse} forall
  /Encoding WinAnsiEncoding def
  currentdict
end
/Helvetica exch definefont pop
/Helvetica-Oblique findfont
dup length dict begin
  {1 index /FID ne {def} {pop pop} ifelse} forall
  /Encoding WinAnsiEncoding def
  currentdict
end
/Helvetica-Oblique exch definefont pop
/Helvetica-Bold findfont
dup length dict begin
  {1 index /FID ne {def} {pop pop} ifelse} forall
  /Encoding WinAnsiEncoding def
  currentdict
end
/Helvetica-Bold exch definefont pop
/Helvetica-BoldOblique findfont
dup length dict begin
  {1 index /FID ne {def} {pop pop} ifelse} forall
  /Encoding WinAnsiEncoding def
  currentdict
end
/Helvetica-BoldOblique exch definefont pop
/Times-Roman findfont
dup length dict begin
  {1 index /FID ne {def} {pop pop} ifelse} forall
  /Encoding WinAnsiEncoding def
  currentdict
end
/Times-Roman exch definefont pop
/Times-Italic findfont
dup length dict begin
  {1 index /FID ne {def} {pop pop} ifelse} forall
  /Encoding WinAnsiEncoding def
  currentdict
end
/Times-Italic exch definefont pop
/Times-Bold findfont
dup length dict begin
  {1 index /FID ne {def} {pop pop} ifelse} forall
  /Encoding WinAnsiEncoding def
  currentdict
end
/Times-Bold exch definefont pop
/Times-BoldItalic findfont
dup length dict begin
  {1 index /FID ne {def} {pop pop} ifelse} forall
  /Encoding WinAnsiEncoding def
  currentdict
end
/Times-BoldItalic exch definefont pop
/Courier findfont
dup length dict begin
  {1 index /FID ne {def} {pop pop} ifelse} forall
  /Encoding WinAnsiEncoding def
  currentdict
end
/Courier exch definefont pop
%FOPEndFontReencode
%%EndProlog
%%Page: 1 1
%%PageBoundingBox: 0 0 198 283
%%BeginPageSetup
[1 0 0 -1 0 283] CT
%%EndPageSetup
GS
[1.00215 0 0 1 0 0] CT
1 GC
N
0 0 198 283 re
f
GR
GS
[1.00215 0 0 1 0 0] CT
1 GC
N
0 0 198 283 re
f
GR
GS
[1.00215 0 0 1 0 0] CT
1 GC
N
55.5 228 M
179 228 L
179 32 L
55.5 32 L
cp
f
GR
GS
[1.00215 0 0 1 0 0] CT
0.149 GC
2 setlinecap
1 LJ
0.5 LW
N
55.5 228 M
179 228 L
S
GR
GS
[1.00215 0 0 1 0 0] CT
0.149 GC
2 setlinecap
1 LJ
0.5 LW
N
92.55 228 M
92.55 226.04 L
S
GR
GS
[1.00215 0 0 1 0 0] CT
0.149 GC
2 setlinecap
1 LJ
0.5 LW
N
141.95 228 M
141.95 226.04 L
S
GR
GS
[1.00215 0 0 1 92.74875 234] CT
0.149 GC
/Helvetica 20 F
GS
[1 0 0 1 0 0] CT
-13 20 moveto 
1 -1 scale
(YA) t 
GR
GR
GS
[1.00215 0 0 1 142.25483 234] CT
0.149 GC
/Helvetica 20 F
GS
[1 0 0 1 0 0] CT
-14.5 20 moveto 
1 -1 scale
(OA) t 
GR
GR
GS
[1.00215 0 0 1 117.50185 259] CT
0.149 GC
/Helvetica 20 F
GS
[1 0 0 1 0 0] CT
-49 20 moveto 
1 -1 scale
(Age Group) t 
GR
GR
GS
[1.00215 0 0 1 0 0] CT
0.149 GC
2 setlinecap
1 LJ
0.5 LW
N
55.5 228 M
55.5 32 L
S
GR
GS
[1.00215 0 0 1 0 0] CT
0.149 GC
2 setlinecap
1 LJ
0.5 LW
N
55.5 228 M
57.46 228 L
S
GR
GS
[1.00215 0 0 1 0 0] CT
0.149 GC
2 setlinecap
1 LJ
0.5 LW
N
55.5 167.654 M
57.46 167.654 L
S
GR
GS
[1.00215 0 0 1 0 0] CT
0.149 GC
2 setlinecap
1 LJ
0.5 LW
N
55.5 107.308 M
57.46 107.308 L
S
GR
GS
[1.00215 0 0 1 0 0] CT
0.149 GC
2 setlinecap
1 LJ
0.5 LW
N
55.5 46.962 M
57.46 46.962 L
S
GR
GS
[1.00215 0 0 1 49.6063 228] CT
0.149 GC
/Helvetica 20 F
GS
[1 0 0 1 0 0] CT
-19 7.5 moveto 
1 -1 scale
(-5) t 
GR
GR
GS
[1.00215 0 0 1 49.6063 167.65416] CT
0.149 GC
/Helvetica 20 F
GS
[1 0 0 1 0 0] CT
-12 7.5 moveto 
1 -1 scale
(0) t 
GR
GR
GS
[1.00215 0 0 1 49.6063 107.30832] CT
0.149 GC
/Helvetica 20 F
GS
[1 0 0 1 0 0] CT
-12 7.5 moveto 
1 -1 scale
(5) t 
GR
GR
GS
[1.00215 0 0 1 49.6063 46.96248] CT
0.149 GC
/Helvetica 20 F
GS
[1 0 0 1 0 0] CT
-23 7.5 moveto 
1 -1 scale
(10) t 
GR
GR
GS
[0 -1 1.00215 0 24.05154 129.99991] CT
0.149 GC
/Helvetica 20 F
GS
[1 0 0 1 0 0] CT
-49 -5 moveto 
1 -1 scale
(pupil linear) t 
GR
GR
GS
[1.00215 0 0 1 117.50191 29.24999] CT
/Helvetica-Bold 22 F
GS
[1 0 0 1 0 0] CT
-41 -5 moveto 
1 -1 scale
(p = 0.02) t 
GR
GR
GS
[1.00215 0 0 1 0 0] CT
0.149 GC
1 LJ
0.5 LW
N
55.5 167.654 M
179 167.654 L
S
GR
GS
[1.00215 0 0 1 0 0] CT
1 0.6 0.6 RC
N
112.31 167.654 M
112.31 115.016 L
72.79 115.016 L
72.79 167.654 L
cp
f
GR
GS
[1.00215 0 0 1 99.32028 200.68541] CT
0.302 GC
N
2.236 0 M
2.236 -1.235 1.235 -2.236 0 -2.236 C
-1.235 -2.236 -2.236 -1.235 -2.236 0 C
-2.236 1.235 -1.235 2.236 0 2.236 C
1.235 2.236 2.236 1.235 2.236 0 C
cp
f
GR
GS
[1.00215 0 0 1 89.74913 60.77267] CT
0.302 GC
N
/f-1586420743{2.236 0 M
2.236 -1.235 1.235 -2.236 0 -2.236 C
-1.235 -2.236 -2.236 -1.235 -2.236 0 C
-2.236 1.235 -1.235 2.236 0 2.236 C
1.235 2.236 2.236 1.235 2.236 0 C
cp}def
f-1586420743
f
GR
GS
[1.00215 0 0 1 93.48577 131.36478] CT
0.302 GC
N
f-1586420743
f
GR
GS
[1.00215 0 0 1 85.12327 162.22453] CT
0.302 GC
N
f-1586420743
f
GR
GS
[1.00215 0 0 1 90.33865 107.36582] CT
0.302 GC
N
f-1586420743
f
GR
GS
[1.00215 0 0 1 84.28997 52.93808] CT
0.302 GC
N
f-1586420743
f
GR
GS
[1.00215 0 0 1 88.93492 87.46108] CT
0.302 GC
N
f-1586420743
f
GR
GS
[1.00215 0 0 1 93.68623 83.48992] CT
0.302 GC
N
f-1586420743
f
GR
GS
[1.00215 0 0 1 100.55726 129.30556] CT
0.302 GC
N
f-1586420743
f
GR
GS
[1.00215 0 0 1 96.06866 156.80376] CT
0.302 GC
N
f-1586420743
f
GR
GS
[1.00215 0 0 1 85.30533 129.96358] CT
0.302 GC
N
f-1586420743
f
GR
GS
[1.00215 0 0 1 96.41724 143.69598] CT
0.302 GC
N
f-1586420743
f
GR
GS
[1.00215 0 0 1 99.45497 129.29443] CT
0.302 GC
N
f-1586420743
f
GR
GS
[1.00215 0 0 1 88.96888 200.68541] CT
0.302 GC
N
f-1586420743
f
GR
GS
[1.00215 0 0 1 96.91276 106.84094] CT
0.302 GC
N
f-1586420743
f
GR
GS
[1.00215 0 0 1 94.19115 105.69451] CT
0.302 GC
N
f-1586420743
f
GR
GS
[1.00215 0 0 1 91.48427 123.59667] CT
0.302 GC
N
f-1586420743
f
GR
GS
[1.00215 0 0 1 83.35355 97.41678] CT
0.302 GC
N
f-1586420743
f
GR
GS
[1.00215 0 0 1 91.36563 112.30708] CT
0.302 GC
N
f-1586420743
f
GR
GS
[1.00215 0 0 1 88.14448 41.4771] CT
0.302 GC
N
f-1586420743
f
GR
GS
[1.00215 0 0 1 96.41168 191.4968] CT
0.302 GC
N
f-1586420743
f
GR
GS
[1.00215 0 0 1 102.5789 136.44989] CT
0.302 GC
N
f-1586420743
f
GR
GS
[1.00215 0 0 1 98.57416 158.46376] CT
0.302 GC
N
f-1586420743
f
GR
GS
[1.00215 0 0 1 91.72728 57.19305] CT
0.302 GC
N
f-1586420743
f
GR
GS
[1.00215 0 0 1 86.28256 120.33548] CT
0.302 GC
N
f-1586420743
f
GR
GS
[1.00215 0 0 1 102.50284 200.2825] CT
0.302 GC
N
f-1586420743
f
GR
GS
[1.00215 0 0 1 99.65439 131.44096] CT
0.302 GC
N
f-1586420743
f
GR
GS
[1.00215 0 0 1 99.87648 52.30856] CT
0.302 GC
N
f-1586420743
f
GR
GS
[1.00215 0 0 1 98.21548 142.53169] CT
0.302 GC
N
f-1586420743
f
GR
GS
[1.00215 0 0 1 86.80198 181.73753] CT
0.302 GC
N
f-1586420743
f
GR
GS
[1.00215 0 0 1 86.28583 120.79632] CT
0.302 GC
N
f-1586420743
f
GR
GS
[1.00215 0 0 1 99.12177 140.31534] CT
0.302 GC
N
f-1586420743
f
GR
GS
[1.00215 0 0 1 85.76486 32] CT
0.302 GC
N
f-1586420743
f
GR
GS
[1.00215 0 0 1 92.90237 41.32011] CT
0.302 GC
N
f-1586420743
f
GR
GS
[1.00215 0 0 1 92.93074 139.13133] CT
0.302 GC
N
f-1586420743
f
GR
GS
[1.00215 0 0 1 91.65133 54.22735] CT
0.302 GC
N
f-1586420743
f
GR
GS
[1.00215 0 0 1 100.36103 51.59268] CT
0.302 GC
N
f-1586420743
f
GR
GS
[1.00215 0 0 1 90.9468 52.05879] CT
0.302 GC
N
f-1586420743
f
GR
GS
[1.00215 0 0 1 92.8919 122.98233] CT
0.302 GC
N
f-1586420743
f
GR
GS
[1.00215 0 0 1 96.76035 115.64884] CT
0.302 GC
N
f-1586420743
f
GR
GS
[1.00215 0 0 1 93.96347 120.85452] CT
0.302 GC
N
f-1586420743
f
GR
GS
[1.00215 0 0 1 90.10256 104.10783] CT
0.302 GC
N
f-1586420743
f
GR
GS
[1.00215 0 0 1 0 0] CT
1 0.6 0.6 RC
N
/f1855338766{161.71 167.654 M
161.71 134.007 L
122.19 134.007 L
122.19 167.654 L
cp}def
f1855338766
f
GR
GS
[1.00215 0 0 1 133.0158 163.88014] CT
0.302 GC
N
f-1586420743
f
GR
GS
[1.00215 0 0 1 141.59321 152.74043] CT
0.302 GC
N
f-1586420743
f
GR
GS
[1.00215 0 0 1 139.07644 128.92734] CT
0.302 GC
N
f-1586420743
f
GR
GS
[1.00215 0 0 1 136.8615 171.90707] CT
0.302 GC
N
f-1586420743
f
GR
GS
[1.00215 0 0 1 151.93454 107.45923] CT
0.302 GC
N
f-1586420743
f
GR
GS
[1.00215 0 0 1 150.26148 145.69478] CT
0.302 GC
N
f-1586420743
f
GR
GS
[1.00215 0 0 1 136.58897 199.68155] CT
0.302 GC
N
f-1586420743
f
GR
GS
[1.00215 0 0 1 139.62871 145.31348] CT
0.302 GC
N
f-1586420743
f
GR
GS
[1.00215 0 0 1 137.37632 196.12691] CT
0.302 GC
N
f-1586420743
f
GR
GS
[1.00215 0 0 1 139.55937 165.13162] CT
0.302 GC
N
f-1586420743
f
GR
GS
[1.00215 0 0 1 135.60614 150.15848] CT
0.302 GC
N
f-1586420743
f
GR
GS
[1.00215 0 0 1 145.48533 186.86992] CT
0.302 GC
N
f-1586420743
f
GR
GS
[1.00215 0 0 1 150.02771 145.93515] CT
0.302 GC
N
f-1586420743
f
GR
GS
[1.00215 0 0 1 136.38862 168.34328] CT
0.302 GC
N
f-1586420743
f
GR
GS
[1.00215 0 0 1 133.1733 120.28924] CT
0.302 GC
N
f-1586420743
f
GR
GS
[1.00215 0 0 1 149.47347 126.83361] CT
0.302 GC
N
f-1586420743
f
GR
GS
[1.00215 0 0 1 139.15828 101.75643] CT
0.302 GC
N
f-1586420743
f
GR
GS
[1.00215 0 0 1 145.90399 107.70309] CT
0.302 GC
N
f-1586420743
f
GR
GS
[1.00215 0 0 1 135.61262 130.95906] CT
0.302 GC
N
f-1586420743
f
GR
GS
[1.00215 0 0 1 148.49735 169.62981] CT
0.302 GC
N
f-1586420743
f
GR
GS
[1.00215 0 0 1 146.71191 99.3869] CT
0.302 GC
N
f-1586420743
f
GR
GS
[1.00215 0 0 1 132.7995 120.34758] CT
0.302 GC
N
f-1586420743
f
GR
GS
[1.00215 0 0 1 132.49029 147.24141] CT
0.302 GC
N
f-1586420743
f
GR
GS
[1.00215 0 0 1 132.95226 144.06474] CT
0.302 GC
N
f-1586420743
f
GR
GS
[1.00215 0 0 1 133.46624 111.7762] CT
0.302 GC
N
f-1586420743
f
GR
GS
[1.00215 0 0 1 143.78192 121.21568] CT
0.302 GC
N
f-1586420743
f
GR
GS
[1.00215 0 0 1 143.90721 68.30373] CT
0.302 GC
N
f-1586420743
f
GR
GS
[1.00215 0 0 1 136.91364 153.7749] CT
0.302 GC
N
f-1586420743
f
GR
GS
[1.00215 0 0 1 132.36616 141.39977] CT
0.302 GC
N
f-1586420743
f
GR
GS
[1.00215 0 0 1 150.5994 116.84936] CT
0.302 GC
N
f-1586420743
f
GR
GS
[1.00215 0 0 1 142.71685 67.06693] CT
0.302 GC
N
f-1586420743
f
GR
GS
[1.00215 0 0 1 139.57661 52.35012] CT
0.302 GC
N
f-1586420743
f
GR
GS
[1.00215 0 0 1 136.73013 128.11192] CT
0.302 GC
N
f-1586420743
f
GR
GS
[1.00215 0 0 1 141.64649 123.57847] CT
0.302 GC
N
f-1586420743
f
GR
GS
[1.00215 0 0 1 149.11625 152.65244] CT
0.302 GC
N
f-1586420743
f
GR
GS
[1.00215 0 0 1 132.45317 170.32533] CT
0.302 GC
N
f-1586420743
f
GR
GS
[1.00215 0 0 1 149.22771 66.17348] CT
0.302 GC
N
f-1586420743
f
GR
GS
[1.00215 0 0 1 135.6863 119.26868] CT
0.302 GC
N
f-1586420743
f
GR
GS
[1.00215 0 0 1 136.12491 178.68938] CT
0.302 GC
N
f-1586420743
f
GR
GS
[1.00215 0 0 1 149.94519 116.71651] CT
0.302 GC
N
f-1586420743
f
GR
GS
[1.00215 0 0 1 150.36697 150.20938] CT
0.302 GC
N
f-1586420743
f
GR
GS
[1.00215 0 0 1 145.6871 125.60492] CT
0.302 GC
N
f-1586420743
f
GR
GS
[1.00215 0 0 1 137.41943 109.73971] CT
0.302 GC
N
f-1586420743
f
GR
GS
[1.00215 0 0 1 151.64067 113.46037] CT
0.302 GC
N
f-1586420743
f
GR
GS
[1.00215 0 0 1 143.29966 141.73553] CT
0.302 GC
N
f-1586420743
f
GR
GS
[1.00215 0 0 1 143.21384 136.73901] CT
0.302 GC
N
f-1586420743
f
GR
GS
[1.00215 0 0 1 143.25959 75.64718] CT
0.302 GC
N
f-1586420743
f
GR
GS
[1.00215 0 0 1 147.47791 130.10609] CT
0.302 GC
N
f-1586420743
f
GR
GS
[1.00215 0 0 1 139.2411 181.98566] CT
0.302 GC
N
f-1586420743
f
GR
GS
[1.00215 0 0 1 133.9421 87.92106] CT
0.302 GC
N
f-1586420743
f
GR
GS
[1.00215 0 0 1 143.54333 173.03925] CT
0.302 GC
N
f-1586420743
f
GR
GS
[1.00215 0 0 1 133.07066 158.85623] CT
0.302 GC
N
f-1586420743
f
GR
GS
[1.00215 0 0 1 140.52719 132.71754] CT
0.302 GC
N
f-1586420743
f
GR
%%Trailer
%%Pages: 1
%%EOF
