%!PS-Adobe-3.0 EPSF-3.0
%%Creator: (MATLAB, The Mathworks, Inc. Version 9.8.0.1323502 \(R2020a\). Operating System: Mac OS X)
%%Title: /Users/kosciessa/Desktop/mntTardisLNDG/LNDG/stateswitch/stsw_multimodal/figures/linearbyage/linearcomp_betaslope.eps
%%CreationDate: 2022-03-03T16:32:28
%%Pages: (atend)
%%BoundingBox:     4     0   180   275
%%LanguageLevel: 3
%%EndComments
%%BeginProlog
%%BeginResource: procset (Apache XML Graphics Std ProcSet) 1.2 0
%%Version: 1.2 0
%%Copyright: (Copyright 2001-2003,2010 The Apache Software Foundation. License terms: http://www.apache.org/licenses/LICENSE-2.0)
/bd{bind def}bind def
/ld{load def}bd
/GR/grestore ld
/GS/gsave ld
/RM/rmoveto ld
/C/curveto ld
/t/show ld
/L/lineto ld
/ML/setmiterlimit ld
/CT/concat ld
/f/fill ld
/N/newpath ld
/S/stroke ld
/CC/setcmykcolor ld
/A/ashow ld
/cp/closepath ld
/RC/setrgbcolor ld
/LJ/setlinejoin ld
/GC/setgray ld
/LW/setlinewidth ld
/M/moveto ld
/re {4 2 roll M
1 index 0 rlineto
0 exch rlineto
neg 0 rlineto
cp } bd
/_ctm matrix def
/_tm matrix def
/BT { _ctm currentmatrix pop matrix _tm copy pop 0 0 moveto } bd
/ET { _ctm setmatrix } bd
/iTm { _ctm setmatrix _tm concat } bd
/Tm { _tm astore pop iTm 0 0 moveto } bd
/ux 0.0 def
/uy 0.0 def
/F {
  /Tp exch def
  /Tf exch def
  Tf findfont Tp scalefont setfont
  /cf Tf def  /cs Tp def
} bd
/ULS {currentpoint /uy exch def /ux exch def} bd
/ULE {
  /Tcx currentpoint pop def
  gsave
  newpath
  cf findfont cs scalefont dup
  /FontMatrix get 0 get /Ts exch def /FontInfo get dup
  /UnderlinePosition get Ts mul /To exch def
  /UnderlineThickness get Ts mul /Tt exch def
  ux uy To add moveto  Tcx uy To add lineto
  Tt setlinewidth stroke
  grestore
} bd
/OLE {
  /Tcx currentpoint pop def
  gsave
  newpath
  cf findfont cs scalefont dup
  /FontMatrix get 0 get /Ts exch def /FontInfo get dup
  /UnderlinePosition get Ts mul /To exch def
  /UnderlineThickness get Ts mul /Tt exch def
  ux uy To add cs add moveto Tcx uy To add cs add lineto
  Tt setlinewidth stroke
  grestore
} bd
/SOE {
  /Tcx currentpoint pop def
  gsave
  newpath
  cf findfont cs scalefont dup
  /FontMatrix get 0 get /Ts exch def /FontInfo get dup
  /UnderlinePosition get Ts mul /To exch def
  /UnderlineThickness get Ts mul /Tt exch def
  ux uy To add cs 10 mul 26 idiv add moveto Tcx uy To add cs 10 mul 26 idiv add lineto
  Tt setlinewidth stroke
  grestore
} bd
/QT {
/Y22 exch store
/X22 exch store
/Y21 exch store
/X21 exch store
currentpoint
/Y21 load 2 mul add 3 div exch
/X21 load 2 mul add 3 div exch
/X21 load 2 mul /X22 load add 3 div
/Y21 load 2 mul /Y22 load add 3 div
/X22 load /Y22 load curveto
} bd
/SSPD {
dup length /d exch dict def
{
/v exch def
/k exch def
currentpagedevice k known {
/cpdv currentpagedevice k get def
v cpdv ne {
/upd false def
/nullv v type /nulltype eq def
/nullcpdv cpdv type /nulltype eq def
nullv nullcpdv or
{
/upd true def
} {
/sametype v type cpdv type eq def
sametype {
v type /arraytype eq {
/vlen v length def
/cpdvlen cpdv length def
vlen cpdvlen eq {
0 1 vlen 1 sub {
/i exch def
/obj v i get def
/cpdobj cpdv i get def
obj cpdobj ne {
/upd true def
exit
} if
} for
} {
/upd true def
} ifelse
} {
v type /dicttype eq {
v {
/dv exch def
/dk exch def
/cpddv cpdv dk get def
dv cpddv ne {
/upd true def
exit
} if
} forall
} {
/upd true def
} ifelse
} ifelse
} if
} ifelse
upd true eq {
d k v put
} if
} if
} if
} forall
d length 0 gt {
d setpagedevice
} if
} bd
/RE { % /NewFontName [NewEncodingArray] /FontName RE -
  findfont dup length dict begin
  {
    1 index /FID ne
    {def} {pop pop} ifelse
  } forall
  /Encoding exch def
  /FontName 1 index def
  currentdict definefont pop
  end
} bind def
%%EndResource
%%BeginResource: procset (Apache XML Graphics EPS ProcSet) 1.0 0
%%Version: 1.0 0
%%Copyright: (Copyright 2002-2003 The Apache Software Foundation. License terms: http://www.apache.org/licenses/LICENSE-2.0)
/BeginEPSF { %def
/b4_Inc_state save def         % Save state for cleanup
/dict_count countdictstack def % Count objects on dict stack
/op_count count 1 sub def      % Count objects on operand stack
userdict begin                 % Push userdict on dict stack
/showpage { } def              % Redefine showpage, { } = null proc
0 setgray 0 setlinecap         % Prepare graphics state
1 setlinewidth 0 setlinejoin
10 setmiterlimit [ ] 0 setdash newpath
/languagelevel where           % If level not equal to 1 then
{pop languagelevel             % set strokeadjust and
1 ne                           % overprint to their defaults.
{false setstrokeadjust false setoverprint
} if
} if
} bd
/EndEPSF { %def
count op_count sub {pop} repeat            % Clean up stacks
countdictstack dict_count sub {end} repeat
b4_Inc_state restore
} bd
%%EndResource
%FOPBeginFontDict
%%IncludeResource: font Courier-Oblique
%%IncludeResource: font Courier-BoldOblique
%%IncludeResource: font Courier-Bold
%%IncludeResource: font ZapfDingbats
%%IncludeResource: font Symbol
%%IncludeResource: font Helvetica
%%IncludeResource: font Helvetica-Oblique
%%IncludeResource: font Helvetica-Bold
%%IncludeResource: font Helvetica-BoldOblique
%%IncludeResource: font Times-Roman
%%IncludeResource: font Times-Italic
%%IncludeResource: font Times-Bold
%%IncludeResource: font Times-BoldItalic
%%IncludeResource: font Courier
%FOPEndFontDict
%%BeginResource: encoding WinAnsiEncoding
/WinAnsiEncoding [
/.notdef /.notdef /.notdef /.notdef /.notdef
/.notdef /.notdef /.notdef /.notdef /.notdef
/.notdef /.notdef /.notdef /.notdef /.notdef
/.notdef /.notdef /.notdef /.notdef /.notdef
/.notdef /.notdef /.notdef /.notdef /.notdef
/.notdef /.notdef /.notdef /.notdef /.notdef
/.notdef /.notdef /space /exclam /quotedbl
/numbersign /dollar /percent /ampersand /quotesingle
/parenleft /parenright /asterisk /plus /comma
/hyphen /period /slash /zero /one
/two /three /four /five /six
/seven /eight /nine /colon /semicolon
/less /equal /greater /question /at
/A /B /C /D /E
/F /G /H /I /J
/K /L /M /N /O
/P /Q /R /S /T
/U /V /W /X /Y
/Z /bracketleft /backslash /bracketright /asciicircum
/underscore /quoteleft /a /b /c
/d /e /f /g /h
/i /j /k /l /m
/n /o /p /q /r
/s /t /u /v /w
/x /y /z /braceleft /bar
/braceright /asciitilde /bullet /Euro /bullet
/quotesinglbase /florin /quotedblbase /ellipsis /dagger
/daggerdbl /circumflex /perthousand /Scaron /guilsinglleft
/OE /bullet /Zcaron /bullet /bullet
/quoteleft /quoteright /quotedblleft /quotedblright /bullet
/endash /emdash /asciitilde /trademark /scaron
/guilsinglright /oe /bullet /zcaron /Ydieresis
/space /exclamdown /cent /sterling /currency
/yen /brokenbar /section /dieresis /copyright
/ordfeminine /guillemotleft /logicalnot /sfthyphen /registered
/macron /degree /plusminus /twosuperior /threesuperior
/acute /mu /paragraph /middot /cedilla
/onesuperior /ordmasculine /guillemotright /onequarter /onehalf
/threequarters /questiondown /Agrave /Aacute /Acircumflex
/Atilde /Adieresis /Aring /AE /Ccedilla
/Egrave /Eacute /Ecircumflex /Edieresis /Igrave
/Iacute /Icircumflex /Idieresis /Eth /Ntilde
/Ograve /Oacute /Ocircumflex /Otilde /Odieresis
/multiply /Oslash /Ugrave /Uacute /Ucircumflex
/Udieresis /Yacute /Thorn /germandbls /agrave
/aacute /acircumflex /atilde /adieresis /aring
/ae /ccedilla /egrave /eacute /ecircumflex
/edieresis /igrave /iacute /icircumflex /idieresis
/eth /ntilde /ograve /oacute /ocircumflex
/otilde /odieresis /divide /oslash /ugrave
/uacute /ucircumflex /udieresis /yacute /thorn
/ydieresis
] def
%%EndResource
%FOPBeginFontReencode
/Courier-Oblique findfont
dup length dict begin
  {1 index /FID ne {def} {pop pop} ifelse} forall
  /Encoding WinAnsiEncoding def
  currentdict
end
/Courier-Oblique exch definefont pop
/Courier-BoldOblique findfont
dup length dict begin
  {1 index /FID ne {def} {pop pop} ifelse} forall
  /Encoding WinAnsiEncoding def
  currentdict
end
/Courier-BoldOblique exch definefont pop
/Courier-Bold findfont
dup length dict begin
  {1 index /FID ne {def} {pop pop} ifelse} forall
  /Encoding WinAnsiEncoding def
  currentdict
end
/Courier-Bold exch definefont pop
/Helvetica findfont
dup length dict begin
  {1 index /FID ne {def} {pop pop} ifelse} forall
  /Encoding WinAnsiEncoding def
  currentdict
end
/Helvetica exch definefont pop
/Helvetica-Oblique findfont
dup length dict begin
  {1 index /FID ne {def} {pop pop} ifelse} forall
  /Encoding WinAnsiEncoding def
  currentdict
end
/Helvetica-Oblique exch definefont pop
/Helvetica-Bold findfont
dup length dict begin
  {1 index /FID ne {def} {pop pop} ifelse} forall
  /Encoding WinAnsiEncoding def
  currentdict
end
/Helvetica-Bold exch definefont pop
/Helvetica-BoldOblique findfont
dup length dict begin
  {1 index /FID ne {def} {pop pop} ifelse} forall
  /Encoding WinAnsiEncoding def
  currentdict
end
/Helvetica-BoldOblique exch definefont pop
/Times-Roman findfont
dup length dict begin
  {1 index /FID ne {def} {pop pop} ifelse} forall
  /Encoding WinAnsiEncoding def
  currentdict
end
/Times-Roman exch definefont pop
/Times-Italic findfont
dup length dict begin
  {1 index /FID ne {def} {pop pop} ifelse} forall
  /Encoding WinAnsiEncoding def
  currentdict
end
/Times-Italic exch definefont pop
/Times-Bold findfont
dup length dict begin
  {1 index /FID ne {def} {pop pop} ifelse} forall
  /Encoding WinAnsiEncoding def
  currentdict
end
/Times-Bold exch definefont pop
/Times-BoldItalic findfont
dup length dict begin
  {1 index /FID ne {def} {pop pop} ifelse} forall
  /Encoding WinAnsiEncoding def
  currentdict
end
/Times-BoldItalic exch definefont pop
/Courier findfont
dup length dict begin
  {1 index /FID ne {def} {pop pop} ifelse} forall
  /Encoding WinAnsiEncoding def
  currentdict
end
/Courier exch definefont pop
%FOPEndFontReencode
%%EndProlog
%%Page: 1 1
%%PageBoundingBox: 0 0 198 283
%%BeginPageSetup
[1 0 0 -1 0 283] CT
%%EndPageSetup
GS
[1.00215 0 0 1 0 0] CT
1 GC
N
0 0 198 283 re
f
GR
GS
[1.00215 0 0 1 0 0] CT
1 GC
N
0 0 198 283 re
f
GR
GS
[1.00215 0 0 1 0 0] CT
1 GC
N
80 228 M
179 228 L
179 32 L
80 32 L
cp
f
GR
GS
[1.00215 0 0 1 0 0] CT
0.149 GC
2 setlinecap
1 LJ
0.5 LW
N
80 228 M
179 228 L
S
GR
GS
[1.00215 0 0 1 0 0] CT
0.149 GC
2 setlinecap
1 LJ
0.5 LW
N
109.7 228 M
109.7 226.04 L
S
GR
GS
[1.00215 0 0 1 0 0] CT
0.149 GC
2 setlinecap
1 LJ
0.5 LW
N
149.3 228 M
149.3 226.04 L
S
GR
GS
[1.00215 0 0 1 109.93558 234] CT
0.149 GC
/Helvetica 20 F
GS
[1 0 0 1 0 0] CT
-13 20 moveto 
1 -1 scale
(YA) t 
GR
GR
GS
[1.00215 0 0 1 149.62062 234] CT
0.149 GC
/Helvetica 20 F
GS
[1 0 0 1 0 0] CT
-14.5 20 moveto 
1 -1 scale
(OA) t 
GR
GR
GS
[1.00215 0 0 1 129.77814 259] CT
0.149 GC
/Helvetica 20 F
GS
[1 0 0 1 0 0] CT
-49 20 moveto 
1 -1 scale
(Age Group) t 
GR
GR
GS
[1.00215 0 0 1 0 0] CT
0.149 GC
2 setlinecap
1 LJ
0.5 LW
N
80 228 M
80 32 L
S
GR
GS
[1.00215 0 0 1 0 0] CT
0.149 GC
2 setlinecap
1 LJ
0.5 LW
N
80 228 M
81.96 228 L
S
GR
GS
[1.00215 0 0 1 0 0] CT
0.149 GC
2 setlinecap
1 LJ
0.5 LW
N
80 149.6 M
81.96 149.6 L
S
GR
GS
[1.00215 0 0 1 0 0] CT
0.149 GC
2 setlinecap
1 LJ
0.5 LW
N
80 71.2 M
81.96 71.2 L
S
GR
GS
[1.00215 0 0 1 74.15891 228] CT
0.149 GC
/Helvetica 20 F
GS
[1 0 0 1 0 0] CT
-47 7.5 moveto 
1 -1 scale
(-0.02) t 
GR
GR
GS
[1.00215 0 0 1 74.15891 149.60001] CT
0.149 GC
/Helvetica 20 F
GS
[1 0 0 1 0 0] CT
-12 7.5 moveto 
1 -1 scale
(0) t 
GR
GR
GS
[1.00215 0 0 1 74.15891 71.2] CT
0.149 GC
/Helvetica 20 F
GS
[1 0 0 1 0 0] CT
-39 7.5 moveto 
1 -1 scale
(0.02) t 
GR
GR
GS
[0 -1 1.00215 0 24.05154 129.99991] CT
0.149 GC
/Helvetica 20 F
GS
[1 0 0 1 0 0] CT
-71 -5 moveto 
1 -1 scale
(betaslope linear) t 
GR
GR
GS
[1.00215 0 0 1 129.77822 29.25001] CT
/Helvetica-Bold 22 F
GS
[1 0 0 1 0 0] CT
-41 -5 moveto 
1 -1 scale
(p = 0.49) t 
GR
GR
GS
[1.00215 0 0 1 0 0] CT
0.149 GC
1 LJ
0.5 LW
N
80 149.6 M
179 149.6 L
S
GR
GS
[1.00215 0 0 1 0 0] CT
1 0.6 0.6 RC
N
125.54 149.6 M
125.54 130.275 L
93.86 130.275 L
93.86 149.6 L
cp
f
GR
GS
[1.00215 0 0 1 117.51916 100.94374] CT
0.302 GC
N
2.236 0 M
2.236 -1.235 1.235 -2.236 0 -2.236 C
-1.235 -2.236 -2.236 -1.235 -2.236 0 C
-2.236 1.235 -1.235 2.236 0 2.236 C
1.235 2.236 2.236 1.235 2.236 0 C
cp
f
GR
GS
[1.00215 0 0 1 115.38598 147.49783] CT
0.302 GC
N
/f-1586420743{2.236 0 M
2.236 -1.235 1.235 -2.236 0 -2.236 C
-1.235 -2.236 -2.236 -1.235 -2.236 0 C
-2.236 1.235 -1.235 2.236 0 2.236 C
1.235 2.236 2.236 1.235 2.236 0 C
cp}def
f-1586420743
f
GR
GS
[1.00215 0 0 1 114.87919 89.58034] CT
0.302 GC
N
f-1586420743
f
GR
GS
[1.00215 0 0 1 109.23834 154.8317] CT
0.302 GC
N
f-1586420743
f
GR
GS
[1.00215 0 0 1 110.04886 129.4735] CT
0.302 GC
N
f-1586420743
f
GR
GS
[1.00215 0 0 1 107.80166 75.70463] CT
0.302 GC
N
f-1586420743
f
GR
GS
[1.00215 0 0 1 110.05155 134.74292] CT
0.302 GC
N
f-1586420743
f
GR
GS
[1.00215 0 0 1 106.61472 124.22366] CT
0.302 GC
N
f-1586420743
f
GR
GS
[1.00215 0 0 1 107.07115 97.54886] CT
0.302 GC
N
f-1586420743
f
GR
GS
[1.00215 0 0 1 103.45123 140.70438] CT
0.302 GC
N
f-1586420743
f
GR
GS
[1.00215 0 0 1 111.10659 123.37013] CT
0.302 GC
N
f-1586420743
f
GR
GS
[1.00215 0 0 1 106.10697 115.13534] CT
0.302 GC
N
f-1586420743
f
GR
GS
[1.00215 0 0 1 113.39966 148.3627] CT
0.302 GC
N
f-1586420743
f
GR
GS
[1.00215 0 0 1 108.8869 123.01074] CT
0.302 GC
N
f-1586420743
f
GR
GS
[1.00215 0 0 1 114.38574 108.23928] CT
0.302 GC
N
f-1586420743
f
GR
GS
[1.00215 0 0 1 108.01668 108.7375] CT
0.302 GC
N
f-1586420743
f
GR
GS
[1.00215 0 0 1 109.10439 173.09924] CT
0.302 GC
N
f-1586420743
f
GR
GS
[1.00215 0 0 1 108.69165 113.59093] CT
0.302 GC
N
f-1586420743
f
GR
GS
[1.00215 0 0 1 117.73062 168.51782] CT
0.302 GC
N
f-1586420743
f
GR
GS
[1.00215 0 0 1 102.12532 150.43442] CT
0.302 GC
N
f-1586420743
f
GR
GS
[1.00215 0 0 1 113.11887 114.37492] CT
0.302 GC
N
f-1586420743
f
GR
GS
[1.00215 0 0 1 117.3536 105.15257] CT
0.302 GC
N
f-1586420743
f
GR
GS
[1.00215 0 0 1 102.04434 111.00524] CT
0.302 GC
N
f-1586420743
f
GR
GS
[1.00215 0 0 1 111.49796 174.56921] CT
0.302 GC
N
f-1586420743
f
GR
GS
[1.00215 0 0 1 115.09767 136.97975] CT
0.302 GC
N
f-1586420743
f
GR
GS
[1.00215 0 0 1 108.91764 130.75987] CT
0.302 GC
N
f-1586420743
f
GR
GS
[1.00215 0 0 1 112.25493 122.61363] CT
0.302 GC
N
f-1586420743
f
GR
GS
[1.00215 0 0 1 117.45005 130.6199] CT
0.302 GC
N
f-1586420743
f
GR
GS
[1.00215 0 0 1 112.63584 86.58695] CT
0.302 GC
N
f-1586420743
f
GR
GS
[1.00215 0 0 1 107.08061 75.70463] CT
0.302 GC
N
f-1586420743
f
GR
GS
[1.00215 0 0 1 110.28651 170.3049] CT
0.302 GC
N
f-1586420743
f
GR
GS
[1.00215 0 0 1 107.50368 102.05941] CT
0.302 GC
N
f-1586420743
f
GR
GS
[1.00215 0 0 1 108.97718 168.66151] CT
0.302 GC
N
f-1586420743
f
GR
GS
[1.00215 0 0 1 112.78148 126.70479] CT
0.302 GC
N
f-1586420743
f
GR
GS
[1.00215 0 0 1 115.07787 184.99718] CT
0.302 GC
N
f-1586420743
f
GR
GS
[1.00215 0 0 1 112.36694 103.31613] CT
0.302 GC
N
f-1586420743
f
GR
GS
[1.00215 0 0 1 103.41763 117.89078] CT
0.302 GC
N
f-1586420743
f
GR
GS
[1.00215 0 0 1 112.73229 175.31386] CT
0.302 GC
N
f-1586420743
f
GR
GS
[1.00215 0 0 1 104.62879 136.34563] CT
0.302 GC
N
f-1586420743
f
GR
GS
[1.00215 0 0 1 106.99204 203.81248] CT
0.302 GC
N
f-1586420743
f
GR
GS
[1.00215 0 0 1 105.3705 103.08849] CT
0.302 GC
N
f-1586420743
f
GR
GS
[1.00215 0 0 1 110.60506 162.93655] CT
0.302 GC
N
f-1586420743
f
GR
GS
[1.00215 0 0 1 0 0] CT
1 0.6 0.6 RC
N
/f-937167858{165.14 149.6 M
165.14 135.756 L
133.46 135.756 L
133.46 149.6 L
cp}def
f-937167858
f
GR
GS
[1.00215 0 0 1 146.30338 145.22566] CT
0.302 GC
N
f-1586420743
f
GR
GS
[1.00215 0 0 1 152.55997 142.18895] CT
0.302 GC
N
f-1586420743
f
GR
GS
[1.00215 0 0 1 146.63094 64.90931] CT
0.302 GC
N
f-1586420743
f
GR
GS
[1.00215 0 0 1 145.07235 42.39251] CT
0.302 GC
N
f-1586420743
f
GR
GS
[1.00215 0 0 1 148.87502 80.92939] CT
0.302 GC
N
f-1586420743
f
GR
GS
[1.00215 0 0 1 143.93316 178.24147] CT
0.302 GC
N
f-1586420743
f
GR
GS
[1.00215 0 0 1 145.61281 177.89392] CT
0.302 GC
N
f-1586420743
f
GR
GS
[1.00215 0 0 1 147.28921 150.88402] CT
0.302 GC
N
f-1586420743
f
GR
GS
[1.00215 0 0 1 152.56929 127.9339] CT
0.302 GC
N
f-1586420743
f
GR
GS
[1.00215 0 0 1 146.69221 121.46321] CT
0.302 GC
N
f-1586420743
f
GR
GS
[1.00215 0 0 1 143.13183 156.57698] CT
0.302 GC
N
f-1586420743
f
GR
GS
[1.00215 0 0 1 151.62285 142.16838] CT
0.302 GC
N
f-1586420743
f
GR
GS
[1.00215 0 0 1 157.40468 151.57153] CT
0.302 GC
N
f-1586420743
f
GR
GS
[1.00215 0 0 1 154.99516 66.764] CT
0.302 GC
N
f-1586420743
f
GR
GS
[1.00215 0 0 1 142.73878 192.41101] CT
0.302 GC
N
f-1586420743
f
GR
GS
[1.00215 0 0 1 144.68238 179.88255] CT
0.302 GC
N
f-1586420743
f
GR
GS
[1.00215 0 0 1 152.54709 115.19713] CT
0.302 GC
N
f-1586420743
f
GR
GS
[1.00215 0 0 1 142.86839 131.24959] CT
0.302 GC
N
f-1586420743
f
GR
GS
[1.00215 0 0 1 144.28414 169.35738] CT
0.302 GC
N
f-1586420743
f
GR
GS
[1.00215 0 0 1 144.93705 163.4245] CT
0.302 GC
N
f-1586420743
f
GR
GS
[1.00215 0 0 1 144.63616 130.47357] CT
0.302 GC
N
f-1586420743
f
GR
GS
[1.00215 0 0 1 155.05946 146.28116] CT
0.302 GC
N
f-1586420743
f
GR
GS
[1.00215 0 0 1 144.64713 160.26154] CT
0.302 GC
N
f-1586420743
f
GR
GS
[1.00215 0 0 1 153.81736 148.51016] CT
0.302 GC
N
f-1586420743
f
GR
GS
[1.00215 0 0 1 144.32814 74.81771] CT
0.302 GC
N
f-1586420743
f
GR
GS
[1.00215 0 0 1 143.585 120.30493] CT
0.302 GC
N
f-1586420743
f
GR
GS
[1.00215 0 0 1 152.78821 70.06486] CT
0.302 GC
N
f-1586420743
f
GR
GS
[1.00215 0 0 1 152.26313 135.70273] CT
0.302 GC
N
f-1586420743
f
GR
GS
[1.00215 0 0 1 149.7171 77.47382] CT
0.302 GC
N
f-1586420743
f
GR
GS
[1.00215 0 0 1 145.41969 93.95986] CT
0.302 GC
N
f-1586420743
f
GR
GS
[1.00215 0 0 1 152.68422 73.7622] CT
0.302 GC
N
f-1586420743
f
GR
GS
[1.00215 0 0 1 154.61373 144.48799] CT
0.302 GC
N
f-1586420743
f
GR
GS
[1.00215 0 0 1 149.09678 154.50253] CT
0.302 GC
N
f-1586420743
f
GR
GS
[1.00215 0 0 1 149.081 150.48517] CT
0.302 GC
N
f-1586420743
f
GR
GS
[1.00215 0 0 1 149.24616 178.23515] CT
0.302 GC
N
f-1586420743
f
GR
GS
[1.00215 0 0 1 146.93642 95.7293] CT
0.302 GC
N
f-1586420743
f
GR
GS
[1.00215 0 0 1 149.06019 122.11469] CT
0.302 GC
N
f-1586420743
f
GR
GS
[1.00215 0 0 1 145.87075 201.51303] CT
0.302 GC
N
f-1586420743
f
GR
GS
[1.00215 0 0 1 152.01163 203.13829] CT
0.302 GC
N
f-1586420743
f
GR
GS
[1.00215 0 0 1 151.32138 154.64134] CT
0.302 GC
N
f-1586420743
f
GR
GS
[1.00215 0 0 1 148.51371 158.88016] CT
0.302 GC
N
f-1586420743
f
GR
GS
[1.00215 0 0 1 145.99418 157.7739] CT
0.302 GC
N
f-1586420743
f
GR
GS
[1.00215 0 0 1 152.93288 42.39251] CT
0.302 GC
N
f-1586420743
f
GR
GS
[1.00215 0 0 1 145.28498 155.57867] CT
0.302 GC
N
f-1586420743
f
GR
GS
[1.00215 0 0 1 155.34711 116.36793] CT
0.302 GC
N
f-1586420743
f
GR
GS
[1.00215 0 0 1 145.40263 134.87576] CT
0.302 GC
N
f-1586420743
f
GR
GS
[1.00215 0 0 1 150.87968 216.52872] CT
0.302 GC
N
f-1586420743
f
GR
GS
[1.00215 0 0 1 156.82496 226.59711] CT
0.302 GC
N
f-1586420743
f
GR
GS
[1.00215 0 0 1 154.7076 73.61704] CT
0.302 GC
N
f-1586420743
f
GR
GS
[1.00215 0 0 1 150.85233 156.24899] CT
0.302 GC
N
f-1586420743
f
GR
GS
[1.00215 0 0 1 154.72167 115.36467] CT
0.302 GC
N
f-1586420743
f
GR
GS
[1.00215 0 0 1 146.97087 166.14601] CT
0.302 GC
N
f-1586420743
f
GR
GS
[1.00215 0 0 1 152.26684 137.56531] CT
0.302 GC
N
f-1586420743
f
GR
%%Trailer
%%Pages: 1
%%EOF
