%!PS-Adobe-3.0 EPSF-3.0
%%Creator: (MATLAB, The Mathworks, Inc. Version 9.8.0.1323502 \(R2020a\). Operating System: Mac OS X)
%%Title: /Users/kosciessa/Desktop/mntTardisLNDG/LNDG/stateswitch/stsw_multimodal/figures/correlations/f_sampen_fooof.eps
%%CreationDate: 2022-03-11T15:12:20
%%Pages: (atend)
%%BoundingBox:     6     0   241   194
%%LanguageLevel: 3
%%EndComments
%%BeginProlog
%%BeginResource: procset (Apache XML Graphics Std ProcSet) 1.2 0
%%Version: 1.2 0
%%Copyright: (Copyright 2001-2003,2010 The Apache Software Foundation. License terms: http://www.apache.org/licenses/LICENSE-2.0)
/bd{bind def}bind def
/ld{load def}bd
/GR/grestore ld
/GS/gsave ld
/RM/rmoveto ld
/C/curveto ld
/t/show ld
/L/lineto ld
/ML/setmiterlimit ld
/CT/concat ld
/f/fill ld
/N/newpath ld
/S/stroke ld
/CC/setcmykcolor ld
/A/ashow ld
/cp/closepath ld
/RC/setrgbcolor ld
/LJ/setlinejoin ld
/GC/setgray ld
/LW/setlinewidth ld
/M/moveto ld
/re {4 2 roll M
1 index 0 rlineto
0 exch rlineto
neg 0 rlineto
cp } bd
/_ctm matrix def
/_tm matrix def
/BT { _ctm currentmatrix pop matrix _tm copy pop 0 0 moveto } bd
/ET { _ctm setmatrix } bd
/iTm { _ctm setmatrix _tm concat } bd
/Tm { _tm astore pop iTm 0 0 moveto } bd
/ux 0.0 def
/uy 0.0 def
/F {
  /Tp exch def
  /Tf exch def
  Tf findfont Tp scalefont setfont
  /cf Tf def  /cs Tp def
} bd
/ULS {currentpoint /uy exch def /ux exch def} bd
/ULE {
  /Tcx currentpoint pop def
  gsave
  newpath
  cf findfont cs scalefont dup
  /FontMatrix get 0 get /Ts exch def /FontInfo get dup
  /UnderlinePosition get Ts mul /To exch def
  /UnderlineThickness get Ts mul /Tt exch def
  ux uy To add moveto  Tcx uy To add lineto
  Tt setlinewidth stroke
  grestore
} bd
/OLE {
  /Tcx currentpoint pop def
  gsave
  newpath
  cf findfont cs scalefont dup
  /FontMatrix get 0 get /Ts exch def /FontInfo get dup
  /UnderlinePosition get Ts mul /To exch def
  /UnderlineThickness get Ts mul /Tt exch def
  ux uy To add cs add moveto Tcx uy To add cs add lineto
  Tt setlinewidth stroke
  grestore
} bd
/SOE {
  /Tcx currentpoint pop def
  gsave
  newpath
  cf findfont cs scalefont dup
  /FontMatrix get 0 get /Ts exch def /FontInfo get dup
  /UnderlinePosition get Ts mul /To exch def
  /UnderlineThickness get Ts mul /Tt exch def
  ux uy To add cs 10 mul 26 idiv add moveto Tcx uy To add cs 10 mul 26 idiv add lineto
  Tt setlinewidth stroke
  grestore
} bd
/QT {
/Y22 exch store
/X22 exch store
/Y21 exch store
/X21 exch store
currentpoint
/Y21 load 2 mul add 3 div exch
/X21 load 2 mul add 3 div exch
/X21 load 2 mul /X22 load add 3 div
/Y21 load 2 mul /Y22 load add 3 div
/X22 load /Y22 load curveto
} bd
/SSPD {
dup length /d exch dict def
{
/v exch def
/k exch def
currentpagedevice k known {
/cpdv currentpagedevice k get def
v cpdv ne {
/upd false def
/nullv v type /nulltype eq def
/nullcpdv cpdv type /nulltype eq def
nullv nullcpdv or
{
/upd true def
} {
/sametype v type cpdv type eq def
sametype {
v type /arraytype eq {
/vlen v length def
/cpdvlen cpdv length def
vlen cpdvlen eq {
0 1 vlen 1 sub {
/i exch def
/obj v i get def
/cpdobj cpdv i get def
obj cpdobj ne {
/upd true def
exit
} if
} for
} {
/upd true def
} ifelse
} {
v type /dicttype eq {
v {
/dv exch def
/dk exch def
/cpddv cpdv dk get def
dv cpddv ne {
/upd true def
exit
} if
} forall
} {
/upd true def
} ifelse
} ifelse
} if
} ifelse
upd true eq {
d k v put
} if
} if
} if
} forall
d length 0 gt {
d setpagedevice
} if
} bd
/RE { % /NewFontName [NewEncodingArray] /FontName RE -
  findfont dup length dict begin
  {
    1 index /FID ne
    {def} {pop pop} ifelse
  } forall
  /Encoding exch def
  /FontName 1 index def
  currentdict definefont pop
  end
} bind def
%%EndResource
%%BeginResource: procset (Apache XML Graphics EPS ProcSet) 1.0 0
%%Version: 1.0 0
%%Copyright: (Copyright 2002-2003 The Apache Software Foundation. License terms: http://www.apache.org/licenses/LICENSE-2.0)
/BeginEPSF { %def
/b4_Inc_state save def         % Save state for cleanup
/dict_count countdictstack def % Count objects on dict stack
/op_count count 1 sub def      % Count objects on operand stack
userdict begin                 % Push userdict on dict stack
/showpage { } def              % Redefine showpage, { } = null proc
0 setgray 0 setlinecap         % Prepare graphics state
1 setlinewidth 0 setlinejoin
10 setmiterlimit [ ] 0 setdash newpath
/languagelevel where           % If level not equal to 1 then
{pop languagelevel             % set strokeadjust and
1 ne                           % overprint to their defaults.
{false setstrokeadjust false setoverprint
} if
} if
} bd
/EndEPSF { %def
count op_count sub {pop} repeat            % Clean up stacks
countdictstack dict_count sub {end} repeat
b4_Inc_state restore
} bd
%%EndResource
%FOPBeginFontDict
%%IncludeResource: font Courier-Oblique
%%IncludeResource: font Courier-BoldOblique
%%IncludeResource: font Courier-Bold
%%IncludeResource: font ZapfDingbats
%%IncludeResource: font Symbol
%%IncludeResource: font Helvetica
%%IncludeResource: font Helvetica-Oblique
%%IncludeResource: font Helvetica-Bold
%%IncludeResource: font Helvetica-BoldOblique
%%IncludeResource: font Times-Roman
%%IncludeResource: font Times-Italic
%%IncludeResource: font Times-Bold
%%IncludeResource: font Times-BoldItalic
%%IncludeResource: font Courier
%FOPEndFontDict
%%BeginResource: encoding WinAnsiEncoding
/WinAnsiEncoding [
/.notdef /.notdef /.notdef /.notdef /.notdef
/.notdef /.notdef /.notdef /.notdef /.notdef
/.notdef /.notdef /.notdef /.notdef /.notdef
/.notdef /.notdef /.notdef /.notdef /.notdef
/.notdef /.notdef /.notdef /.notdef /.notdef
/.notdef /.notdef /.notdef /.notdef /.notdef
/.notdef /.notdef /space /exclam /quotedbl
/numbersign /dollar /percent /ampersand /quotesingle
/parenleft /parenright /asterisk /plus /comma
/hyphen /period /slash /zero /one
/two /three /four /five /six
/seven /eight /nine /colon /semicolon
/less /equal /greater /question /at
/A /B /C /D /E
/F /G /H /I /J
/K /L /M /N /O
/P /Q /R /S /T
/U /V /W /X /Y
/Z /bracketleft /backslash /bracketright /asciicircum
/underscore /quoteleft /a /b /c
/d /e /f /g /h
/i /j /k /l /m
/n /o /p /q /r
/s /t /u /v /w
/x /y /z /braceleft /bar
/braceright /asciitilde /bullet /Euro /bullet
/quotesinglbase /florin /quotedblbase /ellipsis /dagger
/daggerdbl /circumflex /perthousand /Scaron /guilsinglleft
/OE /bullet /Zcaron /bullet /bullet
/quoteleft /quoteright /quotedblleft /quotedblright /bullet
/endash /emdash /asciitilde /trademark /scaron
/guilsinglright /oe /bullet /zcaron /Ydieresis
/space /exclamdown /cent /sterling /currency
/yen /brokenbar /section /dieresis /copyright
/ordfeminine /guillemotleft /logicalnot /sfthyphen /registered
/macron /degree /plusminus /twosuperior /threesuperior
/acute /mu /paragraph /middot /cedilla
/onesuperior /ordmasculine /guillemotright /onequarter /onehalf
/threequarters /questiondown /Agrave /Aacute /Acircumflex
/Atilde /Adieresis /Aring /AE /Ccedilla
/Egrave /Eacute /Ecircumflex /Edieresis /Igrave
/Iacute /Icircumflex /Idieresis /Eth /Ntilde
/Ograve /Oacute /Ocircumflex /Otilde /Odieresis
/multiply /Oslash /Ugrave /Uacute /Ucircumflex
/Udieresis /Yacute /Thorn /germandbls /agrave
/aacute /acircumflex /atilde /adieresis /aring
/ae /ccedilla /egrave /eacute /ecircumflex
/edieresis /igrave /iacute /icircumflex /idieresis
/eth /ntilde /ograve /oacute /ocircumflex
/otilde /odieresis /divide /oslash /ugrave
/uacute /ucircumflex /udieresis /yacute /thorn
/ydieresis
] def
%%EndResource
%FOPBeginFontReencode
/Courier-Oblique findfont
dup length dict begin
  {1 index /FID ne {def} {pop pop} ifelse} forall
  /Encoding WinAnsiEncoding def
  currentdict
end
/Courier-Oblique exch definefont pop
/Courier-BoldOblique findfont
dup length dict begin
  {1 index /FID ne {def} {pop pop} ifelse} forall
  /Encoding WinAnsiEncoding def
  currentdict
end
/Courier-BoldOblique exch definefont pop
/Courier-Bold findfont
dup length dict begin
  {1 index /FID ne {def} {pop pop} ifelse} forall
  /Encoding WinAnsiEncoding def
  currentdict
end
/Courier-Bold exch definefont pop
/Helvetica findfont
dup length dict begin
  {1 index /FID ne {def} {pop pop} ifelse} forall
  /Encoding WinAnsiEncoding def
  currentdict
end
/Helvetica exch definefont pop
/Helvetica-Oblique findfont
dup length dict begin
  {1 index /FID ne {def} {pop pop} ifelse} forall
  /Encoding WinAnsiEncoding def
  currentdict
end
/Helvetica-Oblique exch definefont pop
/Helvetica-Bold findfont
dup length dict begin
  {1 index /FID ne {def} {pop pop} ifelse} forall
  /Encoding WinAnsiEncoding def
  currentdict
end
/Helvetica-Bold exch definefont pop
/Helvetica-BoldOblique findfont
dup length dict begin
  {1 index /FID ne {def} {pop pop} ifelse} forall
  /Encoding WinAnsiEncoding def
  currentdict
end
/Helvetica-BoldOblique exch definefont pop
/Times-Roman findfont
dup length dict begin
  {1 index /FID ne {def} {pop pop} ifelse} forall
  /Encoding WinAnsiEncoding def
  currentdict
end
/Times-Roman exch definefont pop
/Times-Italic findfont
dup length dict begin
  {1 index /FID ne {def} {pop pop} ifelse} forall
  /Encoding WinAnsiEncoding def
  currentdict
end
/Times-Italic exch definefont pop
/Times-Bold findfont
dup length dict begin
  {1 index /FID ne {def} {pop pop} ifelse} forall
  /Encoding WinAnsiEncoding def
  currentdict
end
/Times-Bold exch definefont pop
/Times-BoldItalic findfont
dup length dict begin
  {1 index /FID ne {def} {pop pop} ifelse} forall
  /Encoding WinAnsiEncoding def
  currentdict
end
/Times-BoldItalic exch definefont pop
/Courier findfont
dup length dict begin
  {1 index /FID ne {def} {pop pop} ifelse} forall
  /Encoding WinAnsiEncoding def
  currentdict
end
/Courier exch definefont pop
%FOPEndFontReencode
%%EndProlog
%%Page: 1 1
%%PageBoundingBox: 0 0 255 198
%%BeginPageSetup
[1 0 0 -1 0 198] CT
%%EndPageSetup
GS
[1.00046 0 0 1.00215 0 -0.4252] CT
1 GC
N
0 0 255 198 re
f
GR
GS
[1.00046 0 0 1.00215 0 -0.4252] CT
1 GC
N
0 0 255 198 re
f
GR
GS
[1.00046 0 0 1.00215 0 -0.4252] CT
0.2 GC
N
74.5 143 M
231.5 143 L
231.5 21 L
74.5 21 L
cp
f
GR
GS
[1.00046 0 0 1.00215 0 -0.4252] CT
0.149 GC
2 setlinecap
1 LJ
0.5 LW
N
74.5 143 M
231.5 143 L
S
GR
GS
[1.00046 0 0 1.00215 0 -0.4252] CT
0.149 GC
2 setlinecap
1 LJ
0.5 LW
N
74.5 143 M
74.5 141.43 L
S
GR
GS
[1.00046 0 0 1.00215 0 -0.4252] CT
0.149 GC
2 setlinecap
1 LJ
0.5 LW
N
126.833 143 M
126.833 141.43 L
S
GR
GS
[1.00046 0 0 1.00215 0 -0.4252] CT
0.149 GC
2 setlinecap
1 LJ
0.5 LW
N
179.167 143 M
179.167 141.43 L
S
GR
GS
[1.00046 0 0 1.00215 0 -0.4252] CT
0.149 GC
2 setlinecap
1 LJ
0.5 LW
N
231.5 143 M
231.5 141.43 L
S
GR
GS
[1.00046 0 0 1.00215 74.5345 147.6922] CT
0.149 GC
/Helvetica 14 F
GS
[1 0 0 1 0 0] CT
-12.5 14 moveto 
1 -1 scale
(-0.1) t 
GR
GR
GS
[1.00046 0 0 1.00215 126.89208 147.6922] CT
0.149 GC
/Helvetica 14 F
GS
[1 0 0 1 0 0] CT
-4 14 moveto 
1 -1 scale
(0) t 
GR
GR
GS
[1.00046 0 0 1.00215 179.24965 147.6922] CT
0.149 GC
/Helvetica 14 F
GS
[1 0 0 1 0 0] CT
-10 14 moveto 
1 -1 scale
(0.1) t 
GR
GR
GS
[1.00046 0 0 1.00215 231.60722 147.6922] CT
0.149 GC
/Helvetica 14 F
GS
[1 0 0 1 0 0] CT
-10 14 moveto 
1 -1 scale
(0.2) t 
GR
GR
GS
[1.00046 0 0 1.00215 153.07094 165.22978] CT
0.149 GC
/Helvetica 14 F
GS
[1 0 0 1 0 0] CT
-26 14 moveto 
1 -1 scale
(fooof bs) t 
GR
GR
GS
[1.00046 0 0 1.00215 153.07094 165.22978] CT
0.149 GC
/Helvetica 14 F
GS
[1 0 0 1 0 0] CT
-57.5 31 moveto 
1 -1 scale
(\(linear modulation\)) t 
GR
GR
GS
[1.00046 0 0 1.00215 0 -0.4252] CT
0.149 GC
2 setlinecap
1 LJ
0.5 LW
N
74.5 143 M
74.5 21 L
S
GR
GS
[1.00046 0 0 1.00215 0 -0.4252] CT
0.149 GC
2 setlinecap
1 LJ
0.5 LW
N
74.5 117.905 M
76.07 117.905 L
S
GR
GS
[1.00046 0 0 1.00215 0 -0.4252] CT
0.149 GC
2 setlinecap
1 LJ
0.5 LW
N
74.5 86.968 M
76.07 86.968 L
S
GR
GS
[1.00046 0 0 1.00215 0 -0.4252] CT
0.149 GC
2 setlinecap
1 LJ
0.5 LW
N
74.5 56.031 M
76.07 56.031 L
S
GR
GS
[1.00046 0 0 1.00215 0 -0.4252] CT
0.149 GC
2 setlinecap
1 LJ
0.5 LW
N
74.5 25.095 M
76.07 25.095 L
S
GR
GS
[1.00046 0 0 1.00215 69.73228 117.73314] CT
0.149 GC
/Helvetica 14 F
GS
[1 0 0 1 0 0] CT
-33 5.5 moveto 
1 -1 scale
(-0.02) t 
GR
GR
GS
[1.00046 0 0 1.00215 69.73228 86.72986] CT
0.149 GC
/Helvetica 14 F
GS
[1 0 0 1 0 0] CT
-8 5.5 moveto 
1 -1 scale
(0) t 
GR
GR
GS
[1.00046 0 0 1.00215 69.73228 55.72658] CT
0.149 GC
/Helvetica 14 F
GS
[1 0 0 1 0 0] CT
-28 5.5 moveto 
1 -1 scale
(0.02) t 
GR
GR
GS
[1.00046 0 0 1.00215 69.73228 24.72329] CT
0.149 GC
/Helvetica 14 F
GS
[1 0 0 1 0 0] CT
-28 5.5 moveto 
1 -1 scale
(0.04) t 
GR
GR
GS
[0 -1.00215 1.00046 0 33.71561 81.75084] CT
0.149 GC
/Helvetica 14 F
GS
[1 0 0 1 0 0] CT
-25.5 -20 moveto 
1 -1 scale
(sampen) t 
GR
GR
GS
[0 -1.00215 1.00046 0 33.71561 81.75084] CT
0.149 GC
/Helvetica 14 F
GS
[1 0 0 1 0 0] CT
-57.5 -3 moveto 
1 -1 scale
(\(linear modulation\)) t 
GR
GR
GS
[1.00046 0 0 1.00215 153.07101 18.86614] CT
/Helvetica-Bold 14 F
GS
[1 0 0 1 0 0] CT
-59.5 -4 moveto 
1 -1 scale
(r = 0.6 p = 1.1e-10) t 
GR
GR
GS
[1.00046 0 0 1.00215 116.04459 131.85707] CT
0.8 0.502 0.502 RC
N
0.5 0 M
0.5 -0.276 0.276 -0.5 0 -0.5 C
-0.276 -0.5 -0.5 -0.276 -0.5 0 C
-0.5 0.276 -0.276 0.5 0 0.5 C
0.276 0.5 0.5 0.276 0.5 0 C
cp
f
GR
GS
[1.00046 0 0 1.00215 100.9049 75.39684] CT
0.8 0.502 0.502 RC
N
/f-2105962265{0.5 0 M
0.5 -0.276 0.276 -0.5 0 -0.5 C
-0.276 -0.5 -0.5 -0.276 -0.5 0 C
-0.5 0.276 -0.276 0.5 0 0.5 C
0.276 0.5 0.5 0.276 0.5 0 C
cp}def
f-2105962265
f
GR
GS
[1.00046 0 0 1.00215 170.482 60.03881] CT
0.8 0.502 0.502 RC
N
f-2105962265
f
GR
GS
[1.00046 0 0 1.00215 183.20357 30.8084] CT
0.8 0.502 0.502 RC
N
f-2105962265
f
GR
GS
[1.00046 0 0 1.00215 164.70199 43.13606] CT
0.8 0.502 0.502 RC
N
f-2105962265
f
GR
GS
[1.00046 0 0 1.00215 144.34766 85.08416] CT
0.8 0.502 0.502 RC
N
f-2105962265
f
GR
GS
[1.00046 0 0 1.00215 138.72685 53.40582] CT
0.8 0.502 0.502 RC
N
f-2105962265
f
GR
GS
[1.00046 0 0 1.00215 149.32549 81.88872] CT
0.8 0.502 0.502 RC
N
f-2105962265
f
GR
GS
[1.00046 0 0 1.00215 149.169 78.43472] CT
0.8 0.502 0.502 RC
N
f-2105962265
f
GR
GS
[1.00046 0 0 1.00215 176.59689 91.77978] CT
0.8 0.502 0.502 RC
N
f-2105962265
f
GR
GS
[1.00046 0 0 1.00215 146.12774 60.8944] CT
0.8 0.502 0.502 RC
N
f-2105962265
f
GR
GS
[1.00046 0 0 1.00215 133.64686 93.78901] CT
0.8 0.502 0.502 RC
N
f-2105962265
f
GR
GS
[1.00046 0 0 1.00215 109.79736 80.29475] CT
0.8 0.502 0.502 RC
N
f-2105962265
f
GR
GS
[1.00046 0 0 1.00215 113.84856 93.36733] CT
0.8 0.502 0.502 RC
N
f-2105962265
f
GR
GS
[1.00046 0 0 1.00215 202.86511 30.8084] CT
0.8 0.502 0.502 RC
N
f-2105962265
f
GR
GS
[1.00046 0 0 1.00215 118.89466 85.42824] CT
0.8 0.502 0.502 RC
N
f-2105962265
f
GR
GS
[1.00046 0 0 1.00215 131.66239 82.48259] CT
0.8 0.502 0.502 RC
N
f-2105962265
f
GR
GS
[1.00046 0 0 1.00215 156.86324 68.06299] CT
0.8 0.502 0.502 RC
N
f-2105962265
f
GR
GS
[1.00046 0 0 1.00215 160.47543 97.02531] CT
0.8 0.502 0.502 RC
N
f-2105962265
f
GR
GS
[1.00046 0 0 1.00215 163.38841 85.89688] CT
0.8 0.502 0.502 RC
N
f-2105962265
f
GR
GS
[1.00046 0 0 1.00215 208.04652 30.8084] CT
0.8 0.502 0.502 RC
N
f-2105962265
f
GR
GS
[1.00046 0 0 1.00215 173.12757 86.12182] CT
0.8 0.502 0.502 RC
N
f-2105962265
f
GR
GS
[1.00046 0 0 1.00215 135.06323 85.32622] CT
0.8 0.502 0.502 RC
N
f-2105962265
f
GR
GS
[1.00046 0 0 1.00215 131.54939 53.46848] CT
0.8 0.502 0.502 RC
N
f-2105962265
f
GR
GS
[1.00046 0 0 1.00215 169.89693 78.50756] CT
0.8 0.502 0.502 RC
N
f-2105962265
f
GR
GS
[1.00046 0 0 1.00215 168.21966 61.91445] CT
0.8 0.502 0.502 RC
N
f-2105962265
f
GR
GS
[1.00046 0 0 1.00215 163.30749 53.21041] CT
0.8 0.502 0.502 RC
N
f-2105962265
f
GR
GS
[1.00046 0 0 1.00215 127.18418 91.10896] CT
0.8 0.502 0.502 RC
N
f-2105962265
f
GR
GS
[1.00046 0 0 1.00215 157.36463 51.61919] CT
0.8 0.502 0.502 RC
N
f-2105962265
f
GR
GS
[1.00046 0 0 1.00215 155.48572 66.73009] CT
0.8 0.502 0.502 RC
N
f-2105962265
f
GR
GS
[1.00046 0 0 1.00215 130.68132 83.03369] CT
0.8 0.502 0.502 RC
N
f-2105962265
f
GR
GS
[1.00046 0 0 1.00215 208.04652 30.8084] CT
0.8 0.502 0.502 RC
N
f-2105962265
f
GR
GS
[1.00046 0 0 1.00215 127.54276 91.66144] CT
0.8 0.502 0.502 RC
N
f-2105962265
f
GR
GS
[1.00046 0 0 1.00215 117.47618 82.60282] CT
0.8 0.502 0.502 RC
N
f-2105962265
f
GR
GS
[1.00046 0 0 1.00215 141.74624 93.82636] CT
0.8 0.502 0.502 RC
N
f-2105962265
f
GR
GS
[1.00046 0 0 1.00215 161.03981 49.02468] CT
0.8 0.502 0.502 RC
N
f-2105962265
f
GR
GS
[1.00046 0 0 1.00215 127.24894 83.76942] CT
0.8 0.502 0.502 RC
N
f-2105962265
f
GR
GS
[1.00046 0 0 1.00215 126.73602 87.78276] CT
0.8 0.502 0.502 RC
N
f-2105962265
f
GR
GS
[1.00046 0 0 1.00215 103.89232 104.65811] CT
0.8 0.502 0.502 RC
N
f-2105962265
f
GR
GS
[1.00046 0 0 1.00215 153.81239 79.89119] CT
0.8 0.502 0.502 RC
N
f-2105962265
f
GR
GS
[1.00046 0 0 1.00215 111.05854 104.62063] CT
0.8 0.502 0.502 RC
N
f-2105962265
f
GR
GS
[1.00046 0 0 1.00215 121.58326 72.62171] CT
0.8 0.502 0.502 RC
N
f-2105962265
f
GR
GS
[1.00046 0 0 1.00215 113.0923 132.69338] CT
0.8 0.502 0.502 RC
N
f-2105962265
f
GR
GS
[1.00046 0 0 1.00215 106.27724 117.71863] CT
0.8 0.502 0.502 RC
N
f-2105962265
f
GR
GS
[1.00046 0 0 1.00215 123.83679 71.02947] CT
0.8 0.502 0.502 RC
N
f-2105962265
f
GR
GS
[1.00046 0 0 1.00215 144.62961 88.02168] CT
0.8 0.502 0.502 RC
N
f-2105962265
f
GR
GS
[1.00046 0 0 1.00215 148.32429 80.43746] CT
0.8 0.502 0.502 RC
N
f-2105962265
f
GR
GS
[1.00046 0 0 1.00215 139.82008 57.05141] CT
0.8 0.502 0.502 RC
N
f-2105962265
f
GR
GS
[1.00046 0 0 1.00215 129.49453 132.69338] CT
0.8 0.502 0.502 RC
N
f-2105962265
f
GR
GS
[1.00046 0 0 1.00215 139.79225 132.69338] CT
0.8 0.502 0.502 RC
N
f-2105962265
f
GR
GS
[1.00046 0 0 1.00215 107.44135 83.22358] CT
0.8 0.502 0.502 RC
N
f-2105962265
f
GR
GS
[1.00046 0 0 1.00215 144.27478 65.69005] CT
0.8 0.502 0.502 RC
N
f-2105962265
f
GR
GS
[1.00046 0 0 1.00215 106.81917 75.05886] CT
0.8 0.502 0.502 RC
N
f-2105962265
f
GR
GS
[1.00046 0 0 1.00215 87.37217 95.04699] CT
0.8 0.502 0.502 RC
N
f-2105962265
f
GR
GS
[1.00046 0 0 1.00215 81.34795 98.90869] CT
0.8 0.502 0.502 RC
N
f-2105962265
f
GR
GS
[1.00046 0 0 1.00215 148.25697 85.08863] CT
0.8 0.502 0.502 RC
N
f-2105962265
f
GR
GS
[1.00046 0 0 1.00215 117.77876 52.28458] CT
0.8 0.502 0.502 RC
N
f-2105962265
f
GR
GS
[1.00046 0 0 1.00215 108.07357 64.75137] CT
0.8 0.502 0.502 RC
N
f-2105962265
f
GR
GS
[1.00046 0 0 1.00215 140.28804 94.02353] CT
0.8 0.502 0.502 RC
N
f-2105962265
f
GR
GS
[1.00046 0 0 1.00215 133.83651 62.68482] CT
0.8 0.502 0.502 RC
N
f-2105962265
f
GR
GS
[1.00046 0 0 1.00215 106.91784 110.74291] CT
0.8 0.502 0.502 RC
N
f-2105962265
f
GR
GS
[1.00046 0 0 1.00215 136.42203 111.17299] CT
0.8 0.502 0.502 RC
N
f-2105962265
f
GR
GS
[1.00046 0 0 1.00215 108.97663 61.37461] CT
0.8 0.502 0.502 RC
N
f-2105962265
f
GR
GS
[1.00046 0 0 1.00215 145.96699 55.27674] CT
0.8 0.502 0.502 RC
N
f-2105962265
f
GR
GS
[1.00046 0 0 1.00215 131.72683 74.09319] CT
0.8 0.502 0.502 RC
N
f-2105962265
f
GR
GS
[1.00046 0 0 1.00215 137.12635 82.69396] CT
0.8 0.502 0.502 RC
N
f-2105962265
f
GR
GS
[1.00046 0 0 1.00215 134.46149 82.59275] CT
0.8 0.502 0.502 RC
N
f-2105962265
f
GR
GS
[1.00046 0 0 1.00215 106.03577 102.25542] CT
0.8 0.502 0.502 RC
N
f-2105962265
f
GR
GS
[1.00046 0 0 1.00215 157.77968 39.58149] CT
0.8 0.502 0.502 RC
N
f-2105962265
f
GR
GS
[1.00046 0 0 1.00215 132.84124 92.16373] CT
0.8 0.502 0.502 RC
N
f-2105962265
f
GR
GS
[1.00046 0 0 1.00215 123.3864 96.52712] CT
0.8 0.502 0.502 RC
N
f-2105962265
f
GR
GS
[1.00046 0 0 1.00215 115.14151 76.38103] CT
0.8 0.502 0.502 RC
N
f-2105962265
f
GR
GS
[1.00046 0 0 1.00215 139.36591 81.46554] CT
0.8 0.502 0.502 RC
N
f-2105962265
f
GR
GS
[1.00046 0 0 1.00215 93.95168 132.69338] CT
0.8 0.502 0.502 RC
N
f-2105962265
f
GR
GS
[1.00046 0 0 1.00215 180.65156 78.07947] CT
0.8 0.502 0.502 RC
N
f-2105962265
f
GR
GS
[1.00046 0 0 1.00215 141.15082 75.92027] CT
0.8 0.502 0.502 RC
N
f-2105962265
f
GR
GS
[1.00046 0 0 1.00215 143.51279 79.53729] CT
0.8 0.502 0.502 RC
N
f-2105962265
f
GR
GS
[1.00046 0 0 1.00215 119.63368 81.60255] CT
0.8 0.502 0.502 RC
N
f-2105962265
f
GR
GS
[1.00046 0 0 1.00215 131.37977 62.32787] CT
0.8 0.502 0.502 RC
N
f-2105962265
f
GR
GS
[1.00046 0 0 1.00215 109.50075 97.75] CT
0.8 0.502 0.502 RC
N
f-2105962265
f
GR
GS
[1.00046 0 0 1.00215 132.60773 106.58572] CT
0.8 0.502 0.502 RC
N
f-2105962265
f
GR
GS
[1.00046 0 0 1.00215 107.25287 97.77877] CT
0.8 0.502 0.502 RC
N
f-2105962265
f
GR
GS
[1.00046 0 0 1.00215 127.71687 91.40042] CT
0.8 0.502 0.502 RC
N
f-2105962265
f
GR
GS
[1.00046 0 0 1.00215 105.95236 93.32376] CT
0.8 0.502 0.502 RC
N
f-2105962265
f
GR
GS
[1.00046 0 0 1.00215 113.85669 89.97769] CT
0.8 0.502 0.502 RC
N
f-2105962265
f
GR
GS
[1.00046 0 0 1.00215 120.25836 86.63778] CT
0.8 0.502 0.502 RC
N
f-2105962265
f
GR
GS
[1.00046 0 0 1.00215 159.02296 81.13907] CT
0.8 0.502 0.502 RC
N
f-2105962265
f
GR
GS
[1.00046 0 0 1.00215 91.4427 119.84188] CT
0.8 0.502 0.502 RC
N
f-2105962265
f
GR
GS
[1.00046 0 0 1.00215 112.8064 88.09157] CT
0.8 0.502 0.502 RC
N
f-2105962265
f
GR
GS
[1.00046 0 0 1.00215 160.58647 86.36635] CT
0.8 0.502 0.502 RC
N
f-2105962265
f
GR
GS
[1.00046 0 0 1.00215 121.31917 132.69338] CT
0.8 0.502 0.502 RC
N
f-2105962265
f
GR
GS
[1.00046 0 0 1.00215 161.0117 42.82459] CT
0.8 0.502 0.502 RC
N
f-2105962265
f
GR
GS
[1.00046 0 0 1.00215 113.93547 91.98025] CT
0.8 0.502 0.502 RC
N
f-2105962265
f
GR
GS
[1.00046 0 0 1.00215 180.65156 39.58149] CT
0.8 0.502 0.502 RC
N
f-2105962265
f
GR
GS
[1.00046 0 0 1.00215 122.81576 100.66477] CT
0.8 0.502 0.502 RC
N
f-2105962265
f
GR
GS
[1.00046 0 0 1.00215 0 -0.4252] CT
0.902 0.6 0.6 RC
1 LJ
3 LW
N
74.5 115.377 M
231.5 29.208 L
S
GR
GS
[1.00046 0 0 1.00215 116.04459 131.85707] CT
1 0.702 0.702 RC
N
/f227889816{-3 -3 M
-3 3 L
3 3 L
3 -3 L
cp}def
f227889816
f
GR
GS
[1.00046 0 0 1.00215 100.9049 75.39684] CT
1 0.702 0.702 RC
N
f227889816
f
GR
GS
[1.00046 0 0 1.00215 170.482 60.03881] CT
1 0.702 0.702 RC
N
f227889816
f
GR
GS
[1.00046 0 0 1.00215 183.20357 30.8084] CT
1 0.702 0.702 RC
N
f227889816
f
GR
GS
[1.00046 0 0 1.00215 164.70199 43.13606] CT
1 0.702 0.702 RC
N
f227889816
f
GR
GS
[1.00046 0 0 1.00215 144.34766 85.08416] CT
1 0.702 0.702 RC
N
f227889816
f
GR
GS
[1.00046 0 0 1.00215 138.72685 53.40582] CT
1 0.702 0.702 RC
N
f227889816
f
GR
GS
[1.00046 0 0 1.00215 149.32549 81.88872] CT
1 0.702 0.702 RC
N
f227889816
f
GR
GS
[1.00046 0 0 1.00215 149.169 78.43472] CT
1 0.702 0.702 RC
N
f227889816
f
GR
GS
[1.00046 0 0 1.00215 176.59689 91.77978] CT
1 0.702 0.702 RC
N
f227889816
f
GR
GS
[1.00046 0 0 1.00215 146.12774 60.8944] CT
1 0.702 0.702 RC
N
f227889816
f
GR
GS
[1.00046 0 0 1.00215 133.64686 93.78901] CT
1 0.702 0.702 RC
N
f227889816
f
GR
GS
[1.00046 0 0 1.00215 109.79736 80.29475] CT
1 0.702 0.702 RC
N
f227889816
f
GR
GS
[1.00046 0 0 1.00215 113.84856 93.36733] CT
1 0.702 0.702 RC
N
f227889816
f
GR
GS
[1.00046 0 0 1.00215 202.86511 30.8084] CT
1 0.702 0.702 RC
N
f227889816
f
GR
GS
[1.00046 0 0 1.00215 118.89466 85.42824] CT
1 0.702 0.702 RC
N
f227889816
f
GR
GS
[1.00046 0 0 1.00215 131.66239 82.48259] CT
1 0.702 0.702 RC
N
f227889816
f
GR
GS
[1.00046 0 0 1.00215 156.86324 68.06299] CT
1 0.702 0.702 RC
N
f227889816
f
GR
GS
[1.00046 0 0 1.00215 160.47543 97.02531] CT
1 0.702 0.702 RC
N
f227889816
f
GR
GS
[1.00046 0 0 1.00215 163.38841 85.89688] CT
1 0.702 0.702 RC
N
f227889816
f
GR
GS
[1.00046 0 0 1.00215 208.04652 30.8084] CT
1 0.702 0.702 RC
N
f227889816
f
GR
GS
[1.00046 0 0 1.00215 173.12757 86.12182] CT
1 0.702 0.702 RC
N
f227889816
f
GR
GS
[1.00046 0 0 1.00215 135.06323 85.32622] CT
1 0.702 0.702 RC
N
f227889816
f
GR
GS
[1.00046 0 0 1.00215 131.54939 53.46848] CT
1 0.702 0.702 RC
N
f227889816
f
GR
GS
[1.00046 0 0 1.00215 169.89693 78.50756] CT
1 0.702 0.702 RC
N
f227889816
f
GR
GS
[1.00046 0 0 1.00215 168.21966 61.91445] CT
1 0.702 0.702 RC
N
f227889816
f
GR
GS
[1.00046 0 0 1.00215 163.30749 53.21041] CT
1 0.702 0.702 RC
N
f227889816
f
GR
GS
[1.00046 0 0 1.00215 127.18418 91.10896] CT
1 0.702 0.702 RC
N
f227889816
f
GR
GS
[1.00046 0 0 1.00215 157.36463 51.61919] CT
1 0.702 0.702 RC
N
f227889816
f
GR
GS
[1.00046 0 0 1.00215 155.48572 66.73009] CT
1 0.702 0.702 RC
N
f227889816
f
GR
GS
[1.00046 0 0 1.00215 130.68132 83.03369] CT
1 0.702 0.702 RC
N
f227889816
f
GR
GS
[1.00046 0 0 1.00215 208.04652 30.8084] CT
1 0.702 0.702 RC
N
f227889816
f
GR
GS
[1.00046 0 0 1.00215 127.54276 91.66144] CT
1 0.702 0.702 RC
N
f227889816
f
GR
GS
[1.00046 0 0 1.00215 117.47618 82.60282] CT
1 0.702 0.702 RC
N
f227889816
f
GR
GS
[1.00046 0 0 1.00215 141.74624 93.82636] CT
1 0.702 0.702 RC
N
f227889816
f
GR
GS
[1.00046 0 0 1.00215 161.03981 49.02468] CT
1 0.702 0.702 RC
N
f227889816
f
GR
GS
[1.00046 0 0 1.00215 127.24894 83.76942] CT
1 0.702 0.702 RC
N
f227889816
f
GR
GS
[1.00046 0 0 1.00215 126.73602 87.78276] CT
1 0.702 0.702 RC
N
f227889816
f
GR
GS
[1.00046 0 0 1.00215 103.89232 104.65811] CT
1 0.702 0.702 RC
N
f227889816
f
GR
GS
[1.00046 0 0 1.00215 153.81239 79.89119] CT
1 0.702 0.702 RC
N
f227889816
f
GR
GS
[1.00046 0 0 1.00215 111.05854 104.62063] CT
1 0.702 0.702 RC
N
f227889816
f
GR
GS
[1.00046 0 0 1.00215 121.58326 72.62171] CT
1 0.702 0.702 RC
N
f227889816
f
GR
GS
[1.00046 0 0 1.00215 113.0923 132.69338] CT
0.8 0.502 0.502 RC
N
/f-1969333140{-3.536 0 M
0 4.702 L
3.536 0 L
0 -4.702 L
cp}def
f-1969333140
f
GR
GS
[1.00046 0 0 1.00215 106.27724 117.71863] CT
0.8 0.502 0.502 RC
N
f-1969333140
f
GR
GS
[1.00046 0 0 1.00215 123.83679 71.02947] CT
0.8 0.502 0.502 RC
N
f-1969333140
f
GR
GS
[1.00046 0 0 1.00215 144.62961 88.02168] CT
0.8 0.502 0.502 RC
N
f-1969333140
f
GR
GS
[1.00046 0 0 1.00215 148.32429 80.43746] CT
0.8 0.502 0.502 RC
N
f-1969333140
f
GR
GS
[1.00046 0 0 1.00215 139.82008 57.05141] CT
0.8 0.502 0.502 RC
N
f-1969333140
f
GR
GS
[1.00046 0 0 1.00215 129.49453 132.69338] CT
0.8 0.502 0.502 RC
N
f-1969333140
f
GR
GS
[1.00046 0 0 1.00215 139.79225 132.69338] CT
0.8 0.502 0.502 RC
N
f-1969333140
f
GR
GS
[1.00046 0 0 1.00215 107.44135 83.22358] CT
0.8 0.502 0.502 RC
N
f-1969333140
f
GR
GS
[1.00046 0 0 1.00215 144.27478 65.69005] CT
0.8 0.502 0.502 RC
N
f-1969333140
f
GR
GS
[1.00046 0 0 1.00215 106.81917 75.05886] CT
0.8 0.502 0.502 RC
N
f-1969333140
f
GR
GS
[1.00046 0 0 1.00215 87.37217 95.04699] CT
0.8 0.502 0.502 RC
N
f-1969333140
f
GR
GS
[1.00046 0 0 1.00215 81.34795 98.90869] CT
0.8 0.502 0.502 RC
N
f-1969333140
f
GR
GS
[1.00046 0 0 1.00215 148.25697 85.08863] CT
0.8 0.502 0.502 RC
N
f-1969333140
f
GR
GS
[1.00046 0 0 1.00215 117.77876 52.28458] CT
0.8 0.502 0.502 RC
N
f-1969333140
f
GR
GS
[1.00046 0 0 1.00215 108.07357 64.75137] CT
0.8 0.502 0.502 RC
N
f-1969333140
f
GR
GS
[1.00046 0 0 1.00215 140.28804 94.02353] CT
0.8 0.502 0.502 RC
N
f-1969333140
f
GR
GS
[1.00046 0 0 1.00215 133.83651 62.68482] CT
0.8 0.502 0.502 RC
N
f-1969333140
f
GR
GS
[1.00046 0 0 1.00215 106.91784 110.74291] CT
0.8 0.502 0.502 RC
N
f-1969333140
f
GR
GS
[1.00046 0 0 1.00215 136.42203 111.17299] CT
0.8 0.502 0.502 RC
N
f-1969333140
f
GR
GS
[1.00046 0 0 1.00215 108.97663 61.37461] CT
0.8 0.502 0.502 RC
N
f-1969333140
f
GR
GS
[1.00046 0 0 1.00215 145.96699 55.27674] CT
0.8 0.502 0.502 RC
N
f-1969333140
f
GR
GS
[1.00046 0 0 1.00215 131.72683 74.09319] CT
0.8 0.502 0.502 RC
N
f-1969333140
f
GR
GS
[1.00046 0 0 1.00215 137.12635 82.69396] CT
0.8 0.502 0.502 RC
N
f-1969333140
f
GR
GS
[1.00046 0 0 1.00215 134.46149 82.59275] CT
0.8 0.502 0.502 RC
N
f-1969333140
f
GR
GS
[1.00046 0 0 1.00215 106.03577 102.25542] CT
0.8 0.502 0.502 RC
N
f-1969333140
f
GR
GS
[1.00046 0 0 1.00215 157.77968 39.58149] CT
0.8 0.502 0.502 RC
N
f-1969333140
f
GR
GS
[1.00046 0 0 1.00215 132.84124 92.16373] CT
0.8 0.502 0.502 RC
N
f-1969333140
f
GR
GS
[1.00046 0 0 1.00215 123.3864 96.52712] CT
0.8 0.502 0.502 RC
N
f-1969333140
f
GR
GS
[1.00046 0 0 1.00215 115.14151 76.38103] CT
0.8 0.502 0.502 RC
N
f-1969333140
f
GR
GS
[1.00046 0 0 1.00215 139.36591 81.46554] CT
0.8 0.502 0.502 RC
N
f-1969333140
f
GR
GS
[1.00046 0 0 1.00215 93.95168 132.69338] CT
0.8 0.502 0.502 RC
N
f-1969333140
f
GR
GS
[1.00046 0 0 1.00215 180.65156 78.07947] CT
0.8 0.502 0.502 RC
N
f-1969333140
f
GR
GS
[1.00046 0 0 1.00215 141.15082 75.92027] CT
0.8 0.502 0.502 RC
N
f-1969333140
f
GR
GS
[1.00046 0 0 1.00215 143.51279 79.53729] CT
0.8 0.502 0.502 RC
N
f-1969333140
f
GR
GS
[1.00046 0 0 1.00215 119.63368 81.60255] CT
0.8 0.502 0.502 RC
N
f-1969333140
f
GR
GS
[1.00046 0 0 1.00215 131.37977 62.32787] CT
0.8 0.502 0.502 RC
N
f-1969333140
f
GR
GS
[1.00046 0 0 1.00215 109.50075 97.75] CT
0.8 0.502 0.502 RC
N
f-1969333140
f
GR
GS
[1.00046 0 0 1.00215 132.60773 106.58572] CT
0.8 0.502 0.502 RC
N
f-1969333140
f
GR
GS
[1.00046 0 0 1.00215 107.25287 97.77877] CT
0.8 0.502 0.502 RC
N
f-1969333140
f
GR
GS
[1.00046 0 0 1.00215 127.71687 91.40042] CT
0.8 0.502 0.502 RC
N
f-1969333140
f
GR
GS
[1.00046 0 0 1.00215 105.95236 93.32376] CT
0.8 0.502 0.502 RC
N
f-1969333140
f
GR
GS
[1.00046 0 0 1.00215 113.85669 89.97769] CT
0.8 0.502 0.502 RC
N
f-1969333140
f
GR
GS
[1.00046 0 0 1.00215 120.25836 86.63778] CT
0.8 0.502 0.502 RC
N
f-1969333140
f
GR
GS
[1.00046 0 0 1.00215 159.02296 81.13907] CT
0.8 0.502 0.502 RC
N
f-1969333140
f
GR
GS
[1.00046 0 0 1.00215 91.4427 119.84188] CT
0.8 0.502 0.502 RC
N
f-1969333140
f
GR
GS
[1.00046 0 0 1.00215 112.8064 88.09157] CT
0.8 0.502 0.502 RC
N
f-1969333140
f
GR
GS
[1.00046 0 0 1.00215 160.58647 86.36635] CT
0.8 0.502 0.502 RC
N
f-1969333140
f
GR
GS
[1.00046 0 0 1.00215 121.31917 132.69338] CT
0.8 0.502 0.502 RC
N
f-1969333140
f
GR
GS
[1.00046 0 0 1.00215 161.0117 42.82459] CT
0.8 0.502 0.502 RC
N
f-1969333140
f
GR
GS
[1.00046 0 0 1.00215 113.93547 91.98025] CT
0.8 0.502 0.502 RC
N
f-1969333140
f
GR
GS
[1.00046 0 0 1.00215 180.65156 39.58149] CT
0.8 0.502 0.502 RC
N
f-1969333140
f
GR
GS
[1.00046 0 0 1.00215 122.81576 100.66477] CT
0.8 0.502 0.502 RC
N
f-1969333140
f
GR
%%Trailer
%%Pages: 1
%%EOF
