%!PS-Adobe-3.0 EPSF-3.0
%%Creator: (MATLAB, The Mathworks, Inc. Version 9.8.0.1323502 \(R2020a\). Operating System: Mac OS X)
%%Title: /Users/kosciessa/Desktop/mntTardisLNDG/LNDG/stateswitch/stsw_multimodal/figures/l1byage/drift_cpp.eps
%%CreationDate: 2022-03-06T15:16:33
%%Pages: (atend)
%%BoundingBox:    25    20   269   406
%%LanguageLevel: 3
%%EndComments
%%BeginProlog
%%BeginResource: procset (Apache XML Graphics Std ProcSet) 1.2 0
%%Version: 1.2 0
%%Copyright: (Copyright 2001-2003,2010 The Apache Software Foundation. License terms: http://www.apache.org/licenses/LICENSE-2.0)
/bd{bind def}bind def
/ld{load def}bd
/GR/grestore ld
/GS/gsave ld
/RM/rmoveto ld
/C/curveto ld
/t/show ld
/L/lineto ld
/ML/setmiterlimit ld
/CT/concat ld
/f/fill ld
/N/newpath ld
/S/stroke ld
/CC/setcmykcolor ld
/A/ashow ld
/cp/closepath ld
/RC/setrgbcolor ld
/LJ/setlinejoin ld
/GC/setgray ld
/LW/setlinewidth ld
/M/moveto ld
/re {4 2 roll M
1 index 0 rlineto
0 exch rlineto
neg 0 rlineto
cp } bd
/_ctm matrix def
/_tm matrix def
/BT { _ctm currentmatrix pop matrix _tm copy pop 0 0 moveto } bd
/ET { _ctm setmatrix } bd
/iTm { _ctm setmatrix _tm concat } bd
/Tm { _tm astore pop iTm 0 0 moveto } bd
/ux 0.0 def
/uy 0.0 def
/F {
  /Tp exch def
  /Tf exch def
  Tf findfont Tp scalefont setfont
  /cf Tf def  /cs Tp def
} bd
/ULS {currentpoint /uy exch def /ux exch def} bd
/ULE {
  /Tcx currentpoint pop def
  gsave
  newpath
  cf findfont cs scalefont dup
  /FontMatrix get 0 get /Ts exch def /FontInfo get dup
  /UnderlinePosition get Ts mul /To exch def
  /UnderlineThickness get Ts mul /Tt exch def
  ux uy To add moveto  Tcx uy To add lineto
  Tt setlinewidth stroke
  grestore
} bd
/OLE {
  /Tcx currentpoint pop def
  gsave
  newpath
  cf findfont cs scalefont dup
  /FontMatrix get 0 get /Ts exch def /FontInfo get dup
  /UnderlinePosition get Ts mul /To exch def
  /UnderlineThickness get Ts mul /Tt exch def
  ux uy To add cs add moveto Tcx uy To add cs add lineto
  Tt setlinewidth stroke
  grestore
} bd
/SOE {
  /Tcx currentpoint pop def
  gsave
  newpath
  cf findfont cs scalefont dup
  /FontMatrix get 0 get /Ts exch def /FontInfo get dup
  /UnderlinePosition get Ts mul /To exch def
  /UnderlineThickness get Ts mul /Tt exch def
  ux uy To add cs 10 mul 26 idiv add moveto Tcx uy To add cs 10 mul 26 idiv add lineto
  Tt setlinewidth stroke
  grestore
} bd
/QT {
/Y22 exch store
/X22 exch store
/Y21 exch store
/X21 exch store
currentpoint
/Y21 load 2 mul add 3 div exch
/X21 load 2 mul add 3 div exch
/X21 load 2 mul /X22 load add 3 div
/Y21 load 2 mul /Y22 load add 3 div
/X22 load /Y22 load curveto
} bd
/SSPD {
dup length /d exch dict def
{
/v exch def
/k exch def
currentpagedevice k known {
/cpdv currentpagedevice k get def
v cpdv ne {
/upd false def
/nullv v type /nulltype eq def
/nullcpdv cpdv type /nulltype eq def
nullv nullcpdv or
{
/upd true def
} {
/sametype v type cpdv type eq def
sametype {
v type /arraytype eq {
/vlen v length def
/cpdvlen cpdv length def
vlen cpdvlen eq {
0 1 vlen 1 sub {
/i exch def
/obj v i get def
/cpdobj cpdv i get def
obj cpdobj ne {
/upd true def
exit
} if
} for
} {
/upd true def
} ifelse
} {
v type /dicttype eq {
v {
/dv exch def
/dk exch def
/cpddv cpdv dk get def
dv cpddv ne {
/upd true def
exit
} if
} forall
} {
/upd true def
} ifelse
} ifelse
} if
} ifelse
upd true eq {
d k v put
} if
} if
} if
} forall
d length 0 gt {
d setpagedevice
} if
} bd
/RE { % /NewFontName [NewEncodingArray] /FontName RE -
  findfont dup length dict begin
  {
    1 index /FID ne
    {def} {pop pop} ifelse
  } forall
  /Encoding exch def
  /FontName 1 index def
  currentdict definefont pop
  end
} bind def
%%EndResource
%%BeginResource: procset (Apache XML Graphics EPS ProcSet) 1.0 0
%%Version: 1.0 0
%%Copyright: (Copyright 2002-2003 The Apache Software Foundation. License terms: http://www.apache.org/licenses/LICENSE-2.0)
/BeginEPSF { %def
/b4_Inc_state save def         % Save state for cleanup
/dict_count countdictstack def % Count objects on dict stack
/op_count count 1 sub def      % Count objects on operand stack
userdict begin                 % Push userdict on dict stack
/showpage { } def              % Redefine showpage, { } = null proc
0 setgray 0 setlinecap         % Prepare graphics state
1 setlinewidth 0 setlinejoin
10 setmiterlimit [ ] 0 setdash newpath
/languagelevel where           % If level not equal to 1 then
{pop languagelevel             % set strokeadjust and
1 ne                           % overprint to their defaults.
{false setstrokeadjust false setoverprint
} if
} if
} bd
/EndEPSF { %def
count op_count sub {pop} repeat            % Clean up stacks
countdictstack dict_count sub {end} repeat
b4_Inc_state restore
} bd
%%EndResource
%FOPBeginFontDict
%%IncludeResource: font Courier-Oblique
%%IncludeResource: font Courier-BoldOblique
%%IncludeResource: font Courier-Bold
%%IncludeResource: font ZapfDingbats
%%IncludeResource: font Symbol
%%IncludeResource: font Helvetica
%%IncludeResource: font Helvetica-Oblique
%%IncludeResource: font Helvetica-Bold
%%IncludeResource: font Helvetica-BoldOblique
%%IncludeResource: font Times-Roman
%%IncludeResource: font Times-Italic
%%IncludeResource: font Times-Bold
%%IncludeResource: font Times-BoldItalic
%%IncludeResource: font Courier
%FOPEndFontDict
%%BeginResource: encoding WinAnsiEncoding
/WinAnsiEncoding [
/.notdef /.notdef /.notdef /.notdef /.notdef
/.notdef /.notdef /.notdef /.notdef /.notdef
/.notdef /.notdef /.notdef /.notdef /.notdef
/.notdef /.notdef /.notdef /.notdef /.notdef
/.notdef /.notdef /.notdef /.notdef /.notdef
/.notdef /.notdef /.notdef /.notdef /.notdef
/.notdef /.notdef /space /exclam /quotedbl
/numbersign /dollar /percent /ampersand /quotesingle
/parenleft /parenright /asterisk /plus /comma
/hyphen /period /slash /zero /one
/two /three /four /five /six
/seven /eight /nine /colon /semicolon
/less /equal /greater /question /at
/A /B /C /D /E
/F /G /H /I /J
/K /L /M /N /O
/P /Q /R /S /T
/U /V /W /X /Y
/Z /bracketleft /backslash /bracketright /asciicircum
/underscore /quoteleft /a /b /c
/d /e /f /g /h
/i /j /k /l /m
/n /o /p /q /r
/s /t /u /v /w
/x /y /z /braceleft /bar
/braceright /asciitilde /bullet /Euro /bullet
/quotesinglbase /florin /quotedblbase /ellipsis /dagger
/daggerdbl /circumflex /perthousand /Scaron /guilsinglleft
/OE /bullet /Zcaron /bullet /bullet
/quoteleft /quoteright /quotedblleft /quotedblright /bullet
/endash /emdash /asciitilde /trademark /scaron
/guilsinglright /oe /bullet /zcaron /Ydieresis
/space /exclamdown /cent /sterling /currency
/yen /brokenbar /section /dieresis /copyright
/ordfeminine /guillemotleft /logicalnot /sfthyphen /registered
/macron /degree /plusminus /twosuperior /threesuperior
/acute /mu /paragraph /middot /cedilla
/onesuperior /ordmasculine /guillemotright /onequarter /onehalf
/threequarters /questiondown /Agrave /Aacute /Acircumflex
/Atilde /Adieresis /Aring /AE /Ccedilla
/Egrave /Eacute /Ecircumflex /Edieresis /Igrave
/Iacute /Icircumflex /Idieresis /Eth /Ntilde
/Ograve /Oacute /Ocircumflex /Otilde /Odieresis
/multiply /Oslash /Ugrave /Uacute /Ucircumflex
/Udieresis /Yacute /Thorn /germandbls /agrave
/aacute /acircumflex /atilde /adieresis /aring
/ae /ccedilla /egrave /eacute /ecircumflex
/edieresis /igrave /iacute /icircumflex /idieresis
/eth /ntilde /ograve /oacute /ocircumflex
/otilde /odieresis /divide /oslash /ugrave
/uacute /ucircumflex /udieresis /yacute /thorn
/ydieresis
] def
%%EndResource
%FOPBeginFontReencode
/Courier-Oblique findfont
dup length dict begin
  {1 index /FID ne {def} {pop pop} ifelse} forall
  /Encoding WinAnsiEncoding def
  currentdict
end
/Courier-Oblique exch definefont pop
/Courier-BoldOblique findfont
dup length dict begin
  {1 index /FID ne {def} {pop pop} ifelse} forall
  /Encoding WinAnsiEncoding def
  currentdict
end
/Courier-BoldOblique exch definefont pop
/Courier-Bold findfont
dup length dict begin
  {1 index /FID ne {def} {pop pop} ifelse} forall
  /Encoding WinAnsiEncoding def
  currentdict
end
/Courier-Bold exch definefont pop
/Helvetica findfont
dup length dict begin
  {1 index /FID ne {def} {pop pop} ifelse} forall
  /Encoding WinAnsiEncoding def
  currentdict
end
/Helvetica exch definefont pop
/Helvetica-Oblique findfont
dup length dict begin
  {1 index /FID ne {def} {pop pop} ifelse} forall
  /Encoding WinAnsiEncoding def
  currentdict
end
/Helvetica-Oblique exch definefont pop
/Helvetica-Bold findfont
dup length dict begin
  {1 index /FID ne {def} {pop pop} ifelse} forall
  /Encoding WinAnsiEncoding def
  currentdict
end
/Helvetica-Bold exch definefont pop
/Helvetica-BoldOblique findfont
dup length dict begin
  {1 index /FID ne {def} {pop pop} ifelse} forall
  /Encoding WinAnsiEncoding def
  currentdict
end
/Helvetica-BoldOblique exch definefont pop
/Times-Roman findfont
dup length dict begin
  {1 index /FID ne {def} {pop pop} ifelse} forall
  /Encoding WinAnsiEncoding def
  currentdict
end
/Times-Roman exch definefont pop
/Times-Italic findfont
dup length dict begin
  {1 index /FID ne {def} {pop pop} ifelse} forall
  /Encoding WinAnsiEncoding def
  currentdict
end
/Times-Italic exch definefont pop
/Times-Bold findfont
dup length dict begin
  {1 index /FID ne {def} {pop pop} ifelse} forall
  /Encoding WinAnsiEncoding def
  currentdict
end
/Times-Bold exch definefont pop
/Times-BoldItalic findfont
dup length dict begin
  {1 index /FID ne {def} {pop pop} ifelse} forall
  /Encoding WinAnsiEncoding def
  currentdict
end
/Times-BoldItalic exch definefont pop
/Courier findfont
dup length dict begin
  {1 index /FID ne {def} {pop pop} ifelse} forall
  /Encoding WinAnsiEncoding def
  currentdict
end
/Courier exch definefont pop
%FOPEndFontReencode
%%EndProlog
%%Page: 1 1
%%PageBoundingBox: 0 0 283 425
%%BeginPageSetup
[1 0 0 -1 0 425] CT
%%EndPageSetup
GS
1 GC
N
0 0 283 425 re
f
GR
GS
1 GC
N
0 0 283 425 re
f
GR
GS
1 GC
N
54 177 M
131.5 177 L
131.5 41.5 L
54 41.5 L
cp
f
GR
GS
0.149 GC
2 setlinecap
1 LJ
0.5 LW
N
54 177 M
131.5 177 L
S
GR
GS
0.149 GC
2 setlinecap
1 LJ
0.5 LW
N
77.25 177 M
77.25 175.645 L
S
GR
GS
0.149 GC
2 setlinecap
1 LJ
0.5 LW
N
108.25 177 M
108.25 175.645 L
S
GR
GS
[1 0 0 1 77.25 183] CT
0.149 GC
/Helvetica 20 F
GS
[1 0 0 1 0 0] CT
-13 20 moveto 
1 -1 scale
(YA) t 
GR
GR
GS
[1 0 0 1 108.25 183] CT
0.149 GC
/Helvetica 20 F
GS
[1 0 0 1 0 0] CT
-14.5 20 moveto 
1 -1 scale
(OA) t 
GR
GR
GS
0.149 GC
2 setlinecap
1 LJ
0.5 LW
N
54 177 M
54 41.5 L
S
GR
GS
0.149 GC
2 setlinecap
1 LJ
0.5 LW
N
54 177 M
55.355 177 L
S
GR
GS
0.149 GC
2 setlinecap
1 LJ
0.5 LW
N
54 133.16 M
55.355 133.16 L
S
GR
GS
0.149 GC
2 setlinecap
1 LJ
0.5 LW
N
54 89.321 M
55.355 89.321 L
S
GR
GS
0.149 GC
2 setlinecap
1 LJ
0.5 LW
N
54 45.481 M
55.355 45.481 L
S
GR
GS
[1 0 0 1 48 177] CT
0.149 GC
/Helvetica 20 F
GS
[1 0 0 1 0 0] CT
-12 7.5 moveto 
1 -1 scale
(0) t 
GR
GR
GS
[1 0 0 1 48 133.1604] CT
0.149 GC
/Helvetica 20 F
GS
[1 0 0 1 0 0] CT
-12 7.5 moveto 
1 -1 scale
(1) t 
GR
GR
GS
[1 0 0 1 48 89.32079] CT
0.149 GC
/Helvetica 20 F
GS
[1 0 0 1 0 0] CT
-12 7.5 moveto 
1 -1 scale
(2) t 
GR
GR
GS
[1 0 0 1 48 45.48119] CT
0.149 GC
/Helvetica 20 F
GS
[1 0 0 1 0 0] CT
-12 7.5 moveto 
1 -1 scale
(3) t 
GR
GR
GS
[1 0 0 1 92.75009 38.99999] CT
/Helvetica-Bold 20 F
GS
[1 0 0 1 0 0] CT
-54.5 -5 moveto 
1 -1 scale
(p = 0.0e+00) t 
GR
GR
GS
0.149 GC
1 LJ
0.5 LW
N
54 177 M
131.5 177 L
S
GR
GS
1 0.6 0.6 RC
N
89.65 177 M
89.65 82.524 L
64.85 82.524 L
64.85 177 L
cp
f
GR
GS
[1 0 0 1 80.92207 67.87511] CT
0.302 GC
N
2.236 0 M
2.236 -1.235 1.235 -2.236 0 -2.236 C
-1.235 -2.236 -2.236 -1.235 -2.236 0 C
-2.236 1.235 -1.235 2.236 0 2.236 C
1.235 2.236 2.236 1.235 2.236 0 C
cp
f
GR
GS
[1 0 0 1 74.95438 94.77874] CT
0.302 GC
N
/f-1586420743{2.236 0 M
2.236 -1.235 1.235 -2.236 0 -2.236 C
-1.235 -2.236 -2.236 -1.235 -2.236 0 C
-2.236 1.235 -1.235 2.236 0 2.236 C
1.235 2.236 2.236 1.235 2.236 0 C
cp}def
f-1586420743
f
GR
GS
[1 0 0 1 72.66817 73.28204] CT
0.302 GC
N
f-1586420743
f
GR
GS
[1 0 0 1 77.84714 92.04058] CT
0.302 GC
N
f-1586420743
f
GR
GS
[1 0 0 1 81.79419 122.56506] CT
0.302 GC
N
f-1586420743
f
GR
GS
[1 0 0 1 77.26898 76.94304] CT
0.302 GC
N
f-1586420743
f
GR
GS
[1 0 0 1 72.90925 76.58978] CT
0.302 GC
N
f-1586420743
f
GR
GS
[1 0 0 1 75.26457 62.72121] CT
0.302 GC
N
f-1586420743
f
GR
GS
[1 0 0 1 80.65311 112.56434] CT
0.302 GC
N
f-1586420743
f
GR
GS
[1 0 0 1 82.0994 77.47467] CT
0.302 GC
N
f-1586420743
f
GR
GS
[1 0 0 1 80.0174 101.40555] CT
0.302 GC
N
f-1586420743
f
GR
GS
[1 0 0 1 76.0908 73.67401] CT
0.302 GC
N
f-1586420743
f
GR
GS
[1 0 0 1 81.55955 99.00337] CT
0.302 GC
N
f-1586420743
f
GR
GS
[1 0 0 1 71.21548 90.92036] CT
0.302 GC
N
f-1586420743
f
GR
GS
[1 0 0 1 79.68901 108.43906] CT
0.302 GC
N
f-1586420743
f
GR
GS
[1 0 0 1 83.12955 151.6714] CT
0.302 GC
N
f-1586420743
f
GR
GS
[1 0 0 1 77.46915 100.26459] CT
0.302 GC
N
f-1586420743
f
GR
GS
[1 0 0 1 82.33307 70.15452] CT
0.302 GC
N
f-1586420743
f
GR
GS
[1 0 0 1 76.71183 79.89952] CT
0.302 GC
N
f-1586420743
f
GR
GS
[1 0 0 1 73.15336 95.74454] CT
0.302 GC
N
f-1586420743
f
GR
GS
[1 0 0 1 83.30146 63.8541] CT
0.302 GC
N
f-1586420743
f
GR
GS
[1 0 0 1 76.58257 87.07039] CT
0.302 GC
N
f-1586420743
f
GR
GS
[1 0 0 1 73.82876 125.55602] CT
0.302 GC
N
f-1586420743
f
GR
GS
[1 0 0 1 71.42268 64.63052] CT
0.302 GC
N
f-1586420743
f
GR
GS
[1 0 0 1 78.90784 51.22445] CT
0.302 GC
N
f-1586420743
f
GR
GS
[1 0 0 1 73.95855 80.83919] CT
0.302 GC
N
f-1586420743
f
GR
GS
[1 0 0 1 80.13611 94.52562] CT
0.302 GC
N
f-1586420743
f
GR
GS
[1 0 0 1 72.14092 52.20449] CT
0.302 GC
N
f-1586420743
f
GR
GS
[1 0 0 1 73.94936 63.64973] CT
0.302 GC
N
f-1586420743
f
GR
GS
[1 0 0 1 82.82707 92.39494] CT
0.302 GC
N
f-1586420743
f
GR
GS
[1 0 0 1 71.90284 78.15908] CT
0.302 GC
N
f-1586420743
f
GR
GS
[1 0 0 1 82.60061 48.36093] CT
0.302 GC
N
f-1586420743
f
GR
GS
[1 0 0 1 75.48947 56.8526] CT
0.302 GC
N
f-1586420743
f
GR
GS
[1 0 0 1 82.40061 56.25223] CT
0.302 GC
N
f-1586420743
f
GR
GS
[1 0 0 1 78.14528 72.36483] CT
0.302 GC
N
f-1586420743
f
GR
GS
[1 0 0 1 72.12293 41.5] CT
0.302 GC
N
f-1586420743
f
GR
GS
[1 0 0 1 76.08206 96.07358] CT
0.302 GC
N
f-1586420743
f
GR
GS
[1 0 0 1 77.07761 54.78631] CT
0.302 GC
N
f-1586420743
f
GR
GS
[1 0 0 1 74.44359 113.43355] CT
0.302 GC
N
f-1586420743
f
GR
GS
[1 0 0 1 79.37412 69.12666] CT
0.302 GC
N
f-1586420743
f
GR
GS
[1 0 0 1 73.62571 95.65892] CT
0.302 GC
N
f-1586420743
f
GR
GS
[1 0 0 1 76.01191 79.49036] CT
0.302 GC
N
f-1586420743
f
GR
GS
1 0.6 0.6 RC
N
/f-1511157262{120.65 177 M
120.65 129.311 L
95.85 129.311 L
95.85 177 L
cp}def
f-1511157262
f
GR
GS
[1 0 0 1 107.32725 131.84816] CT
0.302 GC
N
f-1586420743
f
GR
GS
[1 0 0 1 110.74508 122.90497] CT
0.302 GC
N
f-1586420743
f
GR
GS
[1 0 0 1 106.2645 110.954] CT
0.302 GC
N
f-1586420743
f
GR
GS
[1 0 0 1 105.87258 169.67383] CT
0.302 GC
N
f-1586420743
f
GR
GS
[1 0 0 1 111.89532 116.98079] CT
0.302 GC
N
f-1586420743
f
GR
GS
[1 0 0 1 113.21598 139.35408] CT
0.302 GC
N
f-1586420743
f
GR
GS
[1 0 0 1 107.04788 104.881] CT
0.302 GC
N
f-1586420743
f
GR
GS
[1 0 0 1 107.08738 131.29982] CT
0.302 GC
N
f-1586420743
f
GR
GS
[1 0 0 1 107.6206 129.28726] CT
0.302 GC
N
f-1586420743
f
GR
GS
[1 0 0 1 111.6693 122.1349] CT
0.302 GC
N
f-1586420743
f
GR
GS
[1 0 0 1 106.84283 120.54147] CT
0.302 GC
N
f-1586420743
f
GR
GS
[1 0 0 1 103.78784 148.90193] CT
0.302 GC
N
f-1586420743
f
GR
GS
[1 0 0 1 106.52876 97.86491] CT
0.302 GC
N
f-1586420743
f
GR
GS
[1 0 0 1 106.37722 117.56355] CT
0.302 GC
N
f-1586420743
f
GR
GS
[1 0 0 1 112.16987 126.35387] CT
0.302 GC
N
f-1586420743
f
GR
GS
[1 0 0 1 106.9622 107.47767] CT
0.302 GC
N
f-1586420743
f
GR
GS
[1 0 0 1 103.54156 115.89847] CT
0.302 GC
N
f-1586420743
f
GR
GS
[1 0 0 1 104.08667 131.73199] CT
0.302 GC
N
f-1586420743
f
GR
GS
[1 0 0 1 104.69411 135.52747] CT
0.302 GC
N
f-1586420743
f
GR
GS
[1 0 0 1 104.04308 161.65202] CT
0.302 GC
N
f-1586420743
f
GR
GS
[1 0 0 1 107.72925 129.05666] CT
0.302 GC
N
f-1586420743
f
GR
GS
[1 0 0 1 106.79726 131.64458] CT
0.302 GC
N
f-1586420743
f
GR
GS
[1 0 0 1 108.3446 134.79128] CT
0.302 GC
N
f-1586420743
f
GR
GS
[1 0 0 1 112.79055 140.87109] CT
0.302 GC
N
f-1586420743
f
GR
GS
[1 0 0 1 111.28404 131.01172] CT
0.302 GC
N
f-1586420743
f
GR
GS
[1 0 0 1 103.59209 109.81343] CT
0.302 GC
N
f-1586420743
f
GR
GS
[1 0 0 1 105.70234 103.1983] CT
0.302 GC
N
f-1586420743
f
GR
GS
[1 0 0 1 107.10317 127.52676] CT
0.302 GC
N
f-1586420743
f
GR
GS
[1 0 0 1 107.14159 120.58412] CT
0.302 GC
N
f-1586420743
f
GR
GS
[1 0 0 1 104.11114 119.09358] CT
0.302 GC
N
f-1586420743
f
GR
GS
[1 0 0 1 111.48236 143.30679] CT
0.302 GC
N
f-1586420743
f
GR
GS
[1 0 0 1 111.98391 107.8204] CT
0.302 GC
N
f-1586420743
f
GR
GS
[1 0 0 1 109.63176 144.7903] CT
0.302 GC
N
f-1586420743
f
GR
GS
[1 0 0 1 106.69724 133.51184] CT
0.302 GC
N
f-1586420743
f
GR
GS
[1 0 0 1 104.86298 131.38403] CT
0.302 GC
N
f-1586420743
f
GR
GS
[1 0 0 1 103.48316 140.53041] CT
0.302 GC
N
f-1586420743
f
GR
GS
[1 0 0 1 102.80286 155.91435] CT
0.302 GC
N
f-1586420743
f
GR
GS
[1 0 0 1 112.01131 137.82121] CT
0.302 GC
N
f-1586420743
f
GR
GS
[1 0 0 1 102.47822 123.74537] CT
0.302 GC
N
f-1586420743
f
GR
GS
[1 0 0 1 105.34504 124.1652] CT
0.302 GC
N
f-1586420743
f
GR
GS
[1 0 0 1 105.35562 166.23596] CT
0.302 GC
N
f-1586420743
f
GR
GS
[1 0 0 1 105.7572 156.01961] CT
0.302 GC
N
f-1586420743
f
GR
GS
[1 0 0 1 112.85921 128.77794] CT
0.302 GC
N
f-1586420743
f
GR
GS
[1 0 0 1 108.20419 125.31299] CT
0.302 GC
N
f-1586420743
f
GR
GS
[1 0 0 1 104.68177 124.30178] CT
0.302 GC
N
f-1586420743
f
GR
GS
[1 0 0 1 111.80671 134.04776] CT
0.302 GC
N
f-1586420743
f
GR
GS
[1 0 0 1 108.35867 132.15816] CT
0.302 GC
N
f-1586420743
f
GR
GS
[1 0 0 1 109.52638 130.94614] CT
0.302 GC
N
f-1586420743
f
GR
GS
[1 0 0 1 108.45992 115.82256] CT
0.302 GC
N
f-1586420743
f
GR
GS
[1 0 0 1 112.20101 124.90802] CT
0.302 GC
N
f-1586420743
f
GR
GS
[1 0 0 1 109.46975 102.03445] CT
0.302 GC
N
f-1586420743
f
GR
GS
[1 0 0 1 106.4445 138.95871] CT
0.302 GC
N
f-1586420743
f
GR
GS
[1 0 0 1 104.48788 140.56999] CT
0.302 GC
N
f-1586420743
f
GR
GS
1 GC
N
/f1442352160{178.5 177 M
256 177 L
256 41.5 L
178.5 41.5 L
cp}def
f1442352160
f
GR
GS
0.149 GC
2 setlinecap
1 LJ
0.5 LW
N
178.5 177 M
256 177 L
S
GR
GS
0.149 GC
2 setlinecap
1 LJ
0.5 LW
N
201.75 177 M
201.75 175.645 L
S
GR
GS
0.149 GC
2 setlinecap
1 LJ
0.5 LW
N
232.75 177 M
232.75 175.645 L
S
GR
GS
[1 0 0 1 201.75 183] CT
0.149 GC
/Helvetica 20 F
GS
[1 0 0 1 0 0] CT
-13 20 moveto 
1 -1 scale
(YA) t 
GR
GR
GS
[1 0 0 1 232.75 183] CT
0.149 GC
/Helvetica 20 F
GS
[1 0 0 1 0 0] CT
-14.5 20 moveto 
1 -1 scale
(OA) t 
GR
GR
GS
0.149 GC
2 setlinecap
1 LJ
0.5 LW
N
178.5 177 M
178.5 41.5 L
S
GR
GS
0.149 GC
2 setlinecap
1 LJ
0.5 LW
N
178.5 135.047 M
179.855 135.047 L
S
GR
GS
0.149 GC
2 setlinecap
1 LJ
0.5 LW
N
178.5 88.459 M
179.855 88.459 L
S
GR
GS
0.149 GC
2 setlinecap
1 LJ
0.5 LW
N
178.5 41.871 M
179.855 41.871 L
S
GR
GS
[1 0 0 1 172.5 135.04655] CT
0.149 GC
/Helvetica 20 F
GS
[1 0 0 1 0 0] CT
-36 7.5 moveto 
1 -1 scale
(-0.4) t 
GR
GR
GS
[1 0 0 1 172.5 88.45902] CT
0.149 GC
/Helvetica 20 F
GS
[1 0 0 1 0 0] CT
-36 7.5 moveto 
1 -1 scale
(-0.2) t 
GR
GR
GS
[1 0 0 1 172.5 41.87149] CT
0.149 GC
/Helvetica 20 F
GS
[1 0 0 1 0 0] CT
-12 7.5 moveto 
1 -1 scale
(0) t 
GR
GR
GS
[1 0 0 1 217.25021 39] CT
/Helvetica-Bold 20 F
GS
[1 0 0 1 0 0] CT
-52.5 -5 moveto 
1 -1 scale
(p = 5.1e-10) t 
GR
GR
GS
0.149 GC
1 LJ
0.5 LW
N
178.5 41.871 M
256 41.871 L
S
GR
GS
0.6 0.8 1 RC
N
/f719249410{189.35 41.871 M
189.35 124.691 L
214.15 124.691 L
214.15 41.871 L
cp}def
f719249410
f
GR
GS
[1 0 0 1 207.87686 128.91388] CT
0.302 GC
N
f-1586420743
f
GR
GS
[1 0 0 1 207.00517 125.35415] CT
0.302 GC
N
f-1586420743
f
GR
GS
[1 0 0 1 201.86993 95.06679] CT
0.302 GC
N
f-1586420743
f
GR
GS
[1 0 0 1 197.32248 89.1977] CT
0.302 GC
N
f-1586420743
f
GR
GS
[1 0 0 1 206.50281 77.26513] CT
0.302 GC
N
f-1586420743
f
GR
GS
[1 0 0 1 205.58911 130.73816] CT
0.302 GC
N
f-1586420743
f
GR
GS
[1 0 0 1 196.57314 125.23441] CT
0.302 GC
N
f-1586420743
f
GR
GS
[1 0 0 1 202.88437 151.9212] CT
0.302 GC
N
f-1586420743
f
GR
GS
[1 0 0 1 200.47859 52.0318] CT
0.302 GC
N
f-1586420743
f
GR
GS
[1 0 0 1 206.56483 98.41963] CT
0.302 GC
N
f-1586420743
f
GR
GS
[1 0 0 1 195.94386 103.74496] CT
0.302 GC
N
f-1586420743
f
GR
GS
[1 0 0 1 202.52798 122.7029] CT
0.302 GC
N
f-1586420743
f
GR
GS
[1 0 0 1 199.17216 77.13095] CT
0.302 GC
N
f-1586420743
f
GR
GS
[1 0 0 1 206.08142 98.99921] CT
0.302 GC
N
f-1586420743
f
GR
GS
[1 0 0 1 199.49164 119.85623] CT
0.302 GC
N
f-1586420743
f
GR
GS
[1 0 0 1 198.22795 82.52973] CT
0.302 GC
N
f-1586420743
f
GR
GS
[1 0 0 1 201.16318 110.67992] CT
0.302 GC
N
f-1586420743
f
GR
GS
[1 0 0 1 205.56577 132.61197] CT
0.302 GC
N
f-1586420743
f
GR
GS
[1 0 0 1 202.39642 135.72353] CT
0.302 GC
N
f-1586420743
f
GR
GS
[1 0 0 1 204.93953 131.38078] CT
0.302 GC
N
f-1586420743
f
GR
GS
[1 0 0 1 198.35054 174.2901] CT
0.302 GC
N
f-1586420743
f
GR
GS
[1 0 0 1 197.29922 123.23304] CT
0.302 GC
N
f-1586420743
f
GR
GS
[1 0 0 1 204.7019 78.89624] CT
0.302 GC
N
f-1586420743
f
GR
GS
[1 0 0 1 202.48631 177] CT
0.302 GC
N
f-1586420743
f
GR
GS
[1 0 0 1 201.95221 146.11635] CT
0.302 GC
N
f-1586420743
f
GR
GS
[1 0 0 1 204.38895 172.53613] CT
0.302 GC
N
f-1586420743
f
GR
GS
[1 0 0 1 198.28937 96.31568] CT
0.302 GC
N
f-1586420743
f
GR
GS
[1 0 0 1 199.58727 174.93381] CT
0.302 GC
N
f-1586420743
f
GR
GS
[1 0 0 1 197.75101 127.02325] CT
0.302 GC
N
f-1586420743
f
GR
GS
[1 0 0 1 200.9765 138.56335] CT
0.302 GC
N
f-1586420743
f
GR
GS
[1 0 0 1 201.18129 97.58019] CT
0.302 GC
N
f-1586420743
f
GR
GS
[1 0 0 1 205.94597 169.47723] CT
0.302 GC
N
f-1586420743
f
GR
GS
[1 0 0 1 196.76109 161.25543] CT
0.302 GC
N
f-1586420743
f
GR
GS
[1 0 0 1 203.85783 133.50235] CT
0.302 GC
N
f-1586420743
f
GR
GS
[1 0 0 1 199.09138 156.9527] CT
0.302 GC
N
f-1586420743
f
GR
GS
[1 0 0 1 198.94675 166.98311] CT
0.302 GC
N
f-1586420743
f
GR
GS
[1 0 0 1 195.84407 126.9278] CT
0.302 GC
N
f-1586420743
f
GR
GS
[1 0 0 1 196.03653 168.12695] CT
0.302 GC
N
f-1586420743
f
GR
GS
[1 0 0 1 200.6973 91.93775] CT
0.302 GC
N
f-1586420743
f
GR
GS
[1 0 0 1 199.32031 134.3219] CT
0.302 GC
N
f-1586420743
f
GR
GS
[1 0 0 1 205.94003 114.33305] CT
0.302 GC
N
f-1586420743
f
GR
GS
[1 0 0 1 204.06238 117.21069] CT
0.302 GC
N
f-1586420743
f
GR
GS
0.6 0.8 1 RC
N
/f-1273330954{220.35 41.871 M
220.35 88.256 L
245.15 88.256 L
245.15 41.871 L
cp}def
f-1273330954
f
GR
GS
[1 0 0 1 238.63441 85.99012] CT
0.302 GC
N
f-1586420743
f
GR
GS
[1 0 0 1 236.52792 102.95728] CT
0.302 GC
N
f-1586420743
f
GR
GS
[1 0 0 1 226.79796 82.80778] CT
0.302 GC
N
f-1586420743
f
GR
GS
[1 0 0 1 232.70346 52.41377] CT
0.302 GC
N
f-1586420743
f
GR
GS
[1 0 0 1 236.34735 114.52692] CT
0.302 GC
N
f-1586420743
f
GR
GS
[1 0 0 1 234.72887 76.33798] CT
0.302 GC
N
f-1586420743
f
GR
GS
[1 0 0 1 237.09006 104.73925] CT
0.302 GC
N
f-1586420743
f
GR
GS
[1 0 0 1 236.43842 89.95134] CT
0.302 GC
N
f-1586420743
f
GR
GS
[1 0 0 1 234.48393 94.3817] CT
0.302 GC
N
f-1586420743
f
GR
GS
[1 0 0 1 234.37254 92.5316] CT
0.302 GC
N
f-1586420743
f
GR
GS
[1 0 0 1 235.62289 101.49245] CT
0.302 GC
N
f-1586420743
f
GR
GS
[1 0 0 1 234.96042 71.83952] CT
0.302 GC
N
f-1586420743
f
GR
GS
[1 0 0 1 227.95825 136.90019] CT
0.302 GC
N
f-1586420743
f
GR
GS
[1 0 0 1 236.49976 99.69863] CT
0.302 GC
N
f-1586420743
f
GR
GS
[1 0 0 1 230.83881 88.95686] CT
0.302 GC
N
f-1586420743
f
GR
GS
[1 0 0 1 232.7692 122.6459] CT
0.302 GC
N
f-1586420743
f
GR
GS
[1 0 0 1 232.6781 89.32977] CT
0.302 GC
N
f-1586420743
f
GR
GS
[1 0 0 1 231.41202 91.26016] CT
0.302 GC
N
f-1586420743
f
GR
GS
[1 0 0 1 232.63089 75.73316] CT
0.302 GC
N
f-1586420743
f
GR
GS
[1 0 0 1 237.01163 49.13311] CT
0.302 GC
N
f-1586420743
f
GR
GS
[1 0 0 1 233.28239 85.40166] CT
0.302 GC
N
f-1586420743
f
GR
GS
[1 0 0 1 227.20963 92.96523] CT
0.302 GC
N
f-1586420743
f
GR
GS
[1 0 0 1 230.15567 78.92516] CT
0.302 GC
N
f-1586420743
f
GR
GS
[1 0 0 1 232.36824 67.61819] CT
0.302 GC
N
f-1586420743
f
GR
GS
[1 0 0 1 227.37411 80.44051] CT
0.302 GC
N
f-1586420743
f
GR
GS
[1 0 0 1 231.12788 100.53043] CT
0.302 GC
N
f-1586420743
f
GR
GS
[1 0 0 1 235.61409 117.15245] CT
0.302 GC
N
f-1586420743
f
GR
GS
[1 0 0 1 232.74355 87.38791] CT
0.302 GC
N
f-1586420743
f
GR
GS
[1 0 0 1 236.67444 116.28672] CT
0.302 GC
N
f-1586420743
f
GR
GS
[1 0 0 1 232.51181 118.50772] CT
0.302 GC
N
f-1586420743
f
GR
GS
[1 0 0 1 232.48927 65.52858] CT
0.302 GC
N
f-1586420743
f
GR
GS
[1 0 0 1 238.62457 112.15979] CT
0.302 GC
N
f-1586420743
f
GR
GS
[1 0 0 1 234.1918 67.2647] CT
0.302 GC
N
f-1586420743
f
GR
GS
[1 0 0 1 229.93741 92.38682] CT
0.302 GC
N
f-1586420743
f
GR
GS
[1 0 0 1 226.82948 84.4719] CT
0.302 GC
N
f-1586420743
f
GR
GS
[1 0 0 1 228.01375 73.76839] CT
0.302 GC
N
f-1586420743
f
GR
GS
[1 0 0 1 228.89995 60.49303] CT
0.302 GC
N
f-1586420743
f
GR
GS
[1 0 0 1 237.69171 82.13701] CT
0.302 GC
N
f-1586420743
f
GR
GS
[1 0 0 1 235.38846 88.06117] CT
0.302 GC
N
f-1586420743
f
GR
GS
[1 0 0 1 236.22891 96.15488] CT
0.302 GC
N
f-1586420743
f
GR
GS
[1 0 0 1 236.9167 41.5] CT
0.302 GC
N
f-1586420743
f
GR
GS
[1 0 0 1 229.44849 68.18755] CT
0.302 GC
N
f-1586420743
f
GR
GS
[1 0 0 1 229.54533 97.73405] CT
0.302 GC
N
f-1586420743
f
GR
GS
[1 0 0 1 232.46184 93.78767] CT
0.302 GC
N
f-1586420743
f
GR
GS
[1 0 0 1 234.5928 79.5118] CT
0.302 GC
N
f-1586420743
f
GR
GS
[1 0 0 1 233.97243 85.67855] CT
0.302 GC
N
f-1586420743
f
GR
GS
[1 0 0 1 232.93889 89.68029] CT
0.302 GC
N
f-1586420743
f
GR
GS
[1 0 0 1 227.62318 92.88254] CT
0.302 GC
N
f-1586420743
f
GR
GS
[1 0 0 1 235.11809 111.51562] CT
0.302 GC
N
f-1586420743
f
GR
GS
[1 0 0 1 230.67564 73.67433] CT
0.302 GC
N
f-1586420743
f
GR
GS
[1 0 0 1 235.8985 114.67893] CT
0.302 GC
N
f-1586420743
f
GR
GS
[1 0 0 1 232.68767 68.42487] CT
0.302 GC
N
f-1586420743
f
GR
GS
[1 0 0 1 231.28299 69.05774] CT
0.302 GC
N
f-1586420743
f
GR
GS
1 GC
N
/f804697734{54 378 M
131.5 378 L
131.5 243 L
54 243 L
cp}def
f804697734
f
GR
GS
0.149 GC
2 setlinecap
1 LJ
0.5 LW
N
54 378 M
131.5 378 L
S
GR
GS
0.149 GC
2 setlinecap
1 LJ
0.5 LW
N
77.25 378 M
77.25 376.65 L
S
GR
GS
0.149 GC
2 setlinecap
1 LJ
0.5 LW
N
108.25 378 M
108.25 376.65 L
S
GR
GS
[1 0 0 1 77.25 384] CT
0.149 GC
/Helvetica 20 F
GS
[1 0 0 1 0 0] CT
-13 20 moveto 
1 -1 scale
(YA) t 
GR
GR
GS
[1 0 0 1 108.25 384] CT
0.149 GC
/Helvetica 20 F
GS
[1 0 0 1 0 0] CT
-14.5 20 moveto 
1 -1 scale
(OA) t 
GR
GR
GS
0.149 GC
2 setlinecap
1 LJ
0.5 LW
N
54 378 M
54 243 L
S
GR
GS
0.149 GC
2 setlinecap
1 LJ
0.5 LW
N
54 356.166 M
55.35 356.166 L
S
GR
GS
0.149 GC
2 setlinecap
1 LJ
0.5 LW
N
54 299.583 M
55.35 299.583 L
S
GR
GS
0.149 GC
2 setlinecap
1 LJ
0.5 LW
N
54 243 M
55.35 243 L
S
GR
GS
[1 0 0 1 48 356.16608] CT
0.149 GC
/Helvetica 20 F
GS
[1 0 0 1 0 0] CT
-12 7.5 moveto 
1 -1 scale
(0) t 
GR
GR
GS
[1 0 0 1 48 299.58304] CT
0.149 GC
/Helvetica 20 F
GS
[1 0 0 1 0 0] CT
-23 7.5 moveto 
1 -1 scale
(10) t 
GR
GR
GS
[1 0 0 1 48 243] CT
0.149 GC
/Helvetica 20 F
GS
[1 0 0 1 0 0] CT
-23 7.5 moveto 
1 -1 scale
(20) t 
GR
GR
GS
[1 0 0 1 54 238] CT
0.149 GC
N
2.938 -0.578 M
2.938 -0.734 3.031 -0.859 QT
7.203 -5 L
3.031 -9.156 L
2.938 -9.266 2.938 -9.422 QT
2.938 -9.578 3.055 -9.703 QT
3.172 -9.828 3.344 -9.828 QT
3.484 -9.828 3.641 -9.703 QT
7.781 -5.563 L
11.906 -9.703 L
12.078 -9.828 12.203 -9.828 QT
12.359 -9.828 12.477 -9.711 QT
12.594 -9.594 12.594 -9.422 QT
12.594 -9.266 12.5 -9.156 QT
8.344 -5 L
12.5 -0.859 L
12.594 -0.734 12.594 -0.578 QT
12.594 -0.406 12.477 -0.289 QT
12.359 -0.172 12.203 -0.172 QT
12.047 -0.172 11.906 -0.328 QT
7.781 -4.438 L
3.641 -0.328 L
3.5 -0.172 3.344 -0.172 QT
3.172 -0.172 3.055 -0.305 QT
2.938 -0.438 2.938 -0.578 QT
cp
f
GR
GS
[1 0 0 1 70 238] CT
0.149 GC
/Helvetica 20 F
GS
[1 0 0 1 0 0] CT
0 0 moveto 
1 -1 scale
(10) t 
GR
GR
GS
[1 0 0 1 93 228] CT
0.149 GC
/Helvetica 16 F
GS
[1 0 0 1 0 0] CT
0 0 moveto 
1 -1 scale
(-6) t 
GR
GR
GS
[1 0 0 1 92.75009 240.5] CT
/Helvetica-Bold 20 F
GS
[1 0 0 1 0 0] CT
-52.5 -5 moveto 
1 -1 scale
(p = 4.5e-05) t 
GR
GR
GS
0.149 GC
1 LJ
0.5 LW
N
54 356.166 M
131.5 356.166 L
S
GR
GS
1 0.6 0.6 RC
N
/f-977016542{89.65 356.166 M
89.65 315.52 L
64.85 315.52 L
64.85 356.166 L
cp}def
f-977016542
f
GR
GS
[1 0 0 1 75.65418 359.18549] CT
0.302 GC
N
f-1586420743
f
GR
GS
[1 0 0 1 72.538 316.95313] CT
0.302 GC
N
f-1586420743
f
GR
GS
[1 0 0 1 82.11906 346.59885] CT
0.302 GC
N
f-1586420743
f
GR
GS
[1 0 0 1 71.97635 338.15836] CT
0.302 GC
N
f-1586420743
f
GR
GS
[1 0 0 1 74.0384 362.40332] CT
0.302 GC
N
f-1586420743
f
GR
GS
[1 0 0 1 72.49726 354.53525] CT
0.302 GC
N
f-1586420743
f
GR
GS
[1 0 0 1 83.4447 318.50519] CT
0.302 GC
N
f-1586420743
f
GR
GS
[1 0 0 1 78.68729 314.95691] CT
0.302 GC
N
f-1586420743
f
GR
GS
[1 0 0 1 75.67513 339.88211] CT
0.302 GC
N
f-1586420743
f
GR
GS
[1 0 0 1 82.15185 313.39127] CT
0.302 GC
N
f-1586420743
f
GR
GS
[1 0 0 1 73.90754 328.86542] CT
0.302 GC
N
f-1586420743
f
GR
GS
[1 0 0 1 82.19631 293.55612] CT
0.302 GC
N
f-1586420743
f
GR
GS
[1 0 0 1 78.28558 348.85474] CT
0.302 GC
N
f-1586420743
f
GR
GS
[1 0 0 1 80.62812 323.07254] CT
0.302 GC
N
f-1586420743
f
GR
GS
[1 0 0 1 81.23751 366.311] CT
0.302 GC
N
f-1586420743
f
GR
GS
[1 0 0 1 78.4955 339.22318] CT
0.302 GC
N
f-1586420743
f
GR
GS
[1 0 0 1 77.94549 325.63394] CT
0.302 GC
N
f-1586420743
f
GR
GS
[1 0 0 1 74.85791 321.30344] CT
0.302 GC
N
f-1586420743
f
GR
GS
[1 0 0 1 75.83582 296.92505] CT
0.302 GC
N
f-1586420743
f
GR
GS
[1 0 0 1 80.3429 326.58975] CT
0.302 GC
N
f-1586420743
f
GR
GS
[1 0 0 1 80.31015 334.23239] CT
0.302 GC
N
f-1586420743
f
GR
GS
[1 0 0 1 76.30686 315.36002] CT
0.302 GC
N
f-1586420743
f
GR
GS
[1 0 0 1 73.50903 323.51437] CT
0.302 GC
N
f-1586420743
f
GR
GS
[1 0 0 1 75.90616 378] CT
0.302 GC
N
f-1586420743
f
GR
GS
[1 0 0 1 75.54305 294.08179] CT
0.302 GC
N
f-1586420743
f
GR
GS
[1 0 0 1 76.48277 288.61902] CT
0.302 GC
N
f-1586420743
f
GR
GS
[1 0 0 1 71.82607 295.23355] CT
0.302 GC
N
f-1586420743
f
GR
GS
[1 0 0 1 77.77067 265.46533] CT
0.302 GC
N
f-1586420743
f
GR
GS
[1 0 0 1 80.65029 287.58786] CT
0.302 GC
N
f-1586420743
f
GR
GS
[1 0 0 1 77.03397 260.53644] CT
0.302 GC
N
f-1586420743
f
GR
GS
[1 0 0 1 72.5629 314.48734] CT
0.302 GC
N
f-1586420743
f
GR
GS
[1 0 0 1 73.2557 246.54778] CT
0.302 GC
N
f-1586420743
f
GR
GS
[1 0 0 1 75.33874 279.39548] CT
0.302 GC
N
f-1586420743
f
GR
GS
[1 0 0 1 73.93422 306.72397] CT
0.302 GC
N
f-1586420743
f
GR
GS
[1 0 0 1 72.68093 323.72205] CT
0.302 GC
N
f-1586420743
f
GR
GS
[1 0 0 1 81.28234 308.76053] CT
0.302 GC
N
f-1586420743
f
GR
GS
[1 0 0 1 75.06237 318.24481] CT
0.302 GC
N
f-1586420743
f
GR
GS
[1 0 0 1 77.92484 246.54778] CT
0.302 GC
N
f-1586420743
f
GR
GS
[1 0 0 1 71.72833 332.01645] CT
0.302 GC
N
f-1586420743
f
GR
GS
[1 0 0 1 80.63059 282.00406] CT
0.302 GC
N
f-1586420743
f
GR
GS
[1 0 0 1 81.6394 296.50229] CT
0.302 GC
N
f-1586420743
f
GR
GS
[1 0 0 1 82.87949 319.36188] CT
0.302 GC
N
f-1586420743
f
GR
GS
1 0.6 0.6 RC
N
/f270432168{120.65 356.166 M
120.65 336.934 L
95.85 336.934 L
95.85 356.166 L
cp}def
f270432168
f
GR
GS
[1 0 0 1 113.59881 313.04556] CT
0.302 GC
N
f-1586420743
f
GR
GS
[1 0 0 1 108.24895 321.12134] CT
0.302 GC
N
f-1586420743
f
GR
GS
[1 0 0 1 110.15057 301.69434] CT
0.302 GC
N
f-1586420743
f
GR
GS
[1 0 0 1 105.99141 350.45023] CT
0.302 GC
N
f-1586420743
f
GR
GS
[1 0 0 1 110.26813 320.28217] CT
0.302 GC
N
f-1586420743
f
GR
GS
[1 0 0 1 103.53419 346.63235] CT
0.302 GC
N
f-1586420743
f
GR
GS
[1 0 0 1 108.35701 345.69443] CT
0.302 GC
N
f-1586420743
f
GR
GS
[1 0 0 1 109.67392 343.39804] CT
0.302 GC
N
f-1586420743
f
GR
GS
[1 0 0 1 114.26028 319.04803] CT
0.302 GC
N
f-1586420743
f
GR
GS
[1 0 0 1 104.10663 319.38913] CT
0.302 GC
N
f-1586420743
f
GR
GS
[1 0 0 1 102.42683 358.5271] CT
0.302 GC
N
f-1586420743
f
GR
GS
[1 0 0 1 106.54099 352.0773] CT
0.302 GC
N
f-1586420743
f
GR
GS
[1 0 0 1 110.94833 337.80731] CT
0.302 GC
N
f-1586420743
f
GR
GS
[1 0 0 1 113.77437 344.40039] CT
0.302 GC
N
f-1586420743
f
GR
GS
[1 0 0 1 111.02586 359.66422] CT
0.302 GC
N
f-1586420743
f
GR
GS
[1 0 0 1 103.79263 331.17834] CT
0.302 GC
N
f-1586420743
f
GR
GS
[1 0 0 1 105.38483 344.40384] CT
0.302 GC
N
f-1586420743
f
GR
GS
[1 0 0 1 108.41348 325.31369] CT
0.302 GC
N
f-1586420743
f
GR
GS
[1 0 0 1 106.18887 356.63834] CT
0.302 GC
N
f-1586420743
f
GR
GS
[1 0 0 1 102.40553 303.0365] CT
0.302 GC
N
f-1586420743
f
GR
GS
[1 0 0 1 106.05163 356.87152] CT
0.302 GC
N
f-1586420743
f
GR
GS
[1 0 0 1 108.07322 333.41458] CT
0.302 GC
N
f-1586420743
f
GR
GS
[1 0 0 1 111.5518 340.7178] CT
0.302 GC
N
f-1586420743
f
GR
GS
[1 0 0 1 106.35722 336.40887] CT
0.302 GC
N
f-1586420743
f
GR
GS
[1 0 0 1 110.06455 331.41568] CT
0.302 GC
N
f-1586420743
f
GR
GS
[1 0 0 1 110.4205 313.11807] CT
0.302 GC
N
f-1586420743
f
GR
GS
[1 0 0 1 105.0332 301.69434] CT
0.302 GC
N
f-1586420743
f
GR
GS
[1 0 0 1 109.11186 341.70377] CT
0.302 GC
N
f-1586420743
f
GR
GS
[1 0 0 1 109.55059 328.19754] CT
0.302 GC
N
f-1586420743
f
GR
GS
[1 0 0 1 106.12448 350.49033] CT
0.302 GC
N
f-1586420743
f
GR
GS
[1 0 0 1 105.00243 325.8819] CT
0.302 GC
N
f-1586420743
f
GR
GS
[1 0 0 1 103.96088 321.16345] CT
0.302 GC
N
f-1586420743
f
GR
GS
[1 0 0 1 109.14093 320.64667] CT
0.302 GC
N
f-1586420743
f
GR
GS
[1 0 0 1 105.32809 333.27634] CT
0.302 GC
N
f-1586420743
f
GR
GS
[1 0 0 1 106.42709 377.32562] CT
0.302 GC
N
f-1586420743
f
GR
GS
[1 0 0 1 108.49525 301.69434] CT
0.302 GC
N
f-1586420743
f
GR
GS
[1 0 0 1 105.71788 346.07736] CT
0.302 GC
N
f-1586420743
f
GR
GS
[1 0 0 1 113.10443 339.10965] CT
0.302 GC
N
f-1586420743
f
GR
GS
[1 0 0 1 113.3647 347.43866] CT
0.302 GC
N
f-1586420743
f
GR
GS
[1 0 0 1 106.27144 344.71664] CT
0.302 GC
N
f-1586420743
f
GR
GS
[1 0 0 1 108.80729 352.79578] CT
0.302 GC
N
f-1586420743
f
GR
GS
[1 0 0 1 105.93487 329.4346] CT
0.302 GC
N
f-1586420743
f
GR
GS
[1 0 0 1 106.12473 350.11209] CT
0.302 GC
N
f-1586420743
f
GR
GS
[1 0 0 1 108.13585 366.8299] CT
0.302 GC
N
f-1586420743
f
GR
GS
[1 0 0 1 113.00667 353.29984] CT
0.302 GC
N
f-1586420743
f
GR
GS
[1 0 0 1 113.90538 362.1936] CT
0.302 GC
N
f-1586420743
f
GR
GS
[1 0 0 1 110.35088 327.06946] CT
0.302 GC
N
f-1586420743
f
GR
GS
[1 0 0 1 113.44704 360.15659] CT
0.302 GC
N
f-1586420743
f
GR
GS
[1 0 0 1 107.65927 352.18948] CT
0.302 GC
N
f-1586420743
f
GR
GS
[1 0 0 1 113.75539 337.95633] CT
0.302 GC
N
f-1586420743
f
GR
GS
[1 0 0 1 112.36848 332.28406] CT
0.302 GC
N
f-1586420743
f
GR
GS
[1 0 0 1 105.62263 325.49765] CT
0.302 GC
N
f-1586420743
f
GR
GS
[1 0 0 1 105.05003 322.50027] CT
0.302 GC
N
f-1586420743
f
GR
GS
1 GC
N
/f2144424418{178.5 378 M
256 378 L
256 243 L
178.5 243 L
cp}def
f2144424418
f
GR
GS
0.149 GC
2 setlinecap
1 LJ
0.5 LW
N
178.5 378 M
256 378 L
S
GR
GS
0.149 GC
2 setlinecap
1 LJ
0.5 LW
N
201.75 378 M
201.75 376.65 L
S
GR
GS
0.149 GC
2 setlinecap
1 LJ
0.5 LW
N
232.75 378 M
232.75 376.65 L
S
GR
GS
[1 0 0 1 201.75 384] CT
0.149 GC
/Helvetica 20 F
GS
[1 0 0 1 0 0] CT
-13 20 moveto 
1 -1 scale
(YA) t 
GR
GR
GS
[1 0 0 1 232.75 384] CT
0.149 GC
/Helvetica 20 F
GS
[1 0 0 1 0 0] CT
-14.5 20 moveto 
1 -1 scale
(OA) t 
GR
GR
GS
0.149 GC
2 setlinecap
1 LJ
0.5 LW
N
178.5 378 M
178.5 243 L
S
GR
GS
0.149 GC
2 setlinecap
1 LJ
0.5 LW
N
178.5 359.999 M
179.85 359.999 L
S
GR
GS
0.149 GC
2 setlinecap
1 LJ
0.5 LW
N
178.5 330.671 M
179.85 330.671 L
S
GR
GS
0.149 GC
2 setlinecap
1 LJ
0.5 LW
N
178.5 301.343 M
179.85 301.343 L
S
GR
GS
0.149 GC
2 setlinecap
1 LJ
0.5 LW
N
178.5 272.015 M
179.85 272.015 L
S
GR
GS
[1 0 0 1 172.5 359.99933] CT
0.149 GC
/Helvetica 20 F
GS
[1 0 0 1 0 0] CT
-19 7.5 moveto 
1 -1 scale
(-6) t 
GR
GR
GS
[1 0 0 1 172.5 330.67111] CT
0.149 GC
/Helvetica 20 F
GS
[1 0 0 1 0 0] CT
-19 7.5 moveto 
1 -1 scale
(-4) t 
GR
GR
GS
[1 0 0 1 172.5 301.34286] CT
0.149 GC
/Helvetica 20 F
GS
[1 0 0 1 0 0] CT
-19 7.5 moveto 
1 -1 scale
(-2) t 
GR
GR
GS
[1 0 0 1 172.5 272.01465] CT
0.149 GC
/Helvetica 20 F
GS
[1 0 0 1 0 0] CT
-12 7.5 moveto 
1 -1 scale
(0) t 
GR
GR
GS
[1 0 0 1 179 238] CT
0.149 GC
N
/f682067884{2.938 -0.578 M
2.938 -0.734 3.031 -0.859 QT
7.203 -5 L
3.031 -9.156 L
2.938 -9.266 2.938 -9.422 QT
2.938 -9.578 3.055 -9.703 QT
3.172 -9.828 3.344 -9.828 QT
3.484 -9.828 3.641 -9.703 QT
7.781 -5.563 L
11.906 -9.703 L
12.078 -9.828 12.203 -9.828 QT
12.359 -9.828 12.477 -9.711 QT
12.594 -9.594 12.594 -9.422 QT
12.594 -9.266 12.5 -9.156 QT
8.344 -5 L
12.5 -0.859 L
12.594 -0.734 12.594 -0.578 QT
12.594 -0.406 12.477 -0.289 QT
12.359 -0.172 12.203 -0.172 QT
12.047 -0.172 11.906 -0.328 QT
7.781 -4.438 L
3.641 -0.328 L
3.5 -0.172 3.344 -0.172 QT
3.172 -0.172 3.055 -0.305 QT
2.938 -0.438 2.938 -0.578 QT
cp}def
f682067884
f
GR
GS
[1 0 0 1 195 238] CT
0.149 GC
/Helvetica 20 F
GS
[1 0 0 1 0 0] CT
0 0 moveto 
1 -1 scale
(10) t 
GR
GR
GS
[1 0 0 1 218 228] CT
0.149 GC
/Helvetica 16 F
GS
[1 0 0 1 0 0] CT
0 0 moveto 
1 -1 scale
(-6) t 
GR
GR
GS
[1 0 0 1 217.25021 240.5] CT
/Helvetica-Bold 20 F
GS
[1 0 0 1 0 0] CT
-52.5 -5 moveto 
1 -1 scale
(p = 2.8e-05) t 
GR
GR
GS
0.149 GC
1 LJ
0.5 LW
N
178.5 272.015 M
256 272.015 L
S
GR
GS
0.6 0.8 1 RC
N
/f-1934439538{189.35 272.015 M
189.35 305.393 L
214.15 305.393 L
214.15 272.015 L
cp}def
f-1934439538
f
GR
GS
[1 0 0 1 201.88792 262.21558] CT
0.302 GC
N
f-1586420743
f
GR
GS
[1 0 0 1 200.37706 306.60544] CT
0.302 GC
N
f-1586420743
f
GR
GS
[1 0 0 1 207.61819 273.39465] CT
0.302 GC
N
f-1586420743
f
GR
GS
[1 0 0 1 197.43063 303.19751] CT
0.302 GC
N
f-1586420743
f
GR
GS
[1 0 0 1 201.2235 273.52621] CT
0.302 GC
N
f-1586420743
f
GR
GS
[1 0 0 1 196.26344 246.83656] CT
0.302 GC
N
f-1586420743
f
GR
GS
[1 0 0 1 200.48975 298.59256] CT
0.302 GC
N
f-1586420743
f
GR
GS
[1 0 0 1 206.90303 298.62836] CT
0.302 GC
N
f-1586420743
f
GR
GS
[1 0 0 1 207.91524 284.85587] CT
0.302 GC
N
f-1586420743
f
GR
GS
[1 0 0 1 203.468 305.58447] CT
0.302 GC
N
f-1586420743
f
GR
GS
[1 0 0 1 200.74283 322.52374] CT
0.302 GC
N
f-1586420743
f
GR
GS
[1 0 0 1 199.9108 332.612] CT
0.302 GC
N
f-1586420743
f
GR
GS
[1 0 0 1 204.93604 277.06265] CT
0.302 GC
N
f-1586420743
f
GR
GS
[1 0 0 1 203.68404 285.04108] CT
0.302 GC
N
f-1586420743
f
GR
GS
[1 0 0 1 201.01663 248.84261] CT
0.302 GC
N
f-1586420743
f
GR
GS
[1 0 0 1 205.71143 287.53592] CT
0.302 GC
N
f-1586420743
f
GR
GS
[1 0 0 1 202.16389 308.84042] CT
0.302 GC
N
f-1586420743
f
GR
GS
[1 0 0 1 207.73535 309.94772] CT
0.302 GC
N
f-1586420743
f
GR
GS
[1 0 0 1 200.15289 313.98645] CT
0.302 GC
N
f-1586420743
f
GR
GS
[1 0 0 1 197.58356 292.35089] CT
0.302 GC
N
f-1586420743
f
GR
GS
[1 0 0 1 196.2755 302.12027] CT
0.302 GC
N
f-1586420743
f
GR
GS
[1 0 0 1 197.72972 321.51083] CT
0.302 GC
N
f-1586420743
f
GR
GS
[1 0 0 1 206.5649 289.37131] CT
0.302 GC
N
f-1586420743
f
GR
GS
[1 0 0 1 205.33636 246.83656] CT
0.302 GC
N
f-1586420743
f
GR
GS
[1 0 0 1 205.03239 306.47269] CT
0.302 GC
N
f-1586420743
f
GR
GS
[1 0 0 1 198.16754 326.29724] CT
0.302 GC
N
f-1586420743
f
GR
GS
[1 0 0 1 202.13481 323.93896] CT
0.302 GC
N
f-1586420743
f
GR
GS
[1 0 0 1 195.83646 328.42056] CT
0.302 GC
N
f-1586420743
f
GR
GS
[1 0 0 1 205.04558 349.57645] CT
0.302 GC
N
f-1586420743
f
GR
GS
[1 0 0 1 205.42538 349.66483] CT
0.302 GC
N
f-1586420743
f
GR
GS
[1 0 0 1 201.26352 285.8125] CT
0.302 GC
N
f-1586420743
f
GR
GS
[1 0 0 1 204.03703 378] CT
0.302 GC
N
f-1586420743
f
GR
GS
[1 0 0 1 203.38229 334.47238] CT
0.302 GC
N
f-1586420743
f
GR
GS
[1 0 0 1 205.27972 312.47519] CT
0.302 GC
N
f-1586420743
f
GR
GS
[1 0 0 1 198.79448 290.32047] CT
0.302 GC
N
f-1586420743
f
GR
GS
[1 0 0 1 207.30595 310.94714] CT
0.302 GC
N
f-1586420743
f
GR
GS
[1 0 0 1 203.66058 292.61417] CT
0.302 GC
N
f-1586420743
f
GR
GS
[1 0 0 1 201.14755 347.70908] CT
0.302 GC
N
f-1586420743
f
GR
GS
[1 0 0 1 198.51318 291.0556] CT
0.302 GC
N
f-1586420743
f
GR
GS
[1 0 0 1 199.81963 322.98068] CT
0.302 GC
N
f-1586420743
f
GR
GS
[1 0 0 1 198.75711 353.88239] CT
0.302 GC
N
f-1586420743
f
GR
GS
[1 0 0 1 197.51158 329.84549] CT
0.302 GC
N
f-1586420743
f
GR
GS
0.6 0.8 1 RC
N
/f-1097468210{220.35 272.015 M
220.35 284.049 L
245.15 284.049 L
245.15 272.015 L
cp}def
f-1097468210
f
GR
GS
[1 0 0 1 227.70837 313.06287] CT
0.302 GC
N
f-1586420743
f
GR
GS
[1 0 0 1 228.43947 290.75806] CT
0.302 GC
N
f-1586420743
f
GR
GS
[1 0 0 1 230.63235 321.60901] CT
0.302 GC
N
f-1586420743
f
GR
GS
[1 0 0 1 228.30951 276.82617] CT
0.302 GC
N
f-1586420743
f
GR
GS
[1 0 0 1 232.64447 288.54935] CT
0.302 GC
N
f-1586420743
f
GR
GS
[1 0 0 1 232.33426 268.70773] CT
0.302 GC
N
f-1586420743
f
GR
GS
[1 0 0 1 233.93193 283.89859] CT
0.302 GC
N
f-1586420743
f
GR
GS
[1 0 0 1 234.83655 279.65213] CT
0.302 GC
N
f-1586420743
f
GR
GS
[1 0 0 1 231.10129 294.6188] CT
0.302 GC
N
f-1586420743
f
GR
GS
[1 0 0 1 227.77023 294.04233] CT
0.302 GC
N
f-1586420743
f
GR
GS
[1 0 0 1 234.38353 274.31665] CT
0.302 GC
N
f-1586420743
f
GR
GS
[1 0 0 1 227.6187 276.33505] CT
0.302 GC
N
f-1586420743
f
GR
GS
[1 0 0 1 226.68112 272.91937] CT
0.302 GC
N
f-1586420743
f
GR
GS
[1 0 0 1 230.0668 280.57004] CT
0.302 GC
N
f-1586420743
f
GR
GS
[1 0 0 1 228.19899 277.12265] CT
0.302 GC
N
f-1586420743
f
GR
GS
[1 0 0 1 229.7785 297.77255] CT
0.302 GC
N
f-1586420743
f
GR
GS
[1 0 0 1 234.85942 289.52502] CT
0.302 GC
N
f-1586420743
f
GR
GS
[1 0 0 1 230.08942 292.44571] CT
0.302 GC
N
f-1586420743
f
GR
GS
[1 0 0 1 232.81207 268.25345] CT
0.302 GC
N
f-1586420743
f
GR
GS
[1 0 0 1 229.06134 259.92389] CT
0.302 GC
N
f-1586420743
f
GR
GS
[1 0 0 1 229.57263 275.72] CT
0.302 GC
N
f-1586420743
f
GR
GS
[1 0 0 1 229.63078 297.12894] CT
0.302 GC
N
f-1586420743
f
GR
GS
[1 0 0 1 231.16728 280.56039] CT
0.302 GC
N
f-1586420743
f
GR
GS
[1 0 0 1 237.83313 288.82312] CT
0.302 GC
N
f-1586420743
f
GR
GS
[1 0 0 1 232.21472 282.19305] CT
0.302 GC
N
f-1586420743
f
GR
GS
[1 0 0 1 227.13974 271.4577] CT
0.302 GC
N
f-1586420743
f
GR
GS
[1 0 0 1 235.04265 314.20486] CT
0.302 GC
N
f-1586420743
f
GR
GS
[1 0 0 1 235.91997 270.62436] CT
0.302 GC
N
f-1586420743
f
GR
GS
[1 0 0 1 235.62842 310.5502] CT
0.302 GC
N
f-1586420743
f
GR
GS
[1 0 0 1 230.60457 285.44556] CT
0.302 GC
N
f-1586420743
f
GR
GS
[1 0 0 1 235.79155 288.00366] CT
0.302 GC
N
f-1586420743
f
GR
GS
[1 0 0 1 237.22319 296.85889] CT
0.302 GC
N
f-1586420743
f
GR
GS
[1 0 0 1 235.28618 321.60901] CT
0.302 GC
N
f-1586420743
f
GR
GS
[1 0 0 1 232.96855 286.65933] CT
0.302 GC
N
f-1586420743
f
GR
GS
[1 0 0 1 235.06332 243] CT
0.302 GC
N
f-1586420743
f
GR
GS
[1 0 0 1 234.0695 321.60901] CT
0.302 GC
N
f-1586420743
f
GR
GS
[1 0 0 1 238.39807 263.92026] CT
0.302 GC
N
f-1586420743
f
GR
GS
[1 0 0 1 235.83231 290.59442] CT
0.302 GC
N
f-1586420743
f
GR
GS
[1 0 0 1 230.56058 266.86456] CT
0.302 GC
N
f-1586420743
f
GR
GS
[1 0 0 1 233.22971 285.44055] CT
0.302 GC
N
f-1586420743
f
GR
GS
[1 0 0 1 227.84137 277.94717] CT
0.302 GC
N
f-1586420743
f
GR
GS
[1 0 0 1 230.10063 277.19833] CT
0.302 GC
N
f-1586420743
f
GR
GS
[1 0 0 1 230.75589 272.46143] CT
0.302 GC
N
f-1586420743
f
GR
GS
[1 0 0 1 236.79008 263.24771] CT
0.302 GC
N
f-1586420743
f
GR
GS
[1 0 0 1 228.03387 259.08942] CT
0.302 GC
N
f-1586420743
f
GR
GS
[1 0 0 1 231.86365 270.67487] CT
0.302 GC
N
f-1586420743
f
GR
GS
[1 0 0 1 236.11786 321.60901] CT
0.302 GC
N
f-1586420743
f
GR
GS
[1 0 0 1 230.89149 270.29645] CT
0.302 GC
N
f-1586420743
f
GR
GS
[1 0 0 1 230.36299 283.23926] CT
0.302 GC
N
f-1586420743
f
GR
GS
[1 0 0 1 233.03506 263.83566] CT
0.302 GC
N
f-1586420743
f
GR
GS
[1 0 0 1 238.14575 278.25751] CT
0.302 GC
N
f-1586420743
f
GR
GS
[1 0 0 1 237.86044 297.59845] CT
0.302 GC
N
f-1586420743
f
GR
GS
[1 0 0 1 231.90173 276.96631] CT
0.302 GC
N
f-1586420743
f
GR
%%Trailer
%%Pages: 1
%%EOF
