%!PS-Adobe-3.0 EPSF-3.0
%%Creator: (MATLAB, The Mathworks, Inc. Version 9.8.0.1323502 \(R2020a\). Operating System: Mac OS X)
%%Title: /Users/kosciessa/Desktop/mntTardisLNDG/LNDG/stateswitch/stsw_multimodal/figures/l1byage/l1comp_cpp.eps
%%CreationDate: 2022-03-02T14:36:44
%%Pages: (atend)
%%BoundingBox:     4     0   180   278
%%LanguageLevel: 3
%%EndComments
%%BeginProlog
%%BeginResource: procset (Apache XML Graphics Std ProcSet) 1.2 0
%%Version: 1.2 0
%%Copyright: (Copyright 2001-2003,2010 The Apache Software Foundation. License terms: http://www.apache.org/licenses/LICENSE-2.0)
/bd{bind def}bind def
/ld{load def}bd
/GR/grestore ld
/GS/gsave ld
/RM/rmoveto ld
/C/curveto ld
/t/show ld
/L/lineto ld
/ML/setmiterlimit ld
/CT/concat ld
/f/fill ld
/N/newpath ld
/S/stroke ld
/CC/setcmykcolor ld
/A/ashow ld
/cp/closepath ld
/RC/setrgbcolor ld
/LJ/setlinejoin ld
/GC/setgray ld
/LW/setlinewidth ld
/M/moveto ld
/re {4 2 roll M
1 index 0 rlineto
0 exch rlineto
neg 0 rlineto
cp } bd
/_ctm matrix def
/_tm matrix def
/BT { _ctm currentmatrix pop matrix _tm copy pop 0 0 moveto } bd
/ET { _ctm setmatrix } bd
/iTm { _ctm setmatrix _tm concat } bd
/Tm { _tm astore pop iTm 0 0 moveto } bd
/ux 0.0 def
/uy 0.0 def
/F {
  /Tp exch def
  /Tf exch def
  Tf findfont Tp scalefont setfont
  /cf Tf def  /cs Tp def
} bd
/ULS {currentpoint /uy exch def /ux exch def} bd
/ULE {
  /Tcx currentpoint pop def
  gsave
  newpath
  cf findfont cs scalefont dup
  /FontMatrix get 0 get /Ts exch def /FontInfo get dup
  /UnderlinePosition get Ts mul /To exch def
  /UnderlineThickness get Ts mul /Tt exch def
  ux uy To add moveto  Tcx uy To add lineto
  Tt setlinewidth stroke
  grestore
} bd
/OLE {
  /Tcx currentpoint pop def
  gsave
  newpath
  cf findfont cs scalefont dup
  /FontMatrix get 0 get /Ts exch def /FontInfo get dup
  /UnderlinePosition get Ts mul /To exch def
  /UnderlineThickness get Ts mul /Tt exch def
  ux uy To add cs add moveto Tcx uy To add cs add lineto
  Tt setlinewidth stroke
  grestore
} bd
/SOE {
  /Tcx currentpoint pop def
  gsave
  newpath
  cf findfont cs scalefont dup
  /FontMatrix get 0 get /Ts exch def /FontInfo get dup
  /UnderlinePosition get Ts mul /To exch def
  /UnderlineThickness get Ts mul /Tt exch def
  ux uy To add cs 10 mul 26 idiv add moveto Tcx uy To add cs 10 mul 26 idiv add lineto
  Tt setlinewidth stroke
  grestore
} bd
/QT {
/Y22 exch store
/X22 exch store
/Y21 exch store
/X21 exch store
currentpoint
/Y21 load 2 mul add 3 div exch
/X21 load 2 mul add 3 div exch
/X21 load 2 mul /X22 load add 3 div
/Y21 load 2 mul /Y22 load add 3 div
/X22 load /Y22 load curveto
} bd
/SSPD {
dup length /d exch dict def
{
/v exch def
/k exch def
currentpagedevice k known {
/cpdv currentpagedevice k get def
v cpdv ne {
/upd false def
/nullv v type /nulltype eq def
/nullcpdv cpdv type /nulltype eq def
nullv nullcpdv or
{
/upd true def
} {
/sametype v type cpdv type eq def
sametype {
v type /arraytype eq {
/vlen v length def
/cpdvlen cpdv length def
vlen cpdvlen eq {
0 1 vlen 1 sub {
/i exch def
/obj v i get def
/cpdobj cpdv i get def
obj cpdobj ne {
/upd true def
exit
} if
} for
} {
/upd true def
} ifelse
} {
v type /dicttype eq {
v {
/dv exch def
/dk exch def
/cpddv cpdv dk get def
dv cpddv ne {
/upd true def
exit
} if
} forall
} {
/upd true def
} ifelse
} ifelse
} if
} ifelse
upd true eq {
d k v put
} if
} if
} if
} forall
d length 0 gt {
d setpagedevice
} if
} bd
/RE { % /NewFontName [NewEncodingArray] /FontName RE -
  findfont dup length dict begin
  {
    1 index /FID ne
    {def} {pop pop} ifelse
  } forall
  /Encoding exch def
  /FontName 1 index def
  currentdict definefont pop
  end
} bind def
%%EndResource
%%BeginResource: procset (Apache XML Graphics EPS ProcSet) 1.0 0
%%Version: 1.0 0
%%Copyright: (Copyright 2002-2003 The Apache Software Foundation. License terms: http://www.apache.org/licenses/LICENSE-2.0)
/BeginEPSF { %def
/b4_Inc_state save def         % Save state for cleanup
/dict_count countdictstack def % Count objects on dict stack
/op_count count 1 sub def      % Count objects on operand stack
userdict begin                 % Push userdict on dict stack
/showpage { } def              % Redefine showpage, { } = null proc
0 setgray 0 setlinecap         % Prepare graphics state
1 setlinewidth 0 setlinejoin
10 setmiterlimit [ ] 0 setdash newpath
/languagelevel where           % If level not equal to 1 then
{pop languagelevel             % set strokeadjust and
1 ne                           % overprint to their defaults.
{false setstrokeadjust false setoverprint
} if
} if
} bd
/EndEPSF { %def
count op_count sub {pop} repeat            % Clean up stacks
countdictstack dict_count sub {end} repeat
b4_Inc_state restore
} bd
%%EndResource
%FOPBeginFontDict
%%IncludeResource: font Courier-Oblique
%%IncludeResource: font Courier-BoldOblique
%%IncludeResource: font Courier-Bold
%%IncludeResource: font ZapfDingbats
%%IncludeResource: font Symbol
%%IncludeResource: font Helvetica
%%IncludeResource: font Helvetica-Oblique
%%IncludeResource: font Helvetica-Bold
%%IncludeResource: font Helvetica-BoldOblique
%%IncludeResource: font Times-Roman
%%IncludeResource: font Times-Italic
%%IncludeResource: font Times-Bold
%%IncludeResource: font Times-BoldItalic
%%IncludeResource: font Courier
%FOPEndFontDict
%%BeginResource: encoding WinAnsiEncoding
/WinAnsiEncoding [
/.notdef /.notdef /.notdef /.notdef /.notdef
/.notdef /.notdef /.notdef /.notdef /.notdef
/.notdef /.notdef /.notdef /.notdef /.notdef
/.notdef /.notdef /.notdef /.notdef /.notdef
/.notdef /.notdef /.notdef /.notdef /.notdef
/.notdef /.notdef /.notdef /.notdef /.notdef
/.notdef /.notdef /space /exclam /quotedbl
/numbersign /dollar /percent /ampersand /quotesingle
/parenleft /parenright /asterisk /plus /comma
/hyphen /period /slash /zero /one
/two /three /four /five /six
/seven /eight /nine /colon /semicolon
/less /equal /greater /question /at
/A /B /C /D /E
/F /G /H /I /J
/K /L /M /N /O
/P /Q /R /S /T
/U /V /W /X /Y
/Z /bracketleft /backslash /bracketright /asciicircum
/underscore /quoteleft /a /b /c
/d /e /f /g /h
/i /j /k /l /m
/n /o /p /q /r
/s /t /u /v /w
/x /y /z /braceleft /bar
/braceright /asciitilde /bullet /Euro /bullet
/quotesinglbase /florin /quotedblbase /ellipsis /dagger
/daggerdbl /circumflex /perthousand /Scaron /guilsinglleft
/OE /bullet /Zcaron /bullet /bullet
/quoteleft /quoteright /quotedblleft /quotedblright /bullet
/endash /emdash /asciitilde /trademark /scaron
/guilsinglright /oe /bullet /zcaron /Ydieresis
/space /exclamdown /cent /sterling /currency
/yen /brokenbar /section /dieresis /copyright
/ordfeminine /guillemotleft /logicalnot /sfthyphen /registered
/macron /degree /plusminus /twosuperior /threesuperior
/acute /mu /paragraph /middot /cedilla
/onesuperior /ordmasculine /guillemotright /onequarter /onehalf
/threequarters /questiondown /Agrave /Aacute /Acircumflex
/Atilde /Adieresis /Aring /AE /Ccedilla
/Egrave /Eacute /Ecircumflex /Edieresis /Igrave
/Iacute /Icircumflex /Idieresis /Eth /Ntilde
/Ograve /Oacute /Ocircumflex /Otilde /Odieresis
/multiply /Oslash /Ugrave /Uacute /Ucircumflex
/Udieresis /Yacute /Thorn /germandbls /agrave
/aacute /acircumflex /atilde /adieresis /aring
/ae /ccedilla /egrave /eacute /ecircumflex
/edieresis /igrave /iacute /icircumflex /idieresis
/eth /ntilde /ograve /oacute /ocircumflex
/otilde /odieresis /divide /oslash /ugrave
/uacute /ucircumflex /udieresis /yacute /thorn
/ydieresis
] def
%%EndResource
%FOPBeginFontReencode
/Courier-Oblique findfont
dup length dict begin
  {1 index /FID ne {def} {pop pop} ifelse} forall
  /Encoding WinAnsiEncoding def
  currentdict
end
/Courier-Oblique exch definefont pop
/Courier-BoldOblique findfont
dup length dict begin
  {1 index /FID ne {def} {pop pop} ifelse} forall
  /Encoding WinAnsiEncoding def
  currentdict
end
/Courier-BoldOblique exch definefont pop
/Courier-Bold findfont
dup length dict begin
  {1 index /FID ne {def} {pop pop} ifelse} forall
  /Encoding WinAnsiEncoding def
  currentdict
end
/Courier-Bold exch definefont pop
/Helvetica findfont
dup length dict begin
  {1 index /FID ne {def} {pop pop} ifelse} forall
  /Encoding WinAnsiEncoding def
  currentdict
end
/Helvetica exch definefont pop
/Helvetica-Oblique findfont
dup length dict begin
  {1 index /FID ne {def} {pop pop} ifelse} forall
  /Encoding WinAnsiEncoding def
  currentdict
end
/Helvetica-Oblique exch definefont pop
/Helvetica-Bold findfont
dup length dict begin
  {1 index /FID ne {def} {pop pop} ifelse} forall
  /Encoding WinAnsiEncoding def
  currentdict
end
/Helvetica-Bold exch definefont pop
/Helvetica-BoldOblique findfont
dup length dict begin
  {1 index /FID ne {def} {pop pop} ifelse} forall
  /Encoding WinAnsiEncoding def
  currentdict
end
/Helvetica-BoldOblique exch definefont pop
/Times-Roman findfont
dup length dict begin
  {1 index /FID ne {def} {pop pop} ifelse} forall
  /Encoding WinAnsiEncoding def
  currentdict
end
/Times-Roman exch definefont pop
/Times-Italic findfont
dup length dict begin
  {1 index /FID ne {def} {pop pop} ifelse} forall
  /Encoding WinAnsiEncoding def
  currentdict
end
/Times-Italic exch definefont pop
/Times-Bold findfont
dup length dict begin
  {1 index /FID ne {def} {pop pop} ifelse} forall
  /Encoding WinAnsiEncoding def
  currentdict
end
/Times-Bold exch definefont pop
/Times-BoldItalic findfont
dup length dict begin
  {1 index /FID ne {def} {pop pop} ifelse} forall
  /Encoding WinAnsiEncoding def
  currentdict
end
/Times-BoldItalic exch definefont pop
/Courier findfont
dup length dict begin
  {1 index /FID ne {def} {pop pop} ifelse} forall
  /Encoding WinAnsiEncoding def
  currentdict
end
/Courier exch definefont pop
%FOPEndFontReencode
%%EndProlog
%%Page: 1 1
%%PageBoundingBox: 0 0 198 283
%%BeginPageSetup
[1 0 0 -1 0 283] CT
%%EndPageSetup
GS
[1.00215 0 0 1 0 0] CT
1 GC
N
0 0 198 283 re
f
GR
GS
[1.00215 0 0 1 0 0] CT
1 GC
N
0 0 198 283 re
f
GR
GS
[1.00215 0 0 1 0 0] CT
1 GC
N
55.5 228 M
179 228 L
179 32 L
55.5 32 L
cp
f
GR
GS
[1.00215 0 0 1 0 0] CT
0.149 GC
2 setlinecap
1 LJ
0.5 LW
N
55.5 228 M
179 228 L
S
GR
GS
[1.00215 0 0 1 0 0] CT
0.149 GC
2 setlinecap
1 LJ
0.5 LW
N
92.55 228 M
92.55 226.04 L
S
GR
GS
[1.00215 0 0 1 0 0] CT
0.149 GC
2 setlinecap
1 LJ
0.5 LW
N
141.95 228 M
141.95 226.04 L
S
GR
GS
[1.00215 0 0 1 92.74875 234] CT
0.149 GC
/Helvetica 20 F
GS
[1 0 0 1 0 0] CT
-13 20 moveto 
1 -1 scale
(YA) t 
GR
GR
GS
[1.00215 0 0 1 142.25483 234] CT
0.149 GC
/Helvetica 20 F
GS
[1 0 0 1 0 0] CT
-14.5 20 moveto 
1 -1 scale
(OA) t 
GR
GR
GS
[1.00215 0 0 1 117.50185 259] CT
0.149 GC
/Helvetica 20 F
GS
[1 0 0 1 0 0] CT
-49 20 moveto 
1 -1 scale
(Age Group) t 
GR
GR
GS
[1.00215 0 0 1 0 0] CT
0.149 GC
2 setlinecap
1 LJ
0.5 LW
N
55.5 228 M
55.5 32 L
S
GR
GS
[1.00215 0 0 1 0 0] CT
0.149 GC
2 setlinecap
1 LJ
0.5 LW
N
55.5 228 M
57.46 228 L
S
GR
GS
[1.00215 0 0 1 0 0] CT
0.149 GC
2 setlinecap
1 LJ
0.5 LW
N
55.5 188.8 M
57.46 188.8 L
S
GR
GS
[1.00215 0 0 1 0 0] CT
0.149 GC
2 setlinecap
1 LJ
0.5 LW
N
55.5 149.6 M
57.46 149.6 L
S
GR
GS
[1.00215 0 0 1 0 0] CT
0.149 GC
2 setlinecap
1 LJ
0.5 LW
N
55.5 110.4 M
57.46 110.4 L
S
GR
GS
[1.00215 0 0 1 0 0] CT
0.149 GC
2 setlinecap
1 LJ
0.5 LW
N
55.5 71.2 M
57.46 71.2 L
S
GR
GS
[1.00215 0 0 1 0 0] CT
0.149 GC
2 setlinecap
1 LJ
0.5 LW
N
55.5 32 M
57.46 32 L
S
GR
GS
[1.00215 0 0 1 49.6063 228] CT
0.149 GC
/Helvetica 20 F
GS
[1 0 0 1 0 0] CT
-19 7.5 moveto 
1 -1 scale
(-5) t 
GR
GR
GS
[1.00215 0 0 1 49.6063 188.8] CT
0.149 GC
/Helvetica 20 F
GS
[1 0 0 1 0 0] CT
-12 7.5 moveto 
1 -1 scale
(0) t 
GR
GR
GS
[1.00215 0 0 1 49.6063 149.60001] CT
0.149 GC
/Helvetica 20 F
GS
[1 0 0 1 0 0] CT
-12 7.5 moveto 
1 -1 scale
(5) t 
GR
GR
GS
[1.00215 0 0 1 49.6063 110.4] CT
0.149 GC
/Helvetica 20 F
GS
[1 0 0 1 0 0] CT
-23 7.5 moveto 
1 -1 scale
(10) t 
GR
GR
GS
[1.00215 0 0 1 49.6063 71.2] CT
0.149 GC
/Helvetica 20 F
GS
[1 0 0 1 0 0] CT
-23 7.5 moveto 
1 -1 scale
(15) t 
GR
GR
GS
[1.00215 0 0 1 49.6063 32] CT
0.149 GC
/Helvetica 20 F
GS
[1 0 0 1 0 0] CT
-23 7.5 moveto 
1 -1 scale
(20) t 
GR
GR
GS
[0 -1 1.00215 0 24.05154 129.99991] CT
0.149 GC
/Helvetica 20 F
GS
[1 0 0 1 0 0] CT
-28 -5 moveto 
1 -1 scale
(cpp l1) t 
GR
GR
GS
[1.00215 0 0 1 56.12026 27] CT
0.149 GC
N
2.938 -0.578 M
2.938 -0.734 3.031 -0.859 QT
7.203 -5 L
3.031 -9.156 L
2.938 -9.266 2.938 -9.422 QT
2.938 -9.578 3.055 -9.703 QT
3.172 -9.828 3.344 -9.828 QT
3.484 -9.828 3.641 -9.703 QT
7.781 -5.563 L
11.906 -9.703 L
12.078 -9.828 12.203 -9.828 QT
12.359 -9.828 12.477 -9.711 QT
12.594 -9.594 12.594 -9.422 QT
12.594 -9.266 12.5 -9.156 QT
8.344 -5 L
12.5 -0.859 L
12.594 -0.734 12.594 -0.578 QT
12.594 -0.406 12.477 -0.289 QT
12.359 -0.172 12.203 -0.172 QT
12.047 -0.172 11.906 -0.328 QT
7.781 -4.438 L
3.641 -0.328 L
3.5 -0.172 3.344 -0.172 QT
3.172 -0.172 3.055 -0.305 QT
2.938 -0.438 2.938 -0.578 QT
cp
f
GR
GS
[1.00215 0 0 1 72.15462 27] CT
0.149 GC
/Helvetica 20 F
GS
[1 0 0 1 0 0] CT
0 0 moveto 
1 -1 scale
(10) t 
GR
GR
GS
[1.00215 0 0 1 95.20401 17] CT
0.149 GC
/Helvetica 16 F
GS
[1 0 0 1 0 0] CT
0 0 moveto 
1 -1 scale
(-6) t 
GR
GR
GS
[1.00215 0 0 1 117.50191 29.25001] CT
/Helvetica-Bold 22 F
GS
[1 0 0 1 0 0] CT
-58 -5 moveto 
1 -1 scale
(p = 4.5e-05) t 
GR
GR
GS
[1.00215 0 0 1 0 0] CT
0.149 GC
1 LJ
0.5 LW
N
55.5 188.8 M
179 188.8 L
S
GR
GS
[1.00215 0 0 1 0 0] CT
1 0.6 0.6 RC
N
112.31 188.8 M
112.31 132.482 L
72.79 132.482 L
72.79 188.8 L
cp
f
GR
GS
[1.00215 0 0 1 85.63045 192.98361] CT
0.302 GC
N
2.236 0 M
2.236 -1.235 1.235 -2.236 0 -2.236 C
-1.235 -2.236 -2.236 -1.235 -2.236 0 C
-2.236 1.235 -1.235 2.236 0 2.236 C
1.235 2.236 2.236 1.235 2.236 0 C
cp
f
GR
GS
[1.00215 0 0 1 88.17316 134.46756] CT
0.302 GC
N
/f-1586420743{2.236 0 M
2.236 -1.235 1.235 -2.236 0 -2.236 C
-1.235 -2.236 -2.236 -1.235 -2.236 0 C
-2.236 1.235 -1.235 2.236 0 2.236 C
1.235 2.236 2.236 1.235 2.236 0 C
cp}def
f-1586420743
f
GR
GS
[1.00215 0 0 1 93.00981 175.54391] CT
0.302 GC
N
f-1586420743
f
GR
GS
[1.00215 0 0 1 89.45719 163.84895] CT
0.302 GC
N
f-1586420743
f
GR
GS
[1.00215 0 0 1 83.41531 197.44217] CT
0.302 GC
N
f-1586420743
f
GR
GS
[1.00215 0 0 1 89.23802 186.54039] CT
0.302 GC
N
f-1586420743
f
GR
GS
[1.00215 0 0 1 92.46644 136.61806] CT
0.302 GC
N
f-1586420743
f
GR
GS
[1.00215 0 0 1 98.02162 131.70163] CT
0.302 GC
N
f-1586420743
f
GR
GS
[1.00215 0 0 1 89.72602 166.23735] CT
0.302 GC
N
f-1586420743
f
GR
GS
[1.00215 0 0 1 95.64653 129.53235] CT
0.302 GC
N
f-1586420743
f
GR
GS
[1.00215 0 0 1 96.21498 150.97292] CT
0.302 GC
N
f-1586420743
f
GR
GS
[1.00215 0 0 1 87.61161 102.04927] CT
0.302 GC
N
f-1586420743
f
GR
GS
[1.00215 0 0 1 94.12511 178.66963] CT
0.302 GC
N
f-1586420743
f
GR
GS
[1.00215 0 0 1 94.82575 142.94644] CT
0.302 GC
N
f-1586420743
f
GR
GS
[1.00215 0 0 1 89.35436 202.85657] CT
0.302 GC
N
f-1586420743
f
GR
GS
[1.00215 0 0 1 87.56247 165.32437] CT
0.302 GC
N
f-1586420743
f
GR
GS
[1.00215 0 0 1 85.89915 146.49545] CT
0.302 GC
N
f-1586420743
f
GR
GS
[1.00215 0 0 1 94.17154 140.49522] CT
0.302 GC
N
f-1586420743
f
GR
GS
[1.00215 0 0 1 88.08256 106.71716] CT
0.302 GC
N
f-1586420743
f
GR
GS
[1.00215 0 0 1 89.83761 147.81981] CT
0.302 GC
N
f-1586420743
f
GR
GS
[1.00215 0 0 1 93.1404 158.40927] CT
0.302 GC
N
f-1586420743
f
GR
GS
[1.00215 0 0 1 88.70503 132.26019] CT
0.302 GC
N
f-1586420743
f
GR
GS
[1.00215 0 0 1 100.50113 143.55865] CT
0.302 GC
N
f-1586420743
f
GR
GS
[1.00215 0 0 1 100.91678 219.05254] CT
0.302 GC
N
f-1586420743
f
GR
GS
[1.00215 0 0 1 89.58904 102.7776] CT
0.302 GC
N
f-1586420743
f
GR
GS
[1.00215 0 0 1 93.63872 95.20854] CT
0.302 GC
N
f-1586420743
f
GR
GS
[1.00215 0 0 1 89.05155 104.37346] CT
0.302 GC
N
f-1586420743
f
GR
GS
[1.00215 0 0 1 89.35475 63.12741] CT
0.302 GC
N
f-1586420743
f
GR
GS
[1.00215 0 0 1 92.56645 93.77982] CT
0.302 GC
N
f-1586420743
f
GR
GS
[1.00215 0 0 1 100.34501 56.29804] CT
0.302 GC
N
f-1586420743
f
GR
GS
[1.00215 0 0 1 101.78022 131.05103] CT
0.302 GC
N
f-1586420743
f
GR
GS
[1.00215 0 0 1 96.1038 36.91571] CT
0.302 GC
N
f-1586420743
f
GR
GS
[1.00215 0 0 1 101.04828 82.42865] CT
0.302 GC
N
f-1586420743
f
GR
GS
[1.00215 0 0 1 91.80537 120.29431] CT
0.302 GC
N
f-1586420743
f
GR
GS
[1.00215 0 0 1 101.54068 143.84637] CT
0.302 GC
N
f-1586420743
f
GR
GS
[1.00215 0 0 1 99.32586 123.11612] CT
0.302 GC
N
f-1586420743
f
GR
GS
[1.00215 0 0 1 88.55293 136.25728] CT
0.302 GC
N
f-1586420743
f
GR
GS
[1.00215 0 0 1 87.63848 36.91571] CT
0.302 GC
N
f-1586420743
f
GR
GS
[1.00215 0 0 1 92.96902 155.33891] CT
0.302 GC
N
f-1586420743
f
GR
GS
[1.00215 0 0 1 90.55622 86.04302] CT
0.302 GC
N
f-1586420743
f
GR
GS
[1.00215 0 0 1 102.12009 106.13141] CT
0.302 GC
N
f-1586420743
f
GR
GS
[1.00215 0 0 1 85.85085 137.80504] CT
0.302 GC
N
f-1586420743
f
GR
GS
[1.00215 0 0 1 0 0] CT
1 0.6 0.6 RC
N
/f325923086{161.71 188.8 M
161.71 162.152 L
122.19 162.152 L
122.19 188.8 L
cp}def
f325923086
f
GR
GS
[1.00215 0 0 1 141.41401 129.05333] CT
0.302 GC
N
f-1586420743
f
GR
GS
[1.00215 0 0 1 133.49297 140.24292] CT
0.302 GC
N
f-1586420743
f
GR
GS
[1.00215 0 0 1 140.24225 113.32536] CT
0.302 GC
N
f-1586420743
f
GR
GS
[1.00215 0 0 1 150.48408 180.88026] CT
0.302 GC
N
f-1586420743
f
GR
GS
[1.00215 0 0 1 152.10053 139.0802] CT
0.302 GC
N
f-1586420743
f
GR
GS
[1.00215 0 0 1 144.99843 175.59035] CT
0.302 GC
N
f-1586420743
f
GR
GS
[1.00215 0 0 1 140.6464 174.29077] CT
0.302 GC
N
f-1586420743
f
GR
GS
[1.00215 0 0 1 139.31768 171.10895] CT
0.302 GC
N
f-1586420743
f
GR
GS
[1.00215 0 0 1 147.34285 137.37021] CT
0.302 GC
N
f-1586420743
f
GR
GS
[1.00215 0 0 1 145.34344 137.84283] CT
0.302 GC
N
f-1586420743
f
GR
GS
[1.00215 0 0 1 141.08368 192.07141] CT
0.302 GC
N
f-1586420743
f
GR
GS
[1.00215 0 0 1 148.58112 183.13474] CT
0.302 GC
N
f-1586420743
f
GR
GS
[1.00215 0 0 1 142.91581 163.36256] CT
0.302 GC
N
f-1586420743
f
GR
GS
[1.00215 0 0 1 151.81326 172.49779] CT
0.302 GC
N
f-1586420743
f
GR
GS
[1.00215 0 0 1 139.70429 193.64693] CT
0.302 GC
N
f-1586420743
f
GR
GS
[1.00215 0 0 1 135.60115 154.17766] CT
0.302 GC
N
f-1586420743
f
GR
GS
[1.00215 0 0 1 133.51222 172.50258] CT
0.302 GC
N
f-1586420743
f
GR
GS
[1.00215 0 0 1 135.83456 146.05173] CT
0.302 GC
N
f-1586420743
f
GR
GS
[1.00215 0 0 1 149.94408 189.45438] CT
0.302 GC
N
f-1586420743
f
GR
GS
[1.00215 0 0 1 147.98215 115.18504] CT
0.302 GC
N
f-1586420743
f
GR
GS
[1.00215 0 0 1 147.49673 189.77745] CT
0.302 GC
N
f-1586420743
f
GR
GS
[1.00215 0 0 1 136.53376 157.27611] CT
0.302 GC
N
f-1586420743
f
GR
GS
[1.00215 0 0 1 142.86935 167.39529] CT
0.302 GC
N
f-1586420743
f
GR
GS
[1.00215 0 0 1 132.81109 161.42496] CT
0.302 GC
N
f-1586420743
f
GR
GS
[1.00215 0 0 1 147.51779 154.50652] CT
0.302 GC
N
f-1586420743
f
GR
GS
[1.00215 0 0 1 148.12431 129.15382] CT
0.302 GC
N
f-1586420743
f
GR
GS
[1.00215 0 0 1 141.47794 113.32536] CT
0.302 GC
N
f-1586420743
f
GR
GS
[1.00215 0 0 1 145.90717 168.76138] CT
0.302 GC
N
f-1586420743
f
GR
GS
[1.00215 0 0 1 144.86155 150.04752] CT
0.302 GC
N
f-1586420743
f
GR
GS
[1.00215 0 0 1 147.8917 180.93585] CT
0.302 GC
N
f-1586420743
f
GR
GS
[1.00215 0 0 1 137.53496 146.83905] CT
0.302 GC
N
f-1586420743
f
GR
GS
[1.00215 0 0 1 151.12754 140.30128] CT
0.302 GC
N
f-1586420743
f
GR
GS
[1.00215 0 0 1 145.30597 139.58524] CT
0.302 GC
N
f-1586420743
f
GR
GS
[1.00215 0 0 1 141.29273 157.08456] CT
0.302 GC
N
f-1586420743
f
GR
GS
[1.00215 0 0 1 137.08574 218.11815] CT
0.302 GC
N
f-1586420743
f
GR
GS
[1.00215 0 0 1 139.17208 113.32536] CT
0.302 GC
N
f-1586420743
f
GR
GS
[1.00215 0 0 1 137.47529 174.82135] CT
0.302 GC
N
f-1586420743
f
GR
GS
[1.00215 0 0 1 135.48621 165.16707] CT
0.302 GC
N
f-1586420743
f
GR
GS
[1.00215 0 0 1 134.20352 176.70753] CT
0.302 GC
N
f-1586420743
f
GR
GS
[1.00215 0 0 1 135.37106 172.93599] CT
0.302 GC
N
f-1586420743
f
GR
GS
[1.00215 0 0 1 138.87301 184.13023] CT
0.302 GC
N
f-1586420743
f
GR
GS
[1.00215 0 0 1 135.16349 151.76158] CT
0.302 GC
N
f-1586420743
f
GR
GS
[1.00215 0 0 1 142.0863 180.41174] CT
0.302 GC
N
f-1586420743
f
GR
GS
[1.00215 0 0 1 141.59092 203.5755] CT
0.302 GC
N
f-1586420743
f
GR
GS
[1.00215 0 0 1 144.14235 184.82861] CT
0.302 GC
N
f-1586420743
f
GR
GS
[1.00215 0 0 1 145.58698 197.1516] CT
0.302 GC
N
f-1586420743
f
GR
GS
[1.00215 0 0 1 139.62189 148.48448] CT
0.302 GC
N
f-1586420743
f
GR
GS
[1.00215 0 0 1 134.30229 194.32918] CT
0.302 GC
N
f-1586420743
f
GR
GS
[1.00215 0 0 1 144.86354 183.29016] CT
0.302 GC
N
f-1586420743
f
GR
GS
[1.00215 0 0 1 134.0603 163.56905] CT
0.302 GC
N
f-1586420743
f
GR
GS
[1.00215 0 0 1 132.563 155.7097] CT
0.302 GC
N
f-1586420743
f
GR
GS
[1.00215 0 0 1 137.96985 146.30663] CT
0.302 GC
N
f-1586420743
f
GR
GS
[1.00215 0 0 1 134.98701 142.15353] CT
0.302 GC
N
f-1586420743
f
GR
%%Trailer
%%Pages: 1
%%EOF
