%!PS-Adobe-3.0 EPSF-3.0
%%Creator: (MATLAB, The Mathworks, Inc. Version 9.8.0.1323502 \(R2020a\). Operating System: Mac OS X)
%%Title: /Users/kosciessa/Desktop/mntTardisLNDG/LNDG/stateswitch/stsw_multimodal/figures/linearbyage/linearcomp_gamma.eps
%%CreationDate: 2022-03-03T16:32:26
%%Pages: (atend)
%%BoundingBox:     4     0   180   275
%%LanguageLevel: 3
%%EndComments
%%BeginProlog
%%BeginResource: procset (Apache XML Graphics Std ProcSet) 1.2 0
%%Version: 1.2 0
%%Copyright: (Copyright 2001-2003,2010 The Apache Software Foundation. License terms: http://www.apache.org/licenses/LICENSE-2.0)
/bd{bind def}bind def
/ld{load def}bd
/GR/grestore ld
/GS/gsave ld
/RM/rmoveto ld
/C/curveto ld
/t/show ld
/L/lineto ld
/ML/setmiterlimit ld
/CT/concat ld
/f/fill ld
/N/newpath ld
/S/stroke ld
/CC/setcmykcolor ld
/A/ashow ld
/cp/closepath ld
/RC/setrgbcolor ld
/LJ/setlinejoin ld
/GC/setgray ld
/LW/setlinewidth ld
/M/moveto ld
/re {4 2 roll M
1 index 0 rlineto
0 exch rlineto
neg 0 rlineto
cp } bd
/_ctm matrix def
/_tm matrix def
/BT { _ctm currentmatrix pop matrix _tm copy pop 0 0 moveto } bd
/ET { _ctm setmatrix } bd
/iTm { _ctm setmatrix _tm concat } bd
/Tm { _tm astore pop iTm 0 0 moveto } bd
/ux 0.0 def
/uy 0.0 def
/F {
  /Tp exch def
  /Tf exch def
  Tf findfont Tp scalefont setfont
  /cf Tf def  /cs Tp def
} bd
/ULS {currentpoint /uy exch def /ux exch def} bd
/ULE {
  /Tcx currentpoint pop def
  gsave
  newpath
  cf findfont cs scalefont dup
  /FontMatrix get 0 get /Ts exch def /FontInfo get dup
  /UnderlinePosition get Ts mul /To exch def
  /UnderlineThickness get Ts mul /Tt exch def
  ux uy To add moveto  Tcx uy To add lineto
  Tt setlinewidth stroke
  grestore
} bd
/OLE {
  /Tcx currentpoint pop def
  gsave
  newpath
  cf findfont cs scalefont dup
  /FontMatrix get 0 get /Ts exch def /FontInfo get dup
  /UnderlinePosition get Ts mul /To exch def
  /UnderlineThickness get Ts mul /Tt exch def
  ux uy To add cs add moveto Tcx uy To add cs add lineto
  Tt setlinewidth stroke
  grestore
} bd
/SOE {
  /Tcx currentpoint pop def
  gsave
  newpath
  cf findfont cs scalefont dup
  /FontMatrix get 0 get /Ts exch def /FontInfo get dup
  /UnderlinePosition get Ts mul /To exch def
  /UnderlineThickness get Ts mul /Tt exch def
  ux uy To add cs 10 mul 26 idiv add moveto Tcx uy To add cs 10 mul 26 idiv add lineto
  Tt setlinewidth stroke
  grestore
} bd
/QT {
/Y22 exch store
/X22 exch store
/Y21 exch store
/X21 exch store
currentpoint
/Y21 load 2 mul add 3 div exch
/X21 load 2 mul add 3 div exch
/X21 load 2 mul /X22 load add 3 div
/Y21 load 2 mul /Y22 load add 3 div
/X22 load /Y22 load curveto
} bd
/SSPD {
dup length /d exch dict def
{
/v exch def
/k exch def
currentpagedevice k known {
/cpdv currentpagedevice k get def
v cpdv ne {
/upd false def
/nullv v type /nulltype eq def
/nullcpdv cpdv type /nulltype eq def
nullv nullcpdv or
{
/upd true def
} {
/sametype v type cpdv type eq def
sametype {
v type /arraytype eq {
/vlen v length def
/cpdvlen cpdv length def
vlen cpdvlen eq {
0 1 vlen 1 sub {
/i exch def
/obj v i get def
/cpdobj cpdv i get def
obj cpdobj ne {
/upd true def
exit
} if
} for
} {
/upd true def
} ifelse
} {
v type /dicttype eq {
v {
/dv exch def
/dk exch def
/cpddv cpdv dk get def
dv cpddv ne {
/upd true def
exit
} if
} forall
} {
/upd true def
} ifelse
} ifelse
} if
} ifelse
upd true eq {
d k v put
} if
} if
} if
} forall
d length 0 gt {
d setpagedevice
} if
} bd
/RE { % /NewFontName [NewEncodingArray] /FontName RE -
  findfont dup length dict begin
  {
    1 index /FID ne
    {def} {pop pop} ifelse
  } forall
  /Encoding exch def
  /FontName 1 index def
  currentdict definefont pop
  end
} bind def
%%EndResource
%%BeginResource: procset (Apache XML Graphics EPS ProcSet) 1.0 0
%%Version: 1.0 0
%%Copyright: (Copyright 2002-2003 The Apache Software Foundation. License terms: http://www.apache.org/licenses/LICENSE-2.0)
/BeginEPSF { %def
/b4_Inc_state save def         % Save state for cleanup
/dict_count countdictstack def % Count objects on dict stack
/op_count count 1 sub def      % Count objects on operand stack
userdict begin                 % Push userdict on dict stack
/showpage { } def              % Redefine showpage, { } = null proc
0 setgray 0 setlinecap         % Prepare graphics state
1 setlinewidth 0 setlinejoin
10 setmiterlimit [ ] 0 setdash newpath
/languagelevel where           % If level not equal to 1 then
{pop languagelevel             % set strokeadjust and
1 ne                           % overprint to their defaults.
{false setstrokeadjust false setoverprint
} if
} if
} bd
/EndEPSF { %def
count op_count sub {pop} repeat            % Clean up stacks
countdictstack dict_count sub {end} repeat
b4_Inc_state restore
} bd
%%EndResource
%FOPBeginFontDict
%%IncludeResource: font Courier-Oblique
%%IncludeResource: font Courier-BoldOblique
%%IncludeResource: font Courier-Bold
%%IncludeResource: font ZapfDingbats
%%IncludeResource: font Symbol
%%IncludeResource: font Helvetica
%%IncludeResource: font Helvetica-Oblique
%%IncludeResource: font Helvetica-Bold
%%IncludeResource: font Helvetica-BoldOblique
%%IncludeResource: font Times-Roman
%%IncludeResource: font Times-Italic
%%IncludeResource: font Times-Bold
%%IncludeResource: font Times-BoldItalic
%%IncludeResource: font Courier
%FOPEndFontDict
%%BeginResource: encoding WinAnsiEncoding
/WinAnsiEncoding [
/.notdef /.notdef /.notdef /.notdef /.notdef
/.notdef /.notdef /.notdef /.notdef /.notdef
/.notdef /.notdef /.notdef /.notdef /.notdef
/.notdef /.notdef /.notdef /.notdef /.notdef
/.notdef /.notdef /.notdef /.notdef /.notdef
/.notdef /.notdef /.notdef /.notdef /.notdef
/.notdef /.notdef /space /exclam /quotedbl
/numbersign /dollar /percent /ampersand /quotesingle
/parenleft /parenright /asterisk /plus /comma
/hyphen /period /slash /zero /one
/two /three /four /five /six
/seven /eight /nine /colon /semicolon
/less /equal /greater /question /at
/A /B /C /D /E
/F /G /H /I /J
/K /L /M /N /O
/P /Q /R /S /T
/U /V /W /X /Y
/Z /bracketleft /backslash /bracketright /asciicircum
/underscore /quoteleft /a /b /c
/d /e /f /g /h
/i /j /k /l /m
/n /o /p /q /r
/s /t /u /v /w
/x /y /z /braceleft /bar
/braceright /asciitilde /bullet /Euro /bullet
/quotesinglbase /florin /quotedblbase /ellipsis /dagger
/daggerdbl /circumflex /perthousand /Scaron /guilsinglleft
/OE /bullet /Zcaron /bullet /bullet
/quoteleft /quoteright /quotedblleft /quotedblright /bullet
/endash /emdash /asciitilde /trademark /scaron
/guilsinglright /oe /bullet /zcaron /Ydieresis
/space /exclamdown /cent /sterling /currency
/yen /brokenbar /section /dieresis /copyright
/ordfeminine /guillemotleft /logicalnot /sfthyphen /registered
/macron /degree /plusminus /twosuperior /threesuperior
/acute /mu /paragraph /middot /cedilla
/onesuperior /ordmasculine /guillemotright /onequarter /onehalf
/threequarters /questiondown /Agrave /Aacute /Acircumflex
/Atilde /Adieresis /Aring /AE /Ccedilla
/Egrave /Eacute /Ecircumflex /Edieresis /Igrave
/Iacute /Icircumflex /Idieresis /Eth /Ntilde
/Ograve /Oacute /Ocircumflex /Otilde /Odieresis
/multiply /Oslash /Ugrave /Uacute /Ucircumflex
/Udieresis /Yacute /Thorn /germandbls /agrave
/aacute /acircumflex /atilde /adieresis /aring
/ae /ccedilla /egrave /eacute /ecircumflex
/edieresis /igrave /iacute /icircumflex /idieresis
/eth /ntilde /ograve /oacute /ocircumflex
/otilde /odieresis /divide /oslash /ugrave
/uacute /ucircumflex /udieresis /yacute /thorn
/ydieresis
] def
%%EndResource
%FOPBeginFontReencode
/Courier-Oblique findfont
dup length dict begin
  {1 index /FID ne {def} {pop pop} ifelse} forall
  /Encoding WinAnsiEncoding def
  currentdict
end
/Courier-Oblique exch definefont pop
/Courier-BoldOblique findfont
dup length dict begin
  {1 index /FID ne {def} {pop pop} ifelse} forall
  /Encoding WinAnsiEncoding def
  currentdict
end
/Courier-BoldOblique exch definefont pop
/Courier-Bold findfont
dup length dict begin
  {1 index /FID ne {def} {pop pop} ifelse} forall
  /Encoding WinAnsiEncoding def
  currentdict
end
/Courier-Bold exch definefont pop
/Helvetica findfont
dup length dict begin
  {1 index /FID ne {def} {pop pop} ifelse} forall
  /Encoding WinAnsiEncoding def
  currentdict
end
/Helvetica exch definefont pop
/Helvetica-Oblique findfont
dup length dict begin
  {1 index /FID ne {def} {pop pop} ifelse} forall
  /Encoding WinAnsiEncoding def
  currentdict
end
/Helvetica-Oblique exch definefont pop
/Helvetica-Bold findfont
dup length dict begin
  {1 index /FID ne {def} {pop pop} ifelse} forall
  /Encoding WinAnsiEncoding def
  currentdict
end
/Helvetica-Bold exch definefont pop
/Helvetica-BoldOblique findfont
dup length dict begin
  {1 index /FID ne {def} {pop pop} ifelse} forall
  /Encoding WinAnsiEncoding def
  currentdict
end
/Helvetica-BoldOblique exch definefont pop
/Times-Roman findfont
dup length dict begin
  {1 index /FID ne {def} {pop pop} ifelse} forall
  /Encoding WinAnsiEncoding def
  currentdict
end
/Times-Roman exch definefont pop
/Times-Italic findfont
dup length dict begin
  {1 index /FID ne {def} {pop pop} ifelse} forall
  /Encoding WinAnsiEncoding def
  currentdict
end
/Times-Italic exch definefont pop
/Times-Bold findfont
dup length dict begin
  {1 index /FID ne {def} {pop pop} ifelse} forall
  /Encoding WinAnsiEncoding def
  currentdict
end
/Times-Bold exch definefont pop
/Times-BoldItalic findfont
dup length dict begin
  {1 index /FID ne {def} {pop pop} ifelse} forall
  /Encoding WinAnsiEncoding def
  currentdict
end
/Times-BoldItalic exch definefont pop
/Courier findfont
dup length dict begin
  {1 index /FID ne {def} {pop pop} ifelse} forall
  /Encoding WinAnsiEncoding def
  currentdict
end
/Courier exch definefont pop
%FOPEndFontReencode
%%EndProlog
%%Page: 1 1
%%PageBoundingBox: 0 0 198 283
%%BeginPageSetup
[1 0 0 -1 0 283] CT
%%EndPageSetup
GS
[1.00215 0 0 1 0 0] CT
1 GC
N
0 0 198 283 re
f
GR
GS
[1.00215 0 0 1 0 0] CT
1 GC
N
0 0 198 283 re
f
GR
GS
[1.00215 0 0 1 0 0] CT
1 GC
N
69 228 M
179 228 L
179 32 L
69 32 L
cp
f
GR
GS
[1.00215 0 0 1 0 0] CT
0.149 GC
2 setlinecap
1 LJ
0.5 LW
N
69 228 M
179 228 L
S
GR
GS
[1.00215 0 0 1 0 0] CT
0.149 GC
2 setlinecap
1 LJ
0.5 LW
N
102 228 M
102 226.04 L
S
GR
GS
[1.00215 0 0 1 0 0] CT
0.149 GC
2 setlinecap
1 LJ
0.5 LW
N
146 228 M
146 226.04 L
S
GR
GS
[1.00215 0 0 1 102.21904 234] CT
0.149 GC
/Helvetica 20 F
GS
[1 0 0 1 0 0] CT
-13 20 moveto 
1 -1 scale
(YA) t 
GR
GR
GS
[1.00215 0 0 1 146.31353 234] CT
0.149 GC
/Helvetica 20 F
GS
[1 0 0 1 0 0] CT
-14.5 20 moveto 
1 -1 scale
(OA) t 
GR
GR
GS
[1.00215 0 0 1 124.26634 259] CT
0.149 GC
/Helvetica 20 F
GS
[1 0 0 1 0 0] CT
-49 20 moveto 
1 -1 scale
(Age Group) t 
GR
GR
GS
[1.00215 0 0 1 0 0] CT
0.149 GC
2 setlinecap
1 LJ
0.5 LW
N
69 228 M
69 32 L
S
GR
GS
[1.00215 0 0 1 0 0] CT
0.149 GC
2 setlinecap
1 LJ
0.5 LW
N
69 228 M
70.96 228 L
S
GR
GS
[1.00215 0 0 1 0 0] CT
0.149 GC
2 setlinecap
1 LJ
0.5 LW
N
69 188.8 M
70.96 188.8 L
S
GR
GS
[1.00215 0 0 1 0 0] CT
0.149 GC
2 setlinecap
1 LJ
0.5 LW
N
69 149.6 M
70.96 149.6 L
S
GR
GS
[1.00215 0 0 1 0 0] CT
0.149 GC
2 setlinecap
1 LJ
0.5 LW
N
69 110.4 M
70.96 110.4 L
S
GR
GS
[1.00215 0 0 1 0 0] CT
0.149 GC
2 setlinecap
1 LJ
0.5 LW
N
69 71.2 M
70.96 71.2 L
S
GR
GS
[1.00215 0 0 1 0 0] CT
0.149 GC
2 setlinecap
1 LJ
0.5 LW
N
69 32 M
70.96 32 L
S
GR
GS
[1.00215 0 0 1 63.13529 228] CT
0.149 GC
/Helvetica 20 F
GS
[1 0 0 1 0 0] CT
-36 7.5 moveto 
1 -1 scale
(-1.5) t 
GR
GR
GS
[1.00215 0 0 1 63.13529 188.8] CT
0.149 GC
/Helvetica 20 F
GS
[1 0 0 1 0 0] CT
-19 7.5 moveto 
1 -1 scale
(-1) t 
GR
GR
GS
[1.00215 0 0 1 63.13529 149.60001] CT
0.149 GC
/Helvetica 20 F
GS
[1 0 0 1 0 0] CT
-36 7.5 moveto 
1 -1 scale
(-0.5) t 
GR
GR
GS
[1.00215 0 0 1 63.13529 110.4] CT
0.149 GC
/Helvetica 20 F
GS
[1 0 0 1 0 0] CT
-12 7.5 moveto 
1 -1 scale
(0) t 
GR
GR
GS
[1.00215 0 0 1 63.13529 71.2] CT
0.149 GC
/Helvetica 20 F
GS
[1 0 0 1 0 0] CT
-28 7.5 moveto 
1 -1 scale
(0.5) t 
GR
GR
GS
[1.00215 0 0 1 63.13529 32] CT
0.149 GC
/Helvetica 20 F
GS
[1 0 0 1 0 0] CT
-12 7.5 moveto 
1 -1 scale
(1) t 
GR
GR
GS
[0 -1 1.00215 0 24.05154 129.99991] CT
0.149 GC
/Helvetica 20 F
GS
[1 0 0 1 0 0] CT
-60.5 -5 moveto 
1 -1 scale
(gamma linear) t 
GR
GR
GS
[1.00215 0 0 1 124.26641 29.25] CT
/Helvetica-Bold 22 F
GS
[1 0 0 1 0 0] CT
-58 -5 moveto 
1 -1 scale
(p = 5.2e-04) t 
GR
GR
GS
[1.00215 0 0 1 0 0] CT
0.149 GC
1 LJ
0.5 LW
N
69 110.4 M
179 110.4 L
S
GR
GS
[1.00215 0 0 1 0 0] CT
0.6 GC
N
119.6 110.4 M
119.6 99.914 L
84.4 99.914 L
84.4 110.4 L
cp
f
GR
GS
[1.00215 0 0 1 95.29135 191.59972] CT
0.302 GC
N
2.236 0 M
2.236 -1.235 1.235 -2.236 0 -2.236 C
-1.235 -2.236 -2.236 -1.235 -2.236 0 C
-2.236 1.235 -1.235 2.236 0 2.236 C
1.235 2.236 2.236 1.235 2.236 0 C
cp
f
GR
GS
[1.00215 0 0 1 102.42246 101.50706] CT
0.302 GC
N
/f-1586420743{2.236 0 M
2.236 -1.235 1.235 -2.236 0 -2.236 C
-1.235 -2.236 -2.236 -1.235 -2.236 0 C
-2.236 1.235 -1.235 2.236 0 2.236 C
1.235 2.236 2.236 1.235 2.236 0 C
cp}def
f-1586420743
f
GR
GS
[1.00215 0 0 1 106.00381 95.82281] CT
0.302 GC
N
f-1586420743
f
GR
GS
[1.00215 0 0 1 105.48602 39.82154] CT
0.302 GC
N
f-1586420743
f
GR
GS
[1.00215 0 0 1 97.33428 152.2513] CT
0.302 GC
N
f-1586420743
f
GR
GS
[1.00215 0 0 1 106.47471 122.07851] CT
0.302 GC
N
f-1586420743
f
GR
GS
[1.00215 0 0 1 102.12815 94.00577] CT
0.302 GC
N
f-1586420743
f
GR
GS
[1.00215 0 0 1 110.04547 57.5064] CT
0.302 GC
N
f-1586420743
f
GR
GS
[1.00215 0 0 1 108.76878 104.70218] CT
0.302 GC
N
f-1586420743
f
GR
GS
[1.00215 0 0 1 97.64632 64.87293] CT
0.302 GC
N
f-1586420743
f
GR
GS
[1.00215 0 0 1 95.34654 81.51572] CT
0.302 GC
N
f-1586420743
f
GR
GS
[1.00215 0 0 1 109.0586 135.85924] CT
0.302 GC
N
f-1586420743
f
GR
GS
[1.00215 0 0 1 94.48239 77.29597] CT
0.302 GC
N
f-1586420743
f
GR
GS
[1.00215 0 0 1 101.89675 95.77941] CT
0.302 GC
N
f-1586420743
f
GR
GS
[1.00215 0 0 1 104.65042 48.83391] CT
0.302 GC
N
f-1586420743
f
GR
GS
[1.00215 0 0 1 101.25937 147.12605] CT
0.302 GC
N
f-1586420743
f
GR
GS
[1.00215 0 0 1 94.92327 105.88994] CT
0.302 GC
N
f-1586420743
f
GR
GS
[1.00215 0 0 1 101.87927 67.89157] CT
0.302 GC
N
f-1586420743
f
GR
GS
[1.00215 0 0 1 104.55481 66.94456] CT
0.302 GC
N
f-1586420743
f
GR
GS
[1.00215 0 0 1 94.0378 143.8186] CT
0.302 GC
N
f-1586420743
f
GR
GS
[1.00215 0 0 1 109.72854 68.83959] CT
0.302 GC
N
f-1586420743
f
GR
GS
[1.00215 0 0 1 100.15618 134.11209] CT
0.302 GC
N
f-1586420743
f
GR
GS
[1.00215 0 0 1 109.45923 182.96106] CT
0.302 GC
N
f-1586420743
f
GR
GS
[1.00215 0 0 1 108.02023 191.59972] CT
0.302 GC
N
f-1586420743
f
GR
GS
[1.00215 0 0 1 105.39459 78.92354] CT
0.302 GC
N
f-1586420743
f
GR
GS
[1.00215 0 0 1 95.24298 85.82388] CT
0.302 GC
N
f-1586420743
f
GR
GS
[1.00215 0 0 1 101.55263 62.639] CT
0.302 GC
N
f-1586420743
f
GR
GS
[1.00215 0 0 1 108.06608 46.64145] CT
0.302 GC
N
f-1586420743
f
GR
GS
[1.00215 0 0 1 99.58332 122.59042] CT
0.302 GC
N
f-1586420743
f
GR
GS
[1.00215 0 0 1 101.18905 87.96045] CT
0.302 GC
N
f-1586420743
f
GR
GS
[1.00215 0 0 1 99.99773 72.12122] CT
0.302 GC
N
f-1586420743
f
GR
GS
[1.00215 0 0 1 104.94703 32.52551] CT
0.302 GC
N
f-1586420743
f
GR
GS
[1.00215 0 0 1 105.77236 77.57652] CT
0.302 GC
N
f-1586420743
f
GR
GS
[1.00215 0 0 1 97.56588 60.18969] CT
0.302 GC
N
f-1586420743
f
GR
GS
[1.00215 0 0 1 107.89828 133.07523] CT
0.302 GC
N
f-1586420743
f
GR
GS
[1.00215 0 0 1 94.38266 102.44662] CT
0.302 GC
N
f-1586420743
f
GR
GS
[1.00215 0 0 1 93.80681 123.73592] CT
0.302 GC
N
f-1586420743
f
GR
GS
[1.00215 0 0 1 97.27313 32.52551] CT
0.302 GC
N
f-1586420743
f
GR
GS
[1.00215 0 0 1 97.82262 91.85059] CT
0.302 GC
N
f-1586420743
f
GR
GS
[1.00215 0 0 1 94.99868 182.00493] CT
0.302 GC
N
f-1586420743
f
GR
GS
[1.00215 0 0 1 96.82123 114.37481] CT
0.302 GC
N
f-1586420743
f
GR
GS
[1.00215 0 0 1 109.08573 116.75672] CT
0.302 GC
N
f-1586420743
f
GR
GS
[1.00215 0 0 1 0 0] CT
0.6 0.8 1 RC
N
/f266308534{128.4 110.4 M
128.4 128.313 L
163.6 128.313 L
163.6 110.4 L
cp}def
f266308534
f
GR
GS
[1.00215 0 0 1 137.78964 145.49532] CT
0.302 GC
N
f-1586420743
f
GR
GS
[1.00215 0 0 1 142.48024 137.29057] CT
0.302 GC
N
f-1586420743
f
GR
GS
[1.00215 0 0 1 144.49931 113.54029] CT
0.302 GC
N
f-1586420743
f
GR
GS
[1.00215 0 0 1 147.87162 121.164] CT
0.302 GC
N
f-1586420743
f
GR
GS
[1.00215 0 0 1 149.72927 209.77133] CT
0.302 GC
N
f-1586420743
f
GR
GS
[1.00215 0 0 1 154.98978 138.33731] CT
0.302 GC
N
f-1586420743
f
GR
GS
[1.00215 0 0 1 145.72072 112.07529] CT
0.302 GC
N
f-1586420743
f
GR
GS
[1.00215 0 0 1 148.34586 113.89506] CT
0.302 GC
N
f-1586420743
f
GR
GS
[1.00215 0 0 1 151.10237 112.5773] CT
0.302 GC
N
f-1586420743
f
GR
GS
[1.00215 0 0 1 146.25798 114.43243] CT
0.302 GC
N
f-1586420743
f
GR
GS
[1.00215 0 0 1 139.09265 124.03787] CT
0.302 GC
N
f-1586420743
f
GR
GS
[1.00215 0 0 1 144.0046 122.93449] CT
0.302 GC
N
f-1586420743
f
GR
GS
[1.00215 0 0 1 147.02506 145.39229] CT
0.302 GC
N
f-1586420743
f
GR
GS
[1.00215 0 0 1 137.59811 96.65835] CT
0.302 GC
N
f-1586420743
f
GR
GS
[1.00215 0 0 1 151.39275 106.05093] CT
0.302 GC
N
f-1586420743
f
GR
GS
[1.00215 0 0 1 149.82966 140.45319] CT
0.302 GC
N
f-1586420743
f
GR
GS
[1.00215 0 0 1 150.82396 101.38931] CT
0.302 GC
N
f-1586420743
f
GR
GS
[1.00215 0 0 1 145.05456 160.55475] CT
0.302 GC
N
f-1586420743
f
GR
GS
[1.00215 0 0 1 148.76556 118.59451] CT
0.302 GC
N
f-1586420743
f
GR
GS
[1.00215 0 0 1 144.44293 187.69066] CT
0.302 GC
N
f-1586420743
f
GR
GS
[1.00215 0 0 1 141.42343 42.9652] CT
0.302 GC
N
f-1586420743
f
GR
GS
[1.00215 0 0 1 153.66602 42.9652] CT
0.302 GC
N
f-1586420743
f
GR
GS
[1.00215 0 0 1 142.91124 142.18169] CT
0.302 GC
N
f-1586420743
f
GR
GS
[1.00215 0 0 1 153.25296 144.10803] CT
0.302 GC
N
f-1586420743
f
GR
GS
[1.00215 0 0 1 150.89898 175.09454] CT
0.302 GC
N
f-1586420743
f
GR
GS
[1.00215 0 0 1 142.03867 141.79367] CT
0.302 GC
N
f-1586420743
f
GR
GS
[1.00215 0 0 1 146.1445 100.14064] CT
0.302 GC
N
f-1586420743
f
GR
GS
[1.00215 0 0 1 154.37916 116.67445] CT
0.302 GC
N
f-1586420743
f
GR
GS
[1.00215 0 0 1 149.03947 153.23715] CT
0.302 GC
N
f-1586420743
f
GR
GS
[1.00215 0 0 1 140.43899 138.4144] CT
0.302 GC
N
f-1586420743
f
GR
GS
[1.00215 0 0 1 143.7801 157.10417] CT
0.302 GC
N
f-1586420743
f
GR
GS
[1.00215 0 0 1 141.79998 83.31797] CT
0.302 GC
N
f-1586420743
f
GR
GS
[1.00215 0 0 1 143.01465 94.09045] CT
0.302 GC
N
f-1586420743
f
GR
GS
[1.00215 0 0 1 144.65103 83.38341] CT
0.302 GC
N
f-1586420743
f
GR
GS
[1.00215 0 0 1 143.33003 150.67128] CT
0.302 GC
N
f-1586420743
f
GR
GS
[1.00215 0 0 1 153.1365 134.1086] CT
0.302 GC
N
f-1586420743
f
GR
GS
[1.00215 0 0 1 153.37066 148.57687] CT
0.302 GC
N
f-1586420743
f
GR
GS
[1.00215 0 0 1 140.63082 123.09183] CT
0.302 GC
N
f-1586420743
f
GR
GS
[1.00215 0 0 1 141.628 102.78909] CT
0.302 GC
N
f-1586420743
f
GR
GS
[1.00215 0 0 1 154.87466 82.16999] CT
0.302 GC
N
f-1586420743
f
GR
GS
[1.00215 0 0 1 147.79799 82.06867] CT
0.302 GC
N
f-1586420743
f
GR
GS
[1.00215 0 0 1 137.77323 80.57072] CT
0.302 GC
N
f-1586420743
f
GR
GS
[1.00215 0 0 1 137.7329 185.48418] CT
0.302 GC
N
f-1586420743
f
GR
GS
[1.00215 0 0 1 150.14153 151.21423] CT
0.302 GC
N
f-1586420743
f
GR
GS
[1.00215 0 0 1 152.83625 187.70096] CT
0.302 GC
N
f-1586420743
f
GR
GS
[1.00215 0 0 1 152.94531 160.61118] CT
0.302 GC
N
f-1586420743
f
GR
GS
[1.00215 0 0 1 145.45031 170.75822] CT
0.302 GC
N
f-1586420743
f
GR
GS
[1.00215 0 0 1 146.87464 170.06772] CT
0.302 GC
N
f-1586420743
f
GR
GS
[1.00215 0 0 1 147.03577 149.81284] CT
0.302 GC
N
f-1586420743
f
GR
GS
[1.00215 0 0 1 144.73625 121.75674] CT
0.302 GC
N
f-1586420743
f
GR
GS
[1.00215 0 0 1 138.74143 97.18781] CT
0.302 GC
N
f-1586420743
f
GR
GS
[1.00215 0 0 1 144.67082 139.23038] CT
0.302 GC
N
f-1586420743
f
GR
GS
[1.00215 0 0 1 153.87382 124.91846] CT
0.302 GC
N
f-1586420743
f
GR
%%Trailer
%%Pages: 1
%%EOF
