%!PS-Adobe-3.0 EPSF-3.0
%%Creator: (MATLAB, The Mathworks, Inc. Version 9.8.0.1323502 \(R2020a\). Operating System: Mac OS X)
%%Title: /Users/kosciessa/Desktop/mntTardisLNDG/LNDG/stateswitch/stsw_multimodal/figures/l1byage/l1comp_cppthresh.eps
%%CreationDate: 2022-03-02T14:36:45
%%Pages: (atend)
%%BoundingBox:     4     0   180   278
%%LanguageLevel: 3
%%EndComments
%%BeginProlog
%%BeginResource: procset (Apache XML Graphics Std ProcSet) 1.2 0
%%Version: 1.2 0
%%Copyright: (Copyright 2001-2003,2010 The Apache Software Foundation. License terms: http://www.apache.org/licenses/LICENSE-2.0)
/bd{bind def}bind def
/ld{load def}bd
/GR/grestore ld
/GS/gsave ld
/RM/rmoveto ld
/C/curveto ld
/t/show ld
/L/lineto ld
/ML/setmiterlimit ld
/CT/concat ld
/f/fill ld
/N/newpath ld
/S/stroke ld
/CC/setcmykcolor ld
/A/ashow ld
/cp/closepath ld
/RC/setrgbcolor ld
/LJ/setlinejoin ld
/GC/setgray ld
/LW/setlinewidth ld
/M/moveto ld
/re {4 2 roll M
1 index 0 rlineto
0 exch rlineto
neg 0 rlineto
cp } bd
/_ctm matrix def
/_tm matrix def
/BT { _ctm currentmatrix pop matrix _tm copy pop 0 0 moveto } bd
/ET { _ctm setmatrix } bd
/iTm { _ctm setmatrix _tm concat } bd
/Tm { _tm astore pop iTm 0 0 moveto } bd
/ux 0.0 def
/uy 0.0 def
/F {
  /Tp exch def
  /Tf exch def
  Tf findfont Tp scalefont setfont
  /cf Tf def  /cs Tp def
} bd
/ULS {currentpoint /uy exch def /ux exch def} bd
/ULE {
  /Tcx currentpoint pop def
  gsave
  newpath
  cf findfont cs scalefont dup
  /FontMatrix get 0 get /Ts exch def /FontInfo get dup
  /UnderlinePosition get Ts mul /To exch def
  /UnderlineThickness get Ts mul /Tt exch def
  ux uy To add moveto  Tcx uy To add lineto
  Tt setlinewidth stroke
  grestore
} bd
/OLE {
  /Tcx currentpoint pop def
  gsave
  newpath
  cf findfont cs scalefont dup
  /FontMatrix get 0 get /Ts exch def /FontInfo get dup
  /UnderlinePosition get Ts mul /To exch def
  /UnderlineThickness get Ts mul /Tt exch def
  ux uy To add cs add moveto Tcx uy To add cs add lineto
  Tt setlinewidth stroke
  grestore
} bd
/SOE {
  /Tcx currentpoint pop def
  gsave
  newpath
  cf findfont cs scalefont dup
  /FontMatrix get 0 get /Ts exch def /FontInfo get dup
  /UnderlinePosition get Ts mul /To exch def
  /UnderlineThickness get Ts mul /Tt exch def
  ux uy To add cs 10 mul 26 idiv add moveto Tcx uy To add cs 10 mul 26 idiv add lineto
  Tt setlinewidth stroke
  grestore
} bd
/QT {
/Y22 exch store
/X22 exch store
/Y21 exch store
/X21 exch store
currentpoint
/Y21 load 2 mul add 3 div exch
/X21 load 2 mul add 3 div exch
/X21 load 2 mul /X22 load add 3 div
/Y21 load 2 mul /Y22 load add 3 div
/X22 load /Y22 load curveto
} bd
/SSPD {
dup length /d exch dict def
{
/v exch def
/k exch def
currentpagedevice k known {
/cpdv currentpagedevice k get def
v cpdv ne {
/upd false def
/nullv v type /nulltype eq def
/nullcpdv cpdv type /nulltype eq def
nullv nullcpdv or
{
/upd true def
} {
/sametype v type cpdv type eq def
sametype {
v type /arraytype eq {
/vlen v length def
/cpdvlen cpdv length def
vlen cpdvlen eq {
0 1 vlen 1 sub {
/i exch def
/obj v i get def
/cpdobj cpdv i get def
obj cpdobj ne {
/upd true def
exit
} if
} for
} {
/upd true def
} ifelse
} {
v type /dicttype eq {
v {
/dv exch def
/dk exch def
/cpddv cpdv dk get def
dv cpddv ne {
/upd true def
exit
} if
} forall
} {
/upd true def
} ifelse
} ifelse
} if
} ifelse
upd true eq {
d k v put
} if
} if
} if
} forall
d length 0 gt {
d setpagedevice
} if
} bd
/RE { % /NewFontName [NewEncodingArray] /FontName RE -
  findfont dup length dict begin
  {
    1 index /FID ne
    {def} {pop pop} ifelse
  } forall
  /Encoding exch def
  /FontName 1 index def
  currentdict definefont pop
  end
} bind def
%%EndResource
%%BeginResource: procset (Apache XML Graphics EPS ProcSet) 1.0 0
%%Version: 1.0 0
%%Copyright: (Copyright 2002-2003 The Apache Software Foundation. License terms: http://www.apache.org/licenses/LICENSE-2.0)
/BeginEPSF { %def
/b4_Inc_state save def         % Save state for cleanup
/dict_count countdictstack def % Count objects on dict stack
/op_count count 1 sub def      % Count objects on operand stack
userdict begin                 % Push userdict on dict stack
/showpage { } def              % Redefine showpage, { } = null proc
0 setgray 0 setlinecap         % Prepare graphics state
1 setlinewidth 0 setlinejoin
10 setmiterlimit [ ] 0 setdash newpath
/languagelevel where           % If level not equal to 1 then
{pop languagelevel             % set strokeadjust and
1 ne                           % overprint to their defaults.
{false setstrokeadjust false setoverprint
} if
} if
} bd
/EndEPSF { %def
count op_count sub {pop} repeat            % Clean up stacks
countdictstack dict_count sub {end} repeat
b4_Inc_state restore
} bd
%%EndResource
%FOPBeginFontDict
%%IncludeResource: font Courier-Oblique
%%IncludeResource: font Courier-BoldOblique
%%IncludeResource: font Courier-Bold
%%IncludeResource: font ZapfDingbats
%%IncludeResource: font Symbol
%%IncludeResource: font Helvetica
%%IncludeResource: font Helvetica-Oblique
%%IncludeResource: font Helvetica-Bold
%%IncludeResource: font Helvetica-BoldOblique
%%IncludeResource: font Times-Roman
%%IncludeResource: font Times-Italic
%%IncludeResource: font Times-Bold
%%IncludeResource: font Times-BoldItalic
%%IncludeResource: font Courier
%FOPEndFontDict
%%BeginResource: encoding WinAnsiEncoding
/WinAnsiEncoding [
/.notdef /.notdef /.notdef /.notdef /.notdef
/.notdef /.notdef /.notdef /.notdef /.notdef
/.notdef /.notdef /.notdef /.notdef /.notdef
/.notdef /.notdef /.notdef /.notdef /.notdef
/.notdef /.notdef /.notdef /.notdef /.notdef
/.notdef /.notdef /.notdef /.notdef /.notdef
/.notdef /.notdef /space /exclam /quotedbl
/numbersign /dollar /percent /ampersand /quotesingle
/parenleft /parenright /asterisk /plus /comma
/hyphen /period /slash /zero /one
/two /three /four /five /six
/seven /eight /nine /colon /semicolon
/less /equal /greater /question /at
/A /B /C /D /E
/F /G /H /I /J
/K /L /M /N /O
/P /Q /R /S /T
/U /V /W /X /Y
/Z /bracketleft /backslash /bracketright /asciicircum
/underscore /quoteleft /a /b /c
/d /e /f /g /h
/i /j /k /l /m
/n /o /p /q /r
/s /t /u /v /w
/x /y /z /braceleft /bar
/braceright /asciitilde /bullet /Euro /bullet
/quotesinglbase /florin /quotedblbase /ellipsis /dagger
/daggerdbl /circumflex /perthousand /Scaron /guilsinglleft
/OE /bullet /Zcaron /bullet /bullet
/quoteleft /quoteright /quotedblleft /quotedblright /bullet
/endash /emdash /asciitilde /trademark /scaron
/guilsinglright /oe /bullet /zcaron /Ydieresis
/space /exclamdown /cent /sterling /currency
/yen /brokenbar /section /dieresis /copyright
/ordfeminine /guillemotleft /logicalnot /sfthyphen /registered
/macron /degree /plusminus /twosuperior /threesuperior
/acute /mu /paragraph /middot /cedilla
/onesuperior /ordmasculine /guillemotright /onequarter /onehalf
/threequarters /questiondown /Agrave /Aacute /Acircumflex
/Atilde /Adieresis /Aring /AE /Ccedilla
/Egrave /Eacute /Ecircumflex /Edieresis /Igrave
/Iacute /Icircumflex /Idieresis /Eth /Ntilde
/Ograve /Oacute /Ocircumflex /Otilde /Odieresis
/multiply /Oslash /Ugrave /Uacute /Ucircumflex
/Udieresis /Yacute /Thorn /germandbls /agrave
/aacute /acircumflex /atilde /adieresis /aring
/ae /ccedilla /egrave /eacute /ecircumflex
/edieresis /igrave /iacute /icircumflex /idieresis
/eth /ntilde /ograve /oacute /ocircumflex
/otilde /odieresis /divide /oslash /ugrave
/uacute /ucircumflex /udieresis /yacute /thorn
/ydieresis
] def
%%EndResource
%FOPBeginFontReencode
/Courier-Oblique findfont
dup length dict begin
  {1 index /FID ne {def} {pop pop} ifelse} forall
  /Encoding WinAnsiEncoding def
  currentdict
end
/Courier-Oblique exch definefont pop
/Courier-BoldOblique findfont
dup length dict begin
  {1 index /FID ne {def} {pop pop} ifelse} forall
  /Encoding WinAnsiEncoding def
  currentdict
end
/Courier-BoldOblique exch definefont pop
/Courier-Bold findfont
dup length dict begin
  {1 index /FID ne {def} {pop pop} ifelse} forall
  /Encoding WinAnsiEncoding def
  currentdict
end
/Courier-Bold exch definefont pop
/Helvetica findfont
dup length dict begin
  {1 index /FID ne {def} {pop pop} ifelse} forall
  /Encoding WinAnsiEncoding def
  currentdict
end
/Helvetica exch definefont pop
/Helvetica-Oblique findfont
dup length dict begin
  {1 index /FID ne {def} {pop pop} ifelse} forall
  /Encoding WinAnsiEncoding def
  currentdict
end
/Helvetica-Oblique exch definefont pop
/Helvetica-Bold findfont
dup length dict begin
  {1 index /FID ne {def} {pop pop} ifelse} forall
  /Encoding WinAnsiEncoding def
  currentdict
end
/Helvetica-Bold exch definefont pop
/Helvetica-BoldOblique findfont
dup length dict begin
  {1 index /FID ne {def} {pop pop} ifelse} forall
  /Encoding WinAnsiEncoding def
  currentdict
end
/Helvetica-BoldOblique exch definefont pop
/Times-Roman findfont
dup length dict begin
  {1 index /FID ne {def} {pop pop} ifelse} forall
  /Encoding WinAnsiEncoding def
  currentdict
end
/Times-Roman exch definefont pop
/Times-Italic findfont
dup length dict begin
  {1 index /FID ne {def} {pop pop} ifelse} forall
  /Encoding WinAnsiEncoding def
  currentdict
end
/Times-Italic exch definefont pop
/Times-Bold findfont
dup length dict begin
  {1 index /FID ne {def} {pop pop} ifelse} forall
  /Encoding WinAnsiEncoding def
  currentdict
end
/Times-Bold exch definefont pop
/Times-BoldItalic findfont
dup length dict begin
  {1 index /FID ne {def} {pop pop} ifelse} forall
  /Encoding WinAnsiEncoding def
  currentdict
end
/Times-BoldItalic exch definefont pop
/Courier findfont
dup length dict begin
  {1 index /FID ne {def} {pop pop} ifelse} forall
  /Encoding WinAnsiEncoding def
  currentdict
end
/Courier exch definefont pop
%FOPEndFontReencode
%%EndProlog
%%Page: 1 1
%%PageBoundingBox: 0 0 198 283
%%BeginPageSetup
[1 0 0 -1 0 283] CT
%%EndPageSetup
GS
[1.00215 0 0 1 0 0] CT
1 GC
N
0 0 198 283 re
f
GR
GS
[1.00215 0 0 1 0 0] CT
1 GC
N
0 0 198 283 re
f
GR
GS
[1.00215 0 0 1 0 0] CT
1 GC
N
55.5 228 M
179 228 L
179 32 L
55.5 32 L
cp
f
GR
GS
[1.00215 0 0 1 0 0] CT
0.149 GC
2 setlinecap
1 LJ
0.5 LW
N
55.5 228 M
179 228 L
S
GR
GS
[1.00215 0 0 1 0 0] CT
0.149 GC
2 setlinecap
1 LJ
0.5 LW
N
92.55 228 M
92.55 226.04 L
S
GR
GS
[1.00215 0 0 1 0 0] CT
0.149 GC
2 setlinecap
1 LJ
0.5 LW
N
141.95 228 M
141.95 226.04 L
S
GR
GS
[1.00215 0 0 1 92.74875 234] CT
0.149 GC
/Helvetica 20 F
GS
[1 0 0 1 0 0] CT
-13 20 moveto 
1 -1 scale
(YA) t 
GR
GR
GS
[1.00215 0 0 1 142.25483 234] CT
0.149 GC
/Helvetica 20 F
GS
[1 0 0 1 0 0] CT
-14.5 20 moveto 
1 -1 scale
(OA) t 
GR
GR
GS
[1.00215 0 0 1 117.50185 259] CT
0.149 GC
/Helvetica 20 F
GS
[1 0 0 1 0 0] CT
-49 20 moveto 
1 -1 scale
(Age Group) t 
GR
GR
GS
[1.00215 0 0 1 0 0] CT
0.149 GC
2 setlinecap
1 LJ
0.5 LW
N
55.5 228 M
55.5 32 L
S
GR
GS
[1.00215 0 0 1 0 0] CT
0.149 GC
2 setlinecap
1 LJ
0.5 LW
N
55.5 228 M
57.46 228 L
S
GR
GS
[1.00215 0 0 1 0 0] CT
0.149 GC
2 setlinecap
1 LJ
0.5 LW
N
55.5 188.8 M
57.46 188.8 L
S
GR
GS
[1.00215 0 0 1 0 0] CT
0.149 GC
2 setlinecap
1 LJ
0.5 LW
N
55.5 149.6 M
57.46 149.6 L
S
GR
GS
[1.00215 0 0 1 0 0] CT
0.149 GC
2 setlinecap
1 LJ
0.5 LW
N
55.5 110.4 M
57.46 110.4 L
S
GR
GS
[1.00215 0 0 1 0 0] CT
0.149 GC
2 setlinecap
1 LJ
0.5 LW
N
55.5 71.2 M
57.46 71.2 L
S
GR
GS
[1.00215 0 0 1 0 0] CT
0.149 GC
2 setlinecap
1 LJ
0.5 LW
N
55.5 32 M
57.46 32 L
S
GR
GS
[1.00215 0 0 1 49.6063 228] CT
0.149 GC
/Helvetica 20 F
GS
[1 0 0 1 0 0] CT
-19 7.5 moveto 
1 -1 scale
(-5) t 
GR
GR
GS
[1.00215 0 0 1 49.6063 188.8] CT
0.149 GC
/Helvetica 20 F
GS
[1 0 0 1 0 0] CT
-12 7.5 moveto 
1 -1 scale
(0) t 
GR
GR
GS
[1.00215 0 0 1 49.6063 149.59999] CT
0.149 GC
/Helvetica 20 F
GS
[1 0 0 1 0 0] CT
-12 7.5 moveto 
1 -1 scale
(5) t 
GR
GR
GS
[1.00215 0 0 1 49.6063 110.39999] CT
0.149 GC
/Helvetica 20 F
GS
[1 0 0 1 0 0] CT
-23 7.5 moveto 
1 -1 scale
(10) t 
GR
GR
GS
[1.00215 0 0 1 49.6063 71.2] CT
0.149 GC
/Helvetica 20 F
GS
[1 0 0 1 0 0] CT
-23 7.5 moveto 
1 -1 scale
(15) t 
GR
GR
GS
[1.00215 0 0 1 49.6063 31.99999] CT
0.149 GC
/Helvetica 20 F
GS
[1 0 0 1 0 0] CT
-23 7.5 moveto 
1 -1 scale
(20) t 
GR
GR
GS
[0 -1 1.00215 0 24.05154 129.99991] CT
0.149 GC
/Helvetica 20 F
GS
[1 0 0 1 0 0] CT
-56 -5 moveto 
1 -1 scale
(cppthresh l1) t 
GR
GR
GS
[1.00215 0 0 1 56.12026 27] CT
0.149 GC
N
2.938 -0.578 M
2.938 -0.734 3.031 -0.859 QT
7.203 -5 L
3.031 -9.156 L
2.938 -9.266 2.938 -9.422 QT
2.938 -9.578 3.055 -9.703 QT
3.172 -9.828 3.344 -9.828 QT
3.484 -9.828 3.641 -9.703 QT
7.781 -5.563 L
11.906 -9.703 L
12.078 -9.828 12.203 -9.828 QT
12.359 -9.828 12.477 -9.711 QT
12.594 -9.594 12.594 -9.422 QT
12.594 -9.266 12.5 -9.156 QT
8.344 -5 L
12.5 -0.859 L
12.594 -0.734 12.594 -0.578 QT
12.594 -0.406 12.477 -0.289 QT
12.359 -0.172 12.203 -0.172 QT
12.047 -0.172 11.906 -0.328 QT
7.781 -4.438 L
3.641 -0.328 L
3.5 -0.172 3.344 -0.172 QT
3.172 -0.172 3.055 -0.305 QT
2.938 -0.438 2.938 -0.578 QT
cp
f
GR
GS
[1.00215 0 0 1 72.15462 27] CT
0.149 GC
/Helvetica 20 F
GS
[1 0 0 1 0 0] CT
0 0 moveto 
1 -1 scale
(10) t 
GR
GR
GS
[1.00215 0 0 1 95.20401 17] CT
0.149 GC
/Helvetica 16 F
GS
[1 0 0 1 0 0] CT
0 0 moveto 
1 -1 scale
(-4) t 
GR
GR
GS
[1.00215 0 0 1 117.50191 29.24998] CT
/Helvetica-Bold 22 F
GS
[1 0 0 1 0 0] CT
-26 -5 moveto 
1 -1 scale
(p = 0) t 
GR
GR
GS
[1.00215 0 0 1 0 0] CT
0.149 GC
1 LJ
0.5 LW
N
55.5 188.8 M
179 188.8 L
S
GR
GS
[1.00215 0 0 1 0 0] CT
1 0.6 0.6 RC
N
112.31 188.8 M
112.31 119.785 L
72.79 119.785 L
72.79 188.8 L
cp
f
GR
GS
[1.00215 0 0 1 84.76908 166.27676] CT
0.302 GC
N
2.236 0 M
2.236 -1.235 1.235 -2.236 0 -2.236 C
-1.235 -2.236 -2.236 -1.235 -2.236 0 C
-2.236 1.235 -1.235 2.236 0 2.236 C
1.235 2.236 2.236 1.235 2.236 0 C
cp
f
GR
GS
[1.00215 0 0 1 91.56123 80.30519] CT
0.302 GC
N
/f-1586420743{2.236 0 M
2.236 -1.235 1.235 -2.236 0 -2.236 C
-1.235 -2.236 -2.236 -1.235 -2.236 0 C
-2.236 1.235 -1.235 2.236 0 2.236 C
1.235 2.236 2.236 1.235 2.236 0 C
cp}def
f-1586420743
f
GR
GS
[1.00215 0 0 1 100.58061 166.27676] CT
0.302 GC
N
f-1586420743
f
GR
GS
[1.00215 0 0 1 98.9142 147.45505] CT
0.302 GC
N
f-1586420743
f
GR
GS
[1.00215 0 0 1 100.61134 127.58994] CT
0.302 GC
N
f-1586420743
f
GR
GS
[1.00215 0 0 1 84.10357 166.27676] CT
0.302 GC
N
f-1586420743
f
GR
GS
[1.00215 0 0 1 97.64269 86.32085] CT
0.302 GC
N
f-1586420743
f
GR
GS
[1.00215 0 0 1 91.50215 119.74056] CT
0.302 GC
N
f-1586420743
f
GR
GS
[1.00215 0 0 1 92.38195 124.70555] CT
0.302 GC
N
f-1586420743
f
GR
GS
[1.00215 0 0 1 86.16729 140.95236] CT
0.302 GC
N
f-1586420743
f
GR
GS
[1.00215 0 0 1 90.89772 106.45547] CT
0.302 GC
N
f-1586420743
f
GR
GS
[1.00215 0 0 1 89.85538 106.19499] CT
0.302 GC
N
f-1586420743
f
GR
GS
[1.00215 0 0 1 87.60687 131.91324] CT
0.302 GC
N
f-1586420743
f
GR
GS
[1.00215 0 0 1 83.40664 93.94021] CT
0.302 GC
N
f-1586420743
f
GR
GS
[1.00215 0 0 1 101.87454 166.27676] CT
0.302 GC
N
f-1586420743
f
GR
GS
[1.00215 0 0 1 98.91612 88.21304] CT
0.302 GC
N
f-1586420743
f
GR
GS
[1.00215 0 0 1 95.26531 106.85381] CT
0.302 GC
N
f-1586420743
f
GR
GS
[1.00215 0 0 1 84.1214 157.26613] CT
0.302 GC
N
f-1586420743
f
GR
GS
[1.00215 0 0 1 96.91167 121.35751] CT
0.302 GC
N
f-1586420743
f
GR
GS
[1.00215 0 0 1 94.25006 114.1592] CT
0.302 GC
N
f-1586420743
f
GR
GS
[1.00215 0 0 1 90.90688 125.88116] CT
0.302 GC
N
f-1586420743
f
GR
GS
[1.00215 0 0 1 92.50506 107.68749] CT
0.302 GC
N
f-1586420743
f
GR
GS
[1.00215 0 0 1 99.5615 127.03731] CT
0.302 GC
N
f-1586420743
f
GR
GS
[1.00215 0 0 1 99.54567 166.27676] CT
0.302 GC
N
f-1586420743
f
GR
GS
[1.00215 0 0 1 87.13564 116.85442] CT
0.302 GC
N
f-1586420743
f
GR
GS
[1.00215 0 0 1 84.69898 116.76386] CT
0.302 GC
N
f-1586420743
f
GR
GS
[1.00215 0 0 1 85.03669 101.20763] CT
0.302 GC
N
f-1586420743
f
GR
GS
[1.00215 0 0 1 98.4433 129.47278] CT
0.302 GC
N
f-1586420743
f
GR
GS
[1.00215 0 0 1 101.29099 107.18324] CT
0.302 GC
N
f-1586420743
f
GR
GS
[1.00215 0 0 1 100.96493 59.23991] CT
0.302 GC
N
f-1586420743
f
GR
GS
[1.00215 0 0 1 91.47578 113.93282] CT
0.302 GC
N
f-1586420743
f
GR
GS
[1.00215 0 0 1 87.40459 73.50631] CT
0.302 GC
N
f-1586420743
f
GR
GS
[1.00215 0 0 1 95.55762 161.79677] CT
0.302 GC
N
f-1586420743
f
GR
GS
[1.00215 0 0 1 85.4406 125.27861] CT
0.302 GC
N
f-1586420743
f
GR
GS
[1.00215 0 0 1 95.1811 117.32416] CT
0.302 GC
N
f-1586420743
f
GR
GS
[1.00215 0 0 1 96.14741 143.65724] CT
0.302 GC
N
f-1586420743
f
GR
GS
[1.00215 0 0 1 89.30511 110.18878] CT
0.302 GC
N
f-1586420743
f
GR
GS
[1.00215 0 0 1 88.7422 69.3606] CT
0.302 GC
N
f-1586420743
f
GR
GS
[1.00215 0 0 1 99.14564 150.91144] CT
0.302 GC
N
f-1586420743
f
GR
GS
[1.00215 0 0 1 95.39397 150.65079] CT
0.302 GC
N
f-1586420743
f
GR
GS
[1.00215 0 0 1 94.18329 78.97025] CT
0.302 GC
N
f-1586420743
f
GR
GS
[1.00215 0 0 1 84.21857 59.23991] CT
0.302 GC
N
f-1586420743
f
GR
GS
[1.00215 0 0 1 0 0] CT
1 0.6 0.6 RC
N
/f742789838{161.71 188.8 M
161.71 141.946 L
122.19 141.946 L
122.19 188.8 L
cp}def
f742789838
f
GR
GS
[1.00215 0 0 1 147.9597 134.65594] CT
0.302 GC
N
f-1586420743
f
GR
GS
[1.00215 0 0 1 149.88588 192.61908] CT
0.302 GC
N
f-1586420743
f
GR
GS
[1.00215 0 0 1 146.2466 52.6952] CT
0.302 GC
N
f-1586420743
f
GR
GS
[1.00215 0 0 1 141.50977 175.00591] CT
0.302 GC
N
f-1586420743
f
GR
GS
[1.00215 0 0 1 139.81499 140.58536] CT
0.302 GC
N
f-1586420743
f
GR
GS
[1.00215 0 0 1 140.42521 166.02249] CT
0.302 GC
N
f-1586420743
f
GR
GS
[1.00215 0 0 1 138.71066 92.85282] CT
0.302 GC
N
f-1586420743
f
GR
GS
[1.00215 0 0 1 146.71391 146.32588] CT
0.302 GC
N
f-1586420743
f
GR
GS
[1.00215 0 0 1 145.57284 122.34249] CT
0.302 GC
N
f-1586420743
f
GR
GS
[1.00215 0 0 1 143.24212 112.04889] CT
0.302 GC
N
f-1586420743
f
GR
GS
[1.00215 0 0 1 148.84089 172.41193] CT
0.302 GC
N
f-1586420743
f
GR
GS
[1.00215 0 0 1 132.90403 209.1613] CT
0.302 GC
N
f-1586420743
f
GR
GS
[1.00215 0 0 1 141.99147 133.59975] CT
0.302 GC
N
f-1586420743
f
GR
GS
[1.00215 0 0 1 132.44904 174.63573] CT
0.302 GC
N
f-1586420743
f
GR
GS
[1.00215 0 0 1 135.84935 186.90047] CT
0.302 GC
N
f-1586420743
f
GR
GS
[1.00215 0 0 1 134.20081 135.29056] CT
0.302 GC
N
f-1586420743
f
GR
GS
[1.00215 0 0 1 134.09622 146.9321] CT
0.302 GC
N
f-1586420743
f
GR
GS
[1.00215 0 0 1 151.89464 140.34819] CT
0.302 GC
N
f-1586420743
f
GR
GS
[1.00215 0 0 1 148.54079 161.68033] CT
0.302 GC
N
f-1586420743
f
GR
GS
[1.00215 0 0 1 150.63069 94.06868] CT
0.302 GC
N
f-1586420743
f
GR
GS
[1.00215 0 0 1 146.6673 112.07265] CT
0.302 GC
N
f-1586420743
f
GR
GS
[1.00215 0 0 1 137.42105 144.53345] CT
0.302 GC
N
f-1586420743
f
GR
GS
[1.00215 0 0 1 139.35745 140.70343] CT
0.302 GC
N
f-1586420743
f
GR
GS
[1.00215 0 0 1 142.99292 103.18087] CT
0.302 GC
N
f-1586420743
f
GR
GS
[1.00215 0 0 1 144.44692 122.59613] CT
0.302 GC
N
f-1586420743
f
GR
GS
[1.00215 0 0 1 145.51603 124.66937] CT
0.302 GC
N
f-1586420743
f
GR
GS
[1.00215 0 0 1 146.4509 111.14799] CT
0.302 GC
N
f-1586420743
f
GR
GS
[1.00215 0 0 1 143.82745 154.629] CT
0.302 GC
N
f-1586420743
f
GR
GS
[1.00215 0 0 1 145.05747 112.15526] CT
0.302 GC
N
f-1586420743
f
GR
GS
[1.00215 0 0 1 137.28875 214.2338] CT
0.302 GC
N
f-1586420743
f
GR
GS
[1.00215 0 0 1 148.553 138.76166] CT
0.302 GC
N
f-1586420743
f
GR
GS
[1.00215 0 0 1 134.6986 120.29333] CT
0.302 GC
N
f-1586420743
f
GR
GS
[1.00215 0 0 1 146.86866 103.17924] CT
0.302 GC
N
f-1586420743
f
GR
GS
[1.00215 0 0 1 132.42183 114.87034] CT
0.302 GC
N
f-1586420743
f
GR
GS
[1.00215 0 0 1 151.7641 214.0079] CT
0.302 GC
N
f-1586420743
f
GR
GS
[1.00215 0 0 1 147.2915 35.80047] CT
0.302 GC
N
f-1586420743
f
GR
GS
[1.00215 0 0 1 134.82194 146.13249] CT
0.302 GC
N
f-1586420743
f
GR
GS
[1.00215 0 0 1 133.29575 173.38304] CT
0.302 GC
N
f-1586420743
f
GR
GS
[1.00215 0 0 1 138.09501 178.05203] CT
0.302 GC
N
f-1586420743
f
GR
GS
[1.00215 0 0 1 144.06203 163.01457] CT
0.302 GC
N
f-1586420743
f
GR
GS
[1.00215 0 0 1 139.20998 120.30288] CT
0.302 GC
N
f-1586420743
f
GR
GS
[1.00215 0 0 1 149.71976 131.25963] CT
0.302 GC
N
f-1586420743
f
GR
GS
[1.00215 0 0 1 144.50309 178.39084] CT
0.302 GC
N
f-1586420743
f
GR
GS
[1.00215 0 0 1 142.68951 183.81407] CT
0.302 GC
N
f-1586420743
f
GR
GS
[1.00215 0 0 1 136.15 142.54839] CT
0.302 GC
N
f-1586420743
f
GR
GS
[1.00215 0 0 1 149.46489 160.19765] CT
0.302 GC
N
f-1586420743
f
GR
GS
[1.00215 0 0 1 146.05093 204.81943] CT
0.302 GC
N
f-1586420743
f
GR
GS
[1.00215 0 0 1 148.14592 190.33696] CT
0.302 GC
N
f-1586420743
f
GR
GS
[1.00215 0 0 1 142.01757 161.22502] CT
0.302 GC
N
f-1586420743
f
GR
GS
[1.00215 0 0 1 144.9869 134.82478] CT
0.302 GC
N
f-1586420743
f
GR
GS
[1.00215 0 0 1 151.94947 130.75603] CT
0.302 GC
N
f-1586420743
f
GR
GS
[1.00215 0 0 1 151.63139 64.49339] CT
0.302 GC
N
f-1586420743
f
GR
GS
[1.00215 0 0 1 151.97635 102.54987] CT
0.302 GC
N
f-1586420743
f
GR
%%Trailer
%%Pages: 1
%%EOF
