%!PS-Adobe-3.0 EPSF-3.0
%%Creator: (MATLAB, The Mathworks, Inc. Version 9.8.0.1323502 \(R2020a\). Operating System: Mac OS X)
%%Title: /Users/kosciessa/Desktop/mntTardisLNDG/LNDG/stateswitch/stsw_multimodal/figures/linearbyage/linearcomp_theta.eps
%%CreationDate: 2022-03-03T16:32:25
%%Pages: (atend)
%%BoundingBox:     4     0   180   275
%%LanguageLevel: 3
%%EndComments
%%BeginProlog
%%BeginResource: procset (Apache XML Graphics Std ProcSet) 1.2 0
%%Version: 1.2 0
%%Copyright: (Copyright 2001-2003,2010 The Apache Software Foundation. License terms: http://www.apache.org/licenses/LICENSE-2.0)
/bd{bind def}bind def
/ld{load def}bd
/GR/grestore ld
/GS/gsave ld
/RM/rmoveto ld
/C/curveto ld
/t/show ld
/L/lineto ld
/ML/setmiterlimit ld
/CT/concat ld
/f/fill ld
/N/newpath ld
/S/stroke ld
/CC/setcmykcolor ld
/A/ashow ld
/cp/closepath ld
/RC/setrgbcolor ld
/LJ/setlinejoin ld
/GC/setgray ld
/LW/setlinewidth ld
/M/moveto ld
/re {4 2 roll M
1 index 0 rlineto
0 exch rlineto
neg 0 rlineto
cp } bd
/_ctm matrix def
/_tm matrix def
/BT { _ctm currentmatrix pop matrix _tm copy pop 0 0 moveto } bd
/ET { _ctm setmatrix } bd
/iTm { _ctm setmatrix _tm concat } bd
/Tm { _tm astore pop iTm 0 0 moveto } bd
/ux 0.0 def
/uy 0.0 def
/F {
  /Tp exch def
  /Tf exch def
  Tf findfont Tp scalefont setfont
  /cf Tf def  /cs Tp def
} bd
/ULS {currentpoint /uy exch def /ux exch def} bd
/ULE {
  /Tcx currentpoint pop def
  gsave
  newpath
  cf findfont cs scalefont dup
  /FontMatrix get 0 get /Ts exch def /FontInfo get dup
  /UnderlinePosition get Ts mul /To exch def
  /UnderlineThickness get Ts mul /Tt exch def
  ux uy To add moveto  Tcx uy To add lineto
  Tt setlinewidth stroke
  grestore
} bd
/OLE {
  /Tcx currentpoint pop def
  gsave
  newpath
  cf findfont cs scalefont dup
  /FontMatrix get 0 get /Ts exch def /FontInfo get dup
  /UnderlinePosition get Ts mul /To exch def
  /UnderlineThickness get Ts mul /Tt exch def
  ux uy To add cs add moveto Tcx uy To add cs add lineto
  Tt setlinewidth stroke
  grestore
} bd
/SOE {
  /Tcx currentpoint pop def
  gsave
  newpath
  cf findfont cs scalefont dup
  /FontMatrix get 0 get /Ts exch def /FontInfo get dup
  /UnderlinePosition get Ts mul /To exch def
  /UnderlineThickness get Ts mul /Tt exch def
  ux uy To add cs 10 mul 26 idiv add moveto Tcx uy To add cs 10 mul 26 idiv add lineto
  Tt setlinewidth stroke
  grestore
} bd
/QT {
/Y22 exch store
/X22 exch store
/Y21 exch store
/X21 exch store
currentpoint
/Y21 load 2 mul add 3 div exch
/X21 load 2 mul add 3 div exch
/X21 load 2 mul /X22 load add 3 div
/Y21 load 2 mul /Y22 load add 3 div
/X22 load /Y22 load curveto
} bd
/SSPD {
dup length /d exch dict def
{
/v exch def
/k exch def
currentpagedevice k known {
/cpdv currentpagedevice k get def
v cpdv ne {
/upd false def
/nullv v type /nulltype eq def
/nullcpdv cpdv type /nulltype eq def
nullv nullcpdv or
{
/upd true def
} {
/sametype v type cpdv type eq def
sametype {
v type /arraytype eq {
/vlen v length def
/cpdvlen cpdv length def
vlen cpdvlen eq {
0 1 vlen 1 sub {
/i exch def
/obj v i get def
/cpdobj cpdv i get def
obj cpdobj ne {
/upd true def
exit
} if
} for
} {
/upd true def
} ifelse
} {
v type /dicttype eq {
v {
/dv exch def
/dk exch def
/cpddv cpdv dk get def
dv cpddv ne {
/upd true def
exit
} if
} forall
} {
/upd true def
} ifelse
} ifelse
} if
} ifelse
upd true eq {
d k v put
} if
} if
} if
} forall
d length 0 gt {
d setpagedevice
} if
} bd
/RE { % /NewFontName [NewEncodingArray] /FontName RE -
  findfont dup length dict begin
  {
    1 index /FID ne
    {def} {pop pop} ifelse
  } forall
  /Encoding exch def
  /FontName 1 index def
  currentdict definefont pop
  end
} bind def
%%EndResource
%%BeginResource: procset (Apache XML Graphics EPS ProcSet) 1.0 0
%%Version: 1.0 0
%%Copyright: (Copyright 2002-2003 The Apache Software Foundation. License terms: http://www.apache.org/licenses/LICENSE-2.0)
/BeginEPSF { %def
/b4_Inc_state save def         % Save state for cleanup
/dict_count countdictstack def % Count objects on dict stack
/op_count count 1 sub def      % Count objects on operand stack
userdict begin                 % Push userdict on dict stack
/showpage { } def              % Redefine showpage, { } = null proc
0 setgray 0 setlinecap         % Prepare graphics state
1 setlinewidth 0 setlinejoin
10 setmiterlimit [ ] 0 setdash newpath
/languagelevel where           % If level not equal to 1 then
{pop languagelevel             % set strokeadjust and
1 ne                           % overprint to their defaults.
{false setstrokeadjust false setoverprint
} if
} if
} bd
/EndEPSF { %def
count op_count sub {pop} repeat            % Clean up stacks
countdictstack dict_count sub {end} repeat
b4_Inc_state restore
} bd
%%EndResource
%FOPBeginFontDict
%%IncludeResource: font Courier-Oblique
%%IncludeResource: font Courier-BoldOblique
%%IncludeResource: font Courier-Bold
%%IncludeResource: font ZapfDingbats
%%IncludeResource: font Symbol
%%IncludeResource: font Helvetica
%%IncludeResource: font Helvetica-Oblique
%%IncludeResource: font Helvetica-Bold
%%IncludeResource: font Helvetica-BoldOblique
%%IncludeResource: font Times-Roman
%%IncludeResource: font Times-Italic
%%IncludeResource: font Times-Bold
%%IncludeResource: font Times-BoldItalic
%%IncludeResource: font Courier
%FOPEndFontDict
%%BeginResource: encoding WinAnsiEncoding
/WinAnsiEncoding [
/.notdef /.notdef /.notdef /.notdef /.notdef
/.notdef /.notdef /.notdef /.notdef /.notdef
/.notdef /.notdef /.notdef /.notdef /.notdef
/.notdef /.notdef /.notdef /.notdef /.notdef
/.notdef /.notdef /.notdef /.notdef /.notdef
/.notdef /.notdef /.notdef /.notdef /.notdef
/.notdef /.notdef /space /exclam /quotedbl
/numbersign /dollar /percent /ampersand /quotesingle
/parenleft /parenright /asterisk /plus /comma
/hyphen /period /slash /zero /one
/two /three /four /five /six
/seven /eight /nine /colon /semicolon
/less /equal /greater /question /at
/A /B /C /D /E
/F /G /H /I /J
/K /L /M /N /O
/P /Q /R /S /T
/U /V /W /X /Y
/Z /bracketleft /backslash /bracketright /asciicircum
/underscore /quoteleft /a /b /c
/d /e /f /g /h
/i /j /k /l /m
/n /o /p /q /r
/s /t /u /v /w
/x /y /z /braceleft /bar
/braceright /asciitilde /bullet /Euro /bullet
/quotesinglbase /florin /quotedblbase /ellipsis /dagger
/daggerdbl /circumflex /perthousand /Scaron /guilsinglleft
/OE /bullet /Zcaron /bullet /bullet
/quoteleft /quoteright /quotedblleft /quotedblright /bullet
/endash /emdash /asciitilde /trademark /scaron
/guilsinglright /oe /bullet /zcaron /Ydieresis
/space /exclamdown /cent /sterling /currency
/yen /brokenbar /section /dieresis /copyright
/ordfeminine /guillemotleft /logicalnot /sfthyphen /registered
/macron /degree /plusminus /twosuperior /threesuperior
/acute /mu /paragraph /middot /cedilla
/onesuperior /ordmasculine /guillemotright /onequarter /onehalf
/threequarters /questiondown /Agrave /Aacute /Acircumflex
/Atilde /Adieresis /Aring /AE /Ccedilla
/Egrave /Eacute /Ecircumflex /Edieresis /Igrave
/Iacute /Icircumflex /Idieresis /Eth /Ntilde
/Ograve /Oacute /Ocircumflex /Otilde /Odieresis
/multiply /Oslash /Ugrave /Uacute /Ucircumflex
/Udieresis /Yacute /Thorn /germandbls /agrave
/aacute /acircumflex /atilde /adieresis /aring
/ae /ccedilla /egrave /eacute /ecircumflex
/edieresis /igrave /iacute /icircumflex /idieresis
/eth /ntilde /ograve /oacute /ocircumflex
/otilde /odieresis /divide /oslash /ugrave
/uacute /ucircumflex /udieresis /yacute /thorn
/ydieresis
] def
%%EndResource
%FOPBeginFontReencode
/Courier-Oblique findfont
dup length dict begin
  {1 index /FID ne {def} {pop pop} ifelse} forall
  /Encoding WinAnsiEncoding def
  currentdict
end
/Courier-Oblique exch definefont pop
/Courier-BoldOblique findfont
dup length dict begin
  {1 index /FID ne {def} {pop pop} ifelse} forall
  /Encoding WinAnsiEncoding def
  currentdict
end
/Courier-BoldOblique exch definefont pop
/Courier-Bold findfont
dup length dict begin
  {1 index /FID ne {def} {pop pop} ifelse} forall
  /Encoding WinAnsiEncoding def
  currentdict
end
/Courier-Bold exch definefont pop
/Helvetica findfont
dup length dict begin
  {1 index /FID ne {def} {pop pop} ifelse} forall
  /Encoding WinAnsiEncoding def
  currentdict
end
/Helvetica exch definefont pop
/Helvetica-Oblique findfont
dup length dict begin
  {1 index /FID ne {def} {pop pop} ifelse} forall
  /Encoding WinAnsiEncoding def
  currentdict
end
/Helvetica-Oblique exch definefont pop
/Helvetica-Bold findfont
dup length dict begin
  {1 index /FID ne {def} {pop pop} ifelse} forall
  /Encoding WinAnsiEncoding def
  currentdict
end
/Helvetica-Bold exch definefont pop
/Helvetica-BoldOblique findfont
dup length dict begin
  {1 index /FID ne {def} {pop pop} ifelse} forall
  /Encoding WinAnsiEncoding def
  currentdict
end
/Helvetica-BoldOblique exch definefont pop
/Times-Roman findfont
dup length dict begin
  {1 index /FID ne {def} {pop pop} ifelse} forall
  /Encoding WinAnsiEncoding def
  currentdict
end
/Times-Roman exch definefont pop
/Times-Italic findfont
dup length dict begin
  {1 index /FID ne {def} {pop pop} ifelse} forall
  /Encoding WinAnsiEncoding def
  currentdict
end
/Times-Italic exch definefont pop
/Times-Bold findfont
dup length dict begin
  {1 index /FID ne {def} {pop pop} ifelse} forall
  /Encoding WinAnsiEncoding def
  currentdict
end
/Times-Bold exch definefont pop
/Times-BoldItalic findfont
dup length dict begin
  {1 index /FID ne {def} {pop pop} ifelse} forall
  /Encoding WinAnsiEncoding def
  currentdict
end
/Times-BoldItalic exch definefont pop
/Courier findfont
dup length dict begin
  {1 index /FID ne {def} {pop pop} ifelse} forall
  /Encoding WinAnsiEncoding def
  currentdict
end
/Courier exch definefont pop
%FOPEndFontReencode
%%EndProlog
%%Page: 1 1
%%PageBoundingBox: 0 0 198 283
%%BeginPageSetup
[1 0 0 -1 0 283] CT
%%EndPageSetup
GS
[1.00215 0 0 1 0 0] CT
1 GC
N
0 0 198 283 re
f
GR
GS
[1.00215 0 0 1 0 0] CT
1 GC
N
0 0 198 283 re
f
GR
GS
[1.00215 0 0 1 0 0] CT
1 GC
N
69 228 M
179 228 L
179 32 L
69 32 L
cp
f
GR
GS
[1.00215 0 0 1 0 0] CT
0.149 GC
2 setlinecap
1 LJ
0.5 LW
N
69 228 M
179 228 L
S
GR
GS
[1.00215 0 0 1 0 0] CT
0.149 GC
2 setlinecap
1 LJ
0.5 LW
N
102 228 M
102 226.04 L
S
GR
GS
[1.00215 0 0 1 0 0] CT
0.149 GC
2 setlinecap
1 LJ
0.5 LW
N
146 228 M
146 226.04 L
S
GR
GS
[1.00215 0 0 1 102.21904 234] CT
0.149 GC
/Helvetica 20 F
GS
[1 0 0 1 0 0] CT
-13 20 moveto 
1 -1 scale
(YA) t 
GR
GR
GS
[1.00215 0 0 1 146.31353 234] CT
0.149 GC
/Helvetica 20 F
GS
[1 0 0 1 0 0] CT
-14.5 20 moveto 
1 -1 scale
(OA) t 
GR
GR
GS
[1.00215 0 0 1 124.26634 259] CT
0.149 GC
/Helvetica 20 F
GS
[1 0 0 1 0 0] CT
-49 20 moveto 
1 -1 scale
(Age Group) t 
GR
GR
GS
[1.00215 0 0 1 0 0] CT
0.149 GC
2 setlinecap
1 LJ
0.5 LW
N
69 228 M
69 32 L
S
GR
GS
[1.00215 0 0 1 0 0] CT
0.149 GC
2 setlinecap
1 LJ
0.5 LW
N
69 223.694 M
70.96 223.694 L
S
GR
GS
[1.00215 0 0 1 0 0] CT
0.149 GC
2 setlinecap
1 LJ
0.5 LW
N
69 175.77 M
70.96 175.77 L
S
GR
GS
[1.00215 0 0 1 0 0] CT
0.149 GC
2 setlinecap
1 LJ
0.5 LW
N
69 127.847 M
70.96 127.847 L
S
GR
GS
[1.00215 0 0 1 0 0] CT
0.149 GC
2 setlinecap
1 LJ
0.5 LW
N
69 79.923 M
70.96 79.923 L
S
GR
GS
[1.00215 0 0 1 0 0] CT
0.149 GC
2 setlinecap
1 LJ
0.5 LW
N
69 32 M
70.96 32 L
S
GR
GS
[1.00215 0 0 1 63.13529 223.69392] CT
0.149 GC
/Helvetica 20 F
GS
[1 0 0 1 0 0] CT
-36 7.5 moveto 
1 -1 scale
(-0.1) t 
GR
GR
GS
[1.00215 0 0 1 63.13529 175.77043] CT
0.149 GC
/Helvetica 20 F
GS
[1 0 0 1 0 0] CT
-12 7.5 moveto 
1 -1 scale
(0) t 
GR
GR
GS
[1.00215 0 0 1 63.13529 127.84696] CT
0.149 GC
/Helvetica 20 F
GS
[1 0 0 1 0 0] CT
-28 7.5 moveto 
1 -1 scale
(0.1) t 
GR
GR
GS
[1.00215 0 0 1 63.13529 79.92348] CT
0.149 GC
/Helvetica 20 F
GS
[1 0 0 1 0 0] CT
-28 7.5 moveto 
1 -1 scale
(0.2) t 
GR
GR
GS
[1.00215 0 0 1 63.13529 31.99999] CT
0.149 GC
/Helvetica 20 F
GS
[1 0 0 1 0 0] CT
-28 7.5 moveto 
1 -1 scale
(0.3) t 
GR
GR
GS
[0 -1 1.00215 0 24.05154 129.99991] CT
0.149 GC
/Helvetica 20 F
GS
[1 0 0 1 0 0] CT
-49.5 -5 moveto 
1 -1 scale
(theta linear) t 
GR
GR
GS
[1.00215 0 0 1 124.26641 29.24999] CT
/Helvetica-Bold 22 F
GS
[1 0 0 1 0 0] CT
-58 -5 moveto 
1 -1 scale
(p = 4.5e-07) t 
GR
GR
GS
[1.00215 0 0 1 0 0] CT
0.149 GC
1 LJ
0.5 LW
N
69 175.77 M
179 175.77 L
S
GR
GS
[1.00215 0 0 1 0 0] CT
1 0.6 0.6 RC
N
119.6 175.77 M
119.6 132.182 L
84.4 132.182 L
84.4 175.77 L
cp
f
GR
GS
[1.00215 0 0 1 109.97075 187.05734] CT
0.302 GC
N
2.236 0 M
2.236 -1.235 1.235 -2.236 0 -2.236 C
-1.235 -2.236 -2.236 -1.235 -2.236 0 C
-2.236 1.235 -1.235 2.236 0 2.236 C
1.235 2.236 2.236 1.235 2.236 0 C
cp
f
GR
GS
[1.00215 0 0 1 100.10996 194.04182] CT
0.302 GC
N
/f-1586420743{2.236 0 M
2.236 -1.235 1.235 -2.236 0 -2.236 C
-1.235 -2.236 -2.236 -1.235 -2.236 0 C
-2.236 1.235 -1.235 2.236 0 2.236 C
1.235 2.236 2.236 1.235 2.236 0 C
cp}def
f-1586420743
f
GR
GS
[1.00215 0 0 1 108.08017 98.29881] CT
0.302 GC
N
f-1586420743
f
GR
GS
[1.00215 0 0 1 110.52335 128.29358] CT
0.302 GC
N
f-1586420743
f
GR
GS
[1.00215 0 0 1 96.48537 168.22618] CT
0.302 GC
N
f-1586420743
f
GR
GS
[1.00215 0 0 1 107.0068 144.01207] CT
0.302 GC
N
f-1586420743
f
GR
GS
[1.00215 0 0 1 106.97154 141.81145] CT
0.302 GC
N
f-1586420743
f
GR
GS
[1.00215 0 0 1 99.89504 108.43737] CT
0.302 GC
N
f-1586420743
f
GR
GS
[1.00215 0 0 1 94.06328 171.44745] CT
0.302 GC
N
f-1586420743
f
GR
GS
[1.00215 0 0 1 99.92977 129.74968] CT
0.302 GC
N
f-1586420743
f
GR
GS
[1.00215 0 0 1 108.00661 115.40439] CT
0.302 GC
N
f-1586420743
f
GR
GS
[1.00215 0 0 1 95.55155 155.96999] CT
0.302 GC
N
f-1586420743
f
GR
GS
[1.00215 0 0 1 106.84041 147.89394] CT
0.302 GC
N
f-1586420743
f
GR
GS
[1.00215 0 0 1 94.86799 158.57399] CT
0.302 GC
N
f-1586420743
f
GR
GS
[1.00215 0 0 1 105.11599 113.55386] CT
0.302 GC
N
f-1586420743
f
GR
GS
[1.00215 0 0 1 97.56176 195.18898] CT
0.302 GC
N
f-1586420743
f
GR
GS
[1.00215 0 0 1 97.17017 161.80431] CT
0.302 GC
N
f-1586420743
f
GR
GS
[1.00215 0 0 1 101.94636 160.87653] CT
0.302 GC
N
f-1586420743
f
GR
GS
[1.00215 0 0 1 102.48668 113.95505] CT
0.302 GC
N
f-1586420743
f
GR
GS
[1.00215 0 0 1 109.71915 179.18111] CT
0.302 GC
N
f-1586420743
f
GR
GS
[1.00215 0 0 1 94.49236 148.29803] CT
0.302 GC
N
f-1586420743
f
GR
GS
[1.00215 0 0 1 102.47032 67.61912] CT
0.302 GC
N
f-1586420743
f
GR
GS
[1.00215 0 0 1 104.71824 179.88127] CT
0.302 GC
N
f-1586420743
f
GR
GS
[1.00215 0 0 1 110.64546 97.36326] CT
0.302 GC
N
f-1586420743
f
GR
GS
[1.00215 0 0 1 96.80302 85.51885] CT
0.302 GC
N
f-1586420743
f
GR
GS
[1.00215 0 0 1 104.03934 187.98047] CT
0.302 GC
N
f-1586420743
f
GR
GS
[1.00215 0 0 1 106.60268 108.68417] CT
0.302 GC
N
f-1586420743
f
GR
GS
[1.00215 0 0 1 106.04384 120.98505] CT
0.302 GC
N
f-1586420743
f
GR
GS
[1.00215 0 0 1 101.51468 124.44955] CT
0.302 GC
N
f-1586420743
f
GR
GS
[1.00215 0 0 1 98.44827 88.75008] CT
0.302 GC
N
f-1586420743
f
GR
GS
[1.00215 0 0 1 100.1843 107.49469] CT
0.302 GC
N
f-1586420743
f
GR
GS
[1.00215 0 0 1 104.06879 55.71548] CT
0.302 GC
N
f-1586420743
f
GR
GS
[1.00215 0 0 1 93.93155 70.13272] CT
0.302 GC
N
f-1586420743
f
GR
GS
[1.00215 0 0 1 105.35521 60.06335] CT
0.302 GC
N
f-1586420743
f
GR
GS
[1.00215 0 0 1 108.81818 55.71548] CT
0.302 GC
N
f-1586420743
f
GR
GS
[1.00215 0 0 1 106.13265 64.68926] CT
0.302 GC
N
f-1586420743
f
GR
GS
[1.00215 0 0 1 108.93141 184.07556] CT
0.302 GC
N
f-1586420743
f
GR
GS
[1.00215 0 0 1 104.67554 141.55176] CT
0.302 GC
N
f-1586420743
f
GR
GS
[1.00215 0 0 1 93.4669 165.54485] CT
0.302 GC
N
f-1586420743
f
GR
GS
[1.00215 0 0 1 108.54175 143.56984] CT
0.302 GC
N
f-1586420743
f
GR
GS
[1.00215 0 0 1 102.26678 146.87776] CT
0.302 GC
N
f-1586420743
f
GR
GS
[1.00215 0 0 1 101.64408 172.88564] CT
0.302 GC
N
f-1586420743
f
GR
GS
[1.00215 0 0 1 0 0] CT
1 0.6 0.6 RC
N
/f2109062466{163.6 175.77 M
163.6 168.479 L
128.4 168.479 L
128.4 175.77 L
cp}def
f2109062466
f
GR
GS
[1.00215 0 0 1 142.12204 167.81412] CT
0.302 GC
N
f-1586420743
f
GR
GS
[1.00215 0 0 1 154.35166 163.35402] CT
0.302 GC
N
f-1586420743
f
GR
GS
[1.00215 0 0 1 148.23735 137.13791] CT
0.302 GC
N
f-1586420743
f
GR
GS
[1.00215 0 0 1 154.67794 199.31638] CT
0.302 GC
N
f-1586420743
f
GR
GS
[1.00215 0 0 1 141.78616 157.76102] CT
0.302 GC
N
f-1586420743
f
GR
GS
[1.00215 0 0 1 150.64941 175.25774] CT
0.302 GC
N
f-1586420743
f
GR
GS
[1.00215 0 0 1 148.96004 174.1412] CT
0.302 GC
N
f-1586420743
f
GR
GS
[1.00215 0 0 1 138.63717 127.79239] CT
0.302 GC
N
f-1586420743
f
GR
GS
[1.00215 0 0 1 146.70695 173.99568] CT
0.302 GC
N
f-1586420743
f
GR
GS
[1.00215 0 0 1 141.6566 137.49741] CT
0.302 GC
N
f-1586420743
f
GR
GS
[1.00215 0 0 1 141.89285 179.22241] CT
0.302 GC
N
f-1586420743
f
GR
GS
[1.00215 0 0 1 142.40969 222.08626] CT
0.302 GC
N
f-1586420743
f
GR
GS
[1.00215 0 0 1 148.24776 157.09357] CT
0.302 GC
N
f-1586420743
f
GR
GS
[1.00215 0 0 1 147.15185 200.4478] CT
0.302 GC
N
f-1586420743
f
GR
GS
[1.00215 0 0 1 143.60124 154.49643] CT
0.302 GC
N
f-1586420743
f
GR
GS
[1.00215 0 0 1 142.88533 150.14975] CT
0.302 GC
N
f-1586420743
f
GR
GS
[1.00215 0 0 1 143.45283 175.85252] CT
0.302 GC
N
f-1586420743
f
GR
GS
[1.00215 0 0 1 148.82196 150.84326] CT
0.302 GC
N
f-1586420743
f
GR
GS
[1.00215 0 0 1 147.13073 172.86453] CT
0.302 GC
N
f-1586420743
f
GR
GS
[1.00215 0 0 1 140.52889 170.14151] CT
0.302 GC
N
f-1586420743
f
GR
GS
[1.00215 0 0 1 140.41671 148.80498] CT
0.302 GC
N
f-1586420743
f
GR
GS
[1.00215 0 0 1 151.95734 136.84102] CT
0.302 GC
N
f-1586420743
f
GR
GS
[1.00215 0 0 1 152.69248 184.33791] CT
0.302 GC
N
f-1586420743
f
GR
GS
[1.00215 0 0 1 142.42873 187.25697] CT
0.302 GC
N
f-1586420743
f
GR
GS
[1.00215 0 0 1 145.84457 169.00816] CT
0.302 GC
N
f-1586420743
f
GR
GS
[1.00215 0 0 1 154.14477 157.30846] CT
0.302 GC
N
f-1586420743
f
GR
GS
[1.00215 0 0 1 152.36017 156.97072] CT
0.302 GC
N
f-1586420743
f
GR
GS
[1.00215 0 0 1 145.47904 181.68044] CT
0.302 GC
N
f-1586420743
f
GR
GS
[1.00215 0 0 1 148.43921 158.60844] CT
0.302 GC
N
f-1586420743
f
GR
GS
[1.00215 0 0 1 146.7474 169.56154] CT
0.302 GC
N
f-1586420743
f
GR
GS
[1.00215 0 0 1 137.98942 182.87183] CT
0.302 GC
N
f-1586420743
f
GR
GS
[1.00215 0 0 1 139.80532 161.66801] CT
0.302 GC
N
f-1586420743
f
GR
GS
[1.00215 0 0 1 148.57858 185.13918] CT
0.302 GC
N
f-1586420743
f
GR
GS
[1.00215 0 0 1 141.75021 201.62714] CT
0.302 GC
N
f-1586420743
f
GR
GS
[1.00215 0 0 1 143.93755 187.82059] CT
0.302 GC
N
f-1586420743
f
GR
GS
[1.00215 0 0 1 149.13207 184.57895] CT
0.302 GC
N
f-1586420743
f
GR
GS
[1.00215 0 0 1 145.96034 137.90901] CT
0.302 GC
N
f-1586420743
f
GR
GS
[1.00215 0 0 1 149.34557 163.71727] CT
0.302 GC
N
f-1586420743
f
GR
GS
[1.00215 0 0 1 153.77552 158.66685] CT
0.302 GC
N
f-1586420743
f
GR
GS
[1.00215 0 0 1 153.12217 173.62109] CT
0.302 GC
N
f-1586420743
f
GR
GS
[1.00215 0 0 1 148.88248 186.35251] CT
0.302 GC
N
f-1586420743
f
GR
GS
[1.00215 0 0 1 142.41178 228] CT
0.302 GC
N
f-1586420743
f
GR
GS
[1.00215 0 0 1 152.34896 198.30797] CT
0.302 GC
N
f-1586420743
f
GR
GS
[1.00215 0 0 1 152.44722 109.01241] CT
0.302 GC
N
f-1586420743
f
GR
GS
[1.00215 0 0 1 152.8837 179.28676] CT
0.302 GC
N
f-1586420743
f
GR
GS
[1.00215 0 0 1 151.92974 167.49173] CT
0.302 GC
N
f-1586420743
f
GR
GS
[1.00215 0 0 1 138.68329 155.25053] CT
0.302 GC
N
f-1586420743
f
GR
GS
[1.00215 0 0 1 144.64113 182.03893] CT
0.302 GC
N
f-1586420743
f
GR
GS
[1.00215 0 0 1 152.37121 148.30435] CT
0.302 GC
N
f-1586420743
f
GR
GS
[1.00215 0 0 1 148.41251 134.44881] CT
0.302 GC
N
f-1586420743
f
GR
GS
[1.00215 0 0 1 151.69208 164.91936] CT
0.302 GC
N
f-1586420743
f
GR
GS
[1.00215 0 0 1 141.14044 199.72861] CT
0.302 GC
N
f-1586420743
f
GR
GS
[1.00215 0 0 1 138.04289 140.97983] CT
0.302 GC
N
f-1586420743
f
GR
%%Trailer
%%Pages: 1
%%EOF
