%!PS-Adobe-3.0 EPSF-3.0
%%Creator: (MATLAB, The Mathworks, Inc. Version 9.8.0.1323502 \(R2020a\). Operating System: Mac OS X)
%%Title: /Users/kosciessa/Desktop/mntTardisLNDG/LNDG/stateswitch/stsw_multimodal/figures/correlations/f_stroop-rt-match_stroop-rt-mismatch.eps
%%CreationDate: 2022-03-28T15:32:38
%%Pages: (atend)
%%BoundingBox:   -19     0   272   194
%%LanguageLevel: 3
%%EndComments
%%BeginProlog
%%BeginResource: procset (Apache XML Graphics Std ProcSet) 1.2 0
%%Version: 1.2 0
%%Copyright: (Copyright 2001-2003,2010 The Apache Software Foundation. License terms: http://www.apache.org/licenses/LICENSE-2.0)
/bd{bind def}bind def
/ld{load def}bd
/GR/grestore ld
/GS/gsave ld
/RM/rmoveto ld
/C/curveto ld
/t/show ld
/L/lineto ld
/ML/setmiterlimit ld
/CT/concat ld
/f/fill ld
/N/newpath ld
/S/stroke ld
/CC/setcmykcolor ld
/A/ashow ld
/cp/closepath ld
/RC/setrgbcolor ld
/LJ/setlinejoin ld
/GC/setgray ld
/LW/setlinewidth ld
/M/moveto ld
/re {4 2 roll M
1 index 0 rlineto
0 exch rlineto
neg 0 rlineto
cp } bd
/_ctm matrix def
/_tm matrix def
/BT { _ctm currentmatrix pop matrix _tm copy pop 0 0 moveto } bd
/ET { _ctm setmatrix } bd
/iTm { _ctm setmatrix _tm concat } bd
/Tm { _tm astore pop iTm 0 0 moveto } bd
/ux 0.0 def
/uy 0.0 def
/F {
  /Tp exch def
  /Tf exch def
  Tf findfont Tp scalefont setfont
  /cf Tf def  /cs Tp def
} bd
/ULS {currentpoint /uy exch def /ux exch def} bd
/ULE {
  /Tcx currentpoint pop def
  gsave
  newpath
  cf findfont cs scalefont dup
  /FontMatrix get 0 get /Ts exch def /FontInfo get dup
  /UnderlinePosition get Ts mul /To exch def
  /UnderlineThickness get Ts mul /Tt exch def
  ux uy To add moveto  Tcx uy To add lineto
  Tt setlinewidth stroke
  grestore
} bd
/OLE {
  /Tcx currentpoint pop def
  gsave
  newpath
  cf findfont cs scalefont dup
  /FontMatrix get 0 get /Ts exch def /FontInfo get dup
  /UnderlinePosition get Ts mul /To exch def
  /UnderlineThickness get Ts mul /Tt exch def
  ux uy To add cs add moveto Tcx uy To add cs add lineto
  Tt setlinewidth stroke
  grestore
} bd
/SOE {
  /Tcx currentpoint pop def
  gsave
  newpath
  cf findfont cs scalefont dup
  /FontMatrix get 0 get /Ts exch def /FontInfo get dup
  /UnderlinePosition get Ts mul /To exch def
  /UnderlineThickness get Ts mul /Tt exch def
  ux uy To add cs 10 mul 26 idiv add moveto Tcx uy To add cs 10 mul 26 idiv add lineto
  Tt setlinewidth stroke
  grestore
} bd
/QT {
/Y22 exch store
/X22 exch store
/Y21 exch store
/X21 exch store
currentpoint
/Y21 load 2 mul add 3 div exch
/X21 load 2 mul add 3 div exch
/X21 load 2 mul /X22 load add 3 div
/Y21 load 2 mul /Y22 load add 3 div
/X22 load /Y22 load curveto
} bd
/SSPD {
dup length /d exch dict def
{
/v exch def
/k exch def
currentpagedevice k known {
/cpdv currentpagedevice k get def
v cpdv ne {
/upd false def
/nullv v type /nulltype eq def
/nullcpdv cpdv type /nulltype eq def
nullv nullcpdv or
{
/upd true def
} {
/sametype v type cpdv type eq def
sametype {
v type /arraytype eq {
/vlen v length def
/cpdvlen cpdv length def
vlen cpdvlen eq {
0 1 vlen 1 sub {
/i exch def
/obj v i get def
/cpdobj cpdv i get def
obj cpdobj ne {
/upd true def
exit
} if
} for
} {
/upd true def
} ifelse
} {
v type /dicttype eq {
v {
/dv exch def
/dk exch def
/cpddv cpdv dk get def
dv cpddv ne {
/upd true def
exit
} if
} forall
} {
/upd true def
} ifelse
} ifelse
} if
} ifelse
upd true eq {
d k v put
} if
} if
} if
} forall
d length 0 gt {
d setpagedevice
} if
} bd
/RE { % /NewFontName [NewEncodingArray] /FontName RE -
  findfont dup length dict begin
  {
    1 index /FID ne
    {def} {pop pop} ifelse
  } forall
  /Encoding exch def
  /FontName 1 index def
  currentdict definefont pop
  end
} bind def
%%EndResource
%%BeginResource: procset (Apache XML Graphics EPS ProcSet) 1.0 0
%%Version: 1.0 0
%%Copyright: (Copyright 2002-2003 The Apache Software Foundation. License terms: http://www.apache.org/licenses/LICENSE-2.0)
/BeginEPSF { %def
/b4_Inc_state save def         % Save state for cleanup
/dict_count countdictstack def % Count objects on dict stack
/op_count count 1 sub def      % Count objects on operand stack
userdict begin                 % Push userdict on dict stack
/showpage { } def              % Redefine showpage, { } = null proc
0 setgray 0 setlinecap         % Prepare graphics state
1 setlinewidth 0 setlinejoin
10 setmiterlimit [ ] 0 setdash newpath
/languagelevel where           % If level not equal to 1 then
{pop languagelevel             % set strokeadjust and
1 ne                           % overprint to their defaults.
{false setstrokeadjust false setoverprint
} if
} if
} bd
/EndEPSF { %def
count op_count sub {pop} repeat            % Clean up stacks
countdictstack dict_count sub {end} repeat
b4_Inc_state restore
} bd
%%EndResource
%FOPBeginFontDict
%%IncludeResource: font Courier-Oblique
%%IncludeResource: font Courier-BoldOblique
%%IncludeResource: font Courier-Bold
%%IncludeResource: font ZapfDingbats
%%IncludeResource: font Symbol
%%IncludeResource: font Helvetica
%%IncludeResource: font Helvetica-Oblique
%%IncludeResource: font Helvetica-Bold
%%IncludeResource: font Helvetica-BoldOblique
%%IncludeResource: font Times-Roman
%%IncludeResource: font Times-Italic
%%IncludeResource: font Times-Bold
%%IncludeResource: font Times-BoldItalic
%%IncludeResource: font Courier
%FOPEndFontDict
%%BeginResource: encoding WinAnsiEncoding
/WinAnsiEncoding [
/.notdef /.notdef /.notdef /.notdef /.notdef
/.notdef /.notdef /.notdef /.notdef /.notdef
/.notdef /.notdef /.notdef /.notdef /.notdef
/.notdef /.notdef /.notdef /.notdef /.notdef
/.notdef /.notdef /.notdef /.notdef /.notdef
/.notdef /.notdef /.notdef /.notdef /.notdef
/.notdef /.notdef /space /exclam /quotedbl
/numbersign /dollar /percent /ampersand /quotesingle
/parenleft /parenright /asterisk /plus /comma
/hyphen /period /slash /zero /one
/two /three /four /five /six
/seven /eight /nine /colon /semicolon
/less /equal /greater /question /at
/A /B /C /D /E
/F /G /H /I /J
/K /L /M /N /O
/P /Q /R /S /T
/U /V /W /X /Y
/Z /bracketleft /backslash /bracketright /asciicircum
/underscore /quoteleft /a /b /c
/d /e /f /g /h
/i /j /k /l /m
/n /o /p /q /r
/s /t /u /v /w
/x /y /z /braceleft /bar
/braceright /asciitilde /bullet /Euro /bullet
/quotesinglbase /florin /quotedblbase /ellipsis /dagger
/daggerdbl /circumflex /perthousand /Scaron /guilsinglleft
/OE /bullet /Zcaron /bullet /bullet
/quoteleft /quoteright /quotedblleft /quotedblright /bullet
/endash /emdash /asciitilde /trademark /scaron
/guilsinglright /oe /bullet /zcaron /Ydieresis
/space /exclamdown /cent /sterling /currency
/yen /brokenbar /section /dieresis /copyright
/ordfeminine /guillemotleft /logicalnot /sfthyphen /registered
/macron /degree /plusminus /twosuperior /threesuperior
/acute /mu /paragraph /middot /cedilla
/onesuperior /ordmasculine /guillemotright /onequarter /onehalf
/threequarters /questiondown /Agrave /Aacute /Acircumflex
/Atilde /Adieresis /Aring /AE /Ccedilla
/Egrave /Eacute /Ecircumflex /Edieresis /Igrave
/Iacute /Icircumflex /Idieresis /Eth /Ntilde
/Ograve /Oacute /Ocircumflex /Otilde /Odieresis
/multiply /Oslash /Ugrave /Uacute /Ucircumflex
/Udieresis /Yacute /Thorn /germandbls /agrave
/aacute /acircumflex /atilde /adieresis /aring
/ae /ccedilla /egrave /eacute /ecircumflex
/edieresis /igrave /iacute /icircumflex /idieresis
/eth /ntilde /ograve /oacute /ocircumflex
/otilde /odieresis /divide /oslash /ugrave
/uacute /ucircumflex /udieresis /yacute /thorn
/ydieresis
] def
%%EndResource
%FOPBeginFontReencode
/Courier-Oblique findfont
dup length dict begin
  {1 index /FID ne {def} {pop pop} ifelse} forall
  /Encoding WinAnsiEncoding def
  currentdict
end
/Courier-Oblique exch definefont pop
/Courier-BoldOblique findfont
dup length dict begin
  {1 index /FID ne {def} {pop pop} ifelse} forall
  /Encoding WinAnsiEncoding def
  currentdict
end
/Courier-BoldOblique exch definefont pop
/Courier-Bold findfont
dup length dict begin
  {1 index /FID ne {def} {pop pop} ifelse} forall
  /Encoding WinAnsiEncoding def
  currentdict
end
/Courier-Bold exch definefont pop
/Helvetica findfont
dup length dict begin
  {1 index /FID ne {def} {pop pop} ifelse} forall
  /Encoding WinAnsiEncoding def
  currentdict
end
/Helvetica exch definefont pop
/Helvetica-Oblique findfont
dup length dict begin
  {1 index /FID ne {def} {pop pop} ifelse} forall
  /Encoding WinAnsiEncoding def
  currentdict
end
/Helvetica-Oblique exch definefont pop
/Helvetica-Bold findfont
dup length dict begin
  {1 index /FID ne {def} {pop pop} ifelse} forall
  /Encoding WinAnsiEncoding def
  currentdict
end
/Helvetica-Bold exch definefont pop
/Helvetica-BoldOblique findfont
dup length dict begin
  {1 index /FID ne {def} {pop pop} ifelse} forall
  /Encoding WinAnsiEncoding def
  currentdict
end
/Helvetica-BoldOblique exch definefont pop
/Times-Roman findfont
dup length dict begin
  {1 index /FID ne {def} {pop pop} ifelse} forall
  /Encoding WinAnsiEncoding def
  currentdict
end
/Times-Roman exch definefont pop
/Times-Italic findfont
dup length dict begin
  {1 index /FID ne {def} {pop pop} ifelse} forall
  /Encoding WinAnsiEncoding def
  currentdict
end
/Times-Italic exch definefont pop
/Times-Bold findfont
dup length dict begin
  {1 index /FID ne {def} {pop pop} ifelse} forall
  /Encoding WinAnsiEncoding def
  currentdict
end
/Times-Bold exch definefont pop
/Times-BoldItalic findfont
dup length dict begin
  {1 index /FID ne {def} {pop pop} ifelse} forall
  /Encoding WinAnsiEncoding def
  currentdict
end
/Times-BoldItalic exch definefont pop
/Courier findfont
dup length dict begin
  {1 index /FID ne {def} {pop pop} ifelse} forall
  /Encoding WinAnsiEncoding def
  currentdict
end
/Courier exch definefont pop
%FOPEndFontReencode
%%EndProlog
%%Page: 1 1
%%PageBoundingBox: 0 0 227 198
%%BeginPageSetup
[1 0 0 -1 0 198] CT
%%EndPageSetup
GS
[0.99899 0 0 1.00215 0 -0.4252] CT
N
0 0 M
227 0 L
227 198 L
0 198 L
0 0 L
cp
clip
1 GC
N
0 0 227 198 re
f
GR
GS
[0.99899 0 0 1.00215 0 -0.4252] CT
1 GC
N
0 0 227 198 re
f
GR
GS
[0.99899 0 0 1.00215 0 -0.4252] CT
0.2 GC
N
44 160 M
205.5 160 L
205.5 21 L
44 21 L
cp
f
GR
GS
[0.99899 0 0 1.00215 0 -0.4252] CT
0.149 GC
2 setlinecap
1 LJ
0.5 LW
N
44 160 M
205.5 160 L
S
GR
GS
[0.99899 0 0 1.00215 0 -0.4252] CT
0.149 GC
2 setlinecap
1 LJ
0.5 LW
N
84.472 160 M
84.472 158.385 L
S
GR
GS
[0.99899 0 0 1.00215 0 -0.4252] CT
0.149 GC
2 setlinecap
1 LJ
0.5 LW
N
125.981 160 M
125.981 158.385 L
S
GR
GS
[0.99899 0 0 1.00215 0 -0.4252] CT
0.149 GC
2 setlinecap
1 LJ
0.5 LW
N
167.489 160 M
167.489 158.385 L
S
GR
GS
[0.99899 0 0 1.00215 84.38698 164.72871] CT
0.149 GC
/Helvetica 14 F
GS
[1 0 0 1 0 0] CT
-10 14 moveto 
1 -1 scale
(1.6) t 
GR
GR
GS
[0.99899 0 0 1.00215 125.85393 164.72871] CT
0.149 GC
/Helvetica 14 F
GS
[1 0 0 1 0 0] CT
-10 14 moveto 
1 -1 scale
(1.8) t 
GR
GR
GS
[0.99899 0 0 1.00215 167.32091 164.72871] CT
0.149 GC
/Helvetica 14 F
GS
[1 0 0 1 0 0] CT
-4 14 moveto 
1 -1 scale
(2) t 
GR
GR
GS
[0.99899 0 0 1.00215 124.62457 182.26629] CT
0.149 GC
/Helvetica 14 F
GS
[1 0 0 1 0 0] CT
-53 14 moveto 
1 -1 scale
(stroop mismatch) t 
GR
GR
GS
[0.99899 0 0 1.00215 0 -0.4252] CT
0.149 GC
2 setlinecap
1 LJ
0.5 LW
N
44 160 M
44 21 L
S
GR
GS
[0.99899 0 0 1.00215 0 -0.4252] CT
0.149 GC
2 setlinecap
1 LJ
0.5 LW
N
44 144.339 M
45.615 144.339 L
S
GR
GS
[0.99899 0 0 1.00215 0 -0.4252] CT
0.149 GC
2 setlinecap
1 LJ
0.5 LW
N
44 108.661 M
45.615 108.661 L
S
GR
GS
[0.99899 0 0 1.00215 0 -0.4252] CT
0.149 GC
2 setlinecap
1 LJ
0.5 LW
N
44 72.984 M
45.615 72.984 L
S
GR
GS
[0.99899 0 0 1.00215 0 -0.4252] CT
0.149 GC
2 setlinecap
1 LJ
0.5 LW
N
44 37.306 M
45.615 37.306 L
S
GR
GS
[0.99899 0 0 1.00215 39.16056 144.22398] CT
0.149 GC
/Helvetica 14 F
GS
[1 0 0 1 0 0] CT
-20 5.5 moveto 
1 -1 scale
(1.4) t 
GR
GR
GS
[0.99899 0 0 1.00215 39.16056 108.46961] CT
0.149 GC
/Helvetica 14 F
GS
[1 0 0 1 0 0] CT
-20 5.5 moveto 
1 -1 scale
(1.6) t 
GR
GR
GS
[0.99899 0 0 1.00215 39.16056 72.71526] CT
0.149 GC
/Helvetica 14 F
GS
[1 0 0 1 0 0] CT
-20 5.5 moveto 
1 -1 scale
(1.8) t 
GR
GR
GS
[0.99899 0 0 1.00215 39.16056 36.96089] CT
0.149 GC
/Helvetica 14 F
GS
[1 0 0 1 0 0] CT
-8 5.5 moveto 
1 -1 scale
(2) t 
GR
GR
GS
[0 -1.00215 0.99899 0 16.68319 90.26907] CT
0.149 GC
/Helvetica 14 F
GS
[1 0 0 1 0 0] CT
-42 -3 moveto 
1 -1 scale
(stroop match) t 
GR
GR
GS
[0.99899 0 0 1.00215 124.62462 18.86614] CT
/Helvetica-Bold 14 F
GS
[1 0 0 1 0 0] CT
-145 -4 moveto 
1 -1 scale
(r\(93\) = 0.83, 95%CI = [0.76,0.88], p = 1.7e-25) t 
GR
GR
GS
[0.99899 0 0 1.00215 116.58969 100.20598] CT
0.8 0.502 0.502 RC
N
0.5 0 M
0.5 -0.276 0.276 -0.5 0 -0.5 C
-0.276 -0.5 -0.5 -0.276 -0.5 0 C
-0.5 0.276 -0.276 0.5 0 0.5 C
0.276 0.5 0.5 0.276 0.5 0 C
cp
f
GR
GS
[0.99899 0 0 1.00215 92.99537 112.27612] CT
0.8 0.502 0.502 RC
N
/f-2105962265{0.5 0 M
0.5 -0.276 0.276 -0.5 0 -0.5 C
-0.276 -0.5 -0.5 -0.276 -0.5 0 C
-0.5 0.276 -0.276 0.5 0 0.5 C
0.276 0.5 0.5 0.276 0.5 0 C
cp}def
f-2105962265
f
GR
GS
[0.99899 0 0 1.00215 87.13733 113.72333] CT
0.8 0.502 0.502 RC
N
f-2105962265
f
GR
GS
[0.99899 0 0 1.00215 81.05362 113.04836] CT
0.8 0.502 0.502 RC
N
f-2105962265
f
GR
GS
[0.99899 0 0 1.00215 128.63017 70.15732] CT
0.8 0.502 0.502 RC
N
f-2105962265
f
GR
GS
[0.99899 0 0 1.00215 103.66535 116.49204] CT
0.8 0.502 0.502 RC
N
f-2105962265
f
GR
GS
[0.99899 0 0 1.00215 104.9371 102.23692] CT
0.8 0.502 0.502 RC
N
f-2105962265
f
GR
GS
[0.99899 0 0 1.00215 78.89095 121.64036] CT
0.8 0.502 0.502 RC
N
f-2105962265
f
GR
GS
[0.99899 0 0 1.00215 99.34236 121.64036] CT
0.8 0.502 0.502 RC
N
f-2105962265
f
GR
GS
[0.99899 0 0 1.00215 110.89855 96.3184] CT
0.8 0.502 0.502 RC
N
f-2105962265
f
GR
GS
[0.99899 0 0 1.00215 104.27183 98.53581] CT
0.8 0.502 0.502 RC
N
f-2105962265
f
GR
GS
[0.99899 0 0 1.00215 116.87882 111.14916] CT
0.8 0.502 0.502 RC
N
f-2105962265
f
GR
GS
[0.99899 0 0 1.00215 67.25247 133.02541] CT
0.8 0.502 0.502 RC
N
f-2105962265
f
GR
GS
[0.99899 0 0 1.00215 70.19558 128.13451] CT
0.8 0.502 0.502 RC
N
f-2105962265
f
GR
GS
[0.99899 0 0 1.00215 92.99537 95.54616] CT
0.8 0.502 0.502 RC
N
f-2105962265
f
GR
GS
[0.99899 0 0 1.00215 140.97857 88.24327] CT
0.8 0.502 0.502 RC
N
f-2105962265
f
GR
GS
[0.99899 0 0 1.00215 110.71991 108.67231] CT
0.8 0.502 0.502 RC
N
f-2105962265
f
GR
GS
[0.99899 0 0 1.00215 122.8497 89.01552] CT
0.8 0.502 0.502 RC
N
f-2105962265
f
GR
GS
[0.99899 0 0 1.00215 57.40053 142.38964] CT
0.8 0.502 0.502 RC
N
f-2105962265
f
GR
GS
[0.99899 0 0 1.00215 87.13733 120.41205] CT
0.8 0.502 0.502 RC
N
f-2105962265
f
GR
GS
[0.99899 0 0 1.00215 64.6737 138.573] CT
0.8 0.502 0.502 RC
N
f-2105962265
f
GR
GS
[0.99899 0 0 1.00215 93.09881 116.49204] CT
0.8 0.502 0.502 RC
N
f-2105962265
f
GR
GS
[0.99899 0 0 1.00215 81.16648 134.82731] CT
0.8 0.502 0.502 RC
N
f-2105962265
f
GR
GS
[0.99899 0 0 1.00215 62.95768 142.23357] CT
0.8 0.502 0.502 RC
N
f-2105962265
f
GR
GS
[0.99899 0 0 1.00215 95.31084 111.34376] CT
0.8 0.502 0.502 RC
N
f-2105962265
f
GR
GS
[0.99899 0 0 1.00215 82.47347 116.04005] CT
0.8 0.502 0.502 RC
N
f-2105962265
f
GR
GS
[0.99899 0 0 1.00215 64.90408 129.71549] CT
0.8 0.502 0.502 RC
N
f-2105962265
f
GR
GS
[0.99899 0 0 1.00215 113.51729 94.16381] CT
0.8 0.502 0.502 RC
N
f-2105962265
f
GR
GS
[0.99899 0 0 1.00215 109.33768 100.85256] CT
0.8 0.502 0.502 RC
N
f-2105962265
f
GR
GS
[0.99899 0 0 1.00215 105.04758 122.82811] CT
0.8 0.502 0.502 RC
N
f-2105962265
f
GR
GS
[0.99899 0 0 1.00215 87.8167 105.3259] CT
0.8 0.502 0.502 RC
N
f-2105962265
f
GR
GS
[0.99899 0 0 1.00215 65.46121 137.15621] CT
0.8 0.502 0.502 RC
N
f-2105962265
f
GR
GS
[0.99899 0 0 1.00215 75.30843 120.15464] CT
0.8 0.502 0.502 RC
N
f-2105962265
f
GR
GS
[0.99899 0 0 1.00215 93.10351 109.86209] CT
0.8 0.502 0.502 RC
N
f-2105962265
f
GR
GS
[0.99899 0 0 1.00215 69.34228 145.2962] CT
0.8 0.502 0.502 RC
N
f-2105962265
f
GR
GS
[0.99899 0 0 1.00215 83.07057 118.86757] CT
0.8 0.502 0.502 RC
N
f-2105962265
f
GR
GS
[0.99899 0 0 1.00215 83.66764 141.6174] CT
0.8 0.502 0.502 RC
N
f-2105962265
f
GR
GS
[0.99899 0 0 1.00215 57.88245 148.31018] CT
0.8 0.502 0.502 RC
N
f-2105962265
f
GR
GS
[0.99899 0 0 1.00215 100.97847 110.89174] CT
0.8 0.502 0.502 RC
N
f-2105962265
f
GR
GS
[0.99899 0 0 1.00215 83.96619 121.79846] CT
0.8 0.502 0.502 RC
N
f-2105962265
f
GR
GS
[0.99899 0 0 1.00215 104.56099 92.87674] CT
0.8 0.502 0.502 RC
N
f-2105962265
f
GR
GS
[0.99899 0 0 1.00215 93.40675 109.86006] CT
0.8 0.502 0.502 RC
N
f-2105962265
f
GR
GS
[0.99899 0 0 1.00215 157.88507 93.32468] CT
0.8 0.502 0.502 RC
N
f-2105962265
f
GR
GS
[0.99899 0 0 1.00215 151.34533 80.45394] CT
0.8 0.502 0.502 RC
N
f-2105962265
f
GR
GS
[0.99899 0 0 1.00215 92.99537 120.15464] CT
0.8 0.502 0.502 RC
N
f-2105962265
f
GR
GS
[0.99899 0 0 1.00215 191.84847 32.22809] CT
0.8 0.502 0.502 RC
N
f-2105962265
f
GR
GS
[0.99899 0 0 1.00215 122.8497 95.89885] CT
0.8 0.502 0.502 RC
N
f-2105962265
f
GR
GS
[0.99899 0 0 1.00215 153.51269 68.00475] CT
0.8 0.502 0.502 RC
N
f-2105962265
f
GR
GS
[0.99899 0 0 1.00215 140.08294 84.47731] CT
0.8 0.502 0.502 RC
N
f-2105962265
f
GR
GS
[0.99899 0 0 1.00215 122.95783 101.88221] CT
0.8 0.502 0.502 RC
N
f-2105962265
f
GR
GS
[0.99899 0 0 1.00215 116.77776 110.42353] CT
0.8 0.502 0.502 RC
N
f-2105962265
f
GR
GS
[0.99899 0 0 1.00215 136.79897 75.47588] CT
0.8 0.502 0.502 RC
N
f-2105962265
f
GR
GS
[0.99899 0 0 1.00215 75.08277 142.23357] CT
0.8 0.502 0.502 RC
N
f-2105962265
f
GR
GS
[0.99899 0 0 1.00215 165.05011 43.71855] CT
0.8 0.502 0.502 RC
N
f-2105962265
f
GR
GS
[0.99899 0 0 1.00215 122.8497 86.27922] CT
0.8 0.502 0.502 RC
N
f-2105962265
f
GR
GS
[0.99899 0 0 1.00215 134.79146 77.94869] CT
0.8 0.502 0.502 RC
N
f-2105962265
f
GR
GS
[0.99899 0 0 1.00215 129.03684 98.47299] CT
0.8 0.502 0.502 RC
N
f-2105962265
f
GR
GS
[0.99899 0 0 1.00215 104.9371 115.50292] CT
0.8 0.502 0.502 RC
N
f-2105962265
f
GR
GS
[0.99899 0 0 1.00215 128.82057 90.75053] CT
0.8 0.502 0.502 RC
N
f-2105962265
f
GR
GS
[0.99899 0 0 1.00215 140.7623 79.58642] CT
0.8 0.502 0.502 RC
N
f-2105962265
f
GR
GS
[0.99899 0 0 1.00215 112.02458 130.96608] CT
0.8 0.502 0.502 RC
N
f-2105962265
f
GR
GS
[0.99899 0 0 1.00215 117.69688 86.0218] CT
0.8 0.502 0.502 RC
N
f-2105962265
f
GR
GS
[0.99899 0 0 1.00215 129.62922 103.96788] CT
0.8 0.502 0.502 RC
N
f-2105962265
f
GR
GS
[0.99899 0 0 1.00215 104.9371 127.10486] CT
0.8 0.502 0.502 RC
N
f-2105962265
f
GR
GS
[0.99899 0 0 1.00215 128.82057 95.89885] CT
0.8 0.502 0.502 RC
N
f-2105962265
f
GR
GS
[0.99899 0 0 1.00215 105.34613 105.06848] CT
0.8 0.502 0.502 RC
N
f-2105962265
f
GR
GS
[0.99899 0 0 1.00215 140.7623 100.7046] CT
0.8 0.502 0.502 RC
N
f-2105962265
f
GR
GS
[0.99899 0 0 1.00215 135.4943 80.10125] CT
0.8 0.502 0.502 RC
N
f-2105962265
f
GR
GS
[0.99899 0 0 1.00215 109.63622 103.6213] CT
0.8 0.502 0.502 RC
N
f-2105962265
f
GR
GS
[0.99899 0 0 1.00215 131.72371 100.17762] CT
0.8 0.502 0.502 RC
N
f-2105962265
f
GR
GS
[0.99899 0 0 1.00215 120.52012 108.06018] CT
0.8 0.502 0.502 RC
N
f-2105962265
f
GR
GS
[0.99899 0 0 1.00215 142.17276 105.22862] CT
0.8 0.502 0.502 RC
N
f-2105962265
f
GR
GS
[0.99899 0 0 1.00215 146.73318 101.04713] CT
0.8 0.502 0.502 RC
N
f-2105962265
f
GR
GS
[0.99899 0 0 1.00215 134.79146 90.75053] CT
0.8 0.502 0.502 RC
N
f-2105962265
f
GR
GS
[0.99899 0 0 1.00215 98.96623 121.64036] CT
0.8 0.502 0.502 RC
N
f-2105962265
f
GR
GS
[0.99899 0 0 1.00215 137.39604 95.89885] CT
0.8 0.502 0.502 RC
N
f-2105962265
f
GR
GS
[0.99899 0 0 1.00215 134.79146 85.76438] CT
0.8 0.502 0.502 RC
N
f-2105962265
f
GR
GS
[0.99899 0 0 1.00215 100.38137 124.27329] CT
0.8 0.502 0.502 RC
N
f-2105962265
f
GR
GS
[0.99899 0 0 1.00215 99.08612 121.22079] CT
0.8 0.502 0.502 RC
N
f-2105962265
f
GR
GS
[0.99899 0 0 1.00215 112.62165 123.75846] CT
0.8 0.502 0.502 RC
N
f-2105962265
f
GR
GS
[0.99899 0 0 1.00215 164.75157 106.35557] CT
0.8 0.502 0.502 RC
N
f-2105962265
f
GR
GS
[0.99899 0 0 1.00215 145.6448 78.20611] CT
0.8 0.502 0.502 RC
N
f-2105962265
f
GR
GS
[0.99899 0 0 1.00215 172.01769 94.67865] CT
0.8 0.502 0.502 RC
N
f-2105962265
f
GR
GS
[0.99899 0 0 1.00215 143.06602 113.20849] CT
0.8 0.502 0.502 RC
N
f-2105962265
f
GR
GS
[0.99899 0 0 1.00215 116.87882 124.27329] CT
0.8 0.502 0.502 RC
N
f-2105962265
f
GR
GS
[0.99899 0 0 1.00215 133.21646 84.89686] CT
0.8 0.502 0.502 RC
N
f-2105962265
f
GR
GS
[0.99899 0 0 1.00215 128.82057 106.19544] CT
0.8 0.502 0.502 RC
N
f-2105962265
f
GR
GS
[0.99899 0 0 1.00215 111.12894 113.72333] CT
0.8 0.502 0.502 RC
N
f-2105962265
f
GR
GS
[0.99899 0 0 1.00215 100.38137 116.04005] CT
0.8 0.502 0.502 RC
N
f-2105962265
f
GR
GS
[0.99899 0 0 1.00215 129.63393 107.54536] CT
0.8 0.502 0.502 RC
N
f-2105962265
f
GR
GS
[0.99899 0 0 1.00215 92.99537 120.19112] CT
0.8 0.502 0.502 RC
N
f-2105962265
f
GR
GS
[0.99899 0 0 1.00215 118.29398 90.04518] CT
0.8 0.502 0.502 RC
N
f-2105962265
f
GR
GS
[0.99899 0 0 1.00215 70.90551 133.38213] CT
0.8 0.502 0.502 RC
N
f-2105962265
f
GR
GS
[0.99899 0 0 1.00215 176.58752 49.5641] CT
0.8 0.502 0.502 RC
N
f-2105962265
f
GR
GS
[0.99899 0 0 1.00215 113.51729 114.23814] CT
0.8 0.502 0.502 RC
N
f-2105962265
f
GR
GS
[0.99899 0 0 1.00215 0 -0.4252] CT
0.902 0.6 0.6 RC
1 LJ
3 LW
N
43.981 149.14 M
205.519 47.688 L
S
GR
GS
[0.99899 0 0 1.00215 116.58969 100.20598] CT
1 0.702 0.702 RC
N
/f227889816{-3 -3 M
-3 3 L
3 3 L
3 -3 L
cp}def
f227889816
f
GR
GS
[0.99899 0 0 1.00215 92.99537 112.27612] CT
1 0.702 0.702 RC
N
f227889816
f
GR
GS
[0.99899 0 0 1.00215 87.13733 113.72333] CT
1 0.702 0.702 RC
N
f227889816
f
GR
GS
[0.99899 0 0 1.00215 81.05362 113.04836] CT
1 0.702 0.702 RC
N
f227889816
f
GR
GS
[0.99899 0 0 1.00215 128.63017 70.15732] CT
1 0.702 0.702 RC
N
f227889816
f
GR
GS
[0.99899 0 0 1.00215 103.66535 116.49204] CT
1 0.702 0.702 RC
N
f227889816
f
GR
GS
[0.99899 0 0 1.00215 104.9371 102.23692] CT
1 0.702 0.702 RC
N
f227889816
f
GR
GS
[0.99899 0 0 1.00215 78.89095 121.64036] CT
1 0.702 0.702 RC
N
f227889816
f
GR
GS
[0.99899 0 0 1.00215 99.34236 121.64036] CT
1 0.702 0.702 RC
N
f227889816
f
GR
GS
[0.99899 0 0 1.00215 110.89855 96.3184] CT
1 0.702 0.702 RC
N
f227889816
f
GR
GS
[0.99899 0 0 1.00215 104.27183 98.53581] CT
1 0.702 0.702 RC
N
f227889816
f
GR
GS
[0.99899 0 0 1.00215 116.87882 111.14916] CT
1 0.702 0.702 RC
N
f227889816
f
GR
GS
[0.99899 0 0 1.00215 67.25247 133.02541] CT
1 0.702 0.702 RC
N
f227889816
f
GR
GS
[0.99899 0 0 1.00215 70.19558 128.13451] CT
1 0.702 0.702 RC
N
f227889816
f
GR
GS
[0.99899 0 0 1.00215 92.99537 95.54616] CT
1 0.702 0.702 RC
N
f227889816
f
GR
GS
[0.99899 0 0 1.00215 140.97857 88.24327] CT
1 0.702 0.702 RC
N
f227889816
f
GR
GS
[0.99899 0 0 1.00215 110.71991 108.67231] CT
1 0.702 0.702 RC
N
f227889816
f
GR
GS
[0.99899 0 0 1.00215 122.8497 89.01552] CT
1 0.702 0.702 RC
N
f227889816
f
GR
GS
[0.99899 0 0 1.00215 57.40053 142.38964] CT
1 0.702 0.702 RC
N
f227889816
f
GR
GS
[0.99899 0 0 1.00215 87.13733 120.41205] CT
1 0.702 0.702 RC
N
f227889816
f
GR
GS
[0.99899 0 0 1.00215 64.6737 138.573] CT
1 0.702 0.702 RC
N
f227889816
f
GR
GS
[0.99899 0 0 1.00215 93.09881 116.49204] CT
1 0.702 0.702 RC
N
f227889816
f
GR
GS
[0.99899 0 0 1.00215 81.16648 134.82731] CT
1 0.702 0.702 RC
N
f227889816
f
GR
GS
[0.99899 0 0 1.00215 62.95768 142.23357] CT
1 0.702 0.702 RC
N
f227889816
f
GR
GS
[0.99899 0 0 1.00215 95.31084 111.34376] CT
1 0.702 0.702 RC
N
f227889816
f
GR
GS
[0.99899 0 0 1.00215 82.47347 116.04005] CT
1 0.702 0.702 RC
N
f227889816
f
GR
GS
[0.99899 0 0 1.00215 64.90408 129.71549] CT
1 0.702 0.702 RC
N
f227889816
f
GR
GS
[0.99899 0 0 1.00215 113.51729 94.16381] CT
1 0.702 0.702 RC
N
f227889816
f
GR
GS
[0.99899 0 0 1.00215 109.33768 100.85256] CT
1 0.702 0.702 RC
N
f227889816
f
GR
GS
[0.99899 0 0 1.00215 105.04758 122.82811] CT
1 0.702 0.702 RC
N
f227889816
f
GR
GS
[0.99899 0 0 1.00215 87.8167 105.3259] CT
1 0.702 0.702 RC
N
f227889816
f
GR
GS
[0.99899 0 0 1.00215 65.46121 137.15621] CT
1 0.702 0.702 RC
N
f227889816
f
GR
GS
[0.99899 0 0 1.00215 75.30843 120.15464] CT
1 0.702 0.702 RC
N
f227889816
f
GR
GS
[0.99899 0 0 1.00215 93.10351 109.86209] CT
1 0.702 0.702 RC
N
f227889816
f
GR
GS
[0.99899 0 0 1.00215 69.34228 145.2962] CT
1 0.702 0.702 RC
N
f227889816
f
GR
GS
[0.99899 0 0 1.00215 83.07057 118.86757] CT
1 0.702 0.702 RC
N
f227889816
f
GR
GS
[0.99899 0 0 1.00215 83.66764 141.6174] CT
1 0.702 0.702 RC
N
f227889816
f
GR
GS
[0.99899 0 0 1.00215 57.88245 148.31018] CT
1 0.702 0.702 RC
N
f227889816
f
GR
GS
[0.99899 0 0 1.00215 100.97847 110.89174] CT
1 0.702 0.702 RC
N
f227889816
f
GR
GS
[0.99899 0 0 1.00215 83.96619 121.79846] CT
1 0.702 0.702 RC
N
f227889816
f
GR
GS
[0.99899 0 0 1.00215 104.56099 92.87674] CT
1 0.702 0.702 RC
N
f227889816
f
GR
GS
[0.99899 0 0 1.00215 93.40675 109.86006] CT
1 0.702 0.702 RC
N
f227889816
f
GR
GS
[0.99899 0 0 1.00215 157.88507 93.32468] CT
0.8 0.502 0.502 RC
N
/f-1969333140{-3.536 0 M
0 4.702 L
3.536 0 L
0 -4.702 L
cp}def
f-1969333140
f
GR
GS
[0.99899 0 0 1.00215 151.34533 80.45394] CT
0.8 0.502 0.502 RC
N
f-1969333140
f
GR
GS
[0.99899 0 0 1.00215 92.99537 120.15464] CT
0.8 0.502 0.502 RC
N
f-1969333140
f
GR
GS
[0.99899 0 0 1.00215 191.84847 32.22809] CT
0.8 0.502 0.502 RC
N
f-1969333140
f
GR
GS
[0.99899 0 0 1.00215 122.8497 95.89885] CT
0.8 0.502 0.502 RC
N
f-1969333140
f
GR
GS
[0.99899 0 0 1.00215 153.51269 68.00475] CT
0.8 0.502 0.502 RC
N
f-1969333140
f
GR
GS
[0.99899 0 0 1.00215 140.08294 84.47731] CT
0.8 0.502 0.502 RC
N
f-1969333140
f
GR
GS
[0.99899 0 0 1.00215 122.95783 101.88221] CT
0.8 0.502 0.502 RC
N
f-1969333140
f
GR
GS
[0.99899 0 0 1.00215 116.77776 110.42353] CT
0.8 0.502 0.502 RC
N
f-1969333140
f
GR
GS
[0.99899 0 0 1.00215 136.79897 75.47588] CT
0.8 0.502 0.502 RC
N
f-1969333140
f
GR
GS
[0.99899 0 0 1.00215 75.08277 142.23357] CT
0.8 0.502 0.502 RC
N
f-1969333140
f
GR
GS
[0.99899 0 0 1.00215 165.05011 43.71855] CT
0.8 0.502 0.502 RC
N
f-1969333140
f
GR
GS
[0.99899 0 0 1.00215 122.8497 86.27922] CT
0.8 0.502 0.502 RC
N
f-1969333140
f
GR
GS
[0.99899 0 0 1.00215 134.79146 77.94869] CT
0.8 0.502 0.502 RC
N
f-1969333140
f
GR
GS
[0.99899 0 0 1.00215 129.03684 98.47299] CT
0.8 0.502 0.502 RC
N
f-1969333140
f
GR
GS
[0.99899 0 0 1.00215 104.9371 115.50292] CT
0.8 0.502 0.502 RC
N
f-1969333140
f
GR
GS
[0.99899 0 0 1.00215 128.82057 90.75053] CT
0.8 0.502 0.502 RC
N
f-1969333140
f
GR
GS
[0.99899 0 0 1.00215 140.7623 79.58642] CT
0.8 0.502 0.502 RC
N
f-1969333140
f
GR
GS
[0.99899 0 0 1.00215 112.02458 130.96608] CT
0.8 0.502 0.502 RC
N
f-1969333140
f
GR
GS
[0.99899 0 0 1.00215 117.69688 86.0218] CT
0.8 0.502 0.502 RC
N
f-1969333140
f
GR
GS
[0.99899 0 0 1.00215 129.62922 103.96788] CT
0.8 0.502 0.502 RC
N
f-1969333140
f
GR
GS
[0.99899 0 0 1.00215 104.9371 127.10486] CT
0.8 0.502 0.502 RC
N
f-1969333140
f
GR
GS
[0.99899 0 0 1.00215 128.82057 95.89885] CT
0.8 0.502 0.502 RC
N
f-1969333140
f
GR
GS
[0.99899 0 0 1.00215 105.34613 105.06848] CT
0.8 0.502 0.502 RC
N
f-1969333140
f
GR
GS
[0.99899 0 0 1.00215 140.7623 100.7046] CT
0.8 0.502 0.502 RC
N
f-1969333140
f
GR
GS
[0.99899 0 0 1.00215 135.4943 80.10125] CT
0.8 0.502 0.502 RC
N
f-1969333140
f
GR
GS
[0.99899 0 0 1.00215 109.63622 103.6213] CT
0.8 0.502 0.502 RC
N
f-1969333140
f
GR
GS
[0.99899 0 0 1.00215 131.72371 100.17762] CT
0.8 0.502 0.502 RC
N
f-1969333140
f
GR
GS
[0.99899 0 0 1.00215 120.52012 108.06018] CT
0.8 0.502 0.502 RC
N
f-1969333140
f
GR
GS
[0.99899 0 0 1.00215 142.17276 105.22862] CT
0.8 0.502 0.502 RC
N
f-1969333140
f
GR
GS
[0.99899 0 0 1.00215 146.73318 101.04713] CT
0.8 0.502 0.502 RC
N
f-1969333140
f
GR
GS
[0.99899 0 0 1.00215 134.79146 90.75053] CT
0.8 0.502 0.502 RC
N
f-1969333140
f
GR
GS
[0.99899 0 0 1.00215 98.96623 121.64036] CT
0.8 0.502 0.502 RC
N
f-1969333140
f
GR
GS
[0.99899 0 0 1.00215 137.39604 95.89885] CT
0.8 0.502 0.502 RC
N
f-1969333140
f
GR
GS
[0.99899 0 0 1.00215 134.79146 85.76438] CT
0.8 0.502 0.502 RC
N
f-1969333140
f
GR
GS
[0.99899 0 0 1.00215 100.38137 124.27329] CT
0.8 0.502 0.502 RC
N
f-1969333140
f
GR
GS
[0.99899 0 0 1.00215 99.08612 121.22079] CT
0.8 0.502 0.502 RC
N
f-1969333140
f
GR
GS
[0.99899 0 0 1.00215 112.62165 123.75846] CT
0.8 0.502 0.502 RC
N
f-1969333140
f
GR
GS
[0.99899 0 0 1.00215 164.75157 106.35557] CT
0.8 0.502 0.502 RC
N
f-1969333140
f
GR
GS
[0.99899 0 0 1.00215 145.6448 78.20611] CT
0.8 0.502 0.502 RC
N
f-1969333140
f
GR
GS
[0.99899 0 0 1.00215 172.01769 94.67865] CT
0.8 0.502 0.502 RC
N
f-1969333140
f
GR
GS
[0.99899 0 0 1.00215 143.06602 113.20849] CT
0.8 0.502 0.502 RC
N
f-1969333140
f
GR
GS
[0.99899 0 0 1.00215 116.87882 124.27329] CT
0.8 0.502 0.502 RC
N
f-1969333140
f
GR
GS
[0.99899 0 0 1.00215 133.21646 84.89686] CT
0.8 0.502 0.502 RC
N
f-1969333140
f
GR
GS
[0.99899 0 0 1.00215 128.82057 106.19544] CT
0.8 0.502 0.502 RC
N
f-1969333140
f
GR
GS
[0.99899 0 0 1.00215 111.12894 113.72333] CT
0.8 0.502 0.502 RC
N
f-1969333140
f
GR
GS
[0.99899 0 0 1.00215 100.38137 116.04005] CT
0.8 0.502 0.502 RC
N
f-1969333140
f
GR
GS
[0.99899 0 0 1.00215 129.63393 107.54536] CT
0.8 0.502 0.502 RC
N
f-1969333140
f
GR
GS
[0.99899 0 0 1.00215 92.99537 120.19112] CT
0.8 0.502 0.502 RC
N
f-1969333140
f
GR
GS
[0.99899 0 0 1.00215 118.29398 90.04518] CT
0.8 0.502 0.502 RC
N
f-1969333140
f
GR
GS
[0.99899 0 0 1.00215 70.90551 133.38213] CT
0.8 0.502 0.502 RC
N
f-1969333140
f
GR
GS
[0.99899 0 0 1.00215 176.58752 49.5641] CT
0.8 0.502 0.502 RC
N
f-1969333140
f
GR
GS
[0.99899 0 0 1.00215 113.51729 114.23814] CT
0.8 0.502 0.502 RC
N
f-1969333140
f
GR
%%Trailer
%%Pages: 1
%%EOF
