%!PS-Adobe-3.0 EPSF-3.0
%%Creator: (MATLAB, The Mathworks, Inc. Version 9.8.0.1323502 \(R2020a\). Operating System: Mac OS X)
%%Title: /Users/kosciessa/Desktop/mntTardisLNDG/LNDG/stateswitch/stsw_multimodal/figures/l1byage/l1comp_betaslope.eps
%%CreationDate: 2022-03-02T14:36:45
%%Pages: (atend)
%%BoundingBox:     4     0   180   275
%%LanguageLevel: 3
%%EndComments
%%BeginProlog
%%BeginResource: procset (Apache XML Graphics Std ProcSet) 1.2 0
%%Version: 1.2 0
%%Copyright: (Copyright 2001-2003,2010 The Apache Software Foundation. License terms: http://www.apache.org/licenses/LICENSE-2.0)
/bd{bind def}bind def
/ld{load def}bd
/GR/grestore ld
/GS/gsave ld
/RM/rmoveto ld
/C/curveto ld
/t/show ld
/L/lineto ld
/ML/setmiterlimit ld
/CT/concat ld
/f/fill ld
/N/newpath ld
/S/stroke ld
/CC/setcmykcolor ld
/A/ashow ld
/cp/closepath ld
/RC/setrgbcolor ld
/LJ/setlinejoin ld
/GC/setgray ld
/LW/setlinewidth ld
/M/moveto ld
/re {4 2 roll M
1 index 0 rlineto
0 exch rlineto
neg 0 rlineto
cp } bd
/_ctm matrix def
/_tm matrix def
/BT { _ctm currentmatrix pop matrix _tm copy pop 0 0 moveto } bd
/ET { _ctm setmatrix } bd
/iTm { _ctm setmatrix _tm concat } bd
/Tm { _tm astore pop iTm 0 0 moveto } bd
/ux 0.0 def
/uy 0.0 def
/F {
  /Tp exch def
  /Tf exch def
  Tf findfont Tp scalefont setfont
  /cf Tf def  /cs Tp def
} bd
/ULS {currentpoint /uy exch def /ux exch def} bd
/ULE {
  /Tcx currentpoint pop def
  gsave
  newpath
  cf findfont cs scalefont dup
  /FontMatrix get 0 get /Ts exch def /FontInfo get dup
  /UnderlinePosition get Ts mul /To exch def
  /UnderlineThickness get Ts mul /Tt exch def
  ux uy To add moveto  Tcx uy To add lineto
  Tt setlinewidth stroke
  grestore
} bd
/OLE {
  /Tcx currentpoint pop def
  gsave
  newpath
  cf findfont cs scalefont dup
  /FontMatrix get 0 get /Ts exch def /FontInfo get dup
  /UnderlinePosition get Ts mul /To exch def
  /UnderlineThickness get Ts mul /Tt exch def
  ux uy To add cs add moveto Tcx uy To add cs add lineto
  Tt setlinewidth stroke
  grestore
} bd
/SOE {
  /Tcx currentpoint pop def
  gsave
  newpath
  cf findfont cs scalefont dup
  /FontMatrix get 0 get /Ts exch def /FontInfo get dup
  /UnderlinePosition get Ts mul /To exch def
  /UnderlineThickness get Ts mul /Tt exch def
  ux uy To add cs 10 mul 26 idiv add moveto Tcx uy To add cs 10 mul 26 idiv add lineto
  Tt setlinewidth stroke
  grestore
} bd
/QT {
/Y22 exch store
/X22 exch store
/Y21 exch store
/X21 exch store
currentpoint
/Y21 load 2 mul add 3 div exch
/X21 load 2 mul add 3 div exch
/X21 load 2 mul /X22 load add 3 div
/Y21 load 2 mul /Y22 load add 3 div
/X22 load /Y22 load curveto
} bd
/SSPD {
dup length /d exch dict def
{
/v exch def
/k exch def
currentpagedevice k known {
/cpdv currentpagedevice k get def
v cpdv ne {
/upd false def
/nullv v type /nulltype eq def
/nullcpdv cpdv type /nulltype eq def
nullv nullcpdv or
{
/upd true def
} {
/sametype v type cpdv type eq def
sametype {
v type /arraytype eq {
/vlen v length def
/cpdvlen cpdv length def
vlen cpdvlen eq {
0 1 vlen 1 sub {
/i exch def
/obj v i get def
/cpdobj cpdv i get def
obj cpdobj ne {
/upd true def
exit
} if
} for
} {
/upd true def
} ifelse
} {
v type /dicttype eq {
v {
/dv exch def
/dk exch def
/cpddv cpdv dk get def
dv cpddv ne {
/upd true def
exit
} if
} forall
} {
/upd true def
} ifelse
} ifelse
} if
} ifelse
upd true eq {
d k v put
} if
} if
} if
} forall
d length 0 gt {
d setpagedevice
} if
} bd
/RE { % /NewFontName [NewEncodingArray] /FontName RE -
  findfont dup length dict begin
  {
    1 index /FID ne
    {def} {pop pop} ifelse
  } forall
  /Encoding exch def
  /FontName 1 index def
  currentdict definefont pop
  end
} bind def
%%EndResource
%%BeginResource: procset (Apache XML Graphics EPS ProcSet) 1.0 0
%%Version: 1.0 0
%%Copyright: (Copyright 2002-2003 The Apache Software Foundation. License terms: http://www.apache.org/licenses/LICENSE-2.0)
/BeginEPSF { %def
/b4_Inc_state save def         % Save state for cleanup
/dict_count countdictstack def % Count objects on dict stack
/op_count count 1 sub def      % Count objects on operand stack
userdict begin                 % Push userdict on dict stack
/showpage { } def              % Redefine showpage, { } = null proc
0 setgray 0 setlinecap         % Prepare graphics state
1 setlinewidth 0 setlinejoin
10 setmiterlimit [ ] 0 setdash newpath
/languagelevel where           % If level not equal to 1 then
{pop languagelevel             % set strokeadjust and
1 ne                           % overprint to their defaults.
{false setstrokeadjust false setoverprint
} if
} if
} bd
/EndEPSF { %def
count op_count sub {pop} repeat            % Clean up stacks
countdictstack dict_count sub {end} repeat
b4_Inc_state restore
} bd
%%EndResource
%FOPBeginFontDict
%%IncludeResource: font Courier-Oblique
%%IncludeResource: font Courier-BoldOblique
%%IncludeResource: font Courier-Bold
%%IncludeResource: font ZapfDingbats
%%IncludeResource: font Symbol
%%IncludeResource: font Helvetica
%%IncludeResource: font Helvetica-Oblique
%%IncludeResource: font Helvetica-Bold
%%IncludeResource: font Helvetica-BoldOblique
%%IncludeResource: font Times-Roman
%%IncludeResource: font Times-Italic
%%IncludeResource: font Times-Bold
%%IncludeResource: font Times-BoldItalic
%%IncludeResource: font Courier
%FOPEndFontDict
%%BeginResource: encoding WinAnsiEncoding
/WinAnsiEncoding [
/.notdef /.notdef /.notdef /.notdef /.notdef
/.notdef /.notdef /.notdef /.notdef /.notdef
/.notdef /.notdef /.notdef /.notdef /.notdef
/.notdef /.notdef /.notdef /.notdef /.notdef
/.notdef /.notdef /.notdef /.notdef /.notdef
/.notdef /.notdef /.notdef /.notdef /.notdef
/.notdef /.notdef /space /exclam /quotedbl
/numbersign /dollar /percent /ampersand /quotesingle
/parenleft /parenright /asterisk /plus /comma
/hyphen /period /slash /zero /one
/two /three /four /five /six
/seven /eight /nine /colon /semicolon
/less /equal /greater /question /at
/A /B /C /D /E
/F /G /H /I /J
/K /L /M /N /O
/P /Q /R /S /T
/U /V /W /X /Y
/Z /bracketleft /backslash /bracketright /asciicircum
/underscore /quoteleft /a /b /c
/d /e /f /g /h
/i /j /k /l /m
/n /o /p /q /r
/s /t /u /v /w
/x /y /z /braceleft /bar
/braceright /asciitilde /bullet /Euro /bullet
/quotesinglbase /florin /quotedblbase /ellipsis /dagger
/daggerdbl /circumflex /perthousand /Scaron /guilsinglleft
/OE /bullet /Zcaron /bullet /bullet
/quoteleft /quoteright /quotedblleft /quotedblright /bullet
/endash /emdash /asciitilde /trademark /scaron
/guilsinglright /oe /bullet /zcaron /Ydieresis
/space /exclamdown /cent /sterling /currency
/yen /brokenbar /section /dieresis /copyright
/ordfeminine /guillemotleft /logicalnot /sfthyphen /registered
/macron /degree /plusminus /twosuperior /threesuperior
/acute /mu /paragraph /middot /cedilla
/onesuperior /ordmasculine /guillemotright /onequarter /onehalf
/threequarters /questiondown /Agrave /Aacute /Acircumflex
/Atilde /Adieresis /Aring /AE /Ccedilla
/Egrave /Eacute /Ecircumflex /Edieresis /Igrave
/Iacute /Icircumflex /Idieresis /Eth /Ntilde
/Ograve /Oacute /Ocircumflex /Otilde /Odieresis
/multiply /Oslash /Ugrave /Uacute /Ucircumflex
/Udieresis /Yacute /Thorn /germandbls /agrave
/aacute /acircumflex /atilde /adieresis /aring
/ae /ccedilla /egrave /eacute /ecircumflex
/edieresis /igrave /iacute /icircumflex /idieresis
/eth /ntilde /ograve /oacute /ocircumflex
/otilde /odieresis /divide /oslash /ugrave
/uacute /ucircumflex /udieresis /yacute /thorn
/ydieresis
] def
%%EndResource
%FOPBeginFontReencode
/Courier-Oblique findfont
dup length dict begin
  {1 index /FID ne {def} {pop pop} ifelse} forall
  /Encoding WinAnsiEncoding def
  currentdict
end
/Courier-Oblique exch definefont pop
/Courier-BoldOblique findfont
dup length dict begin
  {1 index /FID ne {def} {pop pop} ifelse} forall
  /Encoding WinAnsiEncoding def
  currentdict
end
/Courier-BoldOblique exch definefont pop
/Courier-Bold findfont
dup length dict begin
  {1 index /FID ne {def} {pop pop} ifelse} forall
  /Encoding WinAnsiEncoding def
  currentdict
end
/Courier-Bold exch definefont pop
/Helvetica findfont
dup length dict begin
  {1 index /FID ne {def} {pop pop} ifelse} forall
  /Encoding WinAnsiEncoding def
  currentdict
end
/Helvetica exch definefont pop
/Helvetica-Oblique findfont
dup length dict begin
  {1 index /FID ne {def} {pop pop} ifelse} forall
  /Encoding WinAnsiEncoding def
  currentdict
end
/Helvetica-Oblique exch definefont pop
/Helvetica-Bold findfont
dup length dict begin
  {1 index /FID ne {def} {pop pop} ifelse} forall
  /Encoding WinAnsiEncoding def
  currentdict
end
/Helvetica-Bold exch definefont pop
/Helvetica-BoldOblique findfont
dup length dict begin
  {1 index /FID ne {def} {pop pop} ifelse} forall
  /Encoding WinAnsiEncoding def
  currentdict
end
/Helvetica-BoldOblique exch definefont pop
/Times-Roman findfont
dup length dict begin
  {1 index /FID ne {def} {pop pop} ifelse} forall
  /Encoding WinAnsiEncoding def
  currentdict
end
/Times-Roman exch definefont pop
/Times-Italic findfont
dup length dict begin
  {1 index /FID ne {def} {pop pop} ifelse} forall
  /Encoding WinAnsiEncoding def
  currentdict
end
/Times-Italic exch definefont pop
/Times-Bold findfont
dup length dict begin
  {1 index /FID ne {def} {pop pop} ifelse} forall
  /Encoding WinAnsiEncoding def
  currentdict
end
/Times-Bold exch definefont pop
/Times-BoldItalic findfont
dup length dict begin
  {1 index /FID ne {def} {pop pop} ifelse} forall
  /Encoding WinAnsiEncoding def
  currentdict
end
/Times-BoldItalic exch definefont pop
/Courier findfont
dup length dict begin
  {1 index /FID ne {def} {pop pop} ifelse} forall
  /Encoding WinAnsiEncoding def
  currentdict
end
/Courier exch definefont pop
%FOPEndFontReencode
%%EndProlog
%%Page: 1 1
%%PageBoundingBox: 0 0 198 283
%%BeginPageSetup
[1 0 0 -1 0 283] CT
%%EndPageSetup
GS
[1.00215 0 0 1 0 0] CT
1 GC
N
0 0 198 283 re
f
GR
GS
[1.00215 0 0 1 0 0] CT
1 GC
N
0 0 198 283 re
f
GR
GS
[1.00215 0 0 1 0 0] CT
1 GC
N
80 228 M
179 228 L
179 32 L
80 32 L
cp
f
GR
GS
[1.00215 0 0 1 0 0] CT
0.149 GC
2 setlinecap
1 LJ
0.5 LW
N
80 228 M
179 228 L
S
GR
GS
[1.00215 0 0 1 0 0] CT
0.149 GC
2 setlinecap
1 LJ
0.5 LW
N
109.7 228 M
109.7 226.04 L
S
GR
GS
[1.00215 0 0 1 0 0] CT
0.149 GC
2 setlinecap
1 LJ
0.5 LW
N
149.3 228 M
149.3 226.04 L
S
GR
GS
[1.00215 0 0 1 109.93558 234] CT
0.149 GC
/Helvetica 20 F
GS
[1 0 0 1 0 0] CT
-13 20 moveto 
1 -1 scale
(YA) t 
GR
GR
GS
[1.00215 0 0 1 149.62062 234] CT
0.149 GC
/Helvetica 20 F
GS
[1 0 0 1 0 0] CT
-14.5 20 moveto 
1 -1 scale
(OA) t 
GR
GR
GS
[1.00215 0 0 1 129.77814 259] CT
0.149 GC
/Helvetica 20 F
GS
[1 0 0 1 0 0] CT
-49 20 moveto 
1 -1 scale
(Age Group) t 
GR
GR
GS
[1.00215 0 0 1 0 0] CT
0.149 GC
2 setlinecap
1 LJ
0.5 LW
N
80 228 M
80 32 L
S
GR
GS
[1.00215 0 0 1 0 0] CT
0.149 GC
2 setlinecap
1 LJ
0.5 LW
N
80 228 M
81.96 228 L
S
GR
GS
[1.00215 0 0 1 0 0] CT
0.149 GC
2 setlinecap
1 LJ
0.5 LW
N
80 162.667 M
81.96 162.667 L
S
GR
GS
[1.00215 0 0 1 0 0] CT
0.149 GC
2 setlinecap
1 LJ
0.5 LW
N
80 97.333 M
81.96 97.333 L
S
GR
GS
[1.00215 0 0 1 0 0] CT
0.149 GC
2 setlinecap
1 LJ
0.5 LW
N
80 32 M
81.96 32 L
S
GR
GS
[1.00215 0 0 1 74.15891 228] CT
0.149 GC
/Helvetica 20 F
GS
[1 0 0 1 0 0] CT
-36 7.5 moveto 
1 -1 scale
(-0.1) t 
GR
GR
GS
[1.00215 0 0 1 74.15891 162.66667] CT
0.149 GC
/Helvetica 20 F
GS
[1 0 0 1 0 0] CT
-47 7.5 moveto 
1 -1 scale
(-0.05) t 
GR
GR
GS
[1.00215 0 0 1 74.15891 97.33334] CT
0.149 GC
/Helvetica 20 F
GS
[1 0 0 1 0 0] CT
-12 7.5 moveto 
1 -1 scale
(0) t 
GR
GR
GS
[1.00215 0 0 1 74.15891 32] CT
0.149 GC
/Helvetica 20 F
GS
[1 0 0 1 0 0] CT
-39 7.5 moveto 
1 -1 scale
(0.05) t 
GR
GR
GS
[0 -1 1.00215 0 24.05154 129.99991] CT
0.149 GC
/Helvetica 20 F
GS
[1 0 0 1 0 0] CT
-55 -5 moveto 
1 -1 scale
(betaslope l1) t 
GR
GR
GS
[1.00215 0 0 1 129.77822 29.25] CT
/Helvetica-Bold 22 F
GS
[1 0 0 1 0 0] CT
-41 -5 moveto 
1 -1 scale
(p = 0.05) t 
GR
GR
GS
[1.00215 0 0 1 0 0] CT
0.149 GC
1 LJ
0.5 LW
N
80 97.333 M
179 97.333 L
S
GR
GS
[1.00215 0 0 1 0 0] CT
0.6 0.8 1 RC
N
93.86 97.333 M
93.86 115.389 L
125.54 115.389 L
125.54 97.333 L
cp
f
GR
GS
[1.00215 0 0 1 106.13158 122.75027] CT
0.302 GC
N
2.236 0 M
2.236 -1.235 1.235 -2.236 0 -2.236 C
-1.235 -2.236 -2.236 -1.235 -2.236 0 C
-2.236 1.235 -1.235 2.236 0 2.236 C
1.235 2.236 2.236 1.235 2.236 0 C
cp
f
GR
GS
[1.00215 0 0 1 112.63597 94.02129] CT
0.302 GC
N
/f-1586420743{2.236 0 M
2.236 -1.235 1.235 -2.236 0 -2.236 C
-1.235 -2.236 -2.236 -1.235 -2.236 0 C
-2.236 1.235 -1.235 2.236 0 2.236 C
1.235 2.236 2.236 1.235 2.236 0 C
cp}def
f-1586420743
f
GR
GS
[1.00215 0 0 1 106.52961 114.49426] CT
0.302 GC
N
f-1586420743
f
GR
GS
[1.00215 0 0 1 110.01505 114.53062] CT
0.302 GC
N
f-1586420743
f
GR
GS
[1.00215 0 0 1 105.21349 98.17017] CT
0.302 GC
N
f-1586420743
f
GR
GS
[1.00215 0 0 1 105.86804 165.40372] CT
0.302 GC
N
f-1586420743
f
GR
GS
[1.00215 0 0 1 105.94247 111.95358] CT
0.302 GC
N
f-1586420743
f
GR
GS
[1.00215 0 0 1 107.90944 94.68102] CT
0.302 GC
N
f-1586420743
f
GR
GS
[1.00215 0 0 1 116.44281 152.8951] CT
0.302 GC
N
f-1586420743
f
GR
GS
[1.00215 0 0 1 109.25033 65.55414] CT
0.302 GC
N
f-1586420743
f
GR
GS
[1.00215 0 0 1 102.75353 158.60532] CT
0.302 GC
N
f-1586420743
f
GR
GS
[1.00215 0 0 1 112.87055 117.3573] CT
0.302 GC
N
f-1586420743
f
GR
GS
[1.00215 0 0 1 113.99366 106.47536] CT
0.302 GC
N
f-1586420743
f
GR
GS
[1.00215 0 0 1 113.62042 125.12181] CT
0.302 GC
N
f-1586420743
f
GR
GS
[1.00215 0 0 1 107.18909 132.97926] CT
0.302 GC
N
f-1586420743
f
GR
GS
[1.00215 0 0 1 113.82925 118.65848] CT
0.302 GC
N
f-1586420743
f
GR
GS
[1.00215 0 0 1 115.66199 75.08405] CT
0.302 GC
N
f-1586420743
f
GR
GS
[1.00215 0 0 1 113.18229 109.57598] CT
0.302 GC
N
f-1586420743
f
GR
GS
[1.00215 0 0 1 110.21536 115.72954] CT
0.302 GC
N
f-1586420743
f
GR
GS
[1.00215 0 0 1 112.89702 100.63446] CT
0.302 GC
N
f-1586420743
f
GR
GS
[1.00215 0 0 1 111.62476 138.97008] CT
0.302 GC
N
f-1586420743
f
GR
GS
[1.00215 0 0 1 117.16603 105.73147] CT
0.302 GC
N
f-1586420743
f
GR
GS
[1.00215 0 0 1 113.88142 114.46662] CT
0.302 GC
N
f-1586420743
f
GR
GS
[1.00215 0 0 1 107.13276 84.69738] CT
0.302 GC
N
f-1586420743
f
GR
GS
[1.00215 0 0 1 110.54967 148.05457] CT
0.302 GC
N
f-1586420743
f
GR
GS
[1.00215 0 0 1 103.65174 134.70607] CT
0.302 GC
N
f-1586420743
f
GR
GS
[1.00215 0 0 1 106.54395 132.60388] CT
0.302 GC
N
f-1586420743
f
GR
GS
[1.00215 0 0 1 107.3828 121.8686] CT
0.302 GC
N
f-1586420743
f
GR
GS
[1.00215 0 0 1 115.10755 157.15631] CT
0.302 GC
N
f-1586420743
f
GR
GS
[1.00215 0 0 1 103.89816 173.06233] CT
0.302 GC
N
f-1586420743
f
GR
GS
[1.00215 0 0 1 108.80091 94.50425] CT
0.302 GC
N
f-1586420743
f
GR
GS
[1.00215 0 0 1 114.24698 99.64146] CT
0.302 GC
N
f-1586420743
f
GR
GS
[1.00215 0 0 1 107.55638 76.49641] CT
0.302 GC
N
f-1586420743
f
GR
GS
[1.00215 0 0 1 106.87982 143.90031] CT
0.302 GC
N
f-1586420743
f
GR
GS
[1.00215 0 0 1 110.30051 55.45934] CT
0.302 GC
N
f-1586420743
f
GR
GS
[1.00215 0 0 1 116.84302 116.61169] CT
0.302 GC
N
f-1586420743
f
GR
GS
[1.00215 0 0 1 116.47778 116.12322] CT
0.302 GC
N
f-1586420743
f
GR
GS
[1.00215 0 0 1 108.84966 74.69111] CT
0.302 GC
N
f-1586420743
f
GR
GS
[1.00215 0 0 1 104.5413 106.62152] CT
0.302 GC
N
f-1586420743
f
GR
GS
[1.00215 0 0 1 112.69663 78.23439] CT
0.302 GC
N
f-1586420743
f
GR
GS
[1.00215 0 0 1 115.98806 170.85529] CT
0.302 GC
N
f-1586420743
f
GR
GS
[1.00215 0 0 1 106.22181 107.22255] CT
0.302 GC
N
f-1586420743
f
GR
GS
[1.00215 0 0 1 0 0] CT
0.6 0.8 1 RC
N
/f305537856{133.46 97.333 M
133.46 130.809 L
165.14 130.809 L
165.14 97.333 L
cp}def
f305537856
f
GR
GS
[1.00215 0 0 1 142.58559 137.08084] CT
0.302 GC
N
f-1586420743
f
GR
GS
[1.00215 0 0 1 146.17404 91.42599] CT
0.302 GC
N
f-1586420743
f
GR
GS
[1.00215 0 0 1 148.61626 194.11288] CT
0.302 GC
N
f-1586420743
f
GR
GS
[1.00215 0 0 1 143.53886 223.54617] CT
0.302 GC
N
f-1586420743
f
GR
GS
[1.00215 0 0 1 152.60945 177.13591] CT
0.302 GC
N
f-1586420743
f
GR
GS
[1.00215 0 0 1 148.9927 122.07249] CT
0.302 GC
N
f-1586420743
f
GR
GS
[1.00215 0 0 1 144.53549 85.68143] CT
0.302 GC
N
f-1586420743
f
GR
GS
[1.00215 0 0 1 149.49691 115.90704] CT
0.302 GC
N
f-1586420743
f
GR
GS
[1.00215 0 0 1 155.70646 144.34552] CT
0.302 GC
N
f-1586420743
f
GR
GS
[1.00215 0 0 1 147.67549 142.63643] CT
0.302 GC
N
f-1586420743
f
GR
GS
[1.00215 0 0 1 154.01575 81.76355] CT
0.302 GC
N
f-1586420743
f
GR
GS
[1.00215 0 0 1 152.63769 92.27209] CT
0.302 GC
N
f-1586420743
f
GR
GS
[1.00215 0 0 1 143.40384 124.62066] CT
0.302 GC
N
f-1586420743
f
GR
GS
[1.00215 0 0 1 144.54078 167.77025] CT
0.302 GC
N
f-1586420743
f
GR
GS
[1.00215 0 0 1 152.08301 77.12449] CT
0.302 GC
N
f-1586420743
f
GR
GS
[1.00215 0 0 1 156.62997 95.67655] CT
0.302 GC
N
f-1586420743
f
GR
GS
[1.00215 0 0 1 145.70759 135.89059] CT
0.302 GC
N
f-1586420743
f
GR
GS
[1.00215 0 0 1 152.65145 141.4368] CT
0.302 GC
N
f-1586420743
f
GR
GS
[1.00215 0 0 1 143.31669 84.26861] CT
0.302 GC
N
f-1586420743
f
GR
GS
[1.00215 0 0 1 151.68841 147.96254] CT
0.302 GC
N
f-1586420743
f
GR
GS
[1.00215 0 0 1 155.66094 106.42017] CT
0.302 GC
N
f-1586420743
f
GR
GS
[1.00215 0 0 1 142.72722 125.62489] CT
0.302 GC
N
f-1586420743
f
GR
GS
[1.00215 0 0 1 149.60626 175.59528] CT
0.302 GC
N
f-1586420743
f
GR
GS
[1.00215 0 0 1 146.12808 117.0433] CT
0.302 GC
N
f-1586420743
f
GR
GS
[1.00215 0 0 1 150.18739 160.80231] CT
0.302 GC
N
f-1586420743
f
GR
GS
[1.00215 0 0 1 145.44358 188.54846] CT
0.302 GC
N
f-1586420743
f
GR
GS
[1.00215 0 0 1 157.0779 153.62677] CT
0.302 GC
N
f-1586420743
f
GR
GS
[1.00215 0 0 1 155.26383 100.97592] CT
0.302 GC
N
f-1586420743
f
GR
GS
[1.00215 0 0 1 155.16398 196.8783] CT
0.302 GC
N
f-1586420743
f
GR
GS
[1.00215 0 0 1 148.23828 161.41747] CT
0.302 GC
N
f-1586420743
f
GR
GS
[1.00215 0 0 1 146.47873 222.87692] CT
0.302 GC
N
f-1586420743
f
GR
GS
[1.00215 0 0 1 146.08125 116.55035] CT
0.302 GC
N
f-1586420743
f
GR
GS
[1.00215 0 0 1 153.0298 89.16406] CT
0.302 GC
N
f-1586420743
f
GR
GS
[1.00215 0 0 1 149.73698 160.57233] CT
0.302 GC
N
f-1586420743
f
GR
GS
[1.00215 0 0 1 150.51165 94.82704] CT
0.302 GC
N
f-1586420743
f
GR
GS
[1.00215 0 0 1 154.89557 161.45885] CT
0.302 GC
N
f-1586420743
f
GR
GS
[1.00215 0 0 1 144.42536 122.99721] CT
0.302 GC
N
f-1586420743
f
GR
GS
[1.00215 0 0 1 150.0853 70.42939] CT
0.302 GC
N
f-1586420743
f
GR
GS
[1.00215 0 0 1 150.26848 82.37856] CT
0.302 GC
N
f-1586420743
f
GR
GS
[1.00215 0 0 1 146.02795 104.71306] CT
0.302 GC
N
f-1586420743
f
GR
GS
[1.00215 0 0 1 143.91507 88.91898] CT
0.302 GC
N
f-1586420743
f
GR
GS
[1.00215 0 0 1 142.91648 134.7301] CT
0.302 GC
N
f-1586420743
f
GR
GS
[1.00215 0 0 1 150.64636 208.6757] CT
0.302 GC
N
f-1586420743
f
GR
GS
[1.00215 0 0 1 152.83561 99.44164] CT
0.302 GC
N
f-1586420743
f
GR
GS
[1.00215 0 0 1 142.06364 128.74886] CT
0.302 GC
N
f-1586420743
f
GR
GS
[1.00215 0 0 1 148.7589 97.82143] CT
0.302 GC
N
f-1586420743
f
GR
GS
[1.00215 0 0 1 153.8551 63.83492] CT
0.302 GC
N
f-1586420743
f
GR
GS
[1.00215 0 0 1 154.86032 77.73381] CT
0.302 GC
N
f-1586420743
f
GR
GS
[1.00215 0 0 1 156.46658 223.54617] CT
0.302 GC
N
f-1586420743
f
GR
GS
[1.00215 0 0 1 142.62106 132.16127] CT
0.302 GC
N
f-1586420743
f
GR
GS
[1.00215 0 0 1 150.3645 129.661] CT
0.302 GC
N
f-1586420743
f
GR
GS
[1.00215 0 0 1 142.0595 99.59421] CT
0.302 GC
N
f-1586420743
f
GR
GS
[1.00215 0 0 1 154.26874 152.38461] CT
0.302 GC
N
f-1586420743
f
GR
%%Trailer
%%Pages: 1
%%EOF
