%!PS-Adobe-3.0 EPSF-3.0
%%Creator: (MATLAB, The Mathworks, Inc. Version 9.8.0.1323502 \(R2020a\). Operating System: Mac OS X)
%%Title: /Users/kosciessa/Desktop/mntTardisLNDG/LNDG/stateswitch/stsw_multimodal/figures/linearbyage/linearcomp_prestimalpha.eps
%%CreationDate: 2022-03-03T16:32:27
%%Pages: (atend)
%%BoundingBox:     4     0   180   275
%%LanguageLevel: 3
%%EndComments
%%BeginProlog
%%BeginResource: procset (Apache XML Graphics Std ProcSet) 1.2 0
%%Version: 1.2 0
%%Copyright: (Copyright 2001-2003,2010 The Apache Software Foundation. License terms: http://www.apache.org/licenses/LICENSE-2.0)
/bd{bind def}bind def
/ld{load def}bd
/GR/grestore ld
/GS/gsave ld
/RM/rmoveto ld
/C/curveto ld
/t/show ld
/L/lineto ld
/ML/setmiterlimit ld
/CT/concat ld
/f/fill ld
/N/newpath ld
/S/stroke ld
/CC/setcmykcolor ld
/A/ashow ld
/cp/closepath ld
/RC/setrgbcolor ld
/LJ/setlinejoin ld
/GC/setgray ld
/LW/setlinewidth ld
/M/moveto ld
/re {4 2 roll M
1 index 0 rlineto
0 exch rlineto
neg 0 rlineto
cp } bd
/_ctm matrix def
/_tm matrix def
/BT { _ctm currentmatrix pop matrix _tm copy pop 0 0 moveto } bd
/ET { _ctm setmatrix } bd
/iTm { _ctm setmatrix _tm concat } bd
/Tm { _tm astore pop iTm 0 0 moveto } bd
/ux 0.0 def
/uy 0.0 def
/F {
  /Tp exch def
  /Tf exch def
  Tf findfont Tp scalefont setfont
  /cf Tf def  /cs Tp def
} bd
/ULS {currentpoint /uy exch def /ux exch def} bd
/ULE {
  /Tcx currentpoint pop def
  gsave
  newpath
  cf findfont cs scalefont dup
  /FontMatrix get 0 get /Ts exch def /FontInfo get dup
  /UnderlinePosition get Ts mul /To exch def
  /UnderlineThickness get Ts mul /Tt exch def
  ux uy To add moveto  Tcx uy To add lineto
  Tt setlinewidth stroke
  grestore
} bd
/OLE {
  /Tcx currentpoint pop def
  gsave
  newpath
  cf findfont cs scalefont dup
  /FontMatrix get 0 get /Ts exch def /FontInfo get dup
  /UnderlinePosition get Ts mul /To exch def
  /UnderlineThickness get Ts mul /Tt exch def
  ux uy To add cs add moveto Tcx uy To add cs add lineto
  Tt setlinewidth stroke
  grestore
} bd
/SOE {
  /Tcx currentpoint pop def
  gsave
  newpath
  cf findfont cs scalefont dup
  /FontMatrix get 0 get /Ts exch def /FontInfo get dup
  /UnderlinePosition get Ts mul /To exch def
  /UnderlineThickness get Ts mul /Tt exch def
  ux uy To add cs 10 mul 26 idiv add moveto Tcx uy To add cs 10 mul 26 idiv add lineto
  Tt setlinewidth stroke
  grestore
} bd
/QT {
/Y22 exch store
/X22 exch store
/Y21 exch store
/X21 exch store
currentpoint
/Y21 load 2 mul add 3 div exch
/X21 load 2 mul add 3 div exch
/X21 load 2 mul /X22 load add 3 div
/Y21 load 2 mul /Y22 load add 3 div
/X22 load /Y22 load curveto
} bd
/SSPD {
dup length /d exch dict def
{
/v exch def
/k exch def
currentpagedevice k known {
/cpdv currentpagedevice k get def
v cpdv ne {
/upd false def
/nullv v type /nulltype eq def
/nullcpdv cpdv type /nulltype eq def
nullv nullcpdv or
{
/upd true def
} {
/sametype v type cpdv type eq def
sametype {
v type /arraytype eq {
/vlen v length def
/cpdvlen cpdv length def
vlen cpdvlen eq {
0 1 vlen 1 sub {
/i exch def
/obj v i get def
/cpdobj cpdv i get def
obj cpdobj ne {
/upd true def
exit
} if
} for
} {
/upd true def
} ifelse
} {
v type /dicttype eq {
v {
/dv exch def
/dk exch def
/cpddv cpdv dk get def
dv cpddv ne {
/upd true def
exit
} if
} forall
} {
/upd true def
} ifelse
} ifelse
} if
} ifelse
upd true eq {
d k v put
} if
} if
} if
} forall
d length 0 gt {
d setpagedevice
} if
} bd
/RE { % /NewFontName [NewEncodingArray] /FontName RE -
  findfont dup length dict begin
  {
    1 index /FID ne
    {def} {pop pop} ifelse
  } forall
  /Encoding exch def
  /FontName 1 index def
  currentdict definefont pop
  end
} bind def
%%EndResource
%%BeginResource: procset (Apache XML Graphics EPS ProcSet) 1.0 0
%%Version: 1.0 0
%%Copyright: (Copyright 2002-2003 The Apache Software Foundation. License terms: http://www.apache.org/licenses/LICENSE-2.0)
/BeginEPSF { %def
/b4_Inc_state save def         % Save state for cleanup
/dict_count countdictstack def % Count objects on dict stack
/op_count count 1 sub def      % Count objects on operand stack
userdict begin                 % Push userdict on dict stack
/showpage { } def              % Redefine showpage, { } = null proc
0 setgray 0 setlinecap         % Prepare graphics state
1 setlinewidth 0 setlinejoin
10 setmiterlimit [ ] 0 setdash newpath
/languagelevel where           % If level not equal to 1 then
{pop languagelevel             % set strokeadjust and
1 ne                           % overprint to their defaults.
{false setstrokeadjust false setoverprint
} if
} if
} bd
/EndEPSF { %def
count op_count sub {pop} repeat            % Clean up stacks
countdictstack dict_count sub {end} repeat
b4_Inc_state restore
} bd
%%EndResource
%FOPBeginFontDict
%%IncludeResource: font Courier-Oblique
%%IncludeResource: font Courier-BoldOblique
%%IncludeResource: font Courier-Bold
%%IncludeResource: font ZapfDingbats
%%IncludeResource: font Symbol
%%IncludeResource: font Helvetica
%%IncludeResource: font Helvetica-Oblique
%%IncludeResource: font Helvetica-Bold
%%IncludeResource: font Helvetica-BoldOblique
%%IncludeResource: font Times-Roman
%%IncludeResource: font Times-Italic
%%IncludeResource: font Times-Bold
%%IncludeResource: font Times-BoldItalic
%%IncludeResource: font Courier
%FOPEndFontDict
%%BeginResource: encoding WinAnsiEncoding
/WinAnsiEncoding [
/.notdef /.notdef /.notdef /.notdef /.notdef
/.notdef /.notdef /.notdef /.notdef /.notdef
/.notdef /.notdef /.notdef /.notdef /.notdef
/.notdef /.notdef /.notdef /.notdef /.notdef
/.notdef /.notdef /.notdef /.notdef /.notdef
/.notdef /.notdef /.notdef /.notdef /.notdef
/.notdef /.notdef /space /exclam /quotedbl
/numbersign /dollar /percent /ampersand /quotesingle
/parenleft /parenright /asterisk /plus /comma
/hyphen /period /slash /zero /one
/two /three /four /five /six
/seven /eight /nine /colon /semicolon
/less /equal /greater /question /at
/A /B /C /D /E
/F /G /H /I /J
/K /L /M /N /O
/P /Q /R /S /T
/U /V /W /X /Y
/Z /bracketleft /backslash /bracketright /asciicircum
/underscore /quoteleft /a /b /c
/d /e /f /g /h
/i /j /k /l /m
/n /o /p /q /r
/s /t /u /v /w
/x /y /z /braceleft /bar
/braceright /asciitilde /bullet /Euro /bullet
/quotesinglbase /florin /quotedblbase /ellipsis /dagger
/daggerdbl /circumflex /perthousand /Scaron /guilsinglleft
/OE /bullet /Zcaron /bullet /bullet
/quoteleft /quoteright /quotedblleft /quotedblright /bullet
/endash /emdash /asciitilde /trademark /scaron
/guilsinglright /oe /bullet /zcaron /Ydieresis
/space /exclamdown /cent /sterling /currency
/yen /brokenbar /section /dieresis /copyright
/ordfeminine /guillemotleft /logicalnot /sfthyphen /registered
/macron /degree /plusminus /twosuperior /threesuperior
/acute /mu /paragraph /middot /cedilla
/onesuperior /ordmasculine /guillemotright /onequarter /onehalf
/threequarters /questiondown /Agrave /Aacute /Acircumflex
/Atilde /Adieresis /Aring /AE /Ccedilla
/Egrave /Eacute /Ecircumflex /Edieresis /Igrave
/Iacute /Icircumflex /Idieresis /Eth /Ntilde
/Ograve /Oacute /Ocircumflex /Otilde /Odieresis
/multiply /Oslash /Ugrave /Uacute /Ucircumflex
/Udieresis /Yacute /Thorn /germandbls /agrave
/aacute /acircumflex /atilde /adieresis /aring
/ae /ccedilla /egrave /eacute /ecircumflex
/edieresis /igrave /iacute /icircumflex /idieresis
/eth /ntilde /ograve /oacute /ocircumflex
/otilde /odieresis /divide /oslash /ugrave
/uacute /ucircumflex /udieresis /yacute /thorn
/ydieresis
] def
%%EndResource
%FOPBeginFontReencode
/Courier-Oblique findfont
dup length dict begin
  {1 index /FID ne {def} {pop pop} ifelse} forall
  /Encoding WinAnsiEncoding def
  currentdict
end
/Courier-Oblique exch definefont pop
/Courier-BoldOblique findfont
dup length dict begin
  {1 index /FID ne {def} {pop pop} ifelse} forall
  /Encoding WinAnsiEncoding def
  currentdict
end
/Courier-BoldOblique exch definefont pop
/Courier-Bold findfont
dup length dict begin
  {1 index /FID ne {def} {pop pop} ifelse} forall
  /Encoding WinAnsiEncoding def
  currentdict
end
/Courier-Bold exch definefont pop
/Helvetica findfont
dup length dict begin
  {1 index /FID ne {def} {pop pop} ifelse} forall
  /Encoding WinAnsiEncoding def
  currentdict
end
/Helvetica exch definefont pop
/Helvetica-Oblique findfont
dup length dict begin
  {1 index /FID ne {def} {pop pop} ifelse} forall
  /Encoding WinAnsiEncoding def
  currentdict
end
/Helvetica-Oblique exch definefont pop
/Helvetica-Bold findfont
dup length dict begin
  {1 index /FID ne {def} {pop pop} ifelse} forall
  /Encoding WinAnsiEncoding def
  currentdict
end
/Helvetica-Bold exch definefont pop
/Helvetica-BoldOblique findfont
dup length dict begin
  {1 index /FID ne {def} {pop pop} ifelse} forall
  /Encoding WinAnsiEncoding def
  currentdict
end
/Helvetica-BoldOblique exch definefont pop
/Times-Roman findfont
dup length dict begin
  {1 index /FID ne {def} {pop pop} ifelse} forall
  /Encoding WinAnsiEncoding def
  currentdict
end
/Times-Roman exch definefont pop
/Times-Italic findfont
dup length dict begin
  {1 index /FID ne {def} {pop pop} ifelse} forall
  /Encoding WinAnsiEncoding def
  currentdict
end
/Times-Italic exch definefont pop
/Times-Bold findfont
dup length dict begin
  {1 index /FID ne {def} {pop pop} ifelse} forall
  /Encoding WinAnsiEncoding def
  currentdict
end
/Times-Bold exch definefont pop
/Times-BoldItalic findfont
dup length dict begin
  {1 index /FID ne {def} {pop pop} ifelse} forall
  /Encoding WinAnsiEncoding def
  currentdict
end
/Times-BoldItalic exch definefont pop
/Courier findfont
dup length dict begin
  {1 index /FID ne {def} {pop pop} ifelse} forall
  /Encoding WinAnsiEncoding def
  currentdict
end
/Courier exch definefont pop
%FOPEndFontReencode
%%EndProlog
%%Page: 1 1
%%PageBoundingBox: 0 0 198 283
%%BeginPageSetup
[1 0 0 -1 0 283] CT
%%EndPageSetup
GS
[1.00215 0 0 1 0 0] CT
1 GC
N
0 0 198 283 re
f
GR
GS
[1.00215 0 0 1 0 0] CT
1 GC
N
0 0 198 283 re
f
GR
GS
[1.00215 0 0 1 0 0] CT
1 GC
N
69 228 M
179 228 L
179 32 L
69 32 L
cp
f
GR
GS
[1.00215 0 0 1 0 0] CT
0.149 GC
2 setlinecap
1 LJ
0.5 LW
N
69 228 M
179 228 L
S
GR
GS
[1.00215 0 0 1 0 0] CT
0.149 GC
2 setlinecap
1 LJ
0.5 LW
N
102 228 M
102 226.04 L
S
GR
GS
[1.00215 0 0 1 0 0] CT
0.149 GC
2 setlinecap
1 LJ
0.5 LW
N
146 228 M
146 226.04 L
S
GR
GS
[1.00215 0 0 1 102.21904 234] CT
0.149 GC
/Helvetica 20 F
GS
[1 0 0 1 0 0] CT
-13 20 moveto 
1 -1 scale
(YA) t 
GR
GR
GS
[1.00215 0 0 1 146.31353 234] CT
0.149 GC
/Helvetica 20 F
GS
[1 0 0 1 0 0] CT
-14.5 20 moveto 
1 -1 scale
(OA) t 
GR
GR
GS
[1.00215 0 0 1 124.26634 259] CT
0.149 GC
/Helvetica 20 F
GS
[1 0 0 1 0 0] CT
-49 20 moveto 
1 -1 scale
(Age Group) t 
GR
GR
GS
[1.00215 0 0 1 0 0] CT
0.149 GC
2 setlinecap
1 LJ
0.5 LW
N
69 228 M
69 32 L
S
GR
GS
[1.00215 0 0 1 0 0] CT
0.149 GC
2 setlinecap
1 LJ
0.5 LW
N
69 228 M
70.96 228 L
S
GR
GS
[1.00215 0 0 1 0 0] CT
0.149 GC
2 setlinecap
1 LJ
0.5 LW
N
69 162.667 M
70.96 162.667 L
S
GR
GS
[1.00215 0 0 1 0 0] CT
0.149 GC
2 setlinecap
1 LJ
0.5 LW
N
69 97.333 M
70.96 97.333 L
S
GR
GS
[1.00215 0 0 1 0 0] CT
0.149 GC
2 setlinecap
1 LJ
0.5 LW
N
69 32 M
70.96 32 L
S
GR
GS
[1.00215 0 0 1 63.13529 228] CT
0.149 GC
/Helvetica 20 F
GS
[1 0 0 1 0 0] CT
-36 7.5 moveto 
1 -1 scale
(-0.5) t 
GR
GR
GS
[1.00215 0 0 1 63.13529 162.66667] CT
0.149 GC
/Helvetica 20 F
GS
[1 0 0 1 0 0] CT
-12 7.5 moveto 
1 -1 scale
(0) t 
GR
GR
GS
[1.00215 0 0 1 63.13529 97.33334] CT
0.149 GC
/Helvetica 20 F
GS
[1 0 0 1 0 0] CT
-28 7.5 moveto 
1 -1 scale
(0.5) t 
GR
GR
GS
[1.00215 0 0 1 63.13529 32] CT
0.149 GC
/Helvetica 20 F
GS
[1 0 0 1 0 0] CT
-12 7.5 moveto 
1 -1 scale
(1) t 
GR
GR
GS
[0 -1 1.00215 0 24.05154 129.99991] CT
0.149 GC
/Helvetica 20 F
GS
[1 0 0 1 0 0] CT
-85 -5 moveto 
1 -1 scale
(prestimalpha linear) t 
GR
GR
GS
[1.00215 0 0 1 124.26641 29.25] CT
/Helvetica-Bold 22 F
GS
[1 0 0 1 0 0] CT
-41 -5 moveto 
1 -1 scale
(p = 0.84) t 
GR
GR
GS
[1.00215 0 0 1 0 0] CT
0.149 GC
1 LJ
0.5 LW
N
69 162.667 M
179 162.667 L
S
GR
GS
[1.00215 0 0 1 0 0] CT
1 0.6 0.6 RC
N
119.6 162.667 M
119.6 138.649 L
84.4 138.649 L
84.4 162.667 L
cp
f
GR
GS
[1.00215 0 0 1 95.33981 135.7072] CT
0.302 GC
N
2.236 0 M
2.236 -1.235 1.235 -2.236 0 -2.236 C
-1.235 -2.236 -2.236 -1.235 -2.236 0 C
-2.236 1.235 -1.235 2.236 0 2.236 C
1.235 2.236 2.236 1.235 2.236 0 C
cp
f
GR
GS
[1.00215 0 0 1 111.00151 149.6507] CT
0.302 GC
N
/f-1586420743{2.236 0 M
2.236 -1.235 1.235 -2.236 0 -2.236 C
-1.235 -2.236 -2.236 -1.235 -2.236 0 C
-2.236 1.235 -1.235 2.236 0 2.236 C
1.235 2.236 2.236 1.235 2.236 0 C
cp}def
f-1586420743
f
GR
GS
[1.00215 0 0 1 109.37741 137.29462] CT
0.302 GC
N
f-1586420743
f
GR
GS
[1.00215 0 0 1 96.29619 158.67091] CT
0.302 GC
N
f-1586420743
f
GR
GS
[1.00215 0 0 1 102.03395 112.14977] CT
0.302 GC
N
f-1586420743
f
GR
GS
[1.00215 0 0 1 107.06892 158.92383] CT
0.302 GC
N
f-1586420743
f
GR
GS
[1.00215 0 0 1 97.05072 165.35542] CT
0.302 GC
N
f-1586420743
f
GR
GS
[1.00215 0 0 1 103.46174 145.38747] CT
0.302 GC
N
f-1586420743
f
GR
GS
[1.00215 0 0 1 97.75434 140.12274] CT
0.302 GC
N
f-1586420743
f
GR
GS
[1.00215 0 0 1 93.70286 174.74799] CT
0.302 GC
N
f-1586420743
f
GR
GS
[1.00215 0 0 1 110.57989 73.86359] CT
0.302 GC
N
f-1586420743
f
GR
GS
[1.00215 0 0 1 105.05275 105.25266] CT
0.302 GC
N
f-1586420743
f
GR
GS
[1.00215 0 0 1 105.85453 145.26311] CT
0.302 GC
N
f-1586420743
f
GR
GS
[1.00215 0 0 1 105.95544 123.47335] CT
0.302 GC
N
f-1586420743
f
GR
GS
[1.00215 0 0 1 103.37977 149.83766] CT
0.302 GC
N
f-1586420743
f
GR
GS
[1.00215 0 0 1 97.97956 198.60663] CT
0.302 GC
N
f-1586420743
f
GR
GS
[1.00215 0 0 1 94.00333 137.01479] CT
0.302 GC
N
f-1586420743
f
GR
GS
[1.00215 0 0 1 101.27831 165.40138] CT
0.302 GC
N
f-1586420743
f
GR
GS
[1.00215 0 0 1 95.7491 177.84573] CT
0.302 GC
N
f-1586420743
f
GR
GS
[1.00215 0 0 1 96.04788 132.92897] CT
0.302 GC
N
f-1586420743
f
GR
GS
[1.00215 0 0 1 107.18601 135.41316] CT
0.302 GC
N
f-1586420743
f
GR
GS
[1.00215 0 0 1 110.24021 215.74582] CT
0.302 GC
N
f-1586420743
f
GR
GS
[1.00215 0 0 1 101.14276 107.45558] CT
0.302 GC
N
f-1586420743
f
GR
GS
[1.00215 0 0 1 102.39548 140.97206] CT
0.302 GC
N
f-1586420743
f
GR
GS
[1.00215 0 0 1 97.59293 115.7989] CT
0.302 GC
N
f-1586420743
f
GR
GS
[1.00215 0 0 1 103.13201 129.49094] CT
0.302 GC
N
f-1586420743
f
GR
GS
[1.00215 0 0 1 93.44333 104.5341] CT
0.302 GC
N
f-1586420743
f
GR
GS
[1.00215 0 0 1 95.66994 122.25014] CT
0.302 GC
N
f-1586420743
f
GR
GS
[1.00215 0 0 1 102.75192 114.94755] CT
0.302 GC
N
f-1586420743
f
GR
GS
[1.00215 0 0 1 105.46187 156.07088] CT
0.302 GC
N
f-1586420743
f
GR
GS
[1.00215 0 0 1 110.53281 65.09987] CT
0.302 GC
N
f-1586420743
f
GR
GS
[1.00215 0 0 1 103.56212 174.77625] CT
0.302 GC
N
f-1586420743
f
GR
GS
[1.00215 0 0 1 109.23797 127.46232] CT
0.302 GC
N
f-1586420743
f
GR
GS
[1.00215 0 0 1 97.25291 105.03957] CT
0.302 GC
N
f-1586420743
f
GR
GS
[1.00215 0 0 1 102.55592 150.60713] CT
0.302 GC
N
f-1586420743
f
GR
GS
[1.00215 0 0 1 108.95039 77.04722] CT
0.302 GC
N
f-1586420743
f
GR
GS
[1.00215 0 0 1 99.48229 150.41905] CT
0.302 GC
N
f-1586420743
f
GR
GS
[1.00215 0 0 1 97.69022 166.08755] CT
0.302 GC
N
f-1586420743
f
GR
GS
[1.00215 0 0 1 109.45054 121.84121] CT
0.302 GC
N
f-1586420743
f
GR
GS
[1.00215 0 0 1 110.33524 139.52202] CT
0.302 GC
N
f-1586420743
f
GR
GS
[1.00215 0 0 1 108.12985 136.42462] CT
0.302 GC
N
f-1586420743
f
GR
GS
[1.00215 0 0 1 94.72077 178.74913] CT
0.302 GC
N
f-1586420743
f
GR
GS
[1.00215 0 0 1 0 0] CT
1 0.6 0.6 RC
N
/f149135598{163.6 162.667 M
163.6 137.506 L
128.4 137.506 L
128.4 162.667 L
cp}def
f149135598
f
GR
GS
[1.00215 0 0 1 147.42358 153.15681] CT
0.302 GC
N
f-1586420743
f
GR
GS
[1.00215 0 0 1 143.85457 139.62534] CT
0.302 GC
N
f-1586420743
f
GR
GS
[1.00215 0 0 1 137.88189 129.62585] CT
0.302 GC
N
f-1586420743
f
GR
GS
[1.00215 0 0 1 154.7996 168.61835] CT
0.302 GC
N
f-1586420743
f
GR
GS
[1.00215 0 0 1 151.42119 80.66888] CT
0.302 GC
N
f-1586420743
f
GR
GS
[1.00215 0 0 1 141.58956 120.57314] CT
0.302 GC
N
f-1586420743
f
GR
GS
[1.00215 0 0 1 142.49492 172.96846] CT
0.302 GC
N
f-1586420743
f
GR
GS
[1.00215 0 0 1 147.88199 138.16397] CT
0.302 GC
N
f-1586420743
f
GR
GS
[1.00215 0 0 1 150.80407 145.49599] CT
0.302 GC
N
f-1586420743
f
GR
GS
[1.00215 0 0 1 154.81602 134.67903] CT
0.302 GC
N
f-1586420743
f
GR
GS
[1.00215 0 0 1 154.69321 140.7514] CT
0.302 GC
N
f-1586420743
f
GR
GS
[1.00215 0 0 1 150.65533 118.11302] CT
0.302 GC
N
f-1586420743
f
GR
GS
[1.00215 0 0 1 145.99204 135.61768] CT
0.302 GC
N
f-1586420743
f
GR
GS
[1.00215 0 0 1 139.68178 148.26175] CT
0.302 GC
N
f-1586420743
f
GR
GS
[1.00215 0 0 1 154.99571 149.19017] CT
0.302 GC
N
f-1586420743
f
GR
GS
[1.00215 0 0 1 143.45904 174.41483] CT
0.302 GC
N
f-1586420743
f
GR
GS
[1.00215 0 0 1 144.45729 162.69612] CT
0.302 GC
N
f-1586420743
f
GR
GS
[1.00215 0 0 1 147.74175 167.56587] CT
0.302 GC
N
f-1586420743
f
GR
GS
[1.00215 0 0 1 142.49781 122.75184] CT
0.302 GC
N
f-1586420743
f
GR
GS
[1.00215 0 0 1 143.93447 143.32642] CT
0.302 GC
N
f-1586420743
f
GR
GS
[1.00215 0 0 1 143.12289 91.08287] CT
0.302 GC
N
f-1586420743
f
GR
GS
[1.00215 0 0 1 148.14684 150.6136] CT
0.302 GC
N
f-1586420743
f
GR
GS
[1.00215 0 0 1 146.10957 127.4195] CT
0.302 GC
N
f-1586420743
f
GR
GS
[1.00215 0 0 1 146.50975 80.66888] CT
0.302 GC
N
f-1586420743
f
GR
GS
[1.00215 0 0 1 153.36213 109.26028] CT
0.302 GC
N
f-1586420743
f
GR
GS
[1.00215 0 0 1 142.725 168.95665] CT
0.302 GC
N
f-1586420743
f
GR
GS
[1.00215 0 0 1 145.96727 119.86643] CT
0.302 GC
N
f-1586420743
f
GR
GS
[1.00215 0 0 1 152.25446 149.53096] CT
0.302 GC
N
f-1586420743
f
GR
GS
[1.00215 0 0 1 138.17524 147.2961] CT
0.302 GC
N
f-1586420743
f
GR
GS
[1.00215 0 0 1 153.24513 135.93768] CT
0.302 GC
N
f-1586420743
f
GR
GS
[1.00215 0 0 1 144.55609 155.47229] CT
0.302 GC
N
f-1586420743
f
GR
GS
[1.00215 0 0 1 154.90399 146.76788] CT
0.302 GC
N
f-1586420743
f
GR
GS
[1.00215 0 0 1 147.40231 125.91402] CT
0.302 GC
N
f-1586420743
f
GR
GS
[1.00215 0 0 1 139.86183 124.35177] CT
0.302 GC
N
f-1586420743
f
GR
GS
[1.00215 0 0 1 148.25392 99.17592] CT
0.302 GC
N
f-1586420743
f
GR
GS
[1.00215 0 0 1 154.18937 125.0695] CT
0.302 GC
N
f-1586420743
f
GR
GS
[1.00215 0 0 1 145.0905 129.76039] CT
0.302 GC
N
f-1586420743
f
GR
GS
[1.00215 0 0 1 139.27429 150.9404] CT
0.302 GC
N
f-1586420743
f
GR
GS
[1.00215 0 0 1 137.89978 142.65106] CT
0.302 GC
N
f-1586420743
f
GR
GS
[1.00215 0 0 1 138.93337 144.65678] CT
0.302 GC
N
f-1586420743
f
GR
GS
[1.00215 0 0 1 143.33963 143.66457] CT
0.302 GC
N
f-1586420743
f
GR
GS
[1.00215 0 0 1 154.48399 173.51561] CT
0.302 GC
N
f-1586420743
f
GR
GS
[1.00215 0 0 1 148.12089 149.12653] CT
0.302 GC
N
f-1586420743
f
GR
GS
[1.00215 0 0 1 148.16488 80.66888] CT
0.302 GC
N
f-1586420743
f
GR
GS
[1.00215 0 0 1 144.23633 126.40645] CT
0.302 GC
N
f-1586420743
f
GR
GS
[1.00215 0 0 1 147.62643 165.88812] CT
0.302 GC
N
f-1586420743
f
GR
GS
[1.00215 0 0 1 151.66422 114.57674] CT
0.302 GC
N
f-1586420743
f
GR
GS
[1.00215 0 0 1 138.8835 163.1554] CT
0.302 GC
N
f-1586420743
f
GR
GS
[1.00215 0 0 1 140.30478 130.06744] CT
0.302 GC
N
f-1586420743
f
GR
GS
[1.00215 0 0 1 149.7221 155.60118] CT
0.302 GC
N
f-1586420743
f
GR
GS
[1.00215 0 0 1 150.1124 139.77438] CT
0.302 GC
N
f-1586420743
f
GR
GS
[1.00215 0 0 1 153.1588 135.08398] CT
0.302 GC
N
f-1586420743
f
GR
GS
[1.00215 0 0 1 138.5317 138.62909] CT
0.302 GC
N
f-1586420743
f
GR
%%Trailer
%%Pages: 1
%%EOF
