%!PS-Adobe-3.0 EPSF-3.0
%%Creator: (MATLAB, The Mathworks, Inc. Version 9.8.0.1323502 \(R2020a\). Operating System: Mac OS X)
%%Title: /Users/kosciessa/Desktop/mntTardisLNDG/LNDG/stateswitch/stsw_multimodal/figures/l1byage/l1comp_prestimalpha.eps
%%CreationDate: 2022-03-02T14:36:43
%%Pages: (atend)
%%BoundingBox:     4     0   180   275
%%LanguageLevel: 3
%%EndComments
%%BeginProlog
%%BeginResource: procset (Apache XML Graphics Std ProcSet) 1.2 0
%%Version: 1.2 0
%%Copyright: (Copyright 2001-2003,2010 The Apache Software Foundation. License terms: http://www.apache.org/licenses/LICENSE-2.0)
/bd{bind def}bind def
/ld{load def}bd
/GR/grestore ld
/GS/gsave ld
/RM/rmoveto ld
/C/curveto ld
/t/show ld
/L/lineto ld
/ML/setmiterlimit ld
/CT/concat ld
/f/fill ld
/N/newpath ld
/S/stroke ld
/CC/setcmykcolor ld
/A/ashow ld
/cp/closepath ld
/RC/setrgbcolor ld
/LJ/setlinejoin ld
/GC/setgray ld
/LW/setlinewidth ld
/M/moveto ld
/re {4 2 roll M
1 index 0 rlineto
0 exch rlineto
neg 0 rlineto
cp } bd
/_ctm matrix def
/_tm matrix def
/BT { _ctm currentmatrix pop matrix _tm copy pop 0 0 moveto } bd
/ET { _ctm setmatrix } bd
/iTm { _ctm setmatrix _tm concat } bd
/Tm { _tm astore pop iTm 0 0 moveto } bd
/ux 0.0 def
/uy 0.0 def
/F {
  /Tp exch def
  /Tf exch def
  Tf findfont Tp scalefont setfont
  /cf Tf def  /cs Tp def
} bd
/ULS {currentpoint /uy exch def /ux exch def} bd
/ULE {
  /Tcx currentpoint pop def
  gsave
  newpath
  cf findfont cs scalefont dup
  /FontMatrix get 0 get /Ts exch def /FontInfo get dup
  /UnderlinePosition get Ts mul /To exch def
  /UnderlineThickness get Ts mul /Tt exch def
  ux uy To add moveto  Tcx uy To add lineto
  Tt setlinewidth stroke
  grestore
} bd
/OLE {
  /Tcx currentpoint pop def
  gsave
  newpath
  cf findfont cs scalefont dup
  /FontMatrix get 0 get /Ts exch def /FontInfo get dup
  /UnderlinePosition get Ts mul /To exch def
  /UnderlineThickness get Ts mul /Tt exch def
  ux uy To add cs add moveto Tcx uy To add cs add lineto
  Tt setlinewidth stroke
  grestore
} bd
/SOE {
  /Tcx currentpoint pop def
  gsave
  newpath
  cf findfont cs scalefont dup
  /FontMatrix get 0 get /Ts exch def /FontInfo get dup
  /UnderlinePosition get Ts mul /To exch def
  /UnderlineThickness get Ts mul /Tt exch def
  ux uy To add cs 10 mul 26 idiv add moveto Tcx uy To add cs 10 mul 26 idiv add lineto
  Tt setlinewidth stroke
  grestore
} bd
/QT {
/Y22 exch store
/X22 exch store
/Y21 exch store
/X21 exch store
currentpoint
/Y21 load 2 mul add 3 div exch
/X21 load 2 mul add 3 div exch
/X21 load 2 mul /X22 load add 3 div
/Y21 load 2 mul /Y22 load add 3 div
/X22 load /Y22 load curveto
} bd
/SSPD {
dup length /d exch dict def
{
/v exch def
/k exch def
currentpagedevice k known {
/cpdv currentpagedevice k get def
v cpdv ne {
/upd false def
/nullv v type /nulltype eq def
/nullcpdv cpdv type /nulltype eq def
nullv nullcpdv or
{
/upd true def
} {
/sametype v type cpdv type eq def
sametype {
v type /arraytype eq {
/vlen v length def
/cpdvlen cpdv length def
vlen cpdvlen eq {
0 1 vlen 1 sub {
/i exch def
/obj v i get def
/cpdobj cpdv i get def
obj cpdobj ne {
/upd true def
exit
} if
} for
} {
/upd true def
} ifelse
} {
v type /dicttype eq {
v {
/dv exch def
/dk exch def
/cpddv cpdv dk get def
dv cpddv ne {
/upd true def
exit
} if
} forall
} {
/upd true def
} ifelse
} ifelse
} if
} ifelse
upd true eq {
d k v put
} if
} if
} if
} forall
d length 0 gt {
d setpagedevice
} if
} bd
/RE { % /NewFontName [NewEncodingArray] /FontName RE -
  findfont dup length dict begin
  {
    1 index /FID ne
    {def} {pop pop} ifelse
  } forall
  /Encoding exch def
  /FontName 1 index def
  currentdict definefont pop
  end
} bind def
%%EndResource
%%BeginResource: procset (Apache XML Graphics EPS ProcSet) 1.0 0
%%Version: 1.0 0
%%Copyright: (Copyright 2002-2003 The Apache Software Foundation. License terms: http://www.apache.org/licenses/LICENSE-2.0)
/BeginEPSF { %def
/b4_Inc_state save def         % Save state for cleanup
/dict_count countdictstack def % Count objects on dict stack
/op_count count 1 sub def      % Count objects on operand stack
userdict begin                 % Push userdict on dict stack
/showpage { } def              % Redefine showpage, { } = null proc
0 setgray 0 setlinecap         % Prepare graphics state
1 setlinewidth 0 setlinejoin
10 setmiterlimit [ ] 0 setdash newpath
/languagelevel where           % If level not equal to 1 then
{pop languagelevel             % set strokeadjust and
1 ne                           % overprint to their defaults.
{false setstrokeadjust false setoverprint
} if
} if
} bd
/EndEPSF { %def
count op_count sub {pop} repeat            % Clean up stacks
countdictstack dict_count sub {end} repeat
b4_Inc_state restore
} bd
%%EndResource
%FOPBeginFontDict
%%IncludeResource: font Courier-Oblique
%%IncludeResource: font Courier-BoldOblique
%%IncludeResource: font Courier-Bold
%%IncludeResource: font ZapfDingbats
%%IncludeResource: font Symbol
%%IncludeResource: font Helvetica
%%IncludeResource: font Helvetica-Oblique
%%IncludeResource: font Helvetica-Bold
%%IncludeResource: font Helvetica-BoldOblique
%%IncludeResource: font Times-Roman
%%IncludeResource: font Times-Italic
%%IncludeResource: font Times-Bold
%%IncludeResource: font Times-BoldItalic
%%IncludeResource: font Courier
%FOPEndFontDict
%%BeginResource: encoding WinAnsiEncoding
/WinAnsiEncoding [
/.notdef /.notdef /.notdef /.notdef /.notdef
/.notdef /.notdef /.notdef /.notdef /.notdef
/.notdef /.notdef /.notdef /.notdef /.notdef
/.notdef /.notdef /.notdef /.notdef /.notdef
/.notdef /.notdef /.notdef /.notdef /.notdef
/.notdef /.notdef /.notdef /.notdef /.notdef
/.notdef /.notdef /space /exclam /quotedbl
/numbersign /dollar /percent /ampersand /quotesingle
/parenleft /parenright /asterisk /plus /comma
/hyphen /period /slash /zero /one
/two /three /four /five /six
/seven /eight /nine /colon /semicolon
/less /equal /greater /question /at
/A /B /C /D /E
/F /G /H /I /J
/K /L /M /N /O
/P /Q /R /S /T
/U /V /W /X /Y
/Z /bracketleft /backslash /bracketright /asciicircum
/underscore /quoteleft /a /b /c
/d /e /f /g /h
/i /j /k /l /m
/n /o /p /q /r
/s /t /u /v /w
/x /y /z /braceleft /bar
/braceright /asciitilde /bullet /Euro /bullet
/quotesinglbase /florin /quotedblbase /ellipsis /dagger
/daggerdbl /circumflex /perthousand /Scaron /guilsinglleft
/OE /bullet /Zcaron /bullet /bullet
/quoteleft /quoteright /quotedblleft /quotedblright /bullet
/endash /emdash /asciitilde /trademark /scaron
/guilsinglright /oe /bullet /zcaron /Ydieresis
/space /exclamdown /cent /sterling /currency
/yen /brokenbar /section /dieresis /copyright
/ordfeminine /guillemotleft /logicalnot /sfthyphen /registered
/macron /degree /plusminus /twosuperior /threesuperior
/acute /mu /paragraph /middot /cedilla
/onesuperior /ordmasculine /guillemotright /onequarter /onehalf
/threequarters /questiondown /Agrave /Aacute /Acircumflex
/Atilde /Adieresis /Aring /AE /Ccedilla
/Egrave /Eacute /Ecircumflex /Edieresis /Igrave
/Iacute /Icircumflex /Idieresis /Eth /Ntilde
/Ograve /Oacute /Ocircumflex /Otilde /Odieresis
/multiply /Oslash /Ugrave /Uacute /Ucircumflex
/Udieresis /Yacute /Thorn /germandbls /agrave
/aacute /acircumflex /atilde /adieresis /aring
/ae /ccedilla /egrave /eacute /ecircumflex
/edieresis /igrave /iacute /icircumflex /idieresis
/eth /ntilde /ograve /oacute /ocircumflex
/otilde /odieresis /divide /oslash /ugrave
/uacute /ucircumflex /udieresis /yacute /thorn
/ydieresis
] def
%%EndResource
%FOPBeginFontReencode
/Courier-Oblique findfont
dup length dict begin
  {1 index /FID ne {def} {pop pop} ifelse} forall
  /Encoding WinAnsiEncoding def
  currentdict
end
/Courier-Oblique exch definefont pop
/Courier-BoldOblique findfont
dup length dict begin
  {1 index /FID ne {def} {pop pop} ifelse} forall
  /Encoding WinAnsiEncoding def
  currentdict
end
/Courier-BoldOblique exch definefont pop
/Courier-Bold findfont
dup length dict begin
  {1 index /FID ne {def} {pop pop} ifelse} forall
  /Encoding WinAnsiEncoding def
  currentdict
end
/Courier-Bold exch definefont pop
/Helvetica findfont
dup length dict begin
  {1 index /FID ne {def} {pop pop} ifelse} forall
  /Encoding WinAnsiEncoding def
  currentdict
end
/Helvetica exch definefont pop
/Helvetica-Oblique findfont
dup length dict begin
  {1 index /FID ne {def} {pop pop} ifelse} forall
  /Encoding WinAnsiEncoding def
  currentdict
end
/Helvetica-Oblique exch definefont pop
/Helvetica-Bold findfont
dup length dict begin
  {1 index /FID ne {def} {pop pop} ifelse} forall
  /Encoding WinAnsiEncoding def
  currentdict
end
/Helvetica-Bold exch definefont pop
/Helvetica-BoldOblique findfont
dup length dict begin
  {1 index /FID ne {def} {pop pop} ifelse} forall
  /Encoding WinAnsiEncoding def
  currentdict
end
/Helvetica-BoldOblique exch definefont pop
/Times-Roman findfont
dup length dict begin
  {1 index /FID ne {def} {pop pop} ifelse} forall
  /Encoding WinAnsiEncoding def
  currentdict
end
/Times-Roman exch definefont pop
/Times-Italic findfont
dup length dict begin
  {1 index /FID ne {def} {pop pop} ifelse} forall
  /Encoding WinAnsiEncoding def
  currentdict
end
/Times-Italic exch definefont pop
/Times-Bold findfont
dup length dict begin
  {1 index /FID ne {def} {pop pop} ifelse} forall
  /Encoding WinAnsiEncoding def
  currentdict
end
/Times-Bold exch definefont pop
/Times-BoldItalic findfont
dup length dict begin
  {1 index /FID ne {def} {pop pop} ifelse} forall
  /Encoding WinAnsiEncoding def
  currentdict
end
/Times-BoldItalic exch definefont pop
/Courier findfont
dup length dict begin
  {1 index /FID ne {def} {pop pop} ifelse} forall
  /Encoding WinAnsiEncoding def
  currentdict
end
/Courier exch definefont pop
%FOPEndFontReencode
%%EndProlog
%%Page: 1 1
%%PageBoundingBox: 0 0 198 283
%%BeginPageSetup
[1 0 0 -1 0 283] CT
%%EndPageSetup
GS
[1.00215 0 0 1 0 0] CT
1 GC
N
0 0 198 283 re
f
GR
GS
[1.00215 0 0 1 0 0] CT
1 GC
N
0 0 198 283 re
f
GR
GS
[1.00215 0 0 1 0 0] CT
1 GC
N
63.5 228 M
179 228 L
179 32 L
63.5 32 L
cp
f
GR
GS
[1.00215 0 0 1 0 0] CT
0.149 GC
2 setlinecap
1 LJ
0.5 LW
N
63.5 228 M
179 228 L
S
GR
GS
[1.00215 0 0 1 0 0] CT
0.149 GC
2 setlinecap
1 LJ
0.5 LW
N
98.15 228 M
98.15 226.04 L
S
GR
GS
[1.00215 0 0 1 0 0] CT
0.149 GC
2 setlinecap
1 LJ
0.5 LW
N
144.35 228 M
144.35 226.04 L
S
GR
GS
[1.00215 0 0 1 98.36078 234] CT
0.149 GC
/Helvetica 20 F
GS
[1 0 0 1 0 0] CT
-13 20 moveto 
1 -1 scale
(YA) t 
GR
GR
GS
[1.00215 0 0 1 144.66 234] CT
0.149 GC
/Helvetica 20 F
GS
[1 0 0 1 0 0] CT
-14.5 20 moveto 
1 -1 scale
(OA) t 
GR
GR
GS
[1.00215 0 0 1 121.51044 259] CT
0.149 GC
/Helvetica 20 F
GS
[1 0 0 1 0 0] CT
-49 20 moveto 
1 -1 scale
(Age Group) t 
GR
GR
GS
[1.00215 0 0 1 0 0] CT
0.149 GC
2 setlinecap
1 LJ
0.5 LW
N
63.5 228 M
63.5 32 L
S
GR
GS
[1.00215 0 0 1 0 0] CT
0.149 GC
2 setlinecap
1 LJ
0.5 LW
N
63.5 228 M
65.46 228 L
S
GR
GS
[1.00215 0 0 1 0 0] CT
0.149 GC
2 setlinecap
1 LJ
0.5 LW
N
63.5 162.667 M
65.46 162.667 L
S
GR
GS
[1.00215 0 0 1 0 0] CT
0.149 GC
2 setlinecap
1 LJ
0.5 LW
N
63.5 97.333 M
65.46 97.333 L
S
GR
GS
[1.00215 0 0 1 0 0] CT
0.149 GC
2 setlinecap
1 LJ
0.5 LW
N
63.5 32 M
65.46 32 L
S
GR
GS
[1.00215 0 0 1 57.62348 228] CT
0.149 GC
/Helvetica 20 F
GS
[1 0 0 1 0 0] CT
-31 7.5 moveto 
1 -1 scale
(-60) t 
GR
GR
GS
[1.00215 0 0 1 57.62348 162.66667] CT
0.149 GC
/Helvetica 20 F
GS
[1 0 0 1 0 0] CT
-31 7.5 moveto 
1 -1 scale
(-40) t 
GR
GR
GS
[1.00215 0 0 1 57.62348 97.33334] CT
0.149 GC
/Helvetica 20 F
GS
[1 0 0 1 0 0] CT
-31 7.5 moveto 
1 -1 scale
(-20) t 
GR
GR
GS
[1.00215 0 0 1 57.62348 32] CT
0.149 GC
/Helvetica 20 F
GS
[1 0 0 1 0 0] CT
-12 7.5 moveto 
1 -1 scale
(0) t 
GR
GR
GS
[0 -1 1.00215 0 24.05154 129.99991] CT
0.149 GC
/Helvetica 20 F
GS
[1 0 0 1 0 0] CT
-69 -5 moveto 
1 -1 scale
(prestimalpha l1) t 
GR
GR
GS
[1.00215 0 0 1 121.5105 29.25] CT
/Helvetica-Bold 22 F
GS
[1 0 0 1 0 0] CT
-58 -5 moveto 
1 -1 scale
(p = 3.0e-08) t 
GR
GR
GS
[1.00215 0 0 1 0 0] CT
0.149 GC
1 LJ
0.5 LW
N
63.5 32 M
179 32 L
S
GR
GS
[1.00215 0 0 1 0 0] CT
0.6 0.8 1 RC
N
79.67 32 M
79.67 165.704 L
116.63 165.704 L
116.63 32 L
cp
f
GR
GS
[1.00215 0 0 1 96.43742 151.15387] CT
0.302 GC
N
2.236 0 M
2.236 -1.235 1.235 -2.236 0 -2.236 C
-1.235 -2.236 -2.236 -1.235 -2.236 0 C
-2.236 1.235 -1.235 2.236 0 2.236 C
1.235 2.236 2.236 1.235 2.236 0 C
cp
f
GR
GS
[1.00215 0 0 1 91.32862 176.85425] CT
0.302 GC
N
/f-1586420743{2.236 0 M
2.236 -1.235 1.235 -2.236 0 -2.236 C
-1.235 -2.236 -2.236 -1.235 -2.236 0 C
-2.236 1.235 -1.235 2.236 0 2.236 C
1.235 2.236 2.236 1.235 2.236 0 C
cp}def
f-1586420743
f
GR
GS
[1.00215 0 0 1 92.14275 166.53151] CT
0.302 GC
N
f-1586420743
f
GR
GS
[1.00215 0 0 1 93.04997 162.44354] CT
0.302 GC
N
f-1586420743
f
GR
GS
[1.00215 0 0 1 92.07765 189.21951] CT
0.302 GC
N
f-1586420743
f
GR
GS
[1.00215 0 0 1 97.58303 178.96867] CT
0.302 GC
N
f-1586420743
f
GR
GS
[1.00215 0 0 1 96.19109 147.4129] CT
0.302 GC
N
f-1586420743
f
GR
GS
[1.00215 0 0 1 98.50208 183.11462] CT
0.302 GC
N
f-1586420743
f
GR
GS
[1.00215 0 0 1 105.1422 171.27943] CT
0.302 GC
N
f-1586420743
f
GR
GS
[1.00215 0 0 1 102.89219 165.56017] CT
0.302 GC
N
f-1586420743
f
GR
GS
[1.00215 0 0 1 91.40407 161.87654] CT
0.302 GC
N
f-1586420743
f
GR
GS
[1.00215 0 0 1 94.55579 169.25082] CT
0.302 GC
N
f-1586420743
f
GR
GS
[1.00215 0 0 1 96.64796 143.32619] CT
0.302 GC
N
f-1586420743
f
GR
GS
[1.00215 0 0 1 96.70534 174.21869] CT
0.302 GC
N
f-1586420743
f
GR
GS
[1.00215 0 0 1 92.17929 154.82693] CT
0.302 GC
N
f-1586420743
f
GR
GS
[1.00215 0 0 1 103.18839 176.72241] CT
0.302 GC
N
f-1586420743
f
GR
GS
[1.00215 0 0 1 103.93745 167.76483] CT
0.302 GC
N
f-1586420743
f
GR
GS
[1.00215 0 0 1 100.42446 145.55144] CT
0.302 GC
N
f-1586420743
f
GR
GS
[1.00215 0 0 1 96.0417 162.52184] CT
0.302 GC
N
f-1586420743
f
GR
GS
[1.00215 0 0 1 93.30219 161.25101] CT
0.302 GC
N
f-1586420743
f
GR
GS
[1.00215 0 0 1 91.24139 165.10666] CT
0.302 GC
N
f-1586420743
f
GR
GS
[1.00215 0 0 1 90.22534 167.97289] CT
0.302 GC
N
f-1586420743
f
GR
GS
[1.00215 0 0 1 103.97837 171.22] CT
0.302 GC
N
f-1586420743
f
GR
GS
[1.00215 0 0 1 89.74049 152.67488] CT
0.302 GC
N
f-1586420743
f
GR
GS
[1.00215 0 0 1 94.02215 163.69597] CT
0.302 GC
N
f-1586420743
f
GR
GS
[1.00215 0 0 1 94.03796 170.2411] CT
0.302 GC
N
f-1586420743
f
GR
GS
[1.00215 0 0 1 94.63773 171.94035] CT
0.302 GC
N
f-1586420743
f
GR
GS
[1.00215 0 0 1 105.24474 167.63846] CT
0.302 GC
N
f-1586420743
f
GR
GS
[1.00215 0 0 1 98.29235 158.57013] CT
0.302 GC
N
f-1586420743
f
GR
GS
[1.00215 0 0 1 93.03155 145.12329] CT
0.302 GC
N
f-1586420743
f
GR
GS
[1.00215 0 0 1 103.6728 165.96034] CT
0.302 GC
N
f-1586420743
f
GR
GS
[1.00215 0 0 1 98.52308 150.73013] CT
0.302 GC
N
f-1586420743
f
GR
GS
[1.00215 0 0 1 100.26709 169.20358] CT
0.302 GC
N
f-1586420743
f
GR
GS
[1.00215 0 0 1 98.6743 165.87701] CT
0.302 GC
N
f-1586420743
f
GR
GS
[1.00215 0 0 1 104.2617 154.61497] CT
0.302 GC
N
f-1586420743
f
GR
GS
[1.00215 0 0 1 100.18249 178.06483] CT
0.302 GC
N
f-1586420743
f
GR
GS
[1.00215 0 0 1 95.66423 172.88553] CT
0.302 GC
N
f-1586420743
f
GR
GS
[1.00215 0 0 1 92.74196 164.17096] CT
0.302 GC
N
f-1586420743
f
GR
GS
[1.00215 0 0 1 107.51138 178.98462] CT
0.302 GC
N
f-1586420743
f
GR
GS
[1.00215 0 0 1 106.20949 175.4272] CT
0.302 GC
N
f-1586420743
f
GR
GS
[1.00215 0 0 1 98.5399 164.26289] CT
0.302 GC
N
f-1586420743
f
GR
GS
[1.00215 0 0 1 91.74818 175.34106] CT
0.302 GC
N
f-1586420743
f
GR
GS
[1.00215 0 0 1 0 0] CT
0.6 0.8 1 RC
N
/f-775833796{125.87 32 M
125.87 179.944 L
162.83 179.944 L
162.83 32 L
cp}def
f-775833796
f
GR
GS
[1.00215 0 0 1 151.75843 181.82292] CT
0.302 GC
N
f-1586420743
f
GR
GS
[1.00215 0 0 1 150.39379 191.37204] CT
0.302 GC
N
f-1586420743
f
GR
GS
[1.00215 0 0 1 136.92822 175.40213] CT
0.302 GC
N
f-1586420743
f
GR
GS
[1.00215 0 0 1 146.35418 166.71422] CT
0.302 GC
N
f-1586420743
f
GR
GS
[1.00215 0 0 1 142.76112 175.32382] CT
0.302 GC
N
f-1586420743
f
GR
GS
[1.00215 0 0 1 151.85106 186.10541] CT
0.302 GC
N
f-1586420743
f
GR
GS
[1.00215 0 0 1 135.9884 197.09615] CT
0.302 GC
N
f-1586420743
f
GR
GS
[1.00215 0 0 1 145.82192 169.71964] CT
0.302 GC
N
f-1586420743
f
GR
GS
[1.00215 0 0 1 140.80993 179.99551] CT
0.302 GC
N
f-1586420743
f
GR
GS
[1.00215 0 0 1 151.12907 170.26108] CT
0.302 GC
N
f-1586420743
f
GR
GS
[1.00215 0 0 1 141.28708 185.54793] CT
0.302 GC
N
f-1586420743
f
GR
GS
[1.00215 0 0 1 139.39973 169.87277] CT
0.302 GC
N
f-1586420743
f
GR
GS
[1.00215 0 0 1 143.78356 202.89291] CT
0.302 GC
N
f-1586420743
f
GR
GS
[1.00215 0 0 1 150.35893 183.21185] CT
0.302 GC
N
f-1586420743
f
GR
GS
[1.00215 0 0 1 145.62544 204.28497] CT
0.302 GC
N
f-1586420743
f
GR
GS
[1.00215 0 0 1 149.42364 192.70467] CT
0.302 GC
N
f-1586420743
f
GR
GS
[1.00215 0 0 1 139.5828 193.99225] CT
0.302 GC
N
f-1586420743
f
GR
GS
[1.00215 0 0 1 138.01265 187.92143] CT
0.302 GC
N
f-1586420743
f
GR
GS
[1.00215 0 0 1 149.06872 193.49689] CT
0.302 GC
N
f-1586420743
f
GR
GS
[1.00215 0 0 1 145.7597 163.16826] CT
0.302 GC
N
f-1586420743
f
GR
GS
[1.00215 0 0 1 144.962 179.31009] CT
0.302 GC
N
f-1586420743
f
GR
GS
[1.00215 0 0 1 148.6013 173.47939] CT
0.302 GC
N
f-1586420743
f
GR
GS
[1.00215 0 0 1 139.49145 178.6898] CT
0.302 GC
N
f-1586420743
f
GR
GS
[1.00215 0 0 1 141.4299 169.4155] CT
0.302 GC
N
f-1586420743
f
GR
GS
[1.00215 0 0 1 138.68739 169.47954] CT
0.302 GC
N
f-1586420743
f
GR
GS
[1.00215 0 0 1 143.50475 181.33728] CT
0.302 GC
N
f-1586420743
f
GR
GS
[1.00215 0 0 1 143.81061 182.67641] CT
0.302 GC
N
f-1586420743
f
GR
GS
[1.00215 0 0 1 150.92677 188.19438] CT
0.302 GC
N
f-1586420743
f
GR
GS
[1.00215 0 0 1 137.20895 162.4259] CT
0.302 GC
N
f-1586420743
f
GR
GS
[1.00215 0 0 1 147.80808 190.29277] CT
0.302 GC
N
f-1586420743
f
GR
GS
[1.00215 0 0 1 140.6893 183.30403] CT
0.302 GC
N
f-1586420743
f
GR
GS
[1.00215 0 0 1 140.47326 170.57396] CT
0.302 GC
N
f-1586420743
f
GR
GS
[1.00215 0 0 1 135.83934 184.97147] CT
0.302 GC
N
f-1586420743
f
GR
GS
[1.00215 0 0 1 136.12679 170.40331] CT
0.302 GC
N
f-1586420743
f
GR
GS
[1.00215 0 0 1 143.08775 158.25223] CT
0.302 GC
N
f-1586420743
f
GR
GS
[1.00215 0 0 1 141.03119 173.31915] CT
0.302 GC
N
f-1586420743
f
GR
GS
[1.00215 0 0 1 150.91788 177.86462] CT
0.302 GC
N
f-1586420743
f
GR
GS
[1.00215 0 0 1 148.11358 166.52077] CT
0.302 GC
N
f-1586420743
f
GR
GS
[1.00215 0 0 1 153.44851 189.5545] CT
0.302 GC
N
f-1586420743
f
GR
GS
[1.00215 0 0 1 150.30241 176.42683] CT
0.302 GC
N
f-1586420743
f
GR
GS
[1.00215 0 0 1 135.77049 164.09798] CT
0.302 GC
N
f-1586420743
f
GR
GS
[1.00215 0 0 1 144.59048 176.87906] CT
0.302 GC
N
f-1586420743
f
GR
GS
[1.00215 0 0 1 150.03273 188.03522] CT
0.302 GC
N
f-1586420743
f
GR
GS
[1.00215 0 0 1 147.61547 167.59688] CT
0.302 GC
N
f-1586420743
f
GR
GS
[1.00215 0 0 1 151.14198 193.06157] CT
0.302 GC
N
f-1586420743
f
GR
GS
[1.00215 0 0 1 150.16872 207.53825] CT
0.302 GC
N
f-1586420743
f
GR
GS
[1.00215 0 0 1 147.24967 183.46866] CT
0.302 GC
N
f-1586420743
f
GR
GS
[1.00215 0 0 1 147.08331 193.22321] CT
0.302 GC
N
f-1586420743
f
GR
GS
[1.00215 0 0 1 148.95073 168.83484] CT
0.302 GC
N
f-1586420743
f
GR
GS
[1.00215 0 0 1 147.9613 178.59634] CT
0.302 GC
N
f-1586420743
f
GR
GS
[1.00215 0 0 1 137.50339 163.34517] CT
0.302 GC
N
f-1586420743
f
GR
GS
[1.00215 0 0 1 150.26033 161.16599] CT
0.302 GC
N
f-1586420743
f
GR
GS
[1.00215 0 0 1 141.80557 193.78622] CT
0.302 GC
N
f-1586420743
f
GR
%%Trailer
%%Pages: 1
%%EOF
