%!PS-Adobe-3.0 EPSF-3.0
%%Creator: (MATLAB, The Mathworks, Inc. Version 9.8.0.1323502 \(R2020a\). Operating System: Mac OS X)
%%Title: /Users/kosciessa/Desktop/mntTardisLNDG/LNDG/stateswitch/stsw_multimodal/figures/correlations/f_drift-mod_stroop-rt.eps
%%CreationDate: 2022-03-11T15:06:23
%%Pages: (atend)
%%BoundingBox:    -4     0   280   194
%%LanguageLevel: 3
%%EndComments
%%BeginProlog
%%BeginResource: procset (Apache XML Graphics Std ProcSet) 1.2 0
%%Version: 1.2 0
%%Copyright: (Copyright 2001-2003,2010 The Apache Software Foundation. License terms: http://www.apache.org/licenses/LICENSE-2.0)
/bd{bind def}bind def
/ld{load def}bd
/GR/grestore ld
/GS/gsave ld
/RM/rmoveto ld
/C/curveto ld
/t/show ld
/L/lineto ld
/ML/setmiterlimit ld
/CT/concat ld
/f/fill ld
/N/newpath ld
/S/stroke ld
/CC/setcmykcolor ld
/A/ashow ld
/cp/closepath ld
/RC/setrgbcolor ld
/LJ/setlinejoin ld
/GC/setgray ld
/LW/setlinewidth ld
/M/moveto ld
/re {4 2 roll M
1 index 0 rlineto
0 exch rlineto
neg 0 rlineto
cp } bd
/_ctm matrix def
/_tm matrix def
/BT { _ctm currentmatrix pop matrix _tm copy pop 0 0 moveto } bd
/ET { _ctm setmatrix } bd
/iTm { _ctm setmatrix _tm concat } bd
/Tm { _tm astore pop iTm 0 0 moveto } bd
/ux 0.0 def
/uy 0.0 def
/F {
  /Tp exch def
  /Tf exch def
  Tf findfont Tp scalefont setfont
  /cf Tf def  /cs Tp def
} bd
/ULS {currentpoint /uy exch def /ux exch def} bd
/ULE {
  /Tcx currentpoint pop def
  gsave
  newpath
  cf findfont cs scalefont dup
  /FontMatrix get 0 get /Ts exch def /FontInfo get dup
  /UnderlinePosition get Ts mul /To exch def
  /UnderlineThickness get Ts mul /Tt exch def
  ux uy To add moveto  Tcx uy To add lineto
  Tt setlinewidth stroke
  grestore
} bd
/OLE {
  /Tcx currentpoint pop def
  gsave
  newpath
  cf findfont cs scalefont dup
  /FontMatrix get 0 get /Ts exch def /FontInfo get dup
  /UnderlinePosition get Ts mul /To exch def
  /UnderlineThickness get Ts mul /Tt exch def
  ux uy To add cs add moveto Tcx uy To add cs add lineto
  Tt setlinewidth stroke
  grestore
} bd
/SOE {
  /Tcx currentpoint pop def
  gsave
  newpath
  cf findfont cs scalefont dup
  /FontMatrix get 0 get /Ts exch def /FontInfo get dup
  /UnderlinePosition get Ts mul /To exch def
  /UnderlineThickness get Ts mul /Tt exch def
  ux uy To add cs 10 mul 26 idiv add moveto Tcx uy To add cs 10 mul 26 idiv add lineto
  Tt setlinewidth stroke
  grestore
} bd
/QT {
/Y22 exch store
/X22 exch store
/Y21 exch store
/X21 exch store
currentpoint
/Y21 load 2 mul add 3 div exch
/X21 load 2 mul add 3 div exch
/X21 load 2 mul /X22 load add 3 div
/Y21 load 2 mul /Y22 load add 3 div
/X22 load /Y22 load curveto
} bd
/SSPD {
dup length /d exch dict def
{
/v exch def
/k exch def
currentpagedevice k known {
/cpdv currentpagedevice k get def
v cpdv ne {
/upd false def
/nullv v type /nulltype eq def
/nullcpdv cpdv type /nulltype eq def
nullv nullcpdv or
{
/upd true def
} {
/sametype v type cpdv type eq def
sametype {
v type /arraytype eq {
/vlen v length def
/cpdvlen cpdv length def
vlen cpdvlen eq {
0 1 vlen 1 sub {
/i exch def
/obj v i get def
/cpdobj cpdv i get def
obj cpdobj ne {
/upd true def
exit
} if
} for
} {
/upd true def
} ifelse
} {
v type /dicttype eq {
v {
/dv exch def
/dk exch def
/cpddv cpdv dk get def
dv cpddv ne {
/upd true def
exit
} if
} forall
} {
/upd true def
} ifelse
} ifelse
} if
} ifelse
upd true eq {
d k v put
} if
} if
} if
} forall
d length 0 gt {
d setpagedevice
} if
} bd
/RE { % /NewFontName [NewEncodingArray] /FontName RE -
  findfont dup length dict begin
  {
    1 index /FID ne
    {def} {pop pop} ifelse
  } forall
  /Encoding exch def
  /FontName 1 index def
  currentdict definefont pop
  end
} bind def
%%EndResource
%%BeginResource: procset (Apache XML Graphics EPS ProcSet) 1.0 0
%%Version: 1.0 0
%%Copyright: (Copyright 2002-2003 The Apache Software Foundation. License terms: http://www.apache.org/licenses/LICENSE-2.0)
/BeginEPSF { %def
/b4_Inc_state save def         % Save state for cleanup
/dict_count countdictstack def % Count objects on dict stack
/op_count count 1 sub def      % Count objects on operand stack
userdict begin                 % Push userdict on dict stack
/showpage { } def              % Redefine showpage, { } = null proc
0 setgray 0 setlinecap         % Prepare graphics state
1 setlinewidth 0 setlinejoin
10 setmiterlimit [ ] 0 setdash newpath
/languagelevel where           % If level not equal to 1 then
{pop languagelevel             % set strokeadjust and
1 ne                           % overprint to their defaults.
{false setstrokeadjust false setoverprint
} if
} if
} bd
/EndEPSF { %def
count op_count sub {pop} repeat            % Clean up stacks
countdictstack dict_count sub {end} repeat
b4_Inc_state restore
} bd
%%EndResource
%FOPBeginFontDict
%%IncludeResource: font Courier-Oblique
%%IncludeResource: font Courier-BoldOblique
%%IncludeResource: font Courier-Bold
%%IncludeResource: font ZapfDingbats
%%IncludeResource: font Symbol
%%IncludeResource: font Helvetica
%%IncludeResource: font Helvetica-Oblique
%%IncludeResource: font Helvetica-Bold
%%IncludeResource: font Helvetica-BoldOblique
%%IncludeResource: font Times-Roman
%%IncludeResource: font Times-Italic
%%IncludeResource: font Times-Bold
%%IncludeResource: font Times-BoldItalic
%%IncludeResource: font Courier
%FOPEndFontDict
%%BeginResource: encoding WinAnsiEncoding
/WinAnsiEncoding [
/.notdef /.notdef /.notdef /.notdef /.notdef
/.notdef /.notdef /.notdef /.notdef /.notdef
/.notdef /.notdef /.notdef /.notdef /.notdef
/.notdef /.notdef /.notdef /.notdef /.notdef
/.notdef /.notdef /.notdef /.notdef /.notdef
/.notdef /.notdef /.notdef /.notdef /.notdef
/.notdef /.notdef /space /exclam /quotedbl
/numbersign /dollar /percent /ampersand /quotesingle
/parenleft /parenright /asterisk /plus /comma
/hyphen /period /slash /zero /one
/two /three /four /five /six
/seven /eight /nine /colon /semicolon
/less /equal /greater /question /at
/A /B /C /D /E
/F /G /H /I /J
/K /L /M /N /O
/P /Q /R /S /T
/U /V /W /X /Y
/Z /bracketleft /backslash /bracketright /asciicircum
/underscore /quoteleft /a /b /c
/d /e /f /g /h
/i /j /k /l /m
/n /o /p /q /r
/s /t /u /v /w
/x /y /z /braceleft /bar
/braceright /asciitilde /bullet /Euro /bullet
/quotesinglbase /florin /quotedblbase /ellipsis /dagger
/daggerdbl /circumflex /perthousand /Scaron /guilsinglleft
/OE /bullet /Zcaron /bullet /bullet
/quoteleft /quoteright /quotedblleft /quotedblright /bullet
/endash /emdash /asciitilde /trademark /scaron
/guilsinglright /oe /bullet /zcaron /Ydieresis
/space /exclamdown /cent /sterling /currency
/yen /brokenbar /section /dieresis /copyright
/ordfeminine /guillemotleft /logicalnot /sfthyphen /registered
/macron /degree /plusminus /twosuperior /threesuperior
/acute /mu /paragraph /middot /cedilla
/onesuperior /ordmasculine /guillemotright /onequarter /onehalf
/threequarters /questiondown /Agrave /Aacute /Acircumflex
/Atilde /Adieresis /Aring /AE /Ccedilla
/Egrave /Eacute /Ecircumflex /Edieresis /Igrave
/Iacute /Icircumflex /Idieresis /Eth /Ntilde
/Ograve /Oacute /Ocircumflex /Otilde /Odieresis
/multiply /Oslash /Ugrave /Uacute /Ucircumflex
/Udieresis /Yacute /Thorn /germandbls /agrave
/aacute /acircumflex /atilde /adieresis /aring
/ae /ccedilla /egrave /eacute /ecircumflex
/edieresis /igrave /iacute /icircumflex /idieresis
/eth /ntilde /ograve /oacute /ocircumflex
/otilde /odieresis /divide /oslash /ugrave
/uacute /ucircumflex /udieresis /yacute /thorn
/ydieresis
] def
%%EndResource
%FOPBeginFontReencode
/Courier-Oblique findfont
dup length dict begin
  {1 index /FID ne {def} {pop pop} ifelse} forall
  /Encoding WinAnsiEncoding def
  currentdict
end
/Courier-Oblique exch definefont pop
/Courier-BoldOblique findfont
dup length dict begin
  {1 index /FID ne {def} {pop pop} ifelse} forall
  /Encoding WinAnsiEncoding def
  currentdict
end
/Courier-BoldOblique exch definefont pop
/Courier-Bold findfont
dup length dict begin
  {1 index /FID ne {def} {pop pop} ifelse} forall
  /Encoding WinAnsiEncoding def
  currentdict
end
/Courier-Bold exch definefont pop
/Helvetica findfont
dup length dict begin
  {1 index /FID ne {def} {pop pop} ifelse} forall
  /Encoding WinAnsiEncoding def
  currentdict
end
/Helvetica exch definefont pop
/Helvetica-Oblique findfont
dup length dict begin
  {1 index /FID ne {def} {pop pop} ifelse} forall
  /Encoding WinAnsiEncoding def
  currentdict
end
/Helvetica-Oblique exch definefont pop
/Helvetica-Bold findfont
dup length dict begin
  {1 index /FID ne {def} {pop pop} ifelse} forall
  /Encoding WinAnsiEncoding def
  currentdict
end
/Helvetica-Bold exch definefont pop
/Helvetica-BoldOblique findfont
dup length dict begin
  {1 index /FID ne {def} {pop pop} ifelse} forall
  /Encoding WinAnsiEncoding def
  currentdict
end
/Helvetica-BoldOblique exch definefont pop
/Times-Roman findfont
dup length dict begin
  {1 index /FID ne {def} {pop pop} ifelse} forall
  /Encoding WinAnsiEncoding def
  currentdict
end
/Times-Roman exch definefont pop
/Times-Italic findfont
dup length dict begin
  {1 index /FID ne {def} {pop pop} ifelse} forall
  /Encoding WinAnsiEncoding def
  currentdict
end
/Times-Italic exch definefont pop
/Times-Bold findfont
dup length dict begin
  {1 index /FID ne {def} {pop pop} ifelse} forall
  /Encoding WinAnsiEncoding def
  currentdict
end
/Times-Bold exch definefont pop
/Times-BoldItalic findfont
dup length dict begin
  {1 index /FID ne {def} {pop pop} ifelse} forall
  /Encoding WinAnsiEncoding def
  currentdict
end
/Times-BoldItalic exch definefont pop
/Courier findfont
dup length dict begin
  {1 index /FID ne {def} {pop pop} ifelse} forall
  /Encoding WinAnsiEncoding def
  currentdict
end
/Courier exch definefont pop
%FOPEndFontReencode
%%EndProlog
%%Page: 1 1
%%PageBoundingBox: 0 0 227 198
%%BeginPageSetup
[1 0 0 -1 0 198] CT
%%EndPageSetup
GS
[0.99899 0 0 1.00215 0 -0.4252] CT
N
0 0 M
227 0 L
227 198 L
0 198 L
0 0 L
cp
clip
1 GC
N
0 0 227 198 re
f
GR
GS
[0.99899 0 0 1.00215 0 -0.4252] CT
1 GC
N
0 0 227 198 re
f
GR
GS
[0.99899 0 0 1.00215 0 -0.4252] CT
0.2 GC
N
66.5 160 M
205.5 160 L
205.5 21 L
66.5 21 L
cp
f
GR
GS
[0.99899 0 0 1.00215 0 -0.4252] CT
0.149 GC
2 setlinecap
1 LJ
0.5 LW
N
66.5 160 M
205.5 160 L
S
GR
GS
[0.99899 0 0 1.00215 0 -0.4252] CT
0.149 GC
2 setlinecap
1 LJ
0.5 LW
N
83.875 160 M
83.875 158.61 L
S
GR
GS
[0.99899 0 0 1.00215 0 -0.4252] CT
0.149 GC
2 setlinecap
1 LJ
0.5 LW
N
170.75 160 M
170.75 158.61 L
S
GR
GS
[0.99899 0 0 1.00215 83.79063 164.72871] CT
0.149 GC
/Helvetica 14 F
GS
[1 0 0 1 0 0] CT
-10 14 moveto 
1 -1 scale
(1.5) t 
GR
GR
GS
[0.99899 0 0 1.00215 170.57824 164.72871] CT
0.149 GC
/Helvetica 14 F
GS
[1 0 0 1 0 0] CT
-4 14 moveto 
1 -1 scale
(2) t 
GR
GR
GS
[0.99899 0 0 1.00215 135.86327 182.26629] CT
0.149 GC
/Helvetica 14 F
GS
[1 0 0 1 0 0] CT
-27 14 moveto 
1 -1 scale
(stroop rt) t 
GR
GR
GS
[0.99899 0 0 1.00215 0 -0.4252] CT
0.149 GC
2 setlinecap
1 LJ
0.5 LW
N
66.5 160 M
66.5 21 L
S
GR
GS
[0.99899 0 0 1.00215 0 -0.4252] CT
0.149 GC
2 setlinecap
1 LJ
0.5 LW
N
66.5 152.378 M
67.89 152.378 L
S
GR
GS
[0.99899 0 0 1.00215 0 -0.4252] CT
0.149 GC
2 setlinecap
1 LJ
0.5 LW
N
66.5 112.552 M
67.89 112.552 L
S
GR
GS
[0.99899 0 0 1.00215 0 -0.4252] CT
0.149 GC
2 setlinecap
1 LJ
0.5 LW
N
66.5 72.727 M
67.89 72.727 L
S
GR
GS
[0.99899 0 0 1.00215 0 -0.4252] CT
0.149 GC
2 setlinecap
1 LJ
0.5 LW
N
66.5 32.901 M
67.89 32.901 L
S
GR
GS
[0.99899 0 0 1.00215 61.63793 152.28019] CT
0.149 GC
/Helvetica 14 F
GS
[1 0 0 1 0 0] CT
-25 5.5 moveto 
1 -1 scale
(-0.6) t 
GR
GR
GS
[0.99899 0 0 1.00215 61.63793 112.36891] CT
0.149 GC
/Helvetica 14 F
GS
[1 0 0 1 0 0] CT
-25 5.5 moveto 
1 -1 scale
(-0.4) t 
GR
GR
GS
[0.99899 0 0 1.00215 61.63793 72.45763] CT
0.149 GC
/Helvetica 14 F
GS
[1 0 0 1 0 0] CT
-25 5.5 moveto 
1 -1 scale
(-0.2) t 
GR
GR
GS
[0.99899 0 0 1.00215 61.63793 32.54636] CT
0.149 GC
/Helvetica 14 F
GS
[1 0 0 1 0 0] CT
-8 5.5 moveto 
1 -1 scale
(0) t 
GR
GR
GS
[0 -1.00215 0.99899 0 33.6661 90.26908] CT
0.149 GC
/Helvetica 14 F
GS
[1 0 0 1 0 0] CT
-26.5 -20 moveto 
1 -1 scale
(drift rate) t 
GR
GR
GS
[0 -1.00215 0.99899 0 33.6661 90.26908] CT
0.149 GC
/Helvetica 14 F
GS
[1 0 0 1 0 0] CT
-39 -3 moveto 
1 -1 scale
(\(linear mod.\)) t 
GR
GR
GS
[0.99899 0 0 1.00215 135.86333 18.86614] CT
/Helvetica-Bold 14 F
GS
[1 0 0 1 0 0] CT
-141 -4 moveto 
1 -1 scale
(r\(93\) = 0.56, 95%CI = [0.4,0.68], p = 3.9e-09) t 
GR
GR
GS
[0.99899 0 0 1.00215 128.10741 107.11508] CT
0.502 0.702 0.8 RC
N
0.5 0 M
0.5 -0.276 0.276 -0.5 0 -0.5 C
-0.276 -0.5 -0.5 -0.276 -0.5 0 C
-0.5 0.276 -0.276 0.5 0 0.5 C
0.276 0.5 0.5 0.276 0.5 0 C
cp
f
GR
GS
[0.99899 0 0 1.00215 108.35487 104.06548] CT
0.502 0.702 0.8 RC
N
/f-2105962265{0.5 0 M
0.5 -0.276 0.276 -0.5 0 -0.5 C
-0.276 -0.5 -0.5 -0.276 -0.5 0 C
-0.5 0.276 -0.276 0.5 0 0.5 C
0.276 0.5 0.5 0.276 0.5 0 C
cp}def
f-2105962265
f
GR
GS
[0.99899 0 0 1.00215 103.45067 78.11847] CT
0.502 0.702 0.8 RC
N
f-2105962265
f
GR
GS
[0.99899 0 0 1.00215 98.35756 73.09046] CT
0.502 0.702 0.8 RC
N
f-2105962265
f
GR
GS
[0.99899 0 0 1.00215 138.18738 62.86788] CT
0.502 0.702 0.8 RC
N
f-2105962265
f
GR
GS
[0.99899 0 0 1.00215 117.28749 108.67793] CT
0.502 0.702 0.8 RC
N
f-2105962265
f
GR
GS
[0.99899 0 0 1.00215 118.35217 103.9629] CT
0.502 0.702 0.8 RC
N
f-2105962265
f
GR
GS
[0.99899 0 0 1.00215 96.54702 126.82532] CT
0.502 0.702 0.8 RC
N
f-2105962265
f
GR
GS
[0.99899 0 0 1.00215 113.66839 41.25063] CT
0.502 0.702 0.8 RC
N
f-2105962265
f
GR
GS
[0.99899 0 0 1.00215 123.34294 80.99083] CT
0.502 0.702 0.8 RC
N
f-2105962265
f
GR
GS
[0.99899 0 0 1.00215 117.79523 85.553] CT
0.502 0.702 0.8 RC
N
f-2105962265
f
GR
GS
[0.99899 0 0 1.00215 128.34946 101.79417] CT
0.502 0.702 0.8 RC
N
f-2105962265
f
GR
GS
[0.99899 0 0 1.00215 86.8036 62.75294] CT
0.502 0.702 0.8 RC
N
f-2105962265
f
GR
GS
[0.99899 0 0 1.00215 89.2675 81.48734] CT
0.502 0.702 0.8 RC
N
f-2105962265
f
GR
GS
[0.99899 0 0 1.00215 108.35487 99.35544] CT
0.502 0.702 0.8 RC
N
f-2105962265
f
GR
GS
[0.99899 0 0 1.00215 148.52513 67.37804] CT
0.502 0.702 0.8 RC
N
f-2105962265
f
GR
GS
[0.99899 0 0 1.00215 123.19338 91.49415] CT
0.502 0.702 0.8 RC
N
f-2105962265
f
GR
GS
[0.99899 0 0 1.00215 133.34812 110.28322] CT
0.502 0.702 0.8 RC
N
f-2105962265
f
GR
GS
[0.99899 0 0 1.00215 78.55582 112.94886] CT
0.502 0.702 0.8 RC
N
f-2105962265
f
GR
GS
[0.99899 0 0 1.00215 103.45067 109.22847] CT
0.502 0.702 0.8 RC
N
f-2105962265
f
GR
GS
[0.99899 0 0 1.00215 84.64472 145.98864] CT
0.502 0.702 0.8 RC
N
f-2105962265
f
GR
GS
[0.99899 0 0 1.00215 108.44146 102.24834] CT
0.502 0.702 0.8 RC
N
f-2105962265
f
GR
GS
[0.99899 0 0 1.00215 98.45203 64.26525] CT
0.502 0.702 0.8 RC
N
f-2105962265
f
GR
GS
[0.99899 0 0 1.00215 83.20811 148.31019] CT
0.502 0.702 0.8 RC
N
f-2105962265
f
GR
GS
[0.99899 0 0 1.00215 110.29332 121.85233] CT
0.502 0.702 0.8 RC
N
f-2105962265
f
GR
GS
[0.99899 0 0 1.00215 99.54622 144.48602] CT
0.502 0.702 0.8 RC
N
f-2105962265
f
GR
GS
[0.99899 0 0 1.00215 84.83759 79.18839] CT
0.502 0.702 0.8 RC
N
f-2105962265
f
GR
GS
[0.99899 0 0 1.00215 125.53527 146.54009] CT
0.502 0.702 0.8 RC
N
f-2105962265
f
GR
GS
[0.99899 0 0 1.00215 122.03621 105.49539] CT
0.502 0.702 0.8 RC
N
f-2105962265
f
GR
GS
[0.99899 0 0 1.00215 118.44466 115.38172] CT
0.502 0.702 0.8 RC
N
f-2105962265
f
GR
GS
[0.99899 0 0 1.00215 104.01943 80.27169] CT
0.502 0.702 0.8 RC
N
f-2105962265
f
GR
GS
[0.99899 0 0 1.00215 85.304 141.86547] CT
0.502 0.702 0.8 RC
N
f-2105962265
f
GR
GS
[0.99899 0 0 1.00215 93.54784 134.82191] CT
0.502 0.702 0.8 RC
N
f-2105962265
f
GR
GS
[0.99899 0 0 1.00215 108.4454 111.04599] CT
0.502 0.702 0.8 RC
N
f-2105962265
f
GR
GS
[0.99899 0 0 1.00215 88.55313 131.13577] CT
0.502 0.702 0.8 RC
N
f-2105962265
f
GR
GS
[0.99899 0 0 1.00215 100.04609 139.72877] CT
0.502 0.702 0.8 RC
N
f-2105962265
f
GR
GS
[0.99899 0 0 1.00215 100.54594 105.41361] CT
0.502 0.702 0.8 RC
N
f-2105962265
f
GR
GS
[0.99899 0 0 1.00215 78.95926 140.7087] CT
0.502 0.702 0.8 RC
N
f-2105962265
f
GR
GS
[0.99899 0 0 1.00215 115.03811 75.43784] CT
0.502 0.702 0.8 RC
N
f-2105962265
f
GR
GS
[0.99899 0 0 1.00215 100.79587 111.7481] CT
0.502 0.702 0.8 RC
N
f-2105962265
f
GR
GS
[0.99899 0 0 1.00215 118.0373 94.62376] CT
0.502 0.702 0.8 RC
N
f-2105962265
f
GR
GS
[0.99899 0 0 1.00215 108.69927 97.08903] CT
0.502 0.702 0.8 RC
N
f-2105962265
f
GR
GS
[0.99899 0 0 1.00215 162.6788 70.34254] CT
0.502 0.702 0.8 RC
N
f-2105962265
f
GR
GS
[0.99899 0 0 1.00215 157.2039 84.87821] CT
0.502 0.702 0.8 RC
N
f-2105962265
f
GR
GS
[0.99899 0 0 1.00215 108.35487 67.61624] CT
0.502 0.702 0.8 RC
N
f-2105962265
f
GR
GS
[0.99899 0 0 1.00215 191.11205 41.57787] CT
0.502 0.702 0.8 RC
N
f-2105962265
f
GR
GS
[0.99899 0 0 1.00215 133.34812 94.78985] CT
0.502 0.702 0.8 RC
N
f-2105962265
f
GR
GS
[0.99899 0 0 1.00215 159.01836 62.07361] CT
0.502 0.702 0.8 RC
N
f-2105962265
f
GR
GS
[0.99899 0 0 1.00215 147.77533 86.40482] CT
0.502 0.702 0.8 RC
N
f-2105962265
f
GR
GS
[0.99899 0 0 1.00215 133.43865 73.73609] CT
0.502 0.702 0.8 RC
N
f-2105962265
f
GR
GS
[0.99899 0 0 1.00215 128.26486 77.53155] CT
0.502 0.702 0.8 RC
N
f-2105962265
f
GR
GS
[0.99899 0 0 1.00215 145.02609 75.94659] CT
0.502 0.702 0.8 RC
N
f-2105962265
f
GR
GS
[0.99899 0 0 1.00215 93.35892 83.6233] CT
0.502 0.702 0.8 RC
N
f-2105962265
f
GR
GS
[0.99899 0 0 1.00215 168.67718 58.21979] CT
0.502 0.702 0.8 RC
N
f-2105962265
f
GR
GS
[0.99899 0 0 1.00215 133.34812 113.95691] CT
0.502 0.702 0.8 RC
N
f-2105962265
f
GR
GS
[0.99899 0 0 1.00215 143.34543 82.08654] CT
0.502 0.702 0.8 RC
N
f-2105962265
f
GR
GS
[0.99899 0 0 1.00215 138.52784 72.88412] CT
0.502 0.702 0.8 RC
N
f-2105962265
f
GR
GS
[0.99899 0 0 1.00215 118.35217 101.74534] CT
0.502 0.702 0.8 RC
N
f-2105962265
f
GR
GS
[0.99899 0 0 1.00215 138.34678 73.2036] CT
0.502 0.702 0.8 RC
N
f-2105962265
f
GR
GS
[0.99899 0 0 1.00215 148.34408 74.85735] CT
0.502 0.702 0.8 RC
N
f-2105962265
f
GR
GS
[0.99899 0 0 1.00215 124.28562 61.55546] CT
0.502 0.702 0.8 RC
N
f-2105962265
f
GR
GS
[0.99899 0 0 1.00215 129.03431 38.76735] CT
0.502 0.702 0.8 RC
N
f-2105962265
f
GR
GS
[0.99899 0 0 1.00215 139.02375 69.83841] CT
0.502 0.702 0.8 RC
N
f-2105962265
f
GR
GS
[0.99899 0 0 1.00215 118.35217 76.31807] CT
0.502 0.702 0.8 RC
N
f-2105962265
f
GR
GS
[0.99899 0 0 1.00215 138.34678 64.29003] CT
0.502 0.702 0.8 RC
N
f-2105962265
f
GR
GS
[0.99899 0 0 1.00215 118.6946 54.60341] CT
0.502 0.702 0.8 RC
N
f-2105962265
f
GR
GS
[0.99899 0 0 1.00215 148.34408 65.58821] CT
0.502 0.702 0.8 RC
N
f-2105962265
f
GR
GS
[0.99899 0 0 1.00215 143.93385 82.79914] CT
0.502 0.702 0.8 RC
N
f-2105962265
f
GR
GS
[0.99899 0 0 1.00215 122.28615 97.03913] CT
0.502 0.702 0.8 RC
N
f-2105962265
f
GR
GS
[0.99899 0 0 1.00215 140.77722 71.54002] CT
0.502 0.702 0.8 RC
N
f-2105962265
f
GR
GS
[0.99899 0 0 1.00215 131.39786 96.29747] CT
0.502 0.702 0.8 RC
N
f-2105962265
f
GR
GS
[0.99899 0 0 1.00215 149.52487 98.20019] CT
0.502 0.702 0.8 RC
N
f-2105962265
f
GR
GS
[0.99899 0 0 1.00215 153.34272 52.81326] CT
0.502 0.702 0.8 RC
N
f-2105962265
f
GR
GS
[0.99899 0 0 1.00215 143.34543 92.76194] CT
0.502 0.702 0.8 RC
N
f-2105962265
f
GR
GS
[0.99899 0 0 1.00215 113.35351 54.30058] CT
0.502 0.702 0.8 RC
N
f-2105962265
f
GR
GS
[0.99899 0 0 1.00215 145.52593 75.82255] CT
0.502 0.702 0.8 RC
N
f-2105962265
f
GR
GS
[0.99899 0 0 1.00215 143.34543 69.04189] CT
0.502 0.702 0.8 RC
N
f-2105962265
f
GR
GS
[0.99899 0 0 1.00215 114.53824 59.87225] CT
0.502 0.702 0.8 RC
N
f-2105962265
f
GR
GS
[0.99899 0 0 1.00215 113.45389 48.49932] CT
0.502 0.702 0.8 RC
N
f-2105962265
f
GR
GS
[0.99899 0 0 1.00215 124.78546 67.0416] CT
0.502 0.702 0.8 RC
N
f-2105962265
f
GR
GS
[0.99899 0 0 1.00215 168.42725 72.11679] CT
0.502 0.702 0.8 RC
N
f-2105962265
f
GR
GS
[0.99899 0 0 1.00215 152.43156 79.05063] CT
0.502 0.702 0.8 RC
N
f-2105962265
f
GR
GS
[0.99899 0 0 1.00215 174.51025 32.2281] CT
0.502 0.702 0.8 RC
N
f-2105962265
f
GR
GS
[0.99899 0 0 1.00215 150.27269 55.09117] CT
0.502 0.702 0.8 RC
N
f-2105962265
f
GR
GS
[0.99899 0 0 1.00215 128.34946 80.40349] CT
0.502 0.702 0.8 RC
N
f-2105962265
f
GR
GS
[0.99899 0 0 1.00215 142.02689 77.02266] CT
0.502 0.702 0.8 RC
N
f-2105962265
f
GR
GS
[0.99899 0 0 1.00215 138.34678 64.7926] CT
0.502 0.702 0.8 RC
N
f-2105962265
f
GR
GS
[0.99899 0 0 1.00215 123.53581 70.07562] CT
0.502 0.702 0.8 RC
N
f-2105962265
f
GR
GS
[0.99899 0 0 1.00215 114.53824 73.50389] CT
0.502 0.702 0.8 RC
N
f-2105962265
f
GR
GS
[0.99899 0 0 1.00215 139.0277 76.24723] CT
0.502 0.702 0.8 RC
N
f-2105962265
f
GR
GS
[0.99899 0 0 1.00215 108.35487 92.21009] CT
0.502 0.702 0.8 RC
N
f-2105962265
f
GR
GS
[0.99899 0 0 1.00215 129.53419 59.79167] CT
0.502 0.702 0.8 RC
N
f-2105962265
f
GR
GS
[0.99899 0 0 1.00215 89.86182 94.92008] CT
0.502 0.702 0.8 RC
N
f-2105962265
f
GR
GS
[0.99899 0 0 1.00215 178.336 55.29448] CT
0.502 0.702 0.8 RC
N
f-2105962265
f
GR
GS
[0.99899 0 0 1.00215 125.53527 55.83667] CT
0.502 0.702 0.8 RC
N
f-2105962265
f
GR
GS
[0.99899 0 0 1.00215 0 -0.4252] CT
0.6 0.8 0.902 RC
1 LJ
3 LW
N
66.5 122.067 M
205.5 35.659 L
S
GR
GS
[0.99899 0 0 1.00215 128.10741 107.11508] CT
0.702 0.898 1 RC
N
/f227889816{-3 -3 M
-3 3 L
3 3 L
3 -3 L
cp}def
f227889816
f
GR
GS
[0.99899 0 0 1.00215 108.35487 104.06548] CT
0.702 0.898 1 RC
N
f227889816
f
GR
GS
[0.99899 0 0 1.00215 103.45067 78.11847] CT
0.702 0.898 1 RC
N
f227889816
f
GR
GS
[0.99899 0 0 1.00215 98.35756 73.09046] CT
0.702 0.898 1 RC
N
f227889816
f
GR
GS
[0.99899 0 0 1.00215 138.18738 62.86788] CT
0.702 0.898 1 RC
N
f227889816
f
GR
GS
[0.99899 0 0 1.00215 117.28749 108.67793] CT
0.702 0.898 1 RC
N
f227889816
f
GR
GS
[0.99899 0 0 1.00215 118.35217 103.9629] CT
0.702 0.898 1 RC
N
f227889816
f
GR
GS
[0.99899 0 0 1.00215 96.54702 126.82532] CT
0.702 0.898 1 RC
N
f227889816
f
GR
GS
[0.99899 0 0 1.00215 113.66839 41.25063] CT
0.702 0.898 1 RC
N
f227889816
f
GR
GS
[0.99899 0 0 1.00215 123.34294 80.99083] CT
0.702 0.898 1 RC
N
f227889816
f
GR
GS
[0.99899 0 0 1.00215 117.79523 85.553] CT
0.702 0.898 1 RC
N
f227889816
f
GR
GS
[0.99899 0 0 1.00215 128.34946 101.79417] CT
0.702 0.898 1 RC
N
f227889816
f
GR
GS
[0.99899 0 0 1.00215 86.8036 62.75294] CT
0.702 0.898 1 RC
N
f227889816
f
GR
GS
[0.99899 0 0 1.00215 89.2675 81.48734] CT
0.702 0.898 1 RC
N
f227889816
f
GR
GS
[0.99899 0 0 1.00215 108.35487 99.35544] CT
0.702 0.898 1 RC
N
f227889816
f
GR
GS
[0.99899 0 0 1.00215 148.52513 67.37804] CT
0.702 0.898 1 RC
N
f227889816
f
GR
GS
[0.99899 0 0 1.00215 123.19338 91.49415] CT
0.702 0.898 1 RC
N
f227889816
f
GR
GS
[0.99899 0 0 1.00215 133.34812 110.28322] CT
0.702 0.898 1 RC
N
f227889816
f
GR
GS
[0.99899 0 0 1.00215 78.55582 112.94886] CT
0.702 0.898 1 RC
N
f227889816
f
GR
GS
[0.99899 0 0 1.00215 103.45067 109.22847] CT
0.702 0.898 1 RC
N
f227889816
f
GR
GS
[0.99899 0 0 1.00215 84.64472 145.98864] CT
0.702 0.898 1 RC
N
f227889816
f
GR
GS
[0.99899 0 0 1.00215 108.44146 102.24834] CT
0.702 0.898 1 RC
N
f227889816
f
GR
GS
[0.99899 0 0 1.00215 98.45203 64.26525] CT
0.702 0.898 1 RC
N
f227889816
f
GR
GS
[0.99899 0 0 1.00215 83.20811 148.31019] CT
0.702 0.898 1 RC
N
f227889816
f
GR
GS
[0.99899 0 0 1.00215 110.29332 121.85233] CT
0.702 0.898 1 RC
N
f227889816
f
GR
GS
[0.99899 0 0 1.00215 99.54622 144.48602] CT
0.702 0.898 1 RC
N
f227889816
f
GR
GS
[0.99899 0 0 1.00215 84.83759 79.18839] CT
0.702 0.898 1 RC
N
f227889816
f
GR
GS
[0.99899 0 0 1.00215 125.53527 146.54009] CT
0.702 0.898 1 RC
N
f227889816
f
GR
GS
[0.99899 0 0 1.00215 122.03621 105.49539] CT
0.702 0.898 1 RC
N
f227889816
f
GR
GS
[0.99899 0 0 1.00215 118.44466 115.38172] CT
0.702 0.898 1 RC
N
f227889816
f
GR
GS
[0.99899 0 0 1.00215 104.01943 80.27169] CT
0.702 0.898 1 RC
N
f227889816
f
GR
GS
[0.99899 0 0 1.00215 85.304 141.86547] CT
0.702 0.898 1 RC
N
f227889816
f
GR
GS
[0.99899 0 0 1.00215 93.54784 134.82191] CT
0.702 0.898 1 RC
N
f227889816
f
GR
GS
[0.99899 0 0 1.00215 108.4454 111.04599] CT
0.702 0.898 1 RC
N
f227889816
f
GR
GS
[0.99899 0 0 1.00215 88.55313 131.13577] CT
0.702 0.898 1 RC
N
f227889816
f
GR
GS
[0.99899 0 0 1.00215 100.04609 139.72877] CT
0.702 0.898 1 RC
N
f227889816
f
GR
GS
[0.99899 0 0 1.00215 100.54594 105.41361] CT
0.702 0.898 1 RC
N
f227889816
f
GR
GS
[0.99899 0 0 1.00215 78.95926 140.7087] CT
0.702 0.898 1 RC
N
f227889816
f
GR
GS
[0.99899 0 0 1.00215 115.03811 75.43784] CT
0.702 0.898 1 RC
N
f227889816
f
GR
GS
[0.99899 0 0 1.00215 100.79587 111.7481] CT
0.702 0.898 1 RC
N
f227889816
f
GR
GS
[0.99899 0 0 1.00215 118.0373 94.62376] CT
0.702 0.898 1 RC
N
f227889816
f
GR
GS
[0.99899 0 0 1.00215 108.69927 97.08903] CT
0.702 0.898 1 RC
N
f227889816
f
GR
GS
[0.99899 0 0 1.00215 162.6788 70.34254] CT
0.502 0.702 0.8 RC
N
/f-1969333140{-3.536 0 M
0 4.702 L
3.536 0 L
0 -4.702 L
cp}def
f-1969333140
f
GR
GS
[0.99899 0 0 1.00215 157.2039 84.87821] CT
0.502 0.702 0.8 RC
N
f-1969333140
f
GR
GS
[0.99899 0 0 1.00215 108.35487 67.61624] CT
0.502 0.702 0.8 RC
N
f-1969333140
f
GR
GS
[0.99899 0 0 1.00215 191.11205 41.57787] CT
0.502 0.702 0.8 RC
N
f-1969333140
f
GR
GS
[0.99899 0 0 1.00215 133.34812 94.78985] CT
0.502 0.702 0.8 RC
N
f-1969333140
f
GR
GS
[0.99899 0 0 1.00215 159.01836 62.07361] CT
0.502 0.702 0.8 RC
N
f-1969333140
f
GR
GS
[0.99899 0 0 1.00215 147.77533 86.40482] CT
0.502 0.702 0.8 RC
N
f-1969333140
f
GR
GS
[0.99899 0 0 1.00215 133.43865 73.73609] CT
0.502 0.702 0.8 RC
N
f-1969333140
f
GR
GS
[0.99899 0 0 1.00215 128.26486 77.53155] CT
0.502 0.702 0.8 RC
N
f-1969333140
f
GR
GS
[0.99899 0 0 1.00215 145.02609 75.94659] CT
0.502 0.702 0.8 RC
N
f-1969333140
f
GR
GS
[0.99899 0 0 1.00215 93.35892 83.6233] CT
0.502 0.702 0.8 RC
N
f-1969333140
f
GR
GS
[0.99899 0 0 1.00215 168.67718 58.21979] CT
0.502 0.702 0.8 RC
N
f-1969333140
f
GR
GS
[0.99899 0 0 1.00215 133.34812 113.95691] CT
0.502 0.702 0.8 RC
N
f-1969333140
f
GR
GS
[0.99899 0 0 1.00215 143.34543 82.08654] CT
0.502 0.702 0.8 RC
N
f-1969333140
f
GR
GS
[0.99899 0 0 1.00215 138.52784 72.88412] CT
0.502 0.702 0.8 RC
N
f-1969333140
f
GR
GS
[0.99899 0 0 1.00215 118.35217 101.74534] CT
0.502 0.702 0.8 RC
N
f-1969333140
f
GR
GS
[0.99899 0 0 1.00215 138.34678 73.2036] CT
0.502 0.702 0.8 RC
N
f-1969333140
f
GR
GS
[0.99899 0 0 1.00215 148.34408 74.85735] CT
0.502 0.702 0.8 RC
N
f-1969333140
f
GR
GS
[0.99899 0 0 1.00215 124.28562 61.55546] CT
0.502 0.702 0.8 RC
N
f-1969333140
f
GR
GS
[0.99899 0 0 1.00215 129.03431 38.76735] CT
0.502 0.702 0.8 RC
N
f-1969333140
f
GR
GS
[0.99899 0 0 1.00215 139.02375 69.83841] CT
0.502 0.702 0.8 RC
N
f-1969333140
f
GR
GS
[0.99899 0 0 1.00215 118.35217 76.31807] CT
0.502 0.702 0.8 RC
N
f-1969333140
f
GR
GS
[0.99899 0 0 1.00215 138.34678 64.29003] CT
0.502 0.702 0.8 RC
N
f-1969333140
f
GR
GS
[0.99899 0 0 1.00215 118.6946 54.60341] CT
0.502 0.702 0.8 RC
N
f-1969333140
f
GR
GS
[0.99899 0 0 1.00215 148.34408 65.58821] CT
0.502 0.702 0.8 RC
N
f-1969333140
f
GR
GS
[0.99899 0 0 1.00215 143.93385 82.79914] CT
0.502 0.702 0.8 RC
N
f-1969333140
f
GR
GS
[0.99899 0 0 1.00215 122.28615 97.03913] CT
0.502 0.702 0.8 RC
N
f-1969333140
f
GR
GS
[0.99899 0 0 1.00215 140.77722 71.54002] CT
0.502 0.702 0.8 RC
N
f-1969333140
f
GR
GS
[0.99899 0 0 1.00215 131.39786 96.29747] CT
0.502 0.702 0.8 RC
N
f-1969333140
f
GR
GS
[0.99899 0 0 1.00215 149.52487 98.20019] CT
0.502 0.702 0.8 RC
N
f-1969333140
f
GR
GS
[0.99899 0 0 1.00215 153.34272 52.81326] CT
0.502 0.702 0.8 RC
N
f-1969333140
f
GR
GS
[0.99899 0 0 1.00215 143.34543 92.76194] CT
0.502 0.702 0.8 RC
N
f-1969333140
f
GR
GS
[0.99899 0 0 1.00215 113.35351 54.30058] CT
0.502 0.702 0.8 RC
N
f-1969333140
f
GR
GS
[0.99899 0 0 1.00215 145.52593 75.82255] CT
0.502 0.702 0.8 RC
N
f-1969333140
f
GR
GS
[0.99899 0 0 1.00215 143.34543 69.04189] CT
0.502 0.702 0.8 RC
N
f-1969333140
f
GR
GS
[0.99899 0 0 1.00215 114.53824 59.87225] CT
0.502 0.702 0.8 RC
N
f-1969333140
f
GR
GS
[0.99899 0 0 1.00215 113.45389 48.49932] CT
0.502 0.702 0.8 RC
N
f-1969333140
f
GR
GS
[0.99899 0 0 1.00215 124.78546 67.0416] CT
0.502 0.702 0.8 RC
N
f-1969333140
f
GR
GS
[0.99899 0 0 1.00215 168.42725 72.11679] CT
0.502 0.702 0.8 RC
N
f-1969333140
f
GR
GS
[0.99899 0 0 1.00215 152.43156 79.05063] CT
0.502 0.702 0.8 RC
N
f-1969333140
f
GR
GS
[0.99899 0 0 1.00215 174.51025 32.2281] CT
0.502 0.702 0.8 RC
N
f-1969333140
f
GR
GS
[0.99899 0 0 1.00215 150.27269 55.09117] CT
0.502 0.702 0.8 RC
N
f-1969333140
f
GR
GS
[0.99899 0 0 1.00215 128.34946 80.40349] CT
0.502 0.702 0.8 RC
N
f-1969333140
f
GR
GS
[0.99899 0 0 1.00215 142.02689 77.02266] CT
0.502 0.702 0.8 RC
N
f-1969333140
f
GR
GS
[0.99899 0 0 1.00215 138.34678 64.7926] CT
0.502 0.702 0.8 RC
N
f-1969333140
f
GR
GS
[0.99899 0 0 1.00215 123.53581 70.07562] CT
0.502 0.702 0.8 RC
N
f-1969333140
f
GR
GS
[0.99899 0 0 1.00215 114.53824 73.50389] CT
0.502 0.702 0.8 RC
N
f-1969333140
f
GR
GS
[0.99899 0 0 1.00215 139.0277 76.24723] CT
0.502 0.702 0.8 RC
N
f-1969333140
f
GR
GS
[0.99899 0 0 1.00215 108.35487 92.21009] CT
0.502 0.702 0.8 RC
N
f-1969333140
f
GR
GS
[0.99899 0 0 1.00215 129.53419 59.79167] CT
0.502 0.702 0.8 RC
N
f-1969333140
f
GR
GS
[0.99899 0 0 1.00215 89.86182 94.92008] CT
0.502 0.702 0.8 RC
N
f-1969333140
f
GR
GS
[0.99899 0 0 1.00215 178.336 55.29448] CT
0.502 0.702 0.8 RC
N
f-1969333140
f
GR
GS
[0.99899 0 0 1.00215 125.53527 55.83667] CT
0.502 0.702 0.8 RC
N
f-1969333140
f
GR
%%Trailer
%%Pages: 1
%%EOF
