%!PS-Adobe-3.0 EPSF-3.0
%%Creator: (MATLAB, The Mathworks, Inc. Version 9.8.0.1323502 \(R2020a\). Operating System: Mac OS X)
%%Title: /Users/kosciessa/Desktop/mntTardisLNDG/LNDG/stateswitch/stsw_multimodal/figures/linearbyage/linearcomp_sampen.eps
%%CreationDate: 2022-03-03T16:32:29
%%Pages: (atend)
%%BoundingBox:     4     0   180   275
%%LanguageLevel: 3
%%EndComments
%%BeginProlog
%%BeginResource: procset (Apache XML Graphics Std ProcSet) 1.2 0
%%Version: 1.2 0
%%Copyright: (Copyright 2001-2003,2010 The Apache Software Foundation. License terms: http://www.apache.org/licenses/LICENSE-2.0)
/bd{bind def}bind def
/ld{load def}bd
/GR/grestore ld
/GS/gsave ld
/RM/rmoveto ld
/C/curveto ld
/t/show ld
/L/lineto ld
/ML/setmiterlimit ld
/CT/concat ld
/f/fill ld
/N/newpath ld
/S/stroke ld
/CC/setcmykcolor ld
/A/ashow ld
/cp/closepath ld
/RC/setrgbcolor ld
/LJ/setlinejoin ld
/GC/setgray ld
/LW/setlinewidth ld
/M/moveto ld
/re {4 2 roll M
1 index 0 rlineto
0 exch rlineto
neg 0 rlineto
cp } bd
/_ctm matrix def
/_tm matrix def
/BT { _ctm currentmatrix pop matrix _tm copy pop 0 0 moveto } bd
/ET { _ctm setmatrix } bd
/iTm { _ctm setmatrix _tm concat } bd
/Tm { _tm astore pop iTm 0 0 moveto } bd
/ux 0.0 def
/uy 0.0 def
/F {
  /Tp exch def
  /Tf exch def
  Tf findfont Tp scalefont setfont
  /cf Tf def  /cs Tp def
} bd
/ULS {currentpoint /uy exch def /ux exch def} bd
/ULE {
  /Tcx currentpoint pop def
  gsave
  newpath
  cf findfont cs scalefont dup
  /FontMatrix get 0 get /Ts exch def /FontInfo get dup
  /UnderlinePosition get Ts mul /To exch def
  /UnderlineThickness get Ts mul /Tt exch def
  ux uy To add moveto  Tcx uy To add lineto
  Tt setlinewidth stroke
  grestore
} bd
/OLE {
  /Tcx currentpoint pop def
  gsave
  newpath
  cf findfont cs scalefont dup
  /FontMatrix get 0 get /Ts exch def /FontInfo get dup
  /UnderlinePosition get Ts mul /To exch def
  /UnderlineThickness get Ts mul /Tt exch def
  ux uy To add cs add moveto Tcx uy To add cs add lineto
  Tt setlinewidth stroke
  grestore
} bd
/SOE {
  /Tcx currentpoint pop def
  gsave
  newpath
  cf findfont cs scalefont dup
  /FontMatrix get 0 get /Ts exch def /FontInfo get dup
  /UnderlinePosition get Ts mul /To exch def
  /UnderlineThickness get Ts mul /Tt exch def
  ux uy To add cs 10 mul 26 idiv add moveto Tcx uy To add cs 10 mul 26 idiv add lineto
  Tt setlinewidth stroke
  grestore
} bd
/QT {
/Y22 exch store
/X22 exch store
/Y21 exch store
/X21 exch store
currentpoint
/Y21 load 2 mul add 3 div exch
/X21 load 2 mul add 3 div exch
/X21 load 2 mul /X22 load add 3 div
/Y21 load 2 mul /Y22 load add 3 div
/X22 load /Y22 load curveto
} bd
/SSPD {
dup length /d exch dict def
{
/v exch def
/k exch def
currentpagedevice k known {
/cpdv currentpagedevice k get def
v cpdv ne {
/upd false def
/nullv v type /nulltype eq def
/nullcpdv cpdv type /nulltype eq def
nullv nullcpdv or
{
/upd true def
} {
/sametype v type cpdv type eq def
sametype {
v type /arraytype eq {
/vlen v length def
/cpdvlen cpdv length def
vlen cpdvlen eq {
0 1 vlen 1 sub {
/i exch def
/obj v i get def
/cpdobj cpdv i get def
obj cpdobj ne {
/upd true def
exit
} if
} for
} {
/upd true def
} ifelse
} {
v type /dicttype eq {
v {
/dv exch def
/dk exch def
/cpddv cpdv dk get def
dv cpddv ne {
/upd true def
exit
} if
} forall
} {
/upd true def
} ifelse
} ifelse
} if
} ifelse
upd true eq {
d k v put
} if
} if
} if
} forall
d length 0 gt {
d setpagedevice
} if
} bd
/RE { % /NewFontName [NewEncodingArray] /FontName RE -
  findfont dup length dict begin
  {
    1 index /FID ne
    {def} {pop pop} ifelse
  } forall
  /Encoding exch def
  /FontName 1 index def
  currentdict definefont pop
  end
} bind def
%%EndResource
%%BeginResource: procset (Apache XML Graphics EPS ProcSet) 1.0 0
%%Version: 1.0 0
%%Copyright: (Copyright 2002-2003 The Apache Software Foundation. License terms: http://www.apache.org/licenses/LICENSE-2.0)
/BeginEPSF { %def
/b4_Inc_state save def         % Save state for cleanup
/dict_count countdictstack def % Count objects on dict stack
/op_count count 1 sub def      % Count objects on operand stack
userdict begin                 % Push userdict on dict stack
/showpage { } def              % Redefine showpage, { } = null proc
0 setgray 0 setlinecap         % Prepare graphics state
1 setlinewidth 0 setlinejoin
10 setmiterlimit [ ] 0 setdash newpath
/languagelevel where           % If level not equal to 1 then
{pop languagelevel             % set strokeadjust and
1 ne                           % overprint to their defaults.
{false setstrokeadjust false setoverprint
} if
} if
} bd
/EndEPSF { %def
count op_count sub {pop} repeat            % Clean up stacks
countdictstack dict_count sub {end} repeat
b4_Inc_state restore
} bd
%%EndResource
%FOPBeginFontDict
%%IncludeResource: font Courier-Oblique
%%IncludeResource: font Courier-BoldOblique
%%IncludeResource: font Courier-Bold
%%IncludeResource: font ZapfDingbats
%%IncludeResource: font Symbol
%%IncludeResource: font Helvetica
%%IncludeResource: font Helvetica-Oblique
%%IncludeResource: font Helvetica-Bold
%%IncludeResource: font Helvetica-BoldOblique
%%IncludeResource: font Times-Roman
%%IncludeResource: font Times-Italic
%%IncludeResource: font Times-Bold
%%IncludeResource: font Times-BoldItalic
%%IncludeResource: font Courier
%FOPEndFontDict
%%BeginResource: encoding WinAnsiEncoding
/WinAnsiEncoding [
/.notdef /.notdef /.notdef /.notdef /.notdef
/.notdef /.notdef /.notdef /.notdef /.notdef
/.notdef /.notdef /.notdef /.notdef /.notdef
/.notdef /.notdef /.notdef /.notdef /.notdef
/.notdef /.notdef /.notdef /.notdef /.notdef
/.notdef /.notdef /.notdef /.notdef /.notdef
/.notdef /.notdef /space /exclam /quotedbl
/numbersign /dollar /percent /ampersand /quotesingle
/parenleft /parenright /asterisk /plus /comma
/hyphen /period /slash /zero /one
/two /three /four /five /six
/seven /eight /nine /colon /semicolon
/less /equal /greater /question /at
/A /B /C /D /E
/F /G /H /I /J
/K /L /M /N /O
/P /Q /R /S /T
/U /V /W /X /Y
/Z /bracketleft /backslash /bracketright /asciicircum
/underscore /quoteleft /a /b /c
/d /e /f /g /h
/i /j /k /l /m
/n /o /p /q /r
/s /t /u /v /w
/x /y /z /braceleft /bar
/braceright /asciitilde /bullet /Euro /bullet
/quotesinglbase /florin /quotedblbase /ellipsis /dagger
/daggerdbl /circumflex /perthousand /Scaron /guilsinglleft
/OE /bullet /Zcaron /bullet /bullet
/quoteleft /quoteright /quotedblleft /quotedblright /bullet
/endash /emdash /asciitilde /trademark /scaron
/guilsinglright /oe /bullet /zcaron /Ydieresis
/space /exclamdown /cent /sterling /currency
/yen /brokenbar /section /dieresis /copyright
/ordfeminine /guillemotleft /logicalnot /sfthyphen /registered
/macron /degree /plusminus /twosuperior /threesuperior
/acute /mu /paragraph /middot /cedilla
/onesuperior /ordmasculine /guillemotright /onequarter /onehalf
/threequarters /questiondown /Agrave /Aacute /Acircumflex
/Atilde /Adieresis /Aring /AE /Ccedilla
/Egrave /Eacute /Ecircumflex /Edieresis /Igrave
/Iacute /Icircumflex /Idieresis /Eth /Ntilde
/Ograve /Oacute /Ocircumflex /Otilde /Odieresis
/multiply /Oslash /Ugrave /Uacute /Ucircumflex
/Udieresis /Yacute /Thorn /germandbls /agrave
/aacute /acircumflex /atilde /adieresis /aring
/ae /ccedilla /egrave /eacute /ecircumflex
/edieresis /igrave /iacute /icircumflex /idieresis
/eth /ntilde /ograve /oacute /ocircumflex
/otilde /odieresis /divide /oslash /ugrave
/uacute /ucircumflex /udieresis /yacute /thorn
/ydieresis
] def
%%EndResource
%FOPBeginFontReencode
/Courier-Oblique findfont
dup length dict begin
  {1 index /FID ne {def} {pop pop} ifelse} forall
  /Encoding WinAnsiEncoding def
  currentdict
end
/Courier-Oblique exch definefont pop
/Courier-BoldOblique findfont
dup length dict begin
  {1 index /FID ne {def} {pop pop} ifelse} forall
  /Encoding WinAnsiEncoding def
  currentdict
end
/Courier-BoldOblique exch definefont pop
/Courier-Bold findfont
dup length dict begin
  {1 index /FID ne {def} {pop pop} ifelse} forall
  /Encoding WinAnsiEncoding def
  currentdict
end
/Courier-Bold exch definefont pop
/Helvetica findfont
dup length dict begin
  {1 index /FID ne {def} {pop pop} ifelse} forall
  /Encoding WinAnsiEncoding def
  currentdict
end
/Helvetica exch definefont pop
/Helvetica-Oblique findfont
dup length dict begin
  {1 index /FID ne {def} {pop pop} ifelse} forall
  /Encoding WinAnsiEncoding def
  currentdict
end
/Helvetica-Oblique exch definefont pop
/Helvetica-Bold findfont
dup length dict begin
  {1 index /FID ne {def} {pop pop} ifelse} forall
  /Encoding WinAnsiEncoding def
  currentdict
end
/Helvetica-Bold exch definefont pop
/Helvetica-BoldOblique findfont
dup length dict begin
  {1 index /FID ne {def} {pop pop} ifelse} forall
  /Encoding WinAnsiEncoding def
  currentdict
end
/Helvetica-BoldOblique exch definefont pop
/Times-Roman findfont
dup length dict begin
  {1 index /FID ne {def} {pop pop} ifelse} forall
  /Encoding WinAnsiEncoding def
  currentdict
end
/Times-Roman exch definefont pop
/Times-Italic findfont
dup length dict begin
  {1 index /FID ne {def} {pop pop} ifelse} forall
  /Encoding WinAnsiEncoding def
  currentdict
end
/Times-Italic exch definefont pop
/Times-Bold findfont
dup length dict begin
  {1 index /FID ne {def} {pop pop} ifelse} forall
  /Encoding WinAnsiEncoding def
  currentdict
end
/Times-Bold exch definefont pop
/Times-BoldItalic findfont
dup length dict begin
  {1 index /FID ne {def} {pop pop} ifelse} forall
  /Encoding WinAnsiEncoding def
  currentdict
end
/Times-BoldItalic exch definefont pop
/Courier findfont
dup length dict begin
  {1 index /FID ne {def} {pop pop} ifelse} forall
  /Encoding WinAnsiEncoding def
  currentdict
end
/Courier exch definefont pop
%FOPEndFontReencode
%%EndProlog
%%Page: 1 1
%%PageBoundingBox: 0 0 198 283
%%BeginPageSetup
[1 0 0 -1 0 283] CT
%%EndPageSetup
GS
[1.00215 0 0 1 0 0] CT
1 GC
N
0 0 198 283 re
f
GR
GS
[1.00215 0 0 1 0 0] CT
1 GC
N
0 0 198 283 re
f
GR
GS
[1.00215 0 0 1 0 0] CT
1 GC
N
80 228 M
179 228 L
179 32 L
80 32 L
cp
f
GR
GS
[1.00215 0 0 1 0 0] CT
0.149 GC
2 setlinecap
1 LJ
0.5 LW
N
80 228 M
179 228 L
S
GR
GS
[1.00215 0 0 1 0 0] CT
0.149 GC
2 setlinecap
1 LJ
0.5 LW
N
109.7 228 M
109.7 226.04 L
S
GR
GS
[1.00215 0 0 1 0 0] CT
0.149 GC
2 setlinecap
1 LJ
0.5 LW
N
149.3 228 M
149.3 226.04 L
S
GR
GS
[1.00215 0 0 1 109.93558 234] CT
0.149 GC
/Helvetica 20 F
GS
[1 0 0 1 0 0] CT
-13 20 moveto 
1 -1 scale
(YA) t 
GR
GR
GS
[1.00215 0 0 1 149.62062 234] CT
0.149 GC
/Helvetica 20 F
GS
[1 0 0 1 0 0] CT
-14.5 20 moveto 
1 -1 scale
(OA) t 
GR
GR
GS
[1.00215 0 0 1 129.77814 259] CT
0.149 GC
/Helvetica 20 F
GS
[1 0 0 1 0 0] CT
-49 20 moveto 
1 -1 scale
(Age Group) t 
GR
GR
GS
[1.00215 0 0 1 0 0] CT
0.149 GC
2 setlinecap
1 LJ
0.5 LW
N
80 228 M
80 32 L
S
GR
GS
[1.00215 0 0 1 0 0] CT
0.149 GC
2 setlinecap
1 LJ
0.5 LW
N
80 228 M
81.96 228 L
S
GR
GS
[1.00215 0 0 1 0 0] CT
0.149 GC
2 setlinecap
1 LJ
0.5 LW
N
80 179 M
81.96 179 L
S
GR
GS
[1.00215 0 0 1 0 0] CT
0.149 GC
2 setlinecap
1 LJ
0.5 LW
N
80 130 M
81.96 130 L
S
GR
GS
[1.00215 0 0 1 0 0] CT
0.149 GC
2 setlinecap
1 LJ
0.5 LW
N
80 81 M
81.96 81 L
S
GR
GS
[1.00215 0 0 1 0 0] CT
0.149 GC
2 setlinecap
1 LJ
0.5 LW
N
80 32 M
81.96 32 L
S
GR
GS
[1.00215 0 0 1 74.15891 228] CT
0.149 GC
/Helvetica 20 F
GS
[1 0 0 1 0 0] CT
-47 7.5 moveto 
1 -1 scale
(-0.04) t 
GR
GR
GS
[1.00215 0 0 1 74.15891 179] CT
0.149 GC
/Helvetica 20 F
GS
[1 0 0 1 0 0] CT
-47 7.5 moveto 
1 -1 scale
(-0.02) t 
GR
GR
GS
[1.00215 0 0 1 74.15891 130] CT
0.149 GC
/Helvetica 20 F
GS
[1 0 0 1 0 0] CT
-12 7.5 moveto 
1 -1 scale
(0) t 
GR
GR
GS
[1.00215 0 0 1 74.15891 81] CT
0.149 GC
/Helvetica 20 F
GS
[1 0 0 1 0 0] CT
-39 7.5 moveto 
1 -1 scale
(0.02) t 
GR
GR
GS
[1.00215 0 0 1 74.15891 32] CT
0.149 GC
/Helvetica 20 F
GS
[1 0 0 1 0 0] CT
-39 7.5 moveto 
1 -1 scale
(0.04) t 
GR
GR
GS
[0 -1 1.00215 0 24.05154 129.99991] CT
0.149 GC
/Helvetica 20 F
GS
[1 0 0 1 0 0] CT
-63 -5 moveto 
1 -1 scale
(sampen linear) t 
GR
GR
GS
[1.00215 0 0 1 129.77822 29.25] CT
/Helvetica-Bold 22 F
GS
[1 0 0 1 0 0] CT
-41 -5 moveto 
1 -1 scale
(p = 0.01) t 
GR
GR
GS
[1.00215 0 0 1 0 0] CT
0.149 GC
1 LJ
0.5 LW
N
80 130 M
179 130 L
S
GR
GS
[1.00215 0 0 1 0 0] CT
1 0.6 0.6 RC
N
125.54 130 M
125.54 110.974 L
93.86 110.974 L
93.86 130 L
cp
f
GR
GS
[1.00215 0 0 1 105.56873 201.21799] CT
0.302 GC
N
2.236 0 M
2.236 -1.235 1.235 -2.236 0 -2.236 C
-1.235 -2.236 -2.236 -1.235 -2.236 0 C
-2.236 1.235 -1.235 2.236 0 2.236 C
1.235 2.236 2.236 1.235 2.236 0 C
cp
f
GR
GS
[1.00215 0 0 1 115.9378 111.62347] CT
0.302 GC
N
/f-1586420743{2.236 0 M
2.236 -1.235 1.235 -2.236 0 -2.236 C
-1.235 -2.236 -2.236 -1.235 -2.236 0 C
-2.236 1.235 -1.235 2.236 0 2.236 C
1.235 2.236 2.236 1.235 2.236 0 C
cp}def
f-1586420743
f
GR
GS
[1.00215 0 0 1 102.34783 86.75731] CT
0.302 GC
N
f-1586420743
f
GR
GS
[1.00215 0 0 1 107.36539 42.93113] CT
0.302 GC
N
f-1586420743
f
GR
GS
[1.00215 0 0 1 117.47276 60.74786] CT
0.302 GC
N
f-1586420743
f
GR
GS
[1.00215 0 0 1 110.471 127.89838] CT
0.302 GC
N
f-1586420743
f
GR
GS
[1.00215 0 0 1 114.33609 77.20653] CT
0.302 GC
N
f-1586420743
f
GR
GS
[1.00215 0 0 1 115.96522 122.27085] CT
0.302 GC
N
f-1586420743
f
GR
GS
[1.00215 0 0 1 109.49513 117.38808] CT
0.302 GC
N
f-1586420743
f
GR
GS
[1.00215 0 0 1 113.60572 137.70476] CT
0.302 GC
N
f-1586420743
f
GR
GS
[1.00215 0 0 1 110.55898 90.31311] CT
0.302 GC
N
f-1586420743
f
GR
GS
[1.00215 0 0 1 112.91725 141.20425] CT
0.302 GC
N
f-1586420743
f
GR
GS
[1.00215 0 0 1 108.14588 118.70772] CT
0.302 GC
N
f-1586420743
f
GR
GS
[1.00215 0 0 1 114.22539 138.7386] CT
0.302 GC
N
f-1586420743
f
GR
GS
[1.00215 0 0 1 106.24737 42.93113] CT
0.302 GC
N
f-1586420743
f
GR
GS
[1.00215 0 0 1 117.63267 126.51905] CT
0.302 GC
N
f-1586420743
f
GR
GS
[1.00215 0 0 1 105.64513 122.91266] CT
0.302 GC
N
f-1586420743
f
GR
GS
[1.00215 0 0 1 113.702 99.91336] CT
0.302 GC
N
f-1586420743
f
GR
GS
[1.00215 0 0 1 107.04767 144.78363] CT
0.302 GC
N
f-1586420743
f
GR
GS
[1.00215 0 0 1 103.32688 128.356] CT
0.302 GC
N
f-1586420743
f
GR
GS
[1.00215 0 0 1 103.14199 42.93113] CT
0.302 GC
N
f-1586420743
f
GR
GS
[1.00215 0 0 1 103.7196 130.64658] CT
0.302 GC
N
f-1586420743
f
GR
GS
[1.00215 0 0 1 102.80385 128.19368] CT
0.302 GC
N
f-1586420743
f
GR
GS
[1.00215 0 0 1 104.5007 76.96864] CT
0.302 GC
N
f-1586420743
f
GR
GS
[1.00215 0 0 1 114.65859 116.80729] CT
0.302 GC
N
f-1586420743
f
GR
GS
[1.00215 0 0 1 107.06894 91.45514] CT
0.302 GC
N
f-1586420743
f
GR
GS
[1.00215 0 0 1 110.1196 81.30808] CT
0.302 GC
N
f-1586420743
f
GR
GS
[1.00215 0 0 1 104.0307 136.37047] CT
0.302 GC
N
f-1586420743
f
GR
GS
[1.00215 0 0 1 116.73854 75.0219] CT
0.302 GC
N
f-1586420743
f
GR
GS
[1.00215 0 0 1 103.77085 98.63999] CT
0.302 GC
N
f-1586420743
f
GR
GS
[1.00215 0 0 1 116.83961 123.86131] CT
0.302 GC
N
f-1586420743
f
GR
GS
[1.00215 0 0 1 102.21058 42.93113] CT
0.302 GC
N
f-1586420743
f
GR
GS
[1.00215 0 0 1 117.62222 138.39633] CT
0.302 GC
N
f-1586420743
f
GR
GS
[1.00215 0 0 1 103.17363 122.9815] CT
0.302 GC
N
f-1586420743
f
GR
GS
[1.00215 0 0 1 103.79619 141.56046] CT
0.302 GC
N
f-1586420743
f
GR
GS
[1.00215 0 0 1 112.85988 71.12759] CT
0.302 GC
N
f-1586420743
f
GR
GS
[1.00215 0 0 1 104.81985 126.24416] CT
0.302 GC
N
f-1586420743
f
GR
GS
[1.00215 0 0 1 113.92236 131.08685] CT
0.302 GC
N
f-1586420743
f
GR
GS
[1.00215 0 0 1 102.21112 159.0788] CT
0.302 GC
N
f-1586420743
f
GR
GS
[1.00215 0 0 1 117.36916 119.08602] CT
0.302 GC
N
f-1586420743
f
GR
GS
[1.00215 0 0 1 116.69813 158.41534] CT
0.302 GC
N
f-1586420743
f
GR
GS
[1.00215 0 0 1 113.74804 107.65273] CT
0.302 GC
N
f-1586420743
f
GR
GS
[1.00215 0 0 1 0 0] CT
0.6 GC
N
/f-2039464626{133.46 130 M
133.46 130.605 L
165.14 130.605 L
165.14 130 L
cp}def
f-2039464626
f
GR
GS
[1.00215 0 0 1 152.67739 204.16849] CT
0.302 GC
N
f-1586420743
f
GR
GS
[1.00215 0 0 1 146.90273 182.65152] CT
0.302 GC
N
f-1586420743
f
GR
GS
[1.00215 0 0 1 153.71286 105.73636] CT
0.302 GC
N
f-1586420743
f
GR
GS
[1.00215 0 0 1 145.50569 132.27618] CT
0.302 GC
N
f-1586420743
f
GR
GS
[1.00215 0 0 1 146.93703 120.69567] CT
0.302 GC
N
f-1586420743
f
GR
GS
[1.00215 0 0 1 155.33872 83.87833] CT
0.302 GC
N
f-1586420743
f
GR
GS
[1.00215 0 0 1 152.22716 204.16849] CT
0.302 GC
N
f-1586420743
f
GR
GS
[1.00215 0 0 1 151.82435 204.16849] CT
0.302 GC
N
f-1586420743
f
GR
GS
[1.00215 0 0 1 151.96722 121.47618] CT
0.302 GC
N
f-1586420743
f
GR
GS
[1.00215 0 0 1 152.14474 98.9549] CT
0.302 GC
N
f-1586420743
f
GR
GS
[1.00215 0 0 1 153.95141 111.41406] CT
0.302 GC
N
f-1586420743
f
GR
GS
[1.00215 0 0 1 156.52742 142.65695] CT
0.302 GC
N
f-1586420743
f
GR
GS
[1.00215 0 0 1 142.83785 150.30356] CT
0.302 GC
N
f-1586420743
f
GR
GS
[1.00215 0 0 1 142.65815 127.13533] CT
0.302 GC
N
f-1586420743
f
GR
GS
[1.00215 0 0 1 145.51268 76.09006] CT
0.302 GC
N
f-1586420743
f
GR
GS
[1.00215 0 0 1 146.62048 94.75004] CT
0.302 GC
N
f-1586420743
f
GR
GS
[1.00215 0 0 1 147.67996 141.93237] CT
0.302 GC
N
f-1586420743
f
GR
GS
[1.00215 0 0 1 155.3207 93.68427] CT
0.302 GC
N
f-1586420743
f
GR
GS
[1.00215 0 0 1 144.40556 168.13326] CT
0.302 GC
N
f-1586420743
f
GR
GS
[1.00215 0 0 1 153.94637 168.43671] CT
0.302 GC
N
f-1586420743
f
GR
GS
[1.00215 0 0 1 142.9109 90.45567] CT
0.302 GC
N
f-1586420743
f
GR
GS
[1.00215 0 0 1 156.52731 79.77326] CT
0.302 GC
N
f-1586420743
f
GR
GS
[1.00215 0 0 1 151.3232 110.00173] CT
0.302 GC
N
f-1586420743
f
GR
GS
[1.00215 0 0 1 143.5016 123.54004] CT
0.302 GC
N
f-1586420743
f
GR
GS
[1.00215 0 0 1 148.76734 123.38747] CT
0.302 GC
N
f-1586420743
f
GR
GS
[1.00215 0 0 1 143.41775 152.63551] CT
0.302 GC
N
f-1586420743
f
GR
GS
[1.00215 0 0 1 144.48494 56.30349] CT
0.302 GC
N
f-1586420743
f
GR
GS
[1.00215 0 0 1 152.74447 138.72882] CT
0.302 GC
N
f-1586420743
f
GR
GS
[1.00215 0 0 1 144.91504 145.76917] CT
0.302 GC
N
f-1586420743
f
GR
GS
[1.00215 0 0 1 148.10098 113.52153] CT
0.302 GC
N
f-1586420743
f
GR
GS
[1.00215 0 0 1 152.86207 123.02855] CT
0.302 GC
N
f-1586420743
f
GR
GS
[1.00215 0 0 1 152.67378 204.16849] CT
0.302 GC
N
f-1586420743
f
GR
GS
[1.00215 0 0 1 147.56857 118.19307] CT
0.302 GC
N
f-1586420743
f
GR
GS
[1.00215 0 0 1 145.19381 113.43277] CT
0.302 GC
N
f-1586420743
f
GR
GS
[1.00215 0 0 1 144.10274 119.6132] CT
0.302 GC
N
f-1586420743
f
GR
GS
[1.00215 0 0 1 149.92395 121.79786] CT
0.302 GC
N
f-1586420743
f
GR
GS
[1.00215 0 0 1 154.9769 92.0854] CT
0.302 GC
N
f-1586420743
f
GR
GS
[1.00215 0 0 1 154.41622 147.3459] CT
0.302 GC
N
f-1586420743
f
GR
GS
[1.00215 0 0 1 154.8309 161.43681] CT
0.302 GC
N
f-1586420743
f
GR
GS
[1.00215 0 0 1 150.91855 146.67769] CT
0.302 GC
N
f-1586420743
f
GR
GS
[1.00215 0 0 1 143.70658 137.19316] CT
0.302 GC
N
f-1586420743
f
GR
GS
[1.00215 0 0 1 142.76477 140.42523] CT
0.302 GC
N
f-1586420743
f
GR
GS
[1.00215 0 0 1 153.69711 134.69611] CT
0.302 GC
N
f-1586420743
f
GR
GS
[1.00215 0 0 1 144.99774 127.68307] CT
0.302 GC
N
f-1586420743
f
GR
GS
[1.00215 0 0 1 155.9271 122.4734] CT
0.302 GC
N
f-1586420743
f
GR
GS
[1.00215 0 0 1 143.3529 182.48257] CT
0.302 GC
N
f-1586420743
f
GR
GS
[1.00215 0 0 1 152.62728 132.28331] CT
0.302 GC
N
f-1586420743
f
GR
GS
[1.00215 0 0 1 148.43383 129.48889] CT
0.302 GC
N
f-1586420743
f
GR
GS
[1.00215 0 0 1 148.68339 204.16849] CT
0.302 GC
N
f-1586420743
f
GR
GS
[1.00215 0 0 1 142.52701 60.52277] CT
0.302 GC
N
f-1586420743
f
GR
GS
[1.00215 0 0 1 149.2154 138.23212] CT
0.302 GC
N
f-1586420743
f
GR
GS
[1.00215 0 0 1 141.94646 45.94585] CT
0.302 GC
N
f-1586420743
f
GR
GS
[1.00215 0 0 1 144.81034 151.84822] CT
0.302 GC
N
f-1586420743
f
GR
%%Trailer
%%Pages: 1
%%EOF
