%!PS-Adobe-3.0 EPSF-3.0
%%Creator: (MATLAB, The Mathworks, Inc. Version 9.8.0.1323502 \(R2020a\). Operating System: Mac OS X)
%%Title: /Users/kosciessa/Desktop/mntTardisLNDG/LNDG/stateswitch/stsw_multimodal/figures/linearbyage/linearcomp_cppthresh.eps
%%CreationDate: 2022-03-03T16:32:28
%%Pages: (atend)
%%BoundingBox:     4     0   180   278
%%LanguageLevel: 3
%%EndComments
%%BeginProlog
%%BeginResource: procset (Apache XML Graphics Std ProcSet) 1.2 0
%%Version: 1.2 0
%%Copyright: (Copyright 2001-2003,2010 The Apache Software Foundation. License terms: http://www.apache.org/licenses/LICENSE-2.0)
/bd{bind def}bind def
/ld{load def}bd
/GR/grestore ld
/GS/gsave ld
/RM/rmoveto ld
/C/curveto ld
/t/show ld
/L/lineto ld
/ML/setmiterlimit ld
/CT/concat ld
/f/fill ld
/N/newpath ld
/S/stroke ld
/CC/setcmykcolor ld
/A/ashow ld
/cp/closepath ld
/RC/setrgbcolor ld
/LJ/setlinejoin ld
/GC/setgray ld
/LW/setlinewidth ld
/M/moveto ld
/re {4 2 roll M
1 index 0 rlineto
0 exch rlineto
neg 0 rlineto
cp } bd
/_ctm matrix def
/_tm matrix def
/BT { _ctm currentmatrix pop matrix _tm copy pop 0 0 moveto } bd
/ET { _ctm setmatrix } bd
/iTm { _ctm setmatrix _tm concat } bd
/Tm { _tm astore pop iTm 0 0 moveto } bd
/ux 0.0 def
/uy 0.0 def
/F {
  /Tp exch def
  /Tf exch def
  Tf findfont Tp scalefont setfont
  /cf Tf def  /cs Tp def
} bd
/ULS {currentpoint /uy exch def /ux exch def} bd
/ULE {
  /Tcx currentpoint pop def
  gsave
  newpath
  cf findfont cs scalefont dup
  /FontMatrix get 0 get /Ts exch def /FontInfo get dup
  /UnderlinePosition get Ts mul /To exch def
  /UnderlineThickness get Ts mul /Tt exch def
  ux uy To add moveto  Tcx uy To add lineto
  Tt setlinewidth stroke
  grestore
} bd
/OLE {
  /Tcx currentpoint pop def
  gsave
  newpath
  cf findfont cs scalefont dup
  /FontMatrix get 0 get /Ts exch def /FontInfo get dup
  /UnderlinePosition get Ts mul /To exch def
  /UnderlineThickness get Ts mul /Tt exch def
  ux uy To add cs add moveto Tcx uy To add cs add lineto
  Tt setlinewidth stroke
  grestore
} bd
/SOE {
  /Tcx currentpoint pop def
  gsave
  newpath
  cf findfont cs scalefont dup
  /FontMatrix get 0 get /Ts exch def /FontInfo get dup
  /UnderlinePosition get Ts mul /To exch def
  /UnderlineThickness get Ts mul /Tt exch def
  ux uy To add cs 10 mul 26 idiv add moveto Tcx uy To add cs 10 mul 26 idiv add lineto
  Tt setlinewidth stroke
  grestore
} bd
/QT {
/Y22 exch store
/X22 exch store
/Y21 exch store
/X21 exch store
currentpoint
/Y21 load 2 mul add 3 div exch
/X21 load 2 mul add 3 div exch
/X21 load 2 mul /X22 load add 3 div
/Y21 load 2 mul /Y22 load add 3 div
/X22 load /Y22 load curveto
} bd
/SSPD {
dup length /d exch dict def
{
/v exch def
/k exch def
currentpagedevice k known {
/cpdv currentpagedevice k get def
v cpdv ne {
/upd false def
/nullv v type /nulltype eq def
/nullcpdv cpdv type /nulltype eq def
nullv nullcpdv or
{
/upd true def
} {
/sametype v type cpdv type eq def
sametype {
v type /arraytype eq {
/vlen v length def
/cpdvlen cpdv length def
vlen cpdvlen eq {
0 1 vlen 1 sub {
/i exch def
/obj v i get def
/cpdobj cpdv i get def
obj cpdobj ne {
/upd true def
exit
} if
} for
} {
/upd true def
} ifelse
} {
v type /dicttype eq {
v {
/dv exch def
/dk exch def
/cpddv cpdv dk get def
dv cpddv ne {
/upd true def
exit
} if
} forall
} {
/upd true def
} ifelse
} ifelse
} if
} ifelse
upd true eq {
d k v put
} if
} if
} if
} forall
d length 0 gt {
d setpagedevice
} if
} bd
/RE { % /NewFontName [NewEncodingArray] /FontName RE -
  findfont dup length dict begin
  {
    1 index /FID ne
    {def} {pop pop} ifelse
  } forall
  /Encoding exch def
  /FontName 1 index def
  currentdict definefont pop
  end
} bind def
%%EndResource
%%BeginResource: procset (Apache XML Graphics EPS ProcSet) 1.0 0
%%Version: 1.0 0
%%Copyright: (Copyright 2002-2003 The Apache Software Foundation. License terms: http://www.apache.org/licenses/LICENSE-2.0)
/BeginEPSF { %def
/b4_Inc_state save def         % Save state for cleanup
/dict_count countdictstack def % Count objects on dict stack
/op_count count 1 sub def      % Count objects on operand stack
userdict begin                 % Push userdict on dict stack
/showpage { } def              % Redefine showpage, { } = null proc
0 setgray 0 setlinecap         % Prepare graphics state
1 setlinewidth 0 setlinejoin
10 setmiterlimit [ ] 0 setdash newpath
/languagelevel where           % If level not equal to 1 then
{pop languagelevel             % set strokeadjust and
1 ne                           % overprint to their defaults.
{false setstrokeadjust false setoverprint
} if
} if
} bd
/EndEPSF { %def
count op_count sub {pop} repeat            % Clean up stacks
countdictstack dict_count sub {end} repeat
b4_Inc_state restore
} bd
%%EndResource
%FOPBeginFontDict
%%IncludeResource: font Courier-Oblique
%%IncludeResource: font Courier-BoldOblique
%%IncludeResource: font Courier-Bold
%%IncludeResource: font ZapfDingbats
%%IncludeResource: font Symbol
%%IncludeResource: font Helvetica
%%IncludeResource: font Helvetica-Oblique
%%IncludeResource: font Helvetica-Bold
%%IncludeResource: font Helvetica-BoldOblique
%%IncludeResource: font Times-Roman
%%IncludeResource: font Times-Italic
%%IncludeResource: font Times-Bold
%%IncludeResource: font Times-BoldItalic
%%IncludeResource: font Courier
%FOPEndFontDict
%%BeginResource: encoding WinAnsiEncoding
/WinAnsiEncoding [
/.notdef /.notdef /.notdef /.notdef /.notdef
/.notdef /.notdef /.notdef /.notdef /.notdef
/.notdef /.notdef /.notdef /.notdef /.notdef
/.notdef /.notdef /.notdef /.notdef /.notdef
/.notdef /.notdef /.notdef /.notdef /.notdef
/.notdef /.notdef /.notdef /.notdef /.notdef
/.notdef /.notdef /space /exclam /quotedbl
/numbersign /dollar /percent /ampersand /quotesingle
/parenleft /parenright /asterisk /plus /comma
/hyphen /period /slash /zero /one
/two /three /four /five /six
/seven /eight /nine /colon /semicolon
/less /equal /greater /question /at
/A /B /C /D /E
/F /G /H /I /J
/K /L /M /N /O
/P /Q /R /S /T
/U /V /W /X /Y
/Z /bracketleft /backslash /bracketright /asciicircum
/underscore /quoteleft /a /b /c
/d /e /f /g /h
/i /j /k /l /m
/n /o /p /q /r
/s /t /u /v /w
/x /y /z /braceleft /bar
/braceright /asciitilde /bullet /Euro /bullet
/quotesinglbase /florin /quotedblbase /ellipsis /dagger
/daggerdbl /circumflex /perthousand /Scaron /guilsinglleft
/OE /bullet /Zcaron /bullet /bullet
/quoteleft /quoteright /quotedblleft /quotedblright /bullet
/endash /emdash /asciitilde /trademark /scaron
/guilsinglright /oe /bullet /zcaron /Ydieresis
/space /exclamdown /cent /sterling /currency
/yen /brokenbar /section /dieresis /copyright
/ordfeminine /guillemotleft /logicalnot /sfthyphen /registered
/macron /degree /plusminus /twosuperior /threesuperior
/acute /mu /paragraph /middot /cedilla
/onesuperior /ordmasculine /guillemotright /onequarter /onehalf
/threequarters /questiondown /Agrave /Aacute /Acircumflex
/Atilde /Adieresis /Aring /AE /Ccedilla
/Egrave /Eacute /Ecircumflex /Edieresis /Igrave
/Iacute /Icircumflex /Idieresis /Eth /Ntilde
/Ograve /Oacute /Ocircumflex /Otilde /Odieresis
/multiply /Oslash /Ugrave /Uacute /Ucircumflex
/Udieresis /Yacute /Thorn /germandbls /agrave
/aacute /acircumflex /atilde /adieresis /aring
/ae /ccedilla /egrave /eacute /ecircumflex
/edieresis /igrave /iacute /icircumflex /idieresis
/eth /ntilde /ograve /oacute /ocircumflex
/otilde /odieresis /divide /oslash /ugrave
/uacute /ucircumflex /udieresis /yacute /thorn
/ydieresis
] def
%%EndResource
%FOPBeginFontReencode
/Courier-Oblique findfont
dup length dict begin
  {1 index /FID ne {def} {pop pop} ifelse} forall
  /Encoding WinAnsiEncoding def
  currentdict
end
/Courier-Oblique exch definefont pop
/Courier-BoldOblique findfont
dup length dict begin
  {1 index /FID ne {def} {pop pop} ifelse} forall
  /Encoding WinAnsiEncoding def
  currentdict
end
/Courier-BoldOblique exch definefont pop
/Courier-Bold findfont
dup length dict begin
  {1 index /FID ne {def} {pop pop} ifelse} forall
  /Encoding WinAnsiEncoding def
  currentdict
end
/Courier-Bold exch definefont pop
/Helvetica findfont
dup length dict begin
  {1 index /FID ne {def} {pop pop} ifelse} forall
  /Encoding WinAnsiEncoding def
  currentdict
end
/Helvetica exch definefont pop
/Helvetica-Oblique findfont
dup length dict begin
  {1 index /FID ne {def} {pop pop} ifelse} forall
  /Encoding WinAnsiEncoding def
  currentdict
end
/Helvetica-Oblique exch definefont pop
/Helvetica-Bold findfont
dup length dict begin
  {1 index /FID ne {def} {pop pop} ifelse} forall
  /Encoding WinAnsiEncoding def
  currentdict
end
/Helvetica-Bold exch definefont pop
/Helvetica-BoldOblique findfont
dup length dict begin
  {1 index /FID ne {def} {pop pop} ifelse} forall
  /Encoding WinAnsiEncoding def
  currentdict
end
/Helvetica-BoldOblique exch definefont pop
/Times-Roman findfont
dup length dict begin
  {1 index /FID ne {def} {pop pop} ifelse} forall
  /Encoding WinAnsiEncoding def
  currentdict
end
/Times-Roman exch definefont pop
/Times-Italic findfont
dup length dict begin
  {1 index /FID ne {def} {pop pop} ifelse} forall
  /Encoding WinAnsiEncoding def
  currentdict
end
/Times-Italic exch definefont pop
/Times-Bold findfont
dup length dict begin
  {1 index /FID ne {def} {pop pop} ifelse} forall
  /Encoding WinAnsiEncoding def
  currentdict
end
/Times-Bold exch definefont pop
/Times-BoldItalic findfont
dup length dict begin
  {1 index /FID ne {def} {pop pop} ifelse} forall
  /Encoding WinAnsiEncoding def
  currentdict
end
/Times-BoldItalic exch definefont pop
/Courier findfont
dup length dict begin
  {1 index /FID ne {def} {pop pop} ifelse} forall
  /Encoding WinAnsiEncoding def
  currentdict
end
/Courier exch definefont pop
%FOPEndFontReencode
%%EndProlog
%%Page: 1 1
%%PageBoundingBox: 0 0 198 283
%%BeginPageSetup
[1 0 0 -1 0 283] CT
%%EndPageSetup
GS
[1.00215 0 0 1 0 0] CT
1 GC
N
0 0 198 283 re
f
GR
GS
[1.00215 0 0 1 0 0] CT
1 GC
N
0 0 198 283 re
f
GR
GS
[1.00215 0 0 1 0 0] CT
1 GC
N
52 228 M
179 228 L
179 32 L
52 32 L
cp
f
GR
GS
[1.00215 0 0 1 0 0] CT
0.149 GC
2 setlinecap
1 LJ
0.5 LW
N
52 228 M
179 228 L
S
GR
GS
[1.00215 0 0 1 0 0] CT
0.149 GC
2 setlinecap
1 LJ
0.5 LW
N
90.1 228 M
90.1 226.04 L
S
GR
GS
[1.00215 0 0 1 0 0] CT
0.149 GC
2 setlinecap
1 LJ
0.5 LW
N
140.9 228 M
140.9 226.04 L
S
GR
GS
[1.00215 0 0 1 90.29349 234] CT
0.149 GC
/Helvetica 20 F
GS
[1 0 0 1 0 0] CT
-13 20 moveto 
1 -1 scale
(YA) t 
GR
GR
GS
[1.00215 0 0 1 141.20257 234] CT
0.149 GC
/Helvetica 20 F
GS
[1 0 0 1 0 0] CT
-14.5 20 moveto 
1 -1 scale
(OA) t 
GR
GR
GS
[1.00215 0 0 1 115.7481 259] CT
0.149 GC
/Helvetica 20 F
GS
[1 0 0 1 0 0] CT
-49 20 moveto 
1 -1 scale
(Age Group) t 
GR
GR
GS
[1.00215 0 0 1 0 0] CT
0.149 GC
2 setlinecap
1 LJ
0.5 LW
N
52 228 M
52 32 L
S
GR
GS
[1.00215 0 0 1 0 0] CT
0.149 GC
2 setlinecap
1 LJ
0.5 LW
N
52 228 M
53.96 228 L
S
GR
GS
[1.00215 0 0 1 0 0] CT
0.149 GC
2 setlinecap
1 LJ
0.5 LW
N
52 179 M
53.96 179 L
S
GR
GS
[1.00215 0 0 1 0 0] CT
0.149 GC
2 setlinecap
1 LJ
0.5 LW
N
52 130 M
53.96 130 L
S
GR
GS
[1.00215 0 0 1 0 0] CT
0.149 GC
2 setlinecap
1 LJ
0.5 LW
N
52 81 M
53.96 81 L
S
GR
GS
[1.00215 0 0 1 0 0] CT
0.149 GC
2 setlinecap
1 LJ
0.5 LW
N
52 32 M
53.96 32 L
S
GR
GS
[1.00215 0 0 1 46.09878 228] CT
0.149 GC
/Helvetica 20 F
GS
[1 0 0 1 0 0] CT
-19 7.5 moveto 
1 -1 scale
(-4) t 
GR
GR
GS
[1.00215 0 0 1 46.09878 179] CT
0.149 GC
/Helvetica 20 F
GS
[1 0 0 1 0 0] CT
-19 7.5 moveto 
1 -1 scale
(-2) t 
GR
GR
GS
[1.00215 0 0 1 46.09878 130] CT
0.149 GC
/Helvetica 20 F
GS
[1 0 0 1 0 0] CT
-12 7.5 moveto 
1 -1 scale
(0) t 
GR
GR
GS
[1.00215 0 0 1 46.09878 81] CT
0.149 GC
/Helvetica 20 F
GS
[1 0 0 1 0 0] CT
-12 7.5 moveto 
1 -1 scale
(2) t 
GR
GR
GS
[1.00215 0 0 1 46.09878 32] CT
0.149 GC
/Helvetica 20 F
GS
[1 0 0 1 0 0] CT
-12 7.5 moveto 
1 -1 scale
(4) t 
GR
GR
GS
[0 -1 1.00215 0 24.05154 129.99991] CT
0.149 GC
/Helvetica 20 F
GS
[1 0 0 1 0 0] CT
-72.5 -5 moveto 
1 -1 scale
(cppthresh linear) t 
GR
GR
GS
[1.00215 0 0 1 52.11167 27] CT
0.149 GC
N
2.938 -0.578 M
2.938 -0.734 3.031 -0.859 QT
7.203 -5 L
3.031 -9.156 L
2.938 -9.266 2.938 -9.422 QT
2.938 -9.578 3.055 -9.703 QT
3.172 -9.828 3.344 -9.828 QT
3.484 -9.828 3.641 -9.703 QT
7.781 -5.563 L
11.906 -9.703 L
12.078 -9.828 12.203 -9.828 QT
12.359 -9.828 12.477 -9.711 QT
12.594 -9.594 12.594 -9.422 QT
12.594 -9.266 12.5 -9.156 QT
8.344 -5 L
12.5 -0.859 L
12.594 -0.734 12.594 -0.578 QT
12.594 -0.406 12.477 -0.289 QT
12.359 -0.172 12.203 -0.172 QT
12.047 -0.172 11.906 -0.328 QT
7.781 -4.438 L
3.641 -0.328 L
3.5 -0.172 3.344 -0.172 QT
3.172 -0.172 3.055 -0.305 QT
2.938 -0.438 2.938 -0.578 QT
cp
f
GR
GS
[1.00215 0 0 1 68.14603 27] CT
0.149 GC
/Helvetica 20 F
GS
[1 0 0 1 0 0] CT
0 0 moveto 
1 -1 scale
(10) t 
GR
GR
GS
[1.00215 0 0 1 91.19542 17] CT
0.149 GC
/Helvetica 16 F
GS
[1 0 0 1 0 0] CT
0 0 moveto 
1 -1 scale
(-4) t 
GR
GR
GS
[1.00215 0 0 1 115.74814 29.25] CT
/Helvetica-Bold 22 F
GS
[1 0 0 1 0 0] CT
-41 -5 moveto 
1 -1 scale
(p = 0.03) t 
GR
GR
GS
[1.00215 0 0 1 0 0] CT
0.149 GC
1 LJ
0.5 LW
N
52 130 M
179 130 L
S
GR
GS
[1.00215 0 0 1 0 0] CT
0.6 GC
N
69.78 130 M
69.78 135.315 L
110.42 135.315 L
110.42 130 L
cp
f
GR
GS
[1.00215 0 0 1 89.29485 112.00234] CT
0.302 GC
N
2.236 0 M
2.236 -1.235 1.235 -2.236 0 -2.236 C
-1.235 -2.236 -2.236 -1.235 -2.236 0 C
-2.236 1.235 -1.235 2.236 0 2.236 C
1.235 2.236 2.236 1.235 2.236 0 C
cp
f
GR
GS
[1.00215 0 0 1 98.98117 140.57573] CT
0.302 GC
N
/f-1586420743{2.236 0 M
2.236 -1.235 1.235 -2.236 0 -2.236 C
-1.235 -2.236 -2.236 -1.235 -2.236 0 C
-2.236 1.235 -1.235 2.236 0 2.236 C
1.235 2.236 2.236 1.235 2.236 0 C
cp}def
f-1586420743
f
GR
GS
[1.00215 0 0 1 82.76514 123.88693] CT
0.302 GC
N
f-1586420743
f
GR
GS
[1.00215 0 0 1 84.35135 148.19656] CT
0.302 GC
N
f-1586420743
f
GR
GS
[1.00215 0 0 1 84.00782 131.78825] CT
0.302 GC
N
f-1586420743
f
GR
GS
[1.00215 0 0 1 87.88377 59.10035] CT
0.302 GC
N
f-1586420743
f
GR
GS
[1.00215 0 0 1 92.77979 161.26405] CT
0.302 GC
N
f-1586420743
f
GR
GS
[1.00215 0 0 1 83.69501 89.1341] CT
0.302 GC
N
f-1586420743
f
GR
GS
[1.00215 0 0 1 93.22199 134.89734] CT
0.302 GC
N
f-1586420743
f
GR
GS
[1.00215 0 0 1 84.81418 137.0363] CT
0.302 GC
N
f-1586420743
f
GR
GS
[1.00215 0 0 1 98.75074 139.48857] CT
0.302 GC
N
f-1586420743
f
GR
GS
[1.00215 0 0 1 96.85836 188.79326] CT
0.302 GC
N
f-1586420743
f
GR
GS
[1.00215 0 0 1 94.47236 83.07443] CT
0.302 GC
N
f-1586420743
f
GR
GS
[1.00215 0 0 1 85.76907 154.72897] CT
0.302 GC
N
f-1586420743
f
GR
GS
[1.00215 0 0 1 99.67701 90.3064] CT
0.302 GC
N
f-1586420743
f
GR
GS
[1.00215 0 0 1 98.78649 146.3307] CT
0.302 GC
N
f-1586420743
f
GR
GS
[1.00215 0 0 1 88.77721 155.07149] CT
0.302 GC
N
f-1586420743
f
GR
GS
[1.00215 0 0 1 96.71044 151.05037] CT
0.302 GC
N
f-1586420743
f
GR
GS
[1.00215 0 0 1 83.08747 126.65944] CT
0.302 GC
N
f-1586420743
f
GR
GS
[1.00215 0 0 1 95.13607 169.05048] CT
0.302 GC
N
f-1586420743
f
GR
GS
[1.00215 0 0 1 89.99319 132.37628] CT
0.302 GC
N
f-1586420743
f
GR
GS
[1.00215 0 0 1 90.34733 197.14421] CT
0.302 GC
N
f-1586420743
f
GR
GS
[1.00215 0 0 1 85.73374 179.48987] CT
0.302 GC
N
f-1586420743
f
GR
GS
[1.00215 0 0 1 87.07341 56.89824] CT
0.302 GC
N
f-1586420743
f
GR
GS
[1.00215 0 0 1 94.81882 125.12011] CT
0.302 GC
N
f-1586420743
f
GR
GS
[1.00215 0 0 1 95.45052 104.46324] CT
0.302 GC
N
f-1586420743
f
GR
GS
[1.00215 0 0 1 98.07619 119.90053] CT
0.302 GC
N
f-1586420743
f
GR
GS
[1.00215 0 0 1 82.36309 150.06796] CT
0.302 GC
N
f-1586420743
f
GR
GS
[1.00215 0 0 1 99.25029 173.01828] CT
0.302 GC
N
f-1586420743
f
GR
GS
[1.00215 0 0 1 82.6275 183.74042] CT
0.302 GC
N
f-1586420743
f
GR
GS
[1.00215 0 0 1 81.18507 85.23402] CT
0.302 GC
N
f-1586420743
f
GR
GS
[1.00215 0 0 1 80.25629 168.40512] CT
0.302 GC
N
f-1586420743
f
GR
GS
[1.00215 0 0 1 89.78269 74.57697] CT
0.302 GC
N
f-1586420743
f
GR
GS
[1.00215 0 0 1 93.16471 148.14183] CT
0.302 GC
N
f-1586420743
f
GR
GS
[1.00215 0 0 1 97.41908 173.76447] CT
0.302 GC
N
f-1586420743
f
GR
GS
[1.00215 0 0 1 88.17027 149.61035] CT
0.302 GC
N
f-1586420743
f
GR
GS
[1.00215 0 0 1 95.32403 130.75343] CT
0.302 GC
N
f-1586420743
f
GR
GS
[1.00215 0 0 1 83.31655 138.1376] CT
0.302 GC
N
f-1586420743
f
GR
GS
[1.00215 0 0 1 95.94974 163.51549] CT
0.302 GC
N
f-1586420743
f
GR
GS
[1.00215 0 0 1 85.55914 77.27999] CT
0.302 GC
N
f-1586420743
f
GR
GS
[1.00215 0 0 1 89.20367 193.77481] CT
0.302 GC
N
f-1586420743
f
GR
GS
[1.00215 0 0 1 82.25334 115.38416] CT
0.302 GC
N
f-1586420743
f
GR
GS
[1.00215 0 0 1 0 0] CT
0.6 0.8 1 RC
N
/f-1478527154{120.58 130 M
120.58 148.848 L
161.22 148.848 L
161.22 130 L
cp}def
f-1478527154
f
GR
GS
[1.00215 0 0 1 142.0578 180.34688] CT
0.302 GC
N
f-1586420743
f
GR
GS
[1.00215 0 0 1 147.39451 144.2471] CT
0.302 GC
N
f-1586420743
f
GR
GS
[1.00215 0 0 1 140.82914 194.13803] CT
0.302 GC
N
f-1586420743
f
GR
GS
[1.00215 0 0 1 133.69512 130.15315] CT
0.302 GC
N
f-1586420743
f
GR
GS
[1.00215 0 0 1 134.91597 168.56702] CT
0.302 GC
N
f-1586420743
f
GR
GS
[1.00215 0 0 1 140.80571 121.24946] CT
0.302 GC
N
f-1586420743
f
GR
GS
[1.00215 0 0 1 143.64733 164.82959] CT
0.302 GC
N
f-1586420743
f
GR
GS
[1.00215 0 0 1 138.95705 143.55107] CT
0.302 GC
N
f-1586420743
f
GR
GS
[1.00215 0 0 1 145.86892 152.2794] CT
0.302 GC
N
f-1586420743
f
GR
GS
[1.00215 0 0 1 150.27816 158.91853] CT
0.302 GC
N
f-1586420743
f
GR
GS
[1.00215 0 0 1 132.53387 130.55342] CT
0.302 GC
N
f-1586420743
f
GR
GS
[1.00215 0 0 1 140.161 97.4762] CT
0.302 GC
N
f-1586420743
f
GR
GS
[1.00215 0 0 1 149.63304 131.97379] CT
0.302 GC
N
f-1586420743
f
GR
GS
[1.00215 0 0 1 140.90505 134.12053] CT
0.302 GC
N
f-1586420743
f
GR
GS
[1.00215 0 0 1 139.08624 142.00636] CT
0.302 GC
N
f-1586420743
f
GR
GS
[1.00215 0 0 1 148.14064 164.77448] CT
0.302 GC
N
f-1586420743
f
GR
GS
[1.00215 0 0 1 143.53659 146.70668] CT
0.302 GC
N
f-1586420743
f
GR
GS
[1.00215 0 0 1 141.61153 167.12776] CT
0.302 GC
N
f-1586420743
f
GR
GS
[1.00215 0 0 1 146.34623 132.19008] CT
0.302 GC
N
f-1586420743
f
GR
GS
[1.00215 0 0 1 135.87536 135.9391] CT
0.302 GC
N
f-1586420743
f
GR
GS
[1.00215 0 0 1 149.166 194.13803] CT
0.302 GC
N
f-1586420743
f
GR
GS
[1.00215 0 0 1 144.02827 194.13803] CT
0.302 GC
N
f-1586420743
f
GR
GS
[1.00215 0 0 1 139.4962 137.41711] CT
0.302 GC
N
f-1586420743
f
GR
GS
[1.00215 0 0 1 142.15879 174.27377] CT
0.302 GC
N
f-1586420743
f
GR
GS
[1.00215 0 0 1 140.25607 168.94997] CT
0.302 GC
N
f-1586420743
f
GR
GS
[1.00215 0 0 1 143.09152 141.84818] CT
0.302 GC
N
f-1586420743
f
GR
GS
[1.00215 0 0 1 145.5496 153.48193] CT
0.302 GC
N
f-1586420743
f
GR
GS
[1.00215 0 0 1 141.60216 136.98566] CT
0.302 GC
N
f-1586420743
f
GR
GS
[1.00215 0 0 1 139.43727 194.13803] CT
0.302 GC
N
f-1586420743
f
GR
GS
[1.00215 0 0 1 132.4471 138.12094] CT
0.302 GC
N
f-1586420743
f
GR
GS
[1.00215 0 0 1 150.93992 130.74077] CT
0.302 GC
N
f-1586420743
f
GR
GS
[1.00215 0 0 1 140.00572 186.49185] CT
0.302 GC
N
f-1586420743
f
GR
GS
[1.00215 0 0 1 139.82606 180.26379] CT
0.302 GC
N
f-1586420743
f
GR
GS
[1.00215 0 0 1 148.33713 117.43215] CT
0.302 GC
N
f-1586420743
f
GR
GS
[1.00215 0 0 1 145.01849 142.15015] CT
0.302 GC
N
f-1586420743
f
GR
GS
[1.00215 0 0 1 144.95089 136.83192] CT
0.302 GC
N
f-1586420743
f
GR
GS
[1.00215 0 0 1 139.90328 111.48973] CT
0.302 GC
N
f-1586420743
f
GR
GS
[1.00215 0 0 1 133.06071 142.52722] CT
0.302 GC
N
f-1586420743
f
GR
GS
[1.00215 0 0 1 144.16103 97.4762] CT
0.302 GC
N
f-1586420743
f
GR
GS
[1.00215 0 0 1 133.64865 155.3898] CT
0.302 GC
N
f-1586420743
f
GR
GS
[1.00215 0 0 1 145.51976 145.27724] CT
0.302 GC
N
f-1586420743
f
GR
GS
[1.00215 0 0 1 138.65304 125.94203] CT
0.302 GC
N
f-1586420743
f
GR
GS
[1.00215 0 0 1 131.42147 139.69896] CT
0.302 GC
N
f-1586420743
f
GR
GS
[1.00215 0 0 1 143.58439 142.20335] CT
0.302 GC
N
f-1586420743
f
GR
GS
[1.00215 0 0 1 148.85935 124.06509] CT
0.302 GC
N
f-1586420743
f
GR
GS
[1.00215 0 0 1 145.79715 154.86656] CT
0.302 GC
N
f-1586420743
f
GR
GS
[1.00215 0 0 1 142.7693 127.59085] CT
0.302 GC
N
f-1586420743
f
GR
GS
[1.00215 0 0 1 147.97007 120.12948] CT
0.302 GC
N
f-1586420743
f
GR
GS
[1.00215 0 0 1 136.25355 164.31769] CT
0.302 GC
N
f-1586420743
f
GR
GS
[1.00215 0 0 1 150.4807 158.2211] CT
0.302 GC
N
f-1586420743
f
GR
GS
[1.00215 0 0 1 135.64422 169.75984] CT
0.302 GC
N
f-1586420743
f
GR
GS
[1.00215 0 0 1 133.94713 194.13803] CT
0.302 GC
N
f-1586420743
f
GR
GS
[1.00215 0 0 1 132.0297 147.27866] CT
0.302 GC
N
f-1586420743
f
GR
%%Trailer
%%Pages: 1
%%EOF
