%!PS-Adobe-3.0 EPSF-3.0
%%Creator: (MATLAB, The Mathworks, Inc. Version 9.8.0.1323502 \(R2020a\). Operating System: Mac OS X)
%%Title: /Users/kosciessa/Desktop/mntTardisLNDG/LNDG/stateswitch/stsw_multimodal/figures/l1byage/l1comp_spmlv1.eps
%%CreationDate: 2022-03-02T14:36:48
%%Pages: (atend)
%%BoundingBox:     4     0   180   278
%%LanguageLevel: 3
%%EndComments
%%BeginProlog
%%BeginResource: procset (Apache XML Graphics Std ProcSet) 1.2 0
%%Version: 1.2 0
%%Copyright: (Copyright 2001-2003,2010 The Apache Software Foundation. License terms: http://www.apache.org/licenses/LICENSE-2.0)
/bd{bind def}bind def
/ld{load def}bd
/GR/grestore ld
/GS/gsave ld
/RM/rmoveto ld
/C/curveto ld
/t/show ld
/L/lineto ld
/ML/setmiterlimit ld
/CT/concat ld
/f/fill ld
/N/newpath ld
/S/stroke ld
/CC/setcmykcolor ld
/A/ashow ld
/cp/closepath ld
/RC/setrgbcolor ld
/LJ/setlinejoin ld
/GC/setgray ld
/LW/setlinewidth ld
/M/moveto ld
/re {4 2 roll M
1 index 0 rlineto
0 exch rlineto
neg 0 rlineto
cp } bd
/_ctm matrix def
/_tm matrix def
/BT { _ctm currentmatrix pop matrix _tm copy pop 0 0 moveto } bd
/ET { _ctm setmatrix } bd
/iTm { _ctm setmatrix _tm concat } bd
/Tm { _tm astore pop iTm 0 0 moveto } bd
/ux 0.0 def
/uy 0.0 def
/F {
  /Tp exch def
  /Tf exch def
  Tf findfont Tp scalefont setfont
  /cf Tf def  /cs Tp def
} bd
/ULS {currentpoint /uy exch def /ux exch def} bd
/ULE {
  /Tcx currentpoint pop def
  gsave
  newpath
  cf findfont cs scalefont dup
  /FontMatrix get 0 get /Ts exch def /FontInfo get dup
  /UnderlinePosition get Ts mul /To exch def
  /UnderlineThickness get Ts mul /Tt exch def
  ux uy To add moveto  Tcx uy To add lineto
  Tt setlinewidth stroke
  grestore
} bd
/OLE {
  /Tcx currentpoint pop def
  gsave
  newpath
  cf findfont cs scalefont dup
  /FontMatrix get 0 get /Ts exch def /FontInfo get dup
  /UnderlinePosition get Ts mul /To exch def
  /UnderlineThickness get Ts mul /Tt exch def
  ux uy To add cs add moveto Tcx uy To add cs add lineto
  Tt setlinewidth stroke
  grestore
} bd
/SOE {
  /Tcx currentpoint pop def
  gsave
  newpath
  cf findfont cs scalefont dup
  /FontMatrix get 0 get /Ts exch def /FontInfo get dup
  /UnderlinePosition get Ts mul /To exch def
  /UnderlineThickness get Ts mul /Tt exch def
  ux uy To add cs 10 mul 26 idiv add moveto Tcx uy To add cs 10 mul 26 idiv add lineto
  Tt setlinewidth stroke
  grestore
} bd
/QT {
/Y22 exch store
/X22 exch store
/Y21 exch store
/X21 exch store
currentpoint
/Y21 load 2 mul add 3 div exch
/X21 load 2 mul add 3 div exch
/X21 load 2 mul /X22 load add 3 div
/Y21 load 2 mul /Y22 load add 3 div
/X22 load /Y22 load curveto
} bd
/SSPD {
dup length /d exch dict def
{
/v exch def
/k exch def
currentpagedevice k known {
/cpdv currentpagedevice k get def
v cpdv ne {
/upd false def
/nullv v type /nulltype eq def
/nullcpdv cpdv type /nulltype eq def
nullv nullcpdv or
{
/upd true def
} {
/sametype v type cpdv type eq def
sametype {
v type /arraytype eq {
/vlen v length def
/cpdvlen cpdv length def
vlen cpdvlen eq {
0 1 vlen 1 sub {
/i exch def
/obj v i get def
/cpdobj cpdv i get def
obj cpdobj ne {
/upd true def
exit
} if
} for
} {
/upd true def
} ifelse
} {
v type /dicttype eq {
v {
/dv exch def
/dk exch def
/cpddv cpdv dk get def
dv cpddv ne {
/upd true def
exit
} if
} forall
} {
/upd true def
} ifelse
} ifelse
} if
} ifelse
upd true eq {
d k v put
} if
} if
} if
} forall
d length 0 gt {
d setpagedevice
} if
} bd
/RE { % /NewFontName [NewEncodingArray] /FontName RE -
  findfont dup length dict begin
  {
    1 index /FID ne
    {def} {pop pop} ifelse
  } forall
  /Encoding exch def
  /FontName 1 index def
  currentdict definefont pop
  end
} bind def
%%EndResource
%%BeginResource: procset (Apache XML Graphics EPS ProcSet) 1.0 0
%%Version: 1.0 0
%%Copyright: (Copyright 2002-2003 The Apache Software Foundation. License terms: http://www.apache.org/licenses/LICENSE-2.0)
/BeginEPSF { %def
/b4_Inc_state save def         % Save state for cleanup
/dict_count countdictstack def % Count objects on dict stack
/op_count count 1 sub def      % Count objects on operand stack
userdict begin                 % Push userdict on dict stack
/showpage { } def              % Redefine showpage, { } = null proc
0 setgray 0 setlinecap         % Prepare graphics state
1 setlinewidth 0 setlinejoin
10 setmiterlimit [ ] 0 setdash newpath
/languagelevel where           % If level not equal to 1 then
{pop languagelevel             % set strokeadjust and
1 ne                           % overprint to their defaults.
{false setstrokeadjust false setoverprint
} if
} if
} bd
/EndEPSF { %def
count op_count sub {pop} repeat            % Clean up stacks
countdictstack dict_count sub {end} repeat
b4_Inc_state restore
} bd
%%EndResource
%FOPBeginFontDict
%%IncludeResource: font Courier-Oblique
%%IncludeResource: font Courier-BoldOblique
%%IncludeResource: font Courier-Bold
%%IncludeResource: font ZapfDingbats
%%IncludeResource: font Symbol
%%IncludeResource: font Helvetica
%%IncludeResource: font Helvetica-Oblique
%%IncludeResource: font Helvetica-Bold
%%IncludeResource: font Helvetica-BoldOblique
%%IncludeResource: font Times-Roman
%%IncludeResource: font Times-Italic
%%IncludeResource: font Times-Bold
%%IncludeResource: font Times-BoldItalic
%%IncludeResource: font Courier
%FOPEndFontDict
%%BeginResource: encoding WinAnsiEncoding
/WinAnsiEncoding [
/.notdef /.notdef /.notdef /.notdef /.notdef
/.notdef /.notdef /.notdef /.notdef /.notdef
/.notdef /.notdef /.notdef /.notdef /.notdef
/.notdef /.notdef /.notdef /.notdef /.notdef
/.notdef /.notdef /.notdef /.notdef /.notdef
/.notdef /.notdef /.notdef /.notdef /.notdef
/.notdef /.notdef /space /exclam /quotedbl
/numbersign /dollar /percent /ampersand /quotesingle
/parenleft /parenright /asterisk /plus /comma
/hyphen /period /slash /zero /one
/two /three /four /five /six
/seven /eight /nine /colon /semicolon
/less /equal /greater /question /at
/A /B /C /D /E
/F /G /H /I /J
/K /L /M /N /O
/P /Q /R /S /T
/U /V /W /X /Y
/Z /bracketleft /backslash /bracketright /asciicircum
/underscore /quoteleft /a /b /c
/d /e /f /g /h
/i /j /k /l /m
/n /o /p /q /r
/s /t /u /v /w
/x /y /z /braceleft /bar
/braceright /asciitilde /bullet /Euro /bullet
/quotesinglbase /florin /quotedblbase /ellipsis /dagger
/daggerdbl /circumflex /perthousand /Scaron /guilsinglleft
/OE /bullet /Zcaron /bullet /bullet
/quoteleft /quoteright /quotedblleft /quotedblright /bullet
/endash /emdash /asciitilde /trademark /scaron
/guilsinglright /oe /bullet /zcaron /Ydieresis
/space /exclamdown /cent /sterling /currency
/yen /brokenbar /section /dieresis /copyright
/ordfeminine /guillemotleft /logicalnot /sfthyphen /registered
/macron /degree /plusminus /twosuperior /threesuperior
/acute /mu /paragraph /middot /cedilla
/onesuperior /ordmasculine /guillemotright /onequarter /onehalf
/threequarters /questiondown /Agrave /Aacute /Acircumflex
/Atilde /Adieresis /Aring /AE /Ccedilla
/Egrave /Eacute /Ecircumflex /Edieresis /Igrave
/Iacute /Icircumflex /Idieresis /Eth /Ntilde
/Ograve /Oacute /Ocircumflex /Otilde /Odieresis
/multiply /Oslash /Ugrave /Uacute /Ucircumflex
/Udieresis /Yacute /Thorn /germandbls /agrave
/aacute /acircumflex /atilde /adieresis /aring
/ae /ccedilla /egrave /eacute /ecircumflex
/edieresis /igrave /iacute /icircumflex /idieresis
/eth /ntilde /ograve /oacute /ocircumflex
/otilde /odieresis /divide /oslash /ugrave
/uacute /ucircumflex /udieresis /yacute /thorn
/ydieresis
] def
%%EndResource
%FOPBeginFontReencode
/Courier-Oblique findfont
dup length dict begin
  {1 index /FID ne {def} {pop pop} ifelse} forall
  /Encoding WinAnsiEncoding def
  currentdict
end
/Courier-Oblique exch definefont pop
/Courier-BoldOblique findfont
dup length dict begin
  {1 index /FID ne {def} {pop pop} ifelse} forall
  /Encoding WinAnsiEncoding def
  currentdict
end
/Courier-BoldOblique exch definefont pop
/Courier-Bold findfont
dup length dict begin
  {1 index /FID ne {def} {pop pop} ifelse} forall
  /Encoding WinAnsiEncoding def
  currentdict
end
/Courier-Bold exch definefont pop
/Helvetica findfont
dup length dict begin
  {1 index /FID ne {def} {pop pop} ifelse} forall
  /Encoding WinAnsiEncoding def
  currentdict
end
/Helvetica exch definefont pop
/Helvetica-Oblique findfont
dup length dict begin
  {1 index /FID ne {def} {pop pop} ifelse} forall
  /Encoding WinAnsiEncoding def
  currentdict
end
/Helvetica-Oblique exch definefont pop
/Helvetica-Bold findfont
dup length dict begin
  {1 index /FID ne {def} {pop pop} ifelse} forall
  /Encoding WinAnsiEncoding def
  currentdict
end
/Helvetica-Bold exch definefont pop
/Helvetica-BoldOblique findfont
dup length dict begin
  {1 index /FID ne {def} {pop pop} ifelse} forall
  /Encoding WinAnsiEncoding def
  currentdict
end
/Helvetica-BoldOblique exch definefont pop
/Times-Roman findfont
dup length dict begin
  {1 index /FID ne {def} {pop pop} ifelse} forall
  /Encoding WinAnsiEncoding def
  currentdict
end
/Times-Roman exch definefont pop
/Times-Italic findfont
dup length dict begin
  {1 index /FID ne {def} {pop pop} ifelse} forall
  /Encoding WinAnsiEncoding def
  currentdict
end
/Times-Italic exch definefont pop
/Times-Bold findfont
dup length dict begin
  {1 index /FID ne {def} {pop pop} ifelse} forall
  /Encoding WinAnsiEncoding def
  currentdict
end
/Times-Bold exch definefont pop
/Times-BoldItalic findfont
dup length dict begin
  {1 index /FID ne {def} {pop pop} ifelse} forall
  /Encoding WinAnsiEncoding def
  currentdict
end
/Times-BoldItalic exch definefont pop
/Courier findfont
dup length dict begin
  {1 index /FID ne {def} {pop pop} ifelse} forall
  /Encoding WinAnsiEncoding def
  currentdict
end
/Courier exch definefont pop
%FOPEndFontReencode
%%EndProlog
%%Page: 1 1
%%PageBoundingBox: 0 0 198 283
%%BeginPageSetup
[1 0 0 -1 0 283] CT
%%EndPageSetup
GS
[1.00215 0 0 1 0 0] CT
1 GC
N
0 0 198 283 re
f
GR
GS
[1.00215 0 0 1 0 0] CT
1 GC
N
0 0 198 283 re
f
GR
GS
[1.00215 0 0 1 0 0] CT
1 GC
N
52 228 M
179 228 L
179 32 L
52 32 L
cp
f
GR
GS
[1.00215 0 0 1 0 0] CT
0.149 GC
2 setlinecap
1 LJ
0.5 LW
N
52 228 M
179 228 L
S
GR
GS
[1.00215 0 0 1 0 0] CT
0.149 GC
2 setlinecap
1 LJ
0.5 LW
N
90.1 228 M
90.1 226.04 L
S
GR
GS
[1.00215 0 0 1 0 0] CT
0.149 GC
2 setlinecap
1 LJ
0.5 LW
N
140.9 228 M
140.9 226.04 L
S
GR
GS
[1.00215 0 0 1 90.29349 234] CT
0.149 GC
/Helvetica 20 F
GS
[1 0 0 1 0 0] CT
-13 20 moveto 
1 -1 scale
(YA) t 
GR
GR
GS
[1.00215 0 0 1 141.20257 234] CT
0.149 GC
/Helvetica 20 F
GS
[1 0 0 1 0 0] CT
-14.5 20 moveto 
1 -1 scale
(OA) t 
GR
GR
GS
[1.00215 0 0 1 115.7481 259] CT
0.149 GC
/Helvetica 20 F
GS
[1 0 0 1 0 0] CT
-49 20 moveto 
1 -1 scale
(Age Group) t 
GR
GR
GS
[1.00215 0 0 1 0 0] CT
0.149 GC
2 setlinecap
1 LJ
0.5 LW
N
52 228 M
52 32 L
S
GR
GS
[1.00215 0 0 1 0 0] CT
0.149 GC
2 setlinecap
1 LJ
0.5 LW
N
52 228 M
53.96 228 L
S
GR
GS
[1.00215 0 0 1 0 0] CT
0.149 GC
2 setlinecap
1 LJ
0.5 LW
N
52 166.713 M
53.96 166.713 L
S
GR
GS
[1.00215 0 0 1 0 0] CT
0.149 GC
2 setlinecap
1 LJ
0.5 LW
N
52 105.427 M
53.96 105.427 L
S
GR
GS
[1.00215 0 0 1 0 0] CT
0.149 GC
2 setlinecap
1 LJ
0.5 LW
N
52 44.14 M
53.96 44.14 L
S
GR
GS
[1.00215 0 0 1 46.09878 228] CT
0.149 GC
/Helvetica 20 F
GS
[1 0 0 1 0 0] CT
-19 7.5 moveto 
1 -1 scale
(-2) t 
GR
GR
GS
[1.00215 0 0 1 46.09878 166.71335] CT
0.149 GC
/Helvetica 20 F
GS
[1 0 0 1 0 0] CT
-19 7.5 moveto 
1 -1 scale
(-1) t 
GR
GR
GS
[1.00215 0 0 1 46.09878 105.42669] CT
0.149 GC
/Helvetica 20 F
GS
[1 0 0 1 0 0] CT
-12 7.5 moveto 
1 -1 scale
(0) t 
GR
GR
GS
[1.00215 0 0 1 46.09878 44.14004] CT
0.149 GC
/Helvetica 20 F
GS
[1 0 0 1 0 0] CT
-12 7.5 moveto 
1 -1 scale
(1) t 
GR
GR
GS
[0 -1 1.00215 0 24.05154 129.99991] CT
0.149 GC
/Helvetica 20 F
GS
[1 0 0 1 0 0] CT
-43 -5 moveto 
1 -1 scale
(spmlv1 l1) t 
GR
GR
GS
[1.00215 0 0 1 52.11167 27] CT
0.149 GC
N
2.938 -0.578 M
2.938 -0.734 3.031 -0.859 QT
7.203 -5 L
3.031 -9.156 L
2.938 -9.266 2.938 -9.422 QT
2.938 -9.578 3.055 -9.703 QT
3.172 -9.828 3.344 -9.828 QT
3.484 -9.828 3.641 -9.703 QT
7.781 -5.563 L
11.906 -9.703 L
12.078 -9.828 12.203 -9.828 QT
12.359 -9.828 12.477 -9.711 QT
12.594 -9.594 12.594 -9.422 QT
12.594 -9.266 12.5 -9.156 QT
8.344 -5 L
12.5 -0.859 L
12.594 -0.734 12.594 -0.578 QT
12.594 -0.406 12.477 -0.289 QT
12.359 -0.172 12.203 -0.172 QT
12.047 -0.172 11.906 -0.328 QT
7.781 -4.438 L
3.641 -0.328 L
3.5 -0.172 3.344 -0.172 QT
3.172 -0.172 3.055 -0.305 QT
2.938 -0.438 2.938 -0.578 QT
cp
f
GR
GS
[1.00215 0 0 1 68.14603 27] CT
0.149 GC
/Helvetica 20 F
GS
[1 0 0 1 0 0] CT
0 0 moveto 
1 -1 scale
(10) t 
GR
GR
GS
[1.00215 0 0 1 91.19542 17] CT
0.149 GC
/Helvetica 16 F
GS
[1 0 0 1 0 0] CT
0 0 moveto 
1 -1 scale
(4) t 
GR
GR
GS
[1.00215 0 0 1 115.74814 29.25] CT
/Helvetica-Bold 22 F
GS
[1 0 0 1 0 0] CT
-41 -5 moveto 
1 -1 scale
(p = 0.14) t 
GR
GR
GS
[1.00215 0 0 1 0 0] CT
0.149 GC
1 LJ
0.5 LW
N
52 105.427 M
179 105.427 L
S
GR
GS
[1.00215 0 0 1 0 0] CT
0.6 0.8 1 RC
N
69.78 105.427 M
69.78 132.874 L
110.42 132.874 L
110.42 105.427 L
cp
f
GR
GS
[1.00215 0 0 1 80.44062 92.45235] CT
0.302 GC
N
2.236 0 M
2.236 -1.235 1.235 -2.236 0 -2.236 C
-1.235 -2.236 -2.236 -1.235 -2.236 0 C
-2.236 1.235 -1.235 2.236 0 2.236 C
1.235 2.236 2.236 1.235 2.236 0 C
cp
f
GR
GS
[1.00215 0 0 1 97.0342 91.91344] CT
0.302 GC
N
/f-1586420743{2.236 0 M
2.236 -1.235 1.235 -2.236 0 -2.236 C
-1.235 -2.236 -2.236 -1.235 -2.236 0 C
-2.236 1.235 -1.235 2.236 0 2.236 C
1.235 2.236 2.236 1.235 2.236 0 C
cp}def
f-1586420743
f
GR
GS
[1.00215 0 0 1 89.44947 129.57526] CT
0.302 GC
N
f-1586420743
f
GR
GS
[1.00215 0 0 1 85.65667 121.86681] CT
0.302 GC
N
f-1586420743
f
GR
GS
[1.00215 0 0 1 80.95228 142.31102] CT
0.302 GC
N
f-1586420743
f
GR
GS
[1.00215 0 0 1 96.68839 168.0475] CT
0.302 GC
N
f-1586420743
f
GR
GS
[1.00215 0 0 1 95.26671 192.82742] CT
0.302 GC
N
f-1586420743
f
GR
GS
[1.00215 0 0 1 84.44859 127.3226] CT
0.302 GC
N
f-1586420743
f
GR
GS
[1.00215 0 0 1 86.17197 56.99437] CT
0.302 GC
N
f-1586420743
f
GR
GS
[1.00215 0 0 1 90.38908 140.30453] CT
0.302 GC
N
f-1586420743
f
GR
GS
[1.00215 0 0 1 94.55991 131.39017] CT
0.302 GC
N
f-1586420743
f
GR
GS
[1.00215 0 0 1 97.63833 149.18509] CT
0.302 GC
N
f-1586420743
f
GR
GS
[1.00215 0 0 1 88.67903 90.13563] CT
0.302 GC
N
f-1586420743
f
GR
GS
[1.00215 0 0 1 83.91419 138.76422] CT
0.302 GC
N
f-1586420743
f
GR
GS
[1.00215 0 0 1 96.83096 126.15236] CT
0.302 GC
N
f-1586420743
f
GR
GS
[1.00215 0 0 1 91.6773 126.02722] CT
0.302 GC
N
f-1586420743
f
GR
GS
[1.00215 0 0 1 87.61641 169.98959] CT
0.302 GC
N
f-1586420743
f
GR
GS
[1.00215 0 0 1 86.47764 77.98753] CT
0.302 GC
N
f-1586420743
f
GR
GS
[1.00215 0 0 1 90.32548 113.56977] CT
0.302 GC
N
f-1586420743
f
GR
GS
[1.00215 0 0 1 100.21263 157.89401] CT
0.302 GC
N
f-1586420743
f
GR
GS
[1.00215 0 0 1 91.40176 136.25002] CT
0.302 GC
N
f-1586420743
f
GR
GS
[1.00215 0 0 1 99.92538 77.16314] CT
0.302 GC
N
f-1586420743
f
GR
GS
[1.00215 0 0 1 81.0536 105.89766] CT
0.302 GC
N
f-1586420743
f
GR
GS
[1.00215 0 0 1 82.41706 163.77843] CT
0.302 GC
N
f-1586420743
f
GR
GS
[1.00215 0 0 1 81.92625 153.50026] CT
0.302 GC
N
f-1586420743
f
GR
GS
[1.00215 0 0 1 99.85346 91.71941] CT
0.302 GC
N
f-1586420743
f
GR
GS
[1.00215 0 0 1 88.16336 104.17418] CT
0.302 GC
N
f-1586420743
f
GR
GS
[1.00215 0 0 1 84.80676 134.36168] CT
0.302 GC
N
f-1586420743
f
GR
GS
[1.00215 0 0 1 90.12113 103.00375] CT
0.302 GC
N
f-1586420743
f
GR
GS
[1.00215 0 0 1 97.57408 170.47046] CT
0.302 GC
N
f-1586420743
f
GR
GS
[1.00215 0 0 1 86.04985 177.16795] CT
0.302 GC
N
f-1586420743
f
GR
GS
[1.00215 0 0 1 85.70822 188.49498] CT
0.302 GC
N
f-1586420743
f
GR
GS
[1.00215 0 0 1 91.11961 148.89771] CT
0.302 GC
N
f-1586420743
f
GR
GS
[1.00215 0 0 1 93.45758 145.5972] CT
0.302 GC
N
f-1586420743
f
GR
GS
[1.00215 0 0 1 91.45693 122.31734] CT
0.302 GC
N
f-1586420743
f
GR
GS
[1.00215 0 0 1 95.24385 192.18124] CT
0.302 GC
N
f-1586420743
f
GR
GS
[1.00215 0 0 1 87.88231 172.46101] CT
0.302 GC
N
f-1586420743
f
GR
GS
[1.00215 0 0 1 93.21005 90.24794] CT
0.302 GC
N
f-1586420743
f
GR
GS
[1.00215 0 0 1 91.79682 143.13824] CT
0.302 GC
N
f-1586420743
f
GR
GS
[1.00215 0 0 1 92.80098 95.13856] CT
0.302 GC
N
f-1586420743
f
GR
GS
[1.00215 0 0 1 98.42333 145.03508] CT
0.302 GC
N
f-1586420743
f
GR
GS
[1.00215 0 0 1 87.22567 175.01118] CT
0.302 GC
N
f-1586420743
f
GR
GS
[1.00215 0 0 1 0 0] CT
0.6 0.8 1 RC
N
/f1573791598{120.58 105.427 M
120.58 121.513 L
161.22 121.513 L
161.22 105.427 L
cp}def
f1573791598
f
GR
GS
[1.00215 0 0 1 149.44615 129.49327] CT
0.302 GC
N
f-1586420743
f
GR
GS
[1.00215 0 0 1 147.1948 132.59373] CT
0.302 GC
N
f-1586420743
f
GR
GS
[1.00215 0 0 1 143.69131 118.42858] CT
0.302 GC
N
f-1586420743
f
GR
GS
[1.00215 0 0 1 142.29717 32] CT
0.302 GC
N
f-1586420743
f
GR
GS
[1.00215 0 0 1 143.07114 163.15047] CT
0.302 GC
N
f-1586420743
f
GR
GS
[1.00215 0 0 1 141.96978 120.45366] CT
0.302 GC
N
f-1586420743
f
GR
GS
[1.00215 0 0 1 145.0054 106.59536] CT
0.302 GC
N
f-1586420743
f
GR
GS
[1.00215 0 0 1 146.51602 80.93729] CT
0.302 GC
N
f-1586420743
f
GR
GS
[1.00215 0 0 1 138.66572 103.32809] CT
0.302 GC
N
f-1586420743
f
GR
GS
[1.00215 0 0 1 139.32035 139.14786] CT
0.302 GC
N
f-1586420743
f
GR
GS
[1.00215 0 0 1 134.2038 90.69847] CT
0.302 GC
N
f-1586420743
f
GR
GS
[1.00215 0 0 1 146.02292 72.49136] CT
0.302 GC
N
f-1586420743
f
GR
GS
[1.00215 0 0 1 135.26011 141.63597] CT
0.302 GC
N
f-1586420743
f
GR
GS
[1.00215 0 0 1 132.24048 96.95142] CT
0.302 GC
N
f-1586420743
f
GR
GS
[1.00215 0 0 1 135.40169 186.99063] CT
0.302 GC
N
f-1586420743
f
GR
GS
[1.00215 0 0 1 134.83511 151.21536] CT
0.302 GC
N
f-1586420743
f
GR
GS
[1.00215 0 0 1 131.68889 204.93288] CT
0.302 GC
N
f-1586420743
f
GR
GS
[1.00215 0 0 1 138.93907 106.72491] CT
0.302 GC
N
f-1586420743
f
GR
GS
[1.00215 0 0 1 144.46428 137.64871] CT
0.302 GC
N
f-1586420743
f
GR
GS
[1.00215 0 0 1 133.634 70.531] CT
0.302 GC
N
f-1586420743
f
GR
GS
[1.00215 0 0 1 141.14976 153.92598] CT
0.302 GC
N
f-1586420743
f
GR
GS
[1.00215 0 0 1 151.19032 127.8528] CT
0.302 GC
N
f-1586420743
f
GR
GS
[1.00215 0 0 1 144.80025 74.76527] CT
0.302 GC
N
f-1586420743
f
GR
GS
[1.00215 0 0 1 144.47737 124.26774] CT
0.302 GC
N
f-1586420743
f
GR
GS
[1.00215 0 0 1 132.44645 74.44318] CT
0.302 GC
N
f-1586420743
f
GR
GS
[1.00215 0 0 1 140.18543 188.91216] CT
0.302 GC
N
f-1586420743
f
GR
GS
[1.00215 0 0 1 134.67863 177.66615] CT
0.302 GC
N
f-1586420743
f
GR
GS
[1.00215 0 0 1 138.25219 113.59629] CT
0.302 GC
N
f-1586420743
f
GR
GS
[1.00215 0 0 1 137.64776 157.2361] CT
0.302 GC
N
f-1586420743
f
GR
GS
[1.00215 0 0 1 133.95048 127.98323] CT
0.302 GC
N
f-1586420743
f
GR
GS
[1.00215 0 0 1 137.28746 52.76758] CT
0.302 GC
N
f-1586420743
f
GR
GS
[1.00215 0 0 1 143.19262 140.39217] CT
0.302 GC
N
f-1586420743
f
GR
GS
[1.00215 0 0 1 142.85183 72.82204] CT
0.302 GC
N
f-1586420743
f
GR
GS
[1.00215 0 0 1 144.35276 148.74031] CT
0.302 GC
N
f-1586420743
f
GR
GS
[1.00215 0 0 1 142.64151 157.00507] CT
0.302 GC
N
f-1586420743
f
GR
GS
[1.00215 0 0 1 144.72365 177.56146] CT
0.302 GC
N
f-1586420743
f
GR
GS
[1.00215 0 0 1 132.1183 125.27672] CT
0.302 GC
N
f-1586420743
f
GR
GS
[1.00215 0 0 1 142.05314 136.99155] CT
0.302 GC
N
f-1586420743
f
GR
GS
[1.00215 0 0 1 144.01588 160.45145] CT
0.302 GC
N
f-1586420743
f
GR
GS
[1.00215 0 0 1 150.93515 121.13696] CT
0.302 GC
N
f-1586420743
f
GR
GS
[1.00215 0 0 1 150.01979 68.00358] CT
0.302 GC
N
f-1586420743
f
GR
GS
[1.00215 0 0 1 150.44594 67.84839] CT
0.302 GC
N
f-1586420743
f
GR
GS
[1.00215 0 0 1 149.32936 96.00189] CT
0.302 GC
N
f-1586420743
f
GR
GS
[1.00215 0 0 1 134.4184 197.20139] CT
0.302 GC
N
f-1586420743
f
GR
GS
[1.00215 0 0 1 140.30329 75.76012] CT
0.302 GC
N
f-1586420743
f
GR
GS
[1.00215 0 0 1 134.01839 112.25928] CT
0.302 GC
N
f-1586420743
f
GR
GS
[1.00215 0 0 1 148.73675 161.69191] CT
0.302 GC
N
f-1586420743
f
GR
GS
[1.00215 0 0 1 151.19451 137.95416] CT
0.302 GC
N
f-1586420743
f
GR
GS
[1.00215 0 0 1 133.01272 105.88635] CT
0.302 GC
N
f-1586420743
f
GR
GS
[1.00215 0 0 1 140.26317 117.09494] CT
0.302 GC
N
f-1586420743
f
GR
GS
[1.00215 0 0 1 138.19275 121.05968] CT
0.302 GC
N
f-1586420743
f
GR
GS
[1.00215 0 0 1 144.48631 109.25959] CT
0.302 GC
N
f-1586420743
f
GR
GS
[1.00215 0 0 1 144.45674 70.44917] CT
0.302 GC
N
f-1586420743
f
GR
%%Trailer
%%Pages: 1
%%EOF
