%!PS-Adobe-3.0 EPSF-3.0
%%Creator: (MATLAB, The Mathworks, Inc. Version 9.8.0.1323502 \(R2020a\). Operating System: Mac OS X)
%%Title: /Users/kosciessa/Desktop/mntTardisLNDG/LNDG/stateswitch/stsw_multimodal/figures/l1byage/l1comp_1f.eps
%%CreationDate: 2022-03-02T14:36:48
%%Pages: (atend)
%%BoundingBox:     4     0   180   275
%%LanguageLevel: 3
%%EndComments
%%BeginProlog
%%BeginResource: procset (Apache XML Graphics Std ProcSet) 1.2 0
%%Version: 1.2 0
%%Copyright: (Copyright 2001-2003,2010 The Apache Software Foundation. License terms: http://www.apache.org/licenses/LICENSE-2.0)
/bd{bind def}bind def
/ld{load def}bd
/GR/grestore ld
/GS/gsave ld
/RM/rmoveto ld
/C/curveto ld
/t/show ld
/L/lineto ld
/ML/setmiterlimit ld
/CT/concat ld
/f/fill ld
/N/newpath ld
/S/stroke ld
/CC/setcmykcolor ld
/A/ashow ld
/cp/closepath ld
/RC/setrgbcolor ld
/LJ/setlinejoin ld
/GC/setgray ld
/LW/setlinewidth ld
/M/moveto ld
/re {4 2 roll M
1 index 0 rlineto
0 exch rlineto
neg 0 rlineto
cp } bd
/_ctm matrix def
/_tm matrix def
/BT { _ctm currentmatrix pop matrix _tm copy pop 0 0 moveto } bd
/ET { _ctm setmatrix } bd
/iTm { _ctm setmatrix _tm concat } bd
/Tm { _tm astore pop iTm 0 0 moveto } bd
/ux 0.0 def
/uy 0.0 def
/F {
  /Tp exch def
  /Tf exch def
  Tf findfont Tp scalefont setfont
  /cf Tf def  /cs Tp def
} bd
/ULS {currentpoint /uy exch def /ux exch def} bd
/ULE {
  /Tcx currentpoint pop def
  gsave
  newpath
  cf findfont cs scalefont dup
  /FontMatrix get 0 get /Ts exch def /FontInfo get dup
  /UnderlinePosition get Ts mul /To exch def
  /UnderlineThickness get Ts mul /Tt exch def
  ux uy To add moveto  Tcx uy To add lineto
  Tt setlinewidth stroke
  grestore
} bd
/OLE {
  /Tcx currentpoint pop def
  gsave
  newpath
  cf findfont cs scalefont dup
  /FontMatrix get 0 get /Ts exch def /FontInfo get dup
  /UnderlinePosition get Ts mul /To exch def
  /UnderlineThickness get Ts mul /Tt exch def
  ux uy To add cs add moveto Tcx uy To add cs add lineto
  Tt setlinewidth stroke
  grestore
} bd
/SOE {
  /Tcx currentpoint pop def
  gsave
  newpath
  cf findfont cs scalefont dup
  /FontMatrix get 0 get /Ts exch def /FontInfo get dup
  /UnderlinePosition get Ts mul /To exch def
  /UnderlineThickness get Ts mul /Tt exch def
  ux uy To add cs 10 mul 26 idiv add moveto Tcx uy To add cs 10 mul 26 idiv add lineto
  Tt setlinewidth stroke
  grestore
} bd
/QT {
/Y22 exch store
/X22 exch store
/Y21 exch store
/X21 exch store
currentpoint
/Y21 load 2 mul add 3 div exch
/X21 load 2 mul add 3 div exch
/X21 load 2 mul /X22 load add 3 div
/Y21 load 2 mul /Y22 load add 3 div
/X22 load /Y22 load curveto
} bd
/SSPD {
dup length /d exch dict def
{
/v exch def
/k exch def
currentpagedevice k known {
/cpdv currentpagedevice k get def
v cpdv ne {
/upd false def
/nullv v type /nulltype eq def
/nullcpdv cpdv type /nulltype eq def
nullv nullcpdv or
{
/upd true def
} {
/sametype v type cpdv type eq def
sametype {
v type /arraytype eq {
/vlen v length def
/cpdvlen cpdv length def
vlen cpdvlen eq {
0 1 vlen 1 sub {
/i exch def
/obj v i get def
/cpdobj cpdv i get def
obj cpdobj ne {
/upd true def
exit
} if
} for
} {
/upd true def
} ifelse
} {
v type /dicttype eq {
v {
/dv exch def
/dk exch def
/cpddv cpdv dk get def
dv cpddv ne {
/upd true def
exit
} if
} forall
} {
/upd true def
} ifelse
} ifelse
} if
} ifelse
upd true eq {
d k v put
} if
} if
} if
} forall
d length 0 gt {
d setpagedevice
} if
} bd
/RE { % /NewFontName [NewEncodingArray] /FontName RE -
  findfont dup length dict begin
  {
    1 index /FID ne
    {def} {pop pop} ifelse
  } forall
  /Encoding exch def
  /FontName 1 index def
  currentdict definefont pop
  end
} bind def
%%EndResource
%%BeginResource: procset (Apache XML Graphics EPS ProcSet) 1.0 0
%%Version: 1.0 0
%%Copyright: (Copyright 2002-2003 The Apache Software Foundation. License terms: http://www.apache.org/licenses/LICENSE-2.0)
/BeginEPSF { %def
/b4_Inc_state save def         % Save state for cleanup
/dict_count countdictstack def % Count objects on dict stack
/op_count count 1 sub def      % Count objects on operand stack
userdict begin                 % Push userdict on dict stack
/showpage { } def              % Redefine showpage, { } = null proc
0 setgray 0 setlinecap         % Prepare graphics state
1 setlinewidth 0 setlinejoin
10 setmiterlimit [ ] 0 setdash newpath
/languagelevel where           % If level not equal to 1 then
{pop languagelevel             % set strokeadjust and
1 ne                           % overprint to their defaults.
{false setstrokeadjust false setoverprint
} if
} if
} bd
/EndEPSF { %def
count op_count sub {pop} repeat            % Clean up stacks
countdictstack dict_count sub {end} repeat
b4_Inc_state restore
} bd
%%EndResource
%FOPBeginFontDict
%%IncludeResource: font Courier-Oblique
%%IncludeResource: font Courier-BoldOblique
%%IncludeResource: font Courier-Bold
%%IncludeResource: font ZapfDingbats
%%IncludeResource: font Symbol
%%IncludeResource: font Helvetica
%%IncludeResource: font Helvetica-Oblique
%%IncludeResource: font Helvetica-Bold
%%IncludeResource: font Helvetica-BoldOblique
%%IncludeResource: font Times-Roman
%%IncludeResource: font Times-Italic
%%IncludeResource: font Times-Bold
%%IncludeResource: font Times-BoldItalic
%%IncludeResource: font Courier
%FOPEndFontDict
%%BeginResource: encoding WinAnsiEncoding
/WinAnsiEncoding [
/.notdef /.notdef /.notdef /.notdef /.notdef
/.notdef /.notdef /.notdef /.notdef /.notdef
/.notdef /.notdef /.notdef /.notdef /.notdef
/.notdef /.notdef /.notdef /.notdef /.notdef
/.notdef /.notdef /.notdef /.notdef /.notdef
/.notdef /.notdef /.notdef /.notdef /.notdef
/.notdef /.notdef /space /exclam /quotedbl
/numbersign /dollar /percent /ampersand /quotesingle
/parenleft /parenright /asterisk /plus /comma
/hyphen /period /slash /zero /one
/two /three /four /five /six
/seven /eight /nine /colon /semicolon
/less /equal /greater /question /at
/A /B /C /D /E
/F /G /H /I /J
/K /L /M /N /O
/P /Q /R /S /T
/U /V /W /X /Y
/Z /bracketleft /backslash /bracketright /asciicircum
/underscore /quoteleft /a /b /c
/d /e /f /g /h
/i /j /k /l /m
/n /o /p /q /r
/s /t /u /v /w
/x /y /z /braceleft /bar
/braceright /asciitilde /bullet /Euro /bullet
/quotesinglbase /florin /quotedblbase /ellipsis /dagger
/daggerdbl /circumflex /perthousand /Scaron /guilsinglleft
/OE /bullet /Zcaron /bullet /bullet
/quoteleft /quoteright /quotedblleft /quotedblright /bullet
/endash /emdash /asciitilde /trademark /scaron
/guilsinglright /oe /bullet /zcaron /Ydieresis
/space /exclamdown /cent /sterling /currency
/yen /brokenbar /section /dieresis /copyright
/ordfeminine /guillemotleft /logicalnot /sfthyphen /registered
/macron /degree /plusminus /twosuperior /threesuperior
/acute /mu /paragraph /middot /cedilla
/onesuperior /ordmasculine /guillemotright /onequarter /onehalf
/threequarters /questiondown /Agrave /Aacute /Acircumflex
/Atilde /Adieresis /Aring /AE /Ccedilla
/Egrave /Eacute /Ecircumflex /Edieresis /Igrave
/Iacute /Icircumflex /Idieresis /Eth /Ntilde
/Ograve /Oacute /Ocircumflex /Otilde /Odieresis
/multiply /Oslash /Ugrave /Uacute /Ucircumflex
/Udieresis /Yacute /Thorn /germandbls /agrave
/aacute /acircumflex /atilde /adieresis /aring
/ae /ccedilla /egrave /eacute /ecircumflex
/edieresis /igrave /iacute /icircumflex /idieresis
/eth /ntilde /ograve /oacute /ocircumflex
/otilde /odieresis /divide /oslash /ugrave
/uacute /ucircumflex /udieresis /yacute /thorn
/ydieresis
] def
%%EndResource
%FOPBeginFontReencode
/Courier-Oblique findfont
dup length dict begin
  {1 index /FID ne {def} {pop pop} ifelse} forall
  /Encoding WinAnsiEncoding def
  currentdict
end
/Courier-Oblique exch definefont pop
/Courier-BoldOblique findfont
dup length dict begin
  {1 index /FID ne {def} {pop pop} ifelse} forall
  /Encoding WinAnsiEncoding def
  currentdict
end
/Courier-BoldOblique exch definefont pop
/Courier-Bold findfont
dup length dict begin
  {1 index /FID ne {def} {pop pop} ifelse} forall
  /Encoding WinAnsiEncoding def
  currentdict
end
/Courier-Bold exch definefont pop
/Helvetica findfont
dup length dict begin
  {1 index /FID ne {def} {pop pop} ifelse} forall
  /Encoding WinAnsiEncoding def
  currentdict
end
/Helvetica exch definefont pop
/Helvetica-Oblique findfont
dup length dict begin
  {1 index /FID ne {def} {pop pop} ifelse} forall
  /Encoding WinAnsiEncoding def
  currentdict
end
/Helvetica-Oblique exch definefont pop
/Helvetica-Bold findfont
dup length dict begin
  {1 index /FID ne {def} {pop pop} ifelse} forall
  /Encoding WinAnsiEncoding def
  currentdict
end
/Helvetica-Bold exch definefont pop
/Helvetica-BoldOblique findfont
dup length dict begin
  {1 index /FID ne {def} {pop pop} ifelse} forall
  /Encoding WinAnsiEncoding def
  currentdict
end
/Helvetica-BoldOblique exch definefont pop
/Times-Roman findfont
dup length dict begin
  {1 index /FID ne {def} {pop pop} ifelse} forall
  /Encoding WinAnsiEncoding def
  currentdict
end
/Times-Roman exch definefont pop
/Times-Italic findfont
dup length dict begin
  {1 index /FID ne {def} {pop pop} ifelse} forall
  /Encoding WinAnsiEncoding def
  currentdict
end
/Times-Italic exch definefont pop
/Times-Bold findfont
dup length dict begin
  {1 index /FID ne {def} {pop pop} ifelse} forall
  /Encoding WinAnsiEncoding def
  currentdict
end
/Times-Bold exch definefont pop
/Times-BoldItalic findfont
dup length dict begin
  {1 index /FID ne {def} {pop pop} ifelse} forall
  /Encoding WinAnsiEncoding def
  currentdict
end
/Times-BoldItalic exch definefont pop
/Courier findfont
dup length dict begin
  {1 index /FID ne {def} {pop pop} ifelse} forall
  /Encoding WinAnsiEncoding def
  currentdict
end
/Courier exch definefont pop
%FOPEndFontReencode
%%EndProlog
%%Page: 1 1
%%PageBoundingBox: 0 0 198 283
%%BeginPageSetup
[1 0 0 -1 0 283] CT
%%EndPageSetup
GS
[1.00215 0 0 1 0 0] CT
1 GC
N
0 0 198 283 re
f
GR
GS
[1.00215 0 0 1 0 0] CT
1 GC
N
0 0 198 283 re
f
GR
GS
[1.00215 0 0 1 0 0] CT
1 GC
N
52 228 M
179 228 L
179 32 L
52 32 L
cp
f
GR
GS
[1.00215 0 0 1 0 0] CT
0.149 GC
2 setlinecap
1 LJ
0.5 LW
N
52 228 M
179 228 L
S
GR
GS
[1.00215 0 0 1 0 0] CT
0.149 GC
2 setlinecap
1 LJ
0.5 LW
N
90.1 228 M
90.1 226.04 L
S
GR
GS
[1.00215 0 0 1 0 0] CT
0.149 GC
2 setlinecap
1 LJ
0.5 LW
N
140.9 228 M
140.9 226.04 L
S
GR
GS
[1.00215 0 0 1 90.29349 234] CT
0.149 GC
/Helvetica 20 F
GS
[1 0 0 1 0 0] CT
-13 20 moveto 
1 -1 scale
(YA) t 
GR
GR
GS
[1.00215 0 0 1 141.20257 234] CT
0.149 GC
/Helvetica 20 F
GS
[1 0 0 1 0 0] CT
-14.5 20 moveto 
1 -1 scale
(OA) t 
GR
GR
GS
[1.00215 0 0 1 115.7481 259] CT
0.149 GC
/Helvetica 20 F
GS
[1 0 0 1 0 0] CT
-49 20 moveto 
1 -1 scale
(Age Group) t 
GR
GR
GS
[1.00215 0 0 1 0 0] CT
0.149 GC
2 setlinecap
1 LJ
0.5 LW
N
52 228 M
52 32 L
S
GR
GS
[1.00215 0 0 1 0 0] CT
0.149 GC
2 setlinecap
1 LJ
0.5 LW
N
52 228 M
53.96 228 L
S
GR
GS
[1.00215 0 0 1 0 0] CT
0.149 GC
2 setlinecap
1 LJ
0.5 LW
N
52 188.8 M
53.96 188.8 L
S
GR
GS
[1.00215 0 0 1 0 0] CT
0.149 GC
2 setlinecap
1 LJ
0.5 LW
N
52 149.6 M
53.96 149.6 L
S
GR
GS
[1.00215 0 0 1 0 0] CT
0.149 GC
2 setlinecap
1 LJ
0.5 LW
N
52 110.4 M
53.96 110.4 L
S
GR
GS
[1.00215 0 0 1 0 0] CT
0.149 GC
2 setlinecap
1 LJ
0.5 LW
N
52 71.2 M
53.96 71.2 L
S
GR
GS
[1.00215 0 0 1 0 0] CT
0.149 GC
2 setlinecap
1 LJ
0.5 LW
N
52 32 M
53.96 32 L
S
GR
GS
[1.00215 0 0 1 46.09878 228] CT
0.149 GC
/Helvetica 20 F
GS
[1 0 0 1 0 0] CT
-19 7.5 moveto 
1 -1 scale
(-5) t 
GR
GR
GS
[1.00215 0 0 1 46.09878 188.8] CT
0.149 GC
/Helvetica 20 F
GS
[1 0 0 1 0 0] CT
-19 7.5 moveto 
1 -1 scale
(-4) t 
GR
GR
GS
[1.00215 0 0 1 46.09878 149.60001] CT
0.149 GC
/Helvetica 20 F
GS
[1 0 0 1 0 0] CT
-19 7.5 moveto 
1 -1 scale
(-3) t 
GR
GR
GS
[1.00215 0 0 1 46.09878 110.4] CT
0.149 GC
/Helvetica 20 F
GS
[1 0 0 1 0 0] CT
-19 7.5 moveto 
1 -1 scale
(-2) t 
GR
GR
GS
[1.00215 0 0 1 46.09878 71.2] CT
0.149 GC
/Helvetica 20 F
GS
[1 0 0 1 0 0] CT
-19 7.5 moveto 
1 -1 scale
(-1) t 
GR
GR
GS
[1.00215 0 0 1 46.09878 32] CT
0.149 GC
/Helvetica 20 F
GS
[1 0 0 1 0 0] CT
-12 7.5 moveto 
1 -1 scale
(0) t 
GR
GR
GS
[0 -1 1.00215 0 24.05154 129.99991] CT
0.149 GC
/Helvetica 20 F
GS
[1 0 0 1 0 0] CT
-19.5 -5 moveto 
1 -1 scale
(1f l1) t 
GR
GR
GS
[1.00215 0 0 1 115.74814 29.25] CT
/Helvetica-Bold 22 F
GS
[1 0 0 1 0 0] CT
-41 -5 moveto 
1 -1 scale
(p = 0.41) t 
GR
GR
GS
[1.00215 0 0 1 0 0] CT
0.149 GC
1 LJ
0.5 LW
N
52 32 M
179 32 L
S
GR
GS
[1.00215 0 0 1 0 0] CT
0.6 0.8 1 RC
N
69.78 32 M
69.78 136.073 L
110.42 136.073 L
110.42 32 L
cp
f
GR
GS
[1.00215 0 0 1 83.51286 105.29787] CT
0.302 GC
N
2.236 0 M
2.236 -1.235 1.235 -2.236 0 -2.236 C
-1.235 -2.236 -2.236 -1.235 -2.236 0 C
-2.236 1.235 -1.235 2.236 0 2.236 C
1.235 2.236 2.236 1.235 2.236 0 C
cp
f
GR
GS
[1.00215 0 0 1 92.97907 158.05972] CT
0.302 GC
N
/f-1586420743{2.236 0 M
2.236 -1.235 1.235 -2.236 0 -2.236 C
-1.235 -2.236 -2.236 -1.235 -2.236 0 C
-2.236 1.235 -1.235 2.236 0 2.236 C
1.235 2.236 2.236 1.235 2.236 0 C
cp}def
f-1586420743
f
GR
GS
[1.00215 0 0 1 91.96788 122.02981] CT
0.302 GC
N
f-1586420743
f
GR
GS
[1.00215 0 0 1 98.49798 163.68929] CT
0.302 GC
N
f-1586420743
f
GR
GS
[1.00215 0 0 1 96.86039 156.56989] CT
0.302 GC
N
f-1586420743
f
GR
GS
[1.00215 0 0 1 100.07745 170.06461] CT
0.302 GC
N
f-1586420743
f
GR
GS
[1.00215 0 0 1 87.15129 157.04829] CT
0.302 GC
N
f-1586420743
f
GR
GS
[1.00215 0 0 1 91.99648 109.17047] CT
0.302 GC
N
f-1586420743
f
GR
GS
[1.00215 0 0 1 99.05745 65.70262] CT
0.302 GC
N
f-1586420743
f
GR
GS
[1.00215 0 0 1 85.13812 167.55455] CT
0.302 GC
N
f-1586420743
f
GR
GS
[1.00215 0 0 1 97.46502 202.69472] CT
0.302 GC
N
f-1586420743
f
GR
GS
[1.00215 0 0 1 90.95064 169.50177] CT
0.302 GC
N
f-1586420743
f
GR
GS
[1.00215 0 0 1 80.14391 151.8797] CT
0.302 GC
N
f-1586420743
f
GR
GS
[1.00215 0 0 1 81.12631 146.39871] CT
0.302 GC
N
f-1586420743
f
GR
GS
[1.00215 0 0 1 84.39225 138.19852] CT
0.302 GC
N
f-1586420743
f
GR
GS
[1.00215 0 0 1 85.0348 82.83514] CT
0.302 GC
N
f-1586420743
f
GR
GS
[1.00215 0 0 1 80.26945 65.70262] CT
0.302 GC
N
f-1586420743
f
GR
GS
[1.00215 0 0 1 99.10675 129.40968] CT
0.302 GC
N
f-1586420743
f
GR
GS
[1.00215 0 0 1 98.43902 166.69174] CT
0.302 GC
N
f-1586420743
f
GR
GS
[1.00215 0 0 1 99.73442 65.70262] CT
0.302 GC
N
f-1586420743
f
GR
GS
[1.00215 0 0 1 99.56974 181.38332] CT
0.302 GC
N
f-1586420743
f
GR
GS
[1.00215 0 0 1 86.02807 171.15897] CT
0.302 GC
N
f-1586420743
f
GR
GS
[1.00215 0 0 1 99.03566 90.83544] CT
0.302 GC
N
f-1586420743
f
GR
GS
[1.00215 0 0 1 88.72106 165.19119] CT
0.302 GC
N
f-1586420743
f
GR
GS
[1.00215 0 0 1 98.36842 154.58411] CT
0.302 GC
N
f-1586420743
f
GR
GS
[1.00215 0 0 1 88.35477 173.74911] CT
0.302 GC
N
f-1586420743
f
GR
GS
[1.00215 0 0 1 96.19963 83.07402] CT
0.302 GC
N
f-1586420743
f
GR
GS
[1.00215 0 0 1 94.28342 151.89384] CT
0.302 GC
N
f-1586420743
f
GR
GS
[1.00215 0 0 1 88.68371 178.69342] CT
0.302 GC
N
f-1586420743
f
GR
GS
[1.00215 0 0 1 95.14341 66.59731] CT
0.302 GC
N
f-1586420743
f
GR
GS
[1.00215 0 0 1 92.16862 161.05098] CT
0.302 GC
N
f-1586420743
f
GR
GS
[1.00215 0 0 1 99.29957 126.45357] CT
0.302 GC
N
f-1586420743
f
GR
GS
[1.00215 0 0 1 99.05988 133.07137] CT
0.302 GC
N
f-1586420743
f
GR
GS
[1.00215 0 0 1 87.57794 156.97156] CT
0.302 GC
N
f-1586420743
f
GR
GS
[1.00215 0 0 1 95.25364 150.35991] CT
0.302 GC
N
f-1586420743
f
GR
GS
[1.00215 0 0 1 93.92917 97.92003] CT
0.302 GC
N
f-1586420743
f
GR
GS
[1.00215 0 0 1 100.15539 138.68044] CT
0.302 GC
N
f-1586420743
f
GR
GS
[1.00215 0 0 1 80.50661 65.70262] CT
0.302 GC
N
f-1586420743
f
GR
GS
[1.00215 0 0 1 83.66347 157.24234] CT
0.302 GC
N
f-1586420743
f
GR
GS
[1.00215 0 0 1 82.50368 105.83476] CT
0.302 GC
N
f-1586420743
f
GR
GS
[1.00215 0 0 1 96.24784 192.92407] CT
0.302 GC
N
f-1586420743
f
GR
GS
[1.00215 0 0 1 85.7113 117.49044] CT
0.302 GC
N
f-1586420743
f
GR
GS
[1.00215 0 0 1 0 0] CT
0.6 0.8 1 RC
N
/f1933073678{120.58 32 M
120.58 130.277 L
161.22 130.277 L
161.22 32 L
cp}def
f1933073678
f
GR
GS
[1.00215 0 0 1 147.46038 98.55077] CT
0.302 GC
N
f-1586420743
f
GR
GS
[1.00215 0 0 1 132.52451 100.66283] CT
0.302 GC
N
f-1586420743
f
GR
GS
[1.00215 0 0 1 151.34892 162.21532] CT
0.302 GC
N
f-1586420743
f
GR
GS
[1.00215 0 0 1 135.66449 52.81424] CT
0.302 GC
N
f-1586420743
f
GR
GS
[1.00215 0 0 1 141.93388 108.35569] CT
0.302 GC
N
f-1586420743
f
GR
GS
[1.00215 0 0 1 136.71566 121.56773] CT
0.302 GC
N
f-1586420743
f
GR
GS
[1.00215 0 0 1 142.82611 93.7679] CT
0.302 GC
N
f-1586420743
f
GR
GS
[1.00215 0 0 1 135.12473 126.35656] CT
0.302 GC
N
f-1586420743
f
GR
GS
[1.00215 0 0 1 133.93697 100.6459] CT
0.302 GC
N
f-1586420743
f
GR
GS
[1.00215 0 0 1 146.17394 125.76177] CT
0.302 GC
N
f-1586420743
f
GR
GS
[1.00215 0 0 1 131.38235 156.15948] CT
0.302 GC
N
f-1586420743
f
GR
GS
[1.00215 0 0 1 141.75666 126.53817] CT
0.302 GC
N
f-1586420743
f
GR
GS
[1.00215 0 0 1 147.09927 120.45639] CT
0.302 GC
N
f-1586420743
f
GR
GS
[1.00215 0 0 1 134.85581 122.50848] CT
0.302 GC
N
f-1586420743
f
GR
GS
[1.00215 0 0 1 147.72328 103.47125] CT
0.302 GC
N
f-1586420743
f
GR
GS
[1.00215 0 0 1 135.04694 126.98404] CT
0.302 GC
N
f-1586420743
f
GR
GS
[1.00215 0 0 1 144.45987 114.94431] CT
0.302 GC
N
f-1586420743
f
GR
GS
[1.00215 0 0 1 147.42575 119.91582] CT
0.302 GC
N
f-1586420743
f
GR
GS
[1.00215 0 0 1 140.5191 76.10445] CT
0.302 GC
N
f-1586420743
f
GR
GS
[1.00215 0 0 1 144.67027 142.71703] CT
0.302 GC
N
f-1586420743
f
GR
GS
[1.00215 0 0 1 132.2963 146.70612] CT
0.302 GC
N
f-1586420743
f
GR
GS
[1.00215 0 0 1 150.9188 152.29813] CT
0.302 GC
N
f-1586420743
f
GR
GS
[1.00215 0 0 1 136.00335 116.62789] CT
0.302 GC
N
f-1586420743
f
GR
GS
[1.00215 0 0 1 135.82998 165.34019] CT
0.302 GC
N
f-1586420743
f
GR
GS
[1.00215 0 0 1 146.78511 170.30876] CT
0.302 GC
N
f-1586420743
f
GR
GS
[1.00215 0 0 1 150.12648 170.89926] CT
0.302 GC
N
f-1586420743
f
GR
GS
[1.00215 0 0 1 135.76427 177.53694] CT
0.302 GC
N
f-1586420743
f
GR
GS
[1.00215 0 0 1 150.44797 135.89311] CT
0.302 GC
N
f-1586420743
f
GR
GS
[1.00215 0 0 1 133.63468 147.55675] CT
0.302 GC
N
f-1586420743
f
GR
GS
[1.00215 0 0 1 138.82874 132.69093] CT
0.302 GC
N
f-1586420743
f
GR
GS
[1.00215 0 0 1 140.53551 145.8972] CT
0.302 GC
N
f-1586420743
f
GR
GS
[1.00215 0 0 1 141.35849 144.64766] CT
0.302 GC
N
f-1586420743
f
GR
GS
[1.00215 0 0 1 149.95601 126.44292] CT
0.302 GC
N
f-1586420743
f
GR
GS
[1.00215 0 0 1 137.30281 167.16898] CT
0.302 GC
N
f-1586420743
f
GR
GS
[1.00215 0 0 1 143.20147 135.74545] CT
0.302 GC
N
f-1586420743
f
GR
GS
[1.00215 0 0 1 137.66703 142.47903] CT
0.302 GC
N
f-1586420743
f
GR
GS
[1.00215 0 0 1 137.84621 128.95259] CT
0.302 GC
N
f-1586420743
f
GR
GS
[1.00215 0 0 1 138.67338 122.21557] CT
0.302 GC
N
f-1586420743
f
GR
GS
[1.00215 0 0 1 148.39766 112.44504] CT
0.302 GC
N
f-1586420743
f
GR
GS
[1.00215 0 0 1 149.62515 164.71173] CT
0.302 GC
N
f-1586420743
f
GR
GS
[1.00215 0 0 1 145.22938 166.47246] CT
0.302 GC
N
f-1586420743
f
GR
GS
[1.00215 0 0 1 134.27559 129.36171] CT
0.302 GC
N
f-1586420743
f
GR
GS
[1.00215 0 0 1 141.09743 103.28171] CT
0.302 GC
N
f-1586420743
f
GR
GS
[1.00215 0 0 1 131.88336 145.68242] CT
0.302 GC
N
f-1586420743
f
GR
GS
[1.00215 0 0 1 147.85356 172.03325] CT
0.302 GC
N
f-1586420743
f
GR
GS
[1.00215 0 0 1 149.02924 67.46651] CT
0.302 GC
N
f-1586420743
f
GR
GS
[1.00215 0 0 1 146.84534 161.4603] CT
0.302 GC
N
f-1586420743
f
GR
GS
[1.00215 0 0 1 134.56584 52.81424] CT
0.302 GC
N
f-1586420743
f
GR
GS
[1.00215 0 0 1 149.42041 147.87479] CT
0.302 GC
N
f-1586420743
f
GR
GS
[1.00215 0 0 1 149.42188 136.97484] CT
0.302 GC
N
f-1586420743
f
GR
GS
[1.00215 0 0 1 147.01236 151.90857] CT
0.302 GC
N
f-1586420743
f
GR
GS
[1.00215 0 0 1 132.50278 142.49149] CT
0.302 GC
N
f-1586420743
f
GR
GS
[1.00215 0 0 1 132.7061 119.77956] CT
0.302 GC
N
f-1586420743
f
GR
%%Trailer
%%Pages: 1
%%EOF
