%!PS-Adobe-3.0 EPSF-3.0
%%Creator: (MATLAB, The Mathworks, Inc. Version 9.8.0.1323502 \(R2020a\). Operating System: Mac OS X)
%%Title: /Users/kosciessa/Desktop/mntTardisLNDG/LNDG/stateswitch/stsw_multimodal/figures/linearbyage/linearcomp_drift.eps
%%CreationDate: 2022-03-03T16:32:24
%%Pages: (atend)
%%BoundingBox:     4     0   180   275
%%LanguageLevel: 3
%%EndComments
%%BeginProlog
%%BeginResource: procset (Apache XML Graphics Std ProcSet) 1.2 0
%%Version: 1.2 0
%%Copyright: (Copyright 2001-2003,2010 The Apache Software Foundation. License terms: http://www.apache.org/licenses/LICENSE-2.0)
/bd{bind def}bind def
/ld{load def}bd
/GR/grestore ld
/GS/gsave ld
/RM/rmoveto ld
/C/curveto ld
/t/show ld
/L/lineto ld
/ML/setmiterlimit ld
/CT/concat ld
/f/fill ld
/N/newpath ld
/S/stroke ld
/CC/setcmykcolor ld
/A/ashow ld
/cp/closepath ld
/RC/setrgbcolor ld
/LJ/setlinejoin ld
/GC/setgray ld
/LW/setlinewidth ld
/M/moveto ld
/re {4 2 roll M
1 index 0 rlineto
0 exch rlineto
neg 0 rlineto
cp } bd
/_ctm matrix def
/_tm matrix def
/BT { _ctm currentmatrix pop matrix _tm copy pop 0 0 moveto } bd
/ET { _ctm setmatrix } bd
/iTm { _ctm setmatrix _tm concat } bd
/Tm { _tm astore pop iTm 0 0 moveto } bd
/ux 0.0 def
/uy 0.0 def
/F {
  /Tp exch def
  /Tf exch def
  Tf findfont Tp scalefont setfont
  /cf Tf def  /cs Tp def
} bd
/ULS {currentpoint /uy exch def /ux exch def} bd
/ULE {
  /Tcx currentpoint pop def
  gsave
  newpath
  cf findfont cs scalefont dup
  /FontMatrix get 0 get /Ts exch def /FontInfo get dup
  /UnderlinePosition get Ts mul /To exch def
  /UnderlineThickness get Ts mul /Tt exch def
  ux uy To add moveto  Tcx uy To add lineto
  Tt setlinewidth stroke
  grestore
} bd
/OLE {
  /Tcx currentpoint pop def
  gsave
  newpath
  cf findfont cs scalefont dup
  /FontMatrix get 0 get /Ts exch def /FontInfo get dup
  /UnderlinePosition get Ts mul /To exch def
  /UnderlineThickness get Ts mul /Tt exch def
  ux uy To add cs add moveto Tcx uy To add cs add lineto
  Tt setlinewidth stroke
  grestore
} bd
/SOE {
  /Tcx currentpoint pop def
  gsave
  newpath
  cf findfont cs scalefont dup
  /FontMatrix get 0 get /Ts exch def /FontInfo get dup
  /UnderlinePosition get Ts mul /To exch def
  /UnderlineThickness get Ts mul /Tt exch def
  ux uy To add cs 10 mul 26 idiv add moveto Tcx uy To add cs 10 mul 26 idiv add lineto
  Tt setlinewidth stroke
  grestore
} bd
/QT {
/Y22 exch store
/X22 exch store
/Y21 exch store
/X21 exch store
currentpoint
/Y21 load 2 mul add 3 div exch
/X21 load 2 mul add 3 div exch
/X21 load 2 mul /X22 load add 3 div
/Y21 load 2 mul /Y22 load add 3 div
/X22 load /Y22 load curveto
} bd
/SSPD {
dup length /d exch dict def
{
/v exch def
/k exch def
currentpagedevice k known {
/cpdv currentpagedevice k get def
v cpdv ne {
/upd false def
/nullv v type /nulltype eq def
/nullcpdv cpdv type /nulltype eq def
nullv nullcpdv or
{
/upd true def
} {
/sametype v type cpdv type eq def
sametype {
v type /arraytype eq {
/vlen v length def
/cpdvlen cpdv length def
vlen cpdvlen eq {
0 1 vlen 1 sub {
/i exch def
/obj v i get def
/cpdobj cpdv i get def
obj cpdobj ne {
/upd true def
exit
} if
} for
} {
/upd true def
} ifelse
} {
v type /dicttype eq {
v {
/dv exch def
/dk exch def
/cpddv cpdv dk get def
dv cpddv ne {
/upd true def
exit
} if
} forall
} {
/upd true def
} ifelse
} ifelse
} if
} ifelse
upd true eq {
d k v put
} if
} if
} if
} forall
d length 0 gt {
d setpagedevice
} if
} bd
/RE { % /NewFontName [NewEncodingArray] /FontName RE -
  findfont dup length dict begin
  {
    1 index /FID ne
    {def} {pop pop} ifelse
  } forall
  /Encoding exch def
  /FontName 1 index def
  currentdict definefont pop
  end
} bind def
%%EndResource
%%BeginResource: procset (Apache XML Graphics EPS ProcSet) 1.0 0
%%Version: 1.0 0
%%Copyright: (Copyright 2002-2003 The Apache Software Foundation. License terms: http://www.apache.org/licenses/LICENSE-2.0)
/BeginEPSF { %def
/b4_Inc_state save def         % Save state for cleanup
/dict_count countdictstack def % Count objects on dict stack
/op_count count 1 sub def      % Count objects on operand stack
userdict begin                 % Push userdict on dict stack
/showpage { } def              % Redefine showpage, { } = null proc
0 setgray 0 setlinecap         % Prepare graphics state
1 setlinewidth 0 setlinejoin
10 setmiterlimit [ ] 0 setdash newpath
/languagelevel where           % If level not equal to 1 then
{pop languagelevel             % set strokeadjust and
1 ne                           % overprint to their defaults.
{false setstrokeadjust false setoverprint
} if
} if
} bd
/EndEPSF { %def
count op_count sub {pop} repeat            % Clean up stacks
countdictstack dict_count sub {end} repeat
b4_Inc_state restore
} bd
%%EndResource
%FOPBeginFontDict
%%IncludeResource: font Courier-Oblique
%%IncludeResource: font Courier-BoldOblique
%%IncludeResource: font Courier-Bold
%%IncludeResource: font ZapfDingbats
%%IncludeResource: font Symbol
%%IncludeResource: font Helvetica
%%IncludeResource: font Helvetica-Oblique
%%IncludeResource: font Helvetica-Bold
%%IncludeResource: font Helvetica-BoldOblique
%%IncludeResource: font Times-Roman
%%IncludeResource: font Times-Italic
%%IncludeResource: font Times-Bold
%%IncludeResource: font Times-BoldItalic
%%IncludeResource: font Courier
%FOPEndFontDict
%%BeginResource: encoding WinAnsiEncoding
/WinAnsiEncoding [
/.notdef /.notdef /.notdef /.notdef /.notdef
/.notdef /.notdef /.notdef /.notdef /.notdef
/.notdef /.notdef /.notdef /.notdef /.notdef
/.notdef /.notdef /.notdef /.notdef /.notdef
/.notdef /.notdef /.notdef /.notdef /.notdef
/.notdef /.notdef /.notdef /.notdef /.notdef
/.notdef /.notdef /space /exclam /quotedbl
/numbersign /dollar /percent /ampersand /quotesingle
/parenleft /parenright /asterisk /plus /comma
/hyphen /period /slash /zero /one
/two /three /four /five /six
/seven /eight /nine /colon /semicolon
/less /equal /greater /question /at
/A /B /C /D /E
/F /G /H /I /J
/K /L /M /N /O
/P /Q /R /S /T
/U /V /W /X /Y
/Z /bracketleft /backslash /bracketright /asciicircum
/underscore /quoteleft /a /b /c
/d /e /f /g /h
/i /j /k /l /m
/n /o /p /q /r
/s /t /u /v /w
/x /y /z /braceleft /bar
/braceright /asciitilde /bullet /Euro /bullet
/quotesinglbase /florin /quotedblbase /ellipsis /dagger
/daggerdbl /circumflex /perthousand /Scaron /guilsinglleft
/OE /bullet /Zcaron /bullet /bullet
/quoteleft /quoteright /quotedblleft /quotedblright /bullet
/endash /emdash /asciitilde /trademark /scaron
/guilsinglright /oe /bullet /zcaron /Ydieresis
/space /exclamdown /cent /sterling /currency
/yen /brokenbar /section /dieresis /copyright
/ordfeminine /guillemotleft /logicalnot /sfthyphen /registered
/macron /degree /plusminus /twosuperior /threesuperior
/acute /mu /paragraph /middot /cedilla
/onesuperior /ordmasculine /guillemotright /onequarter /onehalf
/threequarters /questiondown /Agrave /Aacute /Acircumflex
/Atilde /Adieresis /Aring /AE /Ccedilla
/Egrave /Eacute /Ecircumflex /Edieresis /Igrave
/Iacute /Icircumflex /Idieresis /Eth /Ntilde
/Ograve /Oacute /Ocircumflex /Otilde /Odieresis
/multiply /Oslash /Ugrave /Uacute /Ucircumflex
/Udieresis /Yacute /Thorn /germandbls /agrave
/aacute /acircumflex /atilde /adieresis /aring
/ae /ccedilla /egrave /eacute /ecircumflex
/edieresis /igrave /iacute /icircumflex /idieresis
/eth /ntilde /ograve /oacute /ocircumflex
/otilde /odieresis /divide /oslash /ugrave
/uacute /ucircumflex /udieresis /yacute /thorn
/ydieresis
] def
%%EndResource
%FOPBeginFontReencode
/Courier-Oblique findfont
dup length dict begin
  {1 index /FID ne {def} {pop pop} ifelse} forall
  /Encoding WinAnsiEncoding def
  currentdict
end
/Courier-Oblique exch definefont pop
/Courier-BoldOblique findfont
dup length dict begin
  {1 index /FID ne {def} {pop pop} ifelse} forall
  /Encoding WinAnsiEncoding def
  currentdict
end
/Courier-BoldOblique exch definefont pop
/Courier-Bold findfont
dup length dict begin
  {1 index /FID ne {def} {pop pop} ifelse} forall
  /Encoding WinAnsiEncoding def
  currentdict
end
/Courier-Bold exch definefont pop
/Helvetica findfont
dup length dict begin
  {1 index /FID ne {def} {pop pop} ifelse} forall
  /Encoding WinAnsiEncoding def
  currentdict
end
/Helvetica exch definefont pop
/Helvetica-Oblique findfont
dup length dict begin
  {1 index /FID ne {def} {pop pop} ifelse} forall
  /Encoding WinAnsiEncoding def
  currentdict
end
/Helvetica-Oblique exch definefont pop
/Helvetica-Bold findfont
dup length dict begin
  {1 index /FID ne {def} {pop pop} ifelse} forall
  /Encoding WinAnsiEncoding def
  currentdict
end
/Helvetica-Bold exch definefont pop
/Helvetica-BoldOblique findfont
dup length dict begin
  {1 index /FID ne {def} {pop pop} ifelse} forall
  /Encoding WinAnsiEncoding def
  currentdict
end
/Helvetica-BoldOblique exch definefont pop
/Times-Roman findfont
dup length dict begin
  {1 index /FID ne {def} {pop pop} ifelse} forall
  /Encoding WinAnsiEncoding def
  currentdict
end
/Times-Roman exch definefont pop
/Times-Italic findfont
dup length dict begin
  {1 index /FID ne {def} {pop pop} ifelse} forall
  /Encoding WinAnsiEncoding def
  currentdict
end
/Times-Italic exch definefont pop
/Times-Bold findfont
dup length dict begin
  {1 index /FID ne {def} {pop pop} ifelse} forall
  /Encoding WinAnsiEncoding def
  currentdict
end
/Times-Bold exch definefont pop
/Times-BoldItalic findfont
dup length dict begin
  {1 index /FID ne {def} {pop pop} ifelse} forall
  /Encoding WinAnsiEncoding def
  currentdict
end
/Times-BoldItalic exch definefont pop
/Courier findfont
dup length dict begin
  {1 index /FID ne {def} {pop pop} ifelse} forall
  /Encoding WinAnsiEncoding def
  currentdict
end
/Courier exch definefont pop
%FOPEndFontReencode
%%EndProlog
%%Page: 1 1
%%PageBoundingBox: 0 0 198 283
%%BeginPageSetup
[1 0 0 -1 0 283] CT
%%EndPageSetup
GS
[1.00215 0 0 1 0 0] CT
1 GC
N
0 0 198 283 re
f
GR
GS
[1.00215 0 0 1 0 0] CT
1 GC
N
0 0 198 283 re
f
GR
GS
[1.00215 0 0 1 0 0] CT
1 GC
N
69 228 M
179 228 L
179 32 L
69 32 L
cp
f
GR
GS
[1.00215 0 0 1 0 0] CT
0.149 GC
2 setlinecap
1 LJ
0.5 LW
N
69 228 M
179 228 L
S
GR
GS
[1.00215 0 0 1 0 0] CT
0.149 GC
2 setlinecap
1 LJ
0.5 LW
N
102 228 M
102 226.04 L
S
GR
GS
[1.00215 0 0 1 0 0] CT
0.149 GC
2 setlinecap
1 LJ
0.5 LW
N
146 228 M
146 226.04 L
S
GR
GS
[1.00215 0 0 1 102.21904 234] CT
0.149 GC
/Helvetica 20 F
GS
[1 0 0 1 0 0] CT
-13 20 moveto 
1 -1 scale
(YA) t 
GR
GR
GS
[1.00215 0 0 1 146.31353 234] CT
0.149 GC
/Helvetica 20 F
GS
[1 0 0 1 0 0] CT
-14.5 20 moveto 
1 -1 scale
(OA) t 
GR
GR
GS
[1.00215 0 0 1 124.26634 259] CT
0.149 GC
/Helvetica 20 F
GS
[1 0 0 1 0 0] CT
-49 20 moveto 
1 -1 scale
(Age Group) t 
GR
GR
GS
[1.00215 0 0 1 0 0] CT
0.149 GC
2 setlinecap
1 LJ
0.5 LW
N
69 228 M
69 32 L
S
GR
GS
[1.00215 0 0 1 0 0] CT
0.149 GC
2 setlinecap
1 LJ
0.5 LW
N
69 228 M
70.96 228 L
S
GR
GS
[1.00215 0 0 1 0 0] CT
0.149 GC
2 setlinecap
1 LJ
0.5 LW
N
69 162.84 M
70.96 162.84 L
S
GR
GS
[1.00215 0 0 1 0 0] CT
0.149 GC
2 setlinecap
1 LJ
0.5 LW
N
69 97.68 M
70.96 97.68 L
S
GR
GS
[1.00215 0 0 1 0 0] CT
0.149 GC
2 setlinecap
1 LJ
0.5 LW
N
69 32.52 M
70.96 32.52 L
S
GR
GS
[1.00215 0 0 1 63.13529 228.00002] CT
0.149 GC
/Helvetica 20 F
GS
[1 0 0 1 0 0] CT
-36 7.5 moveto 
1 -1 scale
(-0.6) t 
GR
GR
GS
[1.00215 0 0 1 63.13529 162.83986] CT
0.149 GC
/Helvetica 20 F
GS
[1 0 0 1 0 0] CT
-36 7.5 moveto 
1 -1 scale
(-0.4) t 
GR
GR
GS
[1.00215 0 0 1 63.13529 97.67973] CT
0.149 GC
/Helvetica 20 F
GS
[1 0 0 1 0 0] CT
-36 7.5 moveto 
1 -1 scale
(-0.2) t 
GR
GR
GS
[1.00215 0 0 1 63.13529 32.51959] CT
0.149 GC
/Helvetica 20 F
GS
[1 0 0 1 0 0] CT
-12 7.5 moveto 
1 -1 scale
(0) t 
GR
GR
GS
[0 -1 1.00215 0 24.05154 129.99991] CT
0.149 GC
/Helvetica 20 F
GS
[1 0 0 1 0 0] CT
-44.5 -5 moveto 
1 -1 scale
(drift linear) t 
GR
GR
GS
[1.00215 0 0 1 124.26641 29.25] CT
/Helvetica-Bold 22 F
GS
[1 0 0 1 0 0] CT
-58 -5 moveto 
1 -1 scale
(p = 5.1e-10) t 
GR
GR
GS
[1.00215 0 0 1 0 0] CT
0.149 GC
1 LJ
0.5 LW
N
69 32.52 M
179 32.52 L
S
GR
GS
[1.00215 0 0 1 0 0] CT
0.6 0.8 1 RC
N
84.4 32.52 M
84.4 148.356 L
119.6 148.356 L
119.6 32.52 L
cp
f
GR
GS
[1.00215 0 0 1 95.85205 154.26233] CT
0.302 GC
N
2.236 0 M
2.236 -1.235 1.235 -2.236 0 -2.236 C
-1.235 -2.236 -2.236 -1.235 -2.236 0 C
-2.236 1.235 -1.235 2.236 0 2.236 C
1.235 2.236 2.236 1.235 2.236 0 C
cp
f
GR
GS
[1.00215 0 0 1 105.81919 149.28348] CT
0.302 GC
N
/f-1586420743{2.236 0 M
2.236 -1.235 1.235 -2.236 0 -2.236 C
-1.235 -2.236 -2.236 -1.235 -2.236 0 C
-2.236 1.235 -1.235 2.236 0 2.236 C
1.235 2.236 2.236 1.235 2.236 0 C
cp}def
f-1586420743
f
GR
GS
[1.00215 0 0 1 94.23309 106.92175] CT
0.302 GC
N
f-1586420743
f
GR
GS
[1.00215 0 0 1 99.50139 98.71289] CT
0.302 GC
N
f-1586420743
f
GR
GS
[1.00215 0 0 1 102.80154 82.02326] CT
0.302 GC
N
f-1586420743
f
GR
GS
[1.00215 0 0 1 101.41682 156.81389] CT
0.302 GC
N
f-1586420743
f
GR
GS
[1.00215 0 0 1 94.50964 149.116] CT
0.302 GC
N
f-1586420743
f
GR
GS
[1.00215 0 0 1 94.10797 186.44176] CT
0.302 GC
N
f-1586420743
f
GR
GS
[1.00215 0 0 1 100.74806 46.73041] CT
0.302 GC
N
f-1586420743
f
GR
GS
[1.00215 0 0 1 99.92971 111.61123] CT
0.302 GC
N
f-1586420743
f
GR
GS
[1.00215 0 0 1 96.02884 119.05955] CT
0.302 GC
N
f-1586420743
f
GR
GS
[1.00215 0 0 1 95.11822 145.57529] CT
0.302 GC
N
f-1586420743
f
GR
GS
[1.00215 0 0 1 97.06401 81.8356] CT
0.302 GC
N
f-1586420743
f
GR
GS
[1.00215 0 0 1 105.58601 112.42186] CT
0.302 GC
N
f-1586420743
f
GR
GS
[1.00215 0 0 1 108.1736 141.59375] CT
0.302 GC
N
f-1586420743
f
GR
GS
[1.00215 0 0 1 101.61731 89.38666] CT
0.302 GC
N
f-1586420743
f
GR
GS
[1.00215 0 0 1 106.99919 128.75922] CT
0.302 GC
N
f-1586420743
f
GR
GS
[1.00215 0 0 1 102.6188 159.43471] CT
0.302 GC
N
f-1586420743
f
GR
GS
[1.00215 0 0 1 100.85117 163.78671] CT
0.302 GC
N
f-1586420743
f
GR
GS
[1.00215 0 0 1 105.81169 157.71271] CT
0.302 GC
N
f-1586420743
f
GR
GS
[1.00215 0 0 1 98.10438 217.72826] CT
0.302 GC
N
f-1586420743
f
GR
GS
[1.00215 0 0 1 101.5348 146.31677] CT
0.302 GC
N
f-1586420743
f
GR
GS
[1.00215 0 0 1 93.67785 84.30463] CT
0.302 GC
N
f-1586420743
f
GR
GS
[1.00215 0 0 1 95.07602 221.51849] CT
0.302 GC
N
f-1586420743
f
GR
GS
[1.00215 0 0 1 100.57018 178.32274] CT
0.302 GC
N
f-1586420743
f
GR
GS
[1.00215 0 0 1 93.8071 215.27505] CT
0.302 GC
N
f-1586420743
f
GR
GS
[1.00215 0 0 1 96.99227 108.66852] CT
0.302 GC
N
f-1586420743
f
GR
GS
[1.00215 0 0 1 108.5298 218.62857] CT
0.302 GC
N
f-1586420743
f
GR
GS
[1.00215 0 0 1 99.69483 151.61798] CT
0.302 GC
N
f-1586420743
f
GR
GS
[1.00215 0 0 1 96.49784 167.75867] CT
0.302 GC
N
f-1586420743
f
GR
GS
[1.00215 0 0 1 110.01628 110.43714] CT
0.302 GC
N
f-1586420743
f
GR
GS
[1.00215 0 0 1 107.99112 210.99669] CT
0.302 GC
N
f-1586420743
f
GR
GS
[1.00215 0 0 1 104.14855 199.49718] CT
0.302 GC
N
f-1586420743
f
GR
GS
[1.00215 0 0 1 102.80835 160.68004] CT
0.302 GC
N
f-1586420743
f
GR
GS
[1.00215 0 0 1 100.89812 193.47911] CT
0.302 GC
N
f-1586420743
f
GR
GS
[1.00215 0 0 1 107.45974 207.50826] CT
0.302 GC
N
f-1586420743
f
GR
GS
[1.00215 0 0 1 106.6264 151.48448] CT
0.302 GC
N
f-1586420743
f
GR
GS
[1.00215 0 0 1 100.3266 209.10811] CT
0.302 GC
N
f-1586420743
f
GR
GS
[1.00215 0 0 1 102.57284 102.54529] CT
0.302 GC
N
f-1586420743
f
GR
GS
[1.00215 0 0 1 102.65795 161.82632] CT
0.302 GC
N
f-1586420743
f
GR
GS
[1.00215 0 0 1 99.69655 133.8687] CT
0.302 GC
N
f-1586420743
f
GR
GS
[1.00215 0 0 1 107.75853 137.89355] CT
0.302 GC
N
f-1586420743
f
GR
GS
[1.00215 0 0 1 0 0] CT
0.6 0.8 1 RC
N
/f1632538550{128.4 32.52 M
128.4 97.396 L
163.6 97.396 L
163.6 32.52 L
cp}def
f1632538550
f
GR
GS
[1.00215 0 0 1 139.00368 94.22657] CT
0.302 GC
N
f-1586420743
f
GR
GS
[1.00215 0 0 1 143.85535 117.95786] CT
0.302 GC
N
f-1586420743
f
GR
GS
[1.00215 0 0 1 143.27258 89.77555] CT
0.302 GC
N
f-1586420743
f
GR
GS
[1.00215 0 0 1 148.01536 47.26466] CT
0.302 GC
N
f-1586420743
f
GR
GS
[1.00215 0 0 1 141.2876 134.13986] CT
0.302 GC
N
f-1586420743
f
GR
GS
[1.00215 0 0 1 139.52286 80.7265] CT
0.302 GC
N
f-1586420743
f
GR
GS
[1.00215 0 0 1 140.40402 120.45024] CT
0.302 GC
N
f-1586420743
f
GR
GS
[1.00215 0 0 1 148.77624 99.76697] CT
0.302 GC
N
f-1586420743
f
GR
GS
[1.00215 0 0 1 137.96139 105.96353] CT
0.302 GC
N
f-1586420743
f
GR
GS
[1.00215 0 0 1 143.76412 103.37589] CT
0.302 GC
N
f-1586420743
f
GR
GS
[1.00215 0 0 1 143.11939 115.90907] CT
0.302 GC
N
f-1586420743
f
GR
GS
[1.00215 0 0 1 150.01427 74.43468] CT
0.302 GC
N
f-1586420743
f
GR
GS
[1.00215 0 0 1 138.42278 165.43248] CT
0.302 GC
N
f-1586420743
f
GR
GS
[1.00215 0 0 1 150.43464 113.40012] CT
0.302 GC
N
f-1586420743
f
GR
GS
[1.00215 0 0 1 140.69118 98.37602] CT
0.302 GC
N
f-1586420743
f
GR
GS
[1.00215 0 0 1 141.63514 145.49556] CT
0.302 GC
N
f-1586420743
f
GR
GS
[1.00215 0 0 1 144.28388 98.89761] CT
0.302 GC
N
f-1586420743
f
GR
GS
[1.00215 0 0 1 152.1136 101.59756] CT
0.302 GC
N
f-1586420743
f
GR
GS
[1.00215 0 0 1 142.54063 79.88057] CT
0.302 GC
N
f-1586420743
f
GR
GS
[1.00215 0 0 1 153.65088 42.67613] CT
0.302 GC
N
f-1586420743
f
GR
GS
[1.00215 0 0 1 138.66133 93.40351] CT
0.302 GC
N
f-1586420743
f
GR
GS
[1.00215 0 0 1 154.88989 103.98238] CT
0.302 GC
N
f-1586420743
f
GR
GS
[1.00215 0 0 1 154.70636 84.34509] CT
0.302 GC
N
f-1586420743
f
GR
GS
[1.00215 0 0 1 146.26807 68.53048] CT
0.302 GC
N
f-1586420743
f
GR
GS
[1.00215 0 0 1 148.27183 86.46454] CT
0.302 GC
N
f-1586420743
f
GR
GS
[1.00215 0 0 1 142.71821 114.56352] CT
0.302 GC
N
f-1586420743
f
GR
GS
[1.00215 0 0 1 145.0325 137.81209] CT
0.302 GC
N
f-1586420743
f
GR
GS
[1.00215 0 0 1 142.49942 96.1816] CT
0.302 GC
N
f-1586420743
f
GR
GS
[1.00215 0 0 1 140.67511 136.60123] CT
0.302 GC
N
f-1586420743
f
GR
GS
[1.00215 0 0 1 142.01482 139.70766] CT
0.302 GC
N
f-1586420743
f
GR
GS
[1.00215 0 0 1 153.4256 65.60783] CT
0.302 GC
N
f-1586420743
f
GR
GS
[1.00215 0 0 1 142.32016 130.82906] CT
0.302 GC
N
f-1586420743
f
GR
GS
[1.00215 0 0 1 154.75094 68.03606] CT
0.302 GC
N
f-1586420743
f
GR
GS
[1.00215 0 0 1 138.18566 103.17338] CT
0.302 GC
N
f-1586420743
f
GR
GS
[1.00215 0 0 1 151.02871 92.10309] CT
0.302 GC
N
f-1586420743
f
GR
GS
[1.00215 0 0 1 141.24492 77.13251] CT
0.302 GC
N
f-1586420743
f
GR
GS
[1.00215 0 0 1 139.59019 58.5648] CT
0.302 GC
N
f-1586420743
f
GR
GS
[1.00215 0 0 1 141.13332 88.83738] CT
0.302 GC
N
f-1586420743
f
GR
GS
[1.00215 0 0 1 152.86165 97.12326] CT
0.302 GC
N
f-1586420743
f
GR
GS
[1.00215 0 0 1 153.29229 108.44361] CT
0.302 GC
N
f-1586420743
f
GR
GS
[1.00215 0 0 1 146.34153 32] CT
0.302 GC
N
f-1586420743
f
GR
GS
[1.00215 0 0 1 145.32379 69.32681] CT
0.302 GC
N
f-1586420743
f
GR
GS
[1.00215 0 0 1 139.33508 110.65234] CT
0.302 GC
N
f-1586420743
f
GR
GS
[1.00215 0 0 1 140.02107 105.13269] CT
0.302 GC
N
f-1586420743
f
GR
GS
[1.00215 0 0 1 139.57586 85.1656] CT
0.302 GC
N
f-1586420743
f
GR
GS
[1.00215 0 0 1 153.75598 93.79079] CT
0.302 GC
N
f-1586420743
f
GR
GS
[1.00215 0 0 1 140.11187 99.38786] CT
0.302 GC
N
f-1586420743
f
GR
GS
[1.00215 0 0 1 151.28567 103.86672] CT
0.302 GC
N
f-1586420743
f
GR
GS
[1.00215 0 0 1 150.89979 129.92807] CT
0.302 GC
N
f-1586420743
f
GR
GS
[1.00215 0 0 1 152.39216 77.00097] CT
0.302 GC
N
f-1586420743
f
GR
GS
[1.00215 0 0 1 150.93308 134.35246] CT
0.302 GC
N
f-1586420743
f
GR
GS
[1.00215 0 0 1 153.56774 69.65874] CT
0.302 GC
N
f-1586420743
f
GR
GS
[1.00215 0 0 1 153.42356 70.54392] CT
0.302 GC
N
f-1586420743
f
GR
%%Trailer
%%Pages: 1
%%EOF
