%!PS-Adobe-3.0 EPSF-3.0
%%Creator: (MATLAB, The Mathworks, Inc. Version 9.8.0.1323502 \(R2020a\). Operating System: Mac OS X)
%%Title: /Users/kosciessa/Desktop/mntTardisLNDG/LNDG/stateswitch/stsw_multimodal/figures/linearbyage/linearcomp_excitability.eps
%%CreationDate: 2022-03-03T16:32:25
%%Pages: (atend)
%%BoundingBox:     4     0   180   275
%%LanguageLevel: 3
%%EndComments
%%BeginProlog
%%BeginResource: procset (Apache XML Graphics Std ProcSet) 1.2 0
%%Version: 1.2 0
%%Copyright: (Copyright 2001-2003,2010 The Apache Software Foundation. License terms: http://www.apache.org/licenses/LICENSE-2.0)
/bd{bind def}bind def
/ld{load def}bd
/GR/grestore ld
/GS/gsave ld
/RM/rmoveto ld
/C/curveto ld
/t/show ld
/L/lineto ld
/ML/setmiterlimit ld
/CT/concat ld
/f/fill ld
/N/newpath ld
/S/stroke ld
/CC/setcmykcolor ld
/A/ashow ld
/cp/closepath ld
/RC/setrgbcolor ld
/LJ/setlinejoin ld
/GC/setgray ld
/LW/setlinewidth ld
/M/moveto ld
/re {4 2 roll M
1 index 0 rlineto
0 exch rlineto
neg 0 rlineto
cp } bd
/_ctm matrix def
/_tm matrix def
/BT { _ctm currentmatrix pop matrix _tm copy pop 0 0 moveto } bd
/ET { _ctm setmatrix } bd
/iTm { _ctm setmatrix _tm concat } bd
/Tm { _tm astore pop iTm 0 0 moveto } bd
/ux 0.0 def
/uy 0.0 def
/F {
  /Tp exch def
  /Tf exch def
  Tf findfont Tp scalefont setfont
  /cf Tf def  /cs Tp def
} bd
/ULS {currentpoint /uy exch def /ux exch def} bd
/ULE {
  /Tcx currentpoint pop def
  gsave
  newpath
  cf findfont cs scalefont dup
  /FontMatrix get 0 get /Ts exch def /FontInfo get dup
  /UnderlinePosition get Ts mul /To exch def
  /UnderlineThickness get Ts mul /Tt exch def
  ux uy To add moveto  Tcx uy To add lineto
  Tt setlinewidth stroke
  grestore
} bd
/OLE {
  /Tcx currentpoint pop def
  gsave
  newpath
  cf findfont cs scalefont dup
  /FontMatrix get 0 get /Ts exch def /FontInfo get dup
  /UnderlinePosition get Ts mul /To exch def
  /UnderlineThickness get Ts mul /Tt exch def
  ux uy To add cs add moveto Tcx uy To add cs add lineto
  Tt setlinewidth stroke
  grestore
} bd
/SOE {
  /Tcx currentpoint pop def
  gsave
  newpath
  cf findfont cs scalefont dup
  /FontMatrix get 0 get /Ts exch def /FontInfo get dup
  /UnderlinePosition get Ts mul /To exch def
  /UnderlineThickness get Ts mul /Tt exch def
  ux uy To add cs 10 mul 26 idiv add moveto Tcx uy To add cs 10 mul 26 idiv add lineto
  Tt setlinewidth stroke
  grestore
} bd
/QT {
/Y22 exch store
/X22 exch store
/Y21 exch store
/X21 exch store
currentpoint
/Y21 load 2 mul add 3 div exch
/X21 load 2 mul add 3 div exch
/X21 load 2 mul /X22 load add 3 div
/Y21 load 2 mul /Y22 load add 3 div
/X22 load /Y22 load curveto
} bd
/SSPD {
dup length /d exch dict def
{
/v exch def
/k exch def
currentpagedevice k known {
/cpdv currentpagedevice k get def
v cpdv ne {
/upd false def
/nullv v type /nulltype eq def
/nullcpdv cpdv type /nulltype eq def
nullv nullcpdv or
{
/upd true def
} {
/sametype v type cpdv type eq def
sametype {
v type /arraytype eq {
/vlen v length def
/cpdvlen cpdv length def
vlen cpdvlen eq {
0 1 vlen 1 sub {
/i exch def
/obj v i get def
/cpdobj cpdv i get def
obj cpdobj ne {
/upd true def
exit
} if
} for
} {
/upd true def
} ifelse
} {
v type /dicttype eq {
v {
/dv exch def
/dk exch def
/cpddv cpdv dk get def
dv cpddv ne {
/upd true def
exit
} if
} forall
} {
/upd true def
} ifelse
} ifelse
} if
} ifelse
upd true eq {
d k v put
} if
} if
} if
} forall
d length 0 gt {
d setpagedevice
} if
} bd
/RE { % /NewFontName [NewEncodingArray] /FontName RE -
  findfont dup length dict begin
  {
    1 index /FID ne
    {def} {pop pop} ifelse
  } forall
  /Encoding exch def
  /FontName 1 index def
  currentdict definefont pop
  end
} bind def
%%EndResource
%%BeginResource: procset (Apache XML Graphics EPS ProcSet) 1.0 0
%%Version: 1.0 0
%%Copyright: (Copyright 2002-2003 The Apache Software Foundation. License terms: http://www.apache.org/licenses/LICENSE-2.0)
/BeginEPSF { %def
/b4_Inc_state save def         % Save state for cleanup
/dict_count countdictstack def % Count objects on dict stack
/op_count count 1 sub def      % Count objects on operand stack
userdict begin                 % Push userdict on dict stack
/showpage { } def              % Redefine showpage, { } = null proc
0 setgray 0 setlinecap         % Prepare graphics state
1 setlinewidth 0 setlinejoin
10 setmiterlimit [ ] 0 setdash newpath
/languagelevel where           % If level not equal to 1 then
{pop languagelevel             % set strokeadjust and
1 ne                           % overprint to their defaults.
{false setstrokeadjust false setoverprint
} if
} if
} bd
/EndEPSF { %def
count op_count sub {pop} repeat            % Clean up stacks
countdictstack dict_count sub {end} repeat
b4_Inc_state restore
} bd
%%EndResource
%FOPBeginFontDict
%%IncludeResource: font Courier-Oblique
%%IncludeResource: font Courier-BoldOblique
%%IncludeResource: font Courier-Bold
%%IncludeResource: font ZapfDingbats
%%IncludeResource: font Symbol
%%IncludeResource: font Helvetica
%%IncludeResource: font Helvetica-Oblique
%%IncludeResource: font Helvetica-Bold
%%IncludeResource: font Helvetica-BoldOblique
%%IncludeResource: font Times-Roman
%%IncludeResource: font Times-Italic
%%IncludeResource: font Times-Bold
%%IncludeResource: font Times-BoldItalic
%%IncludeResource: font Courier
%FOPEndFontDict
%%BeginResource: encoding WinAnsiEncoding
/WinAnsiEncoding [
/.notdef /.notdef /.notdef /.notdef /.notdef
/.notdef /.notdef /.notdef /.notdef /.notdef
/.notdef /.notdef /.notdef /.notdef /.notdef
/.notdef /.notdef /.notdef /.notdef /.notdef
/.notdef /.notdef /.notdef /.notdef /.notdef
/.notdef /.notdef /.notdef /.notdef /.notdef
/.notdef /.notdef /space /exclam /quotedbl
/numbersign /dollar /percent /ampersand /quotesingle
/parenleft /parenright /asterisk /plus /comma
/hyphen /period /slash /zero /one
/two /three /four /five /six
/seven /eight /nine /colon /semicolon
/less /equal /greater /question /at
/A /B /C /D /E
/F /G /H /I /J
/K /L /M /N /O
/P /Q /R /S /T
/U /V /W /X /Y
/Z /bracketleft /backslash /bracketright /asciicircum
/underscore /quoteleft /a /b /c
/d /e /f /g /h
/i /j /k /l /m
/n /o /p /q /r
/s /t /u /v /w
/x /y /z /braceleft /bar
/braceright /asciitilde /bullet /Euro /bullet
/quotesinglbase /florin /quotedblbase /ellipsis /dagger
/daggerdbl /circumflex /perthousand /Scaron /guilsinglleft
/OE /bullet /Zcaron /bullet /bullet
/quoteleft /quoteright /quotedblleft /quotedblright /bullet
/endash /emdash /asciitilde /trademark /scaron
/guilsinglright /oe /bullet /zcaron /Ydieresis
/space /exclamdown /cent /sterling /currency
/yen /brokenbar /section /dieresis /copyright
/ordfeminine /guillemotleft /logicalnot /sfthyphen /registered
/macron /degree /plusminus /twosuperior /threesuperior
/acute /mu /paragraph /middot /cedilla
/onesuperior /ordmasculine /guillemotright /onequarter /onehalf
/threequarters /questiondown /Agrave /Aacute /Acircumflex
/Atilde /Adieresis /Aring /AE /Ccedilla
/Egrave /Eacute /Ecircumflex /Edieresis /Igrave
/Iacute /Icircumflex /Idieresis /Eth /Ntilde
/Ograve /Oacute /Ocircumflex /Otilde /Odieresis
/multiply /Oslash /Ugrave /Uacute /Ucircumflex
/Udieresis /Yacute /Thorn /germandbls /agrave
/aacute /acircumflex /atilde /adieresis /aring
/ae /ccedilla /egrave /eacute /ecircumflex
/edieresis /igrave /iacute /icircumflex /idieresis
/eth /ntilde /ograve /oacute /ocircumflex
/otilde /odieresis /divide /oslash /ugrave
/uacute /ucircumflex /udieresis /yacute /thorn
/ydieresis
] def
%%EndResource
%FOPBeginFontReencode
/Courier-Oblique findfont
dup length dict begin
  {1 index /FID ne {def} {pop pop} ifelse} forall
  /Encoding WinAnsiEncoding def
  currentdict
end
/Courier-Oblique exch definefont pop
/Courier-BoldOblique findfont
dup length dict begin
  {1 index /FID ne {def} {pop pop} ifelse} forall
  /Encoding WinAnsiEncoding def
  currentdict
end
/Courier-BoldOblique exch definefont pop
/Courier-Bold findfont
dup length dict begin
  {1 index /FID ne {def} {pop pop} ifelse} forall
  /Encoding WinAnsiEncoding def
  currentdict
end
/Courier-Bold exch definefont pop
/Helvetica findfont
dup length dict begin
  {1 index /FID ne {def} {pop pop} ifelse} forall
  /Encoding WinAnsiEncoding def
  currentdict
end
/Helvetica exch definefont pop
/Helvetica-Oblique findfont
dup length dict begin
  {1 index /FID ne {def} {pop pop} ifelse} forall
  /Encoding WinAnsiEncoding def
  currentdict
end
/Helvetica-Oblique exch definefont pop
/Helvetica-Bold findfont
dup length dict begin
  {1 index /FID ne {def} {pop pop} ifelse} forall
  /Encoding WinAnsiEncoding def
  currentdict
end
/Helvetica-Bold exch definefont pop
/Helvetica-BoldOblique findfont
dup length dict begin
  {1 index /FID ne {def} {pop pop} ifelse} forall
  /Encoding WinAnsiEncoding def
  currentdict
end
/Helvetica-BoldOblique exch definefont pop
/Times-Roman findfont
dup length dict begin
  {1 index /FID ne {def} {pop pop} ifelse} forall
  /Encoding WinAnsiEncoding def
  currentdict
end
/Times-Roman exch definefont pop
/Times-Italic findfont
dup length dict begin
  {1 index /FID ne {def} {pop pop} ifelse} forall
  /Encoding WinAnsiEncoding def
  currentdict
end
/Times-Italic exch definefont pop
/Times-Bold findfont
dup length dict begin
  {1 index /FID ne {def} {pop pop} ifelse} forall
  /Encoding WinAnsiEncoding def
  currentdict
end
/Times-Bold exch definefont pop
/Times-BoldItalic findfont
dup length dict begin
  {1 index /FID ne {def} {pop pop} ifelse} forall
  /Encoding WinAnsiEncoding def
  currentdict
end
/Times-BoldItalic exch definefont pop
/Courier findfont
dup length dict begin
  {1 index /FID ne {def} {pop pop} ifelse} forall
  /Encoding WinAnsiEncoding def
  currentdict
end
/Courier exch definefont pop
%FOPEndFontReencode
%%EndProlog
%%Page: 1 1
%%PageBoundingBox: 0 0 198 283
%%BeginPageSetup
[1 0 0 -1 0 283] CT
%%EndPageSetup
GS
[1.00215 0 0 1 0 0] CT
1 GC
N
0 0 198 283 re
f
GR
GS
[1.00215 0 0 1 0 0] CT
1 GC
N
0 0 198 283 re
f
GR
GS
[1.00215 0 0 1 0 0] CT
1 GC
N
69 228 M
179 228 L
179 32 L
69 32 L
cp
f
GR
GS
[1.00215 0 0 1 0 0] CT
0.149 GC
2 setlinecap
1 LJ
0.5 LW
N
69 228 M
179 228 L
S
GR
GS
[1.00215 0 0 1 0 0] CT
0.149 GC
2 setlinecap
1 LJ
0.5 LW
N
102 228 M
102 226.04 L
S
GR
GS
[1.00215 0 0 1 0 0] CT
0.149 GC
2 setlinecap
1 LJ
0.5 LW
N
146 228 M
146 226.04 L
S
GR
GS
[1.00215 0 0 1 102.21904 234] CT
0.149 GC
/Helvetica 20 F
GS
[1 0 0 1 0 0] CT
-13 20 moveto 
1 -1 scale
(YA) t 
GR
GR
GS
[1.00215 0 0 1 146.31353 234] CT
0.149 GC
/Helvetica 20 F
GS
[1 0 0 1 0 0] CT
-14.5 20 moveto 
1 -1 scale
(OA) t 
GR
GR
GS
[1.00215 0 0 1 124.26634 259] CT
0.149 GC
/Helvetica 20 F
GS
[1 0 0 1 0 0] CT
-49 20 moveto 
1 -1 scale
(Age Group) t 
GR
GR
GS
[1.00215 0 0 1 0 0] CT
0.149 GC
2 setlinecap
1 LJ
0.5 LW
N
69 228 M
69 32 L
S
GR
GS
[1.00215 0 0 1 0 0] CT
0.149 GC
2 setlinecap
1 LJ
0.5 LW
N
69 228 M
70.96 228 L
S
GR
GS
[1.00215 0 0 1 0 0] CT
0.149 GC
2 setlinecap
1 LJ
0.5 LW
N
69 162.667 M
70.96 162.667 L
S
GR
GS
[1.00215 0 0 1 0 0] CT
0.149 GC
2 setlinecap
1 LJ
0.5 LW
N
69 97.333 M
70.96 97.333 L
S
GR
GS
[1.00215 0 0 1 0 0] CT
0.149 GC
2 setlinecap
1 LJ
0.5 LW
N
69 32 M
70.96 32 L
S
GR
GS
[1.00215 0 0 1 63.13529 228] CT
0.149 GC
/Helvetica 20 F
GS
[1 0 0 1 0 0] CT
-36 7.5 moveto 
1 -1 scale
(-0.1) t 
GR
GR
GS
[1.00215 0 0 1 63.13529 162.66667] CT
0.149 GC
/Helvetica 20 F
GS
[1 0 0 1 0 0] CT
-12 7.5 moveto 
1 -1 scale
(0) t 
GR
GR
GS
[1.00215 0 0 1 63.13529 97.33334] CT
0.149 GC
/Helvetica 20 F
GS
[1 0 0 1 0 0] CT
-28 7.5 moveto 
1 -1 scale
(0.1) t 
GR
GR
GS
[1.00215 0 0 1 63.13529 32] CT
0.149 GC
/Helvetica 20 F
GS
[1 0 0 1 0 0] CT
-28 7.5 moveto 
1 -1 scale
(0.2) t 
GR
GR
GS
[0 -1 1.00215 0 24.05154 129.99991] CT
0.149 GC
/Helvetica 20 F
GS
[1 0 0 1 0 0] CT
-74.5 -5 moveto 
1 -1 scale
(excitability linear) t 
GR
GR
GS
[1.00215 0 0 1 124.26641 29.24999] CT
/Helvetica-Bold 22 F
GS
[1 0 0 1 0 0] CT
-58 -5 moveto 
1 -1 scale
(p = 6.3e-07) t 
GR
GR
GS
[1.00215 0 0 1 0 0] CT
0.149 GC
1 LJ
0.5 LW
N
69 162.667 M
179 162.667 L
S
GR
GS
[1.00215 0 0 1 0 0] CT
1 0.6 0.6 RC
N
119.6 162.667 M
119.6 129.083 L
84.4 129.083 L
84.4 162.667 L
cp
f
GR
GS
[1.00215 0 0 1 96.57211 152.04393] CT
0.302 GC
N
2.236 0 M
2.236 -1.235 1.235 -2.236 0 -2.236 C
-1.235 -2.236 -2.236 -1.235 -2.236 0 C
-2.236 1.235 -1.235 2.236 0 2.236 C
1.235 2.236 2.236 1.235 2.236 0 C
cp
f
GR
GS
[1.00215 0 0 1 100.84335 190.53865] CT
0.302 GC
N
/f-1586420743{2.236 0 M
2.236 -1.235 1.235 -2.236 0 -2.236 C
-1.235 -2.236 -2.236 -1.235 -2.236 0 C
-2.236 1.235 -1.235 2.236 0 2.236 C
1.235 2.236 2.236 1.235 2.236 0 C
cp}def
f-1586420743
f
GR
GS
[1.00215 0 0 1 108.28754 79.43953] CT
0.302 GC
N
f-1586420743
f
GR
GS
[1.00215 0 0 1 108.67596 70.67541] CT
0.302 GC
N
f-1586420743
f
GR
GS
[1.00215 0 0 1 98.29043 128.44713] CT
0.302 GC
N
f-1586420743
f
GR
GS
[1.00215 0 0 1 93.59298 142.17436] CT
0.302 GC
N
f-1586420743
f
GR
GS
[1.00215 0 0 1 102.79346 130.88158] CT
0.302 GC
N
f-1586420743
f
GR
GS
[1.00215 0 0 1 102.02481 132.89565] CT
0.302 GC
N
f-1586420743
f
GR
GS
[1.00215 0 0 1 98.71873 136.81113] CT
0.302 GC
N
f-1586420743
f
GR
GS
[1.00215 0 0 1 95.9041 80.11873] CT
0.302 GC
N
f-1586420743
f
GR
GS
[1.00215 0 0 1 96.47553 117.92714] CT
0.302 GC
N
f-1586420743
f
GR
GS
[1.00215 0 0 1 99.99044 144.77423] CT
0.302 GC
N
f-1586420743
f
GR
GS
[1.00215 0 0 1 100.21273 176.45032] CT
0.302 GC
N
f-1586420743
f
GR
GS
[1.00215 0 0 1 103.21813 168.21216] CT
0.302 GC
N
f-1586420743
f
GR
GS
[1.00215 0 0 1 103.55831 67.85073] CT
0.302 GC
N
f-1586420743
f
GR
GS
[1.00215 0 0 1 107.49206 182.84264] CT
0.302 GC
N
f-1586420743
f
GR
GS
[1.00215 0 0 1 93.64248 153.47293] CT
0.302 GC
N
f-1586420743
f
GR
GS
[1.00215 0 0 1 109.22527 109.41013] CT
0.302 GC
N
f-1586420743
f
GR
GS
[1.00215 0 0 1 93.49289 91.21023] CT
0.302 GC
N
f-1586420743
f
GR
GS
[1.00215 0 0 1 97.25885 146.71416] CT
0.302 GC
N
f-1586420743
f
GR
GS
[1.00215 0 0 1 96.05578 60.01775] CT
0.302 GC
N
f-1586420743
f
GR
GS
[1.00215 0 0 1 108.71465 90.781] CT
0.302 GC
N
f-1586420743
f
GR
GS
[1.00215 0 0 1 104.92524 150.07703] CT
0.302 GC
N
f-1586420743
f
GR
GS
[1.00215 0 0 1 97.50343 137.70242] CT
0.302 GC
N
f-1586420743
f
GR
GS
[1.00215 0 0 1 109.37473 107.01355] CT
0.302 GC
N
f-1586420743
f
GR
GS
[1.00215 0 0 1 100.04567 128.5047] CT
0.302 GC
N
f-1586420743
f
GR
GS
[1.00215 0 0 1 100.04734 112.73487] CT
0.302 GC
N
f-1586420743
f
GR
GS
[1.00215 0 0 1 109.66208 140.06483] CT
0.302 GC
N
f-1586420743
f
GR
GS
[1.00215 0 0 1 109.58407 101.9288] CT
0.302 GC
N
f-1586420743
f
GR
GS
[1.00215 0 0 1 107.71507 118.74853] CT
0.302 GC
N
f-1586420743
f
GR
GS
[1.00215 0 0 1 94.889 131.49736] CT
0.302 GC
N
f-1586420743
f
GR
GS
[1.00215 0 0 1 99.89078 60.01775] CT
0.302 GC
N
f-1586420743
f
GR
GS
[1.00215 0 0 1 101.3001 143.61395] CT
0.302 GC
N
f-1586420743
f
GR
GS
[1.00215 0 0 1 94.231 138.15178] CT
0.302 GC
N
f-1586420743
f
GR
GS
[1.00215 0 0 1 106.28879 109.34258] CT
0.302 GC
N
f-1586420743
f
GR
GS
[1.00215 0 0 1 101.42032 99.88716] CT
0.302 GC
N
f-1586420743
f
GR
GS
[1.00215 0 0 1 96.1336 156.55624] CT
0.302 GC
N
f-1586420743
f
GR
GS
[1.00215 0 0 1 99.09133 153.95706] CT
0.302 GC
N
f-1586420743
f
GR
GS
[1.00215 0 0 1 98.38653 196.62103] CT
0.302 GC
N
f-1586420743
f
GR
GS
[1.00215 0 0 1 99.94695 136.36108] CT
0.302 GC
N
f-1586420743
f
GR
GS
[1.00215 0 0 1 97.91404 191.50682] CT
0.302 GC
N
f-1586420743
f
GR
GS
[1.00215 0 0 1 106.98405 153.50235] CT
0.302 GC
N
f-1586420743
f
GR
GS
[1.00215 0 0 1 0 0] CT
0.6 GC
N
/f1439069982{128.4 162.667 M
128.4 163.071 L
163.6 163.071 L
163.6 162.667 L
cp}def
f1439069982
f
GR
GS
[1.00215 0 0 1 153.15653 170.1808] CT
0.302 GC
N
f-1586420743
f
GR
GS
[1.00215 0 0 1 154.15929 188.62271] CT
0.302 GC
N
f-1586420743
f
GR
GS
[1.00215 0 0 1 147.35646 150.85808] CT
0.302 GC
N
f-1586420743
f
GR
GS
[1.00215 0 0 1 137.50549 165.65576] CT
0.302 GC
N
f-1586420743
f
GR
GS
[1.00215 0 0 1 144.07162 133.4017] CT
0.302 GC
N
f-1586420743
f
GR
GS
[1.00215 0 0 1 147.94667 181.84349] CT
0.302 GC
N
f-1586420743
f
GR
GS
[1.00215 0 0 1 138.77336 160.2587] CT
0.302 GC
N
f-1586420743
f
GR
GS
[1.00215 0 0 1 154.83654 154.2547] CT
0.302 GC
N
f-1586420743
f
GR
GS
[1.00215 0 0 1 139.39739 183.79132] CT
0.302 GC
N
f-1586420743
f
GR
GS
[1.00215 0 0 1 150.22222 139.40601] CT
0.302 GC
N
f-1586420743
f
GR
GS
[1.00215 0 0 1 143.04071 187.77721] CT
0.302 GC
N
f-1586420743
f
GR
GS
[1.00215 0 0 1 149.24765 224.78223] CT
0.302 GC
N
f-1586420743
f
GR
GS
[1.00215 0 0 1 142.09702 209.82202] CT
0.302 GC
N
f-1586420743
f
GR
GS
[1.00215 0 0 1 139.7915 140.70959] CT
0.302 GC
N
f-1586420743
f
GR
GS
[1.00215 0 0 1 149.54988 179.06499] CT
0.302 GC
N
f-1586420743
f
GR
GS
[1.00215 0 0 1 140.1284 181.93782] CT
0.302 GC
N
f-1586420743
f
GR
GS
[1.00215 0 0 1 150.72544 149.47215] CT
0.302 GC
N
f-1586420743
f
GR
GS
[1.00215 0 0 1 140.7999 150.54166] CT
0.302 GC
N
f-1586420743
f
GR
GS
[1.00215 0 0 1 146.05954 196.88739] CT
0.302 GC
N
f-1586420743
f
GR
GS
[1.00215 0 0 1 143.80046 148.09041] CT
0.302 GC
N
f-1586420743
f
GR
GS
[1.00215 0 0 1 141.83289 166.55435] CT
0.302 GC
N
f-1586420743
f
GR
GS
[1.00215 0 0 1 139.03267 151.83682] CT
0.302 GC
N
f-1586420743
f
GR
GS
[1.00215 0 0 1 145.03932 143.82318] CT
0.302 GC
N
f-1586420743
f
GR
GS
[1.00215 0 0 1 152.1103 154.75552] CT
0.302 GC
N
f-1586420743
f
GR
GS
[1.00215 0 0 1 150.94658 143.74022] CT
0.302 GC
N
f-1586420743
f
GR
GS
[1.00215 0 0 1 140.69367 176.19981] CT
0.302 GC
N
f-1586420743
f
GR
GS
[1.00215 0 0 1 139.38317 122.18774] CT
0.302 GC
N
f-1586420743
f
GR
GS
[1.00215 0 0 1 145.34568 158.64096] CT
0.302 GC
N
f-1586420743
f
GR
GS
[1.00215 0 0 1 143.9588 156.75243] CT
0.302 GC
N
f-1586420743
f
GR
GS
[1.00215 0 0 1 154.8079 183.08545] CT
0.302 GC
N
f-1586420743
f
GR
GS
[1.00215 0 0 1 149.60888 160.04169] CT
0.302 GC
N
f-1586420743
f
GR
GS
[1.00215 0 0 1 153.24327 183.54614] CT
0.302 GC
N
f-1586420743
f
GR
GS
[1.00215 0 0 1 139.75226 97.8531] CT
0.302 GC
N
f-1586420743
f
GR
GS
[1.00215 0 0 1 139.50186 160.33813] CT
0.302 GC
N
f-1586420743
f
GR
GS
[1.00215 0 0 1 144.02124 134.32471] CT
0.302 GC
N
f-1586420743
f
GR
GS
[1.00215 0 0 1 146.76925 174.74988] CT
0.302 GC
N
f-1586420743
f
GR
GS
[1.00215 0 0 1 144.47524 160.31752] CT
0.302 GC
N
f-1586420743
f
GR
GS
[1.00215 0 0 1 145.07487 168.81061] CT
0.302 GC
N
f-1586420743
f
GR
GS
[1.00215 0 0 1 140.07485 157.57297] CT
0.302 GC
N
f-1586420743
f
GR
GS
[1.00215 0 0 1 141.08539 182.21771] CT
0.302 GC
N
f-1586420743
f
GR
GS
[1.00215 0 0 1 149.62259 173.43028] CT
0.302 GC
N
f-1586420743
f
GR
GS
[1.00215 0 0 1 147.45847 199.90907] CT
0.302 GC
N
f-1586420743
f
GR
GS
[1.00215 0 0 1 146.15205 193.04518] CT
0.302 GC
N
f-1586420743
f
GR
GS
[1.00215 0 0 1 141.81317 152.92807] CT
0.302 GC
N
f-1586420743
f
GR
GS
[1.00215 0 0 1 149.43668 131.69742] CT
0.302 GC
N
f-1586420743
f
GR
GS
[1.00215 0 0 1 154.90496 197.62784] CT
0.302 GC
N
f-1586420743
f
GR
GS
[1.00215 0 0 1 150.96504 190.23502] CT
0.302 GC
N
f-1586420743
f
GR
GS
[1.00215 0 0 1 153.51379 138.86955] CT
0.302 GC
N
f-1586420743
f
GR
GS
[1.00215 0 0 1 149.40429 180.56322] CT
0.302 GC
N
f-1586420743
f
GR
GS
[1.00215 0 0 1 142.38155 103.99423] CT
0.302 GC
N
f-1586420743
f
GR
GS
[1.00215 0 0 1 138.89373 183.83463] CT
0.302 GC
N
f-1586420743
f
GR
GS
[1.00215 0 0 1 145.0746 97.8531] CT
0.302 GC
N
f-1586420743
f
GR
GS
[1.00215 0 0 1 154.34273 164.06564] CT
0.302 GC
N
f-1586420743
f
GR
%%Trailer
%%Pages: 1
%%EOF
