%!PS-Adobe-3.0 EPSF-3.0
%%Creator: (MATLAB, The Mathworks, Inc. Version 9.8.0.1323502 \(R2020a\). Operating System: Mac OS X)
%%Title: /Users/kosciessa/Desktop/mntTardisLNDG/LNDG/stateswitch/stsw_multimodal/figures/linearbyage/linearcomp_betathresh.eps
%%CreationDate: 2022-03-03T16:32:29
%%Pages: (atend)
%%BoundingBox:     4     0   180   275
%%LanguageLevel: 3
%%EndComments
%%BeginProlog
%%BeginResource: procset (Apache XML Graphics Std ProcSet) 1.2 0
%%Version: 1.2 0
%%Copyright: (Copyright 2001-2003,2010 The Apache Software Foundation. License terms: http://www.apache.org/licenses/LICENSE-2.0)
/bd{bind def}bind def
/ld{load def}bd
/GR/grestore ld
/GS/gsave ld
/RM/rmoveto ld
/C/curveto ld
/t/show ld
/L/lineto ld
/ML/setmiterlimit ld
/CT/concat ld
/f/fill ld
/N/newpath ld
/S/stroke ld
/CC/setcmykcolor ld
/A/ashow ld
/cp/closepath ld
/RC/setrgbcolor ld
/LJ/setlinejoin ld
/GC/setgray ld
/LW/setlinewidth ld
/M/moveto ld
/re {4 2 roll M
1 index 0 rlineto
0 exch rlineto
neg 0 rlineto
cp } bd
/_ctm matrix def
/_tm matrix def
/BT { _ctm currentmatrix pop matrix _tm copy pop 0 0 moveto } bd
/ET { _ctm setmatrix } bd
/iTm { _ctm setmatrix _tm concat } bd
/Tm { _tm astore pop iTm 0 0 moveto } bd
/ux 0.0 def
/uy 0.0 def
/F {
  /Tp exch def
  /Tf exch def
  Tf findfont Tp scalefont setfont
  /cf Tf def  /cs Tp def
} bd
/ULS {currentpoint /uy exch def /ux exch def} bd
/ULE {
  /Tcx currentpoint pop def
  gsave
  newpath
  cf findfont cs scalefont dup
  /FontMatrix get 0 get /Ts exch def /FontInfo get dup
  /UnderlinePosition get Ts mul /To exch def
  /UnderlineThickness get Ts mul /Tt exch def
  ux uy To add moveto  Tcx uy To add lineto
  Tt setlinewidth stroke
  grestore
} bd
/OLE {
  /Tcx currentpoint pop def
  gsave
  newpath
  cf findfont cs scalefont dup
  /FontMatrix get 0 get /Ts exch def /FontInfo get dup
  /UnderlinePosition get Ts mul /To exch def
  /UnderlineThickness get Ts mul /Tt exch def
  ux uy To add cs add moveto Tcx uy To add cs add lineto
  Tt setlinewidth stroke
  grestore
} bd
/SOE {
  /Tcx currentpoint pop def
  gsave
  newpath
  cf findfont cs scalefont dup
  /FontMatrix get 0 get /Ts exch def /FontInfo get dup
  /UnderlinePosition get Ts mul /To exch def
  /UnderlineThickness get Ts mul /Tt exch def
  ux uy To add cs 10 mul 26 idiv add moveto Tcx uy To add cs 10 mul 26 idiv add lineto
  Tt setlinewidth stroke
  grestore
} bd
/QT {
/Y22 exch store
/X22 exch store
/Y21 exch store
/X21 exch store
currentpoint
/Y21 load 2 mul add 3 div exch
/X21 load 2 mul add 3 div exch
/X21 load 2 mul /X22 load add 3 div
/Y21 load 2 mul /Y22 load add 3 div
/X22 load /Y22 load curveto
} bd
/SSPD {
dup length /d exch dict def
{
/v exch def
/k exch def
currentpagedevice k known {
/cpdv currentpagedevice k get def
v cpdv ne {
/upd false def
/nullv v type /nulltype eq def
/nullcpdv cpdv type /nulltype eq def
nullv nullcpdv or
{
/upd true def
} {
/sametype v type cpdv type eq def
sametype {
v type /arraytype eq {
/vlen v length def
/cpdvlen cpdv length def
vlen cpdvlen eq {
0 1 vlen 1 sub {
/i exch def
/obj v i get def
/cpdobj cpdv i get def
obj cpdobj ne {
/upd true def
exit
} if
} for
} {
/upd true def
} ifelse
} {
v type /dicttype eq {
v {
/dv exch def
/dk exch def
/cpddv cpdv dk get def
dv cpddv ne {
/upd true def
exit
} if
} forall
} {
/upd true def
} ifelse
} ifelse
} if
} ifelse
upd true eq {
d k v put
} if
} if
} if
} forall
d length 0 gt {
d setpagedevice
} if
} bd
/RE { % /NewFontName [NewEncodingArray] /FontName RE -
  findfont dup length dict begin
  {
    1 index /FID ne
    {def} {pop pop} ifelse
  } forall
  /Encoding exch def
  /FontName 1 index def
  currentdict definefont pop
  end
} bind def
%%EndResource
%%BeginResource: procset (Apache XML Graphics EPS ProcSet) 1.0 0
%%Version: 1.0 0
%%Copyright: (Copyright 2002-2003 The Apache Software Foundation. License terms: http://www.apache.org/licenses/LICENSE-2.0)
/BeginEPSF { %def
/b4_Inc_state save def         % Save state for cleanup
/dict_count countdictstack def % Count objects on dict stack
/op_count count 1 sub def      % Count objects on operand stack
userdict begin                 % Push userdict on dict stack
/showpage { } def              % Redefine showpage, { } = null proc
0 setgray 0 setlinecap         % Prepare graphics state
1 setlinewidth 0 setlinejoin
10 setmiterlimit [ ] 0 setdash newpath
/languagelevel where           % If level not equal to 1 then
{pop languagelevel             % set strokeadjust and
1 ne                           % overprint to their defaults.
{false setstrokeadjust false setoverprint
} if
} if
} bd
/EndEPSF { %def
count op_count sub {pop} repeat            % Clean up stacks
countdictstack dict_count sub {end} repeat
b4_Inc_state restore
} bd
%%EndResource
%FOPBeginFontDict
%%IncludeResource: font Courier-Oblique
%%IncludeResource: font Courier-BoldOblique
%%IncludeResource: font Courier-Bold
%%IncludeResource: font ZapfDingbats
%%IncludeResource: font Symbol
%%IncludeResource: font Helvetica
%%IncludeResource: font Helvetica-Oblique
%%IncludeResource: font Helvetica-Bold
%%IncludeResource: font Helvetica-BoldOblique
%%IncludeResource: font Times-Roman
%%IncludeResource: font Times-Italic
%%IncludeResource: font Times-Bold
%%IncludeResource: font Times-BoldItalic
%%IncludeResource: font Courier
%FOPEndFontDict
%%BeginResource: encoding WinAnsiEncoding
/WinAnsiEncoding [
/.notdef /.notdef /.notdef /.notdef /.notdef
/.notdef /.notdef /.notdef /.notdef /.notdef
/.notdef /.notdef /.notdef /.notdef /.notdef
/.notdef /.notdef /.notdef /.notdef /.notdef
/.notdef /.notdef /.notdef /.notdef /.notdef
/.notdef /.notdef /.notdef /.notdef /.notdef
/.notdef /.notdef /space /exclam /quotedbl
/numbersign /dollar /percent /ampersand /quotesingle
/parenleft /parenright /asterisk /plus /comma
/hyphen /period /slash /zero /one
/two /three /four /five /six
/seven /eight /nine /colon /semicolon
/less /equal /greater /question /at
/A /B /C /D /E
/F /G /H /I /J
/K /L /M /N /O
/P /Q /R /S /T
/U /V /W /X /Y
/Z /bracketleft /backslash /bracketright /asciicircum
/underscore /quoteleft /a /b /c
/d /e /f /g /h
/i /j /k /l /m
/n /o /p /q /r
/s /t /u /v /w
/x /y /z /braceleft /bar
/braceright /asciitilde /bullet /Euro /bullet
/quotesinglbase /florin /quotedblbase /ellipsis /dagger
/daggerdbl /circumflex /perthousand /Scaron /guilsinglleft
/OE /bullet /Zcaron /bullet /bullet
/quoteleft /quoteright /quotedblleft /quotedblright /bullet
/endash /emdash /asciitilde /trademark /scaron
/guilsinglright /oe /bullet /zcaron /Ydieresis
/space /exclamdown /cent /sterling /currency
/yen /brokenbar /section /dieresis /copyright
/ordfeminine /guillemotleft /logicalnot /sfthyphen /registered
/macron /degree /plusminus /twosuperior /threesuperior
/acute /mu /paragraph /middot /cedilla
/onesuperior /ordmasculine /guillemotright /onequarter /onehalf
/threequarters /questiondown /Agrave /Aacute /Acircumflex
/Atilde /Adieresis /Aring /AE /Ccedilla
/Egrave /Eacute /Ecircumflex /Edieresis /Igrave
/Iacute /Icircumflex /Idieresis /Eth /Ntilde
/Ograve /Oacute /Ocircumflex /Otilde /Odieresis
/multiply /Oslash /Ugrave /Uacute /Ucircumflex
/Udieresis /Yacute /Thorn /germandbls /agrave
/aacute /acircumflex /atilde /adieresis /aring
/ae /ccedilla /egrave /eacute /ecircumflex
/edieresis /igrave /iacute /icircumflex /idieresis
/eth /ntilde /ograve /oacute /ocircumflex
/otilde /odieresis /divide /oslash /ugrave
/uacute /ucircumflex /udieresis /yacute /thorn
/ydieresis
] def
%%EndResource
%FOPBeginFontReencode
/Courier-Oblique findfont
dup length dict begin
  {1 index /FID ne {def} {pop pop} ifelse} forall
  /Encoding WinAnsiEncoding def
  currentdict
end
/Courier-Oblique exch definefont pop
/Courier-BoldOblique findfont
dup length dict begin
  {1 index /FID ne {def} {pop pop} ifelse} forall
  /Encoding WinAnsiEncoding def
  currentdict
end
/Courier-BoldOblique exch definefont pop
/Courier-Bold findfont
dup length dict begin
  {1 index /FID ne {def} {pop pop} ifelse} forall
  /Encoding WinAnsiEncoding def
  currentdict
end
/Courier-Bold exch definefont pop
/Helvetica findfont
dup length dict begin
  {1 index /FID ne {def} {pop pop} ifelse} forall
  /Encoding WinAnsiEncoding def
  currentdict
end
/Helvetica exch definefont pop
/Helvetica-Oblique findfont
dup length dict begin
  {1 index /FID ne {def} {pop pop} ifelse} forall
  /Encoding WinAnsiEncoding def
  currentdict
end
/Helvetica-Oblique exch definefont pop
/Helvetica-Bold findfont
dup length dict begin
  {1 index /FID ne {def} {pop pop} ifelse} forall
  /Encoding WinAnsiEncoding def
  currentdict
end
/Helvetica-Bold exch definefont pop
/Helvetica-BoldOblique findfont
dup length dict begin
  {1 index /FID ne {def} {pop pop} ifelse} forall
  /Encoding WinAnsiEncoding def
  currentdict
end
/Helvetica-BoldOblique exch definefont pop
/Times-Roman findfont
dup length dict begin
  {1 index /FID ne {def} {pop pop} ifelse} forall
  /Encoding WinAnsiEncoding def
  currentdict
end
/Times-Roman exch definefont pop
/Times-Italic findfont
dup length dict begin
  {1 index /FID ne {def} {pop pop} ifelse} forall
  /Encoding WinAnsiEncoding def
  currentdict
end
/Times-Italic exch definefont pop
/Times-Bold findfont
dup length dict begin
  {1 index /FID ne {def} {pop pop} ifelse} forall
  /Encoding WinAnsiEncoding def
  currentdict
end
/Times-Bold exch definefont pop
/Times-BoldItalic findfont
dup length dict begin
  {1 index /FID ne {def} {pop pop} ifelse} forall
  /Encoding WinAnsiEncoding def
  currentdict
end
/Times-BoldItalic exch definefont pop
/Courier findfont
dup length dict begin
  {1 index /FID ne {def} {pop pop} ifelse} forall
  /Encoding WinAnsiEncoding def
  currentdict
end
/Courier exch definefont pop
%FOPEndFontReencode
%%EndProlog
%%Page: 1 1
%%PageBoundingBox: 0 0 198 283
%%BeginPageSetup
[1 0 0 -1 0 283] CT
%%EndPageSetup
GS
[1.00215 0 0 1 0 0] CT
1 GC
N
0 0 198 283 re
f
GR
GS
[1.00215 0 0 1 0 0] CT
1 GC
N
0 0 198 283 re
f
GR
GS
[1.00215 0 0 1 0 0] CT
1 GC
N
80 228 M
179 228 L
179 32 L
80 32 L
cp
f
GR
GS
[1.00215 0 0 1 0 0] CT
0.149 GC
2 setlinecap
1 LJ
0.5 LW
N
80 228 M
179 228 L
S
GR
GS
[1.00215 0 0 1 0 0] CT
0.149 GC
2 setlinecap
1 LJ
0.5 LW
N
109.7 228 M
109.7 226.04 L
S
GR
GS
[1.00215 0 0 1 0 0] CT
0.149 GC
2 setlinecap
1 LJ
0.5 LW
N
149.3 228 M
149.3 226.04 L
S
GR
GS
[1.00215 0 0 1 109.93558 234] CT
0.149 GC
/Helvetica 20 F
GS
[1 0 0 1 0 0] CT
-13 20 moveto 
1 -1 scale
(YA) t 
GR
GR
GS
[1.00215 0 0 1 149.62062 234] CT
0.149 GC
/Helvetica 20 F
GS
[1 0 0 1 0 0] CT
-14.5 20 moveto 
1 -1 scale
(OA) t 
GR
GR
GS
[1.00215 0 0 1 129.77814 259] CT
0.149 GC
/Helvetica 20 F
GS
[1 0 0 1 0 0] CT
-49 20 moveto 
1 -1 scale
(Age Group) t 
GR
GR
GS
[1.00215 0 0 1 0 0] CT
0.149 GC
2 setlinecap
1 LJ
0.5 LW
N
80 228 M
80 32 L
S
GR
GS
[1.00215 0 0 1 0 0] CT
0.149 GC
2 setlinecap
1 LJ
0.5 LW
N
80 217.948 M
81.96 217.948 L
S
GR
GS
[1.00215 0 0 1 0 0] CT
0.149 GC
2 setlinecap
1 LJ
0.5 LW
N
80 174.018 M
81.96 174.018 L
S
GR
GS
[1.00215 0 0 1 0 0] CT
0.149 GC
2 setlinecap
1 LJ
0.5 LW
N
80 130.088 M
81.96 130.088 L
S
GR
GS
[1.00215 0 0 1 0 0] CT
0.149 GC
2 setlinecap
1 LJ
0.5 LW
N
80 86.158 M
81.96 86.158 L
S
GR
GS
[1.00215 0 0 1 0 0] CT
0.149 GC
2 setlinecap
1 LJ
0.5 LW
N
80 42.228 M
81.96 42.228 L
S
GR
GS
[1.00215 0 0 1 74.15891 217.94754] CT
0.149 GC
/Helvetica 20 F
GS
[1 0 0 1 0 0] CT
-36 7.5 moveto 
1 -1 scale
(-0.1) t 
GR
GR
GS
[1.00215 0 0 1 74.15891 174.01776] CT
0.149 GC
/Helvetica 20 F
GS
[1 0 0 1 0 0] CT
-47 7.5 moveto 
1 -1 scale
(-0.05) t 
GR
GR
GS
[1.00215 0 0 1 74.15891 130.08798] CT
0.149 GC
/Helvetica 20 F
GS
[1 0 0 1 0 0] CT
-12 7.5 moveto 
1 -1 scale
(0) t 
GR
GR
GS
[1.00215 0 0 1 74.15891 86.1582] CT
0.149 GC
/Helvetica 20 F
GS
[1 0 0 1 0 0] CT
-39 7.5 moveto 
1 -1 scale
(0.05) t 
GR
GR
GS
[1.00215 0 0 1 74.15891 42.22842] CT
0.149 GC
/Helvetica 20 F
GS
[1 0 0 1 0 0] CT
-28 7.5 moveto 
1 -1 scale
(0.1) t 
GR
GR
GS
[0 -1 1.00215 0 24.05154 129.99991] CT
0.149 GC
/Helvetica 20 F
GS
[1 0 0 1 0 0] CT
-75 -5 moveto 
1 -1 scale
(betathresh linear) t 
GR
GR
GS
[1.00215 0 0 1 129.77822 29.25] CT
/Helvetica-Bold 22 F
GS
[1 0 0 1 0 0] CT
-41 -5 moveto 
1 -1 scale
(p = 0.44) t 
GR
GR
GS
[1.00215 0 0 1 0 0] CT
0.149 GC
1 LJ
0.5 LW
N
80 130.088 M
179 130.088 L
S
GR
GS
[1.00215 0 0 1 0 0] CT
0.6 GC
N
93.86 130.088 M
93.86 131.556 L
125.54 131.556 L
125.54 130.088 L
cp
f
GR
GS
[1.00215 0 0 1 111.95938 109.25704] CT
0.302 GC
N
2.236 0 M
2.236 -1.235 1.235 -2.236 0 -2.236 C
-1.235 -2.236 -2.236 -1.235 -2.236 0 C
-2.236 1.235 -1.235 2.236 0 2.236 C
1.235 2.236 2.236 1.235 2.236 0 C
cp
f
GR
GS
[1.00215 0 0 1 114.0695 228] CT
0.302 GC
N
/f-1586420743{2.236 0 M
2.236 -1.235 1.235 -2.236 0 -2.236 C
-1.235 -2.236 -2.236 -1.235 -2.236 0 C
-2.236 1.235 -1.235 2.236 0 2.236 C
1.235 2.236 2.236 1.235 2.236 0 C
cp}def
f-1586420743
f
GR
GS
[1.00215 0 0 1 110.92521 32] CT
0.302 GC
N
f-1586420743
f
GR
GS
[1.00215 0 0 1 107.31259 103.51709] CT
0.302 GC
N
f-1586420743
f
GR
GS
[1.00215 0 0 1 111.56545 165.01817] CT
0.302 GC
N
f-1586420743
f
GR
GS
[1.00215 0 0 1 114.84187 83.56437] CT
0.302 GC
N
f-1586420743
f
GR
GS
[1.00215 0 0 1 111.0078 98.02314] CT
0.302 GC
N
f-1586420743
f
GR
GS
[1.00215 0 0 1 111.10802 203.12849] CT
0.302 GC
N
f-1586420743
f
GR
GS
[1.00215 0 0 1 108.46561 165.72328] CT
0.302 GC
N
f-1586420743
f
GR
GS
[1.00215 0 0 1 104.7752 159.12004] CT
0.302 GC
N
f-1586420743
f
GR
GS
[1.00215 0 0 1 102.37321 156.81871] CT
0.302 GC
N
f-1586420743
f
GR
GS
[1.00215 0 0 1 106.98628 170.86095] CT
0.302 GC
N
f-1586420743
f
GR
GS
[1.00215 0 0 1 105.38193 166.0733] CT
0.302 GC
N
f-1586420743
f
GR
GS
[1.00215 0 0 1 108.64845 118.75014] CT
0.302 GC
N
f-1586420743
f
GR
GS
[1.00215 0 0 1 106.45438 161.60852] CT
0.302 GC
N
f-1586420743
f
GR
GS
[1.00215 0 0 1 116.81294 75.22639] CT
0.302 GC
N
f-1586420743
f
GR
GS
[1.00215 0 0 1 112.3527 32] CT
0.302 GC
N
f-1586420743
f
GR
GS
[1.00215 0 0 1 111.85058 35.658] CT
0.302 GC
N
f-1586420743
f
GR
GS
[1.00215 0 0 1 116.0995 88.80432] CT
0.302 GC
N
f-1586420743
f
GR
GS
[1.00215 0 0 1 114.01679 131.70663] CT
0.302 GC
N
f-1586420743
f
GR
GS
[1.00215 0 0 1 108.76847 182.73982] CT
0.302 GC
N
f-1586420743
f
GR
GS
[1.00215 0 0 1 102.8368 164.59976] CT
0.302 GC
N
f-1586420743
f
GR
GS
[1.00215 0 0 1 112.00275 172.15112] CT
0.302 GC
N
f-1586420743
f
GR
GS
[1.00215 0 0 1 109.75995 161.9408] CT
0.302 GC
N
f-1586420743
f
GR
GS
[1.00215 0 0 1 109.66535 118.67974] CT
0.302 GC
N
f-1586420743
f
GR
GS
[1.00215 0 0 1 115.06573 149.54465] CT
0.302 GC
N
f-1586420743
f
GR
GS
[1.00215 0 0 1 112.93922 196.43864] CT
0.302 GC
N
f-1586420743
f
GR
GS
[1.00215 0 0 1 105.29255 144.85263] CT
0.302 GC
N
f-1586420743
f
GR
GS
[1.00215 0 0 1 108.05391 72.0051] CT
0.302 GC
N
f-1586420743
f
GR
GS
[1.00215 0 0 1 114.47839 32] CT
0.302 GC
N
f-1586420743
f
GR
GS
[1.00215 0 0 1 114.94707 198.03236] CT
0.302 GC
N
f-1586420743
f
GR
GS
[1.00215 0 0 1 110.94921 50.01416] CT
0.302 GC
N
f-1586420743
f
GR
GS
[1.00215 0 0 1 103.37469 32] CT
0.302 GC
N
f-1586420743
f
GR
GS
[1.00215 0 0 1 110.42382 204.6778] CT
0.302 GC
N
f-1586420743
f
GR
GS
[1.00215 0 0 1 117.03661 142.03633] CT
0.302 GC
N
f-1586420743
f
GR
GS
[1.00215 0 0 1 109.90226 41.5985] CT
0.302 GC
N
f-1586420743
f
GR
GS
[1.00215 0 0 1 109.60693 183.04376] CT
0.302 GC
N
f-1586420743
f
GR
GS
[1.00215 0 0 1 111.69968 127.75008] CT
0.302 GC
N
f-1586420743
f
GR
GS
[1.00215 0 0 1 108.4519 195.39355] CT
0.302 GC
N
f-1586420743
f
GR
GS
[1.00215 0 0 1 116.25245 124.23536] CT
0.302 GC
N
f-1586420743
f
GR
GS
[1.00215 0 0 1 106.09736 167.29324] CT
0.302 GC
N
f-1586420743
f
GR
GS
[1.00215 0 0 1 111.57381 179.46422] CT
0.302 GC
N
f-1586420743
f
GR
GS
[1.00215 0 0 1 0 0] CT
0.6 GC
N
/f1523029390{133.46 130.088 M
133.46 139.219 L
165.14 139.219 L
165.14 130.088 L
cp}def
f1523029390
f
GR
GS
[1.00215 0 0 1 142.36232 138.69673] CT
0.302 GC
N
f-1586420743
f
GR
GS
[1.00215 0 0 1 150.37985 171.68135] CT
0.302 GC
N
f-1586420743
f
GR
GS
[1.00215 0 0 1 153.06297 171.62376] CT
0.302 GC
N
f-1586420743
f
GR
GS
[1.00215 0 0 1 155.87813 54.11559] CT
0.302 GC
N
f-1586420743
f
GR
GS
[1.00215 0 0 1 153.53551 136.41672] CT
0.302 GC
N
f-1586420743
f
GR
GS
[1.00215 0 0 1 143.50586 163.29843] CT
0.302 GC
N
f-1586420743
f
GR
GS
[1.00215 0 0 1 143.24702 90.25295] CT
0.302 GC
N
f-1586420743
f
GR
GS
[1.00215 0 0 1 147.62312 144.18747] CT
0.302 GC
N
f-1586420743
f
GR
GS
[1.00215 0 0 1 146.46045 116.50195] CT
0.302 GC
N
f-1586420743
f
GR
GS
[1.00215 0 0 1 146.58071 106.76747] CT
0.302 GC
N
f-1586420743
f
GR
GS
[1.00215 0 0 1 145.96862 219.2993] CT
0.302 GC
N
f-1586420743
f
GR
GS
[1.00215 0 0 1 143.02336 139.2094] CT
0.302 GC
N
f-1586420743
f
GR
GS
[1.00215 0 0 1 146.77797 146.51372] CT
0.302 GC
N
f-1586420743
f
GR
GS
[1.00215 0 0 1 144.9138 137.18282] CT
0.302 GC
N
f-1586420743
f
GR
GS
[1.00215 0 0 1 144.30603 81.78725] CT
0.302 GC
N
f-1586420743
f
GR
GS
[1.00215 0 0 1 152.37012 157.09789] CT
0.302 GC
N
f-1586420743
f
GR
GS
[1.00215 0 0 1 154.77198 134.55141] CT
0.302 GC
N
f-1586420743
f
GR
GS
[1.00215 0 0 1 144.31881 177.49747] CT
0.302 GC
N
f-1586420743
f
GR
GS
[1.00215 0 0 1 142.12461 152.1806] CT
0.302 GC
N
f-1586420743
f
GR
GS
[1.00215 0 0 1 146.93027 131.62515] CT
0.302 GC
N
f-1586420743
f
GR
GS
[1.00215 0 0 1 149.43624 144.66766] CT
0.302 GC
N
f-1586420743
f
GR
GS
[1.00215 0 0 1 142.97285 153.89413] CT
0.302 GC
N
f-1586420743
f
GR
GS
[1.00215 0 0 1 149.37822 102.6169] CT
0.302 GC
N
f-1586420743
f
GR
GS
[1.00215 0 0 1 145.70338 147.16661] CT
0.302 GC
N
f-1586420743
f
GR
GS
[1.00215 0 0 1 147.18299 154.43916] CT
0.302 GC
N
f-1586420743
f
GR
GS
[1.00215 0 0 1 151.1093 126.39697] CT
0.302 GC
N
f-1586420743
f
GR
GS
[1.00215 0 0 1 149.51098 65.20651] CT
0.302 GC
N
f-1586420743
f
GR
GS
[1.00215 0 0 1 156.07393 78.13773] CT
0.302 GC
N
f-1586420743
f
GR
GS
[1.00215 0 0 1 146.40233 148.03455] CT
0.302 GC
N
f-1586420743
f
GR
GS
[1.00215 0 0 1 147.91199 141.89267] CT
0.302 GC
N
f-1586420743
f
GR
GS
[1.00215 0 0 1 156.01388 147.31654] CT
0.302 GC
N
f-1586420743
f
GR
GS
[1.00215 0 0 1 149.30419 92.51124] CT
0.302 GC
N
f-1586420743
f
GR
GS
[1.00215 0 0 1 144.6294 159.55675] CT
0.302 GC
N
f-1586420743
f
GR
GS
[1.00215 0 0 1 153.24504 152.42833] CT
0.302 GC
N
f-1586420743
f
GR
GS
[1.00215 0 0 1 155.66129 224.11964] CT
0.302 GC
N
f-1586420743
f
GR
GS
[1.00215 0 0 1 148.55367 91.27863] CT
0.302 GC
N
f-1586420743
f
GR
GS
[1.00215 0 0 1 151.32786 72.75691] CT
0.302 GC
N
f-1586420743
f
GR
GS
[1.00215 0 0 1 145.34622 121.38219] CT
0.302 GC
N
f-1586420743
f
GR
GS
[1.00215 0 0 1 151.30343 224.11964] CT
0.302 GC
N
f-1586420743
f
GR
GS
[1.00215 0 0 1 147.85902 144.40688] CT
0.302 GC
N
f-1586420743
f
GR
GS
[1.00215 0 0 1 153.32096 173.35434] CT
0.302 GC
N
f-1586420743
f
GR
GS
[1.00215 0 0 1 155.18612 175.71614] CT
0.302 GC
N
f-1586420743
f
GR
GS
[1.00215 0 0 1 150.12676 178.94905] CT
0.302 GC
N
f-1586420743
f
GR
GS
[1.00215 0 0 1 154.22519 134.07538] CT
0.302 GC
N
f-1586420743
f
GR
GS
[1.00215 0 0 1 156.27727 93.04228] CT
0.302 GC
N
f-1586420743
f
GR
GS
[1.00215 0 0 1 148.49134 123.49165] CT
0.302 GC
N
f-1586420743
f
GR
GS
[1.00215 0 0 1 146.21556 177.92149] CT
0.302 GC
N
f-1586420743
f
GR
GS
[1.00215 0 0 1 157.13156 138.15665] CT
0.302 GC
N
f-1586420743
f
GR
GS
[1.00215 0 0 1 156.4891 149.27928] CT
0.302 GC
N
f-1586420743
f
GR
GS
[1.00215 0 0 1 153.38108 54.11559] CT
0.302 GC
N
f-1586420743
f
GR
GS
[1.00215 0 0 1 144.28015 168.983] CT
0.302 GC
N
f-1586420743
f
GR
GS
[1.00215 0 0 1 144.25813 167.19855] CT
0.302 GC
N
f-1586420743
f
GR
GS
[1.00215 0 0 1 152.73799 181.51094] CT
0.302 GC
N
f-1586420743
f
GR
%%Trailer
%%Pages: 1
%%EOF
