%!PS-Adobe-3.0 EPSF-3.0
%%Creator: (MATLAB, The Mathworks, Inc. Version 9.8.0.1323502 \(R2020a\). Operating System: Mac OS X)
%%Title: /Users/kosciessa/Desktop/mntTardisLNDG/LNDG/stateswitch/stsw_multimodal/figures/l1byage/l1comp_drift.eps
%%CreationDate: 2022-03-02T14:36:40
%%Pages: (atend)
%%BoundingBox:     4     0   180   275
%%LanguageLevel: 3
%%EndComments
%%BeginProlog
%%BeginResource: procset (Apache XML Graphics Std ProcSet) 1.2 0
%%Version: 1.2 0
%%Copyright: (Copyright 2001-2003,2010 The Apache Software Foundation. License terms: http://www.apache.org/licenses/LICENSE-2.0)
/bd{bind def}bind def
/ld{load def}bd
/GR/grestore ld
/GS/gsave ld
/RM/rmoveto ld
/C/curveto ld
/t/show ld
/L/lineto ld
/ML/setmiterlimit ld
/CT/concat ld
/f/fill ld
/N/newpath ld
/S/stroke ld
/CC/setcmykcolor ld
/A/ashow ld
/cp/closepath ld
/RC/setrgbcolor ld
/LJ/setlinejoin ld
/GC/setgray ld
/LW/setlinewidth ld
/M/moveto ld
/re {4 2 roll M
1 index 0 rlineto
0 exch rlineto
neg 0 rlineto
cp } bd
/_ctm matrix def
/_tm matrix def
/BT { _ctm currentmatrix pop matrix _tm copy pop 0 0 moveto } bd
/ET { _ctm setmatrix } bd
/iTm { _ctm setmatrix _tm concat } bd
/Tm { _tm astore pop iTm 0 0 moveto } bd
/ux 0.0 def
/uy 0.0 def
/F {
  /Tp exch def
  /Tf exch def
  Tf findfont Tp scalefont setfont
  /cf Tf def  /cs Tp def
} bd
/ULS {currentpoint /uy exch def /ux exch def} bd
/ULE {
  /Tcx currentpoint pop def
  gsave
  newpath
  cf findfont cs scalefont dup
  /FontMatrix get 0 get /Ts exch def /FontInfo get dup
  /UnderlinePosition get Ts mul /To exch def
  /UnderlineThickness get Ts mul /Tt exch def
  ux uy To add moveto  Tcx uy To add lineto
  Tt setlinewidth stroke
  grestore
} bd
/OLE {
  /Tcx currentpoint pop def
  gsave
  newpath
  cf findfont cs scalefont dup
  /FontMatrix get 0 get /Ts exch def /FontInfo get dup
  /UnderlinePosition get Ts mul /To exch def
  /UnderlineThickness get Ts mul /Tt exch def
  ux uy To add cs add moveto Tcx uy To add cs add lineto
  Tt setlinewidth stroke
  grestore
} bd
/SOE {
  /Tcx currentpoint pop def
  gsave
  newpath
  cf findfont cs scalefont dup
  /FontMatrix get 0 get /Ts exch def /FontInfo get dup
  /UnderlinePosition get Ts mul /To exch def
  /UnderlineThickness get Ts mul /Tt exch def
  ux uy To add cs 10 mul 26 idiv add moveto Tcx uy To add cs 10 mul 26 idiv add lineto
  Tt setlinewidth stroke
  grestore
} bd
/QT {
/Y22 exch store
/X22 exch store
/Y21 exch store
/X21 exch store
currentpoint
/Y21 load 2 mul add 3 div exch
/X21 load 2 mul add 3 div exch
/X21 load 2 mul /X22 load add 3 div
/Y21 load 2 mul /Y22 load add 3 div
/X22 load /Y22 load curveto
} bd
/SSPD {
dup length /d exch dict def
{
/v exch def
/k exch def
currentpagedevice k known {
/cpdv currentpagedevice k get def
v cpdv ne {
/upd false def
/nullv v type /nulltype eq def
/nullcpdv cpdv type /nulltype eq def
nullv nullcpdv or
{
/upd true def
} {
/sametype v type cpdv type eq def
sametype {
v type /arraytype eq {
/vlen v length def
/cpdvlen cpdv length def
vlen cpdvlen eq {
0 1 vlen 1 sub {
/i exch def
/obj v i get def
/cpdobj cpdv i get def
obj cpdobj ne {
/upd true def
exit
} if
} for
} {
/upd true def
} ifelse
} {
v type /dicttype eq {
v {
/dv exch def
/dk exch def
/cpddv cpdv dk get def
dv cpddv ne {
/upd true def
exit
} if
} forall
} {
/upd true def
} ifelse
} ifelse
} if
} ifelse
upd true eq {
d k v put
} if
} if
} if
} forall
d length 0 gt {
d setpagedevice
} if
} bd
/RE { % /NewFontName [NewEncodingArray] /FontName RE -
  findfont dup length dict begin
  {
    1 index /FID ne
    {def} {pop pop} ifelse
  } forall
  /Encoding exch def
  /FontName 1 index def
  currentdict definefont pop
  end
} bind def
%%EndResource
%%BeginResource: procset (Apache XML Graphics EPS ProcSet) 1.0 0
%%Version: 1.0 0
%%Copyright: (Copyright 2002-2003 The Apache Software Foundation. License terms: http://www.apache.org/licenses/LICENSE-2.0)
/BeginEPSF { %def
/b4_Inc_state save def         % Save state for cleanup
/dict_count countdictstack def % Count objects on dict stack
/op_count count 1 sub def      % Count objects on operand stack
userdict begin                 % Push userdict on dict stack
/showpage { } def              % Redefine showpage, { } = null proc
0 setgray 0 setlinecap         % Prepare graphics state
1 setlinewidth 0 setlinejoin
10 setmiterlimit [ ] 0 setdash newpath
/languagelevel where           % If level not equal to 1 then
{pop languagelevel             % set strokeadjust and
1 ne                           % overprint to their defaults.
{false setstrokeadjust false setoverprint
} if
} if
} bd
/EndEPSF { %def
count op_count sub {pop} repeat            % Clean up stacks
countdictstack dict_count sub {end} repeat
b4_Inc_state restore
} bd
%%EndResource
%FOPBeginFontDict
%%IncludeResource: font Courier-Oblique
%%IncludeResource: font Courier-BoldOblique
%%IncludeResource: font Courier-Bold
%%IncludeResource: font ZapfDingbats
%%IncludeResource: font Symbol
%%IncludeResource: font Helvetica
%%IncludeResource: font Helvetica-Oblique
%%IncludeResource: font Helvetica-Bold
%%IncludeResource: font Helvetica-BoldOblique
%%IncludeResource: font Times-Roman
%%IncludeResource: font Times-Italic
%%IncludeResource: font Times-Bold
%%IncludeResource: font Times-BoldItalic
%%IncludeResource: font Courier
%FOPEndFontDict
%%BeginResource: encoding WinAnsiEncoding
/WinAnsiEncoding [
/.notdef /.notdef /.notdef /.notdef /.notdef
/.notdef /.notdef /.notdef /.notdef /.notdef
/.notdef /.notdef /.notdef /.notdef /.notdef
/.notdef /.notdef /.notdef /.notdef /.notdef
/.notdef /.notdef /.notdef /.notdef /.notdef
/.notdef /.notdef /.notdef /.notdef /.notdef
/.notdef /.notdef /space /exclam /quotedbl
/numbersign /dollar /percent /ampersand /quotesingle
/parenleft /parenright /asterisk /plus /comma
/hyphen /period /slash /zero /one
/two /three /four /five /six
/seven /eight /nine /colon /semicolon
/less /equal /greater /question /at
/A /B /C /D /E
/F /G /H /I /J
/K /L /M /N /O
/P /Q /R /S /T
/U /V /W /X /Y
/Z /bracketleft /backslash /bracketright /asciicircum
/underscore /quoteleft /a /b /c
/d /e /f /g /h
/i /j /k /l /m
/n /o /p /q /r
/s /t /u /v /w
/x /y /z /braceleft /bar
/braceright /asciitilde /bullet /Euro /bullet
/quotesinglbase /florin /quotedblbase /ellipsis /dagger
/daggerdbl /circumflex /perthousand /Scaron /guilsinglleft
/OE /bullet /Zcaron /bullet /bullet
/quoteleft /quoteright /quotedblleft /quotedblright /bullet
/endash /emdash /asciitilde /trademark /scaron
/guilsinglright /oe /bullet /zcaron /Ydieresis
/space /exclamdown /cent /sterling /currency
/yen /brokenbar /section /dieresis /copyright
/ordfeminine /guillemotleft /logicalnot /sfthyphen /registered
/macron /degree /plusminus /twosuperior /threesuperior
/acute /mu /paragraph /middot /cedilla
/onesuperior /ordmasculine /guillemotright /onequarter /onehalf
/threequarters /questiondown /Agrave /Aacute /Acircumflex
/Atilde /Adieresis /Aring /AE /Ccedilla
/Egrave /Eacute /Ecircumflex /Edieresis /Igrave
/Iacute /Icircumflex /Idieresis /Eth /Ntilde
/Ograve /Oacute /Ocircumflex /Otilde /Odieresis
/multiply /Oslash /Ugrave /Uacute /Ucircumflex
/Udieresis /Yacute /Thorn /germandbls /agrave
/aacute /acircumflex /atilde /adieresis /aring
/ae /ccedilla /egrave /eacute /ecircumflex
/edieresis /igrave /iacute /icircumflex /idieresis
/eth /ntilde /ograve /oacute /ocircumflex
/otilde /odieresis /divide /oslash /ugrave
/uacute /ucircumflex /udieresis /yacute /thorn
/ydieresis
] def
%%EndResource
%FOPBeginFontReencode
/Courier-Oblique findfont
dup length dict begin
  {1 index /FID ne {def} {pop pop} ifelse} forall
  /Encoding WinAnsiEncoding def
  currentdict
end
/Courier-Oblique exch definefont pop
/Courier-BoldOblique findfont
dup length dict begin
  {1 index /FID ne {def} {pop pop} ifelse} forall
  /Encoding WinAnsiEncoding def
  currentdict
end
/Courier-BoldOblique exch definefont pop
/Courier-Bold findfont
dup length dict begin
  {1 index /FID ne {def} {pop pop} ifelse} forall
  /Encoding WinAnsiEncoding def
  currentdict
end
/Courier-Bold exch definefont pop
/Helvetica findfont
dup length dict begin
  {1 index /FID ne {def} {pop pop} ifelse} forall
  /Encoding WinAnsiEncoding def
  currentdict
end
/Helvetica exch definefont pop
/Helvetica-Oblique findfont
dup length dict begin
  {1 index /FID ne {def} {pop pop} ifelse} forall
  /Encoding WinAnsiEncoding def
  currentdict
end
/Helvetica-Oblique exch definefont pop
/Helvetica-Bold findfont
dup length dict begin
  {1 index /FID ne {def} {pop pop} ifelse} forall
  /Encoding WinAnsiEncoding def
  currentdict
end
/Helvetica-Bold exch definefont pop
/Helvetica-BoldOblique findfont
dup length dict begin
  {1 index /FID ne {def} {pop pop} ifelse} forall
  /Encoding WinAnsiEncoding def
  currentdict
end
/Helvetica-BoldOblique exch definefont pop
/Times-Roman findfont
dup length dict begin
  {1 index /FID ne {def} {pop pop} ifelse} forall
  /Encoding WinAnsiEncoding def
  currentdict
end
/Times-Roman exch definefont pop
/Times-Italic findfont
dup length dict begin
  {1 index /FID ne {def} {pop pop} ifelse} forall
  /Encoding WinAnsiEncoding def
  currentdict
end
/Times-Italic exch definefont pop
/Times-Bold findfont
dup length dict begin
  {1 index /FID ne {def} {pop pop} ifelse} forall
  /Encoding WinAnsiEncoding def
  currentdict
end
/Times-Bold exch definefont pop
/Times-BoldItalic findfont
dup length dict begin
  {1 index /FID ne {def} {pop pop} ifelse} forall
  /Encoding WinAnsiEncoding def
  currentdict
end
/Times-BoldItalic exch definefont pop
/Courier findfont
dup length dict begin
  {1 index /FID ne {def} {pop pop} ifelse} forall
  /Encoding WinAnsiEncoding def
  currentdict
end
/Courier exch definefont pop
%FOPEndFontReencode
%%EndProlog
%%Page: 1 1
%%PageBoundingBox: 0 0 198 283
%%BeginPageSetup
[1 0 0 -1 0 283] CT
%%EndPageSetup
GS
[1.00215 0 0 1 0 0] CT
1 GC
N
0 0 198 283 re
f
GR
GS
[1.00215 0 0 1 0 0] CT
1 GC
N
0 0 198 283 re
f
GR
GS
[1.00215 0 0 1 0 0] CT
1 GC
N
44.5 228 M
179 228 L
179 32 L
44.5 32 L
cp
f
GR
GS
[1.00215 0 0 1 0 0] CT
0.149 GC
2 setlinecap
1 LJ
0.5 LW
N
44.5 228 M
179 228 L
S
GR
GS
[1.00215 0 0 1 0 0] CT
0.149 GC
2 setlinecap
1 LJ
0.5 LW
N
84.85 228 M
84.85 226.04 L
S
GR
GS
[1.00215 0 0 1 0 0] CT
0.149 GC
2 setlinecap
1 LJ
0.5 LW
N
138.65 228 M
138.65 226.04 L
S
GR
GS
[1.00215 0 0 1 85.03221 234] CT
0.149 GC
/Helvetica 20 F
GS
[1 0 0 1 0 0] CT
-13 20 moveto 
1 -1 scale
(YA) t 
GR
GR
GS
[1.00215 0 0 1 138.94774 234] CT
0.149 GC
/Helvetica 20 F
GS
[1 0 0 1 0 0] CT
-14.5 20 moveto 
1 -1 scale
(OA) t 
GR
GR
GS
[1.00215 0 0 1 111.99004 259] CT
0.149 GC
/Helvetica 20 F
GS
[1 0 0 1 0 0] CT
-49 20 moveto 
1 -1 scale
(Age Group) t 
GR
GR
GS
[1.00215 0 0 1 0 0] CT
0.149 GC
2 setlinecap
1 LJ
0.5 LW
N
44.5 228 M
44.5 32 L
S
GR
GS
[1.00215 0 0 1 0 0] CT
0.149 GC
2 setlinecap
1 LJ
0.5 LW
N
44.5 228 M
46.46 228 L
S
GR
GS
[1.00215 0 0 1 0 0] CT
0.149 GC
2 setlinecap
1 LJ
0.5 LW
N
44.5 164.586 M
46.46 164.586 L
S
GR
GS
[1.00215 0 0 1 0 0] CT
0.149 GC
2 setlinecap
1 LJ
0.5 LW
N
44.5 101.173 M
46.46 101.173 L
S
GR
GS
[1.00215 0 0 1 0 0] CT
0.149 GC
2 setlinecap
1 LJ
0.5 LW
N
44.5 37.759 M
46.46 37.759 L
S
GR
GS
[1.00215 0 0 1 38.58268 228] CT
0.149 GC
/Helvetica 20 F
GS
[1 0 0 1 0 0] CT
-12 7.5 moveto 
1 -1 scale
(0) t 
GR
GR
GS
[1.00215 0 0 1 38.58268 164.58626] CT
0.149 GC
/Helvetica 20 F
GS
[1 0 0 1 0 0] CT
-12 7.5 moveto 
1 -1 scale
(1) t 
GR
GR
GS
[1.00215 0 0 1 38.58268 101.17251] CT
0.149 GC
/Helvetica 20 F
GS
[1 0 0 1 0 0] CT
-12 7.5 moveto 
1 -1 scale
(2) t 
GR
GR
GS
[1.00215 0 0 1 38.58268 37.75877] CT
0.149 GC
/Helvetica 20 F
GS
[1 0 0 1 0 0] CT
-12 7.5 moveto 
1 -1 scale
(3) t 
GR
GR
GS
[0 -1 1.00215 0 24.05154 129.99991] CT
0.149 GC
/Helvetica 20 F
GS
[1 0 0 1 0 0] CT
-28.5 -5 moveto 
1 -1 scale
(drift l1) t 
GR
GR
GS
[1.00215 0 0 1 111.99009 29.24999] CT
/Helvetica-Bold 22 F
GS
[1 0 0 1 0 0] CT
-60 -5 moveto 
1 -1 scale
(p = 0.0e+00) t 
GR
GR
GS
[1.00215 0 0 1 0 0] CT
0.149 GC
1 LJ
0.5 LW
N
44.5 228 M
179 228 L
S
GR
GS
[1.00215 0 0 1 0 0] CT
1 0.6 0.6 RC
N
106.37 228 M
106.37 91.341 L
63.33 91.341 L
63.33 228 L
cp
f
GR
GS
[1.00215 0 0 1 85.60604 70.15145] CT
0.302 GC
N
2.236 0 M
2.236 -1.235 1.235 -2.236 0 -2.236 C
-1.235 -2.236 -2.236 -1.235 -2.236 0 C
-2.236 1.235 -1.235 2.236 0 2.236 C
1.235 2.236 2.236 1.235 2.236 0 C
cp
f
GR
GS
[1.00215 0 0 1 78.73132 109.06741] CT
0.302 GC
N
/f-1586420743{2.236 0 M
2.236 -1.235 1.235 -2.236 0 -2.236 C
-1.235 -2.236 -2.236 -1.235 -2.236 0 C
-2.236 1.235 -1.235 2.236 0 2.236 C
1.235 2.236 2.236 1.235 2.236 0 C
cp}def
f-1586420743
f
GR
GS
[1.00215 0 0 1 85.70967 77.97255] CT
0.302 GC
N
f-1586420743
f
GR
GS
[1.00215 0 0 1 88.88365 105.10667] CT
0.302 GC
N
f-1586420743
f
GR
GS
[1.00215 0 0 1 75.94016 149.26016] CT
0.302 GC
N
f-1586420743
f
GR
GS
[1.00215 0 0 1 76.21346 83.26817] CT
0.302 GC
N
f-1586420743
f
GR
GS
[1.00215 0 0 1 78.3102 82.75717] CT
0.302 GC
N
f-1586420743
f
GR
GS
[1.00215 0 0 1 84.21424 62.69637] CT
0.302 GC
N
f-1586420743
f
GR
GS
[1.00215 0 0 1 77.89146 134.79417] CT
0.302 GC
N
f-1586420743
f
GR
GS
[1.00215 0 0 1 84.40172 84.03716] CT
0.302 GC
N
f-1586420743
f
GR
GS
[1.00215 0 0 1 76.75988 118.65304] CT
0.302 GC
N
f-1586420743
f
GR
GS
[1.00215 0 0 1 80.19542 78.53953] CT
0.302 GC
N
f-1586420743
f
GR
GS
[1.00215 0 0 1 76.94942 115.17831] CT
0.302 GC
N
f-1586420743
f
GR
GS
[1.00215 0 0 1 78.57306 103.48629] CT
0.302 GC
N
f-1586420743
f
GR
GS
[1.00215 0 0 1 93.9583 128.82698] CT
0.302 GC
N
f-1586420743
f
GR
GS
[1.00215 0 0 1 92.32831 191.36234] CT
0.302 GC
N
f-1586420743
f
GR
GS
[1.00215 0 0 1 77.32242 117.00266] CT
0.302 GC
N
f-1586420743
f
GR
GS
[1.00215 0 0 1 90.85782 73.44861] CT
0.302 GC
N
f-1586420743
f
GR
GS
[1.00215 0 0 1 94.6755 87.5447] CT
0.302 GC
N
f-1586420743
f
GR
GS
[1.00215 0 0 1 94.20939 110.46442] CT
0.302 GC
N
f-1586420743
f
GR
GS
[1.00215 0 0 1 76.3789 64.33508] CT
0.302 GC
N
f-1586420743
f
GR
GS
[1.00215 0 0 1 81.94957 97.91731] CT
0.302 GC
N
f-1586420743
f
GR
GS
[1.00215 0 0 1 89.74854 153.58656] CT
0.302 GC
N
f-1586420743
f
GR
GS
[1.00215 0 0 1 88.10723 65.45818] CT
0.302 GC
N
f-1586420743
f
GR
GS
[1.00215 0 0 1 79.2395 46.06636] CT
0.302 GC
N
f-1586420743
f
GR
GS
[1.00215 0 0 1 90.95418 88.90392] CT
0.302 GC
N
f-1586420743
f
GR
GS
[1.00215 0 0 1 95.19968 108.70126] CT
0.302 GC
N
f-1586420743
f
GR
GS
[1.00215 0 0 1 81.6585 47.48398] CT
0.302 GC
N
f-1586420743
f
GR
GS
[1.00215 0 0 1 95.02404 64.03947] CT
0.302 GC
N
f-1586420743
f
GR
GS
[1.00215 0 0 1 74.90803 105.61925] CT
0.302 GC
N
f-1586420743
f
GR
GS
[1.00215 0 0 1 77.94892 85.02715] CT
0.302 GC
N
f-1586420743
f
GR
GS
[1.00215 0 0 1 91.70279 41.9243] CT
0.302 GC
N
f-1586420743
f
GR
GS
[1.00215 0 0 1 86.12495 54.20745] CT
0.302 GC
N
f-1586420743
f
GR
GS
[1.00215 0 0 1 93.81651 53.33902] CT
0.302 GC
N
f-1586420743
f
GR
GS
[1.00215 0 0 1 76.01336 76.64581] CT
0.302 GC
N
f-1586420743
f
GR
GS
[1.00215 0 0 1 87.6372 31.99999] CT
0.302 GC
N
f-1586420743
f
GR
GS
[1.00215 0 0 1 83.67016 110.94038] CT
0.302 GC
N
f-1586420743
f
GR
GS
[1.00215 0 0 1 82.36487 51.21857] CT
0.302 GC
N
f-1586420743
f
GR
GS
[1.00215 0 0 1 88.95339 136.05148] CT
0.302 GC
N
f-1586420743
f
GR
GS
[1.00215 0 0 1 76.81111 71.96181] CT
0.302 GC
N
f-1586420743
f
GR
GS
[1.00215 0 0 1 87.60908 110.34058] CT
0.302 GC
N
f-1586420743
f
GR
GS
[1.00215 0 0 1 80.87036 86.95285] CT
0.302 GC
N
f-1586420743
f
GR
GS
[1.00215 0 0 1 0 0] CT
1 0.6 0.6 RC
N
/f664546254{160.17 228 M
160.17 159.019 L
117.13 159.019 L
117.13 228 L
cp}def
f664546254
f
GR
GS
[1.00215 0 0 1 140.96815 162.68811] CT
0.302 GC
N
f-1586420743
f
GR
GS
[1.00215 0 0 1 148.46605 149.75183] CT
0.302 GC
N
f-1586420743
f
GR
GS
[1.00215 0 0 1 134.36416 132.46483] CT
0.302 GC
N
f-1586420743
f
GR
GS
[1.00215 0 0 1 134.75399 217.40273] CT
0.302 GC
N
f-1586420743
f
GR
GS
[1.00215 0 0 1 140.25722 141.18256] CT
0.302 GC
N
f-1586420743
f
GR
GS
[1.00215 0 0 1 143.40318 173.54539] CT
0.302 GC
N
f-1586420743
f
GR
GS
[1.00215 0 0 1 136.13692 123.68025] CT
0.302 GC
N
f-1586420743
f
GR
GS
[1.00215 0 0 1 132.60159 161.89493] CT
0.302 GC
N
f-1586420743
f
GR
GS
[1.00215 0 0 1 136.12436 158.9838] CT
0.302 GC
N
f-1586420743
f
GR
GS
[1.00215 0 0 1 140.15166 148.63794] CT
0.302 GC
N
f-1586420743
f
GR
GS
[1.00215 0 0 1 130.11551 146.33304] CT
0.302 GC
N
f-1586420743
f
GR
GS
[1.00215 0 0 1 128.91674 187.35631] CT
0.302 GC
N
f-1586420743
f
GR
GS
[1.00215 0 0 1 144.88114 113.53152] CT
0.302 GC
N
f-1586420743
f
GR
GS
[1.00215 0 0 1 132.88521 142.02551] CT
0.302 GC
N
f-1586420743
f
GR
GS
[1.00215 0 0 1 140.8148 154.74066] CT
0.302 GC
N
f-1586420743
f
GR
GS
[1.00215 0 0 1 131.49583 127.43633] CT
0.302 GC
N
f-1586420743
f
GR
GS
[1.00215 0 0 1 130.58051 139.61697] CT
0.302 GC
N
f-1586420743
f
GR
GS
[1.00215 0 0 1 129.32952 162.52008] CT
0.302 GC
N
f-1586420743
f
GR
GS
[1.00215 0 0 1 129.15896 168.01019] CT
0.302 GC
N
f-1586420743
f
GR
GS
[1.00215 0 0 1 133.89616 205.79924] CT
0.302 GC
N
f-1586420743
f
GR
GS
[1.00215 0 0 1 136.6636 158.65022] CT
0.302 GC
N
f-1586420743
f
GR
GS
[1.00215 0 0 1 140.7892 162.39363] CT
0.302 GC
N
f-1586420743
f
GR
GS
[1.00215 0 0 1 134.43979 166.94531] CT
0.302 GC
N
f-1586420743
f
GR
GS
[1.00215 0 0 1 129.45121 175.73973] CT
0.302 GC
N
f-1586420743
f
GR
GS
[1.00215 0 0 1 133.6996 161.47821] CT
0.302 GC
N
f-1586420743
f
GR
GS
[1.00215 0 0 1 135.26921 130.815] CT
0.302 GC
N
f-1586420743
f
GR
GS
[1.00215 0 0 1 128.25163 121.24625] CT
0.302 GC
N
f-1586420743
f
GR
GS
[1.00215 0 0 1 129.64474 156.43724] CT
0.302 GC
N
f-1586420743
f
GR
GS
[1.00215 0 0 1 133.40085 146.39474] CT
0.302 GC
N
f-1586420743
f
GR
GS
[1.00215 0 0 1 143.02773 144.23868] CT
0.302 GC
N
f-1586420743
f
GR
GS
[1.00215 0 0 1 128.38207 179.26297] CT
0.302 GC
N
f-1586420743
f
GR
GS
[1.00215 0 0 1 129.10613 127.93209] CT
0.302 GC
N
f-1586420743
f
GR
GS
[1.00215 0 0 1 142.65934 181.40883] CT
0.302 GC
N
f-1586420743
f
GR
GS
[1.00215 0 0 1 139.37693 165.09464] CT
0.302 GC
N
f-1586420743
f
GR
GS
[1.00215 0 0 1 128.94425 162.01675] CT
0.302 GC
N
f-1586420743
f
GR
GS
[1.00215 0 0 1 137.40158 175.24695] CT
0.302 GC
N
f-1586420743
f
GR
GS
[1.00215 0 0 1 138.29944 197.49974] CT
0.302 GC
N
f-1586420743
f
GR
GS
[1.00215 0 0 1 138.85767 171.32809] CT
0.302 GC
N
f-1586420743
f
GR
GS
[1.00215 0 0 1 140.25749 150.96747] CT
0.302 GC
N
f-1586420743
f
GR
GS
[1.00215 0 0 1 142.62903 151.57475] CT
0.302 GC
N
f-1586420743
f
GR
GS
[1.00215 0 0 1 132.55459 212.42989] CT
0.302 GC
N
f-1586420743
f
GR
GS
[1.00215 0 0 1 131.13723 197.65198] CT
0.302 GC
N
f-1586420743
f
GR
GS
[1.00215 0 0 1 147.87295 158.24706] CT
0.302 GC
N
f-1586420743
f
GR
GS
[1.00215 0 0 1 130.76754 153.23503] CT
0.302 GC
N
f-1586420743
f
GR
GS
[1.00215 0 0 1 139.88481 151.77231] CT
0.302 GC
N
f-1586420743
f
GR
GS
[1.00215 0 0 1 146.16635 165.86983] CT
0.302 GC
N
f-1586420743
f
GR
GS
[1.00215 0 0 1 140.25577 163.13652] CT
0.302 GC
N
f-1586420743
f
GR
GS
[1.00215 0 0 1 134.66933 161.38335] CT
0.302 GC
N
f-1586420743
f
GR
GS
[1.00215 0 0 1 128.2906 139.50719] CT
0.302 GC
N
f-1586420743
f
GR
GS
[1.00215 0 0 1 130.30306 152.64925] CT
0.302 GC
N
f-1586420743
f
GR
GS
[1.00215 0 0 1 134.19776 119.56275] CT
0.302 GC
N
f-1586420743
f
GR
GS
[1.00215 0 0 1 147.27384 172.97348] CT
0.302 GC
N
f-1586420743
f
GR
GS
[1.00215 0 0 1 141.07362 175.30418] CT
0.302 GC
N
f-1586420743
f
GR
%%Trailer
%%Pages: 1
%%EOF
