%!PS-Adobe-3.0 EPSF-3.0
%%Creator: (MATLAB, The Mathworks, Inc. Version 9.8.0.1323502 \(R2020a\). Operating System: Mac OS X)
%%Title: /Users/kosciessa/Desktop/mntTardisLNDG/LNDG/stateswitch/stsw_multimodal/figures/linearbyage/linearcomp_cpp.eps
%%CreationDate: 2022-03-03T16:32:27
%%Pages: (atend)
%%BoundingBox:     4     0   180   278
%%LanguageLevel: 3
%%EndComments
%%BeginProlog
%%BeginResource: procset (Apache XML Graphics Std ProcSet) 1.2 0
%%Version: 1.2 0
%%Copyright: (Copyright 2001-2003,2010 The Apache Software Foundation. License terms: http://www.apache.org/licenses/LICENSE-2.0)
/bd{bind def}bind def
/ld{load def}bd
/GR/grestore ld
/GS/gsave ld
/RM/rmoveto ld
/C/curveto ld
/t/show ld
/L/lineto ld
/ML/setmiterlimit ld
/CT/concat ld
/f/fill ld
/N/newpath ld
/S/stroke ld
/CC/setcmykcolor ld
/A/ashow ld
/cp/closepath ld
/RC/setrgbcolor ld
/LJ/setlinejoin ld
/GC/setgray ld
/LW/setlinewidth ld
/M/moveto ld
/re {4 2 roll M
1 index 0 rlineto
0 exch rlineto
neg 0 rlineto
cp } bd
/_ctm matrix def
/_tm matrix def
/BT { _ctm currentmatrix pop matrix _tm copy pop 0 0 moveto } bd
/ET { _ctm setmatrix } bd
/iTm { _ctm setmatrix _tm concat } bd
/Tm { _tm astore pop iTm 0 0 moveto } bd
/ux 0.0 def
/uy 0.0 def
/F {
  /Tp exch def
  /Tf exch def
  Tf findfont Tp scalefont setfont
  /cf Tf def  /cs Tp def
} bd
/ULS {currentpoint /uy exch def /ux exch def} bd
/ULE {
  /Tcx currentpoint pop def
  gsave
  newpath
  cf findfont cs scalefont dup
  /FontMatrix get 0 get /Ts exch def /FontInfo get dup
  /UnderlinePosition get Ts mul /To exch def
  /UnderlineThickness get Ts mul /Tt exch def
  ux uy To add moveto  Tcx uy To add lineto
  Tt setlinewidth stroke
  grestore
} bd
/OLE {
  /Tcx currentpoint pop def
  gsave
  newpath
  cf findfont cs scalefont dup
  /FontMatrix get 0 get /Ts exch def /FontInfo get dup
  /UnderlinePosition get Ts mul /To exch def
  /UnderlineThickness get Ts mul /Tt exch def
  ux uy To add cs add moveto Tcx uy To add cs add lineto
  Tt setlinewidth stroke
  grestore
} bd
/SOE {
  /Tcx currentpoint pop def
  gsave
  newpath
  cf findfont cs scalefont dup
  /FontMatrix get 0 get /Ts exch def /FontInfo get dup
  /UnderlinePosition get Ts mul /To exch def
  /UnderlineThickness get Ts mul /Tt exch def
  ux uy To add cs 10 mul 26 idiv add moveto Tcx uy To add cs 10 mul 26 idiv add lineto
  Tt setlinewidth stroke
  grestore
} bd
/QT {
/Y22 exch store
/X22 exch store
/Y21 exch store
/X21 exch store
currentpoint
/Y21 load 2 mul add 3 div exch
/X21 load 2 mul add 3 div exch
/X21 load 2 mul /X22 load add 3 div
/Y21 load 2 mul /Y22 load add 3 div
/X22 load /Y22 load curveto
} bd
/SSPD {
dup length /d exch dict def
{
/v exch def
/k exch def
currentpagedevice k known {
/cpdv currentpagedevice k get def
v cpdv ne {
/upd false def
/nullv v type /nulltype eq def
/nullcpdv cpdv type /nulltype eq def
nullv nullcpdv or
{
/upd true def
} {
/sametype v type cpdv type eq def
sametype {
v type /arraytype eq {
/vlen v length def
/cpdvlen cpdv length def
vlen cpdvlen eq {
0 1 vlen 1 sub {
/i exch def
/obj v i get def
/cpdobj cpdv i get def
obj cpdobj ne {
/upd true def
exit
} if
} for
} {
/upd true def
} ifelse
} {
v type /dicttype eq {
v {
/dv exch def
/dk exch def
/cpddv cpdv dk get def
dv cpddv ne {
/upd true def
exit
} if
} forall
} {
/upd true def
} ifelse
} ifelse
} if
} ifelse
upd true eq {
d k v put
} if
} if
} if
} forall
d length 0 gt {
d setpagedevice
} if
} bd
/RE { % /NewFontName [NewEncodingArray] /FontName RE -
  findfont dup length dict begin
  {
    1 index /FID ne
    {def} {pop pop} ifelse
  } forall
  /Encoding exch def
  /FontName 1 index def
  currentdict definefont pop
  end
} bind def
%%EndResource
%%BeginResource: procset (Apache XML Graphics EPS ProcSet) 1.0 0
%%Version: 1.0 0
%%Copyright: (Copyright 2002-2003 The Apache Software Foundation. License terms: http://www.apache.org/licenses/LICENSE-2.0)
/BeginEPSF { %def
/b4_Inc_state save def         % Save state for cleanup
/dict_count countdictstack def % Count objects on dict stack
/op_count count 1 sub def      % Count objects on operand stack
userdict begin                 % Push userdict on dict stack
/showpage { } def              % Redefine showpage, { } = null proc
0 setgray 0 setlinecap         % Prepare graphics state
1 setlinewidth 0 setlinejoin
10 setmiterlimit [ ] 0 setdash newpath
/languagelevel where           % If level not equal to 1 then
{pop languagelevel             % set strokeadjust and
1 ne                           % overprint to their defaults.
{false setstrokeadjust false setoverprint
} if
} if
} bd
/EndEPSF { %def
count op_count sub {pop} repeat            % Clean up stacks
countdictstack dict_count sub {end} repeat
b4_Inc_state restore
} bd
%%EndResource
%FOPBeginFontDict
%%IncludeResource: font Courier-Oblique
%%IncludeResource: font Courier-BoldOblique
%%IncludeResource: font Courier-Bold
%%IncludeResource: font ZapfDingbats
%%IncludeResource: font Symbol
%%IncludeResource: font Helvetica
%%IncludeResource: font Helvetica-Oblique
%%IncludeResource: font Helvetica-Bold
%%IncludeResource: font Helvetica-BoldOblique
%%IncludeResource: font Times-Roman
%%IncludeResource: font Times-Italic
%%IncludeResource: font Times-Bold
%%IncludeResource: font Times-BoldItalic
%%IncludeResource: font Courier
%FOPEndFontDict
%%BeginResource: encoding WinAnsiEncoding
/WinAnsiEncoding [
/.notdef /.notdef /.notdef /.notdef /.notdef
/.notdef /.notdef /.notdef /.notdef /.notdef
/.notdef /.notdef /.notdef /.notdef /.notdef
/.notdef /.notdef /.notdef /.notdef /.notdef
/.notdef /.notdef /.notdef /.notdef /.notdef
/.notdef /.notdef /.notdef /.notdef /.notdef
/.notdef /.notdef /space /exclam /quotedbl
/numbersign /dollar /percent /ampersand /quotesingle
/parenleft /parenright /asterisk /plus /comma
/hyphen /period /slash /zero /one
/two /three /four /five /six
/seven /eight /nine /colon /semicolon
/less /equal /greater /question /at
/A /B /C /D /E
/F /G /H /I /J
/K /L /M /N /O
/P /Q /R /S /T
/U /V /W /X /Y
/Z /bracketleft /backslash /bracketright /asciicircum
/underscore /quoteleft /a /b /c
/d /e /f /g /h
/i /j /k /l /m
/n /o /p /q /r
/s /t /u /v /w
/x /y /z /braceleft /bar
/braceright /asciitilde /bullet /Euro /bullet
/quotesinglbase /florin /quotedblbase /ellipsis /dagger
/daggerdbl /circumflex /perthousand /Scaron /guilsinglleft
/OE /bullet /Zcaron /bullet /bullet
/quoteleft /quoteright /quotedblleft /quotedblright /bullet
/endash /emdash /asciitilde /trademark /scaron
/guilsinglright /oe /bullet /zcaron /Ydieresis
/space /exclamdown /cent /sterling /currency
/yen /brokenbar /section /dieresis /copyright
/ordfeminine /guillemotleft /logicalnot /sfthyphen /registered
/macron /degree /plusminus /twosuperior /threesuperior
/acute /mu /paragraph /middot /cedilla
/onesuperior /ordmasculine /guillemotright /onequarter /onehalf
/threequarters /questiondown /Agrave /Aacute /Acircumflex
/Atilde /Adieresis /Aring /AE /Ccedilla
/Egrave /Eacute /Ecircumflex /Edieresis /Igrave
/Iacute /Icircumflex /Idieresis /Eth /Ntilde
/Ograve /Oacute /Ocircumflex /Otilde /Odieresis
/multiply /Oslash /Ugrave /Uacute /Ucircumflex
/Udieresis /Yacute /Thorn /germandbls /agrave
/aacute /acircumflex /atilde /adieresis /aring
/ae /ccedilla /egrave /eacute /ecircumflex
/edieresis /igrave /iacute /icircumflex /idieresis
/eth /ntilde /ograve /oacute /ocircumflex
/otilde /odieresis /divide /oslash /ugrave
/uacute /ucircumflex /udieresis /yacute /thorn
/ydieresis
] def
%%EndResource
%FOPBeginFontReencode
/Courier-Oblique findfont
dup length dict begin
  {1 index /FID ne {def} {pop pop} ifelse} forall
  /Encoding WinAnsiEncoding def
  currentdict
end
/Courier-Oblique exch definefont pop
/Courier-BoldOblique findfont
dup length dict begin
  {1 index /FID ne {def} {pop pop} ifelse} forall
  /Encoding WinAnsiEncoding def
  currentdict
end
/Courier-BoldOblique exch definefont pop
/Courier-Bold findfont
dup length dict begin
  {1 index /FID ne {def} {pop pop} ifelse} forall
  /Encoding WinAnsiEncoding def
  currentdict
end
/Courier-Bold exch definefont pop
/Helvetica findfont
dup length dict begin
  {1 index /FID ne {def} {pop pop} ifelse} forall
  /Encoding WinAnsiEncoding def
  currentdict
end
/Helvetica exch definefont pop
/Helvetica-Oblique findfont
dup length dict begin
  {1 index /FID ne {def} {pop pop} ifelse} forall
  /Encoding WinAnsiEncoding def
  currentdict
end
/Helvetica-Oblique exch definefont pop
/Helvetica-Bold findfont
dup length dict begin
  {1 index /FID ne {def} {pop pop} ifelse} forall
  /Encoding WinAnsiEncoding def
  currentdict
end
/Helvetica-Bold exch definefont pop
/Helvetica-BoldOblique findfont
dup length dict begin
  {1 index /FID ne {def} {pop pop} ifelse} forall
  /Encoding WinAnsiEncoding def
  currentdict
end
/Helvetica-BoldOblique exch definefont pop
/Times-Roman findfont
dup length dict begin
  {1 index /FID ne {def} {pop pop} ifelse} forall
  /Encoding WinAnsiEncoding def
  currentdict
end
/Times-Roman exch definefont pop
/Times-Italic findfont
dup length dict begin
  {1 index /FID ne {def} {pop pop} ifelse} forall
  /Encoding WinAnsiEncoding def
  currentdict
end
/Times-Italic exch definefont pop
/Times-Bold findfont
dup length dict begin
  {1 index /FID ne {def} {pop pop} ifelse} forall
  /Encoding WinAnsiEncoding def
  currentdict
end
/Times-Bold exch definefont pop
/Times-BoldItalic findfont
dup length dict begin
  {1 index /FID ne {def} {pop pop} ifelse} forall
  /Encoding WinAnsiEncoding def
  currentdict
end
/Times-BoldItalic exch definefont pop
/Courier findfont
dup length dict begin
  {1 index /FID ne {def} {pop pop} ifelse} forall
  /Encoding WinAnsiEncoding def
  currentdict
end
/Courier exch definefont pop
%FOPEndFontReencode
%%EndProlog
%%Page: 1 1
%%PageBoundingBox: 0 0 198 283
%%BeginPageSetup
[1 0 0 -1 0 283] CT
%%EndPageSetup
GS
[1.00215 0 0 1 0 0] CT
1 GC
N
0 0 198 283 re
f
GR
GS
[1.00215 0 0 1 0 0] CT
1 GC
N
0 0 198 283 re
f
GR
GS
[1.00215 0 0 1 0 0] CT
1 GC
N
52 228 M
179 228 L
179 32 L
52 32 L
cp
f
GR
GS
[1.00215 0 0 1 0 0] CT
0.149 GC
2 setlinecap
1 LJ
0.5 LW
N
52 228 M
179 228 L
S
GR
GS
[1.00215 0 0 1 0 0] CT
0.149 GC
2 setlinecap
1 LJ
0.5 LW
N
90.1 228 M
90.1 226.04 L
S
GR
GS
[1.00215 0 0 1 0 0] CT
0.149 GC
2 setlinecap
1 LJ
0.5 LW
N
140.9 228 M
140.9 226.04 L
S
GR
GS
[1.00215 0 0 1 90.29349 234] CT
0.149 GC
/Helvetica 20 F
GS
[1 0 0 1 0 0] CT
-13 20 moveto 
1 -1 scale
(YA) t 
GR
GR
GS
[1.00215 0 0 1 141.20257 234] CT
0.149 GC
/Helvetica 20 F
GS
[1 0 0 1 0 0] CT
-14.5 20 moveto 
1 -1 scale
(OA) t 
GR
GR
GS
[1.00215 0 0 1 115.7481 259] CT
0.149 GC
/Helvetica 20 F
GS
[1 0 0 1 0 0] CT
-49 20 moveto 
1 -1 scale
(Age Group) t 
GR
GR
GS
[1.00215 0 0 1 0 0] CT
0.149 GC
2 setlinecap
1 LJ
0.5 LW
N
52 228 M
52 32 L
S
GR
GS
[1.00215 0 0 1 0 0] CT
0.149 GC
2 setlinecap
1 LJ
0.5 LW
N
52 228 M
53.96 228 L
S
GR
GS
[1.00215 0 0 1 0 0] CT
0.149 GC
2 setlinecap
1 LJ
0.5 LW
N
52 188.8 M
53.96 188.8 L
S
GR
GS
[1.00215 0 0 1 0 0] CT
0.149 GC
2 setlinecap
1 LJ
0.5 LW
N
52 149.6 M
53.96 149.6 L
S
GR
GS
[1.00215 0 0 1 0 0] CT
0.149 GC
2 setlinecap
1 LJ
0.5 LW
N
52 110.4 M
53.96 110.4 L
S
GR
GS
[1.00215 0 0 1 0 0] CT
0.149 GC
2 setlinecap
1 LJ
0.5 LW
N
52 71.2 M
53.96 71.2 L
S
GR
GS
[1.00215 0 0 1 46.09878 228] CT
0.149 GC
/Helvetica 20 F
GS
[1 0 0 1 0 0] CT
-19 7.5 moveto 
1 -1 scale
(-8) t 
GR
GR
GS
[1.00215 0 0 1 46.09878 188.8] CT
0.149 GC
/Helvetica 20 F
GS
[1 0 0 1 0 0] CT
-19 7.5 moveto 
1 -1 scale
(-6) t 
GR
GR
GS
[1.00215 0 0 1 46.09878 149.60001] CT
0.149 GC
/Helvetica 20 F
GS
[1 0 0 1 0 0] CT
-19 7.5 moveto 
1 -1 scale
(-4) t 
GR
GR
GS
[1.00215 0 0 1 46.09878 110.39999] CT
0.149 GC
/Helvetica 20 F
GS
[1 0 0 1 0 0] CT
-19 7.5 moveto 
1 -1 scale
(-2) t 
GR
GR
GS
[1.00215 0 0 1 46.09878 71.2] CT
0.149 GC
/Helvetica 20 F
GS
[1 0 0 1 0 0] CT
-12 7.5 moveto 
1 -1 scale
(0) t 
GR
GR
GS
[0 -1 1.00215 0 24.05154 129.99991] CT
0.149 GC
/Helvetica 20 F
GS
[1 0 0 1 0 0] CT
-44.5 -5 moveto 
1 -1 scale
(cpp linear) t 
GR
GR
GS
[1.00215 0 0 1 52.11167 27] CT
0.149 GC
N
2.938 -0.578 M
2.938 -0.734 3.031 -0.859 QT
7.203 -5 L
3.031 -9.156 L
2.938 -9.266 2.938 -9.422 QT
2.938 -9.578 3.055 -9.703 QT
3.172 -9.828 3.344 -9.828 QT
3.484 -9.828 3.641 -9.703 QT
7.781 -5.563 L
11.906 -9.703 L
12.078 -9.828 12.203 -9.828 QT
12.359 -9.828 12.477 -9.711 QT
12.594 -9.594 12.594 -9.422 QT
12.594 -9.266 12.5 -9.156 QT
8.344 -5 L
12.5 -0.859 L
12.594 -0.734 12.594 -0.578 QT
12.594 -0.406 12.477 -0.289 QT
12.359 -0.172 12.203 -0.172 QT
12.047 -0.172 11.906 -0.328 QT
7.781 -4.438 L
3.641 -0.328 L
3.5 -0.172 3.344 -0.172 QT
3.172 -0.172 3.055 -0.305 QT
2.938 -0.438 2.938 -0.578 QT
cp
f
GR
GS
[1.00215 0 0 1 68.14603 27] CT
0.149 GC
/Helvetica 20 F
GS
[1 0 0 1 0 0] CT
0 0 moveto 
1 -1 scale
(10) t 
GR
GR
GS
[1.00215 0 0 1 91.19542 17] CT
0.149 GC
/Helvetica 16 F
GS
[1 0 0 1 0 0] CT
0 0 moveto 
1 -1 scale
(-6) t 
GR
GR
GS
[1.00215 0 0 1 115.74815 29.25001] CT
/Helvetica-Bold 22 F
GS
[1 0 0 1 0 0] CT
-58 -5 moveto 
1 -1 scale
(p = 2.8e-05) t 
GR
GR
GS
[1.00215 0 0 1 0 0] CT
0.149 GC
1 LJ
0.5 LW
N
52 71.2 M
179 71.2 L
S
GR
GS
[1.00215 0 0 1 0 0] CT
0.6 0.8 1 RC
N
69.78 71.2 M
69.78 115.813 L
110.42 115.813 L
110.42 71.2 L
cp
f
GR
GS
[1.00215 0 0 1 95.86464 58.1026] CT
0.302 GC
N
2.236 0 M
2.236 -1.235 1.235 -2.236 0 -2.236 C
-1.235 -2.236 -2.236 -1.235 -2.236 0 C
-2.236 1.235 -1.235 2.236 0 2.236 C
1.235 2.236 2.236 1.235 2.236 0 C
cp
f
GR
GS
[1.00215 0 0 1 98.64265 117.43393] CT
0.302 GC
N
/f-1586420743{2.236 0 M
2.236 -1.235 1.235 -2.236 0 -2.236 C
-1.235 -2.236 -2.236 -1.235 -2.236 0 C
-2.236 1.235 -1.235 2.236 0 2.236 C
1.235 2.236 2.236 1.235 2.236 0 C
cp}def
f-1586420743
f
GR
GS
[1.00215 0 0 1 82.70746 73.04453] CT
0.302 GC
N
f-1586420743
f
GR
GS
[1.00215 0 0 1 83.91249 112.87888] CT
0.302 GC
N
f-1586420743
f
GR
GS
[1.00215 0 0 1 83.81116 73.22036] CT
0.302 GC
N
f-1586420743
f
GR
GS
[1.00215 0 0 1 90.02761 37.54708] CT
0.302 GC
N
f-1586420743
f
GR
GS
[1.00215 0 0 1 96.6999 106.72393] CT
0.302 GC
N
f-1586420743
f
GR
GS
[1.00215 0 0 1 91.83249 106.77179] CT
0.302 GC
N
f-1586420743
f
GR
GS
[1.00215 0 0 1 94.58671 88.36352] CT
0.302 GC
N
f-1586420743
f
GR
GS
[1.00215 0 0 1 83.97693 116.06931] CT
0.302 GC
N
f-1586420743
f
GR
GS
[1.00215 0 0 1 84.76388 138.71028] CT
0.302 GC
N
f-1586420743
f
GR
GS
[1.00215 0 0 1 94.16321 152.1942] CT
0.302 GC
N
f-1586420743
f
GR
GS
[1.00215 0 0 1 87.34879 77.94715] CT
0.302 GC
N
f-1586420743
f
GR
GS
[1.00215 0 0 1 83.56332 88.6111] CT
0.302 GC
N
f-1586420743
f
GR
GS
[1.00215 0 0 1 94.95214 40.22836] CT
0.302 GC
N
f-1586420743
f
GR
GS
[1.00215 0 0 1 85.2624 91.94567] CT
0.302 GC
N
f-1586420743
f
GR
GS
[1.00215 0 0 1 95.85763 120.4212] CT
0.302 GC
N
f-1586420743
f
GR
GS
[1.00215 0 0 1 96.48723 121.90121] CT
0.302 GC
N
f-1586420743
f
GR
GS
[1.00215 0 0 1 100.28124 127.29938] CT
0.302 GC
N
f-1586420743
f
GR
GS
[1.00215 0 0 1 93.90872 98.38136] CT
0.302 GC
N
f-1586420743
f
GR
GS
[1.00215 0 0 1 87.00462 111.43907] CT
0.302 GC
N
f-1586420743
f
GR
GS
[1.00215 0 0 1 80.84853 137.35643] CT
0.302 GC
N
f-1586420743
f
GR
GS
[1.00215 0 0 1 83.94976 94.39887] CT
0.302 GC
N
f-1586420743
f
GR
GS
[1.00215 0 0 1 83.99681 37.54708] CT
0.302 GC
N
f-1586420743
f
GR
GS
[1.00215 0 0 1 96.17292 117.25649] CT
0.302 GC
N
f-1586420743
f
GR
GS
[1.00215 0 0 1 82.13515 143.75394] CT
0.302 GC
N
f-1586420743
f
GR
GS
[1.00215 0 0 1 83.67684 140.60184] CT
0.302 GC
N
f-1586420743
f
GR
GS
[1.00215 0 0 1 86.39701 146.59192] CT
0.302 GC
N
f-1586420743
f
GR
GS
[1.00215 0 0 1 95.88455 174.8688] CT
0.302 GC
N
f-1586420743
f
GR
GS
[1.00215 0 0 1 95.10853 174.98694] CT
0.302 GC
N
f-1586420743
f
GR
GS
[1.00215 0 0 1 83.35977 89.64217] CT
0.302 GC
N
f-1586420743
f
GR
GS
[1.00215 0 0 1 84.02789 212.85962] CT
0.302 GC
N
f-1586420743
f
GR
GS
[1.00215 0 0 1 98.23995 154.68079] CT
0.302 GC
N
f-1586420743
f
GR
GS
[1.00215 0 0 1 98.34812 125.27943] CT
0.302 GC
N
f-1586420743
f
GR
GS
[1.00215 0 0 1 100.45611 95.66747] CT
0.302 GC
N
f-1586420743
f
GR
GS
[1.00215 0 0 1 86.42513 123.23701] CT
0.302 GC
N
f-1586420743
f
GR
GS
[1.00215 0 0 1 86.38837 98.73323] CT
0.302 GC
N
f-1586420743
f
GR
GS
[1.00215 0 0 1 98.64447 172.37289] CT
0.302 GC
N
f-1586420743
f
GR
GS
[1.00215 0 0 1 81.5901 96.65009] CT
0.302 GC
N
f-1586420743
f
GR
GS
[1.00215 0 0 1 90.48121 139.321] CT
0.302 GC
N
f-1586420743
f
GR
GS
[1.00215 0 0 1 97.52772 180.62411] CT
0.302 GC
N
f-1586420743
f
GR
GS
[1.00215 0 0 1 83.25926 148.49648] CT
0.302 GC
N
f-1586420743
f
GR
GS
[1.00215 0 0 1 0 0] CT
0.6 0.8 1 RC
N
/f-1378908976{120.58 71.2 M
120.58 87.285 L
161.22 87.285 L
161.22 71.2 L
cp}def
f-1378908976
f
GR
GS
[1.00215 0 0 1 140.54427 126.06491] CT
0.302 GC
N
f-1586420743
f
GR
GS
[1.00215 0 0 1 147.11684 96.25238] CT
0.302 GC
N
f-1586420743
f
GR
GS
[1.00215 0 0 1 136.76993 137.48763] CT
0.302 GC
N
f-1586420743
f
GR
GS
[1.00215 0 0 1 140.92197 77.63107] CT
0.302 GC
N
f-1586420743
f
GR
GS
[1.00215 0 0 1 145.33478 93.30021] CT
0.302 GC
N
f-1586420743
f
GR
GS
[1.00215 0 0 1 148.51558 66.77999] CT
0.302 GC
N
f-1586420743
f
GR
GS
[1.00215 0 0 1 133.49809 87.08403] CT
0.302 GC
N
f-1586420743
f
GR
GS
[1.00215 0 0 1 136.55633 81.40825] CT
0.302 GC
N
f-1586420743
f
GR
GS
[1.00215 0 0 1 151.07087 101.41265] CT
0.302 GC
N
f-1586420743
f
GR
GS
[1.00215 0 0 1 146.14533 100.64214] CT
0.302 GC
N
f-1586420743
f
GR
GS
[1.00215 0 0 1 141.38583 74.27688] CT
0.302 GC
N
f-1586420743
f
GR
GS
[1.00215 0 0 1 135.69359 76.97467] CT
0.302 GC
N
f-1586420743
f
GR
GS
[1.00215 0 0 1 147.00869 72.40924] CT
0.302 GC
N
f-1586420743
f
GR
GS
[1.00215 0 0 1 149.18504 82.63509] CT
0.302 GC
N
f-1586420743
f
GR
GS
[1.00215 0 0 1 139.14852 78.02736] CT
0.302 GC
N
f-1586420743
f
GR
GS
[1.00215 0 0 1 135.06152 105.62794] CT
0.302 GC
N
f-1586420743
f
GR
GS
[1.00215 0 0 1 140.27094 94.60431] CT
0.302 GC
N
f-1586420743
f
GR
GS
[1.00215 0 0 1 140.51003 98.50806] CT
0.302 GC
N
f-1586420743
f
GR
GS
[1.00215 0 0 1 149.54759 66.17281] CT
0.302 GC
N
f-1586420743
f
GR
GS
[1.00215 0 0 1 147.99378 55.03954] CT
0.302 GC
N
f-1586420743
f
GR
GS
[1.00215 0 0 1 135.59999 76.1526] CT
0.302 GC
N
f-1586420743
f
GR
GS
[1.00215 0 0 1 151.20033 104.76766] CT
0.302 GC
N
f-1586420743
f
GR
GS
[1.00215 0 0 1 148.4123 82.62223] CT
0.302 GC
N
f-1586420743
f
GR
GS
[1.00215 0 0 1 145.36007 93.66617] CT
0.302 GC
N
f-1586420743
f
GR
GS
[1.00215 0 0 1 148.80505 84.80444] CT
0.302 GC
N
f-1586420743
f
GR
GS
[1.00215 0 0 1 141.32939 70.45562] CT
0.302 GC
N
f-1586420743
f
GR
GS
[1.00215 0 0 1 135.95522 127.59129] CT
0.302 GC
N
f-1586420743
f
GR
GS
[1.00215 0 0 1 143.14621 69.34177] CT
0.302 GC
N
f-1586420743
f
GR
GS
[1.00215 0 0 1 137.21761 122.70649] CT
0.302 GC
N
f-1586420743
f
GR
GS
[1.00215 0 0 1 137.92272 89.1517] CT
0.302 GC
N
f-1586420743
f
GR
GS
[1.00215 0 0 1 145.95525 92.57085] CT
0.302 GC
N
f-1586420743
f
GR
GS
[1.00215 0 0 1 143.55627 104.40672] CT
0.302 GC
N
f-1586420743
f
GR
GS
[1.00215 0 0 1 140.60837 137.48763] CT
0.302 GC
N
f-1586420743
f
GR
GS
[1.00215 0 0 1 151.31831 90.77403] CT
0.302 GC
N
f-1586420743
f
GR
GS
[1.00215 0 0 1 131.36397 32.41914] CT
0.302 GC
N
f-1586420743
f
GR
GS
[1.00215 0 0 1 141.3913 137.48763] CT
0.302 GC
N
f-1586420743
f
GR
GS
[1.00215 0 0 1 142.23734 60.3811] CT
0.302 GC
N
f-1586420743
f
GR
GS
[1.00215 0 0 1 139.19417 96.03368] CT
0.302 GC
N
f-1586420743
f
GR
GS
[1.00215 0 0 1 141.12916 64.31645] CT
0.302 GC
N
f-1586420743
f
GR
GS
[1.00215 0 0 1 150.4634 89.14503] CT
0.302 GC
N
f-1586420743
f
GR
GS
[1.00215 0 0 1 143.56209 79.12941] CT
0.302 GC
N
f-1586420743
f
GR
GS
[1.00215 0 0 1 138.45002 78.12852] CT
0.302 GC
N
f-1586420743
f
GR
GS
[1.00215 0 0 1 148.257 71.79716] CT
0.302 GC
N
f-1586420743
f
GR
GS
[1.00215 0 0 1 149.32236 59.48217] CT
0.302 GC
N
f-1586420743
f
GR
GS
[1.00215 0 0 1 151.18455 53.92418] CT
0.302 GC
N
f-1586420743
f
GR
GS
[1.00215 0 0 1 131.78012 69.40927] CT
0.302 GC
N
f-1586420743
f
GR
GS
[1.00215 0 0 1 148.08748 137.48763] CT
0.302 GC
N
f-1586420743
f
GR
GS
[1.00215 0 0 1 135.18759 68.9035] CT
0.302 GC
N
f-1586420743
f
GR
GS
[1.00215 0 0 1 146.15543 86.20278] CT
0.302 GC
N
f-1586420743
f
GR
GS
[1.00215 0 0 1 138.19875 60.26801] CT
0.302 GC
N
f-1586420743
f
GR
GS
[1.00215 0 0 1 134.20944 79.5442] CT
0.302 GC
N
f-1586420743
f
GR
GS
[1.00215 0 0 1 147.4376 105.39521] CT
0.302 GC
N
f-1586420743
f
GR
GS
[1.00215 0 0 1 131.65431 77.81836] CT
0.302 GC
N
f-1586420743
f
GR
%%Trailer
%%Pages: 1
%%EOF
