%!PS-Adobe-3.0 EPSF-3.0
%%Creator: (MATLAB, The Mathworks, Inc. Version 9.8.0.1323502 \(R2020a\). Operating System: Mac OS X)
%%Title: /Users/kosciessa/Desktop/mntTardisLNDG/LNDG/stateswitch/stsw_multimodal/figures/correlations/f_stroop-rt_l1_stroop-int.eps
%%CreationDate: 2022-03-07T11:21:07
%%Pages: (atend)
%%BoundingBox:   -10     0   270   194
%%LanguageLevel: 3
%%EndComments
%%BeginProlog
%%BeginResource: procset (Apache XML Graphics Std ProcSet) 1.2 0
%%Version: 1.2 0
%%Copyright: (Copyright 2001-2003,2010 The Apache Software Foundation. License terms: http://www.apache.org/licenses/LICENSE-2.0)
/bd{bind def}bind def
/ld{load def}bd
/GR/grestore ld
/GS/gsave ld
/RM/rmoveto ld
/C/curveto ld
/t/show ld
/L/lineto ld
/ML/setmiterlimit ld
/CT/concat ld
/f/fill ld
/N/newpath ld
/S/stroke ld
/CC/setcmykcolor ld
/A/ashow ld
/cp/closepath ld
/RC/setrgbcolor ld
/LJ/setlinejoin ld
/GC/setgray ld
/LW/setlinewidth ld
/M/moveto ld
/re {4 2 roll M
1 index 0 rlineto
0 exch rlineto
neg 0 rlineto
cp } bd
/_ctm matrix def
/_tm matrix def
/BT { _ctm currentmatrix pop matrix _tm copy pop 0 0 moveto } bd
/ET { _ctm setmatrix } bd
/iTm { _ctm setmatrix _tm concat } bd
/Tm { _tm astore pop iTm 0 0 moveto } bd
/ux 0.0 def
/uy 0.0 def
/F {
  /Tp exch def
  /Tf exch def
  Tf findfont Tp scalefont setfont
  /cf Tf def  /cs Tp def
} bd
/ULS {currentpoint /uy exch def /ux exch def} bd
/ULE {
  /Tcx currentpoint pop def
  gsave
  newpath
  cf findfont cs scalefont dup
  /FontMatrix get 0 get /Ts exch def /FontInfo get dup
  /UnderlinePosition get Ts mul /To exch def
  /UnderlineThickness get Ts mul /Tt exch def
  ux uy To add moveto  Tcx uy To add lineto
  Tt setlinewidth stroke
  grestore
} bd
/OLE {
  /Tcx currentpoint pop def
  gsave
  newpath
  cf findfont cs scalefont dup
  /FontMatrix get 0 get /Ts exch def /FontInfo get dup
  /UnderlinePosition get Ts mul /To exch def
  /UnderlineThickness get Ts mul /Tt exch def
  ux uy To add cs add moveto Tcx uy To add cs add lineto
  Tt setlinewidth stroke
  grestore
} bd
/SOE {
  /Tcx currentpoint pop def
  gsave
  newpath
  cf findfont cs scalefont dup
  /FontMatrix get 0 get /Ts exch def /FontInfo get dup
  /UnderlinePosition get Ts mul /To exch def
  /UnderlineThickness get Ts mul /Tt exch def
  ux uy To add cs 10 mul 26 idiv add moveto Tcx uy To add cs 10 mul 26 idiv add lineto
  Tt setlinewidth stroke
  grestore
} bd
/QT {
/Y22 exch store
/X22 exch store
/Y21 exch store
/X21 exch store
currentpoint
/Y21 load 2 mul add 3 div exch
/X21 load 2 mul add 3 div exch
/X21 load 2 mul /X22 load add 3 div
/Y21 load 2 mul /Y22 load add 3 div
/X22 load /Y22 load curveto
} bd
/SSPD {
dup length /d exch dict def
{
/v exch def
/k exch def
currentpagedevice k known {
/cpdv currentpagedevice k get def
v cpdv ne {
/upd false def
/nullv v type /nulltype eq def
/nullcpdv cpdv type /nulltype eq def
nullv nullcpdv or
{
/upd true def
} {
/sametype v type cpdv type eq def
sametype {
v type /arraytype eq {
/vlen v length def
/cpdvlen cpdv length def
vlen cpdvlen eq {
0 1 vlen 1 sub {
/i exch def
/obj v i get def
/cpdobj cpdv i get def
obj cpdobj ne {
/upd true def
exit
} if
} for
} {
/upd true def
} ifelse
} {
v type /dicttype eq {
v {
/dv exch def
/dk exch def
/cpddv cpdv dk get def
dv cpddv ne {
/upd true def
exit
} if
} forall
} {
/upd true def
} ifelse
} ifelse
} if
} ifelse
upd true eq {
d k v put
} if
} if
} if
} forall
d length 0 gt {
d setpagedevice
} if
} bd
/RE { % /NewFontName [NewEncodingArray] /FontName RE -
  findfont dup length dict begin
  {
    1 index /FID ne
    {def} {pop pop} ifelse
  } forall
  /Encoding exch def
  /FontName 1 index def
  currentdict definefont pop
  end
} bind def
%%EndResource
%%BeginResource: procset (Apache XML Graphics EPS ProcSet) 1.0 0
%%Version: 1.0 0
%%Copyright: (Copyright 2002-2003 The Apache Software Foundation. License terms: http://www.apache.org/licenses/LICENSE-2.0)
/BeginEPSF { %def
/b4_Inc_state save def         % Save state for cleanup
/dict_count countdictstack def % Count objects on dict stack
/op_count count 1 sub def      % Count objects on operand stack
userdict begin                 % Push userdict on dict stack
/showpage { } def              % Redefine showpage, { } = null proc
0 setgray 0 setlinecap         % Prepare graphics state
1 setlinewidth 0 setlinejoin
10 setmiterlimit [ ] 0 setdash newpath
/languagelevel where           % If level not equal to 1 then
{pop languagelevel             % set strokeadjust and
1 ne                           % overprint to their defaults.
{false setstrokeadjust false setoverprint
} if
} if
} bd
/EndEPSF { %def
count op_count sub {pop} repeat            % Clean up stacks
countdictstack dict_count sub {end} repeat
b4_Inc_state restore
} bd
%%EndResource
%FOPBeginFontDict
%%IncludeResource: font Courier-Oblique
%%IncludeResource: font Courier-BoldOblique
%%IncludeResource: font Courier-Bold
%%IncludeResource: font ZapfDingbats
%%IncludeResource: font Symbol
%%IncludeResource: font Helvetica
%%IncludeResource: font Helvetica-Oblique
%%IncludeResource: font Helvetica-Bold
%%IncludeResource: font Helvetica-BoldOblique
%%IncludeResource: font Times-Roman
%%IncludeResource: font Times-Italic
%%IncludeResource: font Times-Bold
%%IncludeResource: font Times-BoldItalic
%%IncludeResource: font Courier
%FOPEndFontDict
%%BeginResource: encoding WinAnsiEncoding
/WinAnsiEncoding [
/.notdef /.notdef /.notdef /.notdef /.notdef
/.notdef /.notdef /.notdef /.notdef /.notdef
/.notdef /.notdef /.notdef /.notdef /.notdef
/.notdef /.notdef /.notdef /.notdef /.notdef
/.notdef /.notdef /.notdef /.notdef /.notdef
/.notdef /.notdef /.notdef /.notdef /.notdef
/.notdef /.notdef /space /exclam /quotedbl
/numbersign /dollar /percent /ampersand /quotesingle
/parenleft /parenright /asterisk /plus /comma
/hyphen /period /slash /zero /one
/two /three /four /five /six
/seven /eight /nine /colon /semicolon
/less /equal /greater /question /at
/A /B /C /D /E
/F /G /H /I /J
/K /L /M /N /O
/P /Q /R /S /T
/U /V /W /X /Y
/Z /bracketleft /backslash /bracketright /asciicircum
/underscore /quoteleft /a /b /c
/d /e /f /g /h
/i /j /k /l /m
/n /o /p /q /r
/s /t /u /v /w
/x /y /z /braceleft /bar
/braceright /asciitilde /bullet /Euro /bullet
/quotesinglbase /florin /quotedblbase /ellipsis /dagger
/daggerdbl /circumflex /perthousand /Scaron /guilsinglleft
/OE /bullet /Zcaron /bullet /bullet
/quoteleft /quoteright /quotedblleft /quotedblright /bullet
/endash /emdash /asciitilde /trademark /scaron
/guilsinglright /oe /bullet /zcaron /Ydieresis
/space /exclamdown /cent /sterling /currency
/yen /brokenbar /section /dieresis /copyright
/ordfeminine /guillemotleft /logicalnot /sfthyphen /registered
/macron /degree /plusminus /twosuperior /threesuperior
/acute /mu /paragraph /middot /cedilla
/onesuperior /ordmasculine /guillemotright /onequarter /onehalf
/threequarters /questiondown /Agrave /Aacute /Acircumflex
/Atilde /Adieresis /Aring /AE /Ccedilla
/Egrave /Eacute /Ecircumflex /Edieresis /Igrave
/Iacute /Icircumflex /Idieresis /Eth /Ntilde
/Ograve /Oacute /Ocircumflex /Otilde /Odieresis
/multiply /Oslash /Ugrave /Uacute /Ucircumflex
/Udieresis /Yacute /Thorn /germandbls /agrave
/aacute /acircumflex /atilde /adieresis /aring
/ae /ccedilla /egrave /eacute /ecircumflex
/edieresis /igrave /iacute /icircumflex /idieresis
/eth /ntilde /ograve /oacute /ocircumflex
/otilde /odieresis /divide /oslash /ugrave
/uacute /ucircumflex /udieresis /yacute /thorn
/ydieresis
] def
%%EndResource
%FOPBeginFontReencode
/Courier-Oblique findfont
dup length dict begin
  {1 index /FID ne {def} {pop pop} ifelse} forall
  /Encoding WinAnsiEncoding def
  currentdict
end
/Courier-Oblique exch definefont pop
/Courier-BoldOblique findfont
dup length dict begin
  {1 index /FID ne {def} {pop pop} ifelse} forall
  /Encoding WinAnsiEncoding def
  currentdict
end
/Courier-BoldOblique exch definefont pop
/Courier-Bold findfont
dup length dict begin
  {1 index /FID ne {def} {pop pop} ifelse} forall
  /Encoding WinAnsiEncoding def
  currentdict
end
/Courier-Bold exch definefont pop
/Helvetica findfont
dup length dict begin
  {1 index /FID ne {def} {pop pop} ifelse} forall
  /Encoding WinAnsiEncoding def
  currentdict
end
/Helvetica exch definefont pop
/Helvetica-Oblique findfont
dup length dict begin
  {1 index /FID ne {def} {pop pop} ifelse} forall
  /Encoding WinAnsiEncoding def
  currentdict
end
/Helvetica-Oblique exch definefont pop
/Helvetica-Bold findfont
dup length dict begin
  {1 index /FID ne {def} {pop pop} ifelse} forall
  /Encoding WinAnsiEncoding def
  currentdict
end
/Helvetica-Bold exch definefont pop
/Helvetica-BoldOblique findfont
dup length dict begin
  {1 index /FID ne {def} {pop pop} ifelse} forall
  /Encoding WinAnsiEncoding def
  currentdict
end
/Helvetica-BoldOblique exch definefont pop
/Times-Roman findfont
dup length dict begin
  {1 index /FID ne {def} {pop pop} ifelse} forall
  /Encoding WinAnsiEncoding def
  currentdict
end
/Times-Roman exch definefont pop
/Times-Italic findfont
dup length dict begin
  {1 index /FID ne {def} {pop pop} ifelse} forall
  /Encoding WinAnsiEncoding def
  currentdict
end
/Times-Italic exch definefont pop
/Times-Bold findfont
dup length dict begin
  {1 index /FID ne {def} {pop pop} ifelse} forall
  /Encoding WinAnsiEncoding def
  currentdict
end
/Times-Bold exch definefont pop
/Times-BoldItalic findfont
dup length dict begin
  {1 index /FID ne {def} {pop pop} ifelse} forall
  /Encoding WinAnsiEncoding def
  currentdict
end
/Times-BoldItalic exch definefont pop
/Courier findfont
dup length dict begin
  {1 index /FID ne {def} {pop pop} ifelse} forall
  /Encoding WinAnsiEncoding def
  currentdict
end
/Courier exch definefont pop
%FOPEndFontReencode
%%EndProlog
%%Page: 1 1
%%PageBoundingBox: 0 0 227 198
%%BeginPageSetup
[1 0 0 -1 0 198] CT
%%EndPageSetup
GS
[0.99899 0 0 1.00215 0 -0.4252] CT
N
0 0 M
227 0 L
227 198 L
0 198 L
0 0 L
cp
clip
1 GC
N
0 0 227 198 re
f
GR
GS
[0.99899 0 0 1.00215 0 -0.4252] CT
1 GC
N
0 0 227 198 re
f
GR
GS
[0.99899 0 0 1.00215 0 -0.4252] CT
0.2 GC
N
52 160 M
205.5 160 L
205.5 21 L
52 21 L
cp
f
GR
GS
[0.99899 0 0 1.00215 0 -0.4252] CT
0.149 GC
2 setlinecap
1 LJ
0.5 LW
N
52 160 M
205.5 160 L
S
GR
GS
[0.99899 0 0 1.00215 0 -0.4252] CT
0.149 GC
2 setlinecap
1 LJ
0.5 LW
N
69.294 160 M
69.294 158.465 L
S
GR
GS
[0.99899 0 0 1.00215 0 -0.4252] CT
0.149 GC
2 setlinecap
1 LJ
0.5 LW
N
108.694 160 M
108.694 158.465 L
S
GR
GS
[0.99899 0 0 1.00215 0 -0.4252] CT
0.149 GC
2 setlinecap
1 LJ
0.5 LW
N
148.094 160 M
148.094 158.465 L
S
GR
GS
[0.99899 0 0 1.00215 0 -0.4252] CT
0.149 GC
2 setlinecap
1 LJ
0.5 LW
N
187.493 160 M
187.493 158.465 L
S
GR
GS
[0.99899 0 0 1.00215 69.22476 164.72871] CT
0.149 GC
/Helvetica 14 F
GS
[1 0 0 1 0 0] CT
-10 14 moveto 
1 -1 scale
(1.4) t 
GR
GR
GS
[0.99899 0 0 1.00215 108.58465 164.72871] CT
0.149 GC
/Helvetica 14 F
GS
[1 0 0 1 0 0] CT
-10 14 moveto 
1 -1 scale
(1.6) t 
GR
GR
GS
[0.99899 0 0 1.00215 147.94453 164.72871] CT
0.149 GC
/Helvetica 14 F
GS
[1 0 0 1 0 0] CT
-10 14 moveto 
1 -1 scale
(1.8) t 
GR
GR
GS
[0.99899 0 0 1.00215 187.30442 164.72871] CT
0.149 GC
/Helvetica 14 F
GS
[1 0 0 1 0 0] CT
-4 14 moveto 
1 -1 scale
(2) t 
GR
GR
GS
[0.99899 0 0 1.00215 128.62056 182.26629] CT
0.149 GC
/Helvetica 14 F
GS
[1 0 0 1 0 0] CT
-27 14 moveto 
1 -1 scale
(stroop rt) t 
GR
GR
GS
[0.99899 0 0 1.00215 0 -0.4252] CT
0.149 GC
2 setlinecap
1 LJ
0.5 LW
N
52 160 M
52 21 L
S
GR
GS
[0.99899 0 0 1.00215 0 -0.4252] CT
0.149 GC
2 setlinecap
1 LJ
0.5 LW
N
52 139.943 M
53.535 139.943 L
S
GR
GS
[0.99899 0 0 1.00215 0 -0.4252] CT
0.149 GC
2 setlinecap
1 LJ
0.5 LW
N
52 93.894 M
53.535 93.894 L
S
GR
GS
[0.99899 0 0 1.00215 0 -0.4252] CT
0.149 GC
2 setlinecap
1 LJ
0.5 LW
N
52 47.844 M
53.535 47.844 L
S
GR
GS
[0.99899 0 0 1.00215 47.15251 139.81867] CT
0.149 GC
/Helvetica 14 F
GS
[1 0 0 1 0 0] CT
-8 5.5 moveto 
1 -1 scale
(0) t 
GR
GR
GS
[0.99899 0 0 1.00215 47.15251 93.67035] CT
0.149 GC
/Helvetica 14 F
GS
[1 0 0 1 0 0] CT
-20 5.5 moveto 
1 -1 scale
(0.1) t 
GR
GR
GS
[0.99899 0 0 1.00215 47.15251 47.52204] CT
0.149 GC
/Helvetica 14 F
GS
[1 0 0 1 0 0] CT
-20 5.5 moveto 
1 -1 scale
(0.2) t 
GR
GR
GS
[0 -1.00215 0.99899 0 24.67516 90.26908] CT
0.149 GC
/Helvetica 14 F
GS
[1 0 0 1 0 0] CT
-59.5 -3 moveto 
1 -1 scale
(stroop interference) t 
GR
GR
GS
[0.99899 0 0 1.00215 128.62062 18.86613] CT
/Helvetica-Bold 14 F
GS
[1 0 0 1 0 0] CT
-140 -4 moveto 
1 -1 scale
(r\(93\) = -0.18, 95%CI = [-0.37,0.03], p = 0.09) t 
GR
GR
GS
[0.99899 0 0 1.00215 117.68161 109.23683] CT
0.6 GC
N
0.5 0 M
0.5 -0.276 0.276 -0.5 0 -0.5 C
-0.276 -0.5 -0.5 -0.276 -0.5 0 C
-0.5 0.276 -0.276 0.5 0 0.5 C
0.276 0.5 0.5 0.276 0.5 0 C
cp
f
GR
GS
[0.99899 0 0 1.00215 104.39429 121.45771] CT
0.6 GC
N
/f-2105962265{0.5 0 M
0.5 -0.276 0.276 -0.5 0 -0.5 C
-0.276 -0.5 -0.5 -0.276 -0.5 0 C
-0.5 0.276 -0.276 0.5 0 0.5 C
0.276 0.5 0.5 0.276 0.5 0 C
cp}def
f-2105962265
f
GR
GS
[0.99899 0 0 1.00215 102.80115 127.28619] CT
0.6 GC
N
f-2105962265
f
GR
GS
[0.99899 0 0 1.00215 103.54418 137.02374] CT
0.6 GC
N
f-2105962265
f
GR
GS
[0.99899 0 0 1.00215 150.76042 140.05226] CT
0.6 GC
N
f-2105962265
f
GR
GS
[0.99899 0 0 1.00215 99.75323 98.90957] CT
0.6 GC
N
f-2105962265
f
GR
GS
[0.99899 0 0 1.00215 115.44586 121.68194] CT
0.6 GC
N
f-2105962265
f
GR
GS
[0.99899 0 0 1.00215 94.08576 125.55822] CT
0.6 GC
N
f-2105962265
f
GR
GS
[0.99899 0 0 1.00215 94.08576 95.73469] CT
0.6 GC
N
f-2105962265
f
GR
GS
[0.99899 0 0 1.00215 121.96121 123.2465] CT
0.6 GC
N
f-2105962265
f
GR
GS
[0.99899 0 0 1.00215 119.52019 128.57401] CT
0.6 GC
N
f-2105962265
f
GR
GS
[0.99899 0 0 1.00215 105.6349 89.82724] CT
0.6 GC
N
f-2105962265
f
GR
GS
[0.99899 0 0 1.00215 81.55262 122.55486] CT
0.6 GC
N
f-2105962265
f
GR
GS
[0.99899 0 0 1.00215 86.93671 126.94877] CT
0.6 GC
N
f-2105962265
f
GR
GS
[0.99899 0 0 1.00215 122.81133 148.31019] CT
0.6 GC
N
f-2105962265
f
GR
GS
[0.99899 0 0 1.00215 130.85066 96.77004] CT
0.6 GC
N
f-2105962265
f
GR
GS
[0.99899 0 0 1.00215 108.36153 102.83325] CT
0.6 GC
N
f-2105962265
f
GR
GS
[0.99899 0 0 1.00215 130.00054 119.10799] CT
0.6 GC
N
f-2105962265
f
GR
GS
[0.99899 0 0 1.00215 71.24408 120.32199] CT
0.6 GC
N
f-2105962265
f
GR
GS
[0.99899 0 0 1.00215 95.43791 115.71868] CT
0.6 GC
N
f-2105962265
f
GR
GS
[0.99899 0 0 1.00215 75.44559 116.18679] CT
0.6 GC
N
f-2105962265
f
GR
GS
[0.99899 0 0 1.00215 99.75323 114.03305] CT
0.6 GC
N
f-2105962265
f
GR
GS
[0.99899 0 0 1.00215 79.569 97.91216] CT
0.6 GC
N
f-2105962265
f
GR
GS
[0.99899 0 0 1.00215 71.41588 111.85426] CT
0.6 GC
N
f-2105962265
f
GR
GS
[0.99899 0 0 1.00215 105.42068 119.78392] CT
0.6 GC
N
f-2105962265
f
GR
GS
[0.99899 0 0 1.00215 100.2508 130.00689] CT
0.6 GC
N
f-2105962265
f
GR
GS
[0.99899 0 0 1.00215 85.19631 132.0683] CT
0.6 GC
N
f-2105962265
f
GR
GS
[0.99899 0 0 1.00215 124.33308 123.20655] CT
0.6 GC
N
f-2105962265
f
GR
GS
[0.99899 0 0 1.00215 116.96982 117.9801] CT
0.6 GC
N
f-2105962265
f
GR
GS
[0.99899 0 0 1.00215 92.77822 85.16826] CT
0.6 GC
N
f-2105962265
f
GR
GS
[0.99899 0 0 1.00215 112.04538 140.11626] CT
0.6 GC
N
f-2105962265
f
GR
GS
[0.99899 0 0 1.00215 77.00525 117.63991] CT
0.6 GC
N
f-2105962265
f
GR
GS
[0.99899 0 0 1.00215 95.72129 133.33052] CT
0.6 GC
N
f-2105962265
f
GR
GS
[0.99899 0 0 1.00215 107.05176 125.37606] CT
0.6 GC
N
f-2105962265
f
GR
GS
[0.99899 0 0 1.00215 68.04442 95.64501] CT
0.6 GC
N
f-2105962265
f
GR
GS
[0.99899 0 0 1.00215 97.13816 124.31034] CT
0.6 GC
N
f-2105962265
f
GR
GS
[0.99899 0 0 1.00215 72.09419 80.4605] CT
0.6 GC
N
f-2105962265
f
GR
GS
[0.99899 0 0 1.00215 64.7265 107.97639] CT
0.6 GC
N
f-2105962265
f
GR
GS
[0.99899 0 0 1.00215 105.91827 112.59965] CT
0.6 GC
N
f-2105962265
f
GR
GS
[0.99899 0 0 1.00215 93.9117 117.87709] CT
0.6 GC
N
f-2105962265
f
GR
GS
[0.99899 0 0 1.00215 125.74994 137.0618] CT
0.6 GC
N
f-2105962265
f
GR
GS
[0.99899 0 0 1.00215 107.05399 124.95554] CT
0.6 GC
N
f-2105962265
f
GR
GS
[0.99899 0 0 1.00215 125.25683 65.92149] CT
0.6 GC
N
f-2105962265
f
GR
GS
[0.99899 0 0 1.00215 139.42548 96.14899] CT
0.6 GC
N
f-2105962265
f
GR
GS
[0.99899 0 0 1.00215 95.72129 107.67799] CT
0.6 GC
N
f-2105962265
f
GR
GS
[0.99899 0 0 1.00215 192.51449 118.90753] CT
0.6 GC
N
f-2105962265
f
GR
GS
[0.99899 0 0 1.00215 122.42308 107.99268] CT
0.6 GC
N
f-2105962265
f
GR
GS
[0.99899 0 0 1.00215 153.13006 112.76866] CT
0.6 GC
N
f-2105962265
f
GR
GS
[0.99899 0 0 1.00215 134.99637 104.04819] CT
0.6 GC
N
f-2105962265
f
GR
GS
[0.99899 0 0 1.00215 115.83634 97.75871] CT
0.6 GC
N
f-2105962265
f
GR
GS
[0.99899 0 0 1.00215 106.4337 91.27528] CT
0.6 GC
N
f-2105962265
f
GR
GS
[0.99899 0 0 1.00215 144.90552 122.17419] CT
0.6 GC
N
f-2105962265
f
GR
GS
[0.99899 0 0 1.00215 71.41588 92.72931] CT
0.6 GC
N
f-2105962265
f
GR
GS
[0.99899 0 0 1.00215 179.86532 133.50436] CT
0.6 GC
N
f-2105962265
f
GR
GS
[0.99899 0 0 1.00215 133.01276 123.38872] CT
0.6 GC
N
f-2105962265
f
GR
GS
[0.99899 0 0 1.00215 142.18335 120.95488] CT
0.6 GC
N
f-2105962265
f
GR
GS
[0.99899 0 0 1.00215 119.58935 95.38671] CT
0.6 GC
N
f-2105962265
f
GR
GS
[0.99899 0 0 1.00215 100.84209 98.87692] CT
0.6 GC
N
f-2105962265
f
GR
GS
[0.99899 0 0 1.00215 128.09055 108.53209] CT
0.6 GC
N
f-2105962265
f
GR
GS
[0.99899 0 0 1.00215 140.38048 110.91248] CT
0.6 GC
N
f-2105962265
f
GR
GS
[0.99899 0 0 1.00215 83.81961 58.69594] CT
0.6 GC
N
f-2105962265
f
GR
GS
[0.99899 0 0 1.00215 133.29614 130.43406] CT
0.6 GC
N
f-2105962265
f
GR
GS
[0.99899 0 0 1.00215 113.54034 85.00706] CT
0.6 GC
N
f-2105962265
f
GR
GS
[0.99899 0 0 1.00215 88.0702 77.07772] CT
0.6 GC
N
f-2105962265
f
GR
GS
[0.99899 0 0 1.00215 122.42308 100.03618] CT
0.6 GC
N
f-2105962265
f
GR
GS
[0.99899 0 0 1.00215 112.32876 116.42748] CT
0.6 GC
N
f-2105962265
f
GR
GS
[0.99899 0 0 1.00215 117.13271 75.66356] CT
0.6 GC
N
f-2105962265
f
GR
GS
[0.99899 0 0 1.00215 139.81373 116.77664] CT
0.6 GC
N
f-2105962265
f
GR
GS
[0.99899 0 0 1.00215 113.92188 112.97127] CT
0.6 GC
N
f-2105962265
f
GR
GS
[0.99899 0 0 1.00215 117.71283 88.82419] CT
0.6 GC
N
f-2105962265
f
GR
GS
[0.99899 0 0 1.00215 109.03538 90.28471] CT
0.6 GC
N
f-2105962265
f
GR
GS
[0.99899 0 0 1.00215 112.15248 65.50293] CT
0.6 GC
N
f-2105962265
f
GR
GS
[0.99899 0 0 1.00215 116.75562 66.95392] CT
0.6 GC
N
f-2105962265
f
GR
GS
[0.99899 0 0 1.00215 128.09055 100.71045] CT
0.6 GC
N
f-2105962265
f
GR
GS
[0.99899 0 0 1.00215 94.08576 96.28317] CT
0.6 GC
N
f-2105962265
f
GR
GS
[0.99899 0 0 1.00215 122.42308 88.60889] CT
0.6 GC
N
f-2105962265
f
GR
GS
[0.99899 0 0 1.00215 133.57951 108.795] CT
0.6 GC
N
f-2105962265
f
GR
GS
[0.99899 0 0 1.00215 91.1873 89.27889] CT
0.6 GC
N
f-2105962265
f
GR
GS
[0.99899 0 0 1.00215 94.54762 96.88395] CT
0.6 GC
N
f-2105962265
f
GR
GS
[0.99899 0 0 1.00215 91.75406 72.26331] CT
0.6 GC
N
f-2105962265
f
GR
GS
[0.99899 0 0 1.00215 110.91188 32.22811] CT
0.6 GC
N
f-2105962265
f
GR
GS
[0.99899 0 0 1.00215 141.89998 106.9103] CT
0.6 GC
N
f-2105962265
f
GR
GS
[0.99899 0 0 1.00215 123.76633 44.74798] CT
0.6 GC
N
f-2105962265
f
GR
GS
[0.99899 0 0 1.00215 103.3679 49.03967] CT
0.6 GC
N
f-2105962265
f
GR
GS
[0.99899 0 0 1.00215 91.1873 64.98684] CT
0.6 GC
N
f-2105962265
f
GR
GS
[0.99899 0 0 1.00215 134.53451 112.19917] CT
0.6 GC
N
f-2105962265
f
GR
GS
[0.99899 0 0 1.00215 111.08815 82.13408] CT
0.6 GC
N
f-2105962265
f
GR
GS
[0.99899 0 0 1.00215 102.80115 93.28658] CT
0.6 GC
N
f-2105962265
f
GR
GS
[0.99899 0 0 1.00215 100.2508 104.41764] CT
0.6 GC
N
f-2105962265
f
GR
GS
[0.99899 0 0 1.00215 109.60211 78.564] CT
0.6 GC
N
f-2105962265
f
GR
GS
[0.99899 0 0 1.00215 95.68113 107.61234] CT
0.6 GC
N
f-2105962265
f
GR
GS
[0.99899 0 0 1.00215 128.86705 123.43126] CT
0.6 GC
N
f-2105962265
f
GR
GS
[0.99899 0 0 1.00215 81.15991 116.33418] CT
0.6 GC
N
f-2105962265
f
GR
GS
[0.99899 0 0 1.00215 173.4303 112.26776] CT
0.6 GC
N
f-2105962265
f
GR
GS
[0.99899 0 0 1.00215 102.23442 88.96254] CT
0.6 GC
N
f-2105962265
f
GR
GS
[0.99899 0 0 1.00215 0 -0.4252] CT
0.702 GC
1 LJ
3 LW
N
64.792 97.862 M
192.708 118.944 L
S
GR
GS
[0.99899 0 0 1.00215 117.68161 109.23683] CT
0.8 GC
N
/f227889816{-3 -3 M
-3 3 L
3 3 L
3 -3 L
cp}def
f227889816
f
GR
GS
[0.99899 0 0 1.00215 104.39429 121.45771] CT
0.8 GC
N
f227889816
f
GR
GS
[0.99899 0 0 1.00215 102.80115 127.28619] CT
0.8 GC
N
f227889816
f
GR
GS
[0.99899 0 0 1.00215 103.54418 137.02374] CT
0.8 GC
N
f227889816
f
GR
GS
[0.99899 0 0 1.00215 150.76042 140.05226] CT
0.8 GC
N
f227889816
f
GR
GS
[0.99899 0 0 1.00215 99.75323 98.90957] CT
0.8 GC
N
f227889816
f
GR
GS
[0.99899 0 0 1.00215 115.44586 121.68194] CT
0.8 GC
N
f227889816
f
GR
GS
[0.99899 0 0 1.00215 94.08576 125.55822] CT
0.8 GC
N
f227889816
f
GR
GS
[0.99899 0 0 1.00215 94.08576 95.73469] CT
0.8 GC
N
f227889816
f
GR
GS
[0.99899 0 0 1.00215 121.96121 123.2465] CT
0.8 GC
N
f227889816
f
GR
GS
[0.99899 0 0 1.00215 119.52019 128.57401] CT
0.8 GC
N
f227889816
f
GR
GS
[0.99899 0 0 1.00215 105.6349 89.82724] CT
0.8 GC
N
f227889816
f
GR
GS
[0.99899 0 0 1.00215 81.55262 122.55486] CT
0.8 GC
N
f227889816
f
GR
GS
[0.99899 0 0 1.00215 86.93671 126.94877] CT
0.8 GC
N
f227889816
f
GR
GS
[0.99899 0 0 1.00215 122.81133 148.31019] CT
0.8 GC
N
f227889816
f
GR
GS
[0.99899 0 0 1.00215 130.85066 96.77004] CT
0.8 GC
N
f227889816
f
GR
GS
[0.99899 0 0 1.00215 108.36153 102.83325] CT
0.8 GC
N
f227889816
f
GR
GS
[0.99899 0 0 1.00215 130.00054 119.10799] CT
0.8 GC
N
f227889816
f
GR
GS
[0.99899 0 0 1.00215 71.24408 120.32199] CT
0.8 GC
N
f227889816
f
GR
GS
[0.99899 0 0 1.00215 95.43791 115.71868] CT
0.8 GC
N
f227889816
f
GR
GS
[0.99899 0 0 1.00215 75.44559 116.18679] CT
0.8 GC
N
f227889816
f
GR
GS
[0.99899 0 0 1.00215 99.75323 114.03305] CT
0.8 GC
N
f227889816
f
GR
GS
[0.99899 0 0 1.00215 79.569 97.91216] CT
0.8 GC
N
f227889816
f
GR
GS
[0.99899 0 0 1.00215 71.41588 111.85426] CT
0.8 GC
N
f227889816
f
GR
GS
[0.99899 0 0 1.00215 105.42068 119.78392] CT
0.8 GC
N
f227889816
f
GR
GS
[0.99899 0 0 1.00215 100.2508 130.00689] CT
0.8 GC
N
f227889816
f
GR
GS
[0.99899 0 0 1.00215 85.19631 132.0683] CT
0.8 GC
N
f227889816
f
GR
GS
[0.99899 0 0 1.00215 124.33308 123.20655] CT
0.8 GC
N
f227889816
f
GR
GS
[0.99899 0 0 1.00215 116.96982 117.9801] CT
0.8 GC
N
f227889816
f
GR
GS
[0.99899 0 0 1.00215 92.77822 85.16826] CT
0.8 GC
N
f227889816
f
GR
GS
[0.99899 0 0 1.00215 112.04538 140.11626] CT
0.8 GC
N
f227889816
f
GR
GS
[0.99899 0 0 1.00215 77.00525 117.63991] CT
0.8 GC
N
f227889816
f
GR
GS
[0.99899 0 0 1.00215 95.72129 133.33052] CT
0.8 GC
N
f227889816
f
GR
GS
[0.99899 0 0 1.00215 107.05176 125.37606] CT
0.8 GC
N
f227889816
f
GR
GS
[0.99899 0 0 1.00215 68.04442 95.64501] CT
0.8 GC
N
f227889816
f
GR
GS
[0.99899 0 0 1.00215 97.13816 124.31034] CT
0.8 GC
N
f227889816
f
GR
GS
[0.99899 0 0 1.00215 72.09419 80.4605] CT
0.8 GC
N
f227889816
f
GR
GS
[0.99899 0 0 1.00215 64.7265 107.97639] CT
0.8 GC
N
f227889816
f
GR
GS
[0.99899 0 0 1.00215 105.91827 112.59965] CT
0.8 GC
N
f227889816
f
GR
GS
[0.99899 0 0 1.00215 93.9117 117.87709] CT
0.8 GC
N
f227889816
f
GR
GS
[0.99899 0 0 1.00215 125.74994 137.0618] CT
0.8 GC
N
f227889816
f
GR
GS
[0.99899 0 0 1.00215 107.05399 124.95554] CT
0.8 GC
N
f227889816
f
GR
GS
[0.99899 0 0 1.00215 125.25683 65.92149] CT
0.6 GC
N
/f-1969333140{-3.536 0 M
0 4.702 L
3.536 0 L
0 -4.702 L
cp}def
f-1969333140
f
GR
GS
[0.99899 0 0 1.00215 139.42548 96.14899] CT
0.6 GC
N
f-1969333140
f
GR
GS
[0.99899 0 0 1.00215 95.72129 107.67799] CT
0.6 GC
N
f-1969333140
f
GR
GS
[0.99899 0 0 1.00215 192.51449 118.90753] CT
0.6 GC
N
f-1969333140
f
GR
GS
[0.99899 0 0 1.00215 122.42308 107.99268] CT
0.6 GC
N
f-1969333140
f
GR
GS
[0.99899 0 0 1.00215 153.13006 112.76866] CT
0.6 GC
N
f-1969333140
f
GR
GS
[0.99899 0 0 1.00215 134.99637 104.04819] CT
0.6 GC
N
f-1969333140
f
GR
GS
[0.99899 0 0 1.00215 115.83634 97.75871] CT
0.6 GC
N
f-1969333140
f
GR
GS
[0.99899 0 0 1.00215 106.4337 91.27528] CT
0.6 GC
N
f-1969333140
f
GR
GS
[0.99899 0 0 1.00215 144.90552 122.17419] CT
0.6 GC
N
f-1969333140
f
GR
GS
[0.99899 0 0 1.00215 71.41588 92.72931] CT
0.6 GC
N
f-1969333140
f
GR
GS
[0.99899 0 0 1.00215 179.86532 133.50436] CT
0.6 GC
N
f-1969333140
f
GR
GS
[0.99899 0 0 1.00215 133.01276 123.38872] CT
0.6 GC
N
f-1969333140
f
GR
GS
[0.99899 0 0 1.00215 142.18335 120.95488] CT
0.6 GC
N
f-1969333140
f
GR
GS
[0.99899 0 0 1.00215 119.58935 95.38671] CT
0.6 GC
N
f-1969333140
f
GR
GS
[0.99899 0 0 1.00215 100.84209 98.87692] CT
0.6 GC
N
f-1969333140
f
GR
GS
[0.99899 0 0 1.00215 128.09055 108.53209] CT
0.6 GC
N
f-1969333140
f
GR
GS
[0.99899 0 0 1.00215 140.38048 110.91248] CT
0.6 GC
N
f-1969333140
f
GR
GS
[0.99899 0 0 1.00215 83.81961 58.69594] CT
0.6 GC
N
f-1969333140
f
GR
GS
[0.99899 0 0 1.00215 133.29614 130.43406] CT
0.6 GC
N
f-1969333140
f
GR
GS
[0.99899 0 0 1.00215 113.54034 85.00706] CT
0.6 GC
N
f-1969333140
f
GR
GS
[0.99899 0 0 1.00215 88.0702 77.07772] CT
0.6 GC
N
f-1969333140
f
GR
GS
[0.99899 0 0 1.00215 122.42308 100.03618] CT
0.6 GC
N
f-1969333140
f
GR
GS
[0.99899 0 0 1.00215 112.32876 116.42748] CT
0.6 GC
N
f-1969333140
f
GR
GS
[0.99899 0 0 1.00215 117.13271 75.66356] CT
0.6 GC
N
f-1969333140
f
GR
GS
[0.99899 0 0 1.00215 139.81373 116.77664] CT
0.6 GC
N
f-1969333140
f
GR
GS
[0.99899 0 0 1.00215 113.92188 112.97127] CT
0.6 GC
N
f-1969333140
f
GR
GS
[0.99899 0 0 1.00215 117.71283 88.82419] CT
0.6 GC
N
f-1969333140
f
GR
GS
[0.99899 0 0 1.00215 109.03538 90.28471] CT
0.6 GC
N
f-1969333140
f
GR
GS
[0.99899 0 0 1.00215 112.15248 65.50293] CT
0.6 GC
N
f-1969333140
f
GR
GS
[0.99899 0 0 1.00215 116.75562 66.95392] CT
0.6 GC
N
f-1969333140
f
GR
GS
[0.99899 0 0 1.00215 128.09055 100.71045] CT
0.6 GC
N
f-1969333140
f
GR
GS
[0.99899 0 0 1.00215 94.08576 96.28317] CT
0.6 GC
N
f-1969333140
f
GR
GS
[0.99899 0 0 1.00215 122.42308 88.60889] CT
0.6 GC
N
f-1969333140
f
GR
GS
[0.99899 0 0 1.00215 133.57951 108.795] CT
0.6 GC
N
f-1969333140
f
GR
GS
[0.99899 0 0 1.00215 91.1873 89.27889] CT
0.6 GC
N
f-1969333140
f
GR
GS
[0.99899 0 0 1.00215 94.54762 96.88395] CT
0.6 GC
N
f-1969333140
f
GR
GS
[0.99899 0 0 1.00215 91.75406 72.26331] CT
0.6 GC
N
f-1969333140
f
GR
GS
[0.99899 0 0 1.00215 110.91188 32.22811] CT
0.6 GC
N
f-1969333140
f
GR
GS
[0.99899 0 0 1.00215 141.89998 106.9103] CT
0.6 GC
N
f-1969333140
f
GR
GS
[0.99899 0 0 1.00215 123.76633 44.74798] CT
0.6 GC
N
f-1969333140
f
GR
GS
[0.99899 0 0 1.00215 103.3679 49.03967] CT
0.6 GC
N
f-1969333140
f
GR
GS
[0.99899 0 0 1.00215 91.1873 64.98684] CT
0.6 GC
N
f-1969333140
f
GR
GS
[0.99899 0 0 1.00215 134.53451 112.19917] CT
0.6 GC
N
f-1969333140
f
GR
GS
[0.99899 0 0 1.00215 111.08815 82.13408] CT
0.6 GC
N
f-1969333140
f
GR
GS
[0.99899 0 0 1.00215 102.80115 93.28658] CT
0.6 GC
N
f-1969333140
f
GR
GS
[0.99899 0 0 1.00215 100.2508 104.41764] CT
0.6 GC
N
f-1969333140
f
GR
GS
[0.99899 0 0 1.00215 109.60211 78.564] CT
0.6 GC
N
f-1969333140
f
GR
GS
[0.99899 0 0 1.00215 95.68113 107.61234] CT
0.6 GC
N
f-1969333140
f
GR
GS
[0.99899 0 0 1.00215 128.86705 123.43126] CT
0.6 GC
N
f-1969333140
f
GR
GS
[0.99899 0 0 1.00215 81.15991 116.33418] CT
0.6 GC
N
f-1969333140
f
GR
GS
[0.99899 0 0 1.00215 173.4303 112.26776] CT
0.6 GC
N
f-1969333140
f
GR
GS
[0.99899 0 0 1.00215 102.23442 88.96254] CT
0.6 GC
N
f-1969333140
f
GR
%%Trailer
%%Pages: 1
%%EOF
