%!PS-Adobe-3.0 EPSF-3.0
%%Creator: (MATLAB, The Mathworks, Inc. Version 9.8.0.1323502 \(R2020a\). Operating System: Mac OS X)
%%Title: /Users/kosciessa/Desktop/mntTardisLNDG/LNDG/stateswitch/stsw_multimodal/figures/l1byage/l1comp_excitability.eps
%%CreationDate: 2022-03-02T14:36:42
%%Pages: (atend)
%%BoundingBox:     4     0   180   275
%%LanguageLevel: 3
%%EndComments
%%BeginProlog
%%BeginResource: procset (Apache XML Graphics Std ProcSet) 1.2 0
%%Version: 1.2 0
%%Copyright: (Copyright 2001-2003,2010 The Apache Software Foundation. License terms: http://www.apache.org/licenses/LICENSE-2.0)
/bd{bind def}bind def
/ld{load def}bd
/GR/grestore ld
/GS/gsave ld
/RM/rmoveto ld
/C/curveto ld
/t/show ld
/L/lineto ld
/ML/setmiterlimit ld
/CT/concat ld
/f/fill ld
/N/newpath ld
/S/stroke ld
/CC/setcmykcolor ld
/A/ashow ld
/cp/closepath ld
/RC/setrgbcolor ld
/LJ/setlinejoin ld
/GC/setgray ld
/LW/setlinewidth ld
/M/moveto ld
/re {4 2 roll M
1 index 0 rlineto
0 exch rlineto
neg 0 rlineto
cp } bd
/_ctm matrix def
/_tm matrix def
/BT { _ctm currentmatrix pop matrix _tm copy pop 0 0 moveto } bd
/ET { _ctm setmatrix } bd
/iTm { _ctm setmatrix _tm concat } bd
/Tm { _tm astore pop iTm 0 0 moveto } bd
/ux 0.0 def
/uy 0.0 def
/F {
  /Tp exch def
  /Tf exch def
  Tf findfont Tp scalefont setfont
  /cf Tf def  /cs Tp def
} bd
/ULS {currentpoint /uy exch def /ux exch def} bd
/ULE {
  /Tcx currentpoint pop def
  gsave
  newpath
  cf findfont cs scalefont dup
  /FontMatrix get 0 get /Ts exch def /FontInfo get dup
  /UnderlinePosition get Ts mul /To exch def
  /UnderlineThickness get Ts mul /Tt exch def
  ux uy To add moveto  Tcx uy To add lineto
  Tt setlinewidth stroke
  grestore
} bd
/OLE {
  /Tcx currentpoint pop def
  gsave
  newpath
  cf findfont cs scalefont dup
  /FontMatrix get 0 get /Ts exch def /FontInfo get dup
  /UnderlinePosition get Ts mul /To exch def
  /UnderlineThickness get Ts mul /Tt exch def
  ux uy To add cs add moveto Tcx uy To add cs add lineto
  Tt setlinewidth stroke
  grestore
} bd
/SOE {
  /Tcx currentpoint pop def
  gsave
  newpath
  cf findfont cs scalefont dup
  /FontMatrix get 0 get /Ts exch def /FontInfo get dup
  /UnderlinePosition get Ts mul /To exch def
  /UnderlineThickness get Ts mul /Tt exch def
  ux uy To add cs 10 mul 26 idiv add moveto Tcx uy To add cs 10 mul 26 idiv add lineto
  Tt setlinewidth stroke
  grestore
} bd
/QT {
/Y22 exch store
/X22 exch store
/Y21 exch store
/X21 exch store
currentpoint
/Y21 load 2 mul add 3 div exch
/X21 load 2 mul add 3 div exch
/X21 load 2 mul /X22 load add 3 div
/Y21 load 2 mul /Y22 load add 3 div
/X22 load /Y22 load curveto
} bd
/SSPD {
dup length /d exch dict def
{
/v exch def
/k exch def
currentpagedevice k known {
/cpdv currentpagedevice k get def
v cpdv ne {
/upd false def
/nullv v type /nulltype eq def
/nullcpdv cpdv type /nulltype eq def
nullv nullcpdv or
{
/upd true def
} {
/sametype v type cpdv type eq def
sametype {
v type /arraytype eq {
/vlen v length def
/cpdvlen cpdv length def
vlen cpdvlen eq {
0 1 vlen 1 sub {
/i exch def
/obj v i get def
/cpdobj cpdv i get def
obj cpdobj ne {
/upd true def
exit
} if
} for
} {
/upd true def
} ifelse
} {
v type /dicttype eq {
v {
/dv exch def
/dk exch def
/cpddv cpdv dk get def
dv cpddv ne {
/upd true def
exit
} if
} forall
} {
/upd true def
} ifelse
} ifelse
} if
} ifelse
upd true eq {
d k v put
} if
} if
} if
} forall
d length 0 gt {
d setpagedevice
} if
} bd
/RE { % /NewFontName [NewEncodingArray] /FontName RE -
  findfont dup length dict begin
  {
    1 index /FID ne
    {def} {pop pop} ifelse
  } forall
  /Encoding exch def
  /FontName 1 index def
  currentdict definefont pop
  end
} bind def
%%EndResource
%%BeginResource: procset (Apache XML Graphics EPS ProcSet) 1.0 0
%%Version: 1.0 0
%%Copyright: (Copyright 2002-2003 The Apache Software Foundation. License terms: http://www.apache.org/licenses/LICENSE-2.0)
/BeginEPSF { %def
/b4_Inc_state save def         % Save state for cleanup
/dict_count countdictstack def % Count objects on dict stack
/op_count count 1 sub def      % Count objects on operand stack
userdict begin                 % Push userdict on dict stack
/showpage { } def              % Redefine showpage, { } = null proc
0 setgray 0 setlinecap         % Prepare graphics state
1 setlinewidth 0 setlinejoin
10 setmiterlimit [ ] 0 setdash newpath
/languagelevel where           % If level not equal to 1 then
{pop languagelevel             % set strokeadjust and
1 ne                           % overprint to their defaults.
{false setstrokeadjust false setoverprint
} if
} if
} bd
/EndEPSF { %def
count op_count sub {pop} repeat            % Clean up stacks
countdictstack dict_count sub {end} repeat
b4_Inc_state restore
} bd
%%EndResource
%FOPBeginFontDict
%%IncludeResource: font Courier-Oblique
%%IncludeResource: font Courier-BoldOblique
%%IncludeResource: font Courier-Bold
%%IncludeResource: font ZapfDingbats
%%IncludeResource: font Symbol
%%IncludeResource: font Helvetica
%%IncludeResource: font Helvetica-Oblique
%%IncludeResource: font Helvetica-Bold
%%IncludeResource: font Helvetica-BoldOblique
%%IncludeResource: font Times-Roman
%%IncludeResource: font Times-Italic
%%IncludeResource: font Times-Bold
%%IncludeResource: font Times-BoldItalic
%%IncludeResource: font Courier
%FOPEndFontDict
%%BeginResource: encoding WinAnsiEncoding
/WinAnsiEncoding [
/.notdef /.notdef /.notdef /.notdef /.notdef
/.notdef /.notdef /.notdef /.notdef /.notdef
/.notdef /.notdef /.notdef /.notdef /.notdef
/.notdef /.notdef /.notdef /.notdef /.notdef
/.notdef /.notdef /.notdef /.notdef /.notdef
/.notdef /.notdef /.notdef /.notdef /.notdef
/.notdef /.notdef /space /exclam /quotedbl
/numbersign /dollar /percent /ampersand /quotesingle
/parenleft /parenright /asterisk /plus /comma
/hyphen /period /slash /zero /one
/two /three /four /five /six
/seven /eight /nine /colon /semicolon
/less /equal /greater /question /at
/A /B /C /D /E
/F /G /H /I /J
/K /L /M /N /O
/P /Q /R /S /T
/U /V /W /X /Y
/Z /bracketleft /backslash /bracketright /asciicircum
/underscore /quoteleft /a /b /c
/d /e /f /g /h
/i /j /k /l /m
/n /o /p /q /r
/s /t /u /v /w
/x /y /z /braceleft /bar
/braceright /asciitilde /bullet /Euro /bullet
/quotesinglbase /florin /quotedblbase /ellipsis /dagger
/daggerdbl /circumflex /perthousand /Scaron /guilsinglleft
/OE /bullet /Zcaron /bullet /bullet
/quoteleft /quoteright /quotedblleft /quotedblright /bullet
/endash /emdash /asciitilde /trademark /scaron
/guilsinglright /oe /bullet /zcaron /Ydieresis
/space /exclamdown /cent /sterling /currency
/yen /brokenbar /section /dieresis /copyright
/ordfeminine /guillemotleft /logicalnot /sfthyphen /registered
/macron /degree /plusminus /twosuperior /threesuperior
/acute /mu /paragraph /middot /cedilla
/onesuperior /ordmasculine /guillemotright /onequarter /onehalf
/threequarters /questiondown /Agrave /Aacute /Acircumflex
/Atilde /Adieresis /Aring /AE /Ccedilla
/Egrave /Eacute /Ecircumflex /Edieresis /Igrave
/Iacute /Icircumflex /Idieresis /Eth /Ntilde
/Ograve /Oacute /Ocircumflex /Otilde /Odieresis
/multiply /Oslash /Ugrave /Uacute /Ucircumflex
/Udieresis /Yacute /Thorn /germandbls /agrave
/aacute /acircumflex /atilde /adieresis /aring
/ae /ccedilla /egrave /eacute /ecircumflex
/edieresis /igrave /iacute /icircumflex /idieresis
/eth /ntilde /ograve /oacute /ocircumflex
/otilde /odieresis /divide /oslash /ugrave
/uacute /ucircumflex /udieresis /yacute /thorn
/ydieresis
] def
%%EndResource
%FOPBeginFontReencode
/Courier-Oblique findfont
dup length dict begin
  {1 index /FID ne {def} {pop pop} ifelse} forall
  /Encoding WinAnsiEncoding def
  currentdict
end
/Courier-Oblique exch definefont pop
/Courier-BoldOblique findfont
dup length dict begin
  {1 index /FID ne {def} {pop pop} ifelse} forall
  /Encoding WinAnsiEncoding def
  currentdict
end
/Courier-BoldOblique exch definefont pop
/Courier-Bold findfont
dup length dict begin
  {1 index /FID ne {def} {pop pop} ifelse} forall
  /Encoding WinAnsiEncoding def
  currentdict
end
/Courier-Bold exch definefont pop
/Helvetica findfont
dup length dict begin
  {1 index /FID ne {def} {pop pop} ifelse} forall
  /Encoding WinAnsiEncoding def
  currentdict
end
/Helvetica exch definefont pop
/Helvetica-Oblique findfont
dup length dict begin
  {1 index /FID ne {def} {pop pop} ifelse} forall
  /Encoding WinAnsiEncoding def
  currentdict
end
/Helvetica-Oblique exch definefont pop
/Helvetica-Bold findfont
dup length dict begin
  {1 index /FID ne {def} {pop pop} ifelse} forall
  /Encoding WinAnsiEncoding def
  currentdict
end
/Helvetica-Bold exch definefont pop
/Helvetica-BoldOblique findfont
dup length dict begin
  {1 index /FID ne {def} {pop pop} ifelse} forall
  /Encoding WinAnsiEncoding def
  currentdict
end
/Helvetica-BoldOblique exch definefont pop
/Times-Roman findfont
dup length dict begin
  {1 index /FID ne {def} {pop pop} ifelse} forall
  /Encoding WinAnsiEncoding def
  currentdict
end
/Times-Roman exch definefont pop
/Times-Italic findfont
dup length dict begin
  {1 index /FID ne {def} {pop pop} ifelse} forall
  /Encoding WinAnsiEncoding def
  currentdict
end
/Times-Italic exch definefont pop
/Times-Bold findfont
dup length dict begin
  {1 index /FID ne {def} {pop pop} ifelse} forall
  /Encoding WinAnsiEncoding def
  currentdict
end
/Times-Bold exch definefont pop
/Times-BoldItalic findfont
dup length dict begin
  {1 index /FID ne {def} {pop pop} ifelse} forall
  /Encoding WinAnsiEncoding def
  currentdict
end
/Times-BoldItalic exch definefont pop
/Courier findfont
dup length dict begin
  {1 index /FID ne {def} {pop pop} ifelse} forall
  /Encoding WinAnsiEncoding def
  currentdict
end
/Courier exch definefont pop
%FOPEndFontReencode
%%EndProlog
%%Page: 1 1
%%PageBoundingBox: 0 0 198 283
%%BeginPageSetup
[1 0 0 -1 0 283] CT
%%EndPageSetup
GS
[1.00215 0 0 1 0 0] CT
1 GC
N
0 0 198 283 re
f
GR
GS
[1.00215 0 0 1 0 0] CT
1 GC
N
0 0 198 283 re
f
GR
GS
[1.00215 0 0 1 0 0] CT
1 GC
N
55.5 228 M
179 228 L
179 32 L
55.5 32 L
cp
f
GR
GS
[1.00215 0 0 1 0 0] CT
0.149 GC
2 setlinecap
1 LJ
0.5 LW
N
55.5 228 M
179 228 L
S
GR
GS
[1.00215 0 0 1 0 0] CT
0.149 GC
2 setlinecap
1 LJ
0.5 LW
N
92.55 228 M
92.55 226.04 L
S
GR
GS
[1.00215 0 0 1 0 0] CT
0.149 GC
2 setlinecap
1 LJ
0.5 LW
N
141.95 228 M
141.95 226.04 L
S
GR
GS
[1.00215 0 0 1 92.74875 234] CT
0.149 GC
/Helvetica 20 F
GS
[1 0 0 1 0 0] CT
-13 20 moveto 
1 -1 scale
(YA) t 
GR
GR
GS
[1.00215 0 0 1 142.25483 234] CT
0.149 GC
/Helvetica 20 F
GS
[1 0 0 1 0 0] CT
-14.5 20 moveto 
1 -1 scale
(OA) t 
GR
GR
GS
[1.00215 0 0 1 117.50185 259] CT
0.149 GC
/Helvetica 20 F
GS
[1 0 0 1 0 0] CT
-49 20 moveto 
1 -1 scale
(Age Group) t 
GR
GR
GS
[1.00215 0 0 1 0 0] CT
0.149 GC
2 setlinecap
1 LJ
0.5 LW
N
55.5 228 M
55.5 32 L
S
GR
GS
[1.00215 0 0 1 0 0] CT
0.149 GC
2 setlinecap
1 LJ
0.5 LW
N
55.5 228 M
57.46 228 L
S
GR
GS
[1.00215 0 0 1 0 0] CT
0.149 GC
2 setlinecap
1 LJ
0.5 LW
N
55.5 145.676 M
57.46 145.676 L
S
GR
GS
[1.00215 0 0 1 0 0] CT
0.149 GC
2 setlinecap
1 LJ
0.5 LW
N
55.5 63.352 M
57.46 63.352 L
S
GR
GS
[1.00215 0 0 1 49.6063 228] CT
0.149 GC
/Helvetica 20 F
GS
[1 0 0 1 0 0] CT
-12 7.5 moveto 
1 -1 scale
(0) t 
GR
GR
GS
[1.00215 0 0 1 49.6063 145.67616] CT
0.149 GC
/Helvetica 20 F
GS
[1 0 0 1 0 0] CT
-12 7.5 moveto 
1 -1 scale
(5) t 
GR
GR
GS
[1.00215 0 0 1 49.6063 63.35233] CT
0.149 GC
/Helvetica 20 F
GS
[1 0 0 1 0 0] CT
-23 7.5 moveto 
1 -1 scale
(10) t 
GR
GR
GS
[0 -1 1.00215 0 24.05154 129.99991] CT
0.149 GC
/Helvetica 20 F
GS
[1 0 0 1 0 0] CT
-58 -5 moveto 
1 -1 scale
(excitability l1) t 
GR
GR
GS
[1.00215 0 0 1 117.50191 29.24999] CT
/Helvetica-Bold 22 F
GS
[1 0 0 1 0 0] CT
-41 -5 moveto 
1 -1 scale
(p = 0.01) t 
GR
GR
GS
[1.00215 0 0 1 0 0] CT
0.149 GC
1 LJ
0.5 LW
N
55.5 228 M
179 228 L
S
GR
GS
[1.00215 0 0 1 0 0] CT
1 0.6 0.6 RC
N
112.31 228 M
112.31 85.953 L
72.79 85.953 L
72.79 228 L
cp
f
GR
GS
[1.00215 0 0 1 83.41634 76.69489] CT
0.302 GC
N
2.236 0 M
2.236 -1.235 1.235 -2.236 0 -2.236 C
-1.235 -2.236 -2.236 -1.235 -2.236 0 C
-2.236 1.235 -1.235 2.236 0 2.236 C
1.235 2.236 2.236 1.235 2.236 0 C
cp
f
GR
GS
[1.00215 0 0 1 84.0592 84.22411] CT
0.302 GC
N
/f-1586420743{2.236 0 M
2.236 -1.235 1.235 -2.236 0 -2.236 C
-1.235 -2.236 -2.236 -1.235 -2.236 0 C
-2.236 1.235 -1.235 2.236 0 2.236 C
1.235 2.236 2.236 1.235 2.236 0 C
cp}def
f-1586420743
f
GR
GS
[1.00215 0 0 1 98.80028 81.27254] CT
0.302 GC
N
f-1586420743
f
GR
GS
[1.00215 0 0 1 90.97619 98.32314] CT
0.302 GC
N
f-1586420743
f
GR
GS
[1.00215 0 0 1 93.87919 79.39402] CT
0.302 GC
N
f-1586420743
f
GR
GS
[1.00215 0 0 1 97.34624 92.53043] CT
0.302 GC
N
f-1586420743
f
GR
GS
[1.00215 0 0 1 83.32228 94.7173] CT
0.302 GC
N
f-1586420743
f
GR
GS
[1.00215 0 0 1 84.86508 69.93356] CT
0.302 GC
N
f-1586420743
f
GR
GS
[1.00215 0 0 1 96.62009 57.61808] CT
0.302 GC
N
f-1586420743
f
GR
GS
[1.00215 0 0 1 95.61523 100.53899] CT
0.302 GC
N
f-1586420743
f
GR
GS
[1.00215 0 0 1 90.96333 116.56647] CT
0.302 GC
N
f-1586420743
f
GR
GS
[1.00215 0 0 1 84.59855 89.33455] CT
0.302 GC
N
f-1586420743
f
GR
GS
[1.00215 0 0 1 92.56913 106.88819] CT
0.302 GC
N
f-1586420743
f
GR
GS
[1.00215 0 0 1 90.8483 91.05279] CT
0.302 GC
N
f-1586420743
f
GR
GS
[1.00215 0 0 1 90.07848 96.79551] CT
0.302 GC
N
f-1586420743
f
GR
GS
[1.00215 0 0 1 93.84591 61.82286] CT
0.302 GC
N
f-1586420743
f
GR
GS
[1.00215 0 0 1 88.89063 53.05453] CT
0.302 GC
N
f-1586420743
f
GR
GS
[1.00215 0 0 1 93.8662 83.75343] CT
0.302 GC
N
f-1586420743
f
GR
GS
[1.00215 0 0 1 86.58024 97.21685] CT
0.302 GC
N
f-1586420743
f
GR
GS
[1.00215 0 0 1 98.23349 58.85037] CT
0.302 GC
N
f-1586420743
f
GR
GS
[1.00215 0 0 1 92.73684 104.95128] CT
0.302 GC
N
f-1586420743
f
GR
GS
[1.00215 0 0 1 83.19606 101.47343] CT
0.302 GC
N
f-1586420743
f
GR
GS
[1.00215 0 0 1 83.22722 66.29739] CT
0.302 GC
N
f-1586420743
f
GR
GS
[1.00215 0 0 1 96.24983 100.60301] CT
0.302 GC
N
f-1586420743
f
GR
GS
[1.00215 0 0 1 100.09791 94.05901] CT
0.302 GC
N
f-1586420743
f
GR
GS
[1.00215 0 0 1 84.38027 91.58077] CT
0.302 GC
N
f-1586420743
f
GR
GS
[1.00215 0 0 1 92.68418 67.82943] CT
0.302 GC
N
f-1586420743
f
GR
GS
[1.00215 0 0 1 100.54209 89.5283] CT
0.302 GC
N
f-1586420743
f
GR
GS
[1.00215 0 0 1 95.25864 108.94386] CT
0.302 GC
N
f-1586420743
f
GR
GS
[1.00215 0 0 1 83.28809 74.01608] CT
0.302 GC
N
f-1586420743
f
GR
GS
[1.00215 0 0 1 96.07066 100.27379] CT
0.302 GC
N
f-1586420743
f
GR
GS
[1.00215 0 0 1 85.03284 89.90269] CT
0.302 GC
N
f-1586420743
f
GR
GS
[1.00215 0 0 1 85.98991 83.63168] CT
0.302 GC
N
f-1586420743
f
GR
GS
[1.00215 0 0 1 91.40541 95.47186] CT
0.302 GC
N
f-1586420743
f
GR
GS
[1.00215 0 0 1 86.885 96.16492] CT
0.302 GC
N
f-1586420743
f
GR
GS
[1.00215 0 0 1 86.01612 64.0751] CT
0.302 GC
N
f-1586420743
f
GR
GS
[1.00215 0 0 1 83.60021 80.3726] CT
0.302 GC
N
f-1586420743
f
GR
GS
[1.00215 0 0 1 96.35315 56.93257] CT
0.302 GC
N
f-1586420743
f
GR
GS
[1.00215 0 0 1 100.72313 83.96172] CT
0.302 GC
N
f-1586420743
f
GR
GS
[1.00215 0 0 1 99.87693 73.82476] CT
0.302 GC
N
f-1586420743
f
GR
GS
[1.00215 0 0 1 100.04591 112.26442] CT
0.302 GC
N
f-1586420743
f
GR
GS
[1.00215 0 0 1 96.5741 83.26727] CT
0.302 GC
N
f-1586420743
f
GR
GS
[1.00215 0 0 1 0 0] CT
1 0.6 0.6 RC
N
/f-1365921948{161.71 228 M
161.71 76.294 L
122.19 76.294 L
122.19 228 L
cp}def
f-1365921948
f
GR
GS
[1.00215 0 0 1 133.70603 63.88175] CT
0.302 GC
N
f-1586420743
f
GR
GS
[1.00215 0 0 1 144.41054 56.15955] CT
0.302 GC
N
f-1586420743
f
GR
GS
[1.00215 0 0 1 142.6405 95.34608] CT
0.302 GC
N
f-1586420743
f
GR
GS
[1.00215 0 0 1 149.6679 55.61712] CT
0.302 GC
N
f-1586420743
f
GR
GS
[1.00215 0 0 1 150.57374 68.11191] CT
0.302 GC
N
f-1586420743
f
GR
GS
[1.00215 0 0 1 143.98663 65.19507] CT
0.302 GC
N
f-1586420743
f
GR
GS
[1.00215 0 0 1 134.90918 49.76786] CT
0.302 GC
N
f-1586420743
f
GR
GS
[1.00215 0 0 1 140.67393 72.65878] CT
0.302 GC
N
f-1586420743
f
GR
GS
[1.00215 0 0 1 148.73429 65.33653] CT
0.302 GC
N
f-1586420743
f
GR
GS
[1.00215 0 0 1 150.15196 80.46041] CT
0.302 GC
N
f-1586420743
f
GR
GS
[1.00215 0 0 1 146.69547 77.81093] CT
0.302 GC
N
f-1586420743
f
GR
GS
[1.00215 0 0 1 148.26671 86.76811] CT
0.302 GC
N
f-1586420743
f
GR
GS
[1.00215 0 0 1 142.48445 58.13462] CT
0.302 GC
N
f-1586420743
f
GR
GS
[1.00215 0 0 1 132.65065 68.77254] CT
0.302 GC
N
f-1586420743
f
GR
GS
[1.00215 0 0 1 150.16554 47.93241] CT
0.302 GC
N
f-1586420743
f
GR
GS
[1.00215 0 0 1 150.69253 59.83936] CT
0.302 GC
N
f-1586420743
f
GR
GS
[1.00215 0 0 1 150.43231 61.28883] CT
0.302 GC
N
f-1586420743
f
GR
GS
[1.00215 0 0 1 137.69617 62.76546] CT
0.302 GC
N
f-1586420743
f
GR
GS
[1.00215 0 0 1 136.46956 41.05823] CT
0.302 GC
N
f-1586420743
f
GR
GS
[1.00215 0 0 1 145.23717 103.25891] CT
0.302 GC
N
f-1586420743
f
GR
GS
[1.00215 0 0 1 134.05923 87.46808] CT
0.302 GC
N
f-1586420743
f
GR
GS
[1.00215 0 0 1 135.31266 88.90208] CT
0.302 GC
N
f-1586420743
f
GR
GS
[1.00215 0 0 1 150.57428 70.04802] CT
0.302 GC
N
f-1586420743
f
GR
GS
[1.00215 0 0 1 144.41016 93.28675] CT
0.302 GC
N
f-1586420743
f
GR
GS
[1.00215 0 0 1 148.35356 101.40827] CT
0.302 GC
N
f-1586420743
f
GR
GS
[1.00215 0 0 1 143.44867 89.45781] CT
0.302 GC
N
f-1586420743
f
GR
GS
[1.00215 0 0 1 148.6171 90.61385] CT
0.302 GC
N
f-1586420743
f
GR
GS
[1.00215 0 0 1 140.15432 71.04605] CT
0.302 GC
N
f-1586420743
f
GR
GS
[1.00215 0 0 1 148.02626 95.20711] CT
0.302 GC
N
f-1586420743
f
GR
GS
[1.00215 0 0 1 134.02524 78.97539] CT
0.302 GC
N
f-1586420743
f
GR
GS
[1.00215 0 0 1 133.76268 79.51369] CT
0.302 GC
N
f-1586420743
f
GR
GS
[1.00215 0 0 1 140.27574 89.10357] CT
0.302 GC
N
f-1586420743
f
GR
GS
[1.00215 0 0 1 149.0348 79.26881] CT
0.302 GC
N
f-1586420743
f
GR
GS
[1.00215 0 0 1 135.93398 97.08598] CT
0.302 GC
N
f-1586420743
f
GR
GS
[1.00215 0 0 1 132.89897 94.18495] CT
0.302 GC
N
f-1586420743
f
GR
GS
[1.00215 0 0 1 142.96638 79.95568] CT
0.302 GC
N
f-1586420743
f
GR
GS
[1.00215 0 0 1 132.88823 77.60696] CT
0.302 GC
N
f-1586420743
f
GR
GS
[1.00215 0 0 1 138.81088 83.30547] CT
0.302 GC
N
f-1586420743
f
GR
GS
[1.00215 0 0 1 138.91315 67.23167] CT
0.302 GC
N
f-1586420743
f
GR
GS
[1.00215 0 0 1 150.81021 92.18716] CT
0.302 GC
N
f-1586420743
f
GR
GS
[1.00215 0 0 1 142.29165 100.76345] CT
0.302 GC
N
f-1586420743
f
GR
GS
[1.00215 0 0 1 139.32609 77.83096] CT
0.302 GC
N
f-1586420743
f
GR
GS
[1.00215 0 0 1 136.9842 61.91687] CT
0.302 GC
N
f-1586420743
f
GR
GS
[1.00215 0 0 1 135.54825 93.23851] CT
0.302 GC
N
f-1586420743
f
GR
GS
[1.00215 0 0 1 151.55834 83.74873] CT
0.302 GC
N
f-1586420743
f
GR
GS
[1.00215 0 0 1 135.67102 32] CT
0.302 GC
N
f-1586420743
f
GR
GS
[1.00215 0 0 1 135.13031 83.61337] CT
0.302 GC
N
f-1586420743
f
GR
GS
[1.00215 0 0 1 139.60034 38.90694] CT
0.302 GC
N
f-1586420743
f
GR
GS
[1.00215 0 0 1 136.11838 86.49391] CT
0.302 GC
N
f-1586420743
f
GR
GS
[1.00215 0 0 1 147.05692 81.52242] CT
0.302 GC
N
f-1586420743
f
GR
GS
[1.00215 0 0 1 137.40149 92.16933] CT
0.302 GC
N
f-1586420743
f
GR
GS
[1.00215 0 0 1 143.56244 104.69314] CT
0.302 GC
N
f-1586420743
f
GR
GS
[1.00215 0 0 1 132.51174 60.6642] CT
0.302 GC
N
f-1586420743
f
GR
%%Trailer
%%Pages: 1
%%EOF
