%!PS-Adobe-3.0 EPSF-3.0
%%Creator: (MATLAB, The Mathworks, Inc. Version 9.8.0.1323502 \(R2020a\). Operating System: Mac OS X)
%%Title: /Users/kosciessa/Desktop/mntTardisLNDG/LNDG/stateswitch/stsw_multimodal/figures/correlations/f_alpha_driftl1.eps
%%CreationDate: 2022-03-11T15:12:21
%%Pages: (atend)
%%BoundingBox:     3     0   215   194
%%LanguageLevel: 3
%%EndComments
%%BeginProlog
%%BeginResource: procset (Apache XML Graphics Std ProcSet) 1.2 0
%%Version: 1.2 0
%%Copyright: (Copyright 2001-2003,2010 The Apache Software Foundation. License terms: http://www.apache.org/licenses/LICENSE-2.0)
/bd{bind def}bind def
/ld{load def}bd
/GR/grestore ld
/GS/gsave ld
/RM/rmoveto ld
/C/curveto ld
/t/show ld
/L/lineto ld
/ML/setmiterlimit ld
/CT/concat ld
/f/fill ld
/N/newpath ld
/S/stroke ld
/CC/setcmykcolor ld
/A/ashow ld
/cp/closepath ld
/RC/setrgbcolor ld
/LJ/setlinejoin ld
/GC/setgray ld
/LW/setlinewidth ld
/M/moveto ld
/re {4 2 roll M
1 index 0 rlineto
0 exch rlineto
neg 0 rlineto
cp } bd
/_ctm matrix def
/_tm matrix def
/BT { _ctm currentmatrix pop matrix _tm copy pop 0 0 moveto } bd
/ET { _ctm setmatrix } bd
/iTm { _ctm setmatrix _tm concat } bd
/Tm { _tm astore pop iTm 0 0 moveto } bd
/ux 0.0 def
/uy 0.0 def
/F {
  /Tp exch def
  /Tf exch def
  Tf findfont Tp scalefont setfont
  /cf Tf def  /cs Tp def
} bd
/ULS {currentpoint /uy exch def /ux exch def} bd
/ULE {
  /Tcx currentpoint pop def
  gsave
  newpath
  cf findfont cs scalefont dup
  /FontMatrix get 0 get /Ts exch def /FontInfo get dup
  /UnderlinePosition get Ts mul /To exch def
  /UnderlineThickness get Ts mul /Tt exch def
  ux uy To add moveto  Tcx uy To add lineto
  Tt setlinewidth stroke
  grestore
} bd
/OLE {
  /Tcx currentpoint pop def
  gsave
  newpath
  cf findfont cs scalefont dup
  /FontMatrix get 0 get /Ts exch def /FontInfo get dup
  /UnderlinePosition get Ts mul /To exch def
  /UnderlineThickness get Ts mul /Tt exch def
  ux uy To add cs add moveto Tcx uy To add cs add lineto
  Tt setlinewidth stroke
  grestore
} bd
/SOE {
  /Tcx currentpoint pop def
  gsave
  newpath
  cf findfont cs scalefont dup
  /FontMatrix get 0 get /Ts exch def /FontInfo get dup
  /UnderlinePosition get Ts mul /To exch def
  /UnderlineThickness get Ts mul /Tt exch def
  ux uy To add cs 10 mul 26 idiv add moveto Tcx uy To add cs 10 mul 26 idiv add lineto
  Tt setlinewidth stroke
  grestore
} bd
/QT {
/Y22 exch store
/X22 exch store
/Y21 exch store
/X21 exch store
currentpoint
/Y21 load 2 mul add 3 div exch
/X21 load 2 mul add 3 div exch
/X21 load 2 mul /X22 load add 3 div
/Y21 load 2 mul /Y22 load add 3 div
/X22 load /Y22 load curveto
} bd
/SSPD {
dup length /d exch dict def
{
/v exch def
/k exch def
currentpagedevice k known {
/cpdv currentpagedevice k get def
v cpdv ne {
/upd false def
/nullv v type /nulltype eq def
/nullcpdv cpdv type /nulltype eq def
nullv nullcpdv or
{
/upd true def
} {
/sametype v type cpdv type eq def
sametype {
v type /arraytype eq {
/vlen v length def
/cpdvlen cpdv length def
vlen cpdvlen eq {
0 1 vlen 1 sub {
/i exch def
/obj v i get def
/cpdobj cpdv i get def
obj cpdobj ne {
/upd true def
exit
} if
} for
} {
/upd true def
} ifelse
} {
v type /dicttype eq {
v {
/dv exch def
/dk exch def
/cpddv cpdv dk get def
dv cpddv ne {
/upd true def
exit
} if
} forall
} {
/upd true def
} ifelse
} ifelse
} if
} ifelse
upd true eq {
d k v put
} if
} if
} if
} forall
d length 0 gt {
d setpagedevice
} if
} bd
/RE { % /NewFontName [NewEncodingArray] /FontName RE -
  findfont dup length dict begin
  {
    1 index /FID ne
    {def} {pop pop} ifelse
  } forall
  /Encoding exch def
  /FontName 1 index def
  currentdict definefont pop
  end
} bind def
%%EndResource
%%BeginResource: procset (Apache XML Graphics EPS ProcSet) 1.0 0
%%Version: 1.0 0
%%Copyright: (Copyright 2002-2003 The Apache Software Foundation. License terms: http://www.apache.org/licenses/LICENSE-2.0)
/BeginEPSF { %def
/b4_Inc_state save def         % Save state for cleanup
/dict_count countdictstack def % Count objects on dict stack
/op_count count 1 sub def      % Count objects on operand stack
userdict begin                 % Push userdict on dict stack
/showpage { } def              % Redefine showpage, { } = null proc
0 setgray 0 setlinecap         % Prepare graphics state
1 setlinewidth 0 setlinejoin
10 setmiterlimit [ ] 0 setdash newpath
/languagelevel where           % If level not equal to 1 then
{pop languagelevel             % set strokeadjust and
1 ne                           % overprint to their defaults.
{false setstrokeadjust false setoverprint
} if
} if
} bd
/EndEPSF { %def
count op_count sub {pop} repeat            % Clean up stacks
countdictstack dict_count sub {end} repeat
b4_Inc_state restore
} bd
%%EndResource
%FOPBeginFontDict
%%IncludeResource: font Courier-Oblique
%%IncludeResource: font Courier-BoldOblique
%%IncludeResource: font Courier-Bold
%%IncludeResource: font ZapfDingbats
%%IncludeResource: font Symbol
%%IncludeResource: font Helvetica
%%IncludeResource: font Helvetica-Oblique
%%IncludeResource: font Helvetica-Bold
%%IncludeResource: font Helvetica-BoldOblique
%%IncludeResource: font Times-Roman
%%IncludeResource: font Times-Italic
%%IncludeResource: font Times-Bold
%%IncludeResource: font Times-BoldItalic
%%IncludeResource: font Courier
%FOPEndFontDict
%%BeginResource: encoding WinAnsiEncoding
/WinAnsiEncoding [
/.notdef /.notdef /.notdef /.notdef /.notdef
/.notdef /.notdef /.notdef /.notdef /.notdef
/.notdef /.notdef /.notdef /.notdef /.notdef
/.notdef /.notdef /.notdef /.notdef /.notdef
/.notdef /.notdef /.notdef /.notdef /.notdef
/.notdef /.notdef /.notdef /.notdef /.notdef
/.notdef /.notdef /space /exclam /quotedbl
/numbersign /dollar /percent /ampersand /quotesingle
/parenleft /parenright /asterisk /plus /comma
/hyphen /period /slash /zero /one
/two /three /four /five /six
/seven /eight /nine /colon /semicolon
/less /equal /greater /question /at
/A /B /C /D /E
/F /G /H /I /J
/K /L /M /N /O
/P /Q /R /S /T
/U /V /W /X /Y
/Z /bracketleft /backslash /bracketright /asciicircum
/underscore /quoteleft /a /b /c
/d /e /f /g /h
/i /j /k /l /m
/n /o /p /q /r
/s /t /u /v /w
/x /y /z /braceleft /bar
/braceright /asciitilde /bullet /Euro /bullet
/quotesinglbase /florin /quotedblbase /ellipsis /dagger
/daggerdbl /circumflex /perthousand /Scaron /guilsinglleft
/OE /bullet /Zcaron /bullet /bullet
/quoteleft /quoteright /quotedblleft /quotedblright /bullet
/endash /emdash /asciitilde /trademark /scaron
/guilsinglright /oe /bullet /zcaron /Ydieresis
/space /exclamdown /cent /sterling /currency
/yen /brokenbar /section /dieresis /copyright
/ordfeminine /guillemotleft /logicalnot /sfthyphen /registered
/macron /degree /plusminus /twosuperior /threesuperior
/acute /mu /paragraph /middot /cedilla
/onesuperior /ordmasculine /guillemotright /onequarter /onehalf
/threequarters /questiondown /Agrave /Aacute /Acircumflex
/Atilde /Adieresis /Aring /AE /Ccedilla
/Egrave /Eacute /Ecircumflex /Edieresis /Igrave
/Iacute /Icircumflex /Idieresis /Eth /Ntilde
/Ograve /Oacute /Ocircumflex /Otilde /Odieresis
/multiply /Oslash /Ugrave /Uacute /Ucircumflex
/Udieresis /Yacute /Thorn /germandbls /agrave
/aacute /acircumflex /atilde /adieresis /aring
/ae /ccedilla /egrave /eacute /ecircumflex
/edieresis /igrave /iacute /icircumflex /idieresis
/eth /ntilde /ograve /oacute /ocircumflex
/otilde /odieresis /divide /oslash /ugrave
/uacute /ucircumflex /udieresis /yacute /thorn
/ydieresis
] def
%%EndResource
%FOPBeginFontReencode
/Courier-Oblique findfont
dup length dict begin
  {1 index /FID ne {def} {pop pop} ifelse} forall
  /Encoding WinAnsiEncoding def
  currentdict
end
/Courier-Oblique exch definefont pop
/Courier-BoldOblique findfont
dup length dict begin
  {1 index /FID ne {def} {pop pop} ifelse} forall
  /Encoding WinAnsiEncoding def
  currentdict
end
/Courier-BoldOblique exch definefont pop
/Courier-Bold findfont
dup length dict begin
  {1 index /FID ne {def} {pop pop} ifelse} forall
  /Encoding WinAnsiEncoding def
  currentdict
end
/Courier-Bold exch definefont pop
/Helvetica findfont
dup length dict begin
  {1 index /FID ne {def} {pop pop} ifelse} forall
  /Encoding WinAnsiEncoding def
  currentdict
end
/Helvetica exch definefont pop
/Helvetica-Oblique findfont
dup length dict begin
  {1 index /FID ne {def} {pop pop} ifelse} forall
  /Encoding WinAnsiEncoding def
  currentdict
end
/Helvetica-Oblique exch definefont pop
/Helvetica-Bold findfont
dup length dict begin
  {1 index /FID ne {def} {pop pop} ifelse} forall
  /Encoding WinAnsiEncoding def
  currentdict
end
/Helvetica-Bold exch definefont pop
/Helvetica-BoldOblique findfont
dup length dict begin
  {1 index /FID ne {def} {pop pop} ifelse} forall
  /Encoding WinAnsiEncoding def
  currentdict
end
/Helvetica-BoldOblique exch definefont pop
/Times-Roman findfont
dup length dict begin
  {1 index /FID ne {def} {pop pop} ifelse} forall
  /Encoding WinAnsiEncoding def
  currentdict
end
/Times-Roman exch definefont pop
/Times-Italic findfont
dup length dict begin
  {1 index /FID ne {def} {pop pop} ifelse} forall
  /Encoding WinAnsiEncoding def
  currentdict
end
/Times-Italic exch definefont pop
/Times-Bold findfont
dup length dict begin
  {1 index /FID ne {def} {pop pop} ifelse} forall
  /Encoding WinAnsiEncoding def
  currentdict
end
/Times-Bold exch definefont pop
/Times-BoldItalic findfont
dup length dict begin
  {1 index /FID ne {def} {pop pop} ifelse} forall
  /Encoding WinAnsiEncoding def
  currentdict
end
/Times-BoldItalic exch definefont pop
/Courier findfont
dup length dict begin
  {1 index /FID ne {def} {pop pop} ifelse} forall
  /Encoding WinAnsiEncoding def
  currentdict
end
/Courier exch definefont pop
%FOPEndFontReencode
%%EndProlog
%%Page: 1 1
%%PageBoundingBox: 0 0 227 198
%%BeginPageSetup
[1 0 0 -1 0 198] CT
%%EndPageSetup
GS
[0.99899 0 0 1.00215 0 -0.4252] CT
N
0 0 M
227 0 L
227 198 L
0 198 L
0 0 L
cp
clip
1 GC
N
0 0 227 198 re
f
GR
GS
[0.99899 0 0 1.00215 0 -0.4252] CT
1 GC
N
0 0 227 198 re
f
GR
GS
[0.99899 0 0 1.00215 0 -0.4252] CT
0.2 GC
N
32.5 143 M
205.5 143 L
205.5 21 L
32.5 21 L
cp
f
GR
GS
[0.99899 0 0 1.00215 0 -0.4252] CT
0.149 GC
2 setlinecap
1 LJ
0.5 LW
N
32.5 143 M
205.5 143 L
S
GR
GS
[0.99899 0 0 1.00215 0 -0.4252] CT
0.149 GC
2 setlinecap
1 LJ
0.5 LW
N
41.363 143 M
41.363 141.27 L
S
GR
GS
[0.99899 0 0 1.00215 0 -0.4252] CT
0.149 GC
2 setlinecap
1 LJ
0.5 LW
N
96.076 143 M
96.076 141.27 L
S
GR
GS
[0.99899 0 0 1.00215 0 -0.4252] CT
0.149 GC
2 setlinecap
1 LJ
0.5 LW
N
150.788 143 M
150.788 141.27 L
S
GR
GS
[0.99899 0 0 1.00215 0 -0.4252] CT
0.149 GC
2 setlinecap
1 LJ
0.5 LW
N
205.5 143 M
205.5 141.27 L
S
GR
GS
[0.99899 0 0 1.00215 41.3217 147.6922] CT
0.149 GC
/Helvetica 14 F
GS
[1 0 0 1 0 0] CT
-12.5 14 moveto 
1 -1 scale
(-0.2) t 
GR
GR
GS
[0.99899 0 0 1.00215 95.97889 147.6922] CT
0.149 GC
/Helvetica 14 F
GS
[1 0 0 1 0 0] CT
-4 14 moveto 
1 -1 scale
(0) t 
GR
GR
GS
[0.99899 0 0 1.00215 150.63608 147.6922] CT
0.149 GC
/Helvetica 14 F
GS
[1 0 0 1 0 0] CT
-10 14 moveto 
1 -1 scale
(0.2) t 
GR
GR
GS
[0.99899 0 0 1.00215 205.29328 147.6922] CT
0.149 GC
/Helvetica 14 F
GS
[1 0 0 1 0 0] CT
-10 14 moveto 
1 -1 scale
(0.4) t 
GR
GR
GS
[0.99899 0 0 1.00215 118.88038 165.22978] CT
0.149 GC
/Helvetica 14 F
GS
[1 0 0 1 0 0] CT
-27 14 moveto 
1 -1 scale
(alpha bs) t 
GR
GR
GS
[0.99899 0 0 1.00215 118.88038 165.22978] CT
0.149 GC
/Helvetica 14 F
GS
[1 0 0 1 0 0] CT
-57.5 31 moveto 
1 -1 scale
(\(linear modulation\)) t 
GR
GR
GS
[0.99899 0 0 1.00215 0 -0.4252] CT
0.149 GC
2 setlinecap
1 LJ
0.5 LW
N
32.5 143 M
32.5 21 L
S
GR
GS
[0.99899 0 0 1.00215 0 -0.4252] CT
0.149 GC
2 setlinecap
1 LJ
0.5 LW
N
32.5 138.644 M
34.23 138.644 L
S
GR
GS
[0.99899 0 0 1.00215 0 -0.4252] CT
0.149 GC
2 setlinecap
1 LJ
0.5 LW
N
32.5 103.871 M
34.23 103.871 L
S
GR
GS
[0.99899 0 0 1.00215 0 -0.4252] CT
0.149 GC
2 setlinecap
1 LJ
0.5 LW
N
32.5 69.098 M
34.23 69.098 L
S
GR
GS
[0.99899 0 0 1.00215 0 -0.4252] CT
0.149 GC
2 setlinecap
1 LJ
0.5 LW
N
32.5 34.325 M
34.23 34.325 L
S
GR
GS
[0.99899 0 0 1.00215 27.67213 138.51694] CT
0.149 GC
/Helvetica 14 F
GS
[1 0 0 1 0 0] CT
-8 5.5 moveto 
1 -1 scale
(0) t 
GR
GR
GS
[0.99899 0 0 1.00215 27.67213 103.66897] CT
0.149 GC
/Helvetica 14 F
GS
[1 0 0 1 0 0] CT
-8 5.5 moveto 
1 -1 scale
(1) t 
GR
GR
GS
[0.99899 0 0 1.00215 27.67213 68.821] CT
0.149 GC
/Helvetica 14 F
GS
[1 0 0 1 0 0] CT
-8 5.5 moveto 
1 -1 scale
(2) t 
GR
GR
GS
[0.99899 0 0 1.00215 27.67213 33.97303] CT
0.149 GC
/Helvetica 14 F
GS
[1 0 0 1 0 0] CT
-8 5.5 moveto 
1 -1 scale
(3) t 
GR
GR
GS
[0 -1.00215 0.99899 0 16.6832 81.75083] CT
0.149 GC
/Helvetica 14 F
GS
[1 0 0 1 0 0] CT
-20 -3 moveto 
1 -1 scale
(drift l1) t 
GR
GR
GS
[0.99899 0 0 1.00215 118.88041 18.86614] CT
/Helvetica-Bold 14 F
GS
[1 0 0 1 0 0] CT
-63.5 -4 moveto 
1 -1 scale
(r = 0.66 p = 2.4e-13) t 
GR
GR
GS
[0.99899 0 0 1.00215 145.08788 51.77389] CT
0.8 0.502 0.502 RC
N
0.5 0 M
0.5 -0.276 0.276 -0.5 0 -0.5 C
-0.276 -0.5 -0.5 -0.276 -0.5 0 C
-0.5 0.276 -0.276 0.5 0 0.5 C
0.276 0.5 0.5 0.276 0.5 0 C
cp
f
GR
GS
[0.99899 0 0 1.00215 87.52315 73.15951] CT
0.8 0.502 0.502 RC
N
/f-2105962265{0.5 0 M
0.5 -0.276 0.276 -0.5 0 -0.5 C
-0.276 -0.5 -0.5 -0.276 -0.5 0 C
-0.5 0.276 -0.276 0.5 0 0.5 C
0.276 0.5 0.5 0.276 0.5 0 C
cp}def
f-2105962265
f
GR
GS
[0.99899 0 0 1.00215 175.262 56.07185] CT
0.8 0.502 0.502 RC
N
f-2105962265
f
GR
GS
[0.99899 0 0 1.00215 153.17875 70.98295] CT
0.8 0.502 0.502 RC
N
f-2105962265
f
GR
GS
[0.99899 0 0 1.00215 86.57354 95.24677] CT
0.8 0.502 0.502 RC
N
f-2105962265
f
GR
GS
[0.99899 0 0 1.00215 104.10907 58.98196] CT
0.8 0.502 0.502 RC
N
f-2105962265
f
GR
GS
[0.99899 0 0 1.00215 135.65876 58.70116] CT
0.8 0.502 0.502 RC
N
f-2105962265
f
GR
GS
[0.99899 0 0 1.00215 115.73871 47.67707] CT
0.8 0.502 0.502 RC
N
f-2105962265
f
GR
GS
[0.99899 0 0 1.00215 104.91148 87.29722] CT
0.8 0.502 0.502 RC
N
f-2105962265
f
GR
GS
[0.99899 0 0 1.00215 172.63322 59.40456] CT
0.8 0.502 0.502 RC
N
f-2105962265
f
GR
GS
[0.99899 0 0 1.00215 148.82432 78.42713] CT
0.8 0.502 0.502 RC
N
f-2105962265
f
GR
GS
[0.99899 0 0 1.00215 119.54604 56.38342] CT
0.8 0.502 0.502 RC
N
f-2105962265
f
GR
GS
[0.99899 0 0 1.00215 97.76064 76.51765] CT
0.8 0.502 0.502 RC
N
f-2105962265
f
GR
GS
[0.99899 0 0 1.00215 111.50562 70.09249] CT
0.8 0.502 0.502 RC
N
f-2105962265
f
GR
GS
[0.99899 0 0 1.00215 137.1609 84.01806] CT
0.8 0.502 0.502 RC
N
f-2105962265
f
GR
GS
[0.99899 0 0 1.00215 73.89555 118.38332] CT
0.8 0.502 0.502 RC
N
f-2105962265
f
GR
GS
[0.99899 0 0 1.00215 107.56027 77.52019] CT
0.8 0.502 0.502 RC
N
f-2105962265
f
GR
GS
[0.99899 0 0 1.00215 147.71353 53.58579] CT
0.8 0.502 0.502 RC
N
f-2105962265
f
GR
GS
[0.99899 0 0 1.00215 180.79415 61.33206] CT
0.8 0.502 0.502 RC
N
f-2105962265
f
GR
GS
[0.99899 0 0 1.00215 60.26211 73.92722] CT
0.8 0.502 0.502 RC
N
f-2105962265
f
GR
GS
[0.99899 0 0 1.00215 135.78803 48.5776] CT
0.8 0.502 0.502 RC
N
f-2105962265
f
GR
GS
[0.99899 0 0 1.00215 154.61146 67.03216] CT
0.8 0.502 0.502 RC
N
f-2105962265
f
GR
GS
[0.99899 0 0 1.00215 104.72977 97.62427] CT
0.8 0.502 0.502 RC
N
f-2105962265
f
GR
GS
[0.99899 0 0 1.00215 128.83078 49.19478] CT
0.8 0.502 0.502 RC
N
f-2105962265
f
GR
GS
[0.99899 0 0 1.00215 122.60683 38.53833] CT
0.8 0.502 0.502 RC
N
f-2105962265
f
GR
GS
[0.99899 0 0 1.00215 75.30074 62.079] CT
0.8 0.502 0.502 RC
N
f-2105962265
f
GR
GS
[0.99899 0 0 1.00215 126.91497 72.9583] CT
0.8 0.502 0.502 RC
N
f-2105962265
f
GR
GS
[0.99899 0 0 1.00215 146.36579 39.31736] CT
0.8 0.502 0.502 RC
N
f-2105962265
f
GR
GS
[0.99899 0 0 1.00215 157.42862 48.41515] CT
0.8 0.502 0.502 RC
N
f-2105962265
f
GR
GS
[0.99899 0 0 1.00215 124.90325 71.26463] CT
0.8 0.502 0.502 RC
N
f-2105962265
f
GR
GS
[0.99899 0 0 1.00215 146.27748 59.94859] CT
0.8 0.502 0.502 RC
N
f-2105962265
f
GR
GS
[0.99899 0 0 1.00215 180.79415 36.26213] CT
0.8 0.502 0.502 RC
N
f-2105962265
f
GR
GS
[0.99899 0 0 1.00215 132.21788 43.01213] CT
0.8 0.502 0.502 RC
N
f-2105962265
f
GR
GS
[0.99899 0 0 1.00215 160.18 42.5349] CT
0.8 0.502 0.502 RC
N
f-2105962265
f
GR
GS
[0.99899 0 0 1.00215 174.25869 55.34276] CT
0.8 0.502 0.502 RC
N
f-2105962265
f
GR
GS
[0.99899 0 0 1.00215 152.01188 30.80839] CT
0.8 0.502 0.502 RC
N
f-2105962265
f
GR
GS
[0.99899 0 0 1.00215 107.09667 74.18877] CT
0.8 0.502 0.502 RC
N
f-2105962265
f
GR
GS
[0.99899 0 0 1.00215 117.31966 41.36964] CT
0.8 0.502 0.502 RC
N
f-2105962265
f
GR
GS
[0.99899 0 0 1.00215 73.08354 87.98816] CT
0.8 0.502 0.502 RC
N
f-2105962265
f
GR
GS
[0.99899 0 0 1.00215 100.86261 52.76875] CT
0.8 0.502 0.502 RC
N
f-2105962265
f
GR
GS
[0.99899 0 0 1.00215 73.80694 73.85916] CT
0.8 0.502 0.502 RC
N
f-2105962265
f
GR
GS
[0.99899 0 0 1.00215 123.70499 61.00682] CT
0.8 0.502 0.502 RC
N
f-2105962265
f
GR
GS
[0.99899 0 0 1.00215 113.24024 102.62588] CT
0.8 0.502 0.502 RC
N
f-2105962265
f
GR
GS
[0.99899 0 0 1.00215 89.29447 95.51696] CT
0.8 0.502 0.502 RC
N
f-2105962265
f
GR
GS
[0.99899 0 0 1.00215 125.56921 86.01718] CT
0.8 0.502 0.502 RC
N
f-2105962265
f
GR
GS
[0.99899 0 0 1.00215 56.92328 132.69338] CT
0.8 0.502 0.502 RC
N
f-2105962265
f
GR
GS
[0.99899 0 0 1.00215 120.18051 90.80785] CT
0.8 0.502 0.502 RC
N
f-2105962265
f
GR
GS
[0.99899 0 0 1.00215 32.46731 108.59232] CT
0.8 0.502 0.502 RC
N
f-2105962265
f
GR
GS
[0.99899 0 0 1.00215 106.10734 81.18976] CT
0.8 0.502 0.502 RC
N
f-2105962265
f
GR
GS
[0.99899 0 0 1.00215 93.37389 102.19] CT
0.8 0.502 0.502 RC
N
f-2105962265
f
GR
GS
[0.99899 0 0 1.00215 86.71385 100.59024] CT
0.8 0.502 0.502 RC
N
f-2105962265
f
GR
GS
[0.99899 0 0 1.00215 107.19008 94.90484] CT
0.8 0.502 0.502 RC
N
f-2105962265
f
GR
GS
[0.99899 0 0 1.00215 82.07816 93.63822] CT
0.8 0.502 0.502 RC
N
f-2105962265
f
GR
GS
[0.99899 0 0 1.00215 50.08561 116.18187] CT
0.8 0.502 0.502 RC
N
f-2105962265
f
GR
GS
[0.99899 0 0 1.00215 85.60724 75.61269] CT
0.8 0.502 0.502 RC
N
f-2105962265
f
GR
GS
[0.99899 0 0 1.00215 97.38638 91.27109] CT
0.8 0.502 0.502 RC
N
f-2105962265
f
GR
GS
[0.99899 0 0 1.00215 77.44319 98.25849] CT
0.8 0.502 0.502 RC
N
f-2105962265
f
GR
GS
[0.99899 0 0 1.00215 90.2617 83.25385] CT
0.8 0.502 0.502 RC
N
f-2105962265
f
GR
GS
[0.99899 0 0 1.00215 94.53117 89.94751] CT
0.8 0.502 0.502 RC
N
f-2105962265
f
GR
GS
[0.99899 0 0 1.00215 104.38637 102.53354] CT
0.8 0.502 0.502 RC
N
f-2105962265
f
GR
GS
[0.99899 0 0 1.00215 70.67442 105.55054] CT
0.8 0.502 0.502 RC
N
f-2105962265
f
GR
GS
[0.99899 0 0 1.00215 107.40015 126.31688] CT
0.8 0.502 0.502 RC
N
f-2105962265
f
GR
GS
[0.99899 0 0 1.00215 119.09046 100.40692] CT
0.8 0.502 0.502 RC
N
f-2105962265
f
GR
GS
[0.99899 0 0 1.00215 79.91215 102.46406] CT
0.8 0.502 0.502 RC
N
f-2105962265
f
GR
GS
[0.99899 0 0 1.00215 117.81548 104.96535] CT
0.8 0.502 0.502 RC
N
f-2105962265
f
GR
GS
[0.99899 0 0 1.00215 89.16739 109.79818] CT
0.8 0.502 0.502 RC
N
f-2105962265
f
GR
GS
[0.99899 0 0 1.00215 113.04488 101.96099] CT
0.8 0.502 0.502 RC
N
f-2105962265
f
GR
GS
[0.99899 0 0 1.00215 109.96939 85.11054] CT
0.8 0.502 0.502 RC
N
f-2105962265
f
GR
GS
[0.99899 0 0 1.00215 113.6021 79.85219] CT
0.8 0.502 0.502 RC
N
f-2105962265
f
GR
GS
[0.99899 0 0 1.00215 94.95485 99.19081] CT
0.8 0.502 0.502 RC
N
f-2105962265
f
GR
GS
[0.99899 0 0 1.00215 114.35531 93.67213] CT
0.8 0.502 0.502 RC
N
f-2105962265
f
GR
GS
[0.99899 0 0 1.00215 77.46686 92.4873] CT
0.8 0.502 0.502 RC
N
f-2105962265
f
GR
GS
[0.99899 0 0 1.00215 76.54121 111.73432] CT
0.8 0.502 0.502 RC
N
f-2105962265
f
GR
GS
[0.99899 0 0 1.00215 124.97602 83.52629] CT
0.8 0.502 0.502 RC
N
f-2105962265
f
GR
GS
[0.99899 0 0 1.00215 77.66816 112.91354] CT
0.8 0.502 0.502 RC
N
f-2105962265
f
GR
GS
[0.99899 0 0 1.00215 71.40584 103.94834] CT
0.8 0.502 0.502 RC
N
f-2105962265
f
GR
GS
[0.99899 0 0 1.00215 121.34592 102.25694] CT
0.8 0.502 0.502 RC
N
f-2105962265
f
GR
GS
[0.99899 0 0 1.00215 85.67219 109.52738] CT
0.8 0.502 0.502 RC
N
f-2105962265
f
GR
GS
[0.99899 0 0 1.00215 88.50968 121.75603] CT
0.8 0.502 0.502 RC
N
f-2105962265
f
GR
GS
[0.99899 0 0 1.00215 114.36083 107.37384] CT
0.8 0.502 0.502 RC
N
f-2105962265
f
GR
GS
[0.99899 0 0 1.00215 95.20056 96.185] CT
0.8 0.502 0.502 RC
N
f-2105962265
f
GR
GS
[0.99899 0 0 1.00215 95.59547 96.51872] CT
0.8 0.502 0.502 RC
N
f-2105962265
f
GR
GS
[0.99899 0 0 1.00215 70.09823 129.96065] CT
0.8 0.502 0.502 RC
N
f-2105962265
f
GR
GS
[0.99899 0 0 1.00215 65.60411 121.83969] CT
0.8 0.502 0.502 RC
N
f-2105962265
f
GR
GS
[0.99899 0 0 1.00215 61.84411 100.18537] CT
0.8 0.502 0.502 RC
N
f-2105962265
f
GR
GS
[0.99899 0 0 1.00215 127.32206 97.43109] CT
0.8 0.502 0.502 RC
N
f-2105962265
f
GR
GS
[0.99899 0 0 1.00215 98.51708 96.62728] CT
0.8 0.502 0.502 RC
N
f-2105962265
f
GR
GS
[0.99899 0 0 1.00215 96.23712 104.37434] CT
0.8 0.502 0.502 RC
N
f-2105962265
f
GR
GS
[0.99899 0 0 1.00215 68.7093 102.87229] CT
0.8 0.502 0.502 RC
N
f-2105962265
f
GR
GS
[0.99899 0 0 1.00215 88.66928 101.90886] CT
0.8 0.502 0.502 RC
N
f-2105962265
f
GR
GS
[0.99899 0 0 1.00215 81.24207 89.88719] CT
0.8 0.502 0.502 RC
N
f-2105962265
f
GR
GS
[0.99899 0 0 1.00215 139.05721 97.10918] CT
0.8 0.502 0.502 RC
N
f-2105962265
f
GR
GS
[0.99899 0 0 1.00215 80.44571 78.92705] CT
0.8 0.502 0.502 RC
N
f-2105962265
f
GR
GS
[0.99899 0 0 1.00215 114.22166 108.27804] CT
0.8 0.502 0.502 RC
N
f-2105962265
f
GR
GS
[0.99899 0 0 1.00215 104.83506 109.55883] CT
0.8 0.502 0.502 RC
N
f-2105962265
f
GR
GS
[0.99899 0 0 1.00215 0 -0.4252] CT
0.902 0.6 0.6 RC
1 LJ
3 LW
N
32.5 123.152 M
205.5 34.424 L
S
GR
GS
[0.99899 0 0 1.00215 145.08788 51.77389] CT
1 0.702 0.702 RC
N
/f227889816{-3 -3 M
-3 3 L
3 3 L
3 -3 L
cp}def
f227889816
f
GR
GS
[0.99899 0 0 1.00215 87.52315 73.15951] CT
1 0.702 0.702 RC
N
f227889816
f
GR
GS
[0.99899 0 0 1.00215 175.262 56.07185] CT
1 0.702 0.702 RC
N
f227889816
f
GR
GS
[0.99899 0 0 1.00215 153.17875 70.98295] CT
1 0.702 0.702 RC
N
f227889816
f
GR
GS
[0.99899 0 0 1.00215 86.57354 95.24677] CT
1 0.702 0.702 RC
N
f227889816
f
GR
GS
[0.99899 0 0 1.00215 104.10907 58.98196] CT
1 0.702 0.702 RC
N
f227889816
f
GR
GS
[0.99899 0 0 1.00215 135.65876 58.70116] CT
1 0.702 0.702 RC
N
f227889816
f
GR
GS
[0.99899 0 0 1.00215 115.73871 47.67707] CT
1 0.702 0.702 RC
N
f227889816
f
GR
GS
[0.99899 0 0 1.00215 104.91148 87.29722] CT
1 0.702 0.702 RC
N
f227889816
f
GR
GS
[0.99899 0 0 1.00215 172.63322 59.40456] CT
1 0.702 0.702 RC
N
f227889816
f
GR
GS
[0.99899 0 0 1.00215 148.82432 78.42713] CT
1 0.702 0.702 RC
N
f227889816
f
GR
GS
[0.99899 0 0 1.00215 119.54604 56.38342] CT
1 0.702 0.702 RC
N
f227889816
f
GR
GS
[0.99899 0 0 1.00215 97.76064 76.51765] CT
1 0.702 0.702 RC
N
f227889816
f
GR
GS
[0.99899 0 0 1.00215 111.50562 70.09249] CT
1 0.702 0.702 RC
N
f227889816
f
GR
GS
[0.99899 0 0 1.00215 137.1609 84.01806] CT
1 0.702 0.702 RC
N
f227889816
f
GR
GS
[0.99899 0 0 1.00215 73.89555 118.38332] CT
1 0.702 0.702 RC
N
f227889816
f
GR
GS
[0.99899 0 0 1.00215 107.56027 77.52019] CT
1 0.702 0.702 RC
N
f227889816
f
GR
GS
[0.99899 0 0 1.00215 147.71353 53.58579] CT
1 0.702 0.702 RC
N
f227889816
f
GR
GS
[0.99899 0 0 1.00215 180.79415 61.33206] CT
1 0.702 0.702 RC
N
f227889816
f
GR
GS
[0.99899 0 0 1.00215 60.26211 73.92722] CT
1 0.702 0.702 RC
N
f227889816
f
GR
GS
[0.99899 0 0 1.00215 135.78803 48.5776] CT
1 0.702 0.702 RC
N
f227889816
f
GR
GS
[0.99899 0 0 1.00215 154.61146 67.03216] CT
1 0.702 0.702 RC
N
f227889816
f
GR
GS
[0.99899 0 0 1.00215 104.72977 97.62427] CT
1 0.702 0.702 RC
N
f227889816
f
GR
GS
[0.99899 0 0 1.00215 128.83078 49.19478] CT
1 0.702 0.702 RC
N
f227889816
f
GR
GS
[0.99899 0 0 1.00215 122.60683 38.53833] CT
1 0.702 0.702 RC
N
f227889816
f
GR
GS
[0.99899 0 0 1.00215 75.30074 62.079] CT
1 0.702 0.702 RC
N
f227889816
f
GR
GS
[0.99899 0 0 1.00215 126.91497 72.9583] CT
1 0.702 0.702 RC
N
f227889816
f
GR
GS
[0.99899 0 0 1.00215 146.36579 39.31736] CT
1 0.702 0.702 RC
N
f227889816
f
GR
GS
[0.99899 0 0 1.00215 157.42862 48.41515] CT
1 0.702 0.702 RC
N
f227889816
f
GR
GS
[0.99899 0 0 1.00215 124.90325 71.26463] CT
1 0.702 0.702 RC
N
f227889816
f
GR
GS
[0.99899 0 0 1.00215 146.27748 59.94859] CT
1 0.702 0.702 RC
N
f227889816
f
GR
GS
[0.99899 0 0 1.00215 180.79415 36.26213] CT
1 0.702 0.702 RC
N
f227889816
f
GR
GS
[0.99899 0 0 1.00215 132.21788 43.01213] CT
1 0.702 0.702 RC
N
f227889816
f
GR
GS
[0.99899 0 0 1.00215 160.18 42.5349] CT
1 0.702 0.702 RC
N
f227889816
f
GR
GS
[0.99899 0 0 1.00215 174.25869 55.34276] CT
1 0.702 0.702 RC
N
f227889816
f
GR
GS
[0.99899 0 0 1.00215 152.01188 30.80839] CT
1 0.702 0.702 RC
N
f227889816
f
GR
GS
[0.99899 0 0 1.00215 107.09667 74.18877] CT
1 0.702 0.702 RC
N
f227889816
f
GR
GS
[0.99899 0 0 1.00215 117.31966 41.36964] CT
1 0.702 0.702 RC
N
f227889816
f
GR
GS
[0.99899 0 0 1.00215 73.08354 87.98816] CT
1 0.702 0.702 RC
N
f227889816
f
GR
GS
[0.99899 0 0 1.00215 100.86261 52.76875] CT
1 0.702 0.702 RC
N
f227889816
f
GR
GS
[0.99899 0 0 1.00215 73.80694 73.85916] CT
1 0.702 0.702 RC
N
f227889816
f
GR
GS
[0.99899 0 0 1.00215 123.70499 61.00682] CT
1 0.702 0.702 RC
N
f227889816
f
GR
GS
[0.99899 0 0 1.00215 113.24024 102.62588] CT
0.8 0.502 0.502 RC
N
/f-1969333140{-3.536 0 M
0 4.702 L
3.536 0 L
0 -4.702 L
cp}def
f-1969333140
f
GR
GS
[0.99899 0 0 1.00215 89.29447 95.51696] CT
0.8 0.502 0.502 RC
N
f-1969333140
f
GR
GS
[0.99899 0 0 1.00215 125.56921 86.01718] CT
0.8 0.502 0.502 RC
N
f-1969333140
f
GR
GS
[0.99899 0 0 1.00215 56.92328 132.69338] CT
0.8 0.502 0.502 RC
N
f-1969333140
f
GR
GS
[0.99899 0 0 1.00215 120.18051 90.80785] CT
0.8 0.502 0.502 RC
N
f-1969333140
f
GR
GS
[0.99899 0 0 1.00215 32.46731 108.59232] CT
0.8 0.502 0.502 RC
N
f-1969333140
f
GR
GS
[0.99899 0 0 1.00215 106.10734 81.18976] CT
0.8 0.502 0.502 RC
N
f-1969333140
f
GR
GS
[0.99899 0 0 1.00215 93.37389 102.19] CT
0.8 0.502 0.502 RC
N
f-1969333140
f
GR
GS
[0.99899 0 0 1.00215 86.71385 100.59024] CT
0.8 0.502 0.502 RC
N
f-1969333140
f
GR
GS
[0.99899 0 0 1.00215 107.19008 94.90484] CT
0.8 0.502 0.502 RC
N
f-1969333140
f
GR
GS
[0.99899 0 0 1.00215 82.07816 93.63822] CT
0.8 0.502 0.502 RC
N
f-1969333140
f
GR
GS
[0.99899 0 0 1.00215 50.08561 116.18187] CT
0.8 0.502 0.502 RC
N
f-1969333140
f
GR
GS
[0.99899 0 0 1.00215 85.60724 75.61269] CT
0.8 0.502 0.502 RC
N
f-1969333140
f
GR
GS
[0.99899 0 0 1.00215 97.38638 91.27109] CT
0.8 0.502 0.502 RC
N
f-1969333140
f
GR
GS
[0.99899 0 0 1.00215 77.44319 98.25849] CT
0.8 0.502 0.502 RC
N
f-1969333140
f
GR
GS
[0.99899 0 0 1.00215 90.2617 83.25385] CT
0.8 0.502 0.502 RC
N
f-1969333140
f
GR
GS
[0.99899 0 0 1.00215 94.53117 89.94751] CT
0.8 0.502 0.502 RC
N
f-1969333140
f
GR
GS
[0.99899 0 0 1.00215 104.38637 102.53354] CT
0.8 0.502 0.502 RC
N
f-1969333140
f
GR
GS
[0.99899 0 0 1.00215 70.67442 105.55054] CT
0.8 0.502 0.502 RC
N
f-1969333140
f
GR
GS
[0.99899 0 0 1.00215 107.40015 126.31688] CT
0.8 0.502 0.502 RC
N
f-1969333140
f
GR
GS
[0.99899 0 0 1.00215 119.09046 100.40692] CT
0.8 0.502 0.502 RC
N
f-1969333140
f
GR
GS
[0.99899 0 0 1.00215 79.91215 102.46406] CT
0.8 0.502 0.502 RC
N
f-1969333140
f
GR
GS
[0.99899 0 0 1.00215 117.81548 104.96535] CT
0.8 0.502 0.502 RC
N
f-1969333140
f
GR
GS
[0.99899 0 0 1.00215 89.16739 109.79818] CT
0.8 0.502 0.502 RC
N
f-1969333140
f
GR
GS
[0.99899 0 0 1.00215 113.04488 101.96099] CT
0.8 0.502 0.502 RC
N
f-1969333140
f
GR
GS
[0.99899 0 0 1.00215 109.96939 85.11054] CT
0.8 0.502 0.502 RC
N
f-1969333140
f
GR
GS
[0.99899 0 0 1.00215 113.6021 79.85219] CT
0.8 0.502 0.502 RC
N
f-1969333140
f
GR
GS
[0.99899 0 0 1.00215 94.95485 99.19081] CT
0.8 0.502 0.502 RC
N
f-1969333140
f
GR
GS
[0.99899 0 0 1.00215 114.35531 93.67213] CT
0.8 0.502 0.502 RC
N
f-1969333140
f
GR
GS
[0.99899 0 0 1.00215 77.46686 92.4873] CT
0.8 0.502 0.502 RC
N
f-1969333140
f
GR
GS
[0.99899 0 0 1.00215 76.54121 111.73432] CT
0.8 0.502 0.502 RC
N
f-1969333140
f
GR
GS
[0.99899 0 0 1.00215 124.97602 83.52629] CT
0.8 0.502 0.502 RC
N
f-1969333140
f
GR
GS
[0.99899 0 0 1.00215 77.66816 112.91354] CT
0.8 0.502 0.502 RC
N
f-1969333140
f
GR
GS
[0.99899 0 0 1.00215 71.40584 103.94834] CT
0.8 0.502 0.502 RC
N
f-1969333140
f
GR
GS
[0.99899 0 0 1.00215 121.34592 102.25694] CT
0.8 0.502 0.502 RC
N
f-1969333140
f
GR
GS
[0.99899 0 0 1.00215 85.67219 109.52738] CT
0.8 0.502 0.502 RC
N
f-1969333140
f
GR
GS
[0.99899 0 0 1.00215 88.50968 121.75603] CT
0.8 0.502 0.502 RC
N
f-1969333140
f
GR
GS
[0.99899 0 0 1.00215 114.36083 107.37384] CT
0.8 0.502 0.502 RC
N
f-1969333140
f
GR
GS
[0.99899 0 0 1.00215 95.20056 96.185] CT
0.8 0.502 0.502 RC
N
f-1969333140
f
GR
GS
[0.99899 0 0 1.00215 95.59547 96.51872] CT
0.8 0.502 0.502 RC
N
f-1969333140
f
GR
GS
[0.99899 0 0 1.00215 70.09823 129.96065] CT
0.8 0.502 0.502 RC
N
f-1969333140
f
GR
GS
[0.99899 0 0 1.00215 65.60411 121.83969] CT
0.8 0.502 0.502 RC
N
f-1969333140
f
GR
GS
[0.99899 0 0 1.00215 61.84411 100.18537] CT
0.8 0.502 0.502 RC
N
f-1969333140
f
GR
GS
[0.99899 0 0 1.00215 127.32206 97.43109] CT
0.8 0.502 0.502 RC
N
f-1969333140
f
GR
GS
[0.99899 0 0 1.00215 98.51708 96.62728] CT
0.8 0.502 0.502 RC
N
f-1969333140
f
GR
GS
[0.99899 0 0 1.00215 96.23712 104.37434] CT
0.8 0.502 0.502 RC
N
f-1969333140
f
GR
GS
[0.99899 0 0 1.00215 68.7093 102.87229] CT
0.8 0.502 0.502 RC
N
f-1969333140
f
GR
GS
[0.99899 0 0 1.00215 88.66928 101.90886] CT
0.8 0.502 0.502 RC
N
f-1969333140
f
GR
GS
[0.99899 0 0 1.00215 81.24207 89.88719] CT
0.8 0.502 0.502 RC
N
f-1969333140
f
GR
GS
[0.99899 0 0 1.00215 139.05721 97.10918] CT
0.8 0.502 0.502 RC
N
f-1969333140
f
GR
GS
[0.99899 0 0 1.00215 80.44571 78.92705] CT
0.8 0.502 0.502 RC
N
f-1969333140
f
GR
GS
[0.99899 0 0 1.00215 114.22166 108.27804] CT
0.8 0.502 0.502 RC
N
f-1969333140
f
GR
GS
[0.99899 0 0 1.00215 104.83506 109.55883] CT
0.8 0.502 0.502 RC
N
f-1969333140
f
GR
%%Trailer
%%Pages: 1
%%EOF
