%!PS-Adobe-3.0 EPSF-3.0
%%Creator: (MATLAB, The Mathworks, Inc. Version 9.8.0.1323502 \(R2020a\). Operating System: Mac OS X)
%%Title: /Users/kosciessa/Desktop/mntTardisLNDG/LNDG/stateswitch/stsw_multimodal/figures/l1byage/l1comp_nondecision.eps
%%CreationDate: 2022-03-02T14:36:41
%%Pages: (atend)
%%BoundingBox:     4     0   180   275
%%LanguageLevel: 3
%%EndComments
%%BeginProlog
%%BeginResource: procset (Apache XML Graphics Std ProcSet) 1.2 0
%%Version: 1.2 0
%%Copyright: (Copyright 2001-2003,2010 The Apache Software Foundation. License terms: http://www.apache.org/licenses/LICENSE-2.0)
/bd{bind def}bind def
/ld{load def}bd
/GR/grestore ld
/GS/gsave ld
/RM/rmoveto ld
/C/curveto ld
/t/show ld
/L/lineto ld
/ML/setmiterlimit ld
/CT/concat ld
/f/fill ld
/N/newpath ld
/S/stroke ld
/CC/setcmykcolor ld
/A/ashow ld
/cp/closepath ld
/RC/setrgbcolor ld
/LJ/setlinejoin ld
/GC/setgray ld
/LW/setlinewidth ld
/M/moveto ld
/re {4 2 roll M
1 index 0 rlineto
0 exch rlineto
neg 0 rlineto
cp } bd
/_ctm matrix def
/_tm matrix def
/BT { _ctm currentmatrix pop matrix _tm copy pop 0 0 moveto } bd
/ET { _ctm setmatrix } bd
/iTm { _ctm setmatrix _tm concat } bd
/Tm { _tm astore pop iTm 0 0 moveto } bd
/ux 0.0 def
/uy 0.0 def
/F {
  /Tp exch def
  /Tf exch def
  Tf findfont Tp scalefont setfont
  /cf Tf def  /cs Tp def
} bd
/ULS {currentpoint /uy exch def /ux exch def} bd
/ULE {
  /Tcx currentpoint pop def
  gsave
  newpath
  cf findfont cs scalefont dup
  /FontMatrix get 0 get /Ts exch def /FontInfo get dup
  /UnderlinePosition get Ts mul /To exch def
  /UnderlineThickness get Ts mul /Tt exch def
  ux uy To add moveto  Tcx uy To add lineto
  Tt setlinewidth stroke
  grestore
} bd
/OLE {
  /Tcx currentpoint pop def
  gsave
  newpath
  cf findfont cs scalefont dup
  /FontMatrix get 0 get /Ts exch def /FontInfo get dup
  /UnderlinePosition get Ts mul /To exch def
  /UnderlineThickness get Ts mul /Tt exch def
  ux uy To add cs add moveto Tcx uy To add cs add lineto
  Tt setlinewidth stroke
  grestore
} bd
/SOE {
  /Tcx currentpoint pop def
  gsave
  newpath
  cf findfont cs scalefont dup
  /FontMatrix get 0 get /Ts exch def /FontInfo get dup
  /UnderlinePosition get Ts mul /To exch def
  /UnderlineThickness get Ts mul /Tt exch def
  ux uy To add cs 10 mul 26 idiv add moveto Tcx uy To add cs 10 mul 26 idiv add lineto
  Tt setlinewidth stroke
  grestore
} bd
/QT {
/Y22 exch store
/X22 exch store
/Y21 exch store
/X21 exch store
currentpoint
/Y21 load 2 mul add 3 div exch
/X21 load 2 mul add 3 div exch
/X21 load 2 mul /X22 load add 3 div
/Y21 load 2 mul /Y22 load add 3 div
/X22 load /Y22 load curveto
} bd
/SSPD {
dup length /d exch dict def
{
/v exch def
/k exch def
currentpagedevice k known {
/cpdv currentpagedevice k get def
v cpdv ne {
/upd false def
/nullv v type /nulltype eq def
/nullcpdv cpdv type /nulltype eq def
nullv nullcpdv or
{
/upd true def
} {
/sametype v type cpdv type eq def
sametype {
v type /arraytype eq {
/vlen v length def
/cpdvlen cpdv length def
vlen cpdvlen eq {
0 1 vlen 1 sub {
/i exch def
/obj v i get def
/cpdobj cpdv i get def
obj cpdobj ne {
/upd true def
exit
} if
} for
} {
/upd true def
} ifelse
} {
v type /dicttype eq {
v {
/dv exch def
/dk exch def
/cpddv cpdv dk get def
dv cpddv ne {
/upd true def
exit
} if
} forall
} {
/upd true def
} ifelse
} ifelse
} if
} ifelse
upd true eq {
d k v put
} if
} if
} if
} forall
d length 0 gt {
d setpagedevice
} if
} bd
/RE { % /NewFontName [NewEncodingArray] /FontName RE -
  findfont dup length dict begin
  {
    1 index /FID ne
    {def} {pop pop} ifelse
  } forall
  /Encoding exch def
  /FontName 1 index def
  currentdict definefont pop
  end
} bind def
%%EndResource
%%BeginResource: procset (Apache XML Graphics EPS ProcSet) 1.0 0
%%Version: 1.0 0
%%Copyright: (Copyright 2002-2003 The Apache Software Foundation. License terms: http://www.apache.org/licenses/LICENSE-2.0)
/BeginEPSF { %def
/b4_Inc_state save def         % Save state for cleanup
/dict_count countdictstack def % Count objects on dict stack
/op_count count 1 sub def      % Count objects on operand stack
userdict begin                 % Push userdict on dict stack
/showpage { } def              % Redefine showpage, { } = null proc
0 setgray 0 setlinecap         % Prepare graphics state
1 setlinewidth 0 setlinejoin
10 setmiterlimit [ ] 0 setdash newpath
/languagelevel where           % If level not equal to 1 then
{pop languagelevel             % set strokeadjust and
1 ne                           % overprint to their defaults.
{false setstrokeadjust false setoverprint
} if
} if
} bd
/EndEPSF { %def
count op_count sub {pop} repeat            % Clean up stacks
countdictstack dict_count sub {end} repeat
b4_Inc_state restore
} bd
%%EndResource
%FOPBeginFontDict
%%IncludeResource: font Courier-Oblique
%%IncludeResource: font Courier-BoldOblique
%%IncludeResource: font Courier-Bold
%%IncludeResource: font ZapfDingbats
%%IncludeResource: font Symbol
%%IncludeResource: font Helvetica
%%IncludeResource: font Helvetica-Oblique
%%IncludeResource: font Helvetica-Bold
%%IncludeResource: font Helvetica-BoldOblique
%%IncludeResource: font Times-Roman
%%IncludeResource: font Times-Italic
%%IncludeResource: font Times-Bold
%%IncludeResource: font Times-BoldItalic
%%IncludeResource: font Courier
%FOPEndFontDict
%%BeginResource: encoding WinAnsiEncoding
/WinAnsiEncoding [
/.notdef /.notdef /.notdef /.notdef /.notdef
/.notdef /.notdef /.notdef /.notdef /.notdef
/.notdef /.notdef /.notdef /.notdef /.notdef
/.notdef /.notdef /.notdef /.notdef /.notdef
/.notdef /.notdef /.notdef /.notdef /.notdef
/.notdef /.notdef /.notdef /.notdef /.notdef
/.notdef /.notdef /space /exclam /quotedbl
/numbersign /dollar /percent /ampersand /quotesingle
/parenleft /parenright /asterisk /plus /comma
/hyphen /period /slash /zero /one
/two /three /four /five /six
/seven /eight /nine /colon /semicolon
/less /equal /greater /question /at
/A /B /C /D /E
/F /G /H /I /J
/K /L /M /N /O
/P /Q /R /S /T
/U /V /W /X /Y
/Z /bracketleft /backslash /bracketright /asciicircum
/underscore /quoteleft /a /b /c
/d /e /f /g /h
/i /j /k /l /m
/n /o /p /q /r
/s /t /u /v /w
/x /y /z /braceleft /bar
/braceright /asciitilde /bullet /Euro /bullet
/quotesinglbase /florin /quotedblbase /ellipsis /dagger
/daggerdbl /circumflex /perthousand /Scaron /guilsinglleft
/OE /bullet /Zcaron /bullet /bullet
/quoteleft /quoteright /quotedblleft /quotedblright /bullet
/endash /emdash /asciitilde /trademark /scaron
/guilsinglright /oe /bullet /zcaron /Ydieresis
/space /exclamdown /cent /sterling /currency
/yen /brokenbar /section /dieresis /copyright
/ordfeminine /guillemotleft /logicalnot /sfthyphen /registered
/macron /degree /plusminus /twosuperior /threesuperior
/acute /mu /paragraph /middot /cedilla
/onesuperior /ordmasculine /guillemotright /onequarter /onehalf
/threequarters /questiondown /Agrave /Aacute /Acircumflex
/Atilde /Adieresis /Aring /AE /Ccedilla
/Egrave /Eacute /Ecircumflex /Edieresis /Igrave
/Iacute /Icircumflex /Idieresis /Eth /Ntilde
/Ograve /Oacute /Ocircumflex /Otilde /Odieresis
/multiply /Oslash /Ugrave /Uacute /Ucircumflex
/Udieresis /Yacute /Thorn /germandbls /agrave
/aacute /acircumflex /atilde /adieresis /aring
/ae /ccedilla /egrave /eacute /ecircumflex
/edieresis /igrave /iacute /icircumflex /idieresis
/eth /ntilde /ograve /oacute /ocircumflex
/otilde /odieresis /divide /oslash /ugrave
/uacute /ucircumflex /udieresis /yacute /thorn
/ydieresis
] def
%%EndResource
%FOPBeginFontReencode
/Courier-Oblique findfont
dup length dict begin
  {1 index /FID ne {def} {pop pop} ifelse} forall
  /Encoding WinAnsiEncoding def
  currentdict
end
/Courier-Oblique exch definefont pop
/Courier-BoldOblique findfont
dup length dict begin
  {1 index /FID ne {def} {pop pop} ifelse} forall
  /Encoding WinAnsiEncoding def
  currentdict
end
/Courier-BoldOblique exch definefont pop
/Courier-Bold findfont
dup length dict begin
  {1 index /FID ne {def} {pop pop} ifelse} forall
  /Encoding WinAnsiEncoding def
  currentdict
end
/Courier-Bold exch definefont pop
/Helvetica findfont
dup length dict begin
  {1 index /FID ne {def} {pop pop} ifelse} forall
  /Encoding WinAnsiEncoding def
  currentdict
end
/Helvetica exch definefont pop
/Helvetica-Oblique findfont
dup length dict begin
  {1 index /FID ne {def} {pop pop} ifelse} forall
  /Encoding WinAnsiEncoding def
  currentdict
end
/Helvetica-Oblique exch definefont pop
/Helvetica-Bold findfont
dup length dict begin
  {1 index /FID ne {def} {pop pop} ifelse} forall
  /Encoding WinAnsiEncoding def
  currentdict
end
/Helvetica-Bold exch definefont pop
/Helvetica-BoldOblique findfont
dup length dict begin
  {1 index /FID ne {def} {pop pop} ifelse} forall
  /Encoding WinAnsiEncoding def
  currentdict
end
/Helvetica-BoldOblique exch definefont pop
/Times-Roman findfont
dup length dict begin
  {1 index /FID ne {def} {pop pop} ifelse} forall
  /Encoding WinAnsiEncoding def
  currentdict
end
/Times-Roman exch definefont pop
/Times-Italic findfont
dup length dict begin
  {1 index /FID ne {def} {pop pop} ifelse} forall
  /Encoding WinAnsiEncoding def
  currentdict
end
/Times-Italic exch definefont pop
/Times-Bold findfont
dup length dict begin
  {1 index /FID ne {def} {pop pop} ifelse} forall
  /Encoding WinAnsiEncoding def
  currentdict
end
/Times-Bold exch definefont pop
/Times-BoldItalic findfont
dup length dict begin
  {1 index /FID ne {def} {pop pop} ifelse} forall
  /Encoding WinAnsiEncoding def
  currentdict
end
/Times-BoldItalic exch definefont pop
/Courier findfont
dup length dict begin
  {1 index /FID ne {def} {pop pop} ifelse} forall
  /Encoding WinAnsiEncoding def
  currentdict
end
/Courier exch definefont pop
%FOPEndFontReencode
%%EndProlog
%%Page: 1 1
%%PageBoundingBox: 0 0 198 283
%%BeginPageSetup
[1 0 0 -1 0 283] CT
%%EndPageSetup
GS
[1.00215 0 0 1 0 0] CT
1 GC
N
0 0 198 283 re
f
GR
GS
[1.00215 0 0 1 0 0] CT
1 GC
N
0 0 198 283 re
f
GR
GS
[1.00215 0 0 1 0 0] CT
1 GC
N
61 228 M
179 228 L
179 32 L
61 32 L
cp
f
GR
GS
[1.00215 0 0 1 0 0] CT
0.149 GC
2 setlinecap
1 LJ
0.5 LW
N
61 228 M
179 228 L
S
GR
GS
[1.00215 0 0 1 0 0] CT
0.149 GC
2 setlinecap
1 LJ
0.5 LW
N
96.4 228 M
96.4 226.04 L
S
GR
GS
[1.00215 0 0 1 0 0] CT
0.149 GC
2 setlinecap
1 LJ
0.5 LW
N
143.6 228 M
143.6 226.04 L
S
GR
GS
[1.00215 0 0 1 96.60702 234] CT
0.149 GC
/Helvetica 20 F
GS
[1 0 0 1 0 0] CT
-13 20 moveto 
1 -1 scale
(YA) t 
GR
GR
GS
[1.00215 0 0 1 143.90838 234] CT
0.149 GC
/Helvetica 20 F
GS
[1 0 0 1 0 0] CT
-14.5 20 moveto 
1 -1 scale
(OA) t 
GR
GR
GS
[1.00215 0 0 1 120.25775 259] CT
0.149 GC
/Helvetica 20 F
GS
[1 0 0 1 0 0] CT
-49 20 moveto 
1 -1 scale
(Age Group) t 
GR
GR
GS
[1.00215 0 0 1 0 0] CT
0.149 GC
2 setlinecap
1 LJ
0.5 LW
N
61 228 M
61 32 L
S
GR
GS
[1.00215 0 0 1 0 0] CT
0.149 GC
2 setlinecap
1 LJ
0.5 LW
N
61 228 M
62.96 228 L
S
GR
GS
[1.00215 0 0 1 0 0] CT
0.149 GC
2 setlinecap
1 LJ
0.5 LW
N
61 188.8 M
62.96 188.8 L
S
GR
GS
[1.00215 0 0 1 0 0] CT
0.149 GC
2 setlinecap
1 LJ
0.5 LW
N
61 149.6 M
62.96 149.6 L
S
GR
GS
[1.00215 0 0 1 0 0] CT
0.149 GC
2 setlinecap
1 LJ
0.5 LW
N
61 110.4 M
62.96 110.4 L
S
GR
GS
[1.00215 0 0 1 0 0] CT
0.149 GC
2 setlinecap
1 LJ
0.5 LW
N
61 71.2 M
62.96 71.2 L
S
GR
GS
[1.00215 0 0 1 55.11811 228] CT
0.149 GC
/Helvetica 20 F
GS
[1 0 0 1 0 0] CT
-12 7.5 moveto 
1 -1 scale
(0) t 
GR
GR
GS
[1.00215 0 0 1 55.11811 188.8] CT
0.149 GC
/Helvetica 20 F
GS
[1 0 0 1 0 0] CT
-28 7.5 moveto 
1 -1 scale
(0.1) t 
GR
GR
GS
[1.00215 0 0 1 55.11811 149.60001] CT
0.149 GC
/Helvetica 20 F
GS
[1 0 0 1 0 0] CT
-28 7.5 moveto 
1 -1 scale
(0.2) t 
GR
GR
GS
[1.00215 0 0 1 55.11811 110.39999] CT
0.149 GC
/Helvetica 20 F
GS
[1 0 0 1 0 0] CT
-28 7.5 moveto 
1 -1 scale
(0.3) t 
GR
GR
GS
[1.00215 0 0 1 55.11811 71.2] CT
0.149 GC
/Helvetica 20 F
GS
[1 0 0 1 0 0] CT
-28 7.5 moveto 
1 -1 scale
(0.4) t 
GR
GR
GS
[0 -1 1.00215 0 24.05154 129.99991] CT
0.149 GC
/Helvetica 20 F
GS
[1 0 0 1 0 0] CT
-65 -5 moveto 
1 -1 scale
(nondecision l1) t 
GR
GR
GS
[1.00215 0 0 1 120.25781 29.25001] CT
/Helvetica-Bold 22 F
GS
[1 0 0 1 0 0] CT
-58 -5 moveto 
1 -1 scale
(p = 1.3e-09) t 
GR
GR
GS
[1.00215 0 0 1 0 0] CT
0.149 GC
1 LJ
0.5 LW
N
61 228 M
179 228 L
S
GR
GS
[1.00215 0 0 1 0 0] CT
1 0.6 0.6 RC
N
115.28 228 M
115.28 125.26 L
77.52 125.26 L
77.52 228 L
cp
f
GR
GS
[1.00215 0 0 1 91.31359 128.67708] CT
0.302 GC
N
2.236 0 M
2.236 -1.235 1.235 -2.236 0 -2.236 C
-1.235 -2.236 -2.236 -1.235 -2.236 0 C
-2.236 1.235 -1.235 2.236 0 2.236 C
1.235 2.236 2.236 1.235 2.236 0 C
cp
f
GR
GS
[1.00215 0 0 1 102.64263 131.60306] CT
0.302 GC
N
/f-1586420743{2.236 0 M
2.236 -1.235 1.235 -2.236 0 -2.236 C
-1.235 -2.236 -2.236 -1.235 -2.236 0 C
-2.236 1.235 -1.235 2.236 0 2.236 C
1.235 2.236 2.236 1.235 2.236 0 C
cp}def
f-1586420743
f
GR
GS
[1.00215 0 0 1 95.26159 139.00386] CT
0.302 GC
N
f-1586420743
f
GR
GS
[1.00215 0 0 1 100.62257 138.65103] CT
0.302 GC
N
f-1586420743
f
GR
GS
[1.00215 0 0 1 91.1838 141.08949] CT
0.302 GC
N
f-1586420743
f
GR
GS
[1.00215 0 0 1 95.63454 119.26772] CT
0.302 GC
N
f-1586420743
f
GR
GS
[1.00215 0 0 1 90.5429 114.88199] CT
0.302 GC
N
f-1586420743
f
GR
GS
[1.00215 0 0 1 91.21973 120.42193] CT
0.302 GC
N
f-1586420743
f
GR
GS
[1.00215 0 0 1 89.27689 142.92702] CT
0.302 GC
N
f-1586420743
f
GR
GS
[1.00215 0 0 1 103.11327 127.67538] CT
0.302 GC
N
f-1586420743
f
GR
GS
[1.00215 0 0 1 88.62211 121.28162] CT
0.302 GC
N
f-1586420743
f
GR
GS
[1.00215 0 0 1 97.83868 136.42284] CT
0.302 GC
N
f-1586420743
f
GR
GS
[1.00215 0 0 1 97.13911 132.70166] CT
0.302 GC
N
f-1586420743
f
GR
GS
[1.00215 0 0 1 87.22578 125.49362] CT
0.302 GC
N
f-1586420743
f
GR
GS
[1.00215 0 0 1 103.24809 96.20007] CT
0.302 GC
N
f-1586420743
f
GR
GS
[1.00215 0 0 1 89.31758 88.16459] CT
0.302 GC
N
f-1586420743
f
GR
GS
[1.00215 0 0 1 100.29441 120.44807] CT
0.302 GC
N
f-1586420743
f
GR
GS
[1.00215 0 0 1 95.99962 126.86753] CT
0.302 GC
N
f-1586420743
f
GR
GS
[1.00215 0 0 1 88.17437 104.16504] CT
0.302 GC
N
f-1586420743
f
GR
GS
[1.00215 0 0 1 88.21326 130.83763] CT
0.302 GC
N
f-1586420743
f
GR
GS
[1.00215 0 0 1 95.21 131.84456] CT
0.302 GC
N
f-1586420743
f
GR
GS
[1.00215 0 0 1 102.7818 126.35967] CT
0.302 GC
N
f-1586420743
f
GR
GS
[1.00215 0 0 1 98.64151 112.47121] CT
0.302 GC
N
f-1586420743
f
GR
GS
[1.00215 0 0 1 93.27137 134.1402] CT
0.302 GC
N
f-1586420743
f
GR
GS
[1.00215 0 0 1 101.98477 126.05862] CT
0.302 GC
N
f-1586420743
f
GR
GS
[1.00215 0 0 1 98.95456 124.34001] CT
0.302 GC
N
f-1586420743
f
GR
GS
[1.00215 0 0 1 96.45479 121.2425] CT
0.302 GC
N
f-1586420743
f
GR
GS
[1.00215 0 0 1 96.35107 126.0634] CT
0.302 GC
N
f-1586420743
f
GR
GS
[1.00215 0 0 1 102.62016 127.79865] CT
0.302 GC
N
f-1586420743
f
GR
GS
[1.00215 0 0 1 91.47913 91.2382] CT
0.302 GC
N
f-1586420743
f
GR
GS
[1.00215 0 0 1 100.83613 132.40431] CT
0.302 GC
N
f-1586420743
f
GR
GS
[1.00215 0 0 1 87.24035 132.86969] CT
0.302 GC
N
f-1586420743
f
GR
GS
[1.00215 0 0 1 103.1121 136.19722] CT
0.302 GC
N
f-1586420743
f
GR
GS
[1.00215 0 0 1 91.62342 128.32312] CT
0.302 GC
N
f-1586420743
f
GR
GS
[1.00215 0 0 1 90.92389 119.37124] CT
0.302 GC
N
f-1586420743
f
GR
GS
[1.00215 0 0 1 102.47947 123.17537] CT
0.302 GC
N
f-1586420743
f
GR
GS
[1.00215 0 0 1 96.06706 137.24141] CT
0.302 GC
N
f-1586420743
f
GR
GS
[1.00215 0 0 1 105.90422 136.64648] CT
0.302 GC
N
f-1586420743
f
GR
GS
[1.00215 0 0 1 98.6105 137.79301] CT
0.302 GC
N
f-1586420743
f
GR
GS
[1.00215 0 0 1 96.20351 131.07567] CT
0.302 GC
N
f-1586420743
f
GR
GS
[1.00215 0 0 1 94.08082 119.06656] CT
0.302 GC
N
f-1586420743
f
GR
GS
[1.00215 0 0 1 98.01464 118.43299] CT
0.302 GC
N
f-1586420743
f
GR
GS
[1.00215 0 0 1 0 0] CT
1 0.6 0.6 RC
N
/f265366766{162.48 228 M
162.48 102.958 L
124.72 102.958 L
124.72 228 L
cp}def
f265366766
f
GR
GS
[1.00215 0 0 1 150.71469 117.36215] CT
0.302 GC
N
f-1586420743
f
GR
GS
[1.00215 0 0 1 136.77703 119.20022] CT
0.302 GC
N
f-1586420743
f
GR
GS
[1.00215 0 0 1 146.67903 106.36063] CT
0.302 GC
N
f-1586420743
f
GR
GS
[1.00215 0 0 1 144.88125 99.95049] CT
0.302 GC
N
f-1586420743
f
GR
GS
[1.00215 0 0 1 149.5706 106.53815] CT
0.302 GC
N
f-1586420743
f
GR
GS
[1.00215 0 0 1 136.7914 132.46423] CT
0.302 GC
N
f-1586420743
f
GR
GS
[1.00215 0 0 1 143.9642 45.36934] CT
0.302 GC
N
f-1586420743
f
GR
GS
[1.00215 0 0 1 144.57829 74.72214] CT
0.302 GC
N
f-1586420743
f
GR
GS
[1.00215 0 0 1 137.70858 102.68291] CT
0.302 GC
N
f-1586420743
f
GR
GS
[1.00215 0 0 1 138.53391 87.95081] CT
0.302 GC
N
f-1586420743
f
GR
GS
[1.00215 0 0 1 145.79873 105.27975] CT
0.302 GC
N
f-1586420743
f
GR
GS
[1.00215 0 0 1 136.73623 90.35986] CT
0.302 GC
N
f-1586420743
f
GR
GS
[1.00215 0 0 1 148.3849 117.79844] CT
0.302 GC
N
f-1586420743
f
GR
GS
[1.00215 0 0 1 145.07632 98.69279] CT
0.302 GC
N
f-1586420743
f
GR
GS
[1.00215 0 0 1 136.30113 92.37623] CT
0.302 GC
N
f-1586420743
f
GR
GS
[1.00215 0 0 1 148.78118 72.98631] CT
0.302 GC
N
f-1586420743
f
GR
GS
[1.00215 0 0 1 147.3959 98.82215] CT
0.302 GC
N
f-1586420743
f
GR
GS
[1.00215 0 0 1 135.34861 85.23796] CT
0.302 GC
N
f-1586420743
f
GR
GS
[1.00215 0 0 1 150.31732 129.42397] CT
0.302 GC
N
f-1586420743
f
GR
GS
[1.00215 0 0 1 150.95695 102.98347] CT
0.302 GC
N
f-1586420743
f
GR
GS
[1.00215 0 0 1 152.73788 85.50759] CT
0.302 GC
N
f-1586420743
f
GR
GS
[1.00215 0 0 1 147.07467 108.26304] CT
0.302 GC
N
f-1586420743
f
GR
GS
[1.00215 0 0 1 137.10023 103.03982] CT
0.302 GC
N
f-1586420743
f
GR
GS
[1.00215 0 0 1 149.94977 76.57394] CT
0.302 GC
N
f-1586420743
f
GR
GS
[1.00215 0 0 1 149.63412 97.46078] CT
0.302 GC
N
f-1586420743
f
GR
GS
[1.00215 0 0 1 149.81311 127.97038] CT
0.302 GC
N
f-1586420743
f
GR
GS
[1.00215 0 0 1 135.04447 123.79366] CT
0.302 GC
N
f-1586420743
f
GR
GS
[1.00215 0 0 1 137.09659 83.68237] CT
0.302 GC
N
f-1586420743
f
GR
GS
[1.00215 0 0 1 142.72222 96.29472] CT
0.302 GC
N
f-1586420743
f
GR
GS
[1.00215 0 0 1 141.04756 93.64222] CT
0.302 GC
N
f-1586420743
f
GR
GS
[1.00215 0 0 1 144.30327 108.99542] CT
0.302 GC
N
f-1586420743
f
GR
GS
[1.00215 0 0 1 152.48988 117.56935] CT
0.302 GC
N
f-1586420743
f
GR
GS
[1.00215 0 0 1 139.80662 113.26207] CT
0.302 GC
N
f-1586420743
f
GR
GS
[1.00215 0 0 1 141.46966 106.00647] CT
0.302 GC
N
f-1586420743
f
GR
GS
[1.00215 0 0 1 139.9667 121.20709] CT
0.302 GC
N
f-1586420743
f
GR
GS
[1.00215 0 0 1 136.53262 93.05856] CT
0.302 GC
N
f-1586420743
f
GR
GS
[1.00215 0 0 1 151.76219 114.15948] CT
0.302 GC
N
f-1586420743
f
GR
GS
[1.00215 0 0 1 147.34428 122.54629] CT
0.302 GC
N
f-1586420743
f
GR
GS
[1.00215 0 0 1 140.63273 121.55132] CT
0.302 GC
N
f-1586420743
f
GR
GS
[1.00215 0 0 1 151.37169 118.61049] CT
0.302 GC
N
f-1586420743
f
GR
GS
[1.00215 0 0 1 140.30777 94.34506] CT
0.302 GC
N
f-1586420743
f
GR
GS
[1.00215 0 0 1 144.40311 96.79225] CT
0.302 GC
N
f-1586420743
f
GR
GS
[1.00215 0 0 1 143.43441 116.80046] CT
0.302 GC
N
f-1586420743
f
GR
GS
[1.00215 0 0 1 140.90628 60.07888] CT
0.302 GC
N
f-1586420743
f
GR
GS
[1.00215 0 0 1 134.95077 121.55238] CT
0.302 GC
N
f-1586420743
f
GR
GS
[1.00215 0 0 1 143.42078 81.82742] CT
0.302 GC
N
f-1586420743
f
GR
GS
[1.00215 0 0 1 140.49239 126.66891] CT
0.302 GC
N
f-1586420743
f
GR
GS
[1.00215 0 0 1 143.44493 90.78365] CT
0.302 GC
N
f-1586420743
f
GR
GS
[1.00215 0 0 1 151.83025 112.58347] CT
0.302 GC
N
f-1586420743
f
GR
GS
[1.00215 0 0 1 152.4545 87.16102] CT
0.302 GC
N
f-1586420743
f
GR
GS
[1.00215 0 0 1 135.95878 129.31372] CT
0.302 GC
N
f-1586420743
f
GR
GS
[1.00215 0 0 1 151.1643 105.90781] CT
0.302 GC
N
f-1586420743
f
GR
GS
[1.00215 0 0 1 149.81952 113.18919] CT
0.302 GC
N
f-1586420743
f
GR
%%Trailer
%%Pages: 1
%%EOF
