%!PS-Adobe-3.0 EPSF-3.0
%%Creator: (MATLAB, The Mathworks, Inc. Version 9.8.0.1323502 \(R2020a\). Operating System: Mac OS X)
%%Title: /Users/kosciessa/Desktop/mntTardisLNDG/LNDG/stateswitch/stsw_multimodal/figures/linearbyage/linearcomp_spmlv1.eps
%%CreationDate: 2022-03-03T16:32:30
%%Pages: (atend)
%%BoundingBox:     4     0   187   275
%%LanguageLevel: 3
%%EndComments
%%BeginProlog
%%BeginResource: procset (Apache XML Graphics Std ProcSet) 1.2 0
%%Version: 1.2 0
%%Copyright: (Copyright 2001-2003,2010 The Apache Software Foundation. License terms: http://www.apache.org/licenses/LICENSE-2.0)
/bd{bind def}bind def
/ld{load def}bd
/GR/grestore ld
/GS/gsave ld
/RM/rmoveto ld
/C/curveto ld
/t/show ld
/L/lineto ld
/ML/setmiterlimit ld
/CT/concat ld
/f/fill ld
/N/newpath ld
/S/stroke ld
/CC/setcmykcolor ld
/A/ashow ld
/cp/closepath ld
/RC/setrgbcolor ld
/LJ/setlinejoin ld
/GC/setgray ld
/LW/setlinewidth ld
/M/moveto ld
/re {4 2 roll M
1 index 0 rlineto
0 exch rlineto
neg 0 rlineto
cp } bd
/_ctm matrix def
/_tm matrix def
/BT { _ctm currentmatrix pop matrix _tm copy pop 0 0 moveto } bd
/ET { _ctm setmatrix } bd
/iTm { _ctm setmatrix _tm concat } bd
/Tm { _tm astore pop iTm 0 0 moveto } bd
/ux 0.0 def
/uy 0.0 def
/F {
  /Tp exch def
  /Tf exch def
  Tf findfont Tp scalefont setfont
  /cf Tf def  /cs Tp def
} bd
/ULS {currentpoint /uy exch def /ux exch def} bd
/ULE {
  /Tcx currentpoint pop def
  gsave
  newpath
  cf findfont cs scalefont dup
  /FontMatrix get 0 get /Ts exch def /FontInfo get dup
  /UnderlinePosition get Ts mul /To exch def
  /UnderlineThickness get Ts mul /Tt exch def
  ux uy To add moveto  Tcx uy To add lineto
  Tt setlinewidth stroke
  grestore
} bd
/OLE {
  /Tcx currentpoint pop def
  gsave
  newpath
  cf findfont cs scalefont dup
  /FontMatrix get 0 get /Ts exch def /FontInfo get dup
  /UnderlinePosition get Ts mul /To exch def
  /UnderlineThickness get Ts mul /Tt exch def
  ux uy To add cs add moveto Tcx uy To add cs add lineto
  Tt setlinewidth stroke
  grestore
} bd
/SOE {
  /Tcx currentpoint pop def
  gsave
  newpath
  cf findfont cs scalefont dup
  /FontMatrix get 0 get /Ts exch def /FontInfo get dup
  /UnderlinePosition get Ts mul /To exch def
  /UnderlineThickness get Ts mul /Tt exch def
  ux uy To add cs 10 mul 26 idiv add moveto Tcx uy To add cs 10 mul 26 idiv add lineto
  Tt setlinewidth stroke
  grestore
} bd
/QT {
/Y22 exch store
/X22 exch store
/Y21 exch store
/X21 exch store
currentpoint
/Y21 load 2 mul add 3 div exch
/X21 load 2 mul add 3 div exch
/X21 load 2 mul /X22 load add 3 div
/Y21 load 2 mul /Y22 load add 3 div
/X22 load /Y22 load curveto
} bd
/SSPD {
dup length /d exch dict def
{
/v exch def
/k exch def
currentpagedevice k known {
/cpdv currentpagedevice k get def
v cpdv ne {
/upd false def
/nullv v type /nulltype eq def
/nullcpdv cpdv type /nulltype eq def
nullv nullcpdv or
{
/upd true def
} {
/sametype v type cpdv type eq def
sametype {
v type /arraytype eq {
/vlen v length def
/cpdvlen cpdv length def
vlen cpdvlen eq {
0 1 vlen 1 sub {
/i exch def
/obj v i get def
/cpdobj cpdv i get def
obj cpdobj ne {
/upd true def
exit
} if
} for
} {
/upd true def
} ifelse
} {
v type /dicttype eq {
v {
/dv exch def
/dk exch def
/cpddv cpdv dk get def
dv cpddv ne {
/upd true def
exit
} if
} forall
} {
/upd true def
} ifelse
} ifelse
} if
} ifelse
upd true eq {
d k v put
} if
} if
} if
} forall
d length 0 gt {
d setpagedevice
} if
} bd
/RE { % /NewFontName [NewEncodingArray] /FontName RE -
  findfont dup length dict begin
  {
    1 index /FID ne
    {def} {pop pop} ifelse
  } forall
  /Encoding exch def
  /FontName 1 index def
  currentdict definefont pop
  end
} bind def
%%EndResource
%%BeginResource: procset (Apache XML Graphics EPS ProcSet) 1.0 0
%%Version: 1.0 0
%%Copyright: (Copyright 2002-2003 The Apache Software Foundation. License terms: http://www.apache.org/licenses/LICENSE-2.0)
/BeginEPSF { %def
/b4_Inc_state save def         % Save state for cleanup
/dict_count countdictstack def % Count objects on dict stack
/op_count count 1 sub def      % Count objects on operand stack
userdict begin                 % Push userdict on dict stack
/showpage { } def              % Redefine showpage, { } = null proc
0 setgray 0 setlinecap         % Prepare graphics state
1 setlinewidth 0 setlinejoin
10 setmiterlimit [ ] 0 setdash newpath
/languagelevel where           % If level not equal to 1 then
{pop languagelevel             % set strokeadjust and
1 ne                           % overprint to their defaults.
{false setstrokeadjust false setoverprint
} if
} if
} bd
/EndEPSF { %def
count op_count sub {pop} repeat            % Clean up stacks
countdictstack dict_count sub {end} repeat
b4_Inc_state restore
} bd
%%EndResource
%FOPBeginFontDict
%%IncludeResource: font Courier-Oblique
%%IncludeResource: font Courier-BoldOblique
%%IncludeResource: font Courier-Bold
%%IncludeResource: font ZapfDingbats
%%IncludeResource: font Symbol
%%IncludeResource: font Helvetica
%%IncludeResource: font Helvetica-Oblique
%%IncludeResource: font Helvetica-Bold
%%IncludeResource: font Helvetica-BoldOblique
%%IncludeResource: font Times-Roman
%%IncludeResource: font Times-Italic
%%IncludeResource: font Times-Bold
%%IncludeResource: font Times-BoldItalic
%%IncludeResource: font Courier
%FOPEndFontDict
%%BeginResource: encoding WinAnsiEncoding
/WinAnsiEncoding [
/.notdef /.notdef /.notdef /.notdef /.notdef
/.notdef /.notdef /.notdef /.notdef /.notdef
/.notdef /.notdef /.notdef /.notdef /.notdef
/.notdef /.notdef /.notdef /.notdef /.notdef
/.notdef /.notdef /.notdef /.notdef /.notdef
/.notdef /.notdef /.notdef /.notdef /.notdef
/.notdef /.notdef /space /exclam /quotedbl
/numbersign /dollar /percent /ampersand /quotesingle
/parenleft /parenright /asterisk /plus /comma
/hyphen /period /slash /zero /one
/two /three /four /five /six
/seven /eight /nine /colon /semicolon
/less /equal /greater /question /at
/A /B /C /D /E
/F /G /H /I /J
/K /L /M /N /O
/P /Q /R /S /T
/U /V /W /X /Y
/Z /bracketleft /backslash /bracketright /asciicircum
/underscore /quoteleft /a /b /c
/d /e /f /g /h
/i /j /k /l /m
/n /o /p /q /r
/s /t /u /v /w
/x /y /z /braceleft /bar
/braceright /asciitilde /bullet /Euro /bullet
/quotesinglbase /florin /quotedblbase /ellipsis /dagger
/daggerdbl /circumflex /perthousand /Scaron /guilsinglleft
/OE /bullet /Zcaron /bullet /bullet
/quoteleft /quoteright /quotedblleft /quotedblright /bullet
/endash /emdash /asciitilde /trademark /scaron
/guilsinglright /oe /bullet /zcaron /Ydieresis
/space /exclamdown /cent /sterling /currency
/yen /brokenbar /section /dieresis /copyright
/ordfeminine /guillemotleft /logicalnot /sfthyphen /registered
/macron /degree /plusminus /twosuperior /threesuperior
/acute /mu /paragraph /middot /cedilla
/onesuperior /ordmasculine /guillemotright /onequarter /onehalf
/threequarters /questiondown /Agrave /Aacute /Acircumflex
/Atilde /Adieresis /Aring /AE /Ccedilla
/Egrave /Eacute /Ecircumflex /Edieresis /Igrave
/Iacute /Icircumflex /Idieresis /Eth /Ntilde
/Ograve /Oacute /Ocircumflex /Otilde /Odieresis
/multiply /Oslash /Ugrave /Uacute /Ucircumflex
/Udieresis /Yacute /Thorn /germandbls /agrave
/aacute /acircumflex /atilde /adieresis /aring
/ae /ccedilla /egrave /eacute /ecircumflex
/edieresis /igrave /iacute /icircumflex /idieresis
/eth /ntilde /ograve /oacute /ocircumflex
/otilde /odieresis /divide /oslash /ugrave
/uacute /ucircumflex /udieresis /yacute /thorn
/ydieresis
] def
%%EndResource
%FOPBeginFontReencode
/Courier-Oblique findfont
dup length dict begin
  {1 index /FID ne {def} {pop pop} ifelse} forall
  /Encoding WinAnsiEncoding def
  currentdict
end
/Courier-Oblique exch definefont pop
/Courier-BoldOblique findfont
dup length dict begin
  {1 index /FID ne {def} {pop pop} ifelse} forall
  /Encoding WinAnsiEncoding def
  currentdict
end
/Courier-BoldOblique exch definefont pop
/Courier-Bold findfont
dup length dict begin
  {1 index /FID ne {def} {pop pop} ifelse} forall
  /Encoding WinAnsiEncoding def
  currentdict
end
/Courier-Bold exch definefont pop
/Helvetica findfont
dup length dict begin
  {1 index /FID ne {def} {pop pop} ifelse} forall
  /Encoding WinAnsiEncoding def
  currentdict
end
/Helvetica exch definefont pop
/Helvetica-Oblique findfont
dup length dict begin
  {1 index /FID ne {def} {pop pop} ifelse} forall
  /Encoding WinAnsiEncoding def
  currentdict
end
/Helvetica-Oblique exch definefont pop
/Helvetica-Bold findfont
dup length dict begin
  {1 index /FID ne {def} {pop pop} ifelse} forall
  /Encoding WinAnsiEncoding def
  currentdict
end
/Helvetica-Bold exch definefont pop
/Helvetica-BoldOblique findfont
dup length dict begin
  {1 index /FID ne {def} {pop pop} ifelse} forall
  /Encoding WinAnsiEncoding def
  currentdict
end
/Helvetica-BoldOblique exch definefont pop
/Times-Roman findfont
dup length dict begin
  {1 index /FID ne {def} {pop pop} ifelse} forall
  /Encoding WinAnsiEncoding def
  currentdict
end
/Times-Roman exch definefont pop
/Times-Italic findfont
dup length dict begin
  {1 index /FID ne {def} {pop pop} ifelse} forall
  /Encoding WinAnsiEncoding def
  currentdict
end
/Times-Italic exch definefont pop
/Times-Bold findfont
dup length dict begin
  {1 index /FID ne {def} {pop pop} ifelse} forall
  /Encoding WinAnsiEncoding def
  currentdict
end
/Times-Bold exch definefont pop
/Times-BoldItalic findfont
dup length dict begin
  {1 index /FID ne {def} {pop pop} ifelse} forall
  /Encoding WinAnsiEncoding def
  currentdict
end
/Times-BoldItalic exch definefont pop
/Courier findfont
dup length dict begin
  {1 index /FID ne {def} {pop pop} ifelse} forall
  /Encoding WinAnsiEncoding def
  currentdict
end
/Courier exch definefont pop
%FOPEndFontReencode
%%EndProlog
%%Page: 1 1
%%PageBoundingBox: 0 0 198 283
%%BeginPageSetup
[1 0 0 -1 0 283] CT
%%EndPageSetup
GS
[1.00215 0 0 1 0 0] CT
1 GC
N
0 0 198 283 re
f
GR
GS
[1.00215 0 0 1 0 0] CT
1 GC
N
0 0 198 283 re
f
GR
GS
[1.00215 0 0 1 0 0] CT
1 GC
N
89 228 M
179 228 L
179 32 L
89 32 L
cp
f
GR
GS
[1.00215 0 0 1 0 0] CT
0.149 GC
2 setlinecap
1 LJ
0.5 LW
N
89 228 M
179 228 L
S
GR
GS
[1.00215 0 0 1 0 0] CT
0.149 GC
2 setlinecap
1 LJ
0.5 LW
N
116 228 M
116 226.04 L
S
GR
GS
[1.00215 0 0 1 0 0] CT
0.149 GC
2 setlinecap
1 LJ
0.5 LW
N
152 228 M
152 226.04 L
S
GR
GS
[1.00215 0 0 1 116.24911 234] CT
0.149 GC
/Helvetica 20 F
GS
[1 0 0 1 0 0] CT
-13 20 moveto 
1 -1 scale
(YA) t 
GR
GR
GS
[1.00215 0 0 1 152.32642 234] CT
0.149 GC
/Helvetica 20 F
GS
[1 0 0 1 0 0] CT
-14.5 20 moveto 
1 -1 scale
(OA) t 
GR
GR
GS
[1.00215 0 0 1 134.28781 259] CT
0.149 GC
/Helvetica 20 F
GS
[1 0 0 1 0 0] CT
-49 20 moveto 
1 -1 scale
(Age Group) t 
GR
GR
GS
[1.00215 0 0 1 0 0] CT
0.149 GC
2 setlinecap
1 LJ
0.5 LW
N
89 228 M
89 32 L
S
GR
GS
[1.00215 0 0 1 0 0] CT
0.149 GC
2 setlinecap
1 LJ
0.5 LW
N
89 222.612 M
90.96 222.612 L
S
GR
GS
[1.00215 0 0 1 0 0] CT
0.149 GC
2 setlinecap
1 LJ
0.5 LW
N
89 160.551 M
90.96 160.551 L
S
GR
GS
[1.00215 0 0 1 0 0] CT
0.149 GC
2 setlinecap
1 LJ
0.5 LW
N
89 98.491 M
90.96 98.491 L
S
GR
GS
[1.00215 0 0 1 0 0] CT
0.149 GC
2 setlinecap
1 LJ
0.5 LW
N
89 36.431 M
90.96 36.431 L
S
GR
GS
[1.00215 0 0 1 83.17824 222.61157] CT
0.149 GC
/Helvetica 20 F
GS
[1 0 0 1 0 0] CT
-12 7.5 moveto 
1 -1 scale
(0) t 
GR
GR
GS
[1.00215 0 0 1 83.17824 160.55124] CT
0.149 GC
/Helvetica 20 F
GS
[1 0 0 1 0 0] CT
-45 7.5 moveto 
1 -1 scale
(5000) t 
GR
GR
GS
[1.00215 0 0 1 83.17824 98.49089] CT
0.149 GC
/Helvetica 20 F
GS
[1 0 0 1 0 0] CT
-56 7.5 moveto 
1 -1 scale
(10000) t 
GR
GR
GS
[1.00215 0 0 1 83.17824 36.43055] CT
0.149 GC
/Helvetica 20 F
GS
[1 0 0 1 0 0] CT
-56 7.5 moveto 
1 -1 scale
(15000) t 
GR
GR
GS
[0 -1 1.00215 0 24.05154 129.99991] CT
0.149 GC
/Helvetica 20 F
GS
[1 0 0 1 0 0] CT
-59.5 -5 moveto 
1 -1 scale
(spmlv1 linear) t 
GR
GR
GS
[1.00215 0 0 1 134.28788 29.25] CT
/Helvetica-Bold 22 F
GS
[1 0 0 1 0 0] CT
-58 -5 moveto 
1 -1 scale
(p = 2.4e-05) t 
GR
GR
GS
[1.00215 0 0 1 0 0] CT
0.149 GC
1 LJ
0.5 LW
N
89 222.612 M
179 222.612 L
S
GR
GS
[1.00215 0 0 1 0 0] CT
1 0.6 0.6 RC
N
130.4 222.612 M
130.4 130.651 L
101.6 130.651 L
101.6 222.612 L
cp
f
GR
GS
[1.00215 0 0 1 112.13865 179.55081] CT
0.302 GC
N
2.236 0 M
2.236 -1.235 1.235 -2.236 0 -2.236 C
-1.235 -2.236 -2.236 -1.235 -2.236 0 C
-2.236 1.235 -1.235 2.236 0 2.236 C
1.235 2.236 2.236 1.235 2.236 0 C
cp
f
GR
GS
[1.00215 0 0 1 110.90624 168.98766] CT
0.302 GC
N
/f-1586420743{2.236 0 M
2.236 -1.235 1.235 -2.236 0 -2.236 C
-1.235 -2.236 -2.236 -1.235 -2.236 0 C
-2.236 1.235 -1.235 2.236 0 2.236 C
1.235 2.236 2.236 1.235 2.236 0 C
cp}def
f-1586420743
f
GR
GS
[1.00215 0 0 1 121.09899 127.21755] CT
0.302 GC
N
f-1586420743
f
GR
GS
[1.00215 0 0 1 109.454 137.97559] CT
0.302 GC
N
f-1586420743
f
GR
GS
[1.00215 0 0 1 123.10434 139.3766] CT
0.302 GC
N
f-1586420743
f
GR
GS
[1.00215 0 0 1 111.65265 109.42632] CT
0.302 GC
N
f-1586420743
f
GR
GS
[1.00215 0 0 1 116.53805 61.63253] CT
0.302 GC
N
f-1586420743
f
GR
GS
[1.00215 0 0 1 110.67324 104.19059] CT
0.302 GC
N
f-1586420743
f
GR
GS
[1.00215 0 0 1 110.22125 213.27158] CT
0.302 GC
N
f-1586420743
f
GR
GS
[1.00215 0 0 1 119.30448 90.28062] CT
0.302 GC
N
f-1586420743
f
GR
GS
[1.00215 0 0 1 115.86181 152.98547] CT
0.302 GC
N
f-1586420743
f
GR
GS
[1.00215 0 0 1 110.03932 100.48405] CT
0.302 GC
N
f-1586420743
f
GR
GS
[1.00215 0 0 1 115.11962 167.0146] CT
0.302 GC
N
f-1586420743
f
GR
GS
[1.00215 0 0 1 121.39156 119.02899] CT
0.302 GC
N
f-1586420743
f
GR
GS
[1.00215 0 0 1 112.90257 169.29594] CT
0.302 GC
N
f-1586420743
f
GR
GS
[1.00215 0 0 1 121.3036 195.82698] CT
0.302 GC
N
f-1586420743
f
GR
GS
[1.00215 0 0 1 115.39499 131.94061] CT
0.302 GC
N
f-1586420743
f
GR
GS
[1.00215 0 0 1 117.73921 161.57782] CT
0.302 GC
N
f-1586420743
f
GR
GS
[1.00215 0 0 1 121.39283 163.10008] CT
0.302 GC
N
f-1586420743
f
GR
GS
[1.00215 0 0 1 109.71847 122.53539] CT
0.302 GC
N
f-1586420743
f
GR
GS
[1.00215 0 0 1 115.46824 145.34546] CT
0.302 GC
N
f-1586420743
f
GR
GS
[1.00215 0 0 1 116.1639 209.97121] CT
0.302 GC
N
f-1586420743
f
GR
GS
[1.00215 0 0 1 120.3517 162.82875] CT
0.302 GC
N
f-1586420743
f
GR
GS
[1.00215 0 0 1 110.0303 132.19908] CT
0.302 GC
N
f-1586420743
f
GR
GS
[1.00215 0 0 1 109.42873 102.46391] CT
0.302 GC
N
f-1586420743
f
GR
GS
[1.00215 0 0 1 109.24766 165.97159] CT
0.302 GC
N
f-1586420743
f
GR
GS
[1.00215 0 0 1 113.47832 170.08246] CT
0.302 GC
N
f-1586420743
f
GR
GS
[1.00215 0 0 1 120.94 107.61426] CT
0.302 GC
N
f-1586420743
f
GR
GS
[1.00215 0 0 1 122.514 148.78079] CT
0.302 GC
N
f-1586420743
f
GR
GS
[1.00215 0 0 1 109.13108 138.56952] CT
0.302 GC
N
f-1586420743
f
GR
GS
[1.00215 0 0 1 116.06843 94.01833] CT
0.302 GC
N
f-1586420743
f
GR
GS
[1.00215 0 0 1 116.05087 82.03833] CT
0.302 GC
N
f-1586420743
f
GR
GS
[1.00215 0 0 1 109.62909 32] CT
0.302 GC
N
f-1586420743
f
GR
GS
[1.00215 0 0 1 110.58778 85.65398] CT
0.302 GC
N
f-1586420743
f
GR
GS
[1.00215 0 0 1 113.42869 184.26843] CT
0.302 GC
N
f-1586420743
f
GR
GS
[1.00215 0 0 1 119.71997 60.47587] CT
0.302 GC
N
f-1586420743
f
GR
GS
[1.00215 0 0 1 111.45376 54.03122] CT
0.302 GC
N
f-1586420743
f
GR
GS
[1.00215 0 0 1 116.08339 102.55721] CT
0.302 GC
N
f-1586420743
f
GR
GS
[1.00215 0 0 1 114.2633 120.79142] CT
0.302 GC
N
f-1586420743
f
GR
GS
[1.00215 0 0 1 113.78058 145.81213] CT
0.302 GC
N
f-1586420743
f
GR
GS
[1.00215 0 0 1 123.32093 133.26765] CT
0.302 GC
N
f-1586420743
f
GR
GS
[1.00215 0 0 1 117.56612 92.91127] CT
0.302 GC
N
f-1586420743
f
GR
GS
[1.00215 0 0 1 0 0] CT
1 0.6 0.6 RC
N
/f-1102412418{166.4 222.612 M
166.4 166.254 L
137.6 166.254 L
137.6 222.612 L
cp}def
f-1102412418
f
GR
GS
[1.00215 0 0 1 145.70507 168.00554] CT
0.302 GC
N
f-1586420743
f
GR
GS
[1.00215 0 0 1 157.7816 185.23254] CT
0.302 GC
N
f-1586420743
f
GR
GS
[1.00215 0 0 1 159.48906 162.04787] CT
0.302 GC
N
f-1586420743
f
GR
GS
[1.00215 0 0 1 147.08161 198.72346] CT
0.302 GC
N
f-1586420743
f
GR
GS
[1.00215 0 0 1 146.04416 155.21353] CT
0.302 GC
N
f-1586420743
f
GR
GS
[1.00215 0 0 1 145.66511 198.23244] CT
0.302 GC
N
f-1586420743
f
GR
GS
[1.00215 0 0 1 151.15667 184.7254] CT
0.302 GC
N
f-1586420743
f
GR
GS
[1.00215 0 0 1 153.28803 207.21472] CT
0.302 GC
N
f-1586420743
f
GR
GS
[1.00215 0 0 1 159.4043 207.91924] CT
0.302 GC
N
f-1586420743
f
GR
GS
[1.00215 0 0 1 158.91697 162.26031] CT
0.302 GC
N
f-1586420743
f
GR
GS
[1.00215 0 0 1 150.17832 166.3862] CT
0.302 GC
N
f-1586420743
f
GR
GS
[1.00215 0 0 1 150.65257 216.18712] CT
0.302 GC
N
f-1586420743
f
GR
GS
[1.00215 0 0 1 158.13498 170.36024] CT
0.302 GC
N
f-1586420743
f
GR
GS
[1.00215 0 0 1 153.9667 175.3179] CT
0.302 GC
N
f-1586420743
f
GR
GS
[1.00215 0 0 1 156.88223 100.91872] CT
0.302 GC
N
f-1586420743
f
GR
GS
[1.00215 0 0 1 153.23949 132.09537] CT
0.302 GC
N
f-1586420743
f
GR
GS
[1.00215 0 0 1 158.21842 134.28487] CT
0.302 GC
N
f-1586420743
f
GR
GS
[1.00215 0 0 1 155.28165 181.60968] CT
0.302 GC
N
f-1586420743
f
GR
GS
[1.00215 0 0 1 155.4354 208.44749] CT
0.302 GC
N
f-1586420743
f
GR
GS
[1.00215 0 0 1 155.53404 220.51483] CT
0.302 GC
N
f-1586420743
f
GR
GS
[1.00215 0 0 1 145.62336 134.20567] CT
0.302 GC
N
f-1586420743
f
GR
GS
[1.00215 0 0 1 150.90826 188.39531] CT
0.302 GC
N
f-1586420743
f
GR
GS
[1.00215 0 0 1 158.3649 209.37007] CT
0.302 GC
N
f-1586420743
f
GR
GS
[1.00215 0 0 1 152.91849 174.01541] CT
0.302 GC
N
f-1586420743
f
GR
GS
[1.00215 0 0 1 157.90383 140.06772] CT
0.302 GC
N
f-1586420743
f
GR
GS
[1.00215 0 0 1 157.58766 187.89467] CT
0.302 GC
N
f-1586420743
f
GR
GS
[1.00215 0 0 1 145.73394 103.19604] CT
0.302 GC
N
f-1586420743
f
GR
GS
[1.00215 0 0 1 155.45252 184.60127] CT
0.302 GC
N
f-1586420743
f
GR
GS
[1.00215 0 0 1 153.2136 117.87946] CT
0.302 GC
N
f-1586420743
f
GR
GS
[1.00215 0 0 1 154.23575 122.61394] CT
0.302 GC
N
f-1586420743
f
GR
GS
[1.00215 0 0 1 151.45957 188.09543] CT
0.302 GC
N
f-1586420743
f
GR
GS
[1.00215 0 0 1 153.47339 159.58644] CT
0.302 GC
N
f-1586420743
f
GR
GS
[1.00215 0 0 1 150.00626 196.35457] CT
0.302 GC
N
f-1586420743
f
GR
GS
[1.00215 0 0 1 156.61552 170.48604] CT
0.302 GC
N
f-1586420743
f
GR
GS
[1.00215 0 0 1 155.81935 127.98471] CT
0.302 GC
N
f-1586420743
f
GR
GS
[1.00215 0 0 1 145.25672 130.14049] CT
0.302 GC
N
f-1586420743
f
GR
GS
[1.00215 0 0 1 154.70259 210.77374] CT
0.302 GC
N
f-1586420743
f
GR
GS
[1.00215 0 0 1 157.24287 136.3699] CT
0.302 GC
N
f-1586420743
f
GR
GS
[1.00215 0 0 1 145.90054 107.93546] CT
0.302 GC
N
f-1586420743
f
GR
GS
[1.00215 0 0 1 150.309 146.80705] CT
0.302 GC
N
f-1586420743
f
GR
GS
[1.00215 0 0 1 153.76592 228] CT
0.302 GC
N
f-1586420743
f
GR
GS
[1.00215 0 0 1 145.23623 226.54616] CT
0.302 GC
N
f-1586420743
f
GR
GS
[1.00215 0 0 1 152.63206 214.93867] CT
0.302 GC
N
f-1586420743
f
GR
GS
[1.00215 0 0 1 156.15536 97.60217] CT
0.302 GC
N
f-1586420743
f
GR
GS
[1.00215 0 0 1 149.80909 161.05743] CT
0.302 GC
N
f-1586420743
f
GR
GS
[1.00215 0 0 1 146.68365 175.17822] CT
0.302 GC
N
f-1586420743
f
GR
GS
[1.00215 0 0 1 154.18448 91.36922] CT
0.302 GC
N
f-1586420743
f
GR
GS
[1.00215 0 0 1 151.19977 163.75345] CT
0.302 GC
N
f-1586420743
f
GR
GS
[1.00215 0 0 1 152.54574 125.19445] CT
0.302 GC
N
f-1586420743
f
GR
GS
[1.00215 0 0 1 156.30822 141.3055] CT
0.302 GC
N
f-1586420743
f
GR
GS
[1.00215 0 0 1 155.60725 172.08348] CT
0.302 GC
N
f-1586420743
f
GR
GS
[1.00215 0 0 1 159.16026 166.33545] CT
0.302 GC
N
f-1586420743
f
GR
GS
[1.00215 0 0 1 147.42607 175.64282] CT
0.302 GC
N
f-1586420743
f
GR
%%Trailer
%%Pages: 1
%%EOF
