%!PS-Adobe-3.0 EPSF-3.0
%%Creator: (MATLAB, The Mathworks, Inc. Version 9.8.0.1323502 \(R2020a\). Operating System: Mac OS X)
%%Title: /Users/kosciessa/Desktop/mntTardisLNDG/LNDG/stateswitch/stsw_multimodal/figures/correlations/f_fooof_drift.eps
%%CreationDate: 2022-03-11T15:12:22
%%Pages: (atend)
%%BoundingBox:     3     0   241   194
%%LanguageLevel: 3
%%EndComments
%%BeginProlog
%%BeginResource: procset (Apache XML Graphics Std ProcSet) 1.2 0
%%Version: 1.2 0
%%Copyright: (Copyright 2001-2003,2010 The Apache Software Foundation. License terms: http://www.apache.org/licenses/LICENSE-2.0)
/bd{bind def}bind def
/ld{load def}bd
/GR/grestore ld
/GS/gsave ld
/RM/rmoveto ld
/C/curveto ld
/t/show ld
/L/lineto ld
/ML/setmiterlimit ld
/CT/concat ld
/f/fill ld
/N/newpath ld
/S/stroke ld
/CC/setcmykcolor ld
/A/ashow ld
/cp/closepath ld
/RC/setrgbcolor ld
/LJ/setlinejoin ld
/GC/setgray ld
/LW/setlinewidth ld
/M/moveto ld
/re {4 2 roll M
1 index 0 rlineto
0 exch rlineto
neg 0 rlineto
cp } bd
/_ctm matrix def
/_tm matrix def
/BT { _ctm currentmatrix pop matrix _tm copy pop 0 0 moveto } bd
/ET { _ctm setmatrix } bd
/iTm { _ctm setmatrix _tm concat } bd
/Tm { _tm astore pop iTm 0 0 moveto } bd
/ux 0.0 def
/uy 0.0 def
/F {
  /Tp exch def
  /Tf exch def
  Tf findfont Tp scalefont setfont
  /cf Tf def  /cs Tp def
} bd
/ULS {currentpoint /uy exch def /ux exch def} bd
/ULE {
  /Tcx currentpoint pop def
  gsave
  newpath
  cf findfont cs scalefont dup
  /FontMatrix get 0 get /Ts exch def /FontInfo get dup
  /UnderlinePosition get Ts mul /To exch def
  /UnderlineThickness get Ts mul /Tt exch def
  ux uy To add moveto  Tcx uy To add lineto
  Tt setlinewidth stroke
  grestore
} bd
/OLE {
  /Tcx currentpoint pop def
  gsave
  newpath
  cf findfont cs scalefont dup
  /FontMatrix get 0 get /Ts exch def /FontInfo get dup
  /UnderlinePosition get Ts mul /To exch def
  /UnderlineThickness get Ts mul /Tt exch def
  ux uy To add cs add moveto Tcx uy To add cs add lineto
  Tt setlinewidth stroke
  grestore
} bd
/SOE {
  /Tcx currentpoint pop def
  gsave
  newpath
  cf findfont cs scalefont dup
  /FontMatrix get 0 get /Ts exch def /FontInfo get dup
  /UnderlinePosition get Ts mul /To exch def
  /UnderlineThickness get Ts mul /Tt exch def
  ux uy To add cs 10 mul 26 idiv add moveto Tcx uy To add cs 10 mul 26 idiv add lineto
  Tt setlinewidth stroke
  grestore
} bd
/QT {
/Y22 exch store
/X22 exch store
/Y21 exch store
/X21 exch store
currentpoint
/Y21 load 2 mul add 3 div exch
/X21 load 2 mul add 3 div exch
/X21 load 2 mul /X22 load add 3 div
/Y21 load 2 mul /Y22 load add 3 div
/X22 load /Y22 load curveto
} bd
/SSPD {
dup length /d exch dict def
{
/v exch def
/k exch def
currentpagedevice k known {
/cpdv currentpagedevice k get def
v cpdv ne {
/upd false def
/nullv v type /nulltype eq def
/nullcpdv cpdv type /nulltype eq def
nullv nullcpdv or
{
/upd true def
} {
/sametype v type cpdv type eq def
sametype {
v type /arraytype eq {
/vlen v length def
/cpdvlen cpdv length def
vlen cpdvlen eq {
0 1 vlen 1 sub {
/i exch def
/obj v i get def
/cpdobj cpdv i get def
obj cpdobj ne {
/upd true def
exit
} if
} for
} {
/upd true def
} ifelse
} {
v type /dicttype eq {
v {
/dv exch def
/dk exch def
/cpddv cpdv dk get def
dv cpddv ne {
/upd true def
exit
} if
} forall
} {
/upd true def
} ifelse
} ifelse
} if
} ifelse
upd true eq {
d k v put
} if
} if
} if
} forall
d length 0 gt {
d setpagedevice
} if
} bd
/RE { % /NewFontName [NewEncodingArray] /FontName RE -
  findfont dup length dict begin
  {
    1 index /FID ne
    {def} {pop pop} ifelse
  } forall
  /Encoding exch def
  /FontName 1 index def
  currentdict definefont pop
  end
} bind def
%%EndResource
%%BeginResource: procset (Apache XML Graphics EPS ProcSet) 1.0 0
%%Version: 1.0 0
%%Copyright: (Copyright 2002-2003 The Apache Software Foundation. License terms: http://www.apache.org/licenses/LICENSE-2.0)
/BeginEPSF { %def
/b4_Inc_state save def         % Save state for cleanup
/dict_count countdictstack def % Count objects on dict stack
/op_count count 1 sub def      % Count objects on operand stack
userdict begin                 % Push userdict on dict stack
/showpage { } def              % Redefine showpage, { } = null proc
0 setgray 0 setlinecap         % Prepare graphics state
1 setlinewidth 0 setlinejoin
10 setmiterlimit [ ] 0 setdash newpath
/languagelevel where           % If level not equal to 1 then
{pop languagelevel             % set strokeadjust and
1 ne                           % overprint to their defaults.
{false setstrokeadjust false setoverprint
} if
} if
} bd
/EndEPSF { %def
count op_count sub {pop} repeat            % Clean up stacks
countdictstack dict_count sub {end} repeat
b4_Inc_state restore
} bd
%%EndResource
%FOPBeginFontDict
%%IncludeResource: font Courier-Oblique
%%IncludeResource: font Courier-BoldOblique
%%IncludeResource: font Courier-Bold
%%IncludeResource: font ZapfDingbats
%%IncludeResource: font Symbol
%%IncludeResource: font Helvetica
%%IncludeResource: font Helvetica-Oblique
%%IncludeResource: font Helvetica-Bold
%%IncludeResource: font Helvetica-BoldOblique
%%IncludeResource: font Times-Roman
%%IncludeResource: font Times-Italic
%%IncludeResource: font Times-Bold
%%IncludeResource: font Times-BoldItalic
%%IncludeResource: font Courier
%FOPEndFontDict
%%BeginResource: encoding WinAnsiEncoding
/WinAnsiEncoding [
/.notdef /.notdef /.notdef /.notdef /.notdef
/.notdef /.notdef /.notdef /.notdef /.notdef
/.notdef /.notdef /.notdef /.notdef /.notdef
/.notdef /.notdef /.notdef /.notdef /.notdef
/.notdef /.notdef /.notdef /.notdef /.notdef
/.notdef /.notdef /.notdef /.notdef /.notdef
/.notdef /.notdef /space /exclam /quotedbl
/numbersign /dollar /percent /ampersand /quotesingle
/parenleft /parenright /asterisk /plus /comma
/hyphen /period /slash /zero /one
/two /three /four /five /six
/seven /eight /nine /colon /semicolon
/less /equal /greater /question /at
/A /B /C /D /E
/F /G /H /I /J
/K /L /M /N /O
/P /Q /R /S /T
/U /V /W /X /Y
/Z /bracketleft /backslash /bracketright /asciicircum
/underscore /quoteleft /a /b /c
/d /e /f /g /h
/i /j /k /l /m
/n /o /p /q /r
/s /t /u /v /w
/x /y /z /braceleft /bar
/braceright /asciitilde /bullet /Euro /bullet
/quotesinglbase /florin /quotedblbase /ellipsis /dagger
/daggerdbl /circumflex /perthousand /Scaron /guilsinglleft
/OE /bullet /Zcaron /bullet /bullet
/quoteleft /quoteright /quotedblleft /quotedblright /bullet
/endash /emdash /asciitilde /trademark /scaron
/guilsinglright /oe /bullet /zcaron /Ydieresis
/space /exclamdown /cent /sterling /currency
/yen /brokenbar /section /dieresis /copyright
/ordfeminine /guillemotleft /logicalnot /sfthyphen /registered
/macron /degree /plusminus /twosuperior /threesuperior
/acute /mu /paragraph /middot /cedilla
/onesuperior /ordmasculine /guillemotright /onequarter /onehalf
/threequarters /questiondown /Agrave /Aacute /Acircumflex
/Atilde /Adieresis /Aring /AE /Ccedilla
/Egrave /Eacute /Ecircumflex /Edieresis /Igrave
/Iacute /Icircumflex /Idieresis /Eth /Ntilde
/Ograve /Oacute /Ocircumflex /Otilde /Odieresis
/multiply /Oslash /Ugrave /Uacute /Ucircumflex
/Udieresis /Yacute /Thorn /germandbls /agrave
/aacute /acircumflex /atilde /adieresis /aring
/ae /ccedilla /egrave /eacute /ecircumflex
/edieresis /igrave /iacute /icircumflex /idieresis
/eth /ntilde /ograve /oacute /ocircumflex
/otilde /odieresis /divide /oslash /ugrave
/uacute /ucircumflex /udieresis /yacute /thorn
/ydieresis
] def
%%EndResource
%FOPBeginFontReencode
/Courier-Oblique findfont
dup length dict begin
  {1 index /FID ne {def} {pop pop} ifelse} forall
  /Encoding WinAnsiEncoding def
  currentdict
end
/Courier-Oblique exch definefont pop
/Courier-BoldOblique findfont
dup length dict begin
  {1 index /FID ne {def} {pop pop} ifelse} forall
  /Encoding WinAnsiEncoding def
  currentdict
end
/Courier-BoldOblique exch definefont pop
/Courier-Bold findfont
dup length dict begin
  {1 index /FID ne {def} {pop pop} ifelse} forall
  /Encoding WinAnsiEncoding def
  currentdict
end
/Courier-Bold exch definefont pop
/Helvetica findfont
dup length dict begin
  {1 index /FID ne {def} {pop pop} ifelse} forall
  /Encoding WinAnsiEncoding def
  currentdict
end
/Helvetica exch definefont pop
/Helvetica-Oblique findfont
dup length dict begin
  {1 index /FID ne {def} {pop pop} ifelse} forall
  /Encoding WinAnsiEncoding def
  currentdict
end
/Helvetica-Oblique exch definefont pop
/Helvetica-Bold findfont
dup length dict begin
  {1 index /FID ne {def} {pop pop} ifelse} forall
  /Encoding WinAnsiEncoding def
  currentdict
end
/Helvetica-Bold exch definefont pop
/Helvetica-BoldOblique findfont
dup length dict begin
  {1 index /FID ne {def} {pop pop} ifelse} forall
  /Encoding WinAnsiEncoding def
  currentdict
end
/Helvetica-BoldOblique exch definefont pop
/Times-Roman findfont
dup length dict begin
  {1 index /FID ne {def} {pop pop} ifelse} forall
  /Encoding WinAnsiEncoding def
  currentdict
end
/Times-Roman exch definefont pop
/Times-Italic findfont
dup length dict begin
  {1 index /FID ne {def} {pop pop} ifelse} forall
  /Encoding WinAnsiEncoding def
  currentdict
end
/Times-Italic exch definefont pop
/Times-Bold findfont
dup length dict begin
  {1 index /FID ne {def} {pop pop} ifelse} forall
  /Encoding WinAnsiEncoding def
  currentdict
end
/Times-Bold exch definefont pop
/Times-BoldItalic findfont
dup length dict begin
  {1 index /FID ne {def} {pop pop} ifelse} forall
  /Encoding WinAnsiEncoding def
  currentdict
end
/Times-BoldItalic exch definefont pop
/Courier findfont
dup length dict begin
  {1 index /FID ne {def} {pop pop} ifelse} forall
  /Encoding WinAnsiEncoding def
  currentdict
end
/Courier exch definefont pop
%FOPEndFontReencode
%%EndProlog
%%Page: 1 1
%%PageBoundingBox: 0 0 255 198
%%BeginPageSetup
[1 0 0 -1 0 198] CT
%%EndPageSetup
GS
[1.00046 0 0 1.00215 0 -0.4252] CT
1 GC
N
0 0 255 198 re
f
GR
GS
[1.00046 0 0 1.00215 0 -0.4252] CT
1 GC
N
0 0 255 198 re
f
GR
GS
[1.00046 0 0 1.00215 0 -0.4252] CT
0.2 GC
N
66.5 143 M
231.5 143 L
231.5 21 L
66.5 21 L
cp
f
GR
GS
[1.00046 0 0 1.00215 0 -0.4252] CT
0.149 GC
2 setlinecap
1 LJ
0.5 LW
N
66.5 143 M
231.5 143 L
S
GR
GS
[1.00046 0 0 1.00215 0 -0.4252] CT
0.149 GC
2 setlinecap
1 LJ
0.5 LW
N
66.5 143 M
66.5 141.35 L
S
GR
GS
[1.00046 0 0 1.00215 0 -0.4252] CT
0.149 GC
2 setlinecap
1 LJ
0.5 LW
N
121.5 143 M
121.5 141.35 L
S
GR
GS
[1.00046 0 0 1.00215 0 -0.4252] CT
0.149 GC
2 setlinecap
1 LJ
0.5 LW
N
176.5 143 M
176.5 141.35 L
S
GR
GS
[1.00046 0 0 1.00215 0 -0.4252] CT
0.149 GC
2 setlinecap
1 LJ
0.5 LW
N
231.5 143 M
231.5 141.35 L
S
GR
GS
[1.00046 0 0 1.00215 66.5308 147.6922] CT
0.149 GC
/Helvetica 14 F
GS
[1 0 0 1 0 0] CT
-12.5 14 moveto 
1 -1 scale
(-0.1) t 
GR
GR
GS
[1.00046 0 0 1.00215 121.55627 147.6922] CT
0.149 GC
/Helvetica 14 F
GS
[1 0 0 1 0 0] CT
-4 14 moveto 
1 -1 scale
(0) t 
GR
GR
GS
[1.00046 0 0 1.00215 176.58175 147.6922] CT
0.149 GC
/Helvetica 14 F
GS
[1 0 0 1 0 0] CT
-10 14 moveto 
1 -1 scale
(0.1) t 
GR
GR
GS
[1.00046 0 0 1.00215 231.60722 147.6922] CT
0.149 GC
/Helvetica 14 F
GS
[1 0 0 1 0 0] CT
-10 14 moveto 
1 -1 scale
(0.2) t 
GR
GR
GS
[1.00046 0 0 1.00215 149.06909 165.22978] CT
0.149 GC
/Helvetica 14 F
GS
[1 0 0 1 0 0] CT
-26 14 moveto 
1 -1 scale
(fooof bs) t 
GR
GR
GS
[1.00046 0 0 1.00215 149.06909 165.22978] CT
0.149 GC
/Helvetica 14 F
GS
[1 0 0 1 0 0] CT
-57.5 31 moveto 
1 -1 scale
(\(linear modulation\)) t 
GR
GR
GS
[1.00046 0 0 1.00215 0 -0.4252] CT
0.149 GC
2 setlinecap
1 LJ
0.5 LW
N
66.5 143 M
66.5 21 L
S
GR
GS
[1.00046 0 0 1.00215 0 -0.4252] CT
0.149 GC
2 setlinecap
1 LJ
0.5 LW
N
66.5 136.31 M
68.15 136.31 L
S
GR
GS
[1.00046 0 0 1.00215 0 -0.4252] CT
0.149 GC
2 setlinecap
1 LJ
0.5 LW
N
66.5 101.355 M
68.15 101.355 L
S
GR
GS
[1.00046 0 0 1.00215 0 -0.4252] CT
0.149 GC
2 setlinecap
1 LJ
0.5 LW
N
66.5 66.4 M
68.15 66.4 L
S
GR
GS
[1.00046 0 0 1.00215 0 -0.4252] CT
0.149 GC
2 setlinecap
1 LJ
0.5 LW
N
66.5 31.445 M
68.15 31.445 L
S
GR
GS
[1.00046 0 0 1.00215 61.72857 136.17786] CT
0.149 GC
/Helvetica 14 F
GS
[1 0 0 1 0 0] CT
-25 5.5 moveto 
1 -1 scale
(-0.6) t 
GR
GR
GS
[1.00046 0 0 1.00215 61.72857 101.1478] CT
0.149 GC
/Helvetica 14 F
GS
[1 0 0 1 0 0] CT
-25 5.5 moveto 
1 -1 scale
(-0.4) t 
GR
GR
GS
[1.00046 0 0 1.00215 61.72857 66.11777] CT
0.149 GC
/Helvetica 14 F
GS
[1 0 0 1 0 0] CT
-25 5.5 moveto 
1 -1 scale
(-0.2) t 
GR
GR
GS
[1.00046 0 0 1.00215 61.72857 31.08773] CT
0.149 GC
/Helvetica 14 F
GS
[1 0 0 1 0 0] CT
-8 5.5 moveto 
1 -1 scale
(0) t 
GR
GR
GS
[0 -1.00215 1.00046 0 33.71561 81.75084] CT
0.149 GC
/Helvetica 14 F
GS
[1 0 0 1 0 0] CT
-12.5 -20 moveto 
1 -1 scale
(drift) t 
GR
GR
GS
[0 -1.00215 1.00046 0 33.71561 81.75084] CT
0.149 GC
/Helvetica 14 F
GS
[1 0 0 1 0 0] CT
-57.5 -3 moveto 
1 -1 scale
(\(linear modulation\)) t 
GR
GR
GS
[1.00046 0 0 1.00215 149.06915 18.86614] CT
/Helvetica-Bold 14 F
GS
[1 0 0 1 0 0] CT
-55.5 -4 moveto 
1 -1 scale
(r = -0.22 p = 0.04) t 
GR
GR
GS
[1.00046 0 0 1.00215 110.15604 96.53654] CT
0.502 0.702 0.8 RC
N
0.5 0 M
0.5 -0.276 0.276 -0.5 0 -0.5 C
-0.276 -0.5 -0.5 -0.276 -0.5 0 C
-0.5 0.276 -0.276 0.5 0 0.5 C
0.276 0.5 0.5 0.276 0.5 0 C
cp
f
GR
GS
[1.00046 0 0 1.00215 94.24492 93.8599] CT
0.502 0.702 0.8 RC
N
/f-2105962265{0.5 0 M
0.5 -0.276 0.276 -0.5 0 -0.5 C
-0.276 -0.5 -0.5 -0.276 -0.5 0 C
-0.5 0.276 -0.276 0.5 0 0.5 C
0.276 0.5 0.5 0.276 0.5 0 C
cp}def
f-2105962265
f
GR
GS
[1.00046 0 0 1.00215 167.36735 71.08627] CT
0.502 0.702 0.8 RC
N
f-2105962265
f
GR
GS
[1.00046 0 0 1.00215 180.73714 66.6732] CT
0.502 0.702 0.8 RC
N
f-2105962265
f
GR
GS
[1.00046 0 0 1.00215 161.29281 57.70087] CT
0.502 0.702 0.8 RC
N
f-2105962265
f
GR
GS
[1.00046 0 0 1.00215 139.90131 97.90824] CT
0.502 0.702 0.8 RC
N
f-2105962265
f
GR
GS
[1.00046 0 0 1.00215 133.9941 93.76987] CT
0.502 0.702 0.8 RC
N
f-2105962265
f
GR
GS
[1.00046 0 0 1.00215 145.1328 113.83616] CT
0.502 0.702 0.8 RC
N
f-2105962265
f
GR
GS
[1.00046 0 0 1.00215 144.96833 38.72745] CT
0.502 0.702 0.8 RC
N
f-2105962265
f
GR
GS
[1.00046 0 0 1.00215 173.79382 73.60734] CT
0.502 0.702 0.8 RC
N
f-2105962265
f
GR
GS
[1.00046 0 0 1.00215 141.77208 77.61154] CT
0.502 0.702 0.8 RC
N
f-2105962265
f
GR
GS
[1.00046 0 0 1.00215 128.65525 91.86638] CT
0.502 0.702 0.8 RC
N
f-2105962265
f
GR
GS
[1.00046 0 0 1.00215 103.59048 57.59998] CT
0.502 0.702 0.8 RC
N
f-2105962265
f
GR
GS
[1.00046 0 0 1.00215 107.84811 74.04312] CT
0.502 0.702 0.8 RC
N
f-2105962265
f
GR
GS
[1.00046 0 0 1.00215 201.40055 89.72591] CT
0.502 0.702 0.8 RC
N
f-2105962265
f
GR
GS
[1.00046 0 0 1.00215 113.15134 61.65942] CT
0.502 0.702 0.8 RC
N
f-2105962265
f
GR
GS
[1.00046 0 0 1.00215 126.56967 82.82608] CT
0.502 0.702 0.8 RC
N
f-2105962265
f
GR
GS
[1.00046 0 0 1.00215 153.05463 99.3172] CT
0.502 0.702 0.8 RC
N
f-2105962265
f
GR
GS
[1.00046 0 0 1.00215 156.85087 101.65683] CT
0.502 0.702 0.8 RC
N
f-2105962265
f
GR
GS
[1.00046 0 0 1.00215 159.91229 98.39145] CT
0.502 0.702 0.8 RC
N
f-2105962265
f
GR
GS
[1.00046 0 0 1.00215 206.84599 130.65577] CT
0.502 0.702 0.8 RC
N
f-2105962265
f
GR
GS
[1.00046 0 0 1.00215 170.14772 92.265] CT
0.502 0.702 0.8 RC
N
f-2105962265
f
GR
GS
[1.00046 0 0 1.00215 130.14379 58.92733] CT
0.502 0.702 0.8 RC
N
f-2105962265
f
GR
GS
[1.00046 0 0 1.00215 126.4509 132.69338] CT
0.502 0.702 0.8 RC
N
f-2105962265
f
GR
GS
[1.00046 0 0 1.00215 166.75246 109.47139] CT
0.502 0.702 0.8 RC
N
f-2105962265
f
GR
GS
[1.00046 0 0 1.00215 164.98972 129.33692] CT
0.502 0.702 0.8 RC
N
f-2105962265
f
GR
GS
[1.00046 0 0 1.00215 159.82725 72.02533] CT
0.502 0.702 0.8 RC
N
f-2105962265
f
GR
GS
[1.00046 0 0 1.00215 121.86326 131.13978] CT
0.502 0.702 0.8 RC
N
f-2105962265
f
GR
GS
[1.00046 0 0 1.00215 153.58157 95.11493] CT
0.502 0.702 0.8 RC
N
f-2105962265
f
GR
GS
[1.00046 0 0 1.00215 151.60691 103.79215] CT
0.502 0.702 0.8 RC
N
f-2105962265
f
GR
GS
[1.00046 0 0 1.00215 125.5386 72.97615] CT
0.502 0.702 0.8 RC
N
f-2105962265
f
GR
GS
[1.00046 0 0 1.00215 206.84599 127.03688] CT
0.502 0.702 0.8 RC
N
f-2105962265
f
GR
GS
[1.00046 0 0 1.00215 122.24011 120.85475] CT
0.502 0.702 0.8 RC
N
f-2105962265
f
GR
GS
[1.00046 0 0 1.00215 111.66059 99.98669] CT
0.502 0.702 0.8 RC
N
f-2105962265
f
GR
GS
[1.00046 0 0 1.00215 137.16732 117.61945] CT
0.502 0.702 0.8 RC
N
f-2105962265
f
GR
GS
[1.00046 0 0 1.00215 157.44401 125.1615] CT
0.502 0.702 0.8 RC
N
f-2105962265
f
GR
GS
[1.00046 0 0 1.00215 121.93132 95.04316] CT
0.502 0.702 0.8 RC
N
f-2105962265
f
GR
GS
[1.00046 0 0 1.00215 121.39226 126.02158] CT
0.502 0.702 0.8 RC
N
f-2105962265
f
GR
GS
[1.00046 0 0 1.00215 97.38455 68.73349] CT
0.502 0.702 0.8 RC
N
f-2105962265
f
GR
GS
[1.00046 0 0 1.00215 149.84832 100.60293] CT
0.502 0.702 0.8 RC
N
f-2105962265
f
GR
GS
[1.00046 0 0 1.00215 104.91593 85.57293] CT
0.502 0.702 0.8 RC
N
f-2105962265
f
GR
GS
[1.00046 0 0 1.00215 115.97695 87.73669] CT
0.502 0.702 0.8 RC
N
f-2105962265
f
GR
GS
[1.00046 0 0 1.00215 107.05332 64.26135] CT
0.502 0.702 0.8 RC
N
f-2105962265
f
GR
GS
[1.00046 0 0 1.00215 99.891 77.01927] CT
0.502 0.702 0.8 RC
N
f-2105962265
f
GR
GS
[1.00046 0 0 1.00215 118.34531 61.86849] CT
0.502 0.702 0.8 RC
N
f-2105962265
f
GR
GS
[1.00046 0 0 1.00215 140.19762 39.01466] CT
0.502 0.702 0.8 RC
N
f-2105962265
f
GR
GS
[1.00046 0 0 1.00215 144.08057 85.71871] CT
0.502 0.702 0.8 RC
N
f-2105962265
f
GR
GS
[1.00046 0 0 1.00215 135.14302 57.00372] CT
0.502 0.702 0.8 RC
N
f-2105962265
f
GR
GS
[1.00046 0 0 1.00215 124.29134 78.35918] CT
0.502 0.702 0.8 RC
N
f-2105962265
f
GR
GS
[1.00046 0 0 1.00215 135.11379 67.23987] CT
0.502 0.702 0.8 RC
N
f-2105962265
f
GR
GS
[1.00046 0 0 1.00215 101.11443 70.57114] CT
0.502 0.702 0.8 RC
N
f-2105962265
f
GR
GS
[1.00046 0 0 1.00215 139.82472 69.18002] CT
0.502 0.702 0.8 RC
N
f-2105962265
f
GR
GS
[1.00046 0 0 1.00215 100.46055 75.91785] CT
0.502 0.702 0.8 RC
N
f-2105962265
f
GR
GS
[1.00046 0 0 1.00215 80.02262 53.62124] CT
0.502 0.702 0.8 RC
N
f-2105962265
f
GR
GS
[1.00046 0 0 1.00215 73.69142 102.54159] CT
0.502 0.702 0.8 RC
N
f-2105962265
f
GR
GS
[1.00046 0 0 1.00215 144.00983 74.56904] CT
0.502 0.702 0.8 RC
N
f-2105962265
f
GR
GS
[1.00046 0 0 1.00215 111.97858 66.4921] CT
0.502 0.702 0.8 RC
N
f-2105962265
f
GR
GS
[1.00046 0 0 1.00215 101.77885 91.82352] CT
0.502 0.702 0.8 RC
N
f-2105962265
f
GR
GS
[1.00046 0 0 1.00215 135.63484 66.7725] CT
0.502 0.702 0.8 RC
N
f-2105962265
f
GR
GS
[1.00046 0 0 1.00215 128.85457 68.224] CT
0.502 0.702 0.8 RC
N
f-2105962265
f
GR
GS
[1.00046 0 0 1.00215 100.56424 56.54895] CT
0.502 0.702 0.8 RC
N
f-2105962265
f
GR
GS
[1.00046 0 0 1.00215 131.57182 36.54788] CT
0.502 0.702 0.8 RC
N
f-2105962265
f
GR
GS
[1.00046 0 0 1.00215 102.72795 63.81888] CT
0.502 0.702 0.8 RC
N
f-2105962265
f
GR
GS
[1.00046 0 0 1.00215 141.60315 69.50606] CT
0.502 0.702 0.8 RC
N
f-2105962265
f
GR
GS
[1.00046 0 0 1.00215 126.63738 58.94908] CT
0.502 0.702 0.8 RC
N
f-2105962265
f
GR
GS
[1.00046 0 0 1.00215 132.31203 50.44716] CT
0.502 0.702 0.8 RC
N
f-2105962265
f
GR
GS
[1.00046 0 0 1.00215 129.51139 60.08849] CT
0.502 0.702 0.8 RC
N
f-2105962265
f
GR
GS
[1.00046 0 0 1.00215 99.63723 75.19448] CT
0.502 0.702 0.8 RC
N
f-2105962265
f
GR
GS
[1.00046 0 0 1.00215 154.01776 87.69289] CT
0.502 0.702 0.8 RC
N
f-2105962265
f
GR
GS
[1.00046 0 0 1.00215 127.80857 65.31238] CT
0.502 0.702 0.8 RC
N
f-2105962265
f
GR
GS
[1.00046 0 0 1.00215 117.87196 87.04194] CT
0.502 0.702 0.8 RC
N
f-2105962265
f
GR
GS
[1.00046 0 0 1.00215 109.20695 88.71195] CT
0.502 0.702 0.8 RC
N
f-2105962265
f
GR
GS
[1.00046 0 0 1.00215 134.6657 48.87594] CT
0.502 0.702 0.8 RC
N
f-2105962265
f
GR
GS
[1.00046 0 0 1.00215 86.93738 83.93882] CT
0.502 0.702 0.8 RC
N
f-2105962265
f
GR
GS
[1.00046 0 0 1.00215 178.0551 50.18136] CT
0.502 0.702 0.8 RC
N
f-2105962265
f
GR
GS
[1.00046 0 0 1.00215 136.54159 69.07115] CT
0.502 0.702 0.8 RC
N
f-2105962265
f
GR
GS
[1.00046 0 0 1.00215 139.02391 63.11977] CT
0.502 0.702 0.8 RC
N
f-2105962265
f
GR
GS
[1.00046 0 0 1.00215 113.92802 55.0716] CT
0.502 0.702 0.8 RC
N
f-2105962265
f
GR
GS
[1.00046 0 0 1.00215 126.27264 45.08961] CT
0.502 0.702 0.8 RC
N
f-2105962265
f
GR
GS
[1.00046 0 0 1.00215 103.27876 61.36413] CT
0.502 0.702 0.8 RC
N
f-2105962265
f
GR
GS
[1.00046 0 0 1.00215 127.56317 65.81861] CT
0.502 0.702 0.8 RC
N
f-2105962265
f
GR
GS
[1.00046 0 0 1.00215 100.91634 71.90442] CT
0.502 0.702 0.8 RC
N
f-2105962265
f
GR
GS
[1.00046 0 0 1.00215 122.42309 30.80839] CT
0.502 0.702 0.8 RC
N
f-2105962265
f
GR
GS
[1.00046 0 0 1.00215 99.54957 50.87526] CT
0.502 0.702 0.8 RC
N
f-2105962265
f
GR
GS
[1.00046 0 0 1.00215 107.85667 73.09183] CT
0.502 0.702 0.8 RC
N
f-2105962265
f
GR
GS
[1.00046 0 0 1.00215 114.58454 70.12448] CT
0.502 0.702 0.8 RC
N
f-2105962265
f
GR
GS
[1.00046 0 0 1.00215 155.32441 59.39018] CT
0.502 0.702 0.8 RC
N
f-2105962265
f
GR
GS
[1.00046 0 0 1.00215 84.30055 64.02708] CT
0.502 0.702 0.8 RC
N
f-2105962265
f
GR
GS
[1.00046 0 0 1.00215 106.75286 67.03606] CT
0.502 0.702 0.8 RC
N
f-2105962265
f
GR
GS
[1.00046 0 0 1.00215 156.96758 69.44389] CT
0.502 0.702 0.8 RC
N
f-2105962265
f
GR
GS
[1.00046 0 0 1.00215 115.6994 83.45445] CT
0.502 0.702 0.8 RC
N
f-2105962265
f
GR
GS
[1.00046 0 0 1.00215 157.41449 55.00088] CT
0.502 0.702 0.8 RC
N
f-2105962265
f
GR
GS
[1.00046 0 0 1.00215 107.93945 85.833] CT
0.502 0.702 0.8 RC
N
f-2105962265
f
GR
GS
[1.00046 0 0 1.00215 178.0551 51.05371] CT
0.502 0.702 0.8 RC
N
f-2105962265
f
GR
GS
[1.00046 0 0 1.00215 117.27225 51.52958] CT
0.502 0.702 0.8 RC
N
f-2105962265
f
GR
GS
[1.00046 0 0 1.00215 0 -0.4252] CT
0.6 0.8 0.902 RC
1 LJ
3 LW
N
66.5 66.425 M
231.5 96.968 L
S
GR
GS
[1.00046 0 0 1.00215 110.15604 96.53654] CT
0.702 0.898 1 RC
N
/f227889816{-3 -3 M
-3 3 L
3 3 L
3 -3 L
cp}def
f227889816
f
GR
GS
[1.00046 0 0 1.00215 94.24492 93.8599] CT
0.702 0.898 1 RC
N
f227889816
f
GR
GS
[1.00046 0 0 1.00215 167.36735 71.08627] CT
0.702 0.898 1 RC
N
f227889816
f
GR
GS
[1.00046 0 0 1.00215 180.73714 66.6732] CT
0.702 0.898 1 RC
N
f227889816
f
GR
GS
[1.00046 0 0 1.00215 161.29281 57.70087] CT
0.702 0.898 1 RC
N
f227889816
f
GR
GS
[1.00046 0 0 1.00215 139.90131 97.90824] CT
0.702 0.898 1 RC
N
f227889816
f
GR
GS
[1.00046 0 0 1.00215 133.9941 93.76987] CT
0.702 0.898 1 RC
N
f227889816
f
GR
GS
[1.00046 0 0 1.00215 145.1328 113.83616] CT
0.702 0.898 1 RC
N
f227889816
f
GR
GS
[1.00046 0 0 1.00215 144.96833 38.72745] CT
0.702 0.898 1 RC
N
f227889816
f
GR
GS
[1.00046 0 0 1.00215 173.79382 73.60734] CT
0.702 0.898 1 RC
N
f227889816
f
GR
GS
[1.00046 0 0 1.00215 141.77208 77.61154] CT
0.702 0.898 1 RC
N
f227889816
f
GR
GS
[1.00046 0 0 1.00215 128.65525 91.86638] CT
0.702 0.898 1 RC
N
f227889816
f
GR
GS
[1.00046 0 0 1.00215 103.59048 57.59998] CT
0.702 0.898 1 RC
N
f227889816
f
GR
GS
[1.00046 0 0 1.00215 107.84811 74.04312] CT
0.702 0.898 1 RC
N
f227889816
f
GR
GS
[1.00046 0 0 1.00215 201.40055 89.72591] CT
0.702 0.898 1 RC
N
f227889816
f
GR
GS
[1.00046 0 0 1.00215 113.15134 61.65942] CT
0.702 0.898 1 RC
N
f227889816
f
GR
GS
[1.00046 0 0 1.00215 126.56967 82.82608] CT
0.702 0.898 1 RC
N
f227889816
f
GR
GS
[1.00046 0 0 1.00215 153.05463 99.3172] CT
0.702 0.898 1 RC
N
f227889816
f
GR
GS
[1.00046 0 0 1.00215 156.85087 101.65683] CT
0.702 0.898 1 RC
N
f227889816
f
GR
GS
[1.00046 0 0 1.00215 159.91229 98.39145] CT
0.702 0.898 1 RC
N
f227889816
f
GR
GS
[1.00046 0 0 1.00215 206.84599 130.65577] CT
0.702 0.898 1 RC
N
f227889816
f
GR
GS
[1.00046 0 0 1.00215 170.14772 92.265] CT
0.702 0.898 1 RC
N
f227889816
f
GR
GS
[1.00046 0 0 1.00215 130.14379 58.92733] CT
0.702 0.898 1 RC
N
f227889816
f
GR
GS
[1.00046 0 0 1.00215 126.4509 132.69338] CT
0.702 0.898 1 RC
N
f227889816
f
GR
GS
[1.00046 0 0 1.00215 166.75246 109.47139] CT
0.702 0.898 1 RC
N
f227889816
f
GR
GS
[1.00046 0 0 1.00215 164.98972 129.33692] CT
0.702 0.898 1 RC
N
f227889816
f
GR
GS
[1.00046 0 0 1.00215 159.82725 72.02533] CT
0.702 0.898 1 RC
N
f227889816
f
GR
GS
[1.00046 0 0 1.00215 121.86326 131.13978] CT
0.702 0.898 1 RC
N
f227889816
f
GR
GS
[1.00046 0 0 1.00215 153.58157 95.11493] CT
0.702 0.898 1 RC
N
f227889816
f
GR
GS
[1.00046 0 0 1.00215 151.60691 103.79215] CT
0.702 0.898 1 RC
N
f227889816
f
GR
GS
[1.00046 0 0 1.00215 125.5386 72.97615] CT
0.702 0.898 1 RC
N
f227889816
f
GR
GS
[1.00046 0 0 1.00215 206.84599 127.03688] CT
0.702 0.898 1 RC
N
f227889816
f
GR
GS
[1.00046 0 0 1.00215 122.24011 120.85475] CT
0.702 0.898 1 RC
N
f227889816
f
GR
GS
[1.00046 0 0 1.00215 111.66059 99.98669] CT
0.702 0.898 1 RC
N
f227889816
f
GR
GS
[1.00046 0 0 1.00215 137.16732 117.61945] CT
0.702 0.898 1 RC
N
f227889816
f
GR
GS
[1.00046 0 0 1.00215 157.44401 125.1615] CT
0.702 0.898 1 RC
N
f227889816
f
GR
GS
[1.00046 0 0 1.00215 121.93132 95.04316] CT
0.702 0.898 1 RC
N
f227889816
f
GR
GS
[1.00046 0 0 1.00215 121.39226 126.02158] CT
0.702 0.898 1 RC
N
f227889816
f
GR
GS
[1.00046 0 0 1.00215 97.38455 68.73349] CT
0.702 0.898 1 RC
N
f227889816
f
GR
GS
[1.00046 0 0 1.00215 149.84832 100.60293] CT
0.702 0.898 1 RC
N
f227889816
f
GR
GS
[1.00046 0 0 1.00215 104.91593 85.57293] CT
0.702 0.898 1 RC
N
f227889816
f
GR
GS
[1.00046 0 0 1.00215 115.97695 87.73669] CT
0.702 0.898 1 RC
N
f227889816
f
GR
GS
[1.00046 0 0 1.00215 107.05332 64.26135] CT
0.502 0.702 0.8 RC
N
/f-1969333140{-3.536 0 M
0 4.702 L
3.536 0 L
0 -4.702 L
cp}def
f-1969333140
f
GR
GS
[1.00046 0 0 1.00215 99.891 77.01927] CT
0.502 0.702 0.8 RC
N
f-1969333140
f
GR
GS
[1.00046 0 0 1.00215 118.34531 61.86849] CT
0.502 0.702 0.8 RC
N
f-1969333140
f
GR
GS
[1.00046 0 0 1.00215 140.19762 39.01466] CT
0.502 0.702 0.8 RC
N
f-1969333140
f
GR
GS
[1.00046 0 0 1.00215 144.08057 85.71871] CT
0.502 0.702 0.8 RC
N
f-1969333140
f
GR
GS
[1.00046 0 0 1.00215 135.14302 57.00372] CT
0.502 0.702 0.8 RC
N
f-1969333140
f
GR
GS
[1.00046 0 0 1.00215 124.29134 78.35918] CT
0.502 0.702 0.8 RC
N
f-1969333140
f
GR
GS
[1.00046 0 0 1.00215 135.11379 67.23987] CT
0.502 0.702 0.8 RC
N
f-1969333140
f
GR
GS
[1.00046 0 0 1.00215 101.11443 70.57114] CT
0.502 0.702 0.8 RC
N
f-1969333140
f
GR
GS
[1.00046 0 0 1.00215 139.82472 69.18002] CT
0.502 0.702 0.8 RC
N
f-1969333140
f
GR
GS
[1.00046 0 0 1.00215 100.46055 75.91785] CT
0.502 0.702 0.8 RC
N
f-1969333140
f
GR
GS
[1.00046 0 0 1.00215 80.02262 53.62124] CT
0.502 0.702 0.8 RC
N
f-1969333140
f
GR
GS
[1.00046 0 0 1.00215 73.69142 102.54159] CT
0.502 0.702 0.8 RC
N
f-1969333140
f
GR
GS
[1.00046 0 0 1.00215 144.00983 74.56904] CT
0.502 0.702 0.8 RC
N
f-1969333140
f
GR
GS
[1.00046 0 0 1.00215 111.97858 66.4921] CT
0.502 0.702 0.8 RC
N
f-1969333140
f
GR
GS
[1.00046 0 0 1.00215 101.77885 91.82352] CT
0.502 0.702 0.8 RC
N
f-1969333140
f
GR
GS
[1.00046 0 0 1.00215 135.63484 66.7725] CT
0.502 0.702 0.8 RC
N
f-1969333140
f
GR
GS
[1.00046 0 0 1.00215 128.85457 68.224] CT
0.502 0.702 0.8 RC
N
f-1969333140
f
GR
GS
[1.00046 0 0 1.00215 100.56424 56.54895] CT
0.502 0.702 0.8 RC
N
f-1969333140
f
GR
GS
[1.00046 0 0 1.00215 131.57182 36.54788] CT
0.502 0.702 0.8 RC
N
f-1969333140
f
GR
GS
[1.00046 0 0 1.00215 102.72795 63.81888] CT
0.502 0.702 0.8 RC
N
f-1969333140
f
GR
GS
[1.00046 0 0 1.00215 141.60315 69.50606] CT
0.502 0.702 0.8 RC
N
f-1969333140
f
GR
GS
[1.00046 0 0 1.00215 126.63738 58.94908] CT
0.502 0.702 0.8 RC
N
f-1969333140
f
GR
GS
[1.00046 0 0 1.00215 132.31203 50.44716] CT
0.502 0.702 0.8 RC
N
f-1969333140
f
GR
GS
[1.00046 0 0 1.00215 129.51139 60.08849] CT
0.502 0.702 0.8 RC
N
f-1969333140
f
GR
GS
[1.00046 0 0 1.00215 99.63723 75.19448] CT
0.502 0.702 0.8 RC
N
f-1969333140
f
GR
GS
[1.00046 0 0 1.00215 154.01776 87.69289] CT
0.502 0.702 0.8 RC
N
f-1969333140
f
GR
GS
[1.00046 0 0 1.00215 127.80857 65.31238] CT
0.502 0.702 0.8 RC
N
f-1969333140
f
GR
GS
[1.00046 0 0 1.00215 117.87196 87.04194] CT
0.502 0.702 0.8 RC
N
f-1969333140
f
GR
GS
[1.00046 0 0 1.00215 109.20695 88.71195] CT
0.502 0.702 0.8 RC
N
f-1969333140
f
GR
GS
[1.00046 0 0 1.00215 134.6657 48.87594] CT
0.502 0.702 0.8 RC
N
f-1969333140
f
GR
GS
[1.00046 0 0 1.00215 86.93738 83.93882] CT
0.502 0.702 0.8 RC
N
f-1969333140
f
GR
GS
[1.00046 0 0 1.00215 178.0551 50.18136] CT
0.502 0.702 0.8 RC
N
f-1969333140
f
GR
GS
[1.00046 0 0 1.00215 136.54159 69.07115] CT
0.502 0.702 0.8 RC
N
f-1969333140
f
GR
GS
[1.00046 0 0 1.00215 139.02391 63.11977] CT
0.502 0.702 0.8 RC
N
f-1969333140
f
GR
GS
[1.00046 0 0 1.00215 113.92802 55.0716] CT
0.502 0.702 0.8 RC
N
f-1969333140
f
GR
GS
[1.00046 0 0 1.00215 126.27264 45.08961] CT
0.502 0.702 0.8 RC
N
f-1969333140
f
GR
GS
[1.00046 0 0 1.00215 103.27876 61.36413] CT
0.502 0.702 0.8 RC
N
f-1969333140
f
GR
GS
[1.00046 0 0 1.00215 127.56317 65.81861] CT
0.502 0.702 0.8 RC
N
f-1969333140
f
GR
GS
[1.00046 0 0 1.00215 100.91634 71.90442] CT
0.502 0.702 0.8 RC
N
f-1969333140
f
GR
GS
[1.00046 0 0 1.00215 122.42309 30.80839] CT
0.502 0.702 0.8 RC
N
f-1969333140
f
GR
GS
[1.00046 0 0 1.00215 99.54957 50.87526] CT
0.502 0.702 0.8 RC
N
f-1969333140
f
GR
GS
[1.00046 0 0 1.00215 107.85667 73.09183] CT
0.502 0.702 0.8 RC
N
f-1969333140
f
GR
GS
[1.00046 0 0 1.00215 114.58454 70.12448] CT
0.502 0.702 0.8 RC
N
f-1969333140
f
GR
GS
[1.00046 0 0 1.00215 155.32441 59.39018] CT
0.502 0.702 0.8 RC
N
f-1969333140
f
GR
GS
[1.00046 0 0 1.00215 84.30055 64.02708] CT
0.502 0.702 0.8 RC
N
f-1969333140
f
GR
GS
[1.00046 0 0 1.00215 106.75286 67.03606] CT
0.502 0.702 0.8 RC
N
f-1969333140
f
GR
GS
[1.00046 0 0 1.00215 156.96758 69.44389] CT
0.502 0.702 0.8 RC
N
f-1969333140
f
GR
GS
[1.00046 0 0 1.00215 115.6994 83.45445] CT
0.502 0.702 0.8 RC
N
f-1969333140
f
GR
GS
[1.00046 0 0 1.00215 157.41449 55.00088] CT
0.502 0.702 0.8 RC
N
f-1969333140
f
GR
GS
[1.00046 0 0 1.00215 107.93945 85.833] CT
0.502 0.702 0.8 RC
N
f-1969333140
f
GR
GS
[1.00046 0 0 1.00215 178.0551 51.05371] CT
0.502 0.702 0.8 RC
N
f-1969333140
f
GR
GS
[1.00046 0 0 1.00215 117.27225 51.52958] CT
0.502 0.702 0.8 RC
N
f-1969333140
f
GR
%%Trailer
%%Pages: 1
%%EOF
