%!PS-Adobe-3.0 EPSF-3.0
%%Creator: (MATLAB, The Mathworks, Inc. Version 9.8.0.1323502 \(R2020a\). Operating System: Mac OS X)
%%Title: /Users/kosciessa/Desktop/mntTardisLNDG/LNDG/stateswitch/stsw_multimodal/figures/linearbyage/linearcomp_threshold.eps
%%CreationDate: 2022-03-03T16:32:24
%%Pages: (atend)
%%BoundingBox:     4     0   180   275
%%LanguageLevel: 3
%%EndComments
%%BeginProlog
%%BeginResource: procset (Apache XML Graphics Std ProcSet) 1.2 0
%%Version: 1.2 0
%%Copyright: (Copyright 2001-2003,2010 The Apache Software Foundation. License terms: http://www.apache.org/licenses/LICENSE-2.0)
/bd{bind def}bind def
/ld{load def}bd
/GR/grestore ld
/GS/gsave ld
/RM/rmoveto ld
/C/curveto ld
/t/show ld
/L/lineto ld
/ML/setmiterlimit ld
/CT/concat ld
/f/fill ld
/N/newpath ld
/S/stroke ld
/CC/setcmykcolor ld
/A/ashow ld
/cp/closepath ld
/RC/setrgbcolor ld
/LJ/setlinejoin ld
/GC/setgray ld
/LW/setlinewidth ld
/M/moveto ld
/re {4 2 roll M
1 index 0 rlineto
0 exch rlineto
neg 0 rlineto
cp } bd
/_ctm matrix def
/_tm matrix def
/BT { _ctm currentmatrix pop matrix _tm copy pop 0 0 moveto } bd
/ET { _ctm setmatrix } bd
/iTm { _ctm setmatrix _tm concat } bd
/Tm { _tm astore pop iTm 0 0 moveto } bd
/ux 0.0 def
/uy 0.0 def
/F {
  /Tp exch def
  /Tf exch def
  Tf findfont Tp scalefont setfont
  /cf Tf def  /cs Tp def
} bd
/ULS {currentpoint /uy exch def /ux exch def} bd
/ULE {
  /Tcx currentpoint pop def
  gsave
  newpath
  cf findfont cs scalefont dup
  /FontMatrix get 0 get /Ts exch def /FontInfo get dup
  /UnderlinePosition get Ts mul /To exch def
  /UnderlineThickness get Ts mul /Tt exch def
  ux uy To add moveto  Tcx uy To add lineto
  Tt setlinewidth stroke
  grestore
} bd
/OLE {
  /Tcx currentpoint pop def
  gsave
  newpath
  cf findfont cs scalefont dup
  /FontMatrix get 0 get /Ts exch def /FontInfo get dup
  /UnderlinePosition get Ts mul /To exch def
  /UnderlineThickness get Ts mul /Tt exch def
  ux uy To add cs add moveto Tcx uy To add cs add lineto
  Tt setlinewidth stroke
  grestore
} bd
/SOE {
  /Tcx currentpoint pop def
  gsave
  newpath
  cf findfont cs scalefont dup
  /FontMatrix get 0 get /Ts exch def /FontInfo get dup
  /UnderlinePosition get Ts mul /To exch def
  /UnderlineThickness get Ts mul /Tt exch def
  ux uy To add cs 10 mul 26 idiv add moveto Tcx uy To add cs 10 mul 26 idiv add lineto
  Tt setlinewidth stroke
  grestore
} bd
/QT {
/Y22 exch store
/X22 exch store
/Y21 exch store
/X21 exch store
currentpoint
/Y21 load 2 mul add 3 div exch
/X21 load 2 mul add 3 div exch
/X21 load 2 mul /X22 load add 3 div
/Y21 load 2 mul /Y22 load add 3 div
/X22 load /Y22 load curveto
} bd
/SSPD {
dup length /d exch dict def
{
/v exch def
/k exch def
currentpagedevice k known {
/cpdv currentpagedevice k get def
v cpdv ne {
/upd false def
/nullv v type /nulltype eq def
/nullcpdv cpdv type /nulltype eq def
nullv nullcpdv or
{
/upd true def
} {
/sametype v type cpdv type eq def
sametype {
v type /arraytype eq {
/vlen v length def
/cpdvlen cpdv length def
vlen cpdvlen eq {
0 1 vlen 1 sub {
/i exch def
/obj v i get def
/cpdobj cpdv i get def
obj cpdobj ne {
/upd true def
exit
} if
} for
} {
/upd true def
} ifelse
} {
v type /dicttype eq {
v {
/dv exch def
/dk exch def
/cpddv cpdv dk get def
dv cpddv ne {
/upd true def
exit
} if
} forall
} {
/upd true def
} ifelse
} ifelse
} if
} ifelse
upd true eq {
d k v put
} if
} if
} if
} forall
d length 0 gt {
d setpagedevice
} if
} bd
/RE { % /NewFontName [NewEncodingArray] /FontName RE -
  findfont dup length dict begin
  {
    1 index /FID ne
    {def} {pop pop} ifelse
  } forall
  /Encoding exch def
  /FontName 1 index def
  currentdict definefont pop
  end
} bind def
%%EndResource
%%BeginResource: procset (Apache XML Graphics EPS ProcSet) 1.0 0
%%Version: 1.0 0
%%Copyright: (Copyright 2002-2003 The Apache Software Foundation. License terms: http://www.apache.org/licenses/LICENSE-2.0)
/BeginEPSF { %def
/b4_Inc_state save def         % Save state for cleanup
/dict_count countdictstack def % Count objects on dict stack
/op_count count 1 sub def      % Count objects on operand stack
userdict begin                 % Push userdict on dict stack
/showpage { } def              % Redefine showpage, { } = null proc
0 setgray 0 setlinecap         % Prepare graphics state
1 setlinewidth 0 setlinejoin
10 setmiterlimit [ ] 0 setdash newpath
/languagelevel where           % If level not equal to 1 then
{pop languagelevel             % set strokeadjust and
1 ne                           % overprint to their defaults.
{false setstrokeadjust false setoverprint
} if
} if
} bd
/EndEPSF { %def
count op_count sub {pop} repeat            % Clean up stacks
countdictstack dict_count sub {end} repeat
b4_Inc_state restore
} bd
%%EndResource
%FOPBeginFontDict
%%IncludeResource: font Courier-Oblique
%%IncludeResource: font Courier-BoldOblique
%%IncludeResource: font Courier-Bold
%%IncludeResource: font ZapfDingbats
%%IncludeResource: font Symbol
%%IncludeResource: font Helvetica
%%IncludeResource: font Helvetica-Oblique
%%IncludeResource: font Helvetica-Bold
%%IncludeResource: font Helvetica-BoldOblique
%%IncludeResource: font Times-Roman
%%IncludeResource: font Times-Italic
%%IncludeResource: font Times-Bold
%%IncludeResource: font Times-BoldItalic
%%IncludeResource: font Courier
%FOPEndFontDict
%%BeginResource: encoding WinAnsiEncoding
/WinAnsiEncoding [
/.notdef /.notdef /.notdef /.notdef /.notdef
/.notdef /.notdef /.notdef /.notdef /.notdef
/.notdef /.notdef /.notdef /.notdef /.notdef
/.notdef /.notdef /.notdef /.notdef /.notdef
/.notdef /.notdef /.notdef /.notdef /.notdef
/.notdef /.notdef /.notdef /.notdef /.notdef
/.notdef /.notdef /space /exclam /quotedbl
/numbersign /dollar /percent /ampersand /quotesingle
/parenleft /parenright /asterisk /plus /comma
/hyphen /period /slash /zero /one
/two /three /four /five /six
/seven /eight /nine /colon /semicolon
/less /equal /greater /question /at
/A /B /C /D /E
/F /G /H /I /J
/K /L /M /N /O
/P /Q /R /S /T
/U /V /W /X /Y
/Z /bracketleft /backslash /bracketright /asciicircum
/underscore /quoteleft /a /b /c
/d /e /f /g /h
/i /j /k /l /m
/n /o /p /q /r
/s /t /u /v /w
/x /y /z /braceleft /bar
/braceright /asciitilde /bullet /Euro /bullet
/quotesinglbase /florin /quotedblbase /ellipsis /dagger
/daggerdbl /circumflex /perthousand /Scaron /guilsinglleft
/OE /bullet /Zcaron /bullet /bullet
/quoteleft /quoteright /quotedblleft /quotedblright /bullet
/endash /emdash /asciitilde /trademark /scaron
/guilsinglright /oe /bullet /zcaron /Ydieresis
/space /exclamdown /cent /sterling /currency
/yen /brokenbar /section /dieresis /copyright
/ordfeminine /guillemotleft /logicalnot /sfthyphen /registered
/macron /degree /plusminus /twosuperior /threesuperior
/acute /mu /paragraph /middot /cedilla
/onesuperior /ordmasculine /guillemotright /onequarter /onehalf
/threequarters /questiondown /Agrave /Aacute /Acircumflex
/Atilde /Adieresis /Aring /AE /Ccedilla
/Egrave /Eacute /Ecircumflex /Edieresis /Igrave
/Iacute /Icircumflex /Idieresis /Eth /Ntilde
/Ograve /Oacute /Ocircumflex /Otilde /Odieresis
/multiply /Oslash /Ugrave /Uacute /Ucircumflex
/Udieresis /Yacute /Thorn /germandbls /agrave
/aacute /acircumflex /atilde /adieresis /aring
/ae /ccedilla /egrave /eacute /ecircumflex
/edieresis /igrave /iacute /icircumflex /idieresis
/eth /ntilde /ograve /oacute /ocircumflex
/otilde /odieresis /divide /oslash /ugrave
/uacute /ucircumflex /udieresis /yacute /thorn
/ydieresis
] def
%%EndResource
%FOPBeginFontReencode
/Courier-Oblique findfont
dup length dict begin
  {1 index /FID ne {def} {pop pop} ifelse} forall
  /Encoding WinAnsiEncoding def
  currentdict
end
/Courier-Oblique exch definefont pop
/Courier-BoldOblique findfont
dup length dict begin
  {1 index /FID ne {def} {pop pop} ifelse} forall
  /Encoding WinAnsiEncoding def
  currentdict
end
/Courier-BoldOblique exch definefont pop
/Courier-Bold findfont
dup length dict begin
  {1 index /FID ne {def} {pop pop} ifelse} forall
  /Encoding WinAnsiEncoding def
  currentdict
end
/Courier-Bold exch definefont pop
/Helvetica findfont
dup length dict begin
  {1 index /FID ne {def} {pop pop} ifelse} forall
  /Encoding WinAnsiEncoding def
  currentdict
end
/Helvetica exch definefont pop
/Helvetica-Oblique findfont
dup length dict begin
  {1 index /FID ne {def} {pop pop} ifelse} forall
  /Encoding WinAnsiEncoding def
  currentdict
end
/Helvetica-Oblique exch definefont pop
/Helvetica-Bold findfont
dup length dict begin
  {1 index /FID ne {def} {pop pop} ifelse} forall
  /Encoding WinAnsiEncoding def
  currentdict
end
/Helvetica-Bold exch definefont pop
/Helvetica-BoldOblique findfont
dup length dict begin
  {1 index /FID ne {def} {pop pop} ifelse} forall
  /Encoding WinAnsiEncoding def
  currentdict
end
/Helvetica-BoldOblique exch definefont pop
/Times-Roman findfont
dup length dict begin
  {1 index /FID ne {def} {pop pop} ifelse} forall
  /Encoding WinAnsiEncoding def
  currentdict
end
/Times-Roman exch definefont pop
/Times-Italic findfont
dup length dict begin
  {1 index /FID ne {def} {pop pop} ifelse} forall
  /Encoding WinAnsiEncoding def
  currentdict
end
/Times-Italic exch definefont pop
/Times-Bold findfont
dup length dict begin
  {1 index /FID ne {def} {pop pop} ifelse} forall
  /Encoding WinAnsiEncoding def
  currentdict
end
/Times-Bold exch definefont pop
/Times-BoldItalic findfont
dup length dict begin
  {1 index /FID ne {def} {pop pop} ifelse} forall
  /Encoding WinAnsiEncoding def
  currentdict
end
/Times-BoldItalic exch definefont pop
/Courier findfont
dup length dict begin
  {1 index /FID ne {def} {pop pop} ifelse} forall
  /Encoding WinAnsiEncoding def
  currentdict
end
/Courier exch definefont pop
%FOPEndFontReencode
%%EndProlog
%%Page: 1 1
%%PageBoundingBox: 0 0 198 283
%%BeginPageSetup
[1 0 0 -1 0 283] CT
%%EndPageSetup
GS
[1.00215 0 0 1 0 0] CT
1 GC
N
0 0 198 283 re
f
GR
GS
[1.00215 0 0 1 0 0] CT
1 GC
N
0 0 198 283 re
f
GR
GS
[1.00215 0 0 1 0 0] CT
1 GC
N
69 228 M
179 228 L
179 32 L
69 32 L
cp
f
GR
GS
[1.00215 0 0 1 0 0] CT
0.149 GC
2 setlinecap
1 LJ
0.5 LW
N
69 228 M
179 228 L
S
GR
GS
[1.00215 0 0 1 0 0] CT
0.149 GC
2 setlinecap
1 LJ
0.5 LW
N
102 228 M
102 226.04 L
S
GR
GS
[1.00215 0 0 1 0 0] CT
0.149 GC
2 setlinecap
1 LJ
0.5 LW
N
146 228 M
146 226.04 L
S
GR
GS
[1.00215 0 0 1 102.21904 234] CT
0.149 GC
/Helvetica 20 F
GS
[1 0 0 1 0 0] CT
-13 20 moveto 
1 -1 scale
(YA) t 
GR
GR
GS
[1.00215 0 0 1 146.31353 234] CT
0.149 GC
/Helvetica 20 F
GS
[1 0 0 1 0 0] CT
-14.5 20 moveto 
1 -1 scale
(OA) t 
GR
GR
GS
[1.00215 0 0 1 124.26634 259] CT
0.149 GC
/Helvetica 20 F
GS
[1 0 0 1 0 0] CT
-49 20 moveto 
1 -1 scale
(Age Group) t 
GR
GR
GS
[1.00215 0 0 1 0 0] CT
0.149 GC
2 setlinecap
1 LJ
0.5 LW
N
69 228 M
69 32 L
S
GR
GS
[1.00215 0 0 1 0 0] CT
0.149 GC
2 setlinecap
1 LJ
0.5 LW
N
69 228 M
70.96 228 L
S
GR
GS
[1.00215 0 0 1 0 0] CT
0.149 GC
2 setlinecap
1 LJ
0.5 LW
N
69 179 M
70.96 179 L
S
GR
GS
[1.00215 0 0 1 0 0] CT
0.149 GC
2 setlinecap
1 LJ
0.5 LW
N
69 130 M
70.96 130 L
S
GR
GS
[1.00215 0 0 1 0 0] CT
0.149 GC
2 setlinecap
1 LJ
0.5 LW
N
69 81 M
70.96 81 L
S
GR
GS
[1.00215 0 0 1 0 0] CT
0.149 GC
2 setlinecap
1 LJ
0.5 LW
N
69 32 M
70.96 32 L
S
GR
GS
[1.00215 0 0 1 63.13529 228] CT
0.149 GC
/Helvetica 20 F
GS
[1 0 0 1 0 0] CT
-36 7.5 moveto 
1 -1 scale
(-0.1) t 
GR
GR
GS
[1.00215 0 0 1 63.13529 179] CT
0.149 GC
/Helvetica 20 F
GS
[1 0 0 1 0 0] CT
-12 7.5 moveto 
1 -1 scale
(0) t 
GR
GR
GS
[1.00215 0 0 1 63.13529 130] CT
0.149 GC
/Helvetica 20 F
GS
[1 0 0 1 0 0] CT
-28 7.5 moveto 
1 -1 scale
(0.1) t 
GR
GR
GS
[1.00215 0 0 1 63.13529 81] CT
0.149 GC
/Helvetica 20 F
GS
[1 0 0 1 0 0] CT
-28 7.5 moveto 
1 -1 scale
(0.2) t 
GR
GR
GS
[1.00215 0 0 1 63.13529 31.99999] CT
0.149 GC
/Helvetica 20 F
GS
[1 0 0 1 0 0] CT
-28 7.5 moveto 
1 -1 scale
(0.3) t 
GR
GR
GS
[0 -1 1.00215 0 24.05154 129.99991] CT
0.149 GC
/Helvetica 20 F
GS
[1 0 0 1 0 0] CT
-69 -5 moveto 
1 -1 scale
(threshold linear) t 
GR
GR
GS
[1.00215 0 0 1 124.26641 29.24999] CT
/Helvetica-Bold 22 F
GS
[1 0 0 1 0 0] CT
-41 -5 moveto 
1 -1 scale
(p = 0.41) t 
GR
GR
GS
[1.00215 0 0 1 0 0] CT
0.149 GC
1 LJ
0.5 LW
N
69 179 M
179 179 L
S
GR
GS
[1.00215 0 0 1 0 0] CT
1 0.6 0.6 RC
N
119.6 179 M
119.6 116.035 L
84.4 116.035 L
84.4 179 L
cp
f
GR
GS
[1.00215 0 0 1 106.16092 105.63482] CT
0.302 GC
N
2.236 0 M
2.236 -1.235 1.235 -2.236 0 -2.236 C
-1.235 -2.236 -2.236 -1.235 -2.236 0 C
-2.236 1.235 -1.235 2.236 0 2.236 C
1.235 2.236 2.236 1.235 2.236 0 C
cp
f
GR
GS
[1.00215 0 0 1 95.21052 95.95368] CT
0.302 GC
N
/f-1586420743{2.236 0 M
2.236 -1.235 1.235 -2.236 0 -2.236 C
-1.235 -2.236 -2.236 -1.235 -2.236 0 C
-2.236 1.235 -1.235 2.236 0 2.236 C
1.235 2.236 2.236 1.235 2.236 0 C
cp}def
f-1586420743
f
GR
GS
[1.00215 0 0 1 103.74422 143.575] CT
0.302 GC
N
f-1586420743
f
GR
GS
[1.00215 0 0 1 105.27255 120.85973] CT
0.302 GC
N
f-1586420743
f
GR
GS
[1.00215 0 0 1 107.7954 111.10236] CT
0.302 GC
N
f-1586420743
f
GR
GS
[1.00215 0 0 1 96.22452 101.19385] CT
0.302 GC
N
f-1586420743
f
GR
GS
[1.00215 0 0 1 101.32817 151.86183] CT
0.302 GC
N
f-1586420743
f
GR
GS
[1.00215 0 0 1 101.04901 96.48184] CT
0.302 GC
N
f-1586420743
f
GR
GS
[1.00215 0 0 1 105.7842 177.02963] CT
0.302 GC
N
f-1586420743
f
GR
GS
[1.00215 0 0 1 98.79685 121.98481] CT
0.302 GC
N
f-1586420743
f
GR
GS
[1.00215 0 0 1 100.86199 137.99402] CT
0.302 GC
N
f-1586420743
f
GR
GS
[1.00215 0 0 1 100.33319 109.3339] CT
0.302 GC
N
f-1586420743
f
GR
GS
[1.00215 0 0 1 93.91093 174.06493] CT
0.302 GC
N
f-1586420743
f
GR
GS
[1.00215 0 0 1 103.34748 126.4354] CT
0.302 GC
N
f-1586420743
f
GR
GS
[1.00215 0 0 1 104.26678 134.81961] CT
0.302 GC
N
f-1586420743
f
GR
GS
[1.00215 0 0 1 104.64659 139.56549] CT
0.302 GC
N
f-1586420743
f
GR
GS
[1.00215 0 0 1 102.47572 134.46053] CT
0.302 GC
N
f-1586420743
f
GR
GS
[1.00215 0 0 1 95.49717 118.0985] CT
0.302 GC
N
f-1586420743
f
GR
GS
[1.00215 0 0 1 109.27688 71.88177] CT
0.302 GC
N
f-1586420743
f
GR
GS
[1.00215 0 0 1 109.95963 71.26245] CT
0.302 GC
N
f-1586420743
f
GR
GS
[1.00215 0 0 1 106.45523 124.77682] CT
0.302 GC
N
f-1586420743
f
GR
GS
[1.00215 0 0 1 98.76261 84.27151] CT
0.302 GC
N
f-1586420743
f
GR
GS
[1.00215 0 0 1 105.49603 126.42425] CT
0.302 GC
N
f-1586420743
f
GR
GS
[1.00215 0 0 1 105.61833 137.36566] CT
0.302 GC
N
f-1586420743
f
GR
GS
[1.00215 0 0 1 105.59368 89.9687] CT
0.302 GC
N
f-1586420743
f
GR
GS
[1.00215 0 0 1 101.33578 129.07101] CT
0.302 GC
N
f-1586420743
f
GR
GS
[1.00215 0 0 1 95.03447 146.08766] CT
0.302 GC
N
f-1586420743
f
GR
GS
[1.00215 0 0 1 97.06333 79.15803] CT
0.302 GC
N
f-1586420743
f
GR
GS
[1.00215 0 0 1 96.04145 83.40077] CT
0.302 GC
N
f-1586420743
f
GR
GS
[1.00215 0 0 1 97.12867 98.34479] CT
0.302 GC
N
f-1586420743
f
GR
GS
[1.00215 0 0 1 95.79021 112.18533] CT
0.302 GC
N
f-1586420743
f
GR
GS
[1.00215 0 0 1 105.49105 52.34164] CT
0.302 GC
N
f-1586420743
f
GR
GS
[1.00215 0 0 1 108.18933 52.34164] CT
0.302 GC
N
f-1586420743
f
GR
GS
[1.00215 0 0 1 105.85239 101.43631] CT
0.302 GC
N
f-1586420743
f
GR
GS
[1.00215 0 0 1 106.17076 116.99046] CT
0.302 GC
N
f-1586420743
f
GR
GS
[1.00215 0 0 1 96.78289 113.50033] CT
0.302 GC
N
f-1586420743
f
GR
GS
[1.00215 0 0 1 110.75975 131.71417] CT
0.302 GC
N
f-1586420743
f
GR
GS
[1.00215 0 0 1 109.80235 125.14561] CT
0.302 GC
N
f-1586420743
f
GR
GS
[1.00215 0 0 1 105.74408 113.81627] CT
0.302 GC
N
f-1586420743
f
GR
GS
[1.00215 0 0 1 98.79588 121.64082] CT
0.302 GC
N
f-1586420743
f
GR
GS
[1.00215 0 0 1 105.20581 132.33932] CT
0.302 GC
N
f-1586420743
f
GR
GS
[1.00215 0 0 1 100.75075 157.54138] CT
0.302 GC
N
f-1586420743
f
GR
GS
[1.00215 0 0 1 0 0] CT
1 0.6 0.6 RC
N
/f-1871538106{163.6 179 M
163.6 121.414 L
128.4 121.414 L
128.4 179 L
cp}def
f-1871538106
f
GR
GS
[1.00215 0 0 1 150.1663 124.89307] CT
0.302 GC
N
f-1586420743
f
GR
GS
[1.00215 0 0 1 149.72005 77.36446] CT
0.302 GC
N
f-1586420743
f
GR
GS
[1.00215 0 0 1 148.45068 163.11684] CT
0.302 GC
N
f-1586420743
f
GR
GS
[1.00215 0 0 1 150.94642 178.00233] CT
0.302 GC
N
f-1586420743
f
GR
GS
[1.00215 0 0 1 145.48598 73.64252] CT
0.302 GC
N
f-1586420743
f
GR
GS
[1.00215 0 0 1 142.59781 140.89357] CT
0.302 GC
N
f-1586420743
f
GR
GS
[1.00215 0 0 1 153.27769 78.90614] CT
0.302 GC
N
f-1586420743
f
GR
GS
[1.00215 0 0 1 146.41686 144.5358] CT
0.302 GC
N
f-1586420743
f
GR
GS
[1.00215 0 0 1 152.30902 76.55812] CT
0.302 GC
N
f-1586420743
f
GR
GS
[1.00215 0 0 1 146.8499 124.14412] CT
0.302 GC
N
f-1586420743
f
GR
GS
[1.00215 0 0 1 146.54537 148.7457] CT
0.302 GC
N
f-1586420743
f
GR
GS
[1.00215 0 0 1 142.87417 158.57861] CT
0.302 GC
N
f-1586420743
f
GR
GS
[1.00215 0 0 1 143.92322 116.02421] CT
0.302 GC
N
f-1586420743
f
GR
GS
[1.00215 0 0 1 137.89616 117.0267] CT
0.302 GC
N
f-1586420743
f
GR
GS
[1.00215 0 0 1 149.16365 93.38789] CT
0.302 GC
N
f-1586420743
f
GR
GS
[1.00215 0 0 1 137.65169 77.36649] CT
0.302 GC
N
f-1586420743
f
GR
GS
[1.00215 0 0 1 147.0608 67.53818] CT
0.302 GC
N
f-1586420743
f
GR
GS
[1.00215 0 0 1 152.02927 90.74143] CT
0.302 GC
N
f-1586420743
f
GR
GS
[1.00215 0 0 1 140.31926 157.2173] CT
0.302 GC
N
f-1586420743
f
GR
GS
[1.00215 0 0 1 153.75755 189.78442] CT
0.302 GC
N
f-1586420743
f
GR
GS
[1.00215 0 0 1 142.89507 92.03159] CT
0.302 GC
N
f-1586420743
f
GR
GS
[1.00215 0 0 1 147.9302 88.98867] CT
0.302 GC
N
f-1586420743
f
GR
GS
[1.00215 0 0 1 139.88187 172.27676] CT
0.302 GC
N
f-1586420743
f
GR
GS
[1.00215 0 0 1 148.1599 117.88617] CT
0.302 GC
N
f-1586420743
f
GR
GS
[1.00215 0 0 1 141.2089 95.21004] CT
0.302 GC
N
f-1586420743
f
GR
GS
[1.00215 0 0 1 153.44428 173.67404] CT
0.302 GC
N
f-1586420743
f
GR
GS
[1.00215 0 0 1 144.88285 96.86241] CT
0.302 GC
N
f-1586420743
f
GR
GS
[1.00215 0 0 1 152.52221 104.89755] CT
0.302 GC
N
f-1586420743
f
GR
GS
[1.00215 0 0 1 149.27234 135.21927] CT
0.302 GC
N
f-1586420743
f
GR
GS
[1.00215 0 0 1 153.20785 87.00702] CT
0.302 GC
N
f-1586420743
f
GR
GS
[1.00215 0 0 1 147.18994 137.68611] CT
0.302 GC
N
f-1586420743
f
GR
GS
[1.00215 0 0 1 142.8557 87.39318] CT
0.302 GC
N
f-1586420743
f
GR
GS
[1.00215 0 0 1 142.59449 166.09274] CT
0.302 GC
N
f-1586420743
f
GR
GS
[1.00215 0 0 1 149.13776 125.49804] CT
0.302 GC
N
f-1586420743
f
GR
GS
[1.00215 0 0 1 146.94287 134.09897] CT
0.302 GC
N
f-1586420743
f
GR
GS
[1.00215 0 0 1 150.70053 115.64445] CT
0.302 GC
N
f-1586420743
f
GR
GS
[1.00215 0 0 1 149.64714 125.547] CT
0.302 GC
N
f-1586420743
f
GR
GS
[1.00215 0 0 1 138.68011 154.56665] CT
0.302 GC
N
f-1586420743
f
GR
GS
[1.00215 0 0 1 146.42692 106.7708] CT
0.302 GC
N
f-1586420743
f
GR
GS
[1.00215 0 0 1 154.14307 130.93785] CT
0.302 GC
N
f-1586420743
f
GR
GS
[1.00215 0 0 1 140.02977 157.36319] CT
0.302 GC
N
f-1586420743
f
GR
GS
[1.00215 0 0 1 141.35937 193.27721] CT
0.302 GC
N
f-1586420743
f
GR
GS
[1.00215 0 0 1 138.27361 95.96067] CT
0.302 GC
N
f-1586420743
f
GR
GS
[1.00215 0 0 1 138.57665 119.50982] CT
0.302 GC
N
f-1586420743
f
GR
GS
[1.00215 0 0 1 139.7179 117.37747] CT
0.302 GC
N
f-1586420743
f
GR
GS
[1.00215 0 0 1 154.02864 103.26062] CT
0.302 GC
N
f-1586420743
f
GR
GS
[1.00215 0 0 1 147.50366 139.01669] CT
0.302 GC
N
f-1586420743
f
GR
GS
[1.00215 0 0 1 145.49314 72.87926] CT
0.302 GC
N
f-1586420743
f
GR
GS
[1.00215 0 0 1 138.17243 100.00609] CT
0.302 GC
N
f-1586420743
f
GR
GS
[1.00215 0 0 1 150.02857 73.67735] CT
0.302 GC
N
f-1586420743
f
GR
GS
[1.00215 0 0 1 142.81964 112.6132] CT
0.302 GC
N
f-1586420743
f
GR
GS
[1.00215 0 0 1 140.89381 146.54942] CT
0.302 GC
N
f-1586420743
f
GR
GS
[1.00215 0 0 1 142.52659 156.68246] CT
0.302 GC
N
f-1586420743
f
GR
%%Trailer
%%Pages: 1
%%EOF
