%!PS-Adobe-3.0 EPSF-3.0
%%Creator: (MATLAB, The Mathworks, Inc. Version 9.8.0.1323502 \(R2020a\). Operating System: Mac OS X)
%%Title: /Users/kosciessa/Desktop/mntTardisLNDG/LNDG/stateswitch/stsw_multimodal/figures/l1byage/l1comp_sampen.eps
%%CreationDate: 2022-03-02T14:36:47
%%Pages: (atend)
%%BoundingBox:     4     0   180   275
%%LanguageLevel: 3
%%EndComments
%%BeginProlog
%%BeginResource: procset (Apache XML Graphics Std ProcSet) 1.2 0
%%Version: 1.2 0
%%Copyright: (Copyright 2001-2003,2010 The Apache Software Foundation. License terms: http://www.apache.org/licenses/LICENSE-2.0)
/bd{bind def}bind def
/ld{load def}bd
/GR/grestore ld
/GS/gsave ld
/RM/rmoveto ld
/C/curveto ld
/t/show ld
/L/lineto ld
/ML/setmiterlimit ld
/CT/concat ld
/f/fill ld
/N/newpath ld
/S/stroke ld
/CC/setcmykcolor ld
/A/ashow ld
/cp/closepath ld
/RC/setrgbcolor ld
/LJ/setlinejoin ld
/GC/setgray ld
/LW/setlinewidth ld
/M/moveto ld
/re {4 2 roll M
1 index 0 rlineto
0 exch rlineto
neg 0 rlineto
cp } bd
/_ctm matrix def
/_tm matrix def
/BT { _ctm currentmatrix pop matrix _tm copy pop 0 0 moveto } bd
/ET { _ctm setmatrix } bd
/iTm { _ctm setmatrix _tm concat } bd
/Tm { _tm astore pop iTm 0 0 moveto } bd
/ux 0.0 def
/uy 0.0 def
/F {
  /Tp exch def
  /Tf exch def
  Tf findfont Tp scalefont setfont
  /cf Tf def  /cs Tp def
} bd
/ULS {currentpoint /uy exch def /ux exch def} bd
/ULE {
  /Tcx currentpoint pop def
  gsave
  newpath
  cf findfont cs scalefont dup
  /FontMatrix get 0 get /Ts exch def /FontInfo get dup
  /UnderlinePosition get Ts mul /To exch def
  /UnderlineThickness get Ts mul /Tt exch def
  ux uy To add moveto  Tcx uy To add lineto
  Tt setlinewidth stroke
  grestore
} bd
/OLE {
  /Tcx currentpoint pop def
  gsave
  newpath
  cf findfont cs scalefont dup
  /FontMatrix get 0 get /Ts exch def /FontInfo get dup
  /UnderlinePosition get Ts mul /To exch def
  /UnderlineThickness get Ts mul /Tt exch def
  ux uy To add cs add moveto Tcx uy To add cs add lineto
  Tt setlinewidth stroke
  grestore
} bd
/SOE {
  /Tcx currentpoint pop def
  gsave
  newpath
  cf findfont cs scalefont dup
  /FontMatrix get 0 get /Ts exch def /FontInfo get dup
  /UnderlinePosition get Ts mul /To exch def
  /UnderlineThickness get Ts mul /Tt exch def
  ux uy To add cs 10 mul 26 idiv add moveto Tcx uy To add cs 10 mul 26 idiv add lineto
  Tt setlinewidth stroke
  grestore
} bd
/QT {
/Y22 exch store
/X22 exch store
/Y21 exch store
/X21 exch store
currentpoint
/Y21 load 2 mul add 3 div exch
/X21 load 2 mul add 3 div exch
/X21 load 2 mul /X22 load add 3 div
/Y21 load 2 mul /Y22 load add 3 div
/X22 load /Y22 load curveto
} bd
/SSPD {
dup length /d exch dict def
{
/v exch def
/k exch def
currentpagedevice k known {
/cpdv currentpagedevice k get def
v cpdv ne {
/upd false def
/nullv v type /nulltype eq def
/nullcpdv cpdv type /nulltype eq def
nullv nullcpdv or
{
/upd true def
} {
/sametype v type cpdv type eq def
sametype {
v type /arraytype eq {
/vlen v length def
/cpdvlen cpdv length def
vlen cpdvlen eq {
0 1 vlen 1 sub {
/i exch def
/obj v i get def
/cpdobj cpdv i get def
obj cpdobj ne {
/upd true def
exit
} if
} for
} {
/upd true def
} ifelse
} {
v type /dicttype eq {
v {
/dv exch def
/dk exch def
/cpddv cpdv dk get def
dv cpddv ne {
/upd true def
exit
} if
} forall
} {
/upd true def
} ifelse
} ifelse
} if
} ifelse
upd true eq {
d k v put
} if
} if
} if
} forall
d length 0 gt {
d setpagedevice
} if
} bd
/RE { % /NewFontName [NewEncodingArray] /FontName RE -
  findfont dup length dict begin
  {
    1 index /FID ne
    {def} {pop pop} ifelse
  } forall
  /Encoding exch def
  /FontName 1 index def
  currentdict definefont pop
  end
} bind def
%%EndResource
%%BeginResource: procset (Apache XML Graphics EPS ProcSet) 1.0 0
%%Version: 1.0 0
%%Copyright: (Copyright 2002-2003 The Apache Software Foundation. License terms: http://www.apache.org/licenses/LICENSE-2.0)
/BeginEPSF { %def
/b4_Inc_state save def         % Save state for cleanup
/dict_count countdictstack def % Count objects on dict stack
/op_count count 1 sub def      % Count objects on operand stack
userdict begin                 % Push userdict on dict stack
/showpage { } def              % Redefine showpage, { } = null proc
0 setgray 0 setlinecap         % Prepare graphics state
1 setlinewidth 0 setlinejoin
10 setmiterlimit [ ] 0 setdash newpath
/languagelevel where           % If level not equal to 1 then
{pop languagelevel             % set strokeadjust and
1 ne                           % overprint to their defaults.
{false setstrokeadjust false setoverprint
} if
} if
} bd
/EndEPSF { %def
count op_count sub {pop} repeat            % Clean up stacks
countdictstack dict_count sub {end} repeat
b4_Inc_state restore
} bd
%%EndResource
%FOPBeginFontDict
%%IncludeResource: font Courier-Oblique
%%IncludeResource: font Courier-BoldOblique
%%IncludeResource: font Courier-Bold
%%IncludeResource: font ZapfDingbats
%%IncludeResource: font Symbol
%%IncludeResource: font Helvetica
%%IncludeResource: font Helvetica-Oblique
%%IncludeResource: font Helvetica-Bold
%%IncludeResource: font Helvetica-BoldOblique
%%IncludeResource: font Times-Roman
%%IncludeResource: font Times-Italic
%%IncludeResource: font Times-Bold
%%IncludeResource: font Times-BoldItalic
%%IncludeResource: font Courier
%FOPEndFontDict
%%BeginResource: encoding WinAnsiEncoding
/WinAnsiEncoding [
/.notdef /.notdef /.notdef /.notdef /.notdef
/.notdef /.notdef /.notdef /.notdef /.notdef
/.notdef /.notdef /.notdef /.notdef /.notdef
/.notdef /.notdef /.notdef /.notdef /.notdef
/.notdef /.notdef /.notdef /.notdef /.notdef
/.notdef /.notdef /.notdef /.notdef /.notdef
/.notdef /.notdef /space /exclam /quotedbl
/numbersign /dollar /percent /ampersand /quotesingle
/parenleft /parenright /asterisk /plus /comma
/hyphen /period /slash /zero /one
/two /three /four /five /six
/seven /eight /nine /colon /semicolon
/less /equal /greater /question /at
/A /B /C /D /E
/F /G /H /I /J
/K /L /M /N /O
/P /Q /R /S /T
/U /V /W /X /Y
/Z /bracketleft /backslash /bracketright /asciicircum
/underscore /quoteleft /a /b /c
/d /e /f /g /h
/i /j /k /l /m
/n /o /p /q /r
/s /t /u /v /w
/x /y /z /braceleft /bar
/braceright /asciitilde /bullet /Euro /bullet
/quotesinglbase /florin /quotedblbase /ellipsis /dagger
/daggerdbl /circumflex /perthousand /Scaron /guilsinglleft
/OE /bullet /Zcaron /bullet /bullet
/quoteleft /quoteright /quotedblleft /quotedblright /bullet
/endash /emdash /asciitilde /trademark /scaron
/guilsinglright /oe /bullet /zcaron /Ydieresis
/space /exclamdown /cent /sterling /currency
/yen /brokenbar /section /dieresis /copyright
/ordfeminine /guillemotleft /logicalnot /sfthyphen /registered
/macron /degree /plusminus /twosuperior /threesuperior
/acute /mu /paragraph /middot /cedilla
/onesuperior /ordmasculine /guillemotright /onequarter /onehalf
/threequarters /questiondown /Agrave /Aacute /Acircumflex
/Atilde /Adieresis /Aring /AE /Ccedilla
/Egrave /Eacute /Ecircumflex /Edieresis /Igrave
/Iacute /Icircumflex /Idieresis /Eth /Ntilde
/Ograve /Oacute /Ocircumflex /Otilde /Odieresis
/multiply /Oslash /Ugrave /Uacute /Ucircumflex
/Udieresis /Yacute /Thorn /germandbls /agrave
/aacute /acircumflex /atilde /adieresis /aring
/ae /ccedilla /egrave /eacute /ecircumflex
/edieresis /igrave /iacute /icircumflex /idieresis
/eth /ntilde /ograve /oacute /ocircumflex
/otilde /odieresis /divide /oslash /ugrave
/uacute /ucircumflex /udieresis /yacute /thorn
/ydieresis
] def
%%EndResource
%FOPBeginFontReencode
/Courier-Oblique findfont
dup length dict begin
  {1 index /FID ne {def} {pop pop} ifelse} forall
  /Encoding WinAnsiEncoding def
  currentdict
end
/Courier-Oblique exch definefont pop
/Courier-BoldOblique findfont
dup length dict begin
  {1 index /FID ne {def} {pop pop} ifelse} forall
  /Encoding WinAnsiEncoding def
  currentdict
end
/Courier-BoldOblique exch definefont pop
/Courier-Bold findfont
dup length dict begin
  {1 index /FID ne {def} {pop pop} ifelse} forall
  /Encoding WinAnsiEncoding def
  currentdict
end
/Courier-Bold exch definefont pop
/Helvetica findfont
dup length dict begin
  {1 index /FID ne {def} {pop pop} ifelse} forall
  /Encoding WinAnsiEncoding def
  currentdict
end
/Helvetica exch definefont pop
/Helvetica-Oblique findfont
dup length dict begin
  {1 index /FID ne {def} {pop pop} ifelse} forall
  /Encoding WinAnsiEncoding def
  currentdict
end
/Helvetica-Oblique exch definefont pop
/Helvetica-Bold findfont
dup length dict begin
  {1 index /FID ne {def} {pop pop} ifelse} forall
  /Encoding WinAnsiEncoding def
  currentdict
end
/Helvetica-Bold exch definefont pop
/Helvetica-BoldOblique findfont
dup length dict begin
  {1 index /FID ne {def} {pop pop} ifelse} forall
  /Encoding WinAnsiEncoding def
  currentdict
end
/Helvetica-BoldOblique exch definefont pop
/Times-Roman findfont
dup length dict begin
  {1 index /FID ne {def} {pop pop} ifelse} forall
  /Encoding WinAnsiEncoding def
  currentdict
end
/Times-Roman exch definefont pop
/Times-Italic findfont
dup length dict begin
  {1 index /FID ne {def} {pop pop} ifelse} forall
  /Encoding WinAnsiEncoding def
  currentdict
end
/Times-Italic exch definefont pop
/Times-Bold findfont
dup length dict begin
  {1 index /FID ne {def} {pop pop} ifelse} forall
  /Encoding WinAnsiEncoding def
  currentdict
end
/Times-Bold exch definefont pop
/Times-BoldItalic findfont
dup length dict begin
  {1 index /FID ne {def} {pop pop} ifelse} forall
  /Encoding WinAnsiEncoding def
  currentdict
end
/Times-BoldItalic exch definefont pop
/Courier findfont
dup length dict begin
  {1 index /FID ne {def} {pop pop} ifelse} forall
  /Encoding WinAnsiEncoding def
  currentdict
end
/Courier exch definefont pop
%FOPEndFontReencode
%%EndProlog
%%Page: 1 1
%%PageBoundingBox: 0 0 198 283
%%BeginPageSetup
[1 0 0 -1 0 283] CT
%%EndPageSetup
GS
[1.00215 0 0 1 0 0] CT
1 GC
N
0 0 198 283 re
f
GR
GS
[1.00215 0 0 1 0 0] CT
1 GC
N
0 0 198 283 re
f
GR
GS
[1.00215 0 0 1 0 0] CT
1 GC
N
61 228 M
179 228 L
179 32 L
61 32 L
cp
f
GR
GS
[1.00215 0 0 1 0 0] CT
0.149 GC
2 setlinecap
1 LJ
0.5 LW
N
61 228 M
179 228 L
S
GR
GS
[1.00215 0 0 1 0 0] CT
0.149 GC
2 setlinecap
1 LJ
0.5 LW
N
96.4 228 M
96.4 226.04 L
S
GR
GS
[1.00215 0 0 1 0 0] CT
0.149 GC
2 setlinecap
1 LJ
0.5 LW
N
143.6 228 M
143.6 226.04 L
S
GR
GS
[1.00215 0 0 1 96.60702 234] CT
0.149 GC
/Helvetica 20 F
GS
[1 0 0 1 0 0] CT
-13 20 moveto 
1 -1 scale
(YA) t 
GR
GR
GS
[1.00215 0 0 1 143.90838 234] CT
0.149 GC
/Helvetica 20 F
GS
[1 0 0 1 0 0] CT
-14.5 20 moveto 
1 -1 scale
(OA) t 
GR
GR
GS
[1.00215 0 0 1 120.25775 259] CT
0.149 GC
/Helvetica 20 F
GS
[1 0 0 1 0 0] CT
-49 20 moveto 
1 -1 scale
(Age Group) t 
GR
GR
GS
[1.00215 0 0 1 0 0] CT
0.149 GC
2 setlinecap
1 LJ
0.5 LW
N
61 228 M
61 32 L
S
GR
GS
[1.00215 0 0 1 0 0] CT
0.149 GC
2 setlinecap
1 LJ
0.5 LW
N
61 228 M
62.96 228 L
S
GR
GS
[1.00215 0 0 1 0 0] CT
0.149 GC
2 setlinecap
1 LJ
0.5 LW
N
61 188.8 M
62.96 188.8 L
S
GR
GS
[1.00215 0 0 1 0 0] CT
0.149 GC
2 setlinecap
1 LJ
0.5 LW
N
61 149.6 M
62.96 149.6 L
S
GR
GS
[1.00215 0 0 1 0 0] CT
0.149 GC
2 setlinecap
1 LJ
0.5 LW
N
61 110.4 M
62.96 110.4 L
S
GR
GS
[1.00215 0 0 1 0 0] CT
0.149 GC
2 setlinecap
1 LJ
0.5 LW
N
61 71.2 M
62.96 71.2 L
S
GR
GS
[1.00215 0 0 1 0 0] CT
0.149 GC
2 setlinecap
1 LJ
0.5 LW
N
61 32 M
62.96 32 L
S
GR
GS
[1.00215 0 0 1 55.11811 228] CT
0.149 GC
/Helvetica 20 F
GS
[1 0 0 1 0 0] CT
-12 7.5 moveto 
1 -1 scale
(0) t 
GR
GR
GS
[1.00215 0 0 1 55.11811 188.8] CT
0.149 GC
/Helvetica 20 F
GS
[1 0 0 1 0 0] CT
-28 7.5 moveto 
1 -1 scale
(0.5) t 
GR
GR
GS
[1.00215 0 0 1 55.11811 149.60001] CT
0.149 GC
/Helvetica 20 F
GS
[1 0 0 1 0 0] CT
-12 7.5 moveto 
1 -1 scale
(1) t 
GR
GR
GS
[1.00215 0 0 1 55.11811 110.4] CT
0.149 GC
/Helvetica 20 F
GS
[1 0 0 1 0 0] CT
-28 7.5 moveto 
1 -1 scale
(1.5) t 
GR
GR
GS
[1.00215 0 0 1 55.11811 71.2] CT
0.149 GC
/Helvetica 20 F
GS
[1 0 0 1 0 0] CT
-12 7.5 moveto 
1 -1 scale
(2) t 
GR
GR
GS
[1.00215 0 0 1 55.11811 32] CT
0.149 GC
/Helvetica 20 F
GS
[1 0 0 1 0 0] CT
-28 7.5 moveto 
1 -1 scale
(2.5) t 
GR
GR
GS
[0 -1 1.00215 0 24.05154 129.99991] CT
0.149 GC
/Helvetica 20 F
GS
[1 0 0 1 0 0] CT
-46.5 -5 moveto 
1 -1 scale
(sampen l1) t 
GR
GR
GS
[1.00215 0 0 1 120.25781 29.24999] CT
/Helvetica-Bold 22 F
GS
[1 0 0 1 0 0] CT
-41 -5 moveto 
1 -1 scale
(p = 0.04) t 
GR
GR
GS
[1.00215 0 0 1 0 0] CT
0.149 GC
1 LJ
0.5 LW
N
61 228 M
179 228 L
S
GR
GS
[1.00215 0 0 1 0 0] CT
1 0.6 0.6 RC
N
115.28 228 M
115.28 112.707 L
77.52 112.707 L
77.52 228 L
cp
f
GR
GS
[1.00215 0 0 1 104.64472 103.45937] CT
0.302 GC
N
2.236 0 M
2.236 -1.235 1.235 -2.236 0 -2.236 C
-1.235 -2.236 -2.236 -1.235 -2.236 0 C
-2.236 1.235 -1.235 2.236 0 2.236 C
1.235 2.236 2.236 1.235 2.236 0 C
cp
f
GR
GS
[1.00215 0 0 1 92.52939 122.55795] CT
0.302 GC
N
/f-1586420743{2.236 0 M
2.236 -1.235 1.235 -2.236 0 -2.236 C
-1.235 -2.236 -2.236 -1.235 -2.236 0 C
-2.236 1.235 -1.235 2.236 0 2.236 C
1.235 2.236 2.236 1.235 2.236 0 C
cp}def
f-1586420743
f
GR
GS
[1.00215 0 0 1 93.74126 112.56135] CT
0.302 GC
N
f-1586420743
f
GR
GS
[1.00215 0 0 1 94.88878 160.08105] CT
0.302 GC
N
f-1586420743
f
GR
GS
[1.00215 0 0 1 97.74043 127.51269] CT
0.302 GC
N
f-1586420743
f
GR
GS
[1.00215 0 0 1 90.2172 115.05867] CT
0.302 GC
N
f-1586420743
f
GR
GS
[1.00215 0 0 1 100.41951 119.47646] CT
0.302 GC
N
f-1586420743
f
GR
GS
[1.00215 0 0 1 97.26469 100.25526] CT
0.302 GC
N
f-1586420743
f
GR
GS
[1.00215 0 0 1 103.33855 65.11909] CT
0.302 GC
N
f-1586420743
f
GR
GS
[1.00215 0 0 1 99.88743 125.12337] CT
0.302 GC
N
f-1586420743
f
GR
GS
[1.00215 0 0 1 94.14219 153.29698] CT
0.302 GC
N
f-1586420743
f
GR
GS
[1.00215 0 0 1 100.29611 126.80471] CT
0.302 GC
N
f-1586420743
f
GR
GS
[1.00215 0 0 1 95.38482 111.07889] CT
0.302 GC
N
f-1586420743
f
GR
GS
[1.00215 0 0 1 104.98227 134.88853] CT
0.302 GC
N
f-1586420743
f
GR
GS
[1.00215 0 0 1 103.55127 112.6814] CT
0.302 GC
N
f-1586420743
f
GR
GS
[1.00215 0 0 1 89.60836 94.96615] CT
0.302 GC
N
f-1586420743
f
GR
GS
[1.00215 0 0 1 104.78968 72.97814] CT
0.302 GC
N
f-1586420743
f
GR
GS
[1.00215 0 0 1 94.14208 110.95631] CT
0.302 GC
N
f-1586420743
f
GR
GS
[1.00215 0 0 1 94.41941 121.7642] CT
0.302 GC
N
f-1586420743
f
GR
GS
[1.00215 0 0 1 87.55968 80.90823] CT
0.302 GC
N
f-1586420743
f
GR
GS
[1.00215 0 0 1 103.49367 146.52603] CT
0.302 GC
N
f-1586420743
f
GR
GS
[1.00215 0 0 1 92.32349 161.34872] CT
0.302 GC
N
f-1586420743
f
GR
GS
[1.00215 0 0 1 90.82091 97.74651] CT
0.302 GC
N
f-1586420743
f
GR
GS
[1.00215 0 0 1 105.60891 117.87196] CT
0.302 GC
N
f-1586420743
f
GR
GS
[1.00215 0 0 1 99.14201 107.01006] CT
0.302 GC
N
f-1586420743
f
GR
GS
[1.00215 0 0 1 87.52473 123.03555] CT
0.302 GC
N
f-1586420743
f
GR
GS
[1.00215 0 0 1 88.20071 80.19991] CT
0.302 GC
N
f-1586420743
f
GR
GS
[1.00215 0 0 1 94.47843 107.24699] CT
0.302 GC
N
f-1586420743
f
GR
GS
[1.00215 0 0 1 93.85751 125.01888] CT
0.302 GC
N
f-1586420743
f
GR
GS
[1.00215 0 0 1 90.71845 87.24028] CT
0.302 GC
N
f-1586420743
f
GR
GS
[1.00215 0 0 1 87.63334 130.73486] CT
0.302 GC
N
f-1586420743
f
GR
GS
[1.00215 0 0 1 92.7742 109.19386] CT
0.302 GC
N
f-1586420743
f
GR
GS
[1.00215 0 0 1 88.73524 102.68682] CT
0.302 GC
N
f-1586420743
f
GR
GS
[1.00215 0 0 1 97.87217 120.94484] CT
0.302 GC
N
f-1586420743
f
GR
GS
[1.00215 0 0 1 98.04748 115.48195] CT
0.302 GC
N
f-1586420743
f
GR
GS
[1.00215 0 0 1 97.0905 92.43261] CT
0.302 GC
N
f-1586420743
f
GR
GS
[1.00215 0 0 1 95.18626 105.65366] CT
0.302 GC
N
f-1586420743
f
GR
GS
[1.00215 0 0 1 88.60028 74.32846] CT
0.302 GC
N
f-1586420743
f
GR
GS
[1.00215 0 0 1 95.75102 113.67733] CT
0.302 GC
N
f-1586420743
f
GR
GS
[1.00215 0 0 1 105.56004 92.71617] CT
0.302 GC
N
f-1586420743
f
GR
GS
[1.00215 0 0 1 104.19723 139.7103] CT
0.302 GC
N
f-1586420743
f
GR
GS
[1.00215 0 0 1 101.91805 111.3661] CT
0.302 GC
N
f-1586420743
f
GR
GS
[1.00215 0 0 1 0 0] CT
1 0.6 0.6 RC
N
/f-1144517042{162.48 228 M
162.48 104.049 L
124.72 104.049 L
124.72 228 L
cp}def
f-1144517042
f
GR
GS
[1.00215 0 0 1 149.11048 89.95776] CT
0.302 GC
N
f-1586420743
f
GR
GS
[1.00215 0 0 1 146.42918 106.40858] CT
0.302 GC
N
f-1586420743
f
GR
GS
[1.00215 0 0 1 151.16065 123.50872] CT
0.302 GC
N
f-1586420743
f
GR
GS
[1.00215 0 0 1 148.96342 64.25229] CT
0.302 GC
N
f-1586420743
f
GR
GS
[1.00215 0 0 1 136.03976 86.4445] CT
0.302 GC
N
f-1586420743
f
GR
GS
[1.00215 0 0 1 146.89119 99.80418] CT
0.302 GC
N
f-1586420743
f
GR
GS
[1.00215 0 0 1 136.43902 73.83985] CT
0.302 GC
N
f-1586420743
f
GR
GS
[1.00215 0 0 1 151.42701 102.80733] CT
0.302 GC
N
f-1586420743
f
GR
GS
[1.00215 0 0 1 144.38999 92.53761] CT
0.302 GC
N
f-1586420743
f
GR
GS
[1.00215 0 0 1 152.89799 100.87289] CT
0.302 GC
N
f-1586420743
f
GR
GS
[1.00215 0 0 1 152.07741 120.40339] CT
0.302 GC
N
f-1586420743
f
GR
GS
[1.00215 0 0 1 149.53464 105.16299] CT
0.302 GC
N
f-1586420743
f
GR
GS
[1.00215 0 0 1 148.06475 118.41872] CT
0.302 GC
N
f-1586420743
f
GR
GS
[1.00215 0 0 1 144.93316 94.33313] CT
0.302 GC
N
f-1586420743
f
GR
GS
[1.00215 0 0 1 139.79548 86.62375] CT
0.302 GC
N
f-1586420743
f
GR
GS
[1.00215 0 0 1 147.50092 120.69164] CT
0.302 GC
N
f-1586420743
f
GR
GS
[1.00215 0 0 1 142.23593 98.3118] CT
0.302 GC
N
f-1586420743
f
GR
GS
[1.00215 0 0 1 137.24778 93.33282] CT
0.302 GC
N
f-1586420743
f
GR
GS
[1.00215 0 0 1 136.81163 73.16276] CT
0.302 GC
N
f-1586420743
f
GR
GS
[1.00215 0 0 1 141.90146 117.02908] CT
0.302 GC
N
f-1586420743
f
GR
GS
[1.00215 0 0 1 149.06696 122.6172] CT
0.302 GC
N
f-1586420743
f
GR
GS
[1.00215 0 0 1 149.36593 119.06242] CT
0.302 GC
N
f-1586420743
f
GR
GS
[1.00215 0 0 1 138.5193 114.0471] CT
0.302 GC
N
f-1586420743
f
GR
GS
[1.00215 0 0 1 141.07864 131.94261] CT
0.302 GC
N
f-1586420743
f
GR
GS
[1.00215 0 0 1 146.01212 120.44153] CT
0.302 GC
N
f-1586420743
f
GR
GS
[1.00215 0 0 1 135.43156 121.17898] CT
0.302 GC
N
f-1586420743
f
GR
GS
[1.00215 0 0 1 150.30114 128.88519] CT
0.302 GC
N
f-1586420743
f
GR
GS
[1.00215 0 0 1 140.1108 101.5993] CT
0.302 GC
N
f-1586420743
f
GR
GS
[1.00215 0 0 1 140.92317 106.33807] CT
0.302 GC
N
f-1586420743
f
GR
GS
[1.00215 0 0 1 146.61822 114.14453] CT
0.302 GC
N
f-1586420743
f
GR
GS
[1.00215 0 0 1 141.5403 100.18903] CT
0.302 GC
N
f-1586420743
f
GR
GS
[1.00215 0 0 1 145.16612 99.43639] CT
0.302 GC
N
f-1586420743
f
GR
GS
[1.00215 0 0 1 140.50959 89.60506] CT
0.302 GC
N
f-1586420743
f
GR
GS
[1.00215 0 0 1 144.46361 118.61848] CT
0.302 GC
N
f-1586420743
f
GR
GS
[1.00215 0 0 1 139.60976 96.51729] CT
0.302 GC
N
f-1586420743
f
GR
GS
[1.00215 0 0 1 150.82986 103.77888] CT
0.302 GC
N
f-1586420743
f
GR
GS
[1.00215 0 0 1 140.11785 100.36426] CT
0.302 GC
N
f-1586420743
f
GR
GS
[1.00215 0 0 1 153.25676 107.53748] CT
0.302 GC
N
f-1586420743
f
GR
GS
[1.00215 0 0 1 148.09878 87.01949] CT
0.302 GC
N
f-1586420743
f
GR
GS
[1.00215 0 0 1 143.5498 123.48387] CT
0.302 GC
N
f-1586420743
f
GR
GS
[1.00215 0 0 1 142.60752 134.77866] CT
0.302 GC
N
f-1586420743
f
GR
GS
[1.00215 0 0 1 151.56442 87.97134] CT
0.302 GC
N
f-1586420743
f
GR
GS
[1.00215 0 0 1 142.57732 77.03145] CT
0.302 GC
N
f-1586420743
f
GR
GS
[1.00215 0 0 1 153.20807 121.78851] CT
0.302 GC
N
f-1586420743
f
GR
GS
[1.00215 0 0 1 144.1455 123.75562] CT
0.302 GC
N
f-1586420743
f
GR
GS
[1.00215 0 0 1 152.24319 61.41068] CT
0.302 GC
N
f-1586420743
f
GR
GS
[1.00215 0 0 1 137.58448 115.71195] CT
0.302 GC
N
f-1586420743
f
GR
GS
[1.00215 0 0 1 139.60213 69.08797] CT
0.302 GC
N
f-1586420743
f
GR
GS
[1.00215 0 0 1 146.11676 119.19481] CT
0.302 GC
N
f-1586420743
f
GR
GS
[1.00215 0 0 1 143.31263 103.96577] CT
0.302 GC
N
f-1586420743
f
GR
GS
[1.00215 0 0 1 148.46597 105.33951] CT
0.302 GC
N
f-1586420743
f
GR
GS
[1.00215 0 0 1 144.36464 130.85088] CT
0.302 GC
N
f-1586420743
f
GR
GS
[1.00215 0 0 1 152.89392 89.02547] CT
0.302 GC
N
f-1586420743
f
GR
%%Trailer
%%Pages: 1
%%EOF
