%!PS-Adobe-3.0 EPSF-3.0
%%Creator: (MATLAB, The Mathworks, Inc. Version 9.8.0.1323502 \(R2020a\). Operating System: Mac OS X)
%%Title: /Users/kosciessa/Desktop/mntTardisLNDG/LNDG/stateswitch/stsw_multimodal/figures/correlations/f_drift-l1_stroop-int.eps
%%CreationDate: 2022-03-07T11:21:23
%%Pages: (atend)
%%BoundingBox:   -21     0   277   194
%%LanguageLevel: 3
%%EndComments
%%BeginProlog
%%BeginResource: procset (Apache XML Graphics Std ProcSet) 1.2 0
%%Version: 1.2 0
%%Copyright: (Copyright 2001-2003,2010 The Apache Software Foundation. License terms: http://www.apache.org/licenses/LICENSE-2.0)
/bd{bind def}bind def
/ld{load def}bd
/GR/grestore ld
/GS/gsave ld
/RM/rmoveto ld
/C/curveto ld
/t/show ld
/L/lineto ld
/ML/setmiterlimit ld
/CT/concat ld
/f/fill ld
/N/newpath ld
/S/stroke ld
/CC/setcmykcolor ld
/A/ashow ld
/cp/closepath ld
/RC/setrgbcolor ld
/LJ/setlinejoin ld
/GC/setgray ld
/LW/setlinewidth ld
/M/moveto ld
/re {4 2 roll M
1 index 0 rlineto
0 exch rlineto
neg 0 rlineto
cp } bd
/_ctm matrix def
/_tm matrix def
/BT { _ctm currentmatrix pop matrix _tm copy pop 0 0 moveto } bd
/ET { _ctm setmatrix } bd
/iTm { _ctm setmatrix _tm concat } bd
/Tm { _tm astore pop iTm 0 0 moveto } bd
/ux 0.0 def
/uy 0.0 def
/F {
  /Tp exch def
  /Tf exch def
  Tf findfont Tp scalefont setfont
  /cf Tf def  /cs Tp def
} bd
/ULS {currentpoint /uy exch def /ux exch def} bd
/ULE {
  /Tcx currentpoint pop def
  gsave
  newpath
  cf findfont cs scalefont dup
  /FontMatrix get 0 get /Ts exch def /FontInfo get dup
  /UnderlinePosition get Ts mul /To exch def
  /UnderlineThickness get Ts mul /Tt exch def
  ux uy To add moveto  Tcx uy To add lineto
  Tt setlinewidth stroke
  grestore
} bd
/OLE {
  /Tcx currentpoint pop def
  gsave
  newpath
  cf findfont cs scalefont dup
  /FontMatrix get 0 get /Ts exch def /FontInfo get dup
  /UnderlinePosition get Ts mul /To exch def
  /UnderlineThickness get Ts mul /Tt exch def
  ux uy To add cs add moveto Tcx uy To add cs add lineto
  Tt setlinewidth stroke
  grestore
} bd
/SOE {
  /Tcx currentpoint pop def
  gsave
  newpath
  cf findfont cs scalefont dup
  /FontMatrix get 0 get /Ts exch def /FontInfo get dup
  /UnderlinePosition get Ts mul /To exch def
  /UnderlineThickness get Ts mul /Tt exch def
  ux uy To add cs 10 mul 26 idiv add moveto Tcx uy To add cs 10 mul 26 idiv add lineto
  Tt setlinewidth stroke
  grestore
} bd
/QT {
/Y22 exch store
/X22 exch store
/Y21 exch store
/X21 exch store
currentpoint
/Y21 load 2 mul add 3 div exch
/X21 load 2 mul add 3 div exch
/X21 load 2 mul /X22 load add 3 div
/Y21 load 2 mul /Y22 load add 3 div
/X22 load /Y22 load curveto
} bd
/SSPD {
dup length /d exch dict def
{
/v exch def
/k exch def
currentpagedevice k known {
/cpdv currentpagedevice k get def
v cpdv ne {
/upd false def
/nullv v type /nulltype eq def
/nullcpdv cpdv type /nulltype eq def
nullv nullcpdv or
{
/upd true def
} {
/sametype v type cpdv type eq def
sametype {
v type /arraytype eq {
/vlen v length def
/cpdvlen cpdv length def
vlen cpdvlen eq {
0 1 vlen 1 sub {
/i exch def
/obj v i get def
/cpdobj cpdv i get def
obj cpdobj ne {
/upd true def
exit
} if
} for
} {
/upd true def
} ifelse
} {
v type /dicttype eq {
v {
/dv exch def
/dk exch def
/cpddv cpdv dk get def
dv cpddv ne {
/upd true def
exit
} if
} forall
} {
/upd true def
} ifelse
} ifelse
} if
} ifelse
upd true eq {
d k v put
} if
} if
} if
} forall
d length 0 gt {
d setpagedevice
} if
} bd
/RE { % /NewFontName [NewEncodingArray] /FontName RE -
  findfont dup length dict begin
  {
    1 index /FID ne
    {def} {pop pop} ifelse
  } forall
  /Encoding exch def
  /FontName 1 index def
  currentdict definefont pop
  end
} bind def
%%EndResource
%%BeginResource: procset (Apache XML Graphics EPS ProcSet) 1.0 0
%%Version: 1.0 0
%%Copyright: (Copyright 2002-2003 The Apache Software Foundation. License terms: http://www.apache.org/licenses/LICENSE-2.0)
/BeginEPSF { %def
/b4_Inc_state save def         % Save state for cleanup
/dict_count countdictstack def % Count objects on dict stack
/op_count count 1 sub def      % Count objects on operand stack
userdict begin                 % Push userdict on dict stack
/showpage { } def              % Redefine showpage, { } = null proc
0 setgray 0 setlinecap         % Prepare graphics state
1 setlinewidth 0 setlinejoin
10 setmiterlimit [ ] 0 setdash newpath
/languagelevel where           % If level not equal to 1 then
{pop languagelevel             % set strokeadjust and
1 ne                           % overprint to their defaults.
{false setstrokeadjust false setoverprint
} if
} if
} bd
/EndEPSF { %def
count op_count sub {pop} repeat            % Clean up stacks
countdictstack dict_count sub {end} repeat
b4_Inc_state restore
} bd
%%EndResource
%FOPBeginFontDict
%%IncludeResource: font Courier-Oblique
%%IncludeResource: font Courier-BoldOblique
%%IncludeResource: font Courier-Bold
%%IncludeResource: font ZapfDingbats
%%IncludeResource: font Symbol
%%IncludeResource: font Helvetica
%%IncludeResource: font Helvetica-Oblique
%%IncludeResource: font Helvetica-Bold
%%IncludeResource: font Helvetica-BoldOblique
%%IncludeResource: font Times-Roman
%%IncludeResource: font Times-Italic
%%IncludeResource: font Times-Bold
%%IncludeResource: font Times-BoldItalic
%%IncludeResource: font Courier
%FOPEndFontDict
%%BeginResource: encoding WinAnsiEncoding
/WinAnsiEncoding [
/.notdef /.notdef /.notdef /.notdef /.notdef
/.notdef /.notdef /.notdef /.notdef /.notdef
/.notdef /.notdef /.notdef /.notdef /.notdef
/.notdef /.notdef /.notdef /.notdef /.notdef
/.notdef /.notdef /.notdef /.notdef /.notdef
/.notdef /.notdef /.notdef /.notdef /.notdef
/.notdef /.notdef /space /exclam /quotedbl
/numbersign /dollar /percent /ampersand /quotesingle
/parenleft /parenright /asterisk /plus /comma
/hyphen /period /slash /zero /one
/two /three /four /five /six
/seven /eight /nine /colon /semicolon
/less /equal /greater /question /at
/A /B /C /D /E
/F /G /H /I /J
/K /L /M /N /O
/P /Q /R /S /T
/U /V /W /X /Y
/Z /bracketleft /backslash /bracketright /asciicircum
/underscore /quoteleft /a /b /c
/d /e /f /g /h
/i /j /k /l /m
/n /o /p /q /r
/s /t /u /v /w
/x /y /z /braceleft /bar
/braceright /asciitilde /bullet /Euro /bullet
/quotesinglbase /florin /quotedblbase /ellipsis /dagger
/daggerdbl /circumflex /perthousand /Scaron /guilsinglleft
/OE /bullet /Zcaron /bullet /bullet
/quoteleft /quoteright /quotedblleft /quotedblright /bullet
/endash /emdash /asciitilde /trademark /scaron
/guilsinglright /oe /bullet /zcaron /Ydieresis
/space /exclamdown /cent /sterling /currency
/yen /brokenbar /section /dieresis /copyright
/ordfeminine /guillemotleft /logicalnot /sfthyphen /registered
/macron /degree /plusminus /twosuperior /threesuperior
/acute /mu /paragraph /middot /cedilla
/onesuperior /ordmasculine /guillemotright /onequarter /onehalf
/threequarters /questiondown /Agrave /Aacute /Acircumflex
/Atilde /Adieresis /Aring /AE /Ccedilla
/Egrave /Eacute /Ecircumflex /Edieresis /Igrave
/Iacute /Icircumflex /Idieresis /Eth /Ntilde
/Ograve /Oacute /Ocircumflex /Otilde /Odieresis
/multiply /Oslash /Ugrave /Uacute /Ucircumflex
/Udieresis /Yacute /Thorn /germandbls /agrave
/aacute /acircumflex /atilde /adieresis /aring
/ae /ccedilla /egrave /eacute /ecircumflex
/edieresis /igrave /iacute /icircumflex /idieresis
/eth /ntilde /ograve /oacute /ocircumflex
/otilde /odieresis /divide /oslash /ugrave
/uacute /ucircumflex /udieresis /yacute /thorn
/ydieresis
] def
%%EndResource
%FOPBeginFontReencode
/Courier-Oblique findfont
dup length dict begin
  {1 index /FID ne {def} {pop pop} ifelse} forall
  /Encoding WinAnsiEncoding def
  currentdict
end
/Courier-Oblique exch definefont pop
/Courier-BoldOblique findfont
dup length dict begin
  {1 index /FID ne {def} {pop pop} ifelse} forall
  /Encoding WinAnsiEncoding def
  currentdict
end
/Courier-BoldOblique exch definefont pop
/Courier-Bold findfont
dup length dict begin
  {1 index /FID ne {def} {pop pop} ifelse} forall
  /Encoding WinAnsiEncoding def
  currentdict
end
/Courier-Bold exch definefont pop
/Helvetica findfont
dup length dict begin
  {1 index /FID ne {def} {pop pop} ifelse} forall
  /Encoding WinAnsiEncoding def
  currentdict
end
/Helvetica exch definefont pop
/Helvetica-Oblique findfont
dup length dict begin
  {1 index /FID ne {def} {pop pop} ifelse} forall
  /Encoding WinAnsiEncoding def
  currentdict
end
/Helvetica-Oblique exch definefont pop
/Helvetica-Bold findfont
dup length dict begin
  {1 index /FID ne {def} {pop pop} ifelse} forall
  /Encoding WinAnsiEncoding def
  currentdict
end
/Helvetica-Bold exch definefont pop
/Helvetica-BoldOblique findfont
dup length dict begin
  {1 index /FID ne {def} {pop pop} ifelse} forall
  /Encoding WinAnsiEncoding def
  currentdict
end
/Helvetica-BoldOblique exch definefont pop
/Times-Roman findfont
dup length dict begin
  {1 index /FID ne {def} {pop pop} ifelse} forall
  /Encoding WinAnsiEncoding def
  currentdict
end
/Times-Roman exch definefont pop
/Times-Italic findfont
dup length dict begin
  {1 index /FID ne {def} {pop pop} ifelse} forall
  /Encoding WinAnsiEncoding def
  currentdict
end
/Times-Italic exch definefont pop
/Times-Bold findfont
dup length dict begin
  {1 index /FID ne {def} {pop pop} ifelse} forall
  /Encoding WinAnsiEncoding def
  currentdict
end
/Times-Bold exch definefont pop
/Times-BoldItalic findfont
dup length dict begin
  {1 index /FID ne {def} {pop pop} ifelse} forall
  /Encoding WinAnsiEncoding def
  currentdict
end
/Times-BoldItalic exch definefont pop
/Courier findfont
dup length dict begin
  {1 index /FID ne {def} {pop pop} ifelse} forall
  /Encoding WinAnsiEncoding def
  currentdict
end
/Courier exch definefont pop
%FOPEndFontReencode
%%EndProlog
%%Page: 1 1
%%PageBoundingBox: 0 0 227 198
%%BeginPageSetup
[1 0 0 -1 0 198] CT
%%EndPageSetup
GS
[0.99899 0 0 1.00215 0 -0.4252] CT
N
0 0 M
227 0 L
227 198 L
0 198 L
0 0 L
cp
clip
1 GC
N
0 0 227 198 re
f
GR
GS
[0.99899 0 0 1.00215 0 -0.4252] CT
1 GC
N
0 0 227 198 re
f
GR
GS
[0.99899 0 0 1.00215 0 -0.4252] CT
0.2 GC
N
49.5 160 M
205.5 160 L
205.5 21 L
49.5 21 L
cp
f
GR
GS
[0.99899 0 0 1.00215 0 -0.4252] CT
0.149 GC
2 setlinecap
1 LJ
0.5 LW
N
49.5 160 M
205.5 160 L
S
GR
GS
[0.99899 0 0 1.00215 0 -0.4252] CT
0.149 GC
2 setlinecap
1 LJ
0.5 LW
N
72.01 160 M
72.01 158.44 L
S
GR
GS
[0.99899 0 0 1.00215 0 -0.4252] CT
0.149 GC
2 setlinecap
1 LJ
0.5 LW
N
123.691 160 M
123.691 158.44 L
S
GR
GS
[0.99899 0 0 1.00215 0 -0.4252] CT
0.149 GC
2 setlinecap
1 LJ
0.5 LW
N
175.372 160 M
175.372 158.44 L
S
GR
GS
[0.99899 0 0 1.00215 71.93719 164.72871] CT
0.149 GC
/Helvetica 14 F
GS
[1 0 0 1 0 0] CT
-4 14 moveto 
1 -1 scale
(0) t 
GR
GR
GS
[0.99899 0 0 1.00215 123.56658 164.72871] CT
0.149 GC
/Helvetica 14 F
GS
[1 0 0 1 0 0] CT
-10 14 moveto 
1 -1 scale
(0.1) t 
GR
GR
GS
[0.99899 0 0 1.00215 175.19595 164.72871] CT
0.149 GC
/Helvetica 14 F
GS
[1 0 0 1 0 0] CT
-10 14 moveto 
1 -1 scale
(0.2) t 
GR
GR
GS
[0.99899 0 0 1.00215 127.37182 182.26629] CT
0.149 GC
/Helvetica 14 F
GS
[1 0 0 1 0 0] CT
-27 14 moveto 
1 -1 scale
(stroop rt) t 
GR
GR
GS
[0.99899 0 0 1.00215 0 -0.4252] CT
0.149 GC
2 setlinecap
1 LJ
0.5 LW
N
49.5 160 M
49.5 21 L
S
GR
GS
[0.99899 0 0 1.00215 0 -0.4252] CT
0.149 GC
2 setlinecap
1 LJ
0.5 LW
N
49.5 155.037 M
51.06 155.037 L
S
GR
GS
[0.99899 0 0 1.00215 0 -0.4252] CT
0.149 GC
2 setlinecap
1 LJ
0.5 LW
N
49.5 115.419 M
51.06 115.419 L
S
GR
GS
[0.99899 0 0 1.00215 0 -0.4252] CT
0.149 GC
2 setlinecap
1 LJ
0.5 LW
N
49.5 75.8 M
51.06 75.8 L
S
GR
GS
[0.99899 0 0 1.00215 0 -0.4252] CT
0.149 GC
2 setlinecap
1 LJ
0.5 LW
N
49.5 36.181 M
51.06 36.181 L
S
GR
GS
[0.99899 0 0 1.00215 44.65503 154.94521] CT
0.149 GC
/Helvetica 14 F
GS
[1 0 0 1 0 0] CT
-8 5.5 moveto 
1 -1 scale
(0) t 
GR
GR
GS
[0.99899 0 0 1.00215 44.65503 115.24138] CT
0.149 GC
/Helvetica 14 F
GS
[1 0 0 1 0 0] CT
-8 5.5 moveto 
1 -1 scale
(1) t 
GR
GR
GS
[0.99899 0 0 1.00215 44.65503 75.53755] CT
0.149 GC
/Helvetica 14 F
GS
[1 0 0 1 0 0] CT
-8 5.5 moveto 
1 -1 scale
(2) t 
GR
GR
GS
[0.99899 0 0 1.00215 44.65503 35.83371] CT
0.149 GC
/Helvetica 14 F
GS
[1 0 0 1 0 0] CT
-8 5.5 moveto 
1 -1 scale
(3) t 
GR
GR
GS
[0 -1.00215 0.99899 0 33.6661 90.26908] CT
0.149 GC
/Helvetica 14 F
GS
[1 0 0 1 0 0] CT
-26.5 -20 moveto 
1 -1 scale
(drift rate) t 
GR
GR
GS
[0 -1.00215 0.99899 0 33.6661 90.26908] CT
0.149 GC
/Helvetica 14 F
GS
[1 0 0 1 0 0] CT
-30 -3 moveto 
1 -1 scale
(\(1 Target\)) t 
GR
GR
GS
[0.99899 0 0 1.00215 127.37186 18.86613] CT
/Helvetica-Bold 14 F
GS
[1 0 0 1 0 0] CT
-150 -4 moveto 
1 -1 scale
(r\(93\) = -0.48, 95%CI = [-0.62,-0.3], p = 1.1e-06) t 
GR
GR
GS
[0.99899 0 0 1.00215 106.15125 56.11502] CT
0.502 0.702 0.8 RC
N
0.5 0 M
0.5 -0.276 0.276 -0.5 0 -0.5 C
-0.276 -0.5 -0.5 -0.276 -0.5 0 C
-0.5 0.276 -0.276 0.5 0 0.5 C
0.276 0.5 0.5 0.276 0.5 0 C
cp
f
GR
GS
[0.99899 0 0 1.00215 92.47889 80.4806] CT
0.502 0.702 0.8 RC
N
/f-2105962265{0.5 0 M
0.5 -0.276 0.276 -0.5 0 -0.5 C
-0.276 -0.5 -0.5 -0.276 -0.5 0 C
-0.5 0.276 -0.276 0.5 0 0.5 C
0.276 0.5 0.5 0.276 0.5 0 C
cp}def
f-2105962265
f
GR
GS
[0.99899 0 0 1.00215 85.95817 61.01187] CT
0.502 0.702 0.8 RC
N
f-2105962265
f
GR
GS
[0.99899 0 0 1.00215 75.06409 78.00075] CT
0.502 0.702 0.8 RC
N
f-2105962265
f
GR
GS
[0.99899 0 0 1.00215 71.67586 105.6456] CT
0.502 0.702 0.8 RC
N
f-2105962265
f
GR
GS
[0.99899 0 0 1.00215 117.70509 64.3275] CT
0.502 0.702 0.8 RC
N
f-2105962265
f
GR
GS
[0.99899 0 0 1.00215 92.22803 64.00756] CT
0.502 0.702 0.8 RC
N
f-2105962265
f
GR
GS
[0.99899 0 0 1.00215 87.89136 51.44734] CT
0.502 0.702 0.8 RC
N
f-2105962265
f
GR
GS
[0.99899 0 0 1.00215 121.25705 96.58833] CT
0.502 0.702 0.8 RC
N
f-2105962265
f
GR
GS
[0.99899 0 0 1.00215 90.47766 64.80897] CT
0.502 0.702 0.8 RC
N
f-2105962265
f
GR
GS
[0.99899 0 0 1.00215 84.51739 86.48225] CT
0.502 0.702 0.8 RC
N
f-2105962265
f
GR
GS
[0.99899 0 0 1.00215 127.86613 61.36686] CT
0.502 0.702 0.8 RC
N
f-2105962265
f
GR
GS
[0.99899 0 0 1.00215 91.25144 84.30669] CT
0.502 0.702 0.8 RC
N
f-2105962265
f
GR
GS
[0.99899 0 0 1.00215 86.33565 76.98622] CT
0.502 0.702 0.8 RC
N
f-2105962265
f
GR
GS
[0.99899 0 0 1.00215 62.43713 92.85223] CT
0.502 0.702 0.8 RC
N
f-2105962265
f
GR
GS
[0.99899 0 0 1.00215 120.09874 132.00609] CT
0.502 0.702 0.8 RC
N
f-2105962265
f
GR
GS
[0.99899 0 0 1.00215 113.31539 85.44893] CT
0.502 0.702 0.8 RC
N
f-2105962265
f
GR
GS
[0.99899 0 0 1.00215 95.10769 58.1794] CT
0.502 0.702 0.8 RC
N
f-2105962265
f
GR
GS
[0.99899 0 0 1.00215 93.7495 67.00507] CT
0.502 0.702 0.8 RC
N
f-2105962265
f
GR
GS
[0.99899 0 0 1.00215 98.89956 81.35528] CT
0.502 0.702 0.8 RC
N
f-2105962265
f
GR
GS
[0.99899 0 0 1.00215 98.37585 52.47334] CT
0.502 0.702 0.8 RC
N
f-2105962265
f
GR
GS
[0.99899 0 0 1.00215 100.78539 73.49945] CT
0.502 0.702 0.8 RC
N
f-2105962265
f
GR
GS
[0.99899 0 0 1.00215 118.82097 108.35439] CT
0.502 0.702 0.8 RC
N
f-2105962265
f
GR
GS
[0.99899 0 0 1.00215 103.22295 53.17653] CT
0.502 0.702 0.8 RC
N
f-2105962265
f
GR
GS
[0.99899 0 0 1.00215 94.35149 41.03516] CT
0.502 0.702 0.8 RC
N
f-2105962265
f
GR
GS
[0.99899 0 0 1.00215 82.91433 67.85608] CT
0.502 0.702 0.8 RC
N
f-2105962265
f
GR
GS
[0.99899 0 0 1.00215 80.60809 80.25136] CT
0.502 0.702 0.8 RC
N
f-2105962265
f
GR
GS
[0.99899 0 0 1.00215 90.52234 41.92274] CT
0.502 0.702 0.8 RC
N
f-2105962265
f
GR
GS
[0.99899 0 0 1.00215 96.36954 52.28826] CT
0.502 0.702 0.8 RC
N
f-2105962265
f
GR
GS
[0.99899 0 0 1.00215 133.07846 78.32168] CT
0.502 0.702 0.8 RC
N
f-2105962265
f
GR
GS
[0.99899 0 0 1.00215 71.60427 65.42881] CT
0.502 0.702 0.8 RC
N
f-2105962265
f
GR
GS
[0.99899 0 0 1.00215 96.75013 38.44178] CT
0.502 0.702 0.8 RC
N
f-2105962265
f
GR
GS
[0.99899 0 0 1.00215 79.19593 46.13236] CT
0.502 0.702 0.8 RC
N
f-2105962265
f
GR
GS
[0.99899 0 0 1.00215 88.09515 45.58863] CT
0.502 0.702 0.8 RC
N
f-2105962265
f
GR
GS
[0.99899 0 0 1.00215 121.35738 60.18119] CT
0.502 0.702 0.8 RC
N
f-2105962265
f
GR
GS
[0.99899 0 0 1.00215 89.28746 32.2281] CT
0.502 0.702 0.8 RC
N
f-2105962265
f
GR
GS
[0.99899 0 0 1.00215 138.34537 81.65329] CT
0.502 0.702 0.8 RC
N
f-2105962265
f
GR
GS
[0.99899 0 0 1.00215 107.5614 44.261] CT
0.502 0.702 0.8 RC
N
f-2105962265
f
GR
GS
[0.99899 0 0 1.00215 102.38903 97.37554] CT
0.502 0.702 0.8 RC
N
f-2105962265
f
GR
GS
[0.99899 0 0 1.00215 96.48478 57.24851] CT
0.502 0.702 0.8 RC
N
f-2105962265
f
GR
GS
[0.99899 0 0 1.00215 75.0215 81.27774] CT
0.502 0.702 0.8 RC
N
f-2105962265
f
GR
GS
[0.99899 0 0 1.00215 88.56562 66.63451] CT
0.502 0.702 0.8 RC
N
f-2105962265
f
GR
GS
[0.99899 0 0 1.00215 154.61119 114.05295] CT
0.502 0.702 0.8 RC
N
f-2105962265
f
GR
GS
[0.99899 0 0 1.00215 120.79354 105.95344] CT
0.502 0.702 0.8 RC
N
f-2105962265
f
GR
GS
[0.99899 0 0 1.00215 107.89524 95.12991] CT
0.502 0.702 0.8 RC
N
f-2105962265
f
GR
GS
[0.99899 0 0 1.00215 95.33196 148.31019] CT
0.502 0.702 0.8 RC
N
f-2105962265
f
GR
GS
[0.99899 0 0 1.00215 107.54318 100.58814] CT
0.502 0.702 0.8 RC
N
f-2105962265
f
GR
GS
[0.99899 0 0 1.00215 102.19995 120.85077] CT
0.502 0.702 0.8 RC
N
f-2105962265
f
GR
GS
[0.99899 0 0 1.00215 111.95614 89.62982] CT
0.502 0.702 0.8 RC
N
f-2105962265
f
GR
GS
[0.99899 0 0 1.00215 118.99263 113.55633] CT
0.502 0.702 0.8 RC
N
f-2105962265
f
GR
GS
[0.99899 0 0 1.00215 126.24611 111.73364] CT
0.502 0.702 0.8 RC
N
f-2105962265
f
GR
GS
[0.99899 0 0 1.00215 91.67732 105.25602] CT
0.502 0.702 0.8 RC
N
f-2105962265
f
GR
GS
[0.99899 0 0 1.00215 124.61939 103.81291] CT
0.502 0.702 0.8 RC
N
f-2105962265
f
GR
GS
[0.99899 0 0 1.00215 79.00146 129.49789] CT
0.502 0.702 0.8 RC
N
f-2105962265
f
GR
GS
[0.99899 0 0 1.00215 90.31854 83.27562] CT
0.502 0.702 0.8 RC
N
f-2105962265
f
GR
GS
[0.99899 0 0 1.00215 93.04144 101.11593] CT
0.502 0.702 0.8 RC
N
f-2105962265
f
GR
GS
[0.99899 0 0 1.00215 121.64636 109.07698] CT
0.502 0.702 0.8 RC
N
f-2105962265
f
GR
GS
[0.99899 0 0 1.00215 117.74162 91.98153] CT
0.502 0.702 0.8 RC
N
f-2105962265
f
GR
GS
[0.99899 0 0 1.00215 106.9397 99.60792] CT
0.502 0.702 0.8 RC
N
f-2105962265
f
GR
GS
[0.99899 0 0 1.00215 104.27658 113.94774] CT
0.502 0.702 0.8 RC
N
f-2105962265
f
GR
GS
[0.99899 0 0 1.00215 162.69492 117.38514] CT
0.502 0.702 0.8 RC
N
f-2105962265
f
GR
GS
[0.99899 0 0 1.00215 82.43642 141.04514] CT
0.502 0.702 0.8 RC
N
f-2105962265
f
GR
GS
[0.99899 0 0 1.00215 133.25881 111.52478] CT
0.502 0.702 0.8 RC
N
f-2105962265
f
GR
GS
[0.99899 0 0 1.00215 142.12992 113.86857] CT
0.502 0.702 0.8 RC
N
f-2105962265
f
GR
GS
[0.99899 0 0 1.00215 116.44467 116.7184] CT
0.502 0.702 0.8 RC
N
f-2105962265
f
GR
GS
[0.99899 0 0 1.00215 98.10657 122.22467] CT
0.502 0.702 0.8 RC
N
f-2105962265
f
GR
GS
[0.99899 0 0 1.00215 143.71204 113.29541] CT
0.502 0.702 0.8 RC
N
f-2105962265
f
GR
GS
[0.99899 0 0 1.00215 97.71594 94.09694] CT
0.502 0.702 0.8 RC
N
f-2105962265
f
GR
GS
[0.99899 0 0 1.00215 101.97327 88.10587] CT
0.502 0.702 0.8 RC
N
f-2105962265
f
GR
GS
[0.99899 0 0 1.00215 128.98831 110.13922] CT
0.502 0.702 0.8 RC
N
f-2105962265
f
GR
GS
[0.99899 0 0 1.00215 127.35433 103.85154] CT
0.502 0.702 0.8 RC
N
f-2105962265
f
GR
GS
[0.99899 0 0 1.00215 155.07945 102.50161] CT
0.502 0.702 0.8 RC
N
f-2105962265
f
GR
GS
[0.99899 0 0 1.00215 153.45613 124.43058] CT
0.502 0.702 0.8 RC
N
f-2105962265
f
GR
GS
[0.99899 0 0 1.00215 115.69032 92.29193] CT
0.502 0.702 0.8 RC
N
f-2105962265
f
GR
GS
[0.99899 0 0 1.00215 120.64343 125.77413] CT
0.502 0.702 0.8 RC
N
f-2105962265
f
GR
GS
[0.99899 0 0 1.00215 129.22919 115.55968] CT
0.502 0.702 0.8 RC
N
f-2105962265
f
GR
GS
[0.99899 0 0 1.00215 106.64557 113.6326] CT
0.502 0.702 0.8 RC
N
f-2105962265
f
GR
GS
[0.99899 0 0 1.00215 128.47962 121.91612] CT
0.502 0.702 0.8 RC
N
f-2105962265
f
GR
GS
[0.99899 0 0 1.00215 119.97129 135.84877] CT
0.502 0.702 0.8 RC
N
f-2105962265
f
GR
GS
[0.99899 0 0 1.00215 147.51613 119.4625] CT
0.502 0.702 0.8 RC
N
f-2105962265
f
GR
GS
[0.99899 0 0 1.00215 192.30636 106.71456] CT
0.502 0.702 0.8 RC
N
f-2105962265
f
GR
GS
[0.99899 0 0 1.00215 108.75411 107.09478] CT
0.502 0.702 0.8 RC
N
f-2105962265
f
GR
GS
[0.99899 0 0 1.00215 178.2995 145.19665] CT
0.502 0.702 0.8 RC
N
f-2105962265
f
GR
GS
[0.99899 0 0 1.00215 173.49806 135.94409] CT
0.502 0.702 0.8 RC
N
f-2105962265
f
GR
GS
[0.99899 0 0 1.00215 155.65684 111.27236] CT
0.502 0.702 0.8 RC
N
f-2105962265
f
GR
GS
[0.99899 0 0 1.00215 102.83708 108.13429] CT
0.502 0.702 0.8 RC
N
f-2105962265
f
GR
GS
[0.99899 0 0 1.00215 136.47301 107.21848] CT
0.502 0.702 0.8 RC
N
f-2105962265
f
GR
GS
[0.99899 0 0 1.00215 123.99592 116.04504] CT
0.502 0.702 0.8 RC
N
f-2105962265
f
GR
GS
[0.99899 0 0 1.00215 111.54283 114.3337] CT
0.502 0.702 0.8 RC
N
f-2105962265
f
GR
GS
[0.99899 0 0 1.00215 140.46712 113.23602] CT
0.502 0.702 0.8 RC
N
f-2105962265
f
GR
GS
[0.99899 0 0 1.00215 107.96869 99.53918] CT
0.502 0.702 0.8 RC
N
f-2105962265
f
GR
GS
[0.99899 0 0 1.00215 90.27093 107.76753] CT
0.502 0.702 0.8 RC
N
f-2105962265
f
GR
GS
[0.99899 0 0 1.00215 98.21095 87.05182] CT
0.502 0.702 0.8 RC
N
f-2105962265
f
GR
GS
[0.99899 0 0 1.00215 102.76034 120.49269] CT
0.502 0.702 0.8 RC
N
f-2105962265
f
GR
GS
[0.99899 0 0 1.00215 128.83354 121.95197] CT
0.502 0.702 0.8 RC
N
f-2105962265
f
GR
GS
[0.99899 0 0 1.00215 0 -0.4252] CT
0.6 0.8 0.902 RC
1 LJ
3 LW
N
62.5 68.138 M
192.5 135.851 L
S
GR
GS
[0.99899 0 0 1.00215 106.15125 56.11502] CT
0.702 0.898 1 RC
N
/f227889816{-3 -3 M
-3 3 L
3 3 L
3 -3 L
cp}def
f227889816
f
GR
GS
[0.99899 0 0 1.00215 92.47889 80.4806] CT
0.702 0.898 1 RC
N
f227889816
f
GR
GS
[0.99899 0 0 1.00215 85.95817 61.01187] CT
0.702 0.898 1 RC
N
f227889816
f
GR
GS
[0.99899 0 0 1.00215 75.06409 78.00075] CT
0.702 0.898 1 RC
N
f227889816
f
GR
GS
[0.99899 0 0 1.00215 71.67586 105.6456] CT
0.702 0.898 1 RC
N
f227889816
f
GR
GS
[0.99899 0 0 1.00215 117.70509 64.3275] CT
0.702 0.898 1 RC
N
f227889816
f
GR
GS
[0.99899 0 0 1.00215 92.22803 64.00756] CT
0.702 0.898 1 RC
N
f227889816
f
GR
GS
[0.99899 0 0 1.00215 87.89136 51.44734] CT
0.702 0.898 1 RC
N
f227889816
f
GR
GS
[0.99899 0 0 1.00215 121.25705 96.58833] CT
0.702 0.898 1 RC
N
f227889816
f
GR
GS
[0.99899 0 0 1.00215 90.47766 64.80897] CT
0.702 0.898 1 RC
N
f227889816
f
GR
GS
[0.99899 0 0 1.00215 84.51739 86.48225] CT
0.702 0.898 1 RC
N
f227889816
f
GR
GS
[0.99899 0 0 1.00215 127.86613 61.36686] CT
0.702 0.898 1 RC
N
f227889816
f
GR
GS
[0.99899 0 0 1.00215 91.25144 84.30669] CT
0.702 0.898 1 RC
N
f227889816
f
GR
GS
[0.99899 0 0 1.00215 86.33565 76.98622] CT
0.702 0.898 1 RC
N
f227889816
f
GR
GS
[0.99899 0 0 1.00215 62.43713 92.85223] CT
0.702 0.898 1 RC
N
f227889816
f
GR
GS
[0.99899 0 0 1.00215 120.09874 132.00609] CT
0.702 0.898 1 RC
N
f227889816
f
GR
GS
[0.99899 0 0 1.00215 113.31539 85.44893] CT
0.702 0.898 1 RC
N
f227889816
f
GR
GS
[0.99899 0 0 1.00215 95.10769 58.1794] CT
0.702 0.898 1 RC
N
f227889816
f
GR
GS
[0.99899 0 0 1.00215 93.7495 67.00507] CT
0.702 0.898 1 RC
N
f227889816
f
GR
GS
[0.99899 0 0 1.00215 98.89956 81.35528] CT
0.702 0.898 1 RC
N
f227889816
f
GR
GS
[0.99899 0 0 1.00215 98.37585 52.47334] CT
0.702 0.898 1 RC
N
f227889816
f
GR
GS
[0.99899 0 0 1.00215 100.78539 73.49945] CT
0.702 0.898 1 RC
N
f227889816
f
GR
GS
[0.99899 0 0 1.00215 118.82097 108.35439] CT
0.702 0.898 1 RC
N
f227889816
f
GR
GS
[0.99899 0 0 1.00215 103.22295 53.17653] CT
0.702 0.898 1 RC
N
f227889816
f
GR
GS
[0.99899 0 0 1.00215 94.35149 41.03516] CT
0.702 0.898 1 RC
N
f227889816
f
GR
GS
[0.99899 0 0 1.00215 82.91433 67.85608] CT
0.702 0.898 1 RC
N
f227889816
f
GR
GS
[0.99899 0 0 1.00215 80.60809 80.25136] CT
0.702 0.898 1 RC
N
f227889816
f
GR
GS
[0.99899 0 0 1.00215 90.52234 41.92274] CT
0.702 0.898 1 RC
N
f227889816
f
GR
GS
[0.99899 0 0 1.00215 96.36954 52.28826] CT
0.702 0.898 1 RC
N
f227889816
f
GR
GS
[0.99899 0 0 1.00215 133.07846 78.32168] CT
0.702 0.898 1 RC
N
f227889816
f
GR
GS
[0.99899 0 0 1.00215 71.60427 65.42881] CT
0.702 0.898 1 RC
N
f227889816
f
GR
GS
[0.99899 0 0 1.00215 96.75013 38.44178] CT
0.702 0.898 1 RC
N
f227889816
f
GR
GS
[0.99899 0 0 1.00215 79.19593 46.13236] CT
0.702 0.898 1 RC
N
f227889816
f
GR
GS
[0.99899 0 0 1.00215 88.09515 45.58863] CT
0.702 0.898 1 RC
N
f227889816
f
GR
GS
[0.99899 0 0 1.00215 121.35738 60.18119] CT
0.702 0.898 1 RC
N
f227889816
f
GR
GS
[0.99899 0 0 1.00215 89.28746 32.2281] CT
0.702 0.898 1 RC
N
f227889816
f
GR
GS
[0.99899 0 0 1.00215 138.34537 81.65329] CT
0.702 0.898 1 RC
N
f227889816
f
GR
GS
[0.99899 0 0 1.00215 107.5614 44.261] CT
0.702 0.898 1 RC
N
f227889816
f
GR
GS
[0.99899 0 0 1.00215 102.38903 97.37554] CT
0.702 0.898 1 RC
N
f227889816
f
GR
GS
[0.99899 0 0 1.00215 96.48478 57.24851] CT
0.702 0.898 1 RC
N
f227889816
f
GR
GS
[0.99899 0 0 1.00215 75.0215 81.27774] CT
0.702 0.898 1 RC
N
f227889816
f
GR
GS
[0.99899 0 0 1.00215 88.56562 66.63451] CT
0.702 0.898 1 RC
N
f227889816
f
GR
GS
[0.99899 0 0 1.00215 154.61119 114.05295] CT
0.502 0.702 0.8 RC
N
/f-1969333140{-3.536 0 M
0 4.702 L
3.536 0 L
0 -4.702 L
cp}def
f-1969333140
f
GR
GS
[0.99899 0 0 1.00215 120.79354 105.95344] CT
0.502 0.702 0.8 RC
N
f-1969333140
f
GR
GS
[0.99899 0 0 1.00215 107.89524 95.12991] CT
0.502 0.702 0.8 RC
N
f-1969333140
f
GR
GS
[0.99899 0 0 1.00215 95.33196 148.31019] CT
0.502 0.702 0.8 RC
N
f-1969333140
f
GR
GS
[0.99899 0 0 1.00215 107.54318 100.58814] CT
0.502 0.702 0.8 RC
N
f-1969333140
f
GR
GS
[0.99899 0 0 1.00215 102.19995 120.85077] CT
0.502 0.702 0.8 RC
N
f-1969333140
f
GR
GS
[0.99899 0 0 1.00215 111.95614 89.62982] CT
0.502 0.702 0.8 RC
N
f-1969333140
f
GR
GS
[0.99899 0 0 1.00215 118.99263 113.55633] CT
0.502 0.702 0.8 RC
N
f-1969333140
f
GR
GS
[0.99899 0 0 1.00215 126.24611 111.73364] CT
0.502 0.702 0.8 RC
N
f-1969333140
f
GR
GS
[0.99899 0 0 1.00215 91.67732 105.25602] CT
0.502 0.702 0.8 RC
N
f-1969333140
f
GR
GS
[0.99899 0 0 1.00215 124.61939 103.81291] CT
0.502 0.702 0.8 RC
N
f-1969333140
f
GR
GS
[0.99899 0 0 1.00215 79.00146 129.49789] CT
0.502 0.702 0.8 RC
N
f-1969333140
f
GR
GS
[0.99899 0 0 1.00215 90.31854 83.27562] CT
0.502 0.702 0.8 RC
N
f-1969333140
f
GR
GS
[0.99899 0 0 1.00215 93.04144 101.11593] CT
0.502 0.702 0.8 RC
N
f-1969333140
f
GR
GS
[0.99899 0 0 1.00215 121.64636 109.07698] CT
0.502 0.702 0.8 RC
N
f-1969333140
f
GR
GS
[0.99899 0 0 1.00215 117.74162 91.98153] CT
0.502 0.702 0.8 RC
N
f-1969333140
f
GR
GS
[0.99899 0 0 1.00215 106.9397 99.60792] CT
0.502 0.702 0.8 RC
N
f-1969333140
f
GR
GS
[0.99899 0 0 1.00215 104.27658 113.94774] CT
0.502 0.702 0.8 RC
N
f-1969333140
f
GR
GS
[0.99899 0 0 1.00215 162.69492 117.38514] CT
0.502 0.702 0.8 RC
N
f-1969333140
f
GR
GS
[0.99899 0 0 1.00215 82.43642 141.04514] CT
0.502 0.702 0.8 RC
N
f-1969333140
f
GR
GS
[0.99899 0 0 1.00215 133.25881 111.52478] CT
0.502 0.702 0.8 RC
N
f-1969333140
f
GR
GS
[0.99899 0 0 1.00215 142.12992 113.86857] CT
0.502 0.702 0.8 RC
N
f-1969333140
f
GR
GS
[0.99899 0 0 1.00215 116.44467 116.7184] CT
0.502 0.702 0.8 RC
N
f-1969333140
f
GR
GS
[0.99899 0 0 1.00215 98.10657 122.22467] CT
0.502 0.702 0.8 RC
N
f-1969333140
f
GR
GS
[0.99899 0 0 1.00215 143.71204 113.29541] CT
0.502 0.702 0.8 RC
N
f-1969333140
f
GR
GS
[0.99899 0 0 1.00215 97.71594 94.09694] CT
0.502 0.702 0.8 RC
N
f-1969333140
f
GR
GS
[0.99899 0 0 1.00215 101.97327 88.10587] CT
0.502 0.702 0.8 RC
N
f-1969333140
f
GR
GS
[0.99899 0 0 1.00215 128.98831 110.13922] CT
0.502 0.702 0.8 RC
N
f-1969333140
f
GR
GS
[0.99899 0 0 1.00215 127.35433 103.85154] CT
0.502 0.702 0.8 RC
N
f-1969333140
f
GR
GS
[0.99899 0 0 1.00215 155.07945 102.50161] CT
0.502 0.702 0.8 RC
N
f-1969333140
f
GR
GS
[0.99899 0 0 1.00215 153.45613 124.43058] CT
0.502 0.702 0.8 RC
N
f-1969333140
f
GR
GS
[0.99899 0 0 1.00215 115.69032 92.29193] CT
0.502 0.702 0.8 RC
N
f-1969333140
f
GR
GS
[0.99899 0 0 1.00215 120.64343 125.77413] CT
0.502 0.702 0.8 RC
N
f-1969333140
f
GR
GS
[0.99899 0 0 1.00215 129.22919 115.55968] CT
0.502 0.702 0.8 RC
N
f-1969333140
f
GR
GS
[0.99899 0 0 1.00215 106.64557 113.6326] CT
0.502 0.702 0.8 RC
N
f-1969333140
f
GR
GS
[0.99899 0 0 1.00215 128.47962 121.91612] CT
0.502 0.702 0.8 RC
N
f-1969333140
f
GR
GS
[0.99899 0 0 1.00215 119.97129 135.84877] CT
0.502 0.702 0.8 RC
N
f-1969333140
f
GR
GS
[0.99899 0 0 1.00215 147.51613 119.4625] CT
0.502 0.702 0.8 RC
N
f-1969333140
f
GR
GS
[0.99899 0 0 1.00215 192.30636 106.71456] CT
0.502 0.702 0.8 RC
N
f-1969333140
f
GR
GS
[0.99899 0 0 1.00215 108.75411 107.09478] CT
0.502 0.702 0.8 RC
N
f-1969333140
f
GR
GS
[0.99899 0 0 1.00215 178.2995 145.19665] CT
0.502 0.702 0.8 RC
N
f-1969333140
f
GR
GS
[0.99899 0 0 1.00215 173.49806 135.94409] CT
0.502 0.702 0.8 RC
N
f-1969333140
f
GR
GS
[0.99899 0 0 1.00215 155.65684 111.27236] CT
0.502 0.702 0.8 RC
N
f-1969333140
f
GR
GS
[0.99899 0 0 1.00215 102.83708 108.13429] CT
0.502 0.702 0.8 RC
N
f-1969333140
f
GR
GS
[0.99899 0 0 1.00215 136.47301 107.21848] CT
0.502 0.702 0.8 RC
N
f-1969333140
f
GR
GS
[0.99899 0 0 1.00215 123.99592 116.04504] CT
0.502 0.702 0.8 RC
N
f-1969333140
f
GR
GS
[0.99899 0 0 1.00215 111.54283 114.3337] CT
0.502 0.702 0.8 RC
N
f-1969333140
f
GR
GS
[0.99899 0 0 1.00215 140.46712 113.23602] CT
0.502 0.702 0.8 RC
N
f-1969333140
f
GR
GS
[0.99899 0 0 1.00215 107.96869 99.53918] CT
0.502 0.702 0.8 RC
N
f-1969333140
f
GR
GS
[0.99899 0 0 1.00215 90.27093 107.76753] CT
0.502 0.702 0.8 RC
N
f-1969333140
f
GR
GS
[0.99899 0 0 1.00215 98.21095 87.05182] CT
0.502 0.702 0.8 RC
N
f-1969333140
f
GR
GS
[0.99899 0 0 1.00215 102.76034 120.49269] CT
0.502 0.702 0.8 RC
N
f-1969333140
f
GR
GS
[0.99899 0 0 1.00215 128.83354 121.95197] CT
0.502 0.702 0.8 RC
N
f-1969333140
f
GR
%%Trailer
%%Pages: 1
%%EOF
