%!PS-Adobe-3.0 EPSF-3.0
%%Creator: (MATLAB, The Mathworks, Inc. Version 9.8.0.1323502 \(R2020a\). Operating System: Mac OS X)
%%Title: /Users/kosciessa/Desktop/mntTardisLNDG/LNDG/stateswitch/stsw_multimodal/figures/linearbyage/linearcomp_ssvep.eps
%%CreationDate: 2022-03-03T16:32:29
%%Pages: (atend)
%%BoundingBox:     4     0   180   275
%%LanguageLevel: 3
%%EndComments
%%BeginProlog
%%BeginResource: procset (Apache XML Graphics Std ProcSet) 1.2 0
%%Version: 1.2 0
%%Copyright: (Copyright 2001-2003,2010 The Apache Software Foundation. License terms: http://www.apache.org/licenses/LICENSE-2.0)
/bd{bind def}bind def
/ld{load def}bd
/GR/grestore ld
/GS/gsave ld
/RM/rmoveto ld
/C/curveto ld
/t/show ld
/L/lineto ld
/ML/setmiterlimit ld
/CT/concat ld
/f/fill ld
/N/newpath ld
/S/stroke ld
/CC/setcmykcolor ld
/A/ashow ld
/cp/closepath ld
/RC/setrgbcolor ld
/LJ/setlinejoin ld
/GC/setgray ld
/LW/setlinewidth ld
/M/moveto ld
/re {4 2 roll M
1 index 0 rlineto
0 exch rlineto
neg 0 rlineto
cp } bd
/_ctm matrix def
/_tm matrix def
/BT { _ctm currentmatrix pop matrix _tm copy pop 0 0 moveto } bd
/ET { _ctm setmatrix } bd
/iTm { _ctm setmatrix _tm concat } bd
/Tm { _tm astore pop iTm 0 0 moveto } bd
/ux 0.0 def
/uy 0.0 def
/F {
  /Tp exch def
  /Tf exch def
  Tf findfont Tp scalefont setfont
  /cf Tf def  /cs Tp def
} bd
/ULS {currentpoint /uy exch def /ux exch def} bd
/ULE {
  /Tcx currentpoint pop def
  gsave
  newpath
  cf findfont cs scalefont dup
  /FontMatrix get 0 get /Ts exch def /FontInfo get dup
  /UnderlinePosition get Ts mul /To exch def
  /UnderlineThickness get Ts mul /Tt exch def
  ux uy To add moveto  Tcx uy To add lineto
  Tt setlinewidth stroke
  grestore
} bd
/OLE {
  /Tcx currentpoint pop def
  gsave
  newpath
  cf findfont cs scalefont dup
  /FontMatrix get 0 get /Ts exch def /FontInfo get dup
  /UnderlinePosition get Ts mul /To exch def
  /UnderlineThickness get Ts mul /Tt exch def
  ux uy To add cs add moveto Tcx uy To add cs add lineto
  Tt setlinewidth stroke
  grestore
} bd
/SOE {
  /Tcx currentpoint pop def
  gsave
  newpath
  cf findfont cs scalefont dup
  /FontMatrix get 0 get /Ts exch def /FontInfo get dup
  /UnderlinePosition get Ts mul /To exch def
  /UnderlineThickness get Ts mul /Tt exch def
  ux uy To add cs 10 mul 26 idiv add moveto Tcx uy To add cs 10 mul 26 idiv add lineto
  Tt setlinewidth stroke
  grestore
} bd
/QT {
/Y22 exch store
/X22 exch store
/Y21 exch store
/X21 exch store
currentpoint
/Y21 load 2 mul add 3 div exch
/X21 load 2 mul add 3 div exch
/X21 load 2 mul /X22 load add 3 div
/Y21 load 2 mul /Y22 load add 3 div
/X22 load /Y22 load curveto
} bd
/SSPD {
dup length /d exch dict def
{
/v exch def
/k exch def
currentpagedevice k known {
/cpdv currentpagedevice k get def
v cpdv ne {
/upd false def
/nullv v type /nulltype eq def
/nullcpdv cpdv type /nulltype eq def
nullv nullcpdv or
{
/upd true def
} {
/sametype v type cpdv type eq def
sametype {
v type /arraytype eq {
/vlen v length def
/cpdvlen cpdv length def
vlen cpdvlen eq {
0 1 vlen 1 sub {
/i exch def
/obj v i get def
/cpdobj cpdv i get def
obj cpdobj ne {
/upd true def
exit
} if
} for
} {
/upd true def
} ifelse
} {
v type /dicttype eq {
v {
/dv exch def
/dk exch def
/cpddv cpdv dk get def
dv cpddv ne {
/upd true def
exit
} if
} forall
} {
/upd true def
} ifelse
} ifelse
} if
} ifelse
upd true eq {
d k v put
} if
} if
} if
} forall
d length 0 gt {
d setpagedevice
} if
} bd
/RE { % /NewFontName [NewEncodingArray] /FontName RE -
  findfont dup length dict begin
  {
    1 index /FID ne
    {def} {pop pop} ifelse
  } forall
  /Encoding exch def
  /FontName 1 index def
  currentdict definefont pop
  end
} bind def
%%EndResource
%%BeginResource: procset (Apache XML Graphics EPS ProcSet) 1.0 0
%%Version: 1.0 0
%%Copyright: (Copyright 2002-2003 The Apache Software Foundation. License terms: http://www.apache.org/licenses/LICENSE-2.0)
/BeginEPSF { %def
/b4_Inc_state save def         % Save state for cleanup
/dict_count countdictstack def % Count objects on dict stack
/op_count count 1 sub def      % Count objects on operand stack
userdict begin                 % Push userdict on dict stack
/showpage { } def              % Redefine showpage, { } = null proc
0 setgray 0 setlinecap         % Prepare graphics state
1 setlinewidth 0 setlinejoin
10 setmiterlimit [ ] 0 setdash newpath
/languagelevel where           % If level not equal to 1 then
{pop languagelevel             % set strokeadjust and
1 ne                           % overprint to their defaults.
{false setstrokeadjust false setoverprint
} if
} if
} bd
/EndEPSF { %def
count op_count sub {pop} repeat            % Clean up stacks
countdictstack dict_count sub {end} repeat
b4_Inc_state restore
} bd
%%EndResource
%FOPBeginFontDict
%%IncludeResource: font Courier-Oblique
%%IncludeResource: font Courier-BoldOblique
%%IncludeResource: font Courier-Bold
%%IncludeResource: font ZapfDingbats
%%IncludeResource: font Symbol
%%IncludeResource: font Helvetica
%%IncludeResource: font Helvetica-Oblique
%%IncludeResource: font Helvetica-Bold
%%IncludeResource: font Helvetica-BoldOblique
%%IncludeResource: font Times-Roman
%%IncludeResource: font Times-Italic
%%IncludeResource: font Times-Bold
%%IncludeResource: font Times-BoldItalic
%%IncludeResource: font Courier
%FOPEndFontDict
%%BeginResource: encoding WinAnsiEncoding
/WinAnsiEncoding [
/.notdef /.notdef /.notdef /.notdef /.notdef
/.notdef /.notdef /.notdef /.notdef /.notdef
/.notdef /.notdef /.notdef /.notdef /.notdef
/.notdef /.notdef /.notdef /.notdef /.notdef
/.notdef /.notdef /.notdef /.notdef /.notdef
/.notdef /.notdef /.notdef /.notdef /.notdef
/.notdef /.notdef /space /exclam /quotedbl
/numbersign /dollar /percent /ampersand /quotesingle
/parenleft /parenright /asterisk /plus /comma
/hyphen /period /slash /zero /one
/two /three /four /five /six
/seven /eight /nine /colon /semicolon
/less /equal /greater /question /at
/A /B /C /D /E
/F /G /H /I /J
/K /L /M /N /O
/P /Q /R /S /T
/U /V /W /X /Y
/Z /bracketleft /backslash /bracketright /asciicircum
/underscore /quoteleft /a /b /c
/d /e /f /g /h
/i /j /k /l /m
/n /o /p /q /r
/s /t /u /v /w
/x /y /z /braceleft /bar
/braceright /asciitilde /bullet /Euro /bullet
/quotesinglbase /florin /quotedblbase /ellipsis /dagger
/daggerdbl /circumflex /perthousand /Scaron /guilsinglleft
/OE /bullet /Zcaron /bullet /bullet
/quoteleft /quoteright /quotedblleft /quotedblright /bullet
/endash /emdash /asciitilde /trademark /scaron
/guilsinglright /oe /bullet /zcaron /Ydieresis
/space /exclamdown /cent /sterling /currency
/yen /brokenbar /section /dieresis /copyright
/ordfeminine /guillemotleft /logicalnot /sfthyphen /registered
/macron /degree /plusminus /twosuperior /threesuperior
/acute /mu /paragraph /middot /cedilla
/onesuperior /ordmasculine /guillemotright /onequarter /onehalf
/threequarters /questiondown /Agrave /Aacute /Acircumflex
/Atilde /Adieresis /Aring /AE /Ccedilla
/Egrave /Eacute /Ecircumflex /Edieresis /Igrave
/Iacute /Icircumflex /Idieresis /Eth /Ntilde
/Ograve /Oacute /Ocircumflex /Otilde /Odieresis
/multiply /Oslash /Ugrave /Uacute /Ucircumflex
/Udieresis /Yacute /Thorn /germandbls /agrave
/aacute /acircumflex /atilde /adieresis /aring
/ae /ccedilla /egrave /eacute /ecircumflex
/edieresis /igrave /iacute /icircumflex /idieresis
/eth /ntilde /ograve /oacute /ocircumflex
/otilde /odieresis /divide /oslash /ugrave
/uacute /ucircumflex /udieresis /yacute /thorn
/ydieresis
] def
%%EndResource
%FOPBeginFontReencode
/Courier-Oblique findfont
dup length dict begin
  {1 index /FID ne {def} {pop pop} ifelse} forall
  /Encoding WinAnsiEncoding def
  currentdict
end
/Courier-Oblique exch definefont pop
/Courier-BoldOblique findfont
dup length dict begin
  {1 index /FID ne {def} {pop pop} ifelse} forall
  /Encoding WinAnsiEncoding def
  currentdict
end
/Courier-BoldOblique exch definefont pop
/Courier-Bold findfont
dup length dict begin
  {1 index /FID ne {def} {pop pop} ifelse} forall
  /Encoding WinAnsiEncoding def
  currentdict
end
/Courier-Bold exch definefont pop
/Helvetica findfont
dup length dict begin
  {1 index /FID ne {def} {pop pop} ifelse} forall
  /Encoding WinAnsiEncoding def
  currentdict
end
/Helvetica exch definefont pop
/Helvetica-Oblique findfont
dup length dict begin
  {1 index /FID ne {def} {pop pop} ifelse} forall
  /Encoding WinAnsiEncoding def
  currentdict
end
/Helvetica-Oblique exch definefont pop
/Helvetica-Bold findfont
dup length dict begin
  {1 index /FID ne {def} {pop pop} ifelse} forall
  /Encoding WinAnsiEncoding def
  currentdict
end
/Helvetica-Bold exch definefont pop
/Helvetica-BoldOblique findfont
dup length dict begin
  {1 index /FID ne {def} {pop pop} ifelse} forall
  /Encoding WinAnsiEncoding def
  currentdict
end
/Helvetica-BoldOblique exch definefont pop
/Times-Roman findfont
dup length dict begin
  {1 index /FID ne {def} {pop pop} ifelse} forall
  /Encoding WinAnsiEncoding def
  currentdict
end
/Times-Roman exch definefont pop
/Times-Italic findfont
dup length dict begin
  {1 index /FID ne {def} {pop pop} ifelse} forall
  /Encoding WinAnsiEncoding def
  currentdict
end
/Times-Italic exch definefont pop
/Times-Bold findfont
dup length dict begin
  {1 index /FID ne {def} {pop pop} ifelse} forall
  /Encoding WinAnsiEncoding def
  currentdict
end
/Times-Bold exch definefont pop
/Times-BoldItalic findfont
dup length dict begin
  {1 index /FID ne {def} {pop pop} ifelse} forall
  /Encoding WinAnsiEncoding def
  currentdict
end
/Times-BoldItalic exch definefont pop
/Courier findfont
dup length dict begin
  {1 index /FID ne {def} {pop pop} ifelse} forall
  /Encoding WinAnsiEncoding def
  currentdict
end
/Courier exch definefont pop
%FOPEndFontReencode
%%EndProlog
%%Page: 1 1
%%PageBoundingBox: 0 0 198 283
%%BeginPageSetup
[1 0 0 -1 0 283] CT
%%EndPageSetup
GS
[1.00215 0 0 1 0 0] CT
1 GC
N
0 0 198 283 re
f
GR
GS
[1.00215 0 0 1 0 0] CT
1 GC
N
0 0 198 283 re
f
GR
GS
[1.00215 0 0 1 0 0] CT
1 GC
N
80 228 M
179 228 L
179 32 L
80 32 L
cp
f
GR
GS
[1.00215 0 0 1 0 0] CT
0.149 GC
2 setlinecap
1 LJ
0.5 LW
N
80 228 M
179 228 L
S
GR
GS
[1.00215 0 0 1 0 0] CT
0.149 GC
2 setlinecap
1 LJ
0.5 LW
N
109.7 228 M
109.7 226.04 L
S
GR
GS
[1.00215 0 0 1 0 0] CT
0.149 GC
2 setlinecap
1 LJ
0.5 LW
N
149.3 228 M
149.3 226.04 L
S
GR
GS
[1.00215 0 0 1 109.93558 234] CT
0.149 GC
/Helvetica 20 F
GS
[1 0 0 1 0 0] CT
-13 20 moveto 
1 -1 scale
(YA) t 
GR
GR
GS
[1.00215 0 0 1 149.62062 234] CT
0.149 GC
/Helvetica 20 F
GS
[1 0 0 1 0 0] CT
-14.5 20 moveto 
1 -1 scale
(OA) t 
GR
GR
GS
[1.00215 0 0 1 129.77814 259] CT
0.149 GC
/Helvetica 20 F
GS
[1 0 0 1 0 0] CT
-49 20 moveto 
1 -1 scale
(Age Group) t 
GR
GR
GS
[1.00215 0 0 1 0 0] CT
0.149 GC
2 setlinecap
1 LJ
0.5 LW
N
80 228 M
80 32 L
S
GR
GS
[1.00215 0 0 1 0 0] CT
0.149 GC
2 setlinecap
1 LJ
0.5 LW
N
80 228 M
81.96 228 L
S
GR
GS
[1.00215 0 0 1 0 0] CT
0.149 GC
2 setlinecap
1 LJ
0.5 LW
N
80 166.444 M
81.96 166.444 L
S
GR
GS
[1.00215 0 0 1 0 0] CT
0.149 GC
2 setlinecap
1 LJ
0.5 LW
N
80 104.889 M
81.96 104.889 L
S
GR
GS
[1.00215 0 0 1 0 0] CT
0.149 GC
2 setlinecap
1 LJ
0.5 LW
N
80 43.333 M
81.96 43.333 L
S
GR
GS
[1.00215 0 0 1 74.15891 228] CT
0.149 GC
/Helvetica 20 F
GS
[1 0 0 1 0 0] CT
-36 7.5 moveto 
1 -1 scale
(-0.1) t 
GR
GR
GS
[1.00215 0 0 1 74.15891 166.44432] CT
0.149 GC
/Helvetica 20 F
GS
[1 0 0 1 0 0] CT
-47 7.5 moveto 
1 -1 scale
(-0.05) t 
GR
GR
GS
[1.00215 0 0 1 74.15891 104.88863] CT
0.149 GC
/Helvetica 20 F
GS
[1 0 0 1 0 0] CT
-12 7.5 moveto 
1 -1 scale
(0) t 
GR
GR
GS
[1.00215 0 0 1 74.15891 43.33294] CT
0.149 GC
/Helvetica 20 F
GS
[1 0 0 1 0 0] CT
-39 7.5 moveto 
1 -1 scale
(0.05) t 
GR
GR
GS
[0 -1 1.00215 0 24.05154 129.99991] CT
0.149 GC
/Helvetica 20 F
GS
[1 0 0 1 0 0] CT
-53.5 -5 moveto 
1 -1 scale
(ssvep linear) t 
GR
GR
GS
[1.00215 0 0 1 129.77822 29.25] CT
/Helvetica-Bold 22 F
GS
[1 0 0 1 0 0] CT
-41 -5 moveto 
1 -1 scale
(p = 0.41) t 
GR
GR
GS
[1.00215 0 0 1 0 0] CT
0.149 GC
1 LJ
0.5 LW
N
80 104.889 M
179 104.889 L
S
GR
GS
[1.00215 0 0 1 0 0] CT
0.6 GC
N
93.86 104.889 M
93.86 107.19 L
125.54 107.19 L
125.54 104.889 L
cp
f
GR
GS
[1.00215 0 0 1 107.63796 90.55634] CT
0.302 GC
N
2.236 0 M
2.236 -1.235 1.235 -2.236 0 -2.236 C
-1.235 -2.236 -2.236 -1.235 -2.236 0 C
-2.236 1.235 -1.235 2.236 0 2.236 C
1.235 2.236 2.236 1.235 2.236 0 C
cp
f
GR
GS
[1.00215 0 0 1 111.0666 112.53834] CT
0.302 GC
N
/f-1586420743{2.236 0 M
2.236 -1.235 1.235 -2.236 0 -2.236 C
-1.235 -2.236 -2.236 -1.235 -2.236 0 C
-2.236 1.235 -1.235 2.236 0 2.236 C
1.235 2.236 2.236 1.235 2.236 0 C
cp}def
f-1586420743
f
GR
GS
[1.00215 0 0 1 116.7133 108.63268] CT
0.302 GC
N
f-1586420743
f
GR
GS
[1.00215 0 0 1 109.38145 110.09128] CT
0.302 GC
N
f-1586420743
f
GR
GS
[1.00215 0 0 1 103.72108 139.7814] CT
0.302 GC
N
f-1586420743
f
GR
GS
[1.00215 0 0 1 110.93882 70.55365] CT
0.302 GC
N
f-1586420743
f
GR
GS
[1.00215 0 0 1 102.7252 128.32088] CT
0.302 GC
N
f-1586420743
f
GR
GS
[1.00215 0 0 1 106.36387 136.09915] CT
0.302 GC
N
f-1586420743
f
GR
GS
[1.00215 0 0 1 116.89473 123.65051] CT
0.302 GC
N
f-1586420743
f
GR
GS
[1.00215 0 0 1 106.95773 69.83045] CT
0.302 GC
N
f-1586420743
f
GR
GS
[1.00215 0 0 1 105.75051 33.20861] CT
0.302 GC
N
f-1586420743
f
GR
GS
[1.00215 0 0 1 117.807 88.32162] CT
0.302 GC
N
f-1586420743
f
GR
GS
[1.00215 0 0 1 107.35481 84.87988] CT
0.302 GC
N
f-1586420743
f
GR
GS
[1.00215 0 0 1 108.53458 134.60947] CT
0.302 GC
N
f-1586420743
f
GR
GS
[1.00215 0 0 1 116.80929 112.33854] CT
0.302 GC
N
f-1586420743
f
GR
GS
[1.00215 0 0 1 102.40847 75.77444] CT
0.302 GC
N
f-1586420743
f
GR
GS
[1.00215 0 0 1 108.84209 146.86635] CT
0.302 GC
N
f-1586420743
f
GR
GS
[1.00215 0 0 1 102.91365 94.30241] CT
0.302 GC
N
f-1586420743
f
GR
GS
[1.00215 0 0 1 109.65805 138.78287] CT
0.302 GC
N
f-1586420743
f
GR
GS
[1.00215 0 0 1 104.60153 194.90826] CT
0.302 GC
N
f-1586420743
f
GR
GS
[1.00215 0 0 1 105.72565 144.55502] CT
0.302 GC
N
f-1586420743
f
GR
GS
[1.00215 0 0 1 104.20442 124.52402] CT
0.302 GC
N
f-1586420743
f
GR
GS
[1.00215 0 0 1 116.6479 118.9076] CT
0.302 GC
N
f-1586420743
f
GR
GS
[1.00215 0 0 1 102.82473 111.64332] CT
0.302 GC
N
f-1586420743
f
GR
GS
[1.00215 0 0 1 105.80708 126.1321] CT
0.302 GC
N
f-1586420743
f
GR
GS
[1.00215 0 0 1 113.78727 124.67886] CT
0.302 GC
N
f-1586420743
f
GR
GS
[1.00215 0 0 1 109.89978 38.97998] CT
0.302 GC
N
f-1586420743
f
GR
GS
[1.00215 0 0 1 105.64482 87.58002] CT
0.302 GC
N
f-1586420743
f
GR
GS
[1.00215 0 0 1 104.98253 105.22739] CT
0.302 GC
N
f-1586420743
f
GR
GS
[1.00215 0 0 1 112.81131 52.64056] CT
0.302 GC
N
f-1586420743
f
GR
GS
[1.00215 0 0 1 109.36547 33.20861] CT
0.302 GC
N
f-1586420743
f
GR
GS
[1.00215 0 0 1 112.1891 96.59552] CT
0.302 GC
N
f-1586420743
f
GR
GS
[1.00215 0 0 1 111.90865 181.46797] CT
0.302 GC
N
f-1586420743
f
GR
GS
[1.00215 0 0 1 116.95172 148.72417] CT
0.302 GC
N
f-1586420743
f
GR
GS
[1.00215 0 0 1 113.7017 115.08575] CT
0.302 GC
N
f-1586420743
f
GR
GS
[1.00215 0 0 1 103.69071 110.70866] CT
0.302 GC
N
f-1586420743
f
GR
GS
[1.00215 0 0 1 102.55396 82.02923] CT
0.302 GC
N
f-1586420743
f
GR
GS
[1.00215 0 0 1 110.17089 89.66087] CT
0.302 GC
N
f-1586420743
f
GR
GS
[1.00215 0 0 1 111.0824 113.61983] CT
0.302 GC
N
f-1586420743
f
GR
GS
[1.00215 0 0 1 105.04803 114.11666] CT
0.302 GC
N
f-1586420743
f
GR
GS
[1.00215 0 0 1 102.33231 114.12761] CT
0.302 GC
N
f-1586420743
f
GR
GS
[1.00215 0 0 1 107.605 73.71181] CT
0.302 GC
N
f-1586420743
f
GR
GS
[1.00215 0 0 1 0 0] CT
0.6 GC
N
/f-1575480146{133.46 104.889 M
133.46 113.216 L
165.14 113.216 L
165.14 104.889 L
cp}def
f-1575480146
f
GR
GS
[1.00215 0 0 1 143.46955 84.43914] CT
0.302 GC
N
f-1586420743
f
GR
GS
[1.00215 0 0 1 150.63615 101.76749] CT
0.302 GC
N
f-1586420743
f
GR
GS
[1.00215 0 0 1 145.71294 139.07898] CT
0.302 GC
N
f-1586420743
f
GR
GS
[1.00215 0 0 1 152.86899 116.8007] CT
0.302 GC
N
f-1586420743
f
GR
GS
[1.00215 0 0 1 152.13572 151.29823] CT
0.302 GC
N
f-1586420743
f
GR
GS
[1.00215 0 0 1 147.94794 111.05083] CT
0.302 GC
N
f-1586420743
f
GR
GS
[1.00215 0 0 1 142.18631 109.49519] CT
0.302 GC
N
f-1586420743
f
GR
GS
[1.00215 0 0 1 152.41971 71.17037] CT
0.302 GC
N
f-1586420743
f
GR
GS
[1.00215 0 0 1 146.70278 144.09526] CT
0.302 GC
N
f-1586420743
f
GR
GS
[1.00215 0 0 1 144.54285 109.60649] CT
0.302 GC
N
f-1586420743
f
GR
GS
[1.00215 0 0 1 145.91925 104.12997] CT
0.302 GC
N
f-1586420743
f
GR
GS
[1.00215 0 0 1 153.76933 175.22736] CT
0.302 GC
N
f-1586420743
f
GR
GS
[1.00215 0 0 1 147.68263 109.91225] CT
0.302 GC
N
f-1586420743
f
GR
GS
[1.00215 0 0 1 141.91449 196.59473] CT
0.302 GC
N
f-1586420743
f
GR
GS
[1.00215 0 0 1 147.41651 100.25989] CT
0.302 GC
N
f-1586420743
f
GR
GS
[1.00215 0 0 1 147.50667 125.32632] CT
0.302 GC
N
f-1586420743
f
GR
GS
[1.00215 0 0 1 142.67263 129.47701] CT
0.302 GC
N
f-1586420743
f
GR
GS
[1.00215 0 0 1 142.42992 95.23485] CT
0.302 GC
N
f-1586420743
f
GR
GS
[1.00215 0 0 1 147.2087 107.9519] CT
0.302 GC
N
f-1586420743
f
GR
GS
[1.00215 0 0 1 148.97766 144.87561] CT
0.302 GC
N
f-1586420743
f
GR
GS
[1.00215 0 0 1 147.78001 106.69121] CT
0.302 GC
N
f-1586420743
f
GR
GS
[1.00215 0 0 1 145.24594 117.0014] CT
0.302 GC
N
f-1586420743
f
GR
GS
[1.00215 0 0 1 151.10453 32] CT
0.302 GC
N
f-1586420743
f
GR
GS
[1.00215 0 0 1 151.18336 44.42682] CT
0.302 GC
N
f-1586420743
f
GR
GS
[1.00215 0 0 1 144.35436 105.15634] CT
0.302 GC
N
f-1586420743
f
GR
GS
[1.00215 0 0 1 144.08907 139.11716] CT
0.302 GC
N
f-1586420743
f
GR
GS
[1.00215 0 0 1 154.61697 66.72349] CT
0.302 GC
N
f-1586420743
f
GR
GS
[1.00215 0 0 1 143.77023 104.11404] CT
0.302 GC
N
f-1586420743
f
GR
GS
[1.00215 0 0 1 152.60586 176.88219] CT
0.302 GC
N
f-1586420743
f
GR
GS
[1.00215 0 0 1 145.80584 86.21377] CT
0.302 GC
N
f-1586420743
f
GR
GS
[1.00215 0 0 1 155.0887 135.76059] CT
0.302 GC
N
f-1586420743
f
GR
GS
[1.00215 0 0 1 141.87294 131.36073] CT
0.302 GC
N
f-1586420743
f
GR
GS
[1.00215 0 0 1 150.25388 145.14142] CT
0.302 GC
N
f-1586420743
f
GR
GS
[1.00215 0 0 1 157.50876 138.95502] CT
0.302 GC
N
f-1586420743
f
GR
GS
[1.00215 0 0 1 146.25928 36.16769] CT
0.302 GC
N
f-1586420743
f
GR
GS
[1.00215 0 0 1 146.0685 112.24603] CT
0.302 GC
N
f-1586420743
f
GR
GS
[1.00215 0 0 1 156.7354 91.09753] CT
0.302 GC
N
f-1586420743
f
GR
GS
[1.00215 0 0 1 142.98231 67.63361] CT
0.302 GC
N
f-1586420743
f
GR
GS
[1.00215 0 0 1 141.92108 84.25734] CT
0.302 GC
N
f-1586420743
f
GR
GS
[1.00215 0 0 1 142.46194 154.62172] CT
0.302 GC
N
f-1586420743
f
GR
GS
[1.00215 0 0 1 151.1923 61.79023] CT
0.302 GC
N
f-1586420743
f
GR
GS
[1.00215 0 0 1 144.52046 126.56151] CT
0.302 GC
N
f-1586420743
f
GR
GS
[1.00215 0 0 1 149.91356 96.08026] CT
0.302 GC
N
f-1586420743
f
GR
GS
[1.00215 0 0 1 142.40808 32] CT
0.302 GC
N
f-1586420743
f
GR
GS
[1.00215 0 0 1 153.94364 95.94476] CT
0.302 GC
N
f-1586420743
f
GR
GS
[1.00215 0 0 1 145.91328 119.03987] CT
0.302 GC
N
f-1586420743
f
GR
GS
[1.00215 0 0 1 151.19937 159.23698] CT
0.302 GC
N
f-1586420743
f
GR
GS
[1.00215 0 0 1 151.80239 143.76158] CT
0.302 GC
N
f-1586420743
f
GR
GS
[1.00215 0 0 1 146.23432 115.26039] CT
0.302 GC
N
f-1586420743
f
GR
GS
[1.00215 0 0 1 145.85046 123.29723] CT
0.302 GC
N
f-1586420743
f
GR
GS
[1.00215 0 0 1 149.96418 145.20288] CT
0.302 GC
N
f-1586420743
f
GR
GS
[1.00215 0 0 1 148.5808 144.62816] CT
0.302 GC
N
f-1586420743
f
GR
GS
[1.00215 0 0 1 152.29652 134.29782] CT
0.302 GC
N
f-1586420743
f
GR
%%Trailer
%%Pages: 1
%%EOF
