%!PS-Adobe-3.0 EPSF-3.0
%%Creator: (MATLAB, The Mathworks, Inc. Version 9.8.0.1323502 \(R2020a\). Operating System: Mac OS X)
%%Title: /Users/kosciessa/Desktop/mntTardisLNDG/LNDG/stateswitch/stsw_multimodal/figures/linearbyage/linearcomp_alpha.eps
%%CreationDate: 2022-03-03T16:32:26
%%Pages: (atend)
%%BoundingBox:     4     0   180   275
%%LanguageLevel: 3
%%EndComments
%%BeginProlog
%%BeginResource: procset (Apache XML Graphics Std ProcSet) 1.2 0
%%Version: 1.2 0
%%Copyright: (Copyright 2001-2003,2010 The Apache Software Foundation. License terms: http://www.apache.org/licenses/LICENSE-2.0)
/bd{bind def}bind def
/ld{load def}bd
/GR/grestore ld
/GS/gsave ld
/RM/rmoveto ld
/C/curveto ld
/t/show ld
/L/lineto ld
/ML/setmiterlimit ld
/CT/concat ld
/f/fill ld
/N/newpath ld
/S/stroke ld
/CC/setcmykcolor ld
/A/ashow ld
/cp/closepath ld
/RC/setrgbcolor ld
/LJ/setlinejoin ld
/GC/setgray ld
/LW/setlinewidth ld
/M/moveto ld
/re {4 2 roll M
1 index 0 rlineto
0 exch rlineto
neg 0 rlineto
cp } bd
/_ctm matrix def
/_tm matrix def
/BT { _ctm currentmatrix pop matrix _tm copy pop 0 0 moveto } bd
/ET { _ctm setmatrix } bd
/iTm { _ctm setmatrix _tm concat } bd
/Tm { _tm astore pop iTm 0 0 moveto } bd
/ux 0.0 def
/uy 0.0 def
/F {
  /Tp exch def
  /Tf exch def
  Tf findfont Tp scalefont setfont
  /cf Tf def  /cs Tp def
} bd
/ULS {currentpoint /uy exch def /ux exch def} bd
/ULE {
  /Tcx currentpoint pop def
  gsave
  newpath
  cf findfont cs scalefont dup
  /FontMatrix get 0 get /Ts exch def /FontInfo get dup
  /UnderlinePosition get Ts mul /To exch def
  /UnderlineThickness get Ts mul /Tt exch def
  ux uy To add moveto  Tcx uy To add lineto
  Tt setlinewidth stroke
  grestore
} bd
/OLE {
  /Tcx currentpoint pop def
  gsave
  newpath
  cf findfont cs scalefont dup
  /FontMatrix get 0 get /Ts exch def /FontInfo get dup
  /UnderlinePosition get Ts mul /To exch def
  /UnderlineThickness get Ts mul /Tt exch def
  ux uy To add cs add moveto Tcx uy To add cs add lineto
  Tt setlinewidth stroke
  grestore
} bd
/SOE {
  /Tcx currentpoint pop def
  gsave
  newpath
  cf findfont cs scalefont dup
  /FontMatrix get 0 get /Ts exch def /FontInfo get dup
  /UnderlinePosition get Ts mul /To exch def
  /UnderlineThickness get Ts mul /Tt exch def
  ux uy To add cs 10 mul 26 idiv add moveto Tcx uy To add cs 10 mul 26 idiv add lineto
  Tt setlinewidth stroke
  grestore
} bd
/QT {
/Y22 exch store
/X22 exch store
/Y21 exch store
/X21 exch store
currentpoint
/Y21 load 2 mul add 3 div exch
/X21 load 2 mul add 3 div exch
/X21 load 2 mul /X22 load add 3 div
/Y21 load 2 mul /Y22 load add 3 div
/X22 load /Y22 load curveto
} bd
/SSPD {
dup length /d exch dict def
{
/v exch def
/k exch def
currentpagedevice k known {
/cpdv currentpagedevice k get def
v cpdv ne {
/upd false def
/nullv v type /nulltype eq def
/nullcpdv cpdv type /nulltype eq def
nullv nullcpdv or
{
/upd true def
} {
/sametype v type cpdv type eq def
sametype {
v type /arraytype eq {
/vlen v length def
/cpdvlen cpdv length def
vlen cpdvlen eq {
0 1 vlen 1 sub {
/i exch def
/obj v i get def
/cpdobj cpdv i get def
obj cpdobj ne {
/upd true def
exit
} if
} for
} {
/upd true def
} ifelse
} {
v type /dicttype eq {
v {
/dv exch def
/dk exch def
/cpddv cpdv dk get def
dv cpddv ne {
/upd true def
exit
} if
} forall
} {
/upd true def
} ifelse
} ifelse
} if
} ifelse
upd true eq {
d k v put
} if
} if
} if
} forall
d length 0 gt {
d setpagedevice
} if
} bd
/RE { % /NewFontName [NewEncodingArray] /FontName RE -
  findfont dup length dict begin
  {
    1 index /FID ne
    {def} {pop pop} ifelse
  } forall
  /Encoding exch def
  /FontName 1 index def
  currentdict definefont pop
  end
} bind def
%%EndResource
%%BeginResource: procset (Apache XML Graphics EPS ProcSet) 1.0 0
%%Version: 1.0 0
%%Copyright: (Copyright 2002-2003 The Apache Software Foundation. License terms: http://www.apache.org/licenses/LICENSE-2.0)
/BeginEPSF { %def
/b4_Inc_state save def         % Save state for cleanup
/dict_count countdictstack def % Count objects on dict stack
/op_count count 1 sub def      % Count objects on operand stack
userdict begin                 % Push userdict on dict stack
/showpage { } def              % Redefine showpage, { } = null proc
0 setgray 0 setlinecap         % Prepare graphics state
1 setlinewidth 0 setlinejoin
10 setmiterlimit [ ] 0 setdash newpath
/languagelevel where           % If level not equal to 1 then
{pop languagelevel             % set strokeadjust and
1 ne                           % overprint to their defaults.
{false setstrokeadjust false setoverprint
} if
} if
} bd
/EndEPSF { %def
count op_count sub {pop} repeat            % Clean up stacks
countdictstack dict_count sub {end} repeat
b4_Inc_state restore
} bd
%%EndResource
%FOPBeginFontDict
%%IncludeResource: font Courier-Oblique
%%IncludeResource: font Courier-BoldOblique
%%IncludeResource: font Courier-Bold
%%IncludeResource: font ZapfDingbats
%%IncludeResource: font Symbol
%%IncludeResource: font Helvetica
%%IncludeResource: font Helvetica-Oblique
%%IncludeResource: font Helvetica-Bold
%%IncludeResource: font Helvetica-BoldOblique
%%IncludeResource: font Times-Roman
%%IncludeResource: font Times-Italic
%%IncludeResource: font Times-Bold
%%IncludeResource: font Times-BoldItalic
%%IncludeResource: font Courier
%FOPEndFontDict
%%BeginResource: encoding WinAnsiEncoding
/WinAnsiEncoding [
/.notdef /.notdef /.notdef /.notdef /.notdef
/.notdef /.notdef /.notdef /.notdef /.notdef
/.notdef /.notdef /.notdef /.notdef /.notdef
/.notdef /.notdef /.notdef /.notdef /.notdef
/.notdef /.notdef /.notdef /.notdef /.notdef
/.notdef /.notdef /.notdef /.notdef /.notdef
/.notdef /.notdef /space /exclam /quotedbl
/numbersign /dollar /percent /ampersand /quotesingle
/parenleft /parenright /asterisk /plus /comma
/hyphen /period /slash /zero /one
/two /three /four /five /six
/seven /eight /nine /colon /semicolon
/less /equal /greater /question /at
/A /B /C /D /E
/F /G /H /I /J
/K /L /M /N /O
/P /Q /R /S /T
/U /V /W /X /Y
/Z /bracketleft /backslash /bracketright /asciicircum
/underscore /quoteleft /a /b /c
/d /e /f /g /h
/i /j /k /l /m
/n /o /p /q /r
/s /t /u /v /w
/x /y /z /braceleft /bar
/braceright /asciitilde /bullet /Euro /bullet
/quotesinglbase /florin /quotedblbase /ellipsis /dagger
/daggerdbl /circumflex /perthousand /Scaron /guilsinglleft
/OE /bullet /Zcaron /bullet /bullet
/quoteleft /quoteright /quotedblleft /quotedblright /bullet
/endash /emdash /asciitilde /trademark /scaron
/guilsinglright /oe /bullet /zcaron /Ydieresis
/space /exclamdown /cent /sterling /currency
/yen /brokenbar /section /dieresis /copyright
/ordfeminine /guillemotleft /logicalnot /sfthyphen /registered
/macron /degree /plusminus /twosuperior /threesuperior
/acute /mu /paragraph /middot /cedilla
/onesuperior /ordmasculine /guillemotright /onequarter /onehalf
/threequarters /questiondown /Agrave /Aacute /Acircumflex
/Atilde /Adieresis /Aring /AE /Ccedilla
/Egrave /Eacute /Ecircumflex /Edieresis /Igrave
/Iacute /Icircumflex /Idieresis /Eth /Ntilde
/Ograve /Oacute /Ocircumflex /Otilde /Odieresis
/multiply /Oslash /Ugrave /Uacute /Ucircumflex
/Udieresis /Yacute /Thorn /germandbls /agrave
/aacute /acircumflex /atilde /adieresis /aring
/ae /ccedilla /egrave /eacute /ecircumflex
/edieresis /igrave /iacute /icircumflex /idieresis
/eth /ntilde /ograve /oacute /ocircumflex
/otilde /odieresis /divide /oslash /ugrave
/uacute /ucircumflex /udieresis /yacute /thorn
/ydieresis
] def
%%EndResource
%FOPBeginFontReencode
/Courier-Oblique findfont
dup length dict begin
  {1 index /FID ne {def} {pop pop} ifelse} forall
  /Encoding WinAnsiEncoding def
  currentdict
end
/Courier-Oblique exch definefont pop
/Courier-BoldOblique findfont
dup length dict begin
  {1 index /FID ne {def} {pop pop} ifelse} forall
  /Encoding WinAnsiEncoding def
  currentdict
end
/Courier-BoldOblique exch definefont pop
/Courier-Bold findfont
dup length dict begin
  {1 index /FID ne {def} {pop pop} ifelse} forall
  /Encoding WinAnsiEncoding def
  currentdict
end
/Courier-Bold exch definefont pop
/Helvetica findfont
dup length dict begin
  {1 index /FID ne {def} {pop pop} ifelse} forall
  /Encoding WinAnsiEncoding def
  currentdict
end
/Helvetica exch definefont pop
/Helvetica-Oblique findfont
dup length dict begin
  {1 index /FID ne {def} {pop pop} ifelse} forall
  /Encoding WinAnsiEncoding def
  currentdict
end
/Helvetica-Oblique exch definefont pop
/Helvetica-Bold findfont
dup length dict begin
  {1 index /FID ne {def} {pop pop} ifelse} forall
  /Encoding WinAnsiEncoding def
  currentdict
end
/Helvetica-Bold exch definefont pop
/Helvetica-BoldOblique findfont
dup length dict begin
  {1 index /FID ne {def} {pop pop} ifelse} forall
  /Encoding WinAnsiEncoding def
  currentdict
end
/Helvetica-BoldOblique exch definefont pop
/Times-Roman findfont
dup length dict begin
  {1 index /FID ne {def} {pop pop} ifelse} forall
  /Encoding WinAnsiEncoding def
  currentdict
end
/Times-Roman exch definefont pop
/Times-Italic findfont
dup length dict begin
  {1 index /FID ne {def} {pop pop} ifelse} forall
  /Encoding WinAnsiEncoding def
  currentdict
end
/Times-Italic exch definefont pop
/Times-Bold findfont
dup length dict begin
  {1 index /FID ne {def} {pop pop} ifelse} forall
  /Encoding WinAnsiEncoding def
  currentdict
end
/Times-Bold exch definefont pop
/Times-BoldItalic findfont
dup length dict begin
  {1 index /FID ne {def} {pop pop} ifelse} forall
  /Encoding WinAnsiEncoding def
  currentdict
end
/Times-BoldItalic exch definefont pop
/Courier findfont
dup length dict begin
  {1 index /FID ne {def} {pop pop} ifelse} forall
  /Encoding WinAnsiEncoding def
  currentdict
end
/Courier exch definefont pop
%FOPEndFontReencode
%%EndProlog
%%Page: 1 1
%%PageBoundingBox: 0 0 198 283
%%BeginPageSetup
[1 0 0 -1 0 283] CT
%%EndPageSetup
GS
[1.00215 0 0 1 0 0] CT
1 GC
N
0 0 198 283 re
f
GR
GS
[1.00215 0 0 1 0 0] CT
1 GC
N
0 0 198 283 re
f
GR
GS
[1.00215 0 0 1 0 0] CT
1 GC
N
69 228 M
179 228 L
179 32 L
69 32 L
cp
f
GR
GS
[1.00215 0 0 1 0 0] CT
0.149 GC
2 setlinecap
1 LJ
0.5 LW
N
69 228 M
179 228 L
S
GR
GS
[1.00215 0 0 1 0 0] CT
0.149 GC
2 setlinecap
1 LJ
0.5 LW
N
102 228 M
102 226.04 L
S
GR
GS
[1.00215 0 0 1 0 0] CT
0.149 GC
2 setlinecap
1 LJ
0.5 LW
N
146 228 M
146 226.04 L
S
GR
GS
[1.00215 0 0 1 102.21904 234] CT
0.149 GC
/Helvetica 20 F
GS
[1 0 0 1 0 0] CT
-13 20 moveto 
1 -1 scale
(YA) t 
GR
GR
GS
[1.00215 0 0 1 146.31353 234] CT
0.149 GC
/Helvetica 20 F
GS
[1 0 0 1 0 0] CT
-14.5 20 moveto 
1 -1 scale
(OA) t 
GR
GR
GS
[1.00215 0 0 1 124.26634 259] CT
0.149 GC
/Helvetica 20 F
GS
[1 0 0 1 0 0] CT
-49 20 moveto 
1 -1 scale
(Age Group) t 
GR
GR
GS
[1.00215 0 0 1 0 0] CT
0.149 GC
2 setlinecap
1 LJ
0.5 LW
N
69 228 M
69 32 L
S
GR
GS
[1.00215 0 0 1 0 0] CT
0.149 GC
2 setlinecap
1 LJ
0.5 LW
N
69 217.958 M
70.96 217.958 L
S
GR
GS
[1.00215 0 0 1 0 0] CT
0.149 GC
2 setlinecap
1 LJ
0.5 LW
N
69 155.972 M
70.96 155.972 L
S
GR
GS
[1.00215 0 0 1 0 0] CT
0.149 GC
2 setlinecap
1 LJ
0.5 LW
N
69 93.986 M
70.96 93.986 L
S
GR
GS
[1.00215 0 0 1 0 0] CT
0.149 GC
2 setlinecap
1 LJ
0.5 LW
N
69 32 M
70.96 32 L
S
GR
GS
[1.00215 0 0 1 63.13529 217.95833] CT
0.149 GC
/Helvetica 20 F
GS
[1 0 0 1 0 0] CT
-36 7.5 moveto 
1 -1 scale
(-0.2) t 
GR
GR
GS
[1.00215 0 0 1 63.13529 155.97221] CT
0.149 GC
/Helvetica 20 F
GS
[1 0 0 1 0 0] CT
-12 7.5 moveto 
1 -1 scale
(0) t 
GR
GR
GS
[1.00215 0 0 1 63.13529 93.98611] CT
0.149 GC
/Helvetica 20 F
GS
[1 0 0 1 0 0] CT
-28 7.5 moveto 
1 -1 scale
(0.2) t 
GR
GR
GS
[1.00215 0 0 1 63.13529 32] CT
0.149 GC
/Helvetica 20 F
GS
[1 0 0 1 0 0] CT
-28 7.5 moveto 
1 -1 scale
(0.4) t 
GR
GR
GS
[0 -1 1.00215 0 24.05154 129.99991] CT
0.149 GC
/Helvetica 20 F
GS
[1 0 0 1 0 0] CT
-51.5 -5 moveto 
1 -1 scale
(alpha linear) t 
GR
GR
GS
[1.00215 0 0 1 124.26641 29.25] CT
/Helvetica-Bold 22 F
GS
[1 0 0 1 0 0] CT
-58 -5 moveto 
1 -1 scale
(p = 8.6e-08) t 
GR
GR
GS
[1.00215 0 0 1 0 0] CT
0.149 GC
1 LJ
0.5 LW
N
69 155.972 M
179 155.972 L
S
GR
GS
[1.00215 0 0 1 0 0] CT
1 0.6 0.6 RC
N
119.6 155.972 M
119.6 122.12 L
84.4 122.12 L
84.4 155.972 L
cp
f
GR
GS
[1.00215 0 0 1 101.61636 100.27826] CT
0.302 GC
N
2.236 0 M
2.236 -1.235 1.235 -2.236 0 -2.236 C
-1.235 -2.236 -2.236 -1.235 -2.236 0 C
-2.236 1.235 -1.235 2.236 0 2.236 C
1.235 2.236 2.236 1.235 2.236 0 C
cp
f
GR
GS
[1.00215 0 0 1 107.26483 165.56178] CT
0.302 GC
N
/f-1586420743{2.236 0 M
2.236 -1.235 1.235 -2.236 0 -2.236 C
-1.235 -2.236 -2.236 -1.235 -2.236 0 C
-2.236 1.235 -1.235 2.236 0 2.236 C
1.235 2.236 2.236 1.235 2.236 0 C
cp}def
f-1586420743
f
GR
GS
[1.00215 0 0 1 93.41405 66.05814] CT
0.302 GC
N
f-1586420743
f
GR
GS
[1.00215 0 0 1 93.99936 91.1025] CT
0.302 GC
N
f-1586420743
f
GR
GS
[1.00215 0 0 1 101.74889 166.63873] CT
0.302 GC
N
f-1586420743
f
GR
GS
[1.00215 0 0 1 110.71441 146.75188] CT
0.302 GC
N
f-1586420743
f
GR
GS
[1.00215 0 0 1 95.45712 110.97173] CT
0.302 GC
N
f-1586420743
f
GR
GS
[1.00215 0 0 1 105.2426 133.56284] CT
0.302 GC
N
f-1586420743
f
GR
GS
[1.00215 0 0 1 99.3347 145.84187] CT
0.302 GC
N
f-1586420743
f
GR
GS
[1.00215 0 0 1 96.76755 69.03941] CT
0.302 GC
N
f-1586420743
f
GR
GS
[1.00215 0 0 1 98.19309 96.04082] CT
0.302 GC
N
f-1586420743
f
GR
GS
[1.00215 0 0 1 93.6846 129.245] CT
0.302 GC
N
f-1586420743
f
GR
GS
[1.00215 0 0 1 104.96892 153.95157] CT
0.302 GC
N
f-1586420743
f
GR
GS
[1.00215 0 0 1 102.98322 138.36353] CT
0.302 GC
N
f-1586420743
f
GR
GS
[1.00215 0 0 1 105.84488 109.26817] CT
0.302 GC
N
f-1586420743
f
GR
GS
[1.00215 0 0 1 109.28127 181.01669] CT
0.302 GC
N
f-1586420743
f
GR
GS
[1.00215 0 0 1 103.38175 142.83791] CT
0.302 GC
N
f-1586420743
f
GR
GS
[1.00215 0 0 1 108.9539 97.30054] CT
0.302 GC
N
f-1586420743
f
GR
GS
[1.00215 0 0 1 95.69119 59.7842] CT
0.302 GC
N
f-1586420743
f
GR
GS
[1.00215 0 0 1 97.41869 196.47823] CT
0.302 GC
N
f-1586420743
f
GR
GS
[1.00215 0 0 1 104.31596 110.82513] CT
0.302 GC
N
f-1586420743
f
GR
GS
[1.00215 0 0 1 108.53586 89.47768] CT
0.302 GC
N
f-1586420743
f
GR
GS
[1.00215 0 0 1 101.44718 146.04794] CT
0.302 GC
N
f-1586420743
f
GR
GS
[1.00215 0 0 1 100.44108 118.71526] CT
0.302 GC
N
f-1586420743
f
GR
GS
[1.00215 0 0 1 107.00317 125.77378] CT
0.302 GC
N
f-1586420743
f
GR
GS
[1.00215 0 0 1 97.82271 179.42308] CT
0.302 GC
N
f-1586420743
f
GR
GS
[1.00215 0 0 1 107.91151 120.88796] CT
0.302 GC
N
f-1586420743
f
GR
GS
[1.00215 0 0 1 109.52104 98.82901] CT
0.302 GC
N
f-1586420743
f
GR
GS
[1.00215 0 0 1 109.02806 86.28278] CT
0.302 GC
N
f-1586420743
f
GR
GS
[1.00215 0 0 1 103.52967 123.16943] CT
0.302 GC
N
f-1586420743
f
GR
GS
[1.00215 0 0 1 95.68774 98.92915] CT
0.302 GC
N
f-1586420743
f
GR
GS
[1.00215 0 0 1 105.94436 59.7842] CT
0.302 GC
N
f-1586420743
f
GR
GS
[1.00215 0 0 1 96.1849 114.874] CT
0.302 GC
N
f-1586420743
f
GR
GS
[1.00215 0 0 1 97.66482 83.16247] CT
0.302 GC
N
f-1586420743
f
GR
GS
[1.00215 0 0 1 99.86446 67.19598] CT
0.302 GC
N
f-1586420743
f
GR
GS
[1.00215 0 0 1 107.34015 92.42584] CT
0.302 GC
N
f-1586420743
f
GR
GS
[1.00215 0 0 1 97.40356 143.36368] CT
0.302 GC
N
f-1586420743
f
GR
GS
[1.00215 0 0 1 97.92865 131.7699] CT
0.302 GC
N
f-1586420743
f
GR
GS
[1.00215 0 0 1 93.51377 181.93758] CT
0.302 GC
N
f-1586420743
f
GR
GS
[1.00215 0 0 1 105.9685 150.43365] CT
0.302 GC
N
f-1586420743
f
GR
GS
[1.00215 0 0 1 106.82533 181.11719] CT
0.302 GC
N
f-1586420743
f
GR
GS
[1.00215 0 0 1 100.68962 124.52836] CT
0.302 GC
N
f-1586420743
f
GR
GS
[1.00215 0 0 1 0 0] CT
0.6 GC
N
/f-1039465622{128.4 155.972 M
128.4 158.508 L
163.6 158.508 L
163.6 155.972 L
cp}def
f-1039465622
f
GR
GS
[1.00215 0 0 1 150.76929 136.39632] CT
0.302 GC
N
f-1586420743
f
GR
GS
[1.00215 0 0 1 142.28164 163.55295] CT
0.302 GC
N
f-1586420743
f
GR
GS
[1.00215 0 0 1 144.6987 122.41418] CT
0.302 GC
N
f-1586420743
f
GR
GS
[1.00215 0 0 1 150.20387 200.26476] CT
0.302 GC
N
f-1586420743
f
GR
GS
[1.00215 0 0 1 141.32254 128.52545] CT
0.302 GC
N
f-1586420743
f
GR
GS
[1.00215 0 0 1 154.72002 228] CT
0.302 GC
N
f-1586420743
f
GR
GS
[1.00215 0 0 1 150.23109 144.48567] CT
0.302 GC
N
f-1586420743
f
GR
GS
[1.00215 0 0 1 139.48137 158.92653] CT
0.302 GC
N
f-1586420743
f
GR
GS
[1.00215 0 0 1 145.2361 166.4796] CT
0.302 GC
N
f-1586420743
f
GR
GS
[1.00215 0 0 1 151.24874 143.25774] CT
0.302 GC
N
f-1586420743
f
GR
GS
[1.00215 0 0 1 153.79792 171.73689] CT
0.302 GC
N
f-1586420743
f
GR
GS
[1.00215 0 0 1 145.28389 208.01927] CT
0.302 GC
N
f-1586420743
f
GR
GS
[1.00215 0 0 1 142.78147 167.7346] CT
0.302 GC
N
f-1586420743
f
GR
GS
[1.00215 0 0 1 152.61388 154.37601] CT
0.302 GC
N
f-1586420743
f
GR
GS
[1.00215 0 0 1 140.16741 176.99336] CT
0.302 GC
N
f-1586420743
f
GR
GS
[1.00215 0 0 1 149.34357 162.45602] CT
0.302 GC
N
f-1586420743
f
GR
GS
[1.00215 0 0 1 152.21505 157.61406] CT
0.302 GC
N
f-1586420743
f
GR
GS
[1.00215 0 0 1 142.23943 146.43739] CT
0.302 GC
N
f-1586420743
f
GR
GS
[1.00215 0 0 1 150.51168 184.66974] CT
0.302 GC
N
f-1586420743
f
GR
GS
[1.00215 0 0 1 151.8661 143.01952] CT
0.302 GC
N
f-1586420743
f
GR
GS
[1.00215 0 0 1 141.98195 129.76164] CT
0.302 GC
N
f-1586420743
f
GR
GS
[1.00215 0 0 1 155.12152 174.19333] CT
0.302 GC
N
f-1586420743
f
GR
GS
[1.00215 0 0 1 140.27191 131.2076] CT
0.302 GC
N
f-1586420743
f
GR
GS
[1.00215 0 0 1 140.23506 163.69707] CT
0.302 GC
N
f-1586420743
f
GR
GS
[1.00215 0 0 1 147.91161 136.61787] CT
0.302 GC
N
f-1586420743
f
GR
GS
[1.00215 0 0 1 152.02277 140.10576] CT
0.302 GC
N
f-1586420743
f
GR
GS
[1.00215 0 0 1 147.68803 135.98595] CT
0.302 GC
N
f-1586420743
f
GR
GS
[1.00215 0 0 1 142.72379 157.13359] CT
0.302 GC
N
f-1586420743
f
GR
GS
[1.00215 0 0 1 146.51778 135.13173] CT
0.302 GC
N
f-1586420743
f
GR
GS
[1.00215 0 0 1 142.03918 176.96652] CT
0.302 GC
N
f-1586420743
f
GR
GS
[1.00215 0 0 1 149.63107 178.01628] CT
0.302 GC
N
f-1586420743
f
GR
GS
[1.00215 0 0 1 144.75278 123.08691] CT
0.302 GC
N
f-1586420743
f
GR
GS
[1.00215 0 0 1 138.02647 176.73822] CT
0.302 GC
N
f-1586420743
f
GR
GS
[1.00215 0 0 1 153.42034 183.84024] CT
0.302 GC
N
f-1586420743
f
GR
GS
[1.00215 0 0 1 138.03317 127.20377] CT
0.302 GC
N
f-1586420743
f
GR
GS
[1.00215 0 0 1 150.36722 167.66093] CT
0.302 GC
N
f-1586420743
f
GR
GS
[1.00215 0 0 1 145.38559 164.44298] CT
0.302 GC
N
f-1586420743
f
GR
GS
[1.00215 0 0 1 153.54587 135.12547] CT
0.302 GC
N
f-1586420743
f
GR
GS
[1.00215 0 0 1 152.07879 156.85492] CT
0.302 GC
N
f-1586420743
f
GR
GS
[1.00215 0 0 1 149.85715 156.40706] CT
0.302 GC
N
f-1586420743
f
GR
GS
[1.00215 0 0 1 141.06204 185.3232] CT
0.302 GC
N
f-1586420743
f
GR
GS
[1.00215 0 0 1 150.97041 190.41992] CT
0.302 GC
N
f-1586420743
f
GR
GS
[1.00215 0 0 1 152.42688 194.6841] CT
0.302 GC
N
f-1586420743
f
GR
GS
[1.00215 0 0 1 154.16699 120.42628] CT
0.302 GC
N
f-1586420743
f
GR
GS
[1.00215 0 0 1 143.21115 153.09369] CT
0.302 GC
N
f-1586420743
f
GR
GS
[1.00215 0 0 1 147.55528 155.67937] CT
0.302 GC
N
f-1586420743
f
GR
GS
[1.00215 0 0 1 141.65306 186.89836] CT
0.302 GC
N
f-1586420743
f
GR
GS
[1.00215 0 0 1 144.15192 164.26198] CT
0.302 GC
N
f-1586420743
f
GR
GS
[1.00215 0 0 1 151.81782 172.68509] CT
0.302 GC
N
f-1586420743
f
GR
GS
[1.00215 0 0 1 142.48869 107.11758] CT
0.302 GC
N
f-1586420743
f
GR
GS
[1.00215 0 0 1 144.7482 173.58824] CT
0.302 GC
N
f-1586420743
f
GR
GS
[1.00215 0 0 1 148.03256 135.28331] CT
0.302 GC
N
f-1586420743
f
GR
GS
[1.00215 0 0 1 144.37351 145.92854] CT
0.302 GC
N
f-1586420743
f
GR
%%Trailer
%%Pages: 1
%%EOF
