%!PS-Adobe-3.0 EPSF-3.0
%%Creator: (MATLAB, The Mathworks, Inc. Version 9.8.0.1323502 \(R2020a\). Operating System: Mac OS X)
%%Title: /Users/kosciessa/Desktop/mntTardisLNDG/LNDG/stateswitch/stsw_multimodal/figures/l1byage/l1comp_pupil.eps
%%CreationDate: 2022-03-02T14:36:44
%%Pages: (atend)
%%BoundingBox:     4     0   180   275
%%LanguageLevel: 3
%%EndComments
%%BeginProlog
%%BeginResource: procset (Apache XML Graphics Std ProcSet) 1.2 0
%%Version: 1.2 0
%%Copyright: (Copyright 2001-2003,2010 The Apache Software Foundation. License terms: http://www.apache.org/licenses/LICENSE-2.0)
/bd{bind def}bind def
/ld{load def}bd
/GR/grestore ld
/GS/gsave ld
/RM/rmoveto ld
/C/curveto ld
/t/show ld
/L/lineto ld
/ML/setmiterlimit ld
/CT/concat ld
/f/fill ld
/N/newpath ld
/S/stroke ld
/CC/setcmykcolor ld
/A/ashow ld
/cp/closepath ld
/RC/setrgbcolor ld
/LJ/setlinejoin ld
/GC/setgray ld
/LW/setlinewidth ld
/M/moveto ld
/re {4 2 roll M
1 index 0 rlineto
0 exch rlineto
neg 0 rlineto
cp } bd
/_ctm matrix def
/_tm matrix def
/BT { _ctm currentmatrix pop matrix _tm copy pop 0 0 moveto } bd
/ET { _ctm setmatrix } bd
/iTm { _ctm setmatrix _tm concat } bd
/Tm { _tm astore pop iTm 0 0 moveto } bd
/ux 0.0 def
/uy 0.0 def
/F {
  /Tp exch def
  /Tf exch def
  Tf findfont Tp scalefont setfont
  /cf Tf def  /cs Tp def
} bd
/ULS {currentpoint /uy exch def /ux exch def} bd
/ULE {
  /Tcx currentpoint pop def
  gsave
  newpath
  cf findfont cs scalefont dup
  /FontMatrix get 0 get /Ts exch def /FontInfo get dup
  /UnderlinePosition get Ts mul /To exch def
  /UnderlineThickness get Ts mul /Tt exch def
  ux uy To add moveto  Tcx uy To add lineto
  Tt setlinewidth stroke
  grestore
} bd
/OLE {
  /Tcx currentpoint pop def
  gsave
  newpath
  cf findfont cs scalefont dup
  /FontMatrix get 0 get /Ts exch def /FontInfo get dup
  /UnderlinePosition get Ts mul /To exch def
  /UnderlineThickness get Ts mul /Tt exch def
  ux uy To add cs add moveto Tcx uy To add cs add lineto
  Tt setlinewidth stroke
  grestore
} bd
/SOE {
  /Tcx currentpoint pop def
  gsave
  newpath
  cf findfont cs scalefont dup
  /FontMatrix get 0 get /Ts exch def /FontInfo get dup
  /UnderlinePosition get Ts mul /To exch def
  /UnderlineThickness get Ts mul /Tt exch def
  ux uy To add cs 10 mul 26 idiv add moveto Tcx uy To add cs 10 mul 26 idiv add lineto
  Tt setlinewidth stroke
  grestore
} bd
/QT {
/Y22 exch store
/X22 exch store
/Y21 exch store
/X21 exch store
currentpoint
/Y21 load 2 mul add 3 div exch
/X21 load 2 mul add 3 div exch
/X21 load 2 mul /X22 load add 3 div
/Y21 load 2 mul /Y22 load add 3 div
/X22 load /Y22 load curveto
} bd
/SSPD {
dup length /d exch dict def
{
/v exch def
/k exch def
currentpagedevice k known {
/cpdv currentpagedevice k get def
v cpdv ne {
/upd false def
/nullv v type /nulltype eq def
/nullcpdv cpdv type /nulltype eq def
nullv nullcpdv or
{
/upd true def
} {
/sametype v type cpdv type eq def
sametype {
v type /arraytype eq {
/vlen v length def
/cpdvlen cpdv length def
vlen cpdvlen eq {
0 1 vlen 1 sub {
/i exch def
/obj v i get def
/cpdobj cpdv i get def
obj cpdobj ne {
/upd true def
exit
} if
} for
} {
/upd true def
} ifelse
} {
v type /dicttype eq {
v {
/dv exch def
/dk exch def
/cpddv cpdv dk get def
dv cpddv ne {
/upd true def
exit
} if
} forall
} {
/upd true def
} ifelse
} ifelse
} if
} ifelse
upd true eq {
d k v put
} if
} if
} if
} forall
d length 0 gt {
d setpagedevice
} if
} bd
/RE { % /NewFontName [NewEncodingArray] /FontName RE -
  findfont dup length dict begin
  {
    1 index /FID ne
    {def} {pop pop} ifelse
  } forall
  /Encoding exch def
  /FontName 1 index def
  currentdict definefont pop
  end
} bind def
%%EndResource
%%BeginResource: procset (Apache XML Graphics EPS ProcSet) 1.0 0
%%Version: 1.0 0
%%Copyright: (Copyright 2002-2003 The Apache Software Foundation. License terms: http://www.apache.org/licenses/LICENSE-2.0)
/BeginEPSF { %def
/b4_Inc_state save def         % Save state for cleanup
/dict_count countdictstack def % Count objects on dict stack
/op_count count 1 sub def      % Count objects on operand stack
userdict begin                 % Push userdict on dict stack
/showpage { } def              % Redefine showpage, { } = null proc
0 setgray 0 setlinecap         % Prepare graphics state
1 setlinewidth 0 setlinejoin
10 setmiterlimit [ ] 0 setdash newpath
/languagelevel where           % If level not equal to 1 then
{pop languagelevel             % set strokeadjust and
1 ne                           % overprint to their defaults.
{false setstrokeadjust false setoverprint
} if
} if
} bd
/EndEPSF { %def
count op_count sub {pop} repeat            % Clean up stacks
countdictstack dict_count sub {end} repeat
b4_Inc_state restore
} bd
%%EndResource
%FOPBeginFontDict
%%IncludeResource: font Courier-Oblique
%%IncludeResource: font Courier-BoldOblique
%%IncludeResource: font Courier-Bold
%%IncludeResource: font ZapfDingbats
%%IncludeResource: font Symbol
%%IncludeResource: font Helvetica
%%IncludeResource: font Helvetica-Oblique
%%IncludeResource: font Helvetica-Bold
%%IncludeResource: font Helvetica-BoldOblique
%%IncludeResource: font Times-Roman
%%IncludeResource: font Times-Italic
%%IncludeResource: font Times-Bold
%%IncludeResource: font Times-BoldItalic
%%IncludeResource: font Courier
%FOPEndFontDict
%%BeginResource: encoding WinAnsiEncoding
/WinAnsiEncoding [
/.notdef /.notdef /.notdef /.notdef /.notdef
/.notdef /.notdef /.notdef /.notdef /.notdef
/.notdef /.notdef /.notdef /.notdef /.notdef
/.notdef /.notdef /.notdef /.notdef /.notdef
/.notdef /.notdef /.notdef /.notdef /.notdef
/.notdef /.notdef /.notdef /.notdef /.notdef
/.notdef /.notdef /space /exclam /quotedbl
/numbersign /dollar /percent /ampersand /quotesingle
/parenleft /parenright /asterisk /plus /comma
/hyphen /period /slash /zero /one
/two /three /four /five /six
/seven /eight /nine /colon /semicolon
/less /equal /greater /question /at
/A /B /C /D /E
/F /G /H /I /J
/K /L /M /N /O
/P /Q /R /S /T
/U /V /W /X /Y
/Z /bracketleft /backslash /bracketright /asciicircum
/underscore /quoteleft /a /b /c
/d /e /f /g /h
/i /j /k /l /m
/n /o /p /q /r
/s /t /u /v /w
/x /y /z /braceleft /bar
/braceright /asciitilde /bullet /Euro /bullet
/quotesinglbase /florin /quotedblbase /ellipsis /dagger
/daggerdbl /circumflex /perthousand /Scaron /guilsinglleft
/OE /bullet /Zcaron /bullet /bullet
/quoteleft /quoteright /quotedblleft /quotedblright /bullet
/endash /emdash /asciitilde /trademark /scaron
/guilsinglright /oe /bullet /zcaron /Ydieresis
/space /exclamdown /cent /sterling /currency
/yen /brokenbar /section /dieresis /copyright
/ordfeminine /guillemotleft /logicalnot /sfthyphen /registered
/macron /degree /plusminus /twosuperior /threesuperior
/acute /mu /paragraph /middot /cedilla
/onesuperior /ordmasculine /guillemotright /onequarter /onehalf
/threequarters /questiondown /Agrave /Aacute /Acircumflex
/Atilde /Adieresis /Aring /AE /Ccedilla
/Egrave /Eacute /Ecircumflex /Edieresis /Igrave
/Iacute /Icircumflex /Idieresis /Eth /Ntilde
/Ograve /Oacute /Ocircumflex /Otilde /Odieresis
/multiply /Oslash /Ugrave /Uacute /Ucircumflex
/Udieresis /Yacute /Thorn /germandbls /agrave
/aacute /acircumflex /atilde /adieresis /aring
/ae /ccedilla /egrave /eacute /ecircumflex
/edieresis /igrave /iacute /icircumflex /idieresis
/eth /ntilde /ograve /oacute /ocircumflex
/otilde /odieresis /divide /oslash /ugrave
/uacute /ucircumflex /udieresis /yacute /thorn
/ydieresis
] def
%%EndResource
%FOPBeginFontReencode
/Courier-Oblique findfont
dup length dict begin
  {1 index /FID ne {def} {pop pop} ifelse} forall
  /Encoding WinAnsiEncoding def
  currentdict
end
/Courier-Oblique exch definefont pop
/Courier-BoldOblique findfont
dup length dict begin
  {1 index /FID ne {def} {pop pop} ifelse} forall
  /Encoding WinAnsiEncoding def
  currentdict
end
/Courier-BoldOblique exch definefont pop
/Courier-Bold findfont
dup length dict begin
  {1 index /FID ne {def} {pop pop} ifelse} forall
  /Encoding WinAnsiEncoding def
  currentdict
end
/Courier-Bold exch definefont pop
/Helvetica findfont
dup length dict begin
  {1 index /FID ne {def} {pop pop} ifelse} forall
  /Encoding WinAnsiEncoding def
  currentdict
end
/Helvetica exch definefont pop
/Helvetica-Oblique findfont
dup length dict begin
  {1 index /FID ne {def} {pop pop} ifelse} forall
  /Encoding WinAnsiEncoding def
  currentdict
end
/Helvetica-Oblique exch definefont pop
/Helvetica-Bold findfont
dup length dict begin
  {1 index /FID ne {def} {pop pop} ifelse} forall
  /Encoding WinAnsiEncoding def
  currentdict
end
/Helvetica-Bold exch definefont pop
/Helvetica-BoldOblique findfont
dup length dict begin
  {1 index /FID ne {def} {pop pop} ifelse} forall
  /Encoding WinAnsiEncoding def
  currentdict
end
/Helvetica-BoldOblique exch definefont pop
/Times-Roman findfont
dup length dict begin
  {1 index /FID ne {def} {pop pop} ifelse} forall
  /Encoding WinAnsiEncoding def
  currentdict
end
/Times-Roman exch definefont pop
/Times-Italic findfont
dup length dict begin
  {1 index /FID ne {def} {pop pop} ifelse} forall
  /Encoding WinAnsiEncoding def
  currentdict
end
/Times-Italic exch definefont pop
/Times-Bold findfont
dup length dict begin
  {1 index /FID ne {def} {pop pop} ifelse} forall
  /Encoding WinAnsiEncoding def
  currentdict
end
/Times-Bold exch definefont pop
/Times-BoldItalic findfont
dup length dict begin
  {1 index /FID ne {def} {pop pop} ifelse} forall
  /Encoding WinAnsiEncoding def
  currentdict
end
/Times-BoldItalic exch definefont pop
/Courier findfont
dup length dict begin
  {1 index /FID ne {def} {pop pop} ifelse} forall
  /Encoding WinAnsiEncoding def
  currentdict
end
/Courier exch definefont pop
%FOPEndFontReencode
%%EndProlog
%%Page: 1 1
%%PageBoundingBox: 0 0 198 283
%%BeginPageSetup
[1 0 0 -1 0 283] CT
%%EndPageSetup
GS
[1.00215 0 0 1 0 0] CT
1 GC
N
0 0 198 283 re
f
GR
GS
[1.00215 0 0 1 0 0] CT
1 GC
N
0 0 198 283 re
f
GR
GS
[1.00215 0 0 1 0 0] CT
1 GC
N
74.5 228 M
179 228 L
179 32 L
74.5 32 L
cp
f
GR
GS
[1.00215 0 0 1 0 0] CT
0.149 GC
2 setlinecap
1 LJ
0.5 LW
N
74.5 228 M
179 228 L
S
GR
GS
[1.00215 0 0 1 0 0] CT
0.149 GC
2 setlinecap
1 LJ
0.5 LW
N
105.85 228 M
105.85 226.04 L
S
GR
GS
[1.00215 0 0 1 0 0] CT
0.149 GC
2 setlinecap
1 LJ
0.5 LW
N
147.65 228 M
147.65 226.04 L
S
GR
GS
[1.00215 0 0 1 106.07731 234.00002] CT
0.149 GC
/Helvetica 20 F
GS
[1 0 0 1 0 0] CT
-13 20 moveto 
1 -1 scale
(YA) t 
GR
GR
GS
[1.00215 0 0 1 147.96707 234.00002] CT
0.149 GC
/Helvetica 20 F
GS
[1 0 0 1 0 0] CT
-14.5 20 moveto 
1 -1 scale
(OA) t 
GR
GR
GS
[1.00215 0 0 1 127.02225 259] CT
0.149 GC
/Helvetica 20 F
GS
[1 0 0 1 0 0] CT
-49 20 moveto 
1 -1 scale
(Age Group) t 
GR
GR
GS
[1.00215 0 0 1 0 0] CT
0.149 GC
2 setlinecap
1 LJ
0.5 LW
N
74.5 228 M
74.5 32 L
S
GR
GS
[1.00215 0 0 1 0 0] CT
0.149 GC
2 setlinecap
1 LJ
0.5 LW
N
74.5 228 M
76.46 228 L
S
GR
GS
[1.00215 0 0 1 0 0] CT
0.149 GC
2 setlinecap
1 LJ
0.5 LW
N
74.5 162.667 M
76.46 162.667 L
S
GR
GS
[1.00215 0 0 1 0 0] CT
0.149 GC
2 setlinecap
1 LJ
0.5 LW
N
74.5 97.333 M
76.46 97.333 L
S
GR
GS
[1.00215 0 0 1 0 0] CT
0.149 GC
2 setlinecap
1 LJ
0.5 LW
N
74.5 32 M
76.46 32 L
S
GR
GS
[1.00215 0 0 1 68.6471 228] CT
0.149 GC
/Helvetica 20 F
GS
[1 0 0 1 0 0] CT
-42 7.5 moveto 
1 -1 scale
(-300) t 
GR
GR
GS
[1.00215 0 0 1 68.6471 162.66667] CT
0.149 GC
/Helvetica 20 F
GS
[1 0 0 1 0 0] CT
-42 7.5 moveto 
1 -1 scale
(-200) t 
GR
GR
GS
[1.00215 0 0 1 68.6471 97.33334] CT
0.149 GC
/Helvetica 20 F
GS
[1 0 0 1 0 0] CT
-42 7.5 moveto 
1 -1 scale
(-100) t 
GR
GR
GS
[1.00215 0 0 1 68.6471 32] CT
0.149 GC
/Helvetica 20 F
GS
[1 0 0 1 0 0] CT
-12 7.5 moveto 
1 -1 scale
(0) t 
GR
GR
GS
[0 -1 1.00215 0 24.05154 129.99991] CT
0.149 GC
/Helvetica 20 F
GS
[1 0 0 1 0 0] CT
-32.5 -5 moveto 
1 -1 scale
(pupil l1) t 
GR
GR
GS
[1.00215 0 0 1 127.02232 29.25] CT
/Helvetica-Bold 22 F
GS
[1 0 0 1 0 0] CT
-58 -5 moveto 
1 -1 scale
(p = 3.1e-06) t 
GR
GR
GS
[1.00215 0 0 1 0 0] CT
0.149 GC
1 LJ
0.5 LW
N
74.5 32 M
179 32 L
S
GR
GS
[1.00215 0 0 1 0 0] CT
0.6 0.8 1 RC
N
89.13 32 M
89.13 111.006 L
122.57 111.006 L
122.57 32 L
cp
f
GR
GS
[1.00215 0 0 1 106.10325 55.23471] CT
0.302 GC
N
2.236 0 M
2.236 -1.235 1.235 -2.236 0 -2.236 C
-1.235 -2.236 -2.236 -1.235 -2.236 0 C
-2.236 1.235 -1.235 2.236 0 2.236 C
1.235 2.236 2.236 1.235 2.236 0 C
cp
f
GR
GS
[1.00215 0 0 1 105.98016 84.15866] CT
0.302 GC
N
/f-1586420743{2.236 0 M
2.236 -1.235 1.235 -2.236 0 -2.236 C
-1.235 -2.236 -2.236 -1.235 -2.236 0 C
-2.236 1.235 -1.235 2.236 0 2.236 C
1.235 2.236 2.236 1.235 2.236 0 C
cp}def
f-1586420743
f
GR
GS
[1.00215 0 0 1 104.26932 111.00577] CT
0.302 GC
N
f-1586420743
f
GR
GS
[1.00215 0 0 1 105.91635 121.44713] CT
0.302 GC
N
f-1586420743
f
GR
GS
[1.00215 0 0 1 111.83596 83.48772] CT
0.302 GC
N
f-1586420743
f
GR
GS
[1.00215 0 0 1 106.79672 149.48322] CT
0.302 GC
N
f-1586420743
f
GR
GS
[1.00215 0 0 1 98.59069 137.21545] CT
0.302 GC
N
f-1586420743
f
GR
GS
[1.00215 0 0 1 102.57164 121.30824] CT
0.302 GC
N
f-1586420743
f
GR
GS
[1.00215 0 0 1 105.56145 71.07561] CT
0.302 GC
N
f-1586420743
f
GR
GS
[1.00215 0 0 1 98.81298 148.37285] CT
0.302 GC
N
f-1586420743
f
GR
GS
[1.00215 0 0 1 103.88537 98.73685] CT
0.302 GC
N
f-1586420743
f
GR
GS
[1.00215 0 0 1 109.94751 97.00182] CT
0.302 GC
N
f-1586420743
f
GR
GS
[1.00215 0 0 1 106.06859 43.52613] CT
0.302 GC
N
f-1586420743
f
GR
GS
[1.00215 0 0 1 111.38034 63.35626] CT
0.302 GC
N
f-1586420743
f
GR
GS
[1.00215 0 0 1 105.75545 126.38281] CT
0.302 GC
N
f-1586420743
f
GR
GS
[1.00215 0 0 1 105.72499 89.93508] CT
0.302 GC
N
f-1586420743
f
GR
GS
[1.00215 0 0 1 114.01552 138.2856] CT
0.302 GC
N
f-1586420743
f
GR
GS
[1.00215 0 0 1 108.0256 78.48965] CT
0.302 GC
N
f-1586420743
f
GR
GS
[1.00215 0 0 1 102.2767 169.68259] CT
0.302 GC
N
f-1586420743
f
GR
GS
[1.00215 0 0 1 98.07701 193.515] CT
0.302 GC
N
f-1586420743
f
GR
GS
[1.00215 0 0 1 99.6773 92.51591] CT
0.302 GC
N
f-1586420743
f
GR
GS
[1.00215 0 0 1 100.87479 52.07675] CT
0.302 GC
N
f-1586420743
f
GR
GS
[1.00215 0 0 1 112.75497 68.11271] CT
0.302 GC
N
f-1586420743
f
GR
GS
[1.00215 0 0 1 109.6426 153.36142] CT
0.302 GC
N
f-1586420743
f
GR
GS
[1.00215 0 0 1 110.77831 186.16402] CT
0.302 GC
N
f-1586420743
f
GR
GS
[1.00215 0 0 1 111.7077 121.22297] CT
0.302 GC
N
f-1586420743
f
GR
GS
[1.00215 0 0 1 101.61604 133.21913] CT
0.302 GC
N
f-1586420743
f
GR
GS
[1.00215 0 0 1 101.74691 106.4045] CT
0.302 GC
N
f-1586420743
f
GR
GS
[1.00215 0 0 1 105.68793 58.15524] CT
0.302 GC
N
f-1586420743
f
GR
GS
[1.00215 0 0 1 108.56746 48.20712] CT
0.302 GC
N
f-1586420743
f
GR
GS
[1.00215 0 0 1 107.72915 104.47447] CT
0.302 GC
N
f-1586420743
f
GR
GS
[1.00215 0 0 1 106.33256 130.17143] CT
0.302 GC
N
f-1586420743
f
GR
GS
[1.00215 0 0 1 99.14952 130.75395] CT
0.302 GC
N
f-1586420743
f
GR
GS
[1.00215 0 0 1 109.27727 121.16442] CT
0.302 GC
N
f-1586420743
f
GR
GS
[1.00215 0 0 1 103.27427 85.01324] CT
0.302 GC
N
f-1586420743
f
GR
GS
[1.00215 0 0 1 110.33183 123.17471] CT
0.302 GC
N
f-1586420743
f
GR
GS
[1.00215 0 0 1 105.99308 87.1861] CT
0.302 GC
N
f-1586420743
f
GR
GS
[1.00215 0 0 1 104.09497 206.41837] CT
0.302 GC
N
f-1586420743
f
GR
GS
[1.00215 0 0 1 103.92091 89.31729] CT
0.302 GC
N
f-1586420743
f
GR
GS
[1.00215 0 0 1 99.71007 114.69886] CT
0.302 GC
N
f-1586420743
f
GR
GS
[1.00215 0 0 1 112.65678 131.58492] CT
0.302 GC
N
f-1586420743
f
GR
GS
[1.00215 0 0 1 98.95112 137.1507] CT
0.302 GC
N
f-1586420743
f
GR
GS
[1.00215 0 0 1 0 0] CT
0.6 0.8 1 RC
N
/f399028980{130.93 32 M
130.93 78.267 L
164.37 78.267 L
164.37 32 L
cp}def
f399028980
f
GR
GS
[1.00215 0 0 1 143.6273 54.65111] CT
0.302 GC
N
f-1586420743
f
GR
GS
[1.00215 0 0 1 141.54478 55.51043] CT
0.302 GC
N
f-1586420743
f
GR
GS
[1.00215 0 0 1 156.33787 65.79259] CT
0.302 GC
N
f-1586420743
f
GR
GS
[1.00215 0 0 1 149.90925 62.67785] CT
0.302 GC
N
f-1586420743
f
GR
GS
[1.00215 0 0 1 145.83899 98.01763] CT
0.302 GC
N
f-1586420743
f
GR
GS
[1.00215 0 0 1 154.59087 54.03855] CT
0.302 GC
N
f-1586420743
f
GR
GS
[1.00215 0 0 1 143.45046 73.59064] CT
0.302 GC
N
f-1586420743
f
GR
GS
[1.00215 0 0 1 154.65095 62.3698] CT
0.302 GC
N
f-1586420743
f
GR
GS
[1.00215 0 0 1 149.36645 54.57694] CT
0.302 GC
N
f-1586420743
f
GR
GS
[1.00215 0 0 1 152.53187 44.2893] CT
0.302 GC
N
f-1586420743
f
GR
GS
[1.00215 0 0 1 153.35534 74.54005] CT
0.302 GC
N
f-1586420743
f
GR
GS
[1.00215 0 0 1 149.6501 83.89625] CT
0.302 GC
N
f-1586420743
f
GR
GS
[1.00215 0 0 1 148.90687 78.02834] CT
0.302 GC
N
f-1586420743
f
GR
GS
[1.00215 0 0 1 144.73468 45.61929] CT
0.302 GC
N
f-1586420743
f
GR
GS
[1.00215 0 0 1 146.05611 116.25507] CT
0.302 GC
N
f-1586420743
f
GR
GS
[1.00215 0 0 1 152.14647 81.1916] CT
0.302 GC
N
f-1586420743
f
GR
GS
[1.00215 0 0 1 152.10221 80.47089] CT
0.302 GC
N
f-1586420743
f
GR
GS
[1.00215 0 0 1 146.69264 79.25801] CT
0.302 GC
N
f-1586420743
f
GR
GS
[1.00215 0 0 1 142.91196 98.73573] CT
0.302 GC
N
f-1586420743
f
GR
GS
[1.00215 0 0 1 146.15117 57.3127] CT
0.302 GC
N
f-1586420743
f
GR
GS
[1.00215 0 0 1 145.66049 146.0909] CT
0.302 GC
N
f-1586420743
f
GR
GS
[1.00215 0 0 1 146.93033 40.93148] CT
0.302 GC
N
f-1586420743
f
GR
GS
[1.00215 0 0 1 140.63781 55.43736] CT
0.302 GC
N
f-1586420743
f
GR
GS
[1.00215 0 0 1 148.67063 55.41067] CT
0.302 GC
N
f-1586420743
f
GR
GS
[1.00215 0 0 1 152.56183 100.11915] CT
0.302 GC
N
f-1586420743
f
GR
GS
[1.00215 0 0 1 147.67517 74.08971] CT
0.302 GC
N
f-1586420743
f
GR
GS
[1.00215 0 0 1 141.63347 101.11029] CT
0.302 GC
N
f-1586420743
f
GR
GS
[1.00215 0 0 1 142.56965 74.62232] CT
0.302 GC
N
f-1586420743
f
GR
GS
[1.00215 0 0 1 145.38442 100.87434] CT
0.302 GC
N
f-1586420743
f
GR
GS
[1.00215 0 0 1 143.48652 81.84228] CT
0.302 GC
N
f-1586420743
f
GR
GS
[1.00215 0 0 1 141.79297 89.03042] CT
0.302 GC
N
f-1586420743
f
GR
GS
[1.00215 0 0 1 153.41591 92.01931] CT
0.302 GC
N
f-1586420743
f
GR
GS
[1.00215 0 0 1 145.01097 88.13339] CT
0.302 GC
N
f-1586420743
f
GR
GS
[1.00215 0 0 1 148.87897 80.89521] CT
0.302 GC
N
f-1586420743
f
GR
GS
[1.00215 0 0 1 140.50574 71.49193] CT
0.302 GC
N
f-1586420743
f
GR
GS
[1.00215 0 0 1 152.53522 55.92724] CT
0.302 GC
N
f-1586420743
f
GR
GS
[1.00215 0 0 1 153.8984 146.0909] CT
0.302 GC
N
f-1586420743
f
GR
GS
[1.00215 0 0 1 155.5741 117.85454] CT
0.302 GC
N
f-1586420743
f
GR
GS
[1.00215 0 0 1 155.19482 133.9059] CT
0.302 GC
N
f-1586420743
f
GR
GS
[1.00215 0 0 1 147.96566 77.35861] CT
0.302 GC
N
f-1586420743
f
GR
GS
[1.00215 0 0 1 150.53529 56.02782] CT
0.302 GC
N
f-1586420743
f
GR
GS
[1.00215 0 0 1 144.91509 93.84213] CT
0.302 GC
N
f-1586420743
f
GR
GS
[1.00215 0 0 1 150.69414 83.96782] CT
0.302 GC
N
f-1586420743
f
GR
GS
[1.00215 0 0 1 141.59468 107.82048] CT
0.302 GC
N
f-1586420743
f
GR
GS
[1.00215 0 0 1 148.11167 74.69144] CT
0.302 GC
N
f-1586420743
f
GR
GS
[1.00215 0 0 1 149.89121 83.80089] CT
0.302 GC
N
f-1586420743
f
GR
GS
[1.00215 0 0 1 156.08866 78.43463] CT
0.302 GC
N
f-1586420743
f
GR
GS
[1.00215 0 0 1 142.3682 48.48153] CT
0.302 GC
N
f-1586420743
f
GR
GS
[1.00215 0 0 1 140.09834 75.90488] CT
0.302 GC
N
f-1586420743
f
GR
GS
[1.00215 0 0 1 145.65771 73.12438] CT
0.302 GC
N
f-1586420743
f
GR
GS
[1.00215 0 0 1 151.61328 59.16666] CT
0.302 GC
N
f-1586420743
f
GR
GS
[1.00215 0 0 1 155.43206 35.15596] CT
0.302 GC
N
f-1586420743
f
GR
GS
[1.00215 0 0 1 151.71804 73.69366] CT
0.302 GC
N
f-1586420743
f
GR
%%Trailer
%%Pages: 1
%%EOF
