%!PS-Adobe-3.0 EPSF-3.0
%%Creator: (MATLAB, The Mathworks, Inc. Version 9.8.0.1323502 \(R2020a\). Operating System: Mac OS X)
%%Title: /Users/kosciessa/Desktop/mntTardisLNDG/LNDG/stateswitch/stsw_multimodal/figures/l1byage/l1comp_alpha.eps
%%CreationDate: 2022-03-02T14:36:43
%%Pages: (atend)
%%BoundingBox:     4     0   180   275
%%LanguageLevel: 3
%%EndComments
%%BeginProlog
%%BeginResource: procset (Apache XML Graphics Std ProcSet) 1.2 0
%%Version: 1.2 0
%%Copyright: (Copyright 2001-2003,2010 The Apache Software Foundation. License terms: http://www.apache.org/licenses/LICENSE-2.0)
/bd{bind def}bind def
/ld{load def}bd
/GR/grestore ld
/GS/gsave ld
/RM/rmoveto ld
/C/curveto ld
/t/show ld
/L/lineto ld
/ML/setmiterlimit ld
/CT/concat ld
/f/fill ld
/N/newpath ld
/S/stroke ld
/CC/setcmykcolor ld
/A/ashow ld
/cp/closepath ld
/RC/setrgbcolor ld
/LJ/setlinejoin ld
/GC/setgray ld
/LW/setlinewidth ld
/M/moveto ld
/re {4 2 roll M
1 index 0 rlineto
0 exch rlineto
neg 0 rlineto
cp } bd
/_ctm matrix def
/_tm matrix def
/BT { _ctm currentmatrix pop matrix _tm copy pop 0 0 moveto } bd
/ET { _ctm setmatrix } bd
/iTm { _ctm setmatrix _tm concat } bd
/Tm { _tm astore pop iTm 0 0 moveto } bd
/ux 0.0 def
/uy 0.0 def
/F {
  /Tp exch def
  /Tf exch def
  Tf findfont Tp scalefont setfont
  /cf Tf def  /cs Tp def
} bd
/ULS {currentpoint /uy exch def /ux exch def} bd
/ULE {
  /Tcx currentpoint pop def
  gsave
  newpath
  cf findfont cs scalefont dup
  /FontMatrix get 0 get /Ts exch def /FontInfo get dup
  /UnderlinePosition get Ts mul /To exch def
  /UnderlineThickness get Ts mul /Tt exch def
  ux uy To add moveto  Tcx uy To add lineto
  Tt setlinewidth stroke
  grestore
} bd
/OLE {
  /Tcx currentpoint pop def
  gsave
  newpath
  cf findfont cs scalefont dup
  /FontMatrix get 0 get /Ts exch def /FontInfo get dup
  /UnderlinePosition get Ts mul /To exch def
  /UnderlineThickness get Ts mul /Tt exch def
  ux uy To add cs add moveto Tcx uy To add cs add lineto
  Tt setlinewidth stroke
  grestore
} bd
/SOE {
  /Tcx currentpoint pop def
  gsave
  newpath
  cf findfont cs scalefont dup
  /FontMatrix get 0 get /Ts exch def /FontInfo get dup
  /UnderlinePosition get Ts mul /To exch def
  /UnderlineThickness get Ts mul /Tt exch def
  ux uy To add cs 10 mul 26 idiv add moveto Tcx uy To add cs 10 mul 26 idiv add lineto
  Tt setlinewidth stroke
  grestore
} bd
/QT {
/Y22 exch store
/X22 exch store
/Y21 exch store
/X21 exch store
currentpoint
/Y21 load 2 mul add 3 div exch
/X21 load 2 mul add 3 div exch
/X21 load 2 mul /X22 load add 3 div
/Y21 load 2 mul /Y22 load add 3 div
/X22 load /Y22 load curveto
} bd
/SSPD {
dup length /d exch dict def
{
/v exch def
/k exch def
currentpagedevice k known {
/cpdv currentpagedevice k get def
v cpdv ne {
/upd false def
/nullv v type /nulltype eq def
/nullcpdv cpdv type /nulltype eq def
nullv nullcpdv or
{
/upd true def
} {
/sametype v type cpdv type eq def
sametype {
v type /arraytype eq {
/vlen v length def
/cpdvlen cpdv length def
vlen cpdvlen eq {
0 1 vlen 1 sub {
/i exch def
/obj v i get def
/cpdobj cpdv i get def
obj cpdobj ne {
/upd true def
exit
} if
} for
} {
/upd true def
} ifelse
} {
v type /dicttype eq {
v {
/dv exch def
/dk exch def
/cpddv cpdv dk get def
dv cpddv ne {
/upd true def
exit
} if
} forall
} {
/upd true def
} ifelse
} ifelse
} if
} ifelse
upd true eq {
d k v put
} if
} if
} if
} forall
d length 0 gt {
d setpagedevice
} if
} bd
/RE { % /NewFontName [NewEncodingArray] /FontName RE -
  findfont dup length dict begin
  {
    1 index /FID ne
    {def} {pop pop} ifelse
  } forall
  /Encoding exch def
  /FontName 1 index def
  currentdict definefont pop
  end
} bind def
%%EndResource
%%BeginResource: procset (Apache XML Graphics EPS ProcSet) 1.0 0
%%Version: 1.0 0
%%Copyright: (Copyright 2002-2003 The Apache Software Foundation. License terms: http://www.apache.org/licenses/LICENSE-2.0)
/BeginEPSF { %def
/b4_Inc_state save def         % Save state for cleanup
/dict_count countdictstack def % Count objects on dict stack
/op_count count 1 sub def      % Count objects on operand stack
userdict begin                 % Push userdict on dict stack
/showpage { } def              % Redefine showpage, { } = null proc
0 setgray 0 setlinecap         % Prepare graphics state
1 setlinewidth 0 setlinejoin
10 setmiterlimit [ ] 0 setdash newpath
/languagelevel where           % If level not equal to 1 then
{pop languagelevel             % set strokeadjust and
1 ne                           % overprint to their defaults.
{false setstrokeadjust false setoverprint
} if
} if
} bd
/EndEPSF { %def
count op_count sub {pop} repeat            % Clean up stacks
countdictstack dict_count sub {end} repeat
b4_Inc_state restore
} bd
%%EndResource
%FOPBeginFontDict
%%IncludeResource: font Courier-Oblique
%%IncludeResource: font Courier-BoldOblique
%%IncludeResource: font Courier-Bold
%%IncludeResource: font ZapfDingbats
%%IncludeResource: font Symbol
%%IncludeResource: font Helvetica
%%IncludeResource: font Helvetica-Oblique
%%IncludeResource: font Helvetica-Bold
%%IncludeResource: font Helvetica-BoldOblique
%%IncludeResource: font Times-Roman
%%IncludeResource: font Times-Italic
%%IncludeResource: font Times-Bold
%%IncludeResource: font Times-BoldItalic
%%IncludeResource: font Courier
%FOPEndFontDict
%%BeginResource: encoding WinAnsiEncoding
/WinAnsiEncoding [
/.notdef /.notdef /.notdef /.notdef /.notdef
/.notdef /.notdef /.notdef /.notdef /.notdef
/.notdef /.notdef /.notdef /.notdef /.notdef
/.notdef /.notdef /.notdef /.notdef /.notdef
/.notdef /.notdef /.notdef /.notdef /.notdef
/.notdef /.notdef /.notdef /.notdef /.notdef
/.notdef /.notdef /space /exclam /quotedbl
/numbersign /dollar /percent /ampersand /quotesingle
/parenleft /parenright /asterisk /plus /comma
/hyphen /period /slash /zero /one
/two /three /four /five /six
/seven /eight /nine /colon /semicolon
/less /equal /greater /question /at
/A /B /C /D /E
/F /G /H /I /J
/K /L /M /N /O
/P /Q /R /S /T
/U /V /W /X /Y
/Z /bracketleft /backslash /bracketright /asciicircum
/underscore /quoteleft /a /b /c
/d /e /f /g /h
/i /j /k /l /m
/n /o /p /q /r
/s /t /u /v /w
/x /y /z /braceleft /bar
/braceright /asciitilde /bullet /Euro /bullet
/quotesinglbase /florin /quotedblbase /ellipsis /dagger
/daggerdbl /circumflex /perthousand /Scaron /guilsinglleft
/OE /bullet /Zcaron /bullet /bullet
/quoteleft /quoteright /quotedblleft /quotedblright /bullet
/endash /emdash /asciitilde /trademark /scaron
/guilsinglright /oe /bullet /zcaron /Ydieresis
/space /exclamdown /cent /sterling /currency
/yen /brokenbar /section /dieresis /copyright
/ordfeminine /guillemotleft /logicalnot /sfthyphen /registered
/macron /degree /plusminus /twosuperior /threesuperior
/acute /mu /paragraph /middot /cedilla
/onesuperior /ordmasculine /guillemotright /onequarter /onehalf
/threequarters /questiondown /Agrave /Aacute /Acircumflex
/Atilde /Adieresis /Aring /AE /Ccedilla
/Egrave /Eacute /Ecircumflex /Edieresis /Igrave
/Iacute /Icircumflex /Idieresis /Eth /Ntilde
/Ograve /Oacute /Ocircumflex /Otilde /Odieresis
/multiply /Oslash /Ugrave /Uacute /Ucircumflex
/Udieresis /Yacute /Thorn /germandbls /agrave
/aacute /acircumflex /atilde /adieresis /aring
/ae /ccedilla /egrave /eacute /ecircumflex
/edieresis /igrave /iacute /icircumflex /idieresis
/eth /ntilde /ograve /oacute /ocircumflex
/otilde /odieresis /divide /oslash /ugrave
/uacute /ucircumflex /udieresis /yacute /thorn
/ydieresis
] def
%%EndResource
%FOPBeginFontReencode
/Courier-Oblique findfont
dup length dict begin
  {1 index /FID ne {def} {pop pop} ifelse} forall
  /Encoding WinAnsiEncoding def
  currentdict
end
/Courier-Oblique exch definefont pop
/Courier-BoldOblique findfont
dup length dict begin
  {1 index /FID ne {def} {pop pop} ifelse} forall
  /Encoding WinAnsiEncoding def
  currentdict
end
/Courier-BoldOblique exch definefont pop
/Courier-Bold findfont
dup length dict begin
  {1 index /FID ne {def} {pop pop} ifelse} forall
  /Encoding WinAnsiEncoding def
  currentdict
end
/Courier-Bold exch definefont pop
/Helvetica findfont
dup length dict begin
  {1 index /FID ne {def} {pop pop} ifelse} forall
  /Encoding WinAnsiEncoding def
  currentdict
end
/Helvetica exch definefont pop
/Helvetica-Oblique findfont
dup length dict begin
  {1 index /FID ne {def} {pop pop} ifelse} forall
  /Encoding WinAnsiEncoding def
  currentdict
end
/Helvetica-Oblique exch definefont pop
/Helvetica-Bold findfont
dup length dict begin
  {1 index /FID ne {def} {pop pop} ifelse} forall
  /Encoding WinAnsiEncoding def
  currentdict
end
/Helvetica-Bold exch definefont pop
/Helvetica-BoldOblique findfont
dup length dict begin
  {1 index /FID ne {def} {pop pop} ifelse} forall
  /Encoding WinAnsiEncoding def
  currentdict
end
/Helvetica-BoldOblique exch definefont pop
/Times-Roman findfont
dup length dict begin
  {1 index /FID ne {def} {pop pop} ifelse} forall
  /Encoding WinAnsiEncoding def
  currentdict
end
/Times-Roman exch definefont pop
/Times-Italic findfont
dup length dict begin
  {1 index /FID ne {def} {pop pop} ifelse} forall
  /Encoding WinAnsiEncoding def
  currentdict
end
/Times-Italic exch definefont pop
/Times-Bold findfont
dup length dict begin
  {1 index /FID ne {def} {pop pop} ifelse} forall
  /Encoding WinAnsiEncoding def
  currentdict
end
/Times-Bold exch definefont pop
/Times-BoldItalic findfont
dup length dict begin
  {1 index /FID ne {def} {pop pop} ifelse} forall
  /Encoding WinAnsiEncoding def
  currentdict
end
/Times-BoldItalic exch definefont pop
/Courier findfont
dup length dict begin
  {1 index /FID ne {def} {pop pop} ifelse} forall
  /Encoding WinAnsiEncoding def
  currentdict
end
/Courier exch definefont pop
%FOPEndFontReencode
%%EndProlog
%%Page: 1 1
%%PageBoundingBox: 0 0 198 283
%%BeginPageSetup
[1 0 0 -1 0 283] CT
%%EndPageSetup
GS
[1.00215 0 0 1 0 0] CT
1 GC
N
0 0 198 283 re
f
GR
GS
[1.00215 0 0 1 0 0] CT
1 GC
N
0 0 198 283 re
f
GR
GS
[1.00215 0 0 1 0 0] CT
1 GC
N
55.5 228 M
179 228 L
179 32 L
55.5 32 L
cp
f
GR
GS
[1.00215 0 0 1 0 0] CT
0.149 GC
2 setlinecap
1 LJ
0.5 LW
N
55.5 228 M
179 228 L
S
GR
GS
[1.00215 0 0 1 0 0] CT
0.149 GC
2 setlinecap
1 LJ
0.5 LW
N
92.55 228 M
92.55 226.04 L
S
GR
GS
[1.00215 0 0 1 0 0] CT
0.149 GC
2 setlinecap
1 LJ
0.5 LW
N
141.95 228 M
141.95 226.04 L
S
GR
GS
[1.00215 0 0 1 92.74875 234] CT
0.149 GC
/Helvetica 20 F
GS
[1 0 0 1 0 0] CT
-13 20 moveto 
1 -1 scale
(YA) t 
GR
GR
GS
[1.00215 0 0 1 142.25483 234] CT
0.149 GC
/Helvetica 20 F
GS
[1 0 0 1 0 0] CT
-14.5 20 moveto 
1 -1 scale
(OA) t 
GR
GR
GS
[1.00215 0 0 1 117.50185 259] CT
0.149 GC
/Helvetica 20 F
GS
[1 0 0 1 0 0] CT
-49 20 moveto 
1 -1 scale
(Age Group) t 
GR
GR
GS
[1.00215 0 0 1 0 0] CT
0.149 GC
2 setlinecap
1 LJ
0.5 LW
N
55.5 228 M
55.5 32 L
S
GR
GS
[1.00215 0 0 1 0 0] CT
0.149 GC
2 setlinecap
1 LJ
0.5 LW
N
55.5 228 M
57.46 228 L
S
GR
GS
[1.00215 0 0 1 0 0] CT
0.149 GC
2 setlinecap
1 LJ
0.5 LW
N
55.5 162.667 M
57.46 162.667 L
S
GR
GS
[1.00215 0 0 1 0 0] CT
0.149 GC
2 setlinecap
1 LJ
0.5 LW
N
55.5 97.333 M
57.46 97.333 L
S
GR
GS
[1.00215 0 0 1 0 0] CT
0.149 GC
2 setlinecap
1 LJ
0.5 LW
N
55.5 32 M
57.46 32 L
S
GR
GS
[1.00215 0 0 1 49.6063 228] CT
0.149 GC
/Helvetica 20 F
GS
[1 0 0 1 0 0] CT
-12 7.5 moveto 
1 -1 scale
(0) t 
GR
GR
GS
[1.00215 0 0 1 49.6063 162.66667] CT
0.149 GC
/Helvetica 20 F
GS
[1 0 0 1 0 0] CT
-23 7.5 moveto 
1 -1 scale
(20) t 
GR
GR
GS
[1.00215 0 0 1 49.6063 97.33334] CT
0.149 GC
/Helvetica 20 F
GS
[1 0 0 1 0 0] CT
-23 7.5 moveto 
1 -1 scale
(40) t 
GR
GR
GS
[1.00215 0 0 1 49.6063 32] CT
0.149 GC
/Helvetica 20 F
GS
[1 0 0 1 0 0] CT
-23 7.5 moveto 
1 -1 scale
(60) t 
GR
GR
GS
[0 -1 1.00215 0 24.05154 129.99991] CT
0.149 GC
/Helvetica 20 F
GS
[1 0 0 1 0 0] CT
-35.5 -5 moveto 
1 -1 scale
(alpha l1) t 
GR
GR
GS
[1.00215 0 0 1 117.50191 29.25001] CT
/Helvetica-Bold 22 F
GS
[1 0 0 1 0 0] CT
-58 -5 moveto 
1 -1 scale
(p = 1.2e-05) t 
GR
GR
GS
[1.00215 0 0 1 0 0] CT
0.149 GC
1 LJ
0.5 LW
N
55.5 228 M
179 228 L
S
GR
GS
[1.00215 0 0 1 0 0] CT
1 0.6 0.6 RC
N
112.31 228 M
112.31 83.243 L
72.79 83.243 L
72.79 228 L
cp
f
GR
GS
[1.00215 0 0 1 84.74945 84.0615] CT
0.302 GC
N
2.236 0 M
2.236 -1.235 1.235 -2.236 0 -2.236 C
-1.235 -2.236 -2.236 -1.235 -2.236 0 C
-2.236 1.235 -1.235 2.236 0 2.236 C
1.235 2.236 2.236 1.235 2.236 0 C
cp
f
GR
GS
[1.00215 0 0 1 98.15531 75.04459] CT
0.302 GC
N
/f-1586420743{2.236 0 M
2.236 -1.235 1.235 -2.236 0 -2.236 C
-1.235 -2.236 -2.236 -1.235 -2.236 0 C
-2.236 1.235 -1.235 2.236 0 2.236 C
1.235 2.236 2.236 1.235 2.236 0 C
cp}def
f-1586420743
f
GR
GS
[1.00215 0 0 1 86.82109 82.88219] CT
0.302 GC
N
f-1586420743
f
GR
GS
[1.00215 0 0 1 82.97333 84.78594] CT
0.302 GC
N
f-1586420743
f
GR
GS
[1.00215 0 0 1 96.81447 70.50771] CT
0.302 GC
N
f-1586420743
f
GR
GS
[1.00215 0 0 1 88.30534 78.57684] CT
0.302 GC
N
f-1586420743
f
GR
GS
[1.00215 0 0 1 96.22184 85.13707] CT
0.302 GC
N
f-1586420743
f
GR
GS
[1.00215 0 0 1 94.02484 75.74985] CT
0.302 GC
N
f-1586420743
f
GR
GS
[1.00215 0 0 1 85.53623 78.97989] CT
0.302 GC
N
f-1586420743
f
GR
GS
[1.00215 0 0 1 99.84202 86.70834] CT
0.302 GC
N
f-1586420743
f
GR
GS
[1.00215 0 0 1 100.43599 91.31618] CT
0.302 GC
N
f-1586420743
f
GR
GS
[1.00215 0 0 1 82.96054 75.97343] CT
0.302 GC
N
f-1586420743
f
GR
GS
[1.00215 0 0 1 98.50148 98.01184] CT
0.302 GC
N
f-1586420743
f
GR
GS
[1.00215 0 0 1 95.53252 83.21115] CT
0.302 GC
N
f-1586420743
f
GR
GS
[1.00215 0 0 1 90.31497 91.74305] CT
0.302 GC
N
f-1586420743
f
GR
GS
[1.00215 0 0 1 91.15135 75.8661] CT
0.302 GC
N
f-1586420743
f
GR
GS
[1.00215 0 0 1 94.8326 80.31708] CT
0.302 GC
N
f-1586420743
f
GR
GS
[1.00215 0 0 1 92.23372 82.78483] CT
0.302 GC
N
f-1586420743
f
GR
GS
[1.00215 0 0 1 90.76815 84.52152] CT
0.302 GC
N
f-1586420743
f
GR
GS
[1.00215 0 0 1 94.17775 84.92633] CT
0.302 GC
N
f-1586420743
f
GR
GS
[1.00215 0 0 1 100.71506 85.50358] CT
0.302 GC
N
f-1586420743
f
GR
GS
[1.00215 0 0 1 89.50904 84.69622] CT
0.302 GC
N
f-1586420743
f
GR
GS
[1.00215 0 0 1 87.56063 77.76302] CT
0.302 GC
N
f-1586420743
f
GR
GS
[1.00215 0 0 1 95.43271 87.48817] CT
0.302 GC
N
f-1586420743
f
GR
GS
[1.00215 0 0 1 99.05536 84.87724] CT
0.302 GC
N
f-1586420743
f
GR
GS
[1.00215 0 0 1 89.63894 76.74619] CT
0.302 GC
N
f-1586420743
f
GR
GS
[1.00215 0 0 1 101.44726 81.83146] CT
0.302 GC
N
f-1586420743
f
GR
GS
[1.00215 0 0 1 84.68938 82.66624] CT
0.302 GC
N
f-1586420743
f
GR
GS
[1.00215 0 0 1 84.41751 91.47648] CT
0.302 GC
N
f-1586420743
f
GR
GS
[1.00215 0 0 1 95.06923 93.06452] CT
0.302 GC
N
f-1586420743
f
GR
GS
[1.00215 0 0 1 92.14601 87.47385] CT
0.302 GC
N
f-1586420743
f
GR
GS
[1.00215 0 0 1 92.71094 89.84583] CT
0.302 GC
N
f-1586420743
f
GR
GS
[1.00215 0 0 1 86.08471 81.52709] CT
0.302 GC
N
f-1586420743
f
GR
GS
[1.00215 0 0 1 83.10915 84.87204] CT
0.302 GC
N
f-1586420743
f
GR
GS
[1.00215 0 0 1 89.26982 87.59212] CT
0.302 GC
N
f-1586420743
f
GR
GS
[1.00215 0 0 1 97.27575 74.20242] CT
0.302 GC
N
f-1586420743
f
GR
GS
[1.00215 0 0 1 94.74609 77.46028] CT
0.302 GC
N
f-1586420743
f
GR
GS
[1.00215 0 0 1 96.44363 86.36435] CT
0.302 GC
N
f-1586420743
f
GR
GS
[1.00215 0 0 1 83.31099 74.67224] CT
0.302 GC
N
f-1586420743
f
GR
GS
[1.00215 0 0 1 84.17563 80.47032] CT
0.302 GC
N
f-1586420743
f
GR
GS
[1.00215 0 0 1 90.37257 89.14465] CT
0.302 GC
N
f-1586420743
f
GR
GS
[1.00215 0 0 1 86.5442 85.37981] CT
0.302 GC
N
f-1586420743
f
GR
GS
[1.00215 0 0 1 0 0] CT
1 0.6 0.6 RC
N
/f128844418{161.71 228 M
161.71 75.838 L
122.19 75.838 L
122.19 228 L
cp}def
f128844418
f
GR
GS
[1.00215 0 0 1 146.62602 74.33144] CT
0.302 GC
N
f-1586420743
f
GR
GS
[1.00215 0 0 1 148.39916 66.06659] CT
0.302 GC
N
f-1586420743
f
GR
GS
[1.00215 0 0 1 146.86091 83.02623] CT
0.302 GC
N
f-1586420743
f
GR
GS
[1.00215 0 0 1 148.13463 83.98828] CT
0.302 GC
N
f-1586420743
f
GR
GS
[1.00215 0 0 1 143.44663 75.75404] CT
0.302 GC
N
f-1586420743
f
GR
GS
[1.00215 0 0 1 149.6192 68.81657] CT
0.302 GC
N
f-1586420743
f
GR
GS
[1.00215 0 0 1 150.09171 63.43996] CT
0.302 GC
N
f-1586420743
f
GR
GS
[1.00215 0 0 1 149.40842 74.47033] CT
0.302 GC
N
f-1586420743
f
GR
GS
[1.00215 0 0 1 139.63514 75.57352] CT
0.302 GC
N
f-1586420743
f
GR
GS
[1.00215 0 0 1 147.88092 80.7072] CT
0.302 GC
N
f-1586420743
f
GR
GS
[1.00215 0 0 1 134.42184 69.85603] CT
0.302 GC
N
f-1586420743
f
GR
GS
[1.00215 0 0 1 135.81589 85.08782] CT
0.302 GC
N
f-1586420743
f
GR
GS
[1.00215 0 0 1 135.2103 61.96078] CT
0.302 GC
N
f-1586420743
f
GR
GS
[1.00215 0 0 1 134.75792 71.00904] CT
0.302 GC
N
f-1586420743
f
GR
GS
[1.00215 0 0 1 149.31767 58.88984] CT
0.302 GC
N
f-1586420743
f
GR
GS
[1.00215 0 0 1 139.08818 62.171] CT
0.302 GC
N
f-1586420743
f
GR
GS
[1.00215 0 0 1 140.45465 67.20409] CT
0.302 GC
N
f-1586420743
f
GR
GS
[1.00215 0 0 1 140.18313 67.98888] CT
0.302 GC
N
f-1586420743
f
GR
GS
[1.00215 0 0 1 148.70562 61.22059] CT
0.302 GC
N
f-1586420743
f
GR
GS
[1.00215 0 0 1 143.62034 95.23314] CT
0.302 GC
N
f-1586420743
f
GR
GS
[1.00215 0 0 1 144.17615 80.49229] CT
0.302 GC
N
f-1586420743
f
GR
GS
[1.00215 0 0 1 147.73109 80.38881] CT
0.302 GC
N
f-1586420743
f
GR
GS
[1.00215 0 0 1 132.52156 73.75627] CT
0.302 GC
N
f-1586420743
f
GR
GS
[1.00215 0 0 1 133.35521 79.97803] CT
0.302 GC
N
f-1586420743
f
GR
GS
[1.00215 0 0 1 132.60436 85.98653] CT
0.302 GC
N
f-1586420743
f
GR
GS
[1.00215 0 0 1 140.26887 75.60561] CT
0.302 GC
N
f-1586420743
f
GR
GS
[1.00215 0 0 1 133.31701 74.42689] CT
0.302 GC
N
f-1586420743
f
GR
GS
[1.00215 0 0 1 143.39081 69.89865] CT
0.302 GC
N
f-1586420743
f
GR
GS
[1.00215 0 0 1 143.48109 87.09289] CT
0.302 GC
N
f-1586420743
f
GR
GS
[1.00215 0 0 1 148.23972 76.86226] CT
0.302 GC
N
f-1586420743
f
GR
GS
[1.00215 0 0 1 133.77435 74.02193] CT
0.302 GC
N
f-1586420743
f
GR
GS
[1.00215 0 0 1 144.10334 83.70517] CT
0.302 GC
N
f-1586420743
f
GR
GS
[1.00215 0 0 1 149.17307 79.73019] CT
0.302 GC
N
f-1586420743
f
GR
GS
[1.00215 0 0 1 148.48053 83.59888] CT
0.302 GC
N
f-1586420743
f
GR
GS
[1.00215 0 0 1 145.90681 89.7529] CT
0.302 GC
N
f-1586420743
f
GR
GS
[1.00215 0 0 1 149.09516 75.31467] CT
0.302 GC
N
f-1586420743
f
GR
GS
[1.00215 0 0 1 139.55436 77.32523] CT
0.302 GC
N
f-1586420743
f
GR
GS
[1.00215 0 0 1 145.9532 83.46278] CT
0.302 GC
N
f-1586420743
f
GR
GS
[1.00215 0 0 1 133.07773 72.87894] CT
0.302 GC
N
f-1586420743
f
GR
GS
[1.00215 0 0 1 137.61877 80.02572] CT
0.302 GC
N
f-1586420743
f
GR
GS
[1.00215 0 0 1 141.50811 86.25295] CT
0.302 GC
N
f-1586420743
f
GR
GS
[1.00215 0 0 1 151.33046 77.89847] CT
0.302 GC
N
f-1586420743
f
GR
GS
[1.00215 0 0 1 147.94629 70.96447] CT
0.302 GC
N
f-1586420743
f
GR
GS
[1.00215 0 0 1 135.97109 85.81499] CT
0.302 GC
N
f-1586420743
f
GR
GS
[1.00215 0 0 1 133.69875 70.19678] CT
0.302 GC
N
f-1586420743
f
GR
GS
[1.00215 0 0 1 137.34841 55.39781] CT
0.302 GC
N
f-1586420743
f
GR
GS
[1.00215 0 0 1 148.13254 73.04187] CT
0.302 GC
N
f-1586420743
f
GR
GS
[1.00215 0 0 1 145.25603 65.26929] CT
0.302 GC
N
f-1586420743
f
GR
GS
[1.00215 0 0 1 149.61513 78.93823] CT
0.302 GC
N
f-1586420743
f
GR
GS
[1.00215 0 0 1 146.9672 78.23496] CT
0.302 GC
N
f-1586420743
f
GR
GS
[1.00215 0 0 1 152.01996 84.04676] CT
0.302 GC
N
f-1586420743
f
GR
GS
[1.00215 0 0 1 133.62796 97.03159] CT
0.302 GC
N
f-1586420743
f
GR
GS
[1.00215 0 0 1 134.97298 65.19962] CT
0.302 GC
N
f-1586420743
f
GR
%%Trailer
%%Pages: 1
%%EOF
