%!PS-Adobe-3.0 EPSF-3.0
%%Creator: (MATLAB, The Mathworks, Inc. Version 9.8.0.1323502 \(R2020a\). Operating System: Mac OS X)
%%Title: /Users/kosciessa/Desktop/mntTardisLNDG/LNDG/stateswitch/stsw_multimodal/figures/l1byage/l1comp_gamma.eps
%%CreationDate: 2022-03-02T14:36:43
%%Pages: (atend)
%%BoundingBox:     4     0   180   275
%%LanguageLevel: 3
%%EndComments
%%BeginProlog
%%BeginResource: procset (Apache XML Graphics Std ProcSet) 1.2 0
%%Version: 1.2 0
%%Copyright: (Copyright 2001-2003,2010 The Apache Software Foundation. License terms: http://www.apache.org/licenses/LICENSE-2.0)
/bd{bind def}bind def
/ld{load def}bd
/GR/grestore ld
/GS/gsave ld
/RM/rmoveto ld
/C/curveto ld
/t/show ld
/L/lineto ld
/ML/setmiterlimit ld
/CT/concat ld
/f/fill ld
/N/newpath ld
/S/stroke ld
/CC/setcmykcolor ld
/A/ashow ld
/cp/closepath ld
/RC/setrgbcolor ld
/LJ/setlinejoin ld
/GC/setgray ld
/LW/setlinewidth ld
/M/moveto ld
/re {4 2 roll M
1 index 0 rlineto
0 exch rlineto
neg 0 rlineto
cp } bd
/_ctm matrix def
/_tm matrix def
/BT { _ctm currentmatrix pop matrix _tm copy pop 0 0 moveto } bd
/ET { _ctm setmatrix } bd
/iTm { _ctm setmatrix _tm concat } bd
/Tm { _tm astore pop iTm 0 0 moveto } bd
/ux 0.0 def
/uy 0.0 def
/F {
  /Tp exch def
  /Tf exch def
  Tf findfont Tp scalefont setfont
  /cf Tf def  /cs Tp def
} bd
/ULS {currentpoint /uy exch def /ux exch def} bd
/ULE {
  /Tcx currentpoint pop def
  gsave
  newpath
  cf findfont cs scalefont dup
  /FontMatrix get 0 get /Ts exch def /FontInfo get dup
  /UnderlinePosition get Ts mul /To exch def
  /UnderlineThickness get Ts mul /Tt exch def
  ux uy To add moveto  Tcx uy To add lineto
  Tt setlinewidth stroke
  grestore
} bd
/OLE {
  /Tcx currentpoint pop def
  gsave
  newpath
  cf findfont cs scalefont dup
  /FontMatrix get 0 get /Ts exch def /FontInfo get dup
  /UnderlinePosition get Ts mul /To exch def
  /UnderlineThickness get Ts mul /Tt exch def
  ux uy To add cs add moveto Tcx uy To add cs add lineto
  Tt setlinewidth stroke
  grestore
} bd
/SOE {
  /Tcx currentpoint pop def
  gsave
  newpath
  cf findfont cs scalefont dup
  /FontMatrix get 0 get /Ts exch def /FontInfo get dup
  /UnderlinePosition get Ts mul /To exch def
  /UnderlineThickness get Ts mul /Tt exch def
  ux uy To add cs 10 mul 26 idiv add moveto Tcx uy To add cs 10 mul 26 idiv add lineto
  Tt setlinewidth stroke
  grestore
} bd
/QT {
/Y22 exch store
/X22 exch store
/Y21 exch store
/X21 exch store
currentpoint
/Y21 load 2 mul add 3 div exch
/X21 load 2 mul add 3 div exch
/X21 load 2 mul /X22 load add 3 div
/Y21 load 2 mul /Y22 load add 3 div
/X22 load /Y22 load curveto
} bd
/SSPD {
dup length /d exch dict def
{
/v exch def
/k exch def
currentpagedevice k known {
/cpdv currentpagedevice k get def
v cpdv ne {
/upd false def
/nullv v type /nulltype eq def
/nullcpdv cpdv type /nulltype eq def
nullv nullcpdv or
{
/upd true def
} {
/sametype v type cpdv type eq def
sametype {
v type /arraytype eq {
/vlen v length def
/cpdvlen cpdv length def
vlen cpdvlen eq {
0 1 vlen 1 sub {
/i exch def
/obj v i get def
/cpdobj cpdv i get def
obj cpdobj ne {
/upd true def
exit
} if
} for
} {
/upd true def
} ifelse
} {
v type /dicttype eq {
v {
/dv exch def
/dk exch def
/cpddv cpdv dk get def
dv cpddv ne {
/upd true def
exit
} if
} forall
} {
/upd true def
} ifelse
} ifelse
} if
} ifelse
upd true eq {
d k v put
} if
} if
} if
} forall
d length 0 gt {
d setpagedevice
} if
} bd
/RE { % /NewFontName [NewEncodingArray] /FontName RE -
  findfont dup length dict begin
  {
    1 index /FID ne
    {def} {pop pop} ifelse
  } forall
  /Encoding exch def
  /FontName 1 index def
  currentdict definefont pop
  end
} bind def
%%EndResource
%%BeginResource: procset (Apache XML Graphics EPS ProcSet) 1.0 0
%%Version: 1.0 0
%%Copyright: (Copyright 2002-2003 The Apache Software Foundation. License terms: http://www.apache.org/licenses/LICENSE-2.0)
/BeginEPSF { %def
/b4_Inc_state save def         % Save state for cleanup
/dict_count countdictstack def % Count objects on dict stack
/op_count count 1 sub def      % Count objects on operand stack
userdict begin                 % Push userdict on dict stack
/showpage { } def              % Redefine showpage, { } = null proc
0 setgray 0 setlinecap         % Prepare graphics state
1 setlinewidth 0 setlinejoin
10 setmiterlimit [ ] 0 setdash newpath
/languagelevel where           % If level not equal to 1 then
{pop languagelevel             % set strokeadjust and
1 ne                           % overprint to their defaults.
{false setstrokeadjust false setoverprint
} if
} if
} bd
/EndEPSF { %def
count op_count sub {pop} repeat            % Clean up stacks
countdictstack dict_count sub {end} repeat
b4_Inc_state restore
} bd
%%EndResource
%FOPBeginFontDict
%%IncludeResource: font Courier-Oblique
%%IncludeResource: font Courier-BoldOblique
%%IncludeResource: font Courier-Bold
%%IncludeResource: font ZapfDingbats
%%IncludeResource: font Symbol
%%IncludeResource: font Helvetica
%%IncludeResource: font Helvetica-Oblique
%%IncludeResource: font Helvetica-Bold
%%IncludeResource: font Helvetica-BoldOblique
%%IncludeResource: font Times-Roman
%%IncludeResource: font Times-Italic
%%IncludeResource: font Times-Bold
%%IncludeResource: font Times-BoldItalic
%%IncludeResource: font Courier
%FOPEndFontDict
%%BeginResource: encoding WinAnsiEncoding
/WinAnsiEncoding [
/.notdef /.notdef /.notdef /.notdef /.notdef
/.notdef /.notdef /.notdef /.notdef /.notdef
/.notdef /.notdef /.notdef /.notdef /.notdef
/.notdef /.notdef /.notdef /.notdef /.notdef
/.notdef /.notdef /.notdef /.notdef /.notdef
/.notdef /.notdef /.notdef /.notdef /.notdef
/.notdef /.notdef /space /exclam /quotedbl
/numbersign /dollar /percent /ampersand /quotesingle
/parenleft /parenright /asterisk /plus /comma
/hyphen /period /slash /zero /one
/two /three /four /five /six
/seven /eight /nine /colon /semicolon
/less /equal /greater /question /at
/A /B /C /D /E
/F /G /H /I /J
/K /L /M /N /O
/P /Q /R /S /T
/U /V /W /X /Y
/Z /bracketleft /backslash /bracketright /asciicircum
/underscore /quoteleft /a /b /c
/d /e /f /g /h
/i /j /k /l /m
/n /o /p /q /r
/s /t /u /v /w
/x /y /z /braceleft /bar
/braceright /asciitilde /bullet /Euro /bullet
/quotesinglbase /florin /quotedblbase /ellipsis /dagger
/daggerdbl /circumflex /perthousand /Scaron /guilsinglleft
/OE /bullet /Zcaron /bullet /bullet
/quoteleft /quoteright /quotedblleft /quotedblright /bullet
/endash /emdash /asciitilde /trademark /scaron
/guilsinglright /oe /bullet /zcaron /Ydieresis
/space /exclamdown /cent /sterling /currency
/yen /brokenbar /section /dieresis /copyright
/ordfeminine /guillemotleft /logicalnot /sfthyphen /registered
/macron /degree /plusminus /twosuperior /threesuperior
/acute /mu /paragraph /middot /cedilla
/onesuperior /ordmasculine /guillemotright /onequarter /onehalf
/threequarters /questiondown /Agrave /Aacute /Acircumflex
/Atilde /Adieresis /Aring /AE /Ccedilla
/Egrave /Eacute /Ecircumflex /Edieresis /Igrave
/Iacute /Icircumflex /Idieresis /Eth /Ntilde
/Ograve /Oacute /Ocircumflex /Otilde /Odieresis
/multiply /Oslash /Ugrave /Uacute /Ucircumflex
/Udieresis /Yacute /Thorn /germandbls /agrave
/aacute /acircumflex /atilde /adieresis /aring
/ae /ccedilla /egrave /eacute /ecircumflex
/edieresis /igrave /iacute /icircumflex /idieresis
/eth /ntilde /ograve /oacute /ocircumflex
/otilde /odieresis /divide /oslash /ugrave
/uacute /ucircumflex /udieresis /yacute /thorn
/ydieresis
] def
%%EndResource
%FOPBeginFontReencode
/Courier-Oblique findfont
dup length dict begin
  {1 index /FID ne {def} {pop pop} ifelse} forall
  /Encoding WinAnsiEncoding def
  currentdict
end
/Courier-Oblique exch definefont pop
/Courier-BoldOblique findfont
dup length dict begin
  {1 index /FID ne {def} {pop pop} ifelse} forall
  /Encoding WinAnsiEncoding def
  currentdict
end
/Courier-BoldOblique exch definefont pop
/Courier-Bold findfont
dup length dict begin
  {1 index /FID ne {def} {pop pop} ifelse} forall
  /Encoding WinAnsiEncoding def
  currentdict
end
/Courier-Bold exch definefont pop
/Helvetica findfont
dup length dict begin
  {1 index /FID ne {def} {pop pop} ifelse} forall
  /Encoding WinAnsiEncoding def
  currentdict
end
/Helvetica exch definefont pop
/Helvetica-Oblique findfont
dup length dict begin
  {1 index /FID ne {def} {pop pop} ifelse} forall
  /Encoding WinAnsiEncoding def
  currentdict
end
/Helvetica-Oblique exch definefont pop
/Helvetica-Bold findfont
dup length dict begin
  {1 index /FID ne {def} {pop pop} ifelse} forall
  /Encoding WinAnsiEncoding def
  currentdict
end
/Helvetica-Bold exch definefont pop
/Helvetica-BoldOblique findfont
dup length dict begin
  {1 index /FID ne {def} {pop pop} ifelse} forall
  /Encoding WinAnsiEncoding def
  currentdict
end
/Helvetica-BoldOblique exch definefont pop
/Times-Roman findfont
dup length dict begin
  {1 index /FID ne {def} {pop pop} ifelse} forall
  /Encoding WinAnsiEncoding def
  currentdict
end
/Times-Roman exch definefont pop
/Times-Italic findfont
dup length dict begin
  {1 index /FID ne {def} {pop pop} ifelse} forall
  /Encoding WinAnsiEncoding def
  currentdict
end
/Times-Italic exch definefont pop
/Times-Bold findfont
dup length dict begin
  {1 index /FID ne {def} {pop pop} ifelse} forall
  /Encoding WinAnsiEncoding def
  currentdict
end
/Times-Bold exch definefont pop
/Times-BoldItalic findfont
dup length dict begin
  {1 index /FID ne {def} {pop pop} ifelse} forall
  /Encoding WinAnsiEncoding def
  currentdict
end
/Times-BoldItalic exch definefont pop
/Courier findfont
dup length dict begin
  {1 index /FID ne {def} {pop pop} ifelse} forall
  /Encoding WinAnsiEncoding def
  currentdict
end
/Courier exch definefont pop
%FOPEndFontReencode
%%EndProlog
%%Page: 1 1
%%PageBoundingBox: 0 0 198 283
%%BeginPageSetup
[1 0 0 -1 0 283] CT
%%EndPageSetup
GS
[1.00215 0 0 1 0 0] CT
1 GC
N
0 0 198 283 re
f
GR
GS
[1.00215 0 0 1 0 0] CT
1 GC
N
0 0 198 283 re
f
GR
GS
[1.00215 0 0 1 0 0] CT
1 GC
N
52 228 M
179 228 L
179 32 L
52 32 L
cp
f
GR
GS
[1.00215 0 0 1 0 0] CT
0.149 GC
2 setlinecap
1 LJ
0.5 LW
N
52 228 M
179 228 L
S
GR
GS
[1.00215 0 0 1 0 0] CT
0.149 GC
2 setlinecap
1 LJ
0.5 LW
N
90.1 228 M
90.1 226.04 L
S
GR
GS
[1.00215 0 0 1 0 0] CT
0.149 GC
2 setlinecap
1 LJ
0.5 LW
N
140.9 228 M
140.9 226.04 L
S
GR
GS
[1.00215 0 0 1 90.29349 234] CT
0.149 GC
/Helvetica 20 F
GS
[1 0 0 1 0 0] CT
-13 20 moveto 
1 -1 scale
(YA) t 
GR
GR
GS
[1.00215 0 0 1 141.20257 234] CT
0.149 GC
/Helvetica 20 F
GS
[1 0 0 1 0 0] CT
-14.5 20 moveto 
1 -1 scale
(OA) t 
GR
GR
GS
[1.00215 0 0 1 115.7481 259] CT
0.149 GC
/Helvetica 20 F
GS
[1 0 0 1 0 0] CT
-49 20 moveto 
1 -1 scale
(Age Group) t 
GR
GR
GS
[1.00215 0 0 1 0 0] CT
0.149 GC
2 setlinecap
1 LJ
0.5 LW
N
52 228 M
52 32 L
S
GR
GS
[1.00215 0 0 1 0 0] CT
0.149 GC
2 setlinecap
1 LJ
0.5 LW
N
52 228 M
53.96 228 L
S
GR
GS
[1.00215 0 0 1 0 0] CT
0.149 GC
2 setlinecap
1 LJ
0.5 LW
N
52 191.084 M
53.96 191.084 L
S
GR
GS
[1.00215 0 0 1 0 0] CT
0.149 GC
2 setlinecap
1 LJ
0.5 LW
N
52 154.169 M
53.96 154.169 L
S
GR
GS
[1.00215 0 0 1 0 0] CT
0.149 GC
2 setlinecap
1 LJ
0.5 LW
N
52 117.253 M
53.96 117.253 L
S
GR
GS
[1.00215 0 0 1 0 0] CT
0.149 GC
2 setlinecap
1 LJ
0.5 LW
N
52 80.337 M
53.96 80.337 L
S
GR
GS
[1.00215 0 0 1 0 0] CT
0.149 GC
2 setlinecap
1 LJ
0.5 LW
N
52 43.422 M
53.96 43.422 L
S
GR
GS
[1.00215 0 0 1 46.09878 228] CT
0.149 GC
/Helvetica 20 F
GS
[1 0 0 1 0 0] CT
-19 7.5 moveto 
1 -1 scale
(-4) t 
GR
GR
GS
[1.00215 0 0 1 46.09878 191.08435] CT
0.149 GC
/Helvetica 20 F
GS
[1 0 0 1 0 0] CT
-19 7.5 moveto 
1 -1 scale
(-2) t 
GR
GR
GS
[1.00215 0 0 1 46.09878 154.1687] CT
0.149 GC
/Helvetica 20 F
GS
[1 0 0 1 0 0] CT
-12 7.5 moveto 
1 -1 scale
(0) t 
GR
GR
GS
[1.00215 0 0 1 46.09878 117.25305] CT
0.149 GC
/Helvetica 20 F
GS
[1 0 0 1 0 0] CT
-12 7.5 moveto 
1 -1 scale
(2) t 
GR
GR
GS
[1.00215 0 0 1 46.09878 80.3374] CT
0.149 GC
/Helvetica 20 F
GS
[1 0 0 1 0 0] CT
-12 7.5 moveto 
1 -1 scale
(4) t 
GR
GR
GS
[1.00215 0 0 1 46.09878 43.42176] CT
0.149 GC
/Helvetica 20 F
GS
[1 0 0 1 0 0] CT
-12 7.5 moveto 
1 -1 scale
(6) t 
GR
GR
GS
[0 -1 1.00215 0 24.05154 129.99991] CT
0.149 GC
/Helvetica 20 F
GS
[1 0 0 1 0 0] CT
-44.5 -5 moveto 
1 -1 scale
(gamma l1) t 
GR
GR
GS
[1.00215 0 0 1 115.74814 29.25] CT
/Helvetica-Bold 22 F
GS
[1 0 0 1 0 0] CT
-41 -5 moveto 
1 -1 scale
(p = 0.57) t 
GR
GR
GS
[1.00215 0 0 1 0 0] CT
0.149 GC
1 LJ
0.5 LW
N
52 154.169 M
179 154.169 L
S
GR
GS
[1.00215 0 0 1 0 0] CT
1 0.6 0.6 RC
N
110.42 154.169 M
110.42 136.879 L
69.78 136.879 L
69.78 154.169 L
cp
f
GR
GS
[1.00215 0 0 1 91.26945 177.32942] CT
0.302 GC
N
2.236 0 M
2.236 -1.235 1.235 -2.236 0 -2.236 C
-1.235 -2.236 -2.236 -1.235 -2.236 0 C
-2.236 1.235 -1.235 2.236 0 2.236 C
1.235 2.236 2.236 1.235 2.236 0 C
cp
f
GR
GS
[1.00215 0 0 1 95.7485 118.12358] CT
0.302 GC
N
/f-1586420743{2.236 0 M
2.236 -1.235 1.235 -2.236 0 -2.236 C
-1.235 -2.236 -2.236 -1.235 -2.236 0 C
-2.236 1.235 -1.235 2.236 0 2.236 C
1.235 2.236 2.236 1.235 2.236 0 C
cp}def
f-1586420743
f
GR
GS
[1.00215 0 0 1 83.36098 211.52599] CT
0.302 GC
N
f-1586420743
f
GR
GS
[1.00215 0 0 1 97.78179 167.51321] CT
0.302 GC
N
f-1586420743
f
GR
GS
[1.00215 0 0 1 95.92696 128.96307] CT
0.302 GC
N
f-1586420743
f
GR
GS
[1.00215 0 0 1 83.28634 62.28077] CT
0.302 GC
N
f-1586420743
f
GR
GS
[1.00215 0 0 1 94.43909 187.88258] CT
0.302 GC
N
f-1586420743
f
GR
GS
[1.00215 0 0 1 88.68603 151.64182] CT
0.302 GC
N
f-1586420743
f
GR
GS
[1.00215 0 0 1 88.24576 148.57227] CT
0.302 GC
N
f-1586420743
f
GR
GS
[1.00215 0 0 1 89.20808 150.70998] CT
0.302 GC
N
f-1586420743
f
GR
GS
[1.00215 0 0 1 87.16356 118.74872] CT
0.302 GC
N
f-1586420743
f
GR
GS
[1.00215 0 0 1 86.08377 150.69659] CT
0.302 GC
N
f-1586420743
f
GR
GS
[1.00215 0 0 1 84.83552 186.70064] CT
0.302 GC
N
f-1586420743
f
GR
GS
[1.00215 0 0 1 81.60619 146.79099] CT
0.302 GC
N
f-1586420743
f
GR
GS
[1.00215 0 0 1 80.61521 148.87497] CT
0.302 GC
N
f-1586420743
f
GR
GS
[1.00215 0 0 1 94.04086 188.79765] CT
0.302 GC
N
f-1586420743
f
GR
GS
[1.00215 0 0 1 81.40028 168.85957] CT
0.302 GC
N
f-1586420743
f
GR
GS
[1.00215 0 0 1 87.58726 164.38229] CT
0.302 GC
N
f-1586420743
f
GR
GS
[1.00215 0 0 1 99.59888 83.14883] CT
0.302 GC
N
f-1586420743
f
GR
GS
[1.00215 0 0 1 92.87423 102.33054] CT
0.302 GC
N
f-1586420743
f
GR
GS
[1.00215 0 0 1 84.25474 149.69853] CT
0.302 GC
N
f-1586420743
f
GR
GS
[1.00215 0 0 1 80.83704 94.61286] CT
0.302 GC
N
f-1586420743
f
GR
GS
[1.00215 0 0 1 88.34817 32] CT
0.302 GC
N
f-1586420743
f
GR
GS
[1.00215 0 0 1 86.17877 106.6563] CT
0.302 GC
N
f-1586420743
f
GR
GS
[1.00215 0 0 1 95.82545 225.00322] CT
0.302 GC
N
f-1586420743
f
GR
GS
[1.00215 0 0 1 87.31392 200.72261] CT
0.302 GC
N
f-1586420743
f
GR
GS
[1.00215 0 0 1 100.13712 110.52175] CT
0.302 GC
N
f-1586420743
f
GR
GS
[1.00215 0 0 1 80.78296 91.839] CT
0.302 GC
N
f-1586420743
f
GR
GS
[1.00215 0 0 1 84.31878 120.94578] CT
0.302 GC
N
f-1586420743
f
GR
GS
[1.00215 0 0 1 99.1578 167.15665] CT
0.302 GC
N
f-1586420743
f
GR
GS
[1.00215 0 0 1 97.26012 85.76568] CT
0.302 GC
N
f-1586420743
f
GR
GS
[1.00215 0 0 1 84.35964 107.55521] CT
0.302 GC
N
f-1586420743
f
GR
GS
[1.00215 0 0 1 82.76693 126.35371] CT
0.302 GC
N
f-1586420743
f
GR
GS
[1.00215 0 0 1 86.85616 202.39066] CT
0.302 GC
N
f-1586420743
f
GR
GS
[1.00215 0 0 1 88.98426 157.36363] CT
0.302 GC
N
f-1586420743
f
GR
GS
[1.00215 0 0 1 92.68633 176.59676] CT
0.302 GC
N
f-1586420743
f
GR
GS
[1.00215 0 0 1 98.44919 126.03978] CT
0.302 GC
N
f-1586420743
f
GR
GS
[1.00215 0 0 1 90.47134 135.84488] CT
0.302 GC
N
f-1586420743
f
GR
GS
[1.00215 0 0 1 96.32387 146.52565] CT
0.302 GC
N
f-1586420743
f
GR
GS
[1.00215 0 0 1 86.52356 32] CT
0.302 GC
N
f-1586420743
f
GR
GS
[1.00215 0 0 1 82.76908 57.56055] CT
0.302 GC
N
f-1586420743
f
GR
GS
[1.00215 0 0 1 91.27413 131.8727] CT
0.302 GC
N
f-1586420743
f
GR
GS
[1.00215 0 0 1 0 0] CT
1 0.6 0.6 RC
N
/f610783502{161.22 154.169 M
161.22 132.443 L
120.58 132.443 L
120.58 154.169 L
cp}def
f610783502
f
GR
GS
[1.00215 0 0 1 148.66518 118.79338] CT
0.302 GC
N
f-1586420743
f
GR
GS
[1.00215 0 0 1 141.23375 146.34627] CT
0.302 GC
N
f-1586420743
f
GR
GS
[1.00215 0 0 1 134.07408 121.02915] CT
0.302 GC
N
f-1586420743
f
GR
GS
[1.00215 0 0 1 137.94206 155.11511] CT
0.302 GC
N
f-1586420743
f
GR
GS
[1.00215 0 0 1 146.79126 155.95009] CT
0.302 GC
N
f-1586420743
f
GR
GS
[1.00215 0 0 1 149.16642 172.01218] CT
0.302 GC
N
f-1586420743
f
GR
GS
[1.00215 0 0 1 145.74729 144.70349] CT
0.302 GC
N
f-1586420743
f
GR
GS
[1.00215 0 0 1 139.2989 135.2955] CT
0.302 GC
N
f-1586420743
f
GR
GS
[1.00215 0 0 1 148.27984 140.9278] CT
0.302 GC
N
f-1586420743
f
GR
GS
[1.00215 0 0 1 131.29251 88.32733] CT
0.302 GC
N
f-1586420743
f
GR
GS
[1.00215 0 0 1 145.20798 133.94632] CT
0.302 GC
N
f-1586420743
f
GR
GS
[1.00215 0 0 1 150.85814 151.59821] CT
0.302 GC
N
f-1586420743
f
GR
GS
[1.00215 0 0 1 141.56249 137.68935] CT
0.302 GC
N
f-1586420743
f
GR
GS
[1.00215 0 0 1 149.55014 148.28874] CT
0.302 GC
N
f-1586420743
f
GR
GS
[1.00215 0 0 1 140.31878 116.7226] CT
0.302 GC
N
f-1586420743
f
GR
GS
[1.00215 0 0 1 134.47495 135.41576] CT
0.302 GC
N
f-1586420743
f
GR
GS
[1.00215 0 0 1 151.14047 105.42859] CT
0.302 GC
N
f-1586420743
f
GR
GS
[1.00215 0 0 1 140.10651 130.6221] CT
0.302 GC
N
f-1586420743
f
GR
GS
[1.00215 0 0 1 135.58412 153.9792] CT
0.302 GC
N
f-1586420743
f
GR
GS
[1.00215 0 0 1 131.6328 163.12117] CT
0.302 GC
N
f-1586420743
f
GR
GS
[1.00215 0 0 1 143.92513 165.30415] CT
0.302 GC
N
f-1586420743
f
GR
GS
[1.00215 0 0 1 135.79727 182.99216] CT
0.302 GC
N
f-1586420743
f
GR
GS
[1.00215 0 0 1 145.94224 180.73212] CT
0.302 GC
N
f-1586420743
f
GR
GS
[1.00215 0 0 1 132.81231 53.01712] CT
0.302 GC
N
f-1586420743
f
GR
GS
[1.00215 0 0 1 135.78218 85.28404] CT
0.302 GC
N
f-1586420743
f
GR
GS
[1.00215 0 0 1 150.36141 139.88271] CT
0.302 GC
N
f-1586420743
f
GR
GS
[1.00215 0 0 1 132.42132 121.88713] CT
0.302 GC
N
f-1586420743
f
GR
GS
[1.00215 0 0 1 149.9895 138.56219] CT
0.302 GC
N
f-1586420743
f
GR
GS
[1.00215 0 0 1 138.3114 144.67847] CT
0.302 GC
N
f-1586420743
f
GR
GS
[1.00215 0 0 1 149.66107 96.93815] CT
0.302 GC
N
f-1586420743
f
GR
GS
[1.00215 0 0 1 142.67283 105.68262] CT
0.302 GC
N
f-1586420743
f
GR
GS
[1.00215 0 0 1 132.78277 110.03485] CT
0.302 GC
N
f-1586420743
f
GR
GS
[1.00215 0 0 1 139.28455 182.99216] CT
0.302 GC
N
f-1586420743
f
GR
GS
[1.00215 0 0 1 140.91947 170.23991] CT
0.302 GC
N
f-1586420743
f
GR
GS
[1.00215 0 0 1 136.59381 159.9588] CT
0.302 GC
N
f-1586420743
f
GR
GS
[1.00215 0 0 1 144.69087 100.43645] CT
0.302 GC
N
f-1586420743
f
GR
GS
[1.00215 0 0 1 135.25067 116.72984] CT
0.302 GC
N
f-1586420743
f
GR
GS
[1.00215 0 0 1 139.16936 146.28094] CT
0.302 GC
N
f-1586420743
f
GR
GS
[1.00215 0 0 1 139.68721 127.42885] CT
0.302 GC
N
f-1586420743
f
GR
GS
[1.00215 0 0 1 145.30007 145.46397] CT
0.302 GC
N
f-1586420743
f
GR
GS
[1.00215 0 0 1 137.94194 167.95514] CT
0.302 GC
N
f-1586420743
f
GR
GS
[1.00215 0 0 1 137.29832 182.99216] CT
0.302 GC
N
f-1586420743
f
GR
GS
[1.00215 0 0 1 147.18904 88.67609] CT
0.302 GC
N
f-1586420743
f
GR
GS
[1.00215 0 0 1 149.35785 106.67928] CT
0.302 GC
N
f-1586420743
f
GR
GS
[1.00215 0 0 1 139.22843 119.41604] CT
0.302 GC
N
f-1586420743
f
GR
GS
[1.00215 0 0 1 139.2933 126.1997] CT
0.302 GC
N
f-1586420743
f
GR
GS
[1.00215 0 0 1 140.16896 123.34966] CT
0.302 GC
N
f-1586420743
f
GR
GS
[1.00215 0 0 1 146.81785 53.01712] CT
0.302 GC
N
f-1586420743
f
GR
GS
[1.00215 0 0 1 138.8917 134.38466] CT
0.302 GC
N
f-1586420743
f
GR
GS
[1.00215 0 0 1 133.87469 158.36705] CT
0.302 GC
N
f-1586420743
f
GR
GS
[1.00215 0 0 1 138.3759 133.59344] CT
0.302 GC
N
f-1586420743
f
GR
GS
[1.00215 0 0 1 138.12704 115.6255] CT
0.302 GC
N
f-1586420743
f
GR
GS
[1.00215 0 0 1 147.63991 79.38004] CT
0.302 GC
N
f-1586420743
f
GR
%%Trailer
%%Pages: 1
%%EOF
