{"freq_range": [0.03502096525352339, 0.4499720778790546], "freq_res": 0.00018930251488390865, "aperiodic_params_": [0.1668346298721917, 1.3904964691701691], "gaussian_params_": [[0.1047457241389665, 0.5620185360913232, 0.009646203918085025]], "peak_params_": [[0.1047457241389665, 0.5620071385130891, 0.01929240783617005]], "r_squared_": 0.9686428070824251, "error_": 0.06728487210434313}
{"freq_range": [0.03502096525352339, 0.4499720778790546], "freq_res": 0.00018930251488390865, "aperiodic_params_": [0.2436449261829426, 1.2433846773554247], "gaussian_params_": [[0.10660714603735211, 0.6494825310934043, 0.010712950788125813]], "peak_params_": [[0.10660714603735211, 0.6494800132453606, 0.021425901576251627]], "r_squared_": 0.9678175229174886, "error_": 0.06522661911576967}
{"freq_range": [0.03502096525352339, 0.4499720778790546], "freq_res": 0.00018930251488390865, "aperiodic_params_": [0.24785323483265934, 1.2395119311900662], "gaussian_params_": [[0.10541974368620036, 0.6446147532908382, 0.008087651478894814]], "peak_params_": [[0.10541974368620036, 0.6446124207632744, 0.016175302957789628]], "r_squared_": 0.9709262682603588, "error_": 0.05591745271335914}
{"freq_range": [0.03502096525352339, 0.4499720778790546], "freq_res": 0.00018930251488390865, "aperiodic_params_": [0.2701099802982953, 1.2209641366467512], "gaussian_params_": [[0.10460281609325865, 0.6312251966530339, 0.007819708491071343]], "peak_params_": [[0.10460281609325865, 0.6311909351594536, 0.015639416982142686]], "r_squared_": 0.9741417068690726, "error_": 0.05303642100474985}
