L3_runFOOOF.py
/home/mpib/LNDG/stateswitch/stsw_fmri_task/spectrum
2132
Setting up paths ...

Loading backgrounds from .mat ...

Running FOOOFGroup across 4 power spectra.
==================================================================================================
                                                                                                  
                                       FOOOF - GROUP RESULTS                                      
                                                                                                  
                             Number of power spectra in the Group: 4                              
                                                                                                  
                        The model was run on the frequency range 0 - 1 Hz                         
                                 Frequency Resolution is 0.00 Hz                                  
                                                                                                  
                              Power spectra were fit without a knee.                              
                                                                                                  
                                      Aperiodic Fit Values:                                       
                        Exponents - Min:  0.530, Max:  0.583, Mean: 0.554                         
                                                                                                  
                          In total 4 peaks were extracted from the group                          
                                                                                                  
                                     Goodness of fit metrics:                                     
                            R2s -  Min:  0.896, Max:  0.918, Mean: 0.910                          
                         Errors -  Min:  0.046, Max:  0.053, Mean: 0.049                          
                                                                                                  
==================================================================================================
2132Done!
