
                            < M A T L A B (R) >
                  Copyright 1984-2020 The MathWorks, Inc.
                  R2020a (9.8.0.1323502) 64-bit (glnxa64)
                             February 25, 2020

 
To get started, type doc.
For product information, visit www.mathworks.com.
 
loading /home/mpib/LNDG/stateswitch/stsw_fmri_task/spectrum/../pls_vartbx/data/pls/taskPLS_STSWD_VarTbx_YA_OA_3mm_1000P1000B_BfMRIbsr_lv1.img
...done
 
Processing subject 1234.
loading /home/mpib/LNDG/stateswitch/stsw_fmri_task/spectrum/../extended_preproc/data/data_clean/1234_run-1_regressed.nii
...done
 
Block 1 finished: 20.8726
Block 2 finished: 18.3792
Block 3 finished: 19.1887
Block 4 finished: 19.4033
Block 5 finished: 20.3765
Block 6 finished: 20.9694
Block 7 finished: 21.5943
Block 8 finished: 21.3369
loading /home/mpib/LNDG/stateswitch/stsw_fmri_task/spectrum/../extended_preproc/data/data_clean/1234_run-2_regressed.nii
...done
 
Block 1 finished: 22.7589
Block 2 finished: 23.4329
Block 3 finished: 24.018
Block 4 finished: 22.9265
Block 5 finished: 24.7836
Block 6 finished: 25.2866
Block 7 finished: 25.7823
Block 8 finished: 24.4676
loading /home/mpib/LNDG/stateswitch/stsw_fmri_task/spectrum/../extended_preproc/data/data_clean/1234_run-3_regressed.nii
...done
 
Block 1 finished: 26.8326
Block 2 finished: 27.4781
Block 3 finished: 27.9949
Block 4 finished: 25.7986
Block 5 finished: 29.3431
Block 6 finished: 30.1625
Block 7 finished: 31.3789
Block 8 finished: 29.078
loading /home/mpib/LNDG/stateswitch/stsw_fmri_task/spectrum/../extended_preproc/data/data_clean/1234_run-4_regressed.nii
...done
 
Block 1 finished: 31.9436
Block 2 finished: 34.4266
Block 3 finished: 31.3385
Block 4 finished: 34.674
Block 5 finished: 42.7892
Block 6 finished: 34.6627
Block 7 finished: 31.9824
Block 8 finished: 44.1715
[Warning: Variable 'fftpower_merged' was not saved. For variables larger than
2GB use MAT-file version 7.3 or later.] 
[> In L1_calcPowerPLS (line 105)] 
