{"freq_range": [0.03502096525352339, 0.4499720778790546], "freq_res": 0.00018930251488390865, "aperiodic_params_": [0.5440881030454183, 1.1676072417505337], "gaussian_params_": [], "peak_params_": [], "r_squared_": 0.9311462080519479, "error_": 0.0703756086509424}
{"freq_range": [0.03502096525352339, 0.4499720778790546], "freq_res": 0.00018930251488390865, "aperiodic_params_": [0.6381428142076975, 1.08650188721535], "gaussian_params_": [], "peak_params_": [], "r_squared_": 0.9396118421833787, "error_": 0.06396368265751752}
{"freq_range": [0.03502096525352339, 0.4499720778790546], "freq_res": 0.00018930251488390865, "aperiodic_params_": [0.6111241436230865, 1.1399578929615128], "gaussian_params_": [], "peak_params_": [], "r_squared_": 0.9293251953904945, "error_": 0.0689205330230589}
{"freq_range": [0.03502096525352339, 0.4499720778790546], "freq_res": 0.00018930251488390865, "aperiodic_params_": [0.6398576399519651, 1.096077747083359], "gaussian_params_": [], "peak_params_": [], "r_squared_": 0.9328868093753342, "error_": 0.06348666437286175}
