{"freq_range": [0.03502096525352339, 0.4499720778790546], "freq_res": 0.00018930251488390865, "aperiodic_params_": [0.3811774032388873, 0.7563463065245221], "gaussian_params_": [[0.10480430080079857, 0.6524632191969276, 0.006639092845209047]], "peak_params_": [[0.10480430080079857, 0.6524276832004849, 0.013278185690418094]], "r_squared_": 0.950346091059146, "error_": 0.04337081169293831}
{"freq_range": [0.03502096525352339, 0.4499720778790546], "freq_res": 0.00018930251488390865, "aperiodic_params_": [0.40311392429174975, 0.7593021700002259], "gaussian_params_": [[0.10586428447478198, 0.6275173152953963, 0.005484229082204113]], "peak_params_": [[0.10586428447478198, 0.6274969550751763, 0.010968458164408225]], "r_squared_": 0.9266743097919931, "error_": 0.05789356636132988}
{"freq_range": [0.03502096525352339, 0.4499720778790546], "freq_res": 0.00018930251488390865, "aperiodic_params_": [0.35072247086967556, 0.8514958807062518], "gaussian_params_": [[0.10510070151480745, 0.6274427432344512, 0.006140618390922978]], "peak_params_": [[0.10510070151480745, 0.627430851872858, 0.012281236781845955]], "r_squared_": 0.90915683728856, "error_": 0.06860947438704024}
{"freq_range": [0.03502096525352339, 0.4499720778790546], "freq_res": 0.00018930251488390865, "aperiodic_params_": [0.4305951816786915, 0.6858796020249397], "gaussian_params_": [[0.10415109678141297, 0.4975829428212084, 0.008105812580581533]], "peak_params_": [[0.10415109678141297, 0.49757837993568943, 0.016211625161163066]], "r_squared_": 0.904264704848346, "error_": 0.061806784102333374}
