
                            < M A T L A B (R) >
                  Copyright 1984-2020 The MathWorks, Inc.
                  R2020a (9.8.0.1323502) 64-bit (glnxa64)
                             February 25, 2020

 
To get started, type doc.
For product information, visit www.mathworks.com.
 
loading /home/mpib/LNDG/stateswitch/stsw_fmri_task/spectrum/../pls_vartbx/data/pls/taskPLS_STSWD_VarTbx_YA_OA_3mm_1000P1000B_BfMRIbsr_lv1.img
...done
 
Processing subject 2210.
loading /home/mpib/LNDG/stateswitch/stsw_fmri_task/spectrum/../extended_preproc/data/data_clean/2210_run-1_regressed.nii
...done
 
Block 1 finished: 24.4742
Block 2 finished: 18.1917
Block 3 finished: 18.951
Block 4 finished: 19.1132
Block 5 finished: 20.0952
Block 6 finished: 20.6404
Block 7 finished: 21.2236
Block 8 finished: 20.9344
loading /home/mpib/LNDG/stateswitch/stsw_fmri_task/spectrum/../extended_preproc/data/data_clean/2210_run-2_regressed.nii
...done
 
Block 1 finished: 22.495
Block 2 finished: 22.9226
Block 3 finished: 23.3833
Block 4 finished: 22.3801
Block 5 finished: 24.3671
Block 6 finished: 24.8678
Block 7 finished: 25.3363
Block 8 finished: 23.8715
loading /home/mpib/LNDG/stateswitch/stsw_fmri_task/spectrum/../extended_preproc/data/data_clean/2210_run-3_regressed.nii
...done
 
Block 1 finished: 26.4089
Block 2 finished: 27.0617
Block 3 finished: 27.7947
Block 4 finished: 25.3907
Block 5 finished: 28.9529
Block 6 finished: 30.6983
Block 7 finished: 31.3076
Block 8 finished: 29.4067
loading /home/mpib/LNDG/stateswitch/stsw_fmri_task/spectrum/../extended_preproc/data/data_clean/2210_run-4_regressed.nii
...done
 
Block 1 finished: 32.208
Block 2 finished: 34.114
Block 3 finished: 31.3172
Block 4 finished: 34.3619
Block 5 finished: 43.5169
Block 6 finished: 35.0687
Block 7 finished: 28.595
Block 8 finished: 48.0283
[Warning: Variable 'fftpower_merged' was not saved. For variables larger than
2GB use MAT-file version 7.3 or later.] 
[> In L1_calcPowerPLS (line 105)] 
