
                            < M A T L A B (R) >
                  Copyright 1984-2020 The MathWorks, Inc.
                  R2020a (9.8.0.1323502) 64-bit (glnxa64)
                             February 25, 2020

 
To get started, type doc.
For product information, visit www.mathworks.com.
 
loading /home/mpib/LNDG/stateswitch/stsw_fmri_task/spectrum/../pls_vartbx/data/pls/taskPLS_STSWD_VarTbx_YA_OA_3mm_1000P1000B_BfMRIbsr_lv1.img
...done
 
Processing subject 2132.
loading /home/mpib/LNDG/stateswitch/stsw_fmri_task/spectrum/../extended_preproc/data/data_clean/2132_run-1_regressed.nii
...done
 
Block 1 finished: 18.6098
Block 2 finished: 18.0806
Block 3 finished: 18.8329
Block 4 finished: 18.9592
Block 5 finished: 19.9191
Block 6 finished: 20.4464
Block 7 finished: 20.9911
Block 8 finished: 20.8032
loading /home/mpib/LNDG/stateswitch/stsw_fmri_task/spectrum/../extended_preproc/data/data_clean/2132_run-2_regressed.nii
...done
 
loading /home/mpib/LNDG/stateswitch/stsw_fmri_task/spectrum/../extended_preproc/data/data_clean/2132_run-3_regressed.nii
...done
 
Block 1 finished: 23.6294
Block 2 finished: 25.7549
Block 3 finished: 26.1657
Block 4 finished: 24.1933
Block 5 finished: 27.2536
Block 6 finished: 28.0818
Block 7 finished: 28.8937
Block 8 finished: 25.1023
loading /home/mpib/LNDG/stateswitch/stsw_fmri_task/spectrum/../extended_preproc/data/data_clean/2132_run-4_regressed.nii
...done
 
Block 1 finished: 28.4918
Block 2 finished: 28.8464
Block 3 finished: 25.7046
Block 4 finished: 29.5977
Block 5 finished: 30.0591
Block 6 finished: 30.7736
Block 7 finished: 27.5941
Block 8 finished: 31.2306
[Warning: Variable 'fftpower_merged' was not saved. For variables larger than
2GB use MAT-file version 7.3 or later.] 
[> In L1_calcPowerPLS (line 105)] 
