
                            < M A T L A B (R) >
                  Copyright 1984-2020 The MathWorks, Inc.
                  R2020a (9.8.0.1323502) 64-bit (glnxa64)
                             February 25, 2020

 
To get started, type doc.
For product information, visit www.mathworks.com.
 
loading /home/mpib/LNDG/stateswitch/stsw_fmri_task/spectrum/data/standards/data/mni_icbm152_nlin_sym_09c/mni_icbm152_gm_tal_nlin_sym_09c_MNI_3mm.nii
...done
 
Processing subject 1240.
loading /home/mpib/LNDG/stateswitch/stsw_fmri_task/spectrum/../extended_preproc/data/data_clean/1240_run-1_regressed.nii
...done
 
Block 1 finished: 38.416
Block 2 finished: 37.1831
Block 3 finished: 37.2405
Block 4 finished: 37.2995
Block 5 finished: 37.4739
Block 6 finished: 37.3998
Block 7 finished: 37.5447
Block 8 finished: 37.535
loading /home/mpib/LNDG/stateswitch/stsw_fmri_task/spectrum/../extended_preproc/data/data_clean/1240_run-2_regressed.nii
...done
 
Block 1 finished: 38.2645
Block 2 finished: 37.6468
Block 3 finished: 37.8073
Block 4 finished: 37.7107
Block 5 finished: 37.7721
Block 6 finished: 37.6709
Block 7 finished: 37.6414
Block 8 finished: 37.7312
loading /home/mpib/LNDG/stateswitch/stsw_fmri_task/spectrum/../extended_preproc/data/data_clean/1240_run-3_regressed.nii
...done
 
Block 1 finished: 37.9824
Block 2 finished: 37.9727
Block 3 finished: 37.852
Block 4 finished: 37.8865
Block 5 finished: 38.3783
Block 6 finished: 38.3673
Block 7 finished: 38.3434
Block 8 finished: 38.214
loading /home/mpib/LNDG/stateswitch/stsw_fmri_task/spectrum/../extended_preproc/data/data_clean/1240_run-4_regressed.nii
...done
 
Block 1 finished: 38.4107
Block 2 finished: 38.4254
Block 3 finished: 38.2989
Block 4 finished: 38.3272
Block 5 finished: 38.3686
Block 6 finished: 38.3744
Block 7 finished: 38.4455
Block 8 finished: 38.9708
