
                            < M A T L A B (R) >
                  Copyright 1984-2020 The MathWorks, Inc.
                  R2020a (9.8.0.1323502) 64-bit (glnxa64)
                             February 25, 2020

 
To get started, type doc.
For product information, visit www.mathworks.com.
 
loading /home/mpib/LNDG/stateswitch/stsw_fmri_task/spectrum/data/standards/data/mni_icbm152_nlin_sym_09c/mni_icbm152_gm_tal_nlin_sym_09c_MNI_3mm.nii
...done
 
Processing subject 2219.
loading /home/mpib/LNDG/stateswitch/stsw_fmri_task/spectrum/../extended_preproc/data/data_clean/2219_run-1_regressed.nii
...done
 
Block 1 finished: 49.3001
Block 2 finished: 45.795
Block 3 finished: 45.885
Block 4 finished: 45.9038
Block 5 finished: 46.0772
Block 6 finished: 46.0953
Block 7 finished: 46.1143
Block 8 finished: 46.1656
loading /home/mpib/LNDG/stateswitch/stsw_fmri_task/spectrum/../extended_preproc/data/data_clean/2219_run-2_regressed.nii
...done
 
Block 1 finished: 46.3272
Block 2 finished: 46.2545
Block 3 finished: 46.4522
Block 4 finished: 46.3421
Block 5 finished: 46.3256
Block 6 finished: 46.4474
Block 7 finished: 46.4418
Block 8 finished: 46.5187
loading /home/mpib/LNDG/stateswitch/stsw_fmri_task/spectrum/../extended_preproc/data/data_clean/2219_run-3_regressed.nii
...done
 
Block 1 finished: 46.4973
Block 2 finished: 46.6025
Block 3 finished: 46.5731
Block 4 finished: 46.6749
Block 5 finished: 47.0032
Block 6 finished: 46.7568
Block 7 finished: 46.8202
Block 8 finished: 46.8415
loading /home/mpib/LNDG/stateswitch/stsw_fmri_task/spectrum/../extended_preproc/data/data_clean/2219_run-4_regressed.nii
...done
 
Block 1 finished: 46.8372
Block 2 finished: 46.8283
Block 3 finished: 46.9918
Block 4 finished: 46.9698
Block 5 finished: 46.9774
Block 6 finished: 47.0219
Block 7 finished: 47.0604
Block 8 finished: 47.607
