
                            < M A T L A B (R) >
                  Copyright 1984-2020 The MathWorks, Inc.
                  R2020a (9.8.0.1323502) 64-bit (glnxa64)
                             February 25, 2020

 
To get started, type doc.
For product information, visit www.mathworks.com.
 
loading /home/mpib/LNDG/stateswitch/stsw_fmri_task/spectrum/data/standards/data/mni_icbm152_nlin_sym_09c/mni_icbm152_gm_tal_nlin_sym_09c_MNI_3mm.nii
...done
 
Processing subject 2129.
loading /home/mpib/LNDG/stateswitch/stsw_fmri_task/spectrum/../extended_preproc/data/data_clean/2129_run-1_regressed.nii
...done
 
Block 1 finished: 38.4717
Block 2 finished: 37.135
Block 3 finished: 37.1684
Block 4 finished: 37.1641
Block 5 finished: 37.4216
Block 6 finished: 37.304
Block 7 finished: 37.7489
Block 8 finished: 37.5535
loading /home/mpib/LNDG/stateswitch/stsw_fmri_task/spectrum/../extended_preproc/data/data_clean/2129_run-2_regressed.nii
...done
 
Block 1 finished: 37.843
Block 2 finished: 37.5961
Block 3 finished: 37.7942
Block 4 finished: 37.6776
Block 5 finished: 37.7819
Block 6 finished: 37.6288
Block 7 finished: 37.8133
Block 8 finished: 38.008
loading /home/mpib/LNDG/stateswitch/stsw_fmri_task/spectrum/../extended_preproc/data/data_clean/2129_run-3_regressed.nii
...done
 
Block 1 finished: 38.0576
Block 2 finished: 37.813
Block 3 finished: 37.8528
Block 4 finished: 37.853
Block 5 finished: 38.2458
Block 6 finished: 38.0898
Block 7 finished: 38.1291
Block 8 finished: 38.783
loading /home/mpib/LNDG/stateswitch/stsw_fmri_task/spectrum/../extended_preproc/data/data_clean/2129_run-4_regressed.nii
...done
 
Block 1 finished: 38.7047
Block 2 finished: 38.2319
Block 3 finished: 38.2845
Block 4 finished: 38.3248
Block 5 finished: 38.3379
Block 6 finished: 38.3788
Block 7 finished: 38.4496
Block 8 finished: 39.2817
