
                            < M A T L A B (R) >
                  Copyright 1984-2020 The MathWorks, Inc.
                  R2020a (9.8.0.1323502) 64-bit (glnxa64)
                             February 25, 2020

 
To get started, type doc.
For product information, visit www.mathworks.com.
 
loading /home/mpib/LNDG/stateswitch/stsw_fmri_task/spectrum/../pls_vartbx/data/pls/taskPLS_STSWD_VarTbx_YA_OA_3mm_1000P1000B_BfMRIbsr_lv1.img
...done
 
Processing subject 1252.
loading /home/mpib/LNDG/stateswitch/stsw_fmri_task/spectrum/../extended_preproc/data/data_clean/1252_run-1_regressed.nii
...done
 
Block 1 finished: 20.2518
Block 2 finished: 17.9519
Block 3 finished: 18.6594
Block 4 finished: 18.7621
Block 5 finished: 19.6955
Block 6 finished: 20.1651
Block 7 finished: 20.7117
Block 8 finished: 20.37
loading /home/mpib/LNDG/stateswitch/stsw_fmri_task/spectrum/../extended_preproc/data/data_clean/1252_run-2_regressed.nii
...done
 
Block 1 finished: 22.3427
Block 2 finished: 22.0778
Block 3 finished: 22.572
Block 4 finished: 21.5299
Block 5 finished: 23.4754
Block 6 finished: 23.9238
Block 7 finished: 24.3789
Block 8 finished: 22.7638
loading /home/mpib/LNDG/stateswitch/stsw_fmri_task/spectrum/../extended_preproc/data/data_clean/1252_run-3_regressed.nii
...done
 
Block 1 finished: 26.215
Block 2 finished: 25.7047
Block 3 finished: 26.2818
Block 4 finished: 24.152
Block 5 finished: 26.9971
Block 6 finished: 27.3917
Block 7 finished: 27.8523
Block 8 finished: 25.1792
loading /home/mpib/LNDG/stateswitch/stsw_fmri_task/spectrum/../extended_preproc/data/data_clean/1252_run-4_regressed.nii
...done
 
Block 1 finished: 29.5405
Block 2 finished: 29.1767
Block 3 finished: 26.3037
Block 4 finished: 30.3525
Block 5 finished: 32.6255
Block 6 finished: 34.0062
Block 7 finished: 27.9312
Block 8 finished: 41.2462
[Warning: Variable 'fftpower_merged' was not saved. For variables larger than
2GB use MAT-file version 7.3 or later.] 
[> In L1_calcPowerPLS (line 105)] 
