{"freq_range": [0.03502096525352339, 0.4499720778790546], "freq_res": 0.00018930251488390865, "aperiodic_params_": [0.7288133413065093, 0.6202629330542031], "gaussian_params_": [[0.10350604612420736, 0.22256253047483557, 0.007737992185340968]], "peak_params_": [[0.10350604612420736, 0.22255918468699298, 0.015475984370681936]], "r_squared_": 0.9758447745939429, "error_": 0.023617509928292528}
{"freq_range": [0.03502096525352339, 0.4499720778790546], "freq_res": 0.00018930251488390865, "aperiodic_params_": [0.7437564285876266, 0.5878695259117679], "gaussian_params_": [[0.10590837623699671, 0.35142554278265375, 0.0069360734168352435]], "peak_params_": [[0.10590837623699671, 0.35139708580735074, 0.013872146833670487]], "r_squared_": 0.9750397691834324, "error_": 0.024569476206660498}
{"freq_range": [0.03502096525352339, 0.4499720778790546], "freq_res": 0.00018930251488390865, "aperiodic_params_": [0.7618505032766971, 0.5666215616523343], "gaussian_params_": [[0.10560639304723819, 0.35616758164791934, 0.0068880817421833355]], "peak_params_": [[0.10560639304723819, 0.35616534513617903, 0.013776163484366671]], "r_squared_": 0.9593300378438211, "error_": 0.028825276730406843}
{"freq_range": [0.03502096525352339, 0.4499720778790546], "freq_res": 0.00018930251488390865, "aperiodic_params_": [0.7917486324134481, 0.5493274931551216], "gaussian_params_": [[0.1045916271990636, 0.32919505944493144, 0.0062583340794888954]], "peak_params_": [[0.1045916271990636, 0.32915897668718364, 0.012516668158977791]], "r_squared_": 0.9551730833036446, "error_": 0.030096623841739664}
