L3_runFOOOF.py
/home/mpib/LNDG/stateswitch/stsw_fmri_task/spectrum
1245
Setting up paths ...

Loading backgrounds from .mat ...

Running FOOOFGroup across 4 power spectra.
==================================================================================================
                                                                                                  
                                       FOOOF - GROUP RESULTS                                      
                                                                                                  
                             Number of power spectra in the Group: 4                              
                                                                                                  
                        The model was run on the frequency range 0 - 1 Hz                         
                                 Frequency Resolution is 0.00 Hz                                  
                                                                                                  
                              Power spectra were fit without a knee.                              
                                                                                                  
                                      Aperiodic Fit Values:                                       
                        Exponents - Min:  1.417, Max:  1.481, Mean: 1.449                         
                                                                                                  
                          In total 4 peaks were extracted from the group                          
                                                                                                  
                                     Goodness of fit metrics:                                     
                            R2s -  Min:  0.941, Max:  0.978, Mean: 0.961                          
                         Errors -  Min:  0.055, Max:  0.102, Mean: 0.079                          
                                                                                                  
==================================================================================================
1245Done!
