
                            < M A T L A B (R) >
                  Copyright 1984-2020 The MathWorks, Inc.
                  R2020a (9.8.0.1323502) 64-bit (glnxa64)
                             February 25, 2020

 
To get started, type doc.
For product information, visit www.mathworks.com.
 
loading /home/mpib/LNDG/stateswitch/stsw_fmri_task/spectrum/data/standards/data/mni_icbm152_nlin_sym_09c/mni_icbm152_gm_tal_nlin_sym_09c_MNI_3mm.nii
...done
 
Processing subject 2226.
loading /home/mpib/LNDG/stateswitch/stsw_fmri_task/spectrum/../extended_preproc/data/data_clean/2226_run-1_regressed.nii
...done
 
Block 1 finished: 40.7997
Block 2 finished: 37.3497
Block 3 finished: 37.3395
Block 4 finished: 37.3899
Block 5 finished: 37.702
Block 6 finished: 37.6038
Block 7 finished: 37.7395
Block 8 finished: 37.1322
loading /home/mpib/LNDG/stateswitch/stsw_fmri_task/spectrum/../extended_preproc/data/data_clean/2226_run-2_regressed.nii
...done
 
Block 1 finished: 34.1746
Block 2 finished: 33.7406
Block 3 finished: 33.9541
Block 4 finished: 33.8349
Block 5 finished: 34.0693
Block 6 finished: 33.9608
Block 7 finished: 33.9714
Block 8 finished: 33.9756
loading /home/mpib/LNDG/stateswitch/stsw_fmri_task/spectrum/../extended_preproc/data/data_clean/2226_run-3_regressed.nii
...done
 
Block 1 finished: 33.9994
Block 2 finished: 34.0562
Block 3 finished: 34.1054
Block 4 finished: 34.16
Block 5 finished: 34.5044
Block 6 finished: 34.2382
Block 7 finished: 34.2563
Block 8 finished: 34.282
loading /home/mpib/LNDG/stateswitch/stsw_fmri_task/spectrum/../extended_preproc/data/data_clean/2226_run-4_regressed.nii
...done
 
Block 1 finished: 34.2683
Block 2 finished: 34.3102
Block 3 finished: 34.3751
Block 4 finished: 34.4176
Block 5 finished: 34.4496
Block 6 finished: 34.4839
Block 7 finished: 34.5466
Block 8 finished: 35.0803
