
                            < M A T L A B (R) >
                  Copyright 1984-2020 The MathWorks, Inc.
                  R2020a (9.8.0.1323502) 64-bit (glnxa64)
                             February 25, 2020

 
To get started, type doc.
For product information, visit www.mathworks.com.
 
loading /home/mpib/LNDG/stateswitch/stsw_fmri_task/spectrum/data/standards/data/mni_icbm152_nlin_sym_09c/mni_icbm152_gm_tal_nlin_sym_09c_MNI_3mm.nii
...done
 
Processing subject 1173.
loading /home/mpib/LNDG/stateswitch/stsw_fmri_task/spectrum/../extended_preproc/data/data_clean/1173_run-1_regressed.nii
...done
 
Block 1 finished: 40.5406
Block 2 finished: 37.1234
Block 3 finished: 37.1815
Block 4 finished: 37.1981
Block 5 finished: 37.4588
Block 6 finished: 37.3934
Block 7 finished: 37.489
Block 8 finished: 37.7042
loading /home/mpib/LNDG/stateswitch/stsw_fmri_task/spectrum/../extended_preproc/data/data_clean/1173_run-2_regressed.nii
...done
 
Block 1 finished: 37.6339
Block 2 finished: 37.5998
Block 3 finished: 37.8
Block 4 finished: 37.6837
Block 5 finished: 37.8107
Block 6 finished: 37.7308
Block 7 finished: 37.7693
Block 8 finished: 37.9458
loading /home/mpib/LNDG/stateswitch/stsw_fmri_task/spectrum/../extended_preproc/data/data_clean/1173_run-3_regressed.nii
...done
 
Block 1 finished: 37.773
Block 2 finished: 37.8164
Block 3 finished: 37.8533
Block 4 finished: 37.8676
Block 5 finished: 38.3322
Block 6 finished: 38.0873
Block 7 finished: 38.1861
Block 8 finished: 38.492
loading /home/mpib/LNDG/stateswitch/stsw_fmri_task/spectrum/../extended_preproc/data/data_clean/1173_run-4_regressed.nii
...done
 
Block 1 finished: 38.2013
Block 2 finished: 38.2191
Block 3 finished: 38.3059
Block 4 finished: 38.3218
Block 5 finished: 38.3753
Block 6 finished: 38.3924
Block 7 finished: 38.4606
Block 8 finished: 39.096
