
                            < M A T L A B (R) >
                  Copyright 1984-2020 The MathWorks, Inc.
                  R2020a (9.8.0.1323502) 64-bit (glnxa64)
                             February 25, 2020

 
To get started, type doc.
For product information, visit www.mathworks.com.
 
loading /home/mpib/LNDG/stateswitch/stsw_fmri_task/spectrum/data/standards/data/mni_icbm152_nlin_sym_09c/mni_icbm152_gm_tal_nlin_sym_09c_MNI_3mm.nii
...done
 
Processing subject 1239.
loading /home/mpib/LNDG/stateswitch/stsw_fmri_task/spectrum/../extended_preproc/data/data_clean/1239_run-1_regressed.nii
...done
 
Block 1 finished: 38.4797
Block 2 finished: 37.3613
Block 3 finished: 37.4247
Block 4 finished: 37.4672
Block 5 finished: 37.6623
Block 6 finished: 37.5692
Block 7 finished: 37.6835
Block 8 finished: 38.1292
loading /home/mpib/LNDG/stateswitch/stsw_fmri_task/spectrum/../extended_preproc/data/data_clean/1239_run-2_regressed.nii
...done
 
Block 1 finished: 38.1161
Block 2 finished: 37.7658
Block 3 finished: 38.014
Block 4 finished: 37.8048
Block 5 finished: 37.8246
Block 6 finished: 37.722
Block 7 finished: 37.7811
Block 8 finished: 38.2726
loading /home/mpib/LNDG/stateswitch/stsw_fmri_task/spectrum/../extended_preproc/data/data_clean/1239_run-3_regressed.nii
...done
 
Block 1 finished: 38.0785
Block 2 finished: 37.9275
Block 3 finished: 37.9915
Block 4 finished: 38.022
Block 5 finished: 38.3644
Block 6 finished: 38.1751
Block 7 finished: 38.243
Block 8 finished: 38.551
loading /home/mpib/LNDG/stateswitch/stsw_fmri_task/spectrum/../extended_preproc/data/data_clean/1239_run-4_regressed.nii
...done
 
Block 1 finished: 38.4471
Block 2 finished: 38.3367
Block 3 finished: 38.3809
Block 4 finished: 38.4095
Block 5 finished: 38.4965
Block 6 finished: 38.4613
Block 7 finished: 38.5043
Block 8 finished: 39.2697
