
                            < M A T L A B (R) >
                  Copyright 1984-2020 The MathWorks, Inc.
                  R2020a (9.8.0.1323502) 64-bit (glnxa64)
                             February 25, 2020

 
To get started, type doc.
For product information, visit www.mathworks.com.
 
loading /home/mpib/LNDG/stateswitch/stsw_fmri_task/spectrum/data/standards/data/mni_icbm152_nlin_sym_09c/mni_icbm152_gm_tal_nlin_sym_09c_MNI_3mm.nii
...done
 
Processing subject 2250.
loading /home/mpib/LNDG/stateswitch/stsw_fmri_task/spectrum/../extended_preproc/data/data_clean/2250_run-1_regressed.nii
...done
 
Block 1 finished: 40.4977
Block 2 finished: 38.1125
Block 3 finished: 38.1992
Block 4 finished: 38.0788
Block 5 finished: 38.4708
Block 6 finished: 38.2634
Block 7 finished: 38.4297
Block 8 finished: 38.8871
loading /home/mpib/LNDG/stateswitch/stsw_fmri_task/spectrum/../extended_preproc/data/data_clean/2250_run-2_regressed.nii
...done
 
Block 1 finished: 38.5086
Block 2 finished: 38.5435
Block 3 finished: 38.7982
Block 4 finished: 38.6847
Block 5 finished: 38.7062
Block 6 finished: 38.7572
Block 7 finished: 39.1603
Block 8 finished: 38.7866
loading /home/mpib/LNDG/stateswitch/stsw_fmri_task/spectrum/../extended_preproc/data/data_clean/2250_run-3_regressed.nii
...done
 
Block 1 finished: 38.7258
Block 2 finished: 38.7864
Block 3 finished: 38.8299
Block 4 finished: 38.8199
Block 5 finished: 39.0605
Block 6 finished: 39.0638
Block 7 finished: 39.6326
Block 8 finished: 39.3068
loading /home/mpib/LNDG/stateswitch/stsw_fmri_task/spectrum/../extended_preproc/data/data_clean/2250_run-4_regressed.nii
...done
 
Block 1 finished: 39.1156
Block 2 finished: 39.1453
Block 3 finished: 39.2378
Block 4 finished: 39.2535
Block 5 finished: 39.3216
Block 6 finished: 39.3227
Block 7 finished: 38.5405
Block 8 finished: 36.9179
