
                            < M A T L A B (R) >
                  Copyright 1984-2020 The MathWorks, Inc.
                  R2020a (9.8.0.1323502) 64-bit (glnxa64)
                             February 25, 2020

 
To get started, type doc.
For product information, visit www.mathworks.com.
 
loading /home/mpib/LNDG/stateswitch/stsw_fmri_task/spectrum/data/standards/data/mni_icbm152_nlin_sym_09c/mni_icbm152_gm_tal_nlin_sym_09c_MNI_3mm.nii
...done
 
Processing subject 2133.
loading /home/mpib/LNDG/stateswitch/stsw_fmri_task/spectrum/../extended_preproc/data/data_clean/2133_run-1_regressed.nii
...done
 
Block 1 finished: 38.5309
Block 2 finished: 37.4279
Block 3 finished: 37.5038
Block 4 finished: 37.5095
Block 5 finished: 37.7843
Block 6 finished: 37.7296
Block 7 finished: 37.7833
Block 8 finished: 37.9125
loading /home/mpib/LNDG/stateswitch/stsw_fmri_task/spectrum/../extended_preproc/data/data_clean/2133_run-2_regressed.nii
...done
 
Block 1 finished: 38.7143
Block 2 finished: 37.8799
Block 3 finished: 38.1276
Block 4 finished: 38.0127
Block 5 finished: 38.0706
Block 6 finished: 37.8709
Block 7 finished: 37.9344
Block 8 finished: 37.8633
loading /home/mpib/LNDG/stateswitch/stsw_fmri_task/spectrum/../extended_preproc/data/data_clean/2133_run-3_regressed.nii
...done
 
Block 1 finished: 38.7191
Block 2 finished: 38.0023
Block 3 finished: 37.9995
Block 4 finished: 38.0588
Block 5 finished: 38.4952
Block 6 finished: 38.295
Block 7 finished: 38.3529
Block 8 finished: 38.3626
loading /home/mpib/LNDG/stateswitch/stsw_fmri_task/spectrum/../extended_preproc/data/data_clean/2133_run-4_regressed.nii
...done
 
Block 1 finished: 39.036
Block 2 finished: 38.632
Block 3 finished: 38.4502
Block 4 finished: 38.4808
Block 5 finished: 38.5598
Block 6 finished: 38.5423
Block 7 finished: 38.6153
Block 8 finished: 39.1894
