L3_runFOOOF.py
/home/mpib/LNDG/stateswitch/stsw_fmri_task/spectrum
1270
Setting up paths ...

Loading backgrounds from .mat ...

Running FOOOFGroup across 4 power spectra.
==================================================================================================
                                                                                                  
                                       FOOOF - GROUP RESULTS                                      
                                                                                                  
                             Number of power spectra in the Group: 4                              
                                                                                                  
                        The model was run on the frequency range 0 - 1 Hz                         
                                 Frequency Resolution is 0.00 Hz                                  
                                                                                                  
                              Power spectra were fit without a knee.                              
                                                                                                  
                                      Aperiodic Fit Values:                                       
                        Exponents - Min:  1.022, Max:  1.087, Mean: 1.051                         
                                                                                                  
                          In total 4 peaks were extracted from the group                          
                                                                                                  
                                     Goodness of fit metrics:                                     
                            R2s -  Min:  0.936, Max:  0.961, Mean: 0.947                          
                         Errors -  Min:  0.055, Max:  0.077, Mean: 0.068                          
                                                                                                  
==================================================================================================
1270Done!
