
                            < M A T L A B (R) >
                  Copyright 1984-2020 The MathWorks, Inc.
                  R2020a (9.8.0.1323502) 64-bit (glnxa64)
                             February 25, 2020

 
To get started, type doc.
For product information, visit www.mathworks.com.
 
loading /home/mpib/LNDG/stateswitch/stsw_fmri_task/spectrum/../pls_vartbx/data/pls/taskPLS_STSWD_VarTbx_YA_OA_3mm_1000P1000B_BfMRIbsr_lv1.img
...done
 
Processing subject 2160.
loading /home/mpib/LNDG/stateswitch/stsw_fmri_task/spectrum/../extended_preproc/data/data_clean/2160_run-1_regressed.nii
...done
 
Block 1 finished: 21.2249
Block 2 finished: 18.6469
Block 3 finished: 19.3397
Block 4 finished: 19.3812
Block 5 finished: 20.3801
Block 6 finished: 20.3814
Block 7 finished: 20.889
Block 8 finished: 20.4864
loading /home/mpib/LNDG/stateswitch/stsw_fmri_task/spectrum/../extended_preproc/data/data_clean/2160_run-2_regressed.nii
...done
 
Block 1 finished: 22.0058
Block 2 finished: 22.5215
Block 3 finished: 22.995
Block 4 finished: 22.0687
Block 5 finished: 24.0552
Block 6 finished: 24.5337
Block 7 finished: 25.0156
Block 8 finished: 23.7396
loading /home/mpib/LNDG/stateswitch/stsw_fmri_task/spectrum/../extended_preproc/data/data_clean/2160_run-3_regressed.nii
...done
 
Block 1 finished: 26.1116
Block 2 finished: 26.8591
Block 3 finished: 27.4748
Block 4 finished: 25.0158
Block 5 finished: 28.6341
Block 6 finished: 30.0083
Block 7 finished: 30.8529
Block 8 finished: 28.2548
loading /home/mpib/LNDG/stateswitch/stsw_fmri_task/spectrum/../extended_preproc/data/data_clean/2160_run-4_regressed.nii
...done
 
Block 1 finished: 31.3327
Block 2 finished: 35.1146
Block 3 finished: 30.4448
Block 4 finished: 34.0255
Block 5 finished: 38.2676
Block 6 finished: 35.9476
Block 7 finished: 33.1807
Block 8 finished: 40.7499
[Warning: Variable 'fftpower_merged' was not saved. For variables larger than
2GB use MAT-file version 7.3 or later.] 
[> In L1_calcPowerPLS (line 105)] 
