L3_runFOOOF.py
/home/mpib/LNDG/stateswitch/stsw_fmri_task/spectrum
1265
Setting up paths ...

Loading backgrounds from .mat ...

Running FOOOFGroup across 4 power spectra.
==================================================================================================
                                                                                                  
                                       FOOOF - GROUP RESULTS                                      
                                                                                                  
                             Number of power spectra in the Group: 4                              
                                                                                                  
                        The model was run on the frequency range 0 - 1 Hz                         
                                 Frequency Resolution is 0.00 Hz                                  
                                                                                                  
                              Power spectra were fit without a knee.                              
                                                                                                  
                                      Aperiodic Fit Values:                                       
                        Exponents - Min:  1.189, Max:  1.226, Mean: 1.205                         
                                                                                                  
                          In total 4 peaks were extracted from the group                          
                                                                                                  
                                     Goodness of fit metrics:                                     
                            R2s -  Min:  0.949, Max:  0.964, Mean: 0.956                          
                         Errors -  Min:  0.062, Max:  0.073, Mean: 0.068                          
                                                                                                  
==================================================================================================
1265Done!
