{"freq_range": [0.03502096525352339, 0.4499720778790546], "freq_res": 0.00018930251488390865, "aperiodic_params_": [0.1185000558585122, 1.288723459423421], "gaussian_params_": [], "peak_params_": [], "r_squared_": 0.8844422475605631, "error_": 0.10179639190030276}
{"freq_range": [0.03502096525352339, 0.4499720778790546], "freq_res": 0.00018930251488390865, "aperiodic_params_": [0.168957048982611, 1.1684226023685145], "gaussian_params_": [[0.1048144596879293, 0.47540261091216734, 0.0124999999999897]], "peak_params_": [[0.1048144596879293, 0.47539729133480635, 0.0249999999999794]], "r_squared_": 0.9391130002310218, "error_": 0.08386807610128198}
{"freq_range": [0.03502096525352339, 0.4499720778790546], "freq_res": 0.00018930251488390865, "aperiodic_params_": [0.1811343868571115, 1.146235166249484], "gaussian_params_": [[0.1050991500375532, 0.48907043244705456, 0.011572972100975363]], "peak_params_": [[0.1050991500375532, 0.4890680326803081, 0.023145944201950725]], "r_squared_": 0.9449247155266615, "error_": 0.07355011292237092}
{"freq_range": [0.03502096525352339, 0.4499720778790546], "freq_res": 0.00018930251488390865, "aperiodic_params_": [0.20320505838401215, 1.1124040621495412], "gaussian_params_": [[0.10292829725997878, 0.5308232670041834, 0.011321420244522973]], "peak_params_": [[0.10292829725997878, 0.530817609371808, 0.022642840489045947]], "r_squared_": 0.9502525373988986, "error_": 0.06712818174613906}
