%!PS-Adobe-3.0 EPSF-3.0
%%Creator: (MATLAB, The Mathworks, Inc. Version 9.8.0.1323502 \(R2020a\). Operating System: Mac OS X)
%%Title: /Users/kosciessa/Desktop/tardis/LNDG/stateswitch/stsw_fmri_task/spectrum/figures/l2_periodic_spectrum.eps
%%CreationDate: 2022-11-01T12:41:51
%%Pages: (atend)
%%BoundingBox:     4     0   349   273
%%LanguageLevel: 3
%%EndComments
%%BeginProlog
%%BeginResource: procset (Apache XML Graphics Std ProcSet) 1.2 0
%%Version: 1.2 0
%%Copyright: (Copyright 2001-2003,2010 The Apache Software Foundation. License terms: http://www.apache.org/licenses/LICENSE-2.0)
/bd{bind def}bind def
/ld{load def}bd
/GR/grestore ld
/GS/gsave ld
/RM/rmoveto ld
/C/curveto ld
/t/show ld
/L/lineto ld
/ML/setmiterlimit ld
/CT/concat ld
/f/fill ld
/N/newpath ld
/S/stroke ld
/CC/setcmykcolor ld
/A/ashow ld
/cp/closepath ld
/RC/setrgbcolor ld
/LJ/setlinejoin ld
/GC/setgray ld
/LW/setlinewidth ld
/M/moveto ld
/re {4 2 roll M
1 index 0 rlineto
0 exch rlineto
neg 0 rlineto
cp } bd
/_ctm matrix def
/_tm matrix def
/BT { _ctm currentmatrix pop matrix _tm copy pop 0 0 moveto } bd
/ET { _ctm setmatrix } bd
/iTm { _ctm setmatrix _tm concat } bd
/Tm { _tm astore pop iTm 0 0 moveto } bd
/ux 0.0 def
/uy 0.0 def
/F {
  /Tp exch def
  /Tf exch def
  Tf findfont Tp scalefont setfont
  /cf Tf def  /cs Tp def
} bd
/ULS {currentpoint /uy exch def /ux exch def} bd
/ULE {
  /Tcx currentpoint pop def
  gsave
  newpath
  cf findfont cs scalefont dup
  /FontMatrix get 0 get /Ts exch def /FontInfo get dup
  /UnderlinePosition get Ts mul /To exch def
  /UnderlineThickness get Ts mul /Tt exch def
  ux uy To add moveto  Tcx uy To add lineto
  Tt setlinewidth stroke
  grestore
} bd
/OLE {
  /Tcx currentpoint pop def
  gsave
  newpath
  cf findfont cs scalefont dup
  /FontMatrix get 0 get /Ts exch def /FontInfo get dup
  /UnderlinePosition get Ts mul /To exch def
  /UnderlineThickness get Ts mul /Tt exch def
  ux uy To add cs add moveto Tcx uy To add cs add lineto
  Tt setlinewidth stroke
  grestore
} bd
/SOE {
  /Tcx currentpoint pop def
  gsave
  newpath
  cf findfont cs scalefont dup
  /FontMatrix get 0 get /Ts exch def /FontInfo get dup
  /UnderlinePosition get Ts mul /To exch def
  /UnderlineThickness get Ts mul /Tt exch def
  ux uy To add cs 10 mul 26 idiv add moveto Tcx uy To add cs 10 mul 26 idiv add lineto
  Tt setlinewidth stroke
  grestore
} bd
/QT {
/Y22 exch store
/X22 exch store
/Y21 exch store
/X21 exch store
currentpoint
/Y21 load 2 mul add 3 div exch
/X21 load 2 mul add 3 div exch
/X21 load 2 mul /X22 load add 3 div
/Y21 load 2 mul /Y22 load add 3 div
/X22 load /Y22 load curveto
} bd
/SSPD {
dup length /d exch dict def
{
/v exch def
/k exch def
currentpagedevice k known {
/cpdv currentpagedevice k get def
v cpdv ne {
/upd false def
/nullv v type /nulltype eq def
/nullcpdv cpdv type /nulltype eq def
nullv nullcpdv or
{
/upd true def
} {
/sametype v type cpdv type eq def
sametype {
v type /arraytype eq {
/vlen v length def
/cpdvlen cpdv length def
vlen cpdvlen eq {
0 1 vlen 1 sub {
/i exch def
/obj v i get def
/cpdobj cpdv i get def
obj cpdobj ne {
/upd true def
exit
} if
} for
} {
/upd true def
} ifelse
} {
v type /dicttype eq {
v {
/dv exch def
/dk exch def
/cpddv cpdv dk get def
dv cpddv ne {
/upd true def
exit
} if
} forall
} {
/upd true def
} ifelse
} ifelse
} if
} ifelse
upd true eq {
d k v put
} if
} if
} if
} forall
d length 0 gt {
d setpagedevice
} if
} bd
/RE { % /NewFontName [NewEncodingArray] /FontName RE -
  findfont dup length dict begin
  {
    1 index /FID ne
    {def} {pop pop} ifelse
  } forall
  /Encoding exch def
  /FontName 1 index def
  currentdict definefont pop
  end
} bind def
%%EndResource
%%BeginResource: procset (Apache XML Graphics EPS ProcSet) 1.0 0
%%Version: 1.0 0
%%Copyright: (Copyright 2002-2003 The Apache Software Foundation. License terms: http://www.apache.org/licenses/LICENSE-2.0)
/BeginEPSF { %def
/b4_Inc_state save def         % Save state for cleanup
/dict_count countdictstack def % Count objects on dict stack
/op_count count 1 sub def      % Count objects on operand stack
userdict begin                 % Push userdict on dict stack
/showpage { } def              % Redefine showpage, { } = null proc
0 setgray 0 setlinecap         % Prepare graphics state
1 setlinewidth 0 setlinejoin
10 setmiterlimit [ ] 0 setdash newpath
/languagelevel where           % If level not equal to 1 then
{pop languagelevel             % set strokeadjust and
1 ne                           % overprint to their defaults.
{false setstrokeadjust false setoverprint
} if
} if
} bd
/EndEPSF { %def
count op_count sub {pop} repeat            % Clean up stacks
countdictstack dict_count sub {end} repeat
b4_Inc_state restore
} bd
%%EndResource
%FOPBeginFontDict
%%IncludeResource: font Courier-Oblique
%%IncludeResource: font Courier-BoldOblique
%%IncludeResource: font Courier-Bold
%%IncludeResource: font ZapfDingbats
%%IncludeResource: font Symbol
%%IncludeResource: font Helvetica
%%IncludeResource: font Helvetica-Oblique
%%IncludeResource: font Helvetica-Bold
%%IncludeResource: font Helvetica-BoldOblique
%%IncludeResource: font Times-Roman
%%IncludeResource: font Times-Italic
%%IncludeResource: font Times-Bold
%%IncludeResource: font Times-BoldItalic
%%IncludeResource: font Courier
%FOPEndFontDict
%%BeginResource: encoding WinAnsiEncoding
/WinAnsiEncoding [
/.notdef /.notdef /.notdef /.notdef /.notdef
/.notdef /.notdef /.notdef /.notdef /.notdef
/.notdef /.notdef /.notdef /.notdef /.notdef
/.notdef /.notdef /.notdef /.notdef /.notdef
/.notdef /.notdef /.notdef /.notdef /.notdef
/.notdef /.notdef /.notdef /.notdef /.notdef
/.notdef /.notdef /space /exclam /quotedbl
/numbersign /dollar /percent /ampersand /quotesingle
/parenleft /parenright /asterisk /plus /comma
/hyphen /period /slash /zero /one
/two /three /four /five /six
/seven /eight /nine /colon /semicolon
/less /equal /greater /question /at
/A /B /C /D /E
/F /G /H /I /J
/K /L /M /N /O
/P /Q /R /S /T
/U /V /W /X /Y
/Z /bracketleft /backslash /bracketright /asciicircum
/underscore /quoteleft /a /b /c
/d /e /f /g /h
/i /j /k /l /m
/n /o /p /q /r
/s /t /u /v /w
/x /y /z /braceleft /bar
/braceright /asciitilde /bullet /Euro /bullet
/quotesinglbase /florin /quotedblbase /ellipsis /dagger
/daggerdbl /circumflex /perthousand /Scaron /guilsinglleft
/OE /bullet /Zcaron /bullet /bullet
/quoteleft /quoteright /quotedblleft /quotedblright /bullet
/endash /emdash /asciitilde /trademark /scaron
/guilsinglright /oe /bullet /zcaron /Ydieresis
/space /exclamdown /cent /sterling /currency
/yen /brokenbar /section /dieresis /copyright
/ordfeminine /guillemotleft /logicalnot /sfthyphen /registered
/macron /degree /plusminus /twosuperior /threesuperior
/acute /mu /paragraph /middot /cedilla
/onesuperior /ordmasculine /guillemotright /onequarter /onehalf
/threequarters /questiondown /Agrave /Aacute /Acircumflex
/Atilde /Adieresis /Aring /AE /Ccedilla
/Egrave /Eacute /Ecircumflex /Edieresis /Igrave
/Iacute /Icircumflex /Idieresis /Eth /Ntilde
/Ograve /Oacute /Ocircumflex /Otilde /Odieresis
/multiply /Oslash /Ugrave /Uacute /Ucircumflex
/Udieresis /Yacute /Thorn /germandbls /agrave
/aacute /acircumflex /atilde /adieresis /aring
/ae /ccedilla /egrave /eacute /ecircumflex
/edieresis /igrave /iacute /icircumflex /idieresis
/eth /ntilde /ograve /oacute /ocircumflex
/otilde /odieresis /divide /oslash /ugrave
/uacute /ucircumflex /udieresis /yacute /thorn
/ydieresis
] def
%%EndResource
%FOPBeginFontReencode
/Courier-Oblique findfont
dup length dict begin
  {1 index /FID ne {def} {pop pop} ifelse} forall
  /Encoding WinAnsiEncoding def
  currentdict
end
/Courier-Oblique exch definefont pop
/Courier-BoldOblique findfont
dup length dict begin
  {1 index /FID ne {def} {pop pop} ifelse} forall
  /Encoding WinAnsiEncoding def
  currentdict
end
/Courier-BoldOblique exch definefont pop
/Courier-Bold findfont
dup length dict begin
  {1 index /FID ne {def} {pop pop} ifelse} forall
  /Encoding WinAnsiEncoding def
  currentdict
end
/Courier-Bold exch definefont pop
/Helvetica findfont
dup length dict begin
  {1 index /FID ne {def} {pop pop} ifelse} forall
  /Encoding WinAnsiEncoding def
  currentdict
end
/Helvetica exch definefont pop
/Helvetica-Oblique findfont
dup length dict begin
  {1 index /FID ne {def} {pop pop} ifelse} forall
  /Encoding WinAnsiEncoding def
  currentdict
end
/Helvetica-Oblique exch definefont pop
/Helvetica-Bold findfont
dup length dict begin
  {1 index /FID ne {def} {pop pop} ifelse} forall
  /Encoding WinAnsiEncoding def
  currentdict
end
/Helvetica-Bold exch definefont pop
/Helvetica-BoldOblique findfont
dup length dict begin
  {1 index /FID ne {def} {pop pop} ifelse} forall
  /Encoding WinAnsiEncoding def
  currentdict
end
/Helvetica-BoldOblique exch definefont pop
/Times-Roman findfont
dup length dict begin
  {1 index /FID ne {def} {pop pop} ifelse} forall
  /Encoding WinAnsiEncoding def
  currentdict
end
/Times-Roman exch definefont pop
/Times-Italic findfont
dup length dict begin
  {1 index /FID ne {def} {pop pop} ifelse} forall
  /Encoding WinAnsiEncoding def
  currentdict
end
/Times-Italic exch definefont pop
/Times-Bold findfont
dup length dict begin
  {1 index /FID ne {def} {pop pop} ifelse} forall
  /Encoding WinAnsiEncoding def
  currentdict
end
/Times-Bold exch definefont pop
/Times-BoldItalic findfont
dup length dict begin
  {1 index /FID ne {def} {pop pop} ifelse} forall
  /Encoding WinAnsiEncoding def
  currentdict
end
/Times-BoldItalic exch definefont pop
/Courier findfont
dup length dict begin
  {1 index /FID ne {def} {pop pop} ifelse} forall
  /Encoding WinAnsiEncoding def
  currentdict
end
/Courier exch definefont pop
%FOPEndFontReencode
%%EndProlog
%%Page: 1 1
%%PageBoundingBox: 0 0 384 288
%%BeginPageSetup
[1 0 0 -1 0 288] CT
%%EndPageSetup
GS
1 GC
N
0 0 384 288 re
f
GR
GS
1 GC
N
0 0 384 288 re
f
GR
GS
1 GC
N
50.5 238 M
347.5 238 L
347.5 21.5 L
50.5 21.5 L
cp
f
GR
GS
0.149 GC
2 setlinecap
1 LJ
0.5 LW
N
50.5 238 M
347.5 238 L
S
GR
GS
0.149 GC
2 setlinecap
1 LJ
0.5 LW
N
50.5 238 M
50.5 235.031 L
S
GR
GS
0.149 GC
2 setlinecap
1 LJ
0.5 LW
N
169.3 238 M
169.3 235.031 L
S
GR
GS
0.149 GC
2 setlinecap
1 LJ
0.5 LW
N
288.1 238 M
288.1 235.031 L
S
GR
GS
[1 0 0 1 50.49999 243.60001] CT
0.149 GC
/Helvetica 18 F
GS
[1 0 0 1 0 0] CT
-18 18 moveto 
1 -1 scale
(0.08) t 
GR
GR
GS
[1 0 0 1 169.3 243.60001] CT
0.149 GC
/Helvetica 18 F
GS
[1 0 0 1 0 0] CT
-13 18 moveto 
1 -1 scale
(0.1) t 
GR
GR
GS
[1 0 0 1 288.09998 243.60001] CT
0.149 GC
/Helvetica 18 F
GS
[1 0 0 1 0 0] CT
-18 18 moveto 
1 -1 scale
(0.12) t 
GR
GR
GS
[1 0 0 1 199.00011 266.5] CT
0.149 GC
/Helvetica 18 F
GS
[1 0 0 1 0 0] CT
-60.5 18 moveto 
1 -1 scale
(Frequency [Hz]) t 
GR
GR
GS
0.149 GC
2 setlinecap
1 LJ
0.5 LW
N
50.5 238 M
50.5 21.5 L
S
GR
GS
0.149 GC
2 setlinecap
1 LJ
0.5 LW
N
50.5 237.686 M
53.469 237.686 L
S
GR
GS
0.149 GC
2 setlinecap
1 LJ
0.5 LW
N
50.5 183.64 M
53.469 183.64 L
S
GR
GS
0.149 GC
2 setlinecap
1 LJ
0.5 LW
N
50.5 129.593 M
53.469 129.593 L
S
GR
GS
0.149 GC
2 setlinecap
1 LJ
0.5 LW
N
50.5 75.547 M
53.469 75.547 L
S
GR
GS
0.149 GC
2 setlinecap
1 LJ
0.5 LW
N
50.5 21.5 M
53.469 21.5 L
S
GR
GS
[1 0 0 1 44.9 237.68613] CT
0.149 GC
/Helvetica 18 F
GS
[1 0 0 1 0 0] CT
-11 7 moveto 
1 -1 scale
(0) t 
GR
GR
GS
[1 0 0 1 44.9 183.6396] CT
0.149 GC
/Helvetica 18 F
GS
[1 0 0 1 0 0] CT
-21 7 moveto 
1 -1 scale
(20) t 
GR
GR
GS
[1 0 0 1 44.9 129.59306] CT
0.149 GC
/Helvetica 18 F
GS
[1 0 0 1 0 0] CT
-21 7 moveto 
1 -1 scale
(40) t 
GR
GR
GS
[1 0 0 1 44.9 75.54653] CT
0.149 GC
/Helvetica 18 F
GS
[1 0 0 1 0 0] CT
-21 7 moveto 
1 -1 scale
(60) t 
GR
GR
GS
[1 0 0 1 44.9 21.5] CT
0.149 GC
/Helvetica 18 F
GS
[1 0 0 1 0 0] CT
-21 7 moveto 
1 -1 scale
(80) t 
GR
GR
GS
[0 -1 1 0 21.50002 129.74989] CT
0.149 GC
/Helvetica 18 F
GS
[1 0 0 1 0 0] CT
-61.5 -4 moveto 
1 -1 scale
(Spectral power) t 
GR
GR
GS
0.958 0.8 0.825 RC
N
127.408 202.303 M
128.533 201.215 L
129.657 200.072 L
130.782 198.875 L
131.906 197.621 L
133.031 196.312 L
134.155 194.945 L
135.28 193.521 L
136.404 192.039 L
137.528 190.5 L
138.653 188.903 L
139.777 187.249 L
140.902 185.537 L
142.026 183.768 L
143.151 181.944 L
144.275 180.064 L
145.4 178.13 L
146.524 176.144 L
147.649 174.108 L
148.773 172.022 L
149.897 169.891 L
151.022 167.715 L
152.146 165.499 L
153.271 163.244 L
154.395 160.955 L
155.52 158.636 L
156.644 156.289 L
157.769 153.92 L
158.893 151.533 L
160.018 149.131 L
161.142 146.721 L
162.267 144.307 L
163.391 141.894 L
164.515 139.487 L
165.64 137.092 L
166.764 134.713 L
167.889 132.356 L
169.013 130.026 L
170.138 127.729 L
171.262 125.47 L
172.387 123.252 L
173.511 121.083 L
174.636 118.965 L
175.76 116.904 L
176.884 114.904 L
178.009 112.968 L
179.133 111.102 L
180.258 109.309 L
181.382 107.591 L
182.507 105.953 L
183.631 104.397 L
184.756 102.926 L
185.88 101.543 L
187.005 100.25 L
188.129 99.05 L
189.253 97.945 L
190.378 96.936 L
191.502 96.025 L
192.627 95.215 L
193.751 94.507 L
194.876 93.903 L
196 93.404 L
197.125 93.012 L
198.249 92.728 L
199.374 92.554 L
200.498 92.491 L
201.623 92.54 L
202.747 92.704 L
203.871 92.982 L
204.996 93.377 L
206.12 93.888 L
207.245 94.518 L
208.369 95.266 L
209.494 96.133 L
210.618 97.12 L
211.743 98.225 L
212.867 99.45 L
213.992 100.793 L
215.116 102.252 L
216.24 103.828 L
217.365 105.517 L
218.489 107.318 L
219.614 109.228 L
220.738 111.244 L
221.863 113.362 L
222.987 115.578 L
224.112 117.887 L
225.236 120.285 L
226.361 122.766 L
227.485 125.324 L
228.609 127.954 L
229.734 130.648 L
230.858 133.4 L
231.983 136.203 L
233.107 139.05 L
234.232 141.933 L
235.356 144.845 L
236.481 147.779 L
237.605 150.726 L
238.73 153.679 L
239.854 156.632 L
240.979 159.576 L
242.103 162.505 L
243.227 165.412 L
244.352 168.29 L
245.476 171.134 L
246.601 173.937 L
247.725 176.695 L
248.85 179.401 L
249.974 182.051 L
251.099 184.642 L
252.223 187.169 L
253.348 189.629 L
254.472 192.019 L
255.596 194.337 L
256.721 196.58 L
257.845 198.747 L
258.97 200.837 L
260.094 202.848 L
261.219 204.781 L
262.343 206.635 L
263.468 208.411 L
264.592 210.109 L
265.717 211.73 L
266.841 213.274 L
267.965 214.744 L
269.09 216.14 L
270.214 217.465 L
271.339 218.721 L
272.463 219.908 L
273.588 221.03 L
274.712 222.088 L
275.837 223.085 L
276.961 224.022 L
278.086 224.902 L
279.21 225.727 L
280.334 226.5 L
281.459 227.222 L
282.583 227.896 L
283.708 228.523 L
284.832 229.106 L
285.957 229.647 L
287.081 230.148 L
288.206 230.61 L
289.33 231.035 L
290.455 231.426 L
291.579 231.784 L
292.704 232.111 L
293.828 232.408 L
294.952 232.677 L
296.077 232.921 L
297.201 233.14 L
298.326 233.336 L
299.45 233.511 L
300.575 233.667 L
301.699 233.805 L
302.824 233.927 L
303.948 234.034 L
305.073 234.128 L
306.197 234.211 L
307.321 234.284 L
308.446 234.348 L
309.57 234.405 L
310.695 234.457 L
311.819 234.505 L
312.944 234.55 L
314.068 234.594 L
315.193 234.637 L
316.317 234.681 L
317.442 234.727 L
318.566 234.775 L
319.69 234.827 L
320.815 234.884 L
321.939 234.946 L
323.064 235.014 L
324.188 235.088 L
325.313 235.169 L
326.437 235.257 L
327.562 235.352 L
328.686 235.454 L
329.811 235.564 L
330.935 235.681 L
332.06 235.805 L
333.184 235.936 L
334.308 236.073 L
335.433 236.217 L
336.557 236.366 L
337.682 236.521 L
338.806 236.681 L
339.931 236.844 L
341.055 237.011 L
342.18 237.181 L
343.304 237.352 L
344.429 237.526 L
345.553 237.699 L
346.677 237.873 L
347.535 238.005 L
347.535 237.88 L
347.535 237.849 L
347.535 237.715 L
347.535 237.642 L
347.535 237.55 L
347.535 237.433 L
347.535 237.382 L
347.535 237.219 L
347.535 237.209 L
347.535 237.167 L
346.677 237.027 L
345.553 236.843 L
344.429 236.658 L
343.304 236.473 L
342.18 236.289 L
341.055 236.107 L
339.931 235.927 L
338.806 235.75 L
337.682 235.577 L
336.557 235.409 L
335.433 235.246 L
334.308 235.089 L
333.184 234.938 L
332.06 234.794 L
330.935 234.657 L
329.811 234.528 L
328.686 234.406 L
327.562 234.293 L
326.437 234.187 L
325.313 234.09 L
324.188 234 L
323.064 233.917 L
321.939 233.842 L
320.815 233.772 L
319.69 233.709 L
318.566 233.651 L
317.442 233.598 L
316.317 233.547 L
315.193 233.499 L
314.068 233.453 L
312.944 233.406 L
311.819 233.359 L
310.695 233.308 L
309.57 233.255 L
308.446 233.195 L
307.321 233.129 L
306.197 233.055 L
305.073 232.971 L
303.948 232.875 L
302.824 232.767 L
301.699 232.643 L
300.575 232.503 L
299.45 232.345 L
298.326 232.168 L
297.201 231.968 L
296.077 231.745 L
294.952 231.497 L
293.828 231.222 L
292.704 230.918 L
291.579 230.584 L
290.455 230.217 L
289.33 229.815 L
288.206 229.378 L
287.081 228.901 L
285.957 228.385 L
284.832 227.826 L
283.708 227.223 L
282.583 226.574 L
281.459 225.876 L
280.334 225.128 L
279.21 224.326 L
278.086 223.47 L
276.961 222.558 L
275.837 221.585 L
274.712 220.552 L
273.588 219.455 L
272.463 218.293 L
271.339 217.063 L
270.214 215.764 L
269.09 214.392 L
267.965 212.948 L
266.841 211.427 L
265.717 209.831 L
264.592 208.155 L
263.468 206.4 L
262.343 204.564 L
261.219 202.647 L
260.094 200.647 L
258.97 198.564 L
257.845 196.4 L
256.721 194.153 L
255.596 191.826 L
254.472 189.418 L
253.348 186.933 L
252.223 184.371 L
251.099 181.737 L
249.974 179.033 L
248.85 176.263 L
247.725 173.431 L
246.601 170.541 L
245.476 167.6 L
244.352 164.613 L
243.227 161.585 L
242.103 158.525 L
240.979 155.437 L
239.854 152.331 L
238.73 149.213 L
237.605 146.091 L
236.481 142.974 L
235.356 139.869 L
234.232 136.784 L
233.107 133.728 L
231.983 130.709 L
230.858 127.736 L
229.734 124.815 L
228.609 121.954 L
227.485 119.162 L
226.361 116.444 L
225.236 113.808 L
224.112 111.26 L
222.987 108.806 L
221.863 106.451 L
220.738 104.2 L
219.614 102.058 L
218.489 100.028 L
217.365 98.114 L
216.24 96.319 L
215.116 94.644 L
213.992 93.093 L
212.867 91.666 L
211.743 90.364 L
210.618 89.189 L
209.494 88.14 L
208.369 87.218 L
207.245 86.422 L
206.12 85.751 L
204.996 85.205 L
203.871 84.783 L
202.747 84.483 L
201.623 84.305 L
200.498 84.247 L
199.374 84.307 L
198.249 84.485 L
197.125 84.778 L
196 85.185 L
194.876 85.704 L
193.751 86.334 L
192.627 87.073 L
191.502 87.92 L
190.378 88.872 L
189.253 89.928 L
188.129 91.085 L
187.005 92.342 L
185.88 93.696 L
184.756 95.145 L
183.631 96.687 L
182.507 98.318 L
181.382 100.036 L
180.258 101.837 L
179.133 103.718 L
178.009 105.676 L
176.884 107.707 L
175.76 109.806 L
174.636 111.969 L
173.511 114.192 L
172.387 116.469 L
171.262 118.796 L
170.138 121.168 L
169.013 123.579 L
167.889 126.024 L
166.764 128.498 L
165.64 130.995 L
164.515 133.509 L
163.391 136.035 L
162.267 138.567 L
161.142 141.101 L
160.018 143.63 L
158.893 146.15 L
157.769 148.655 L
156.644 151.142 L
155.52 153.605 L
154.395 156.04 L
153.271 158.443 L
152.146 160.81 L
151.022 163.139 L
149.897 165.425 L
148.773 167.666 L
147.649 169.859 L
146.524 172.002 L
145.4 174.094 L
144.275 176.131 L
143.151 178.112 L
142.026 180.037 L
140.902 181.905 L
139.777 183.713 L
138.653 185.462 L
137.528 187.152 L
136.404 188.781 L
135.28 190.351 L
134.155 191.859 L
133.031 193.308 L
131.906 194.696 L
130.782 196.025 L
129.657 197.294 L
128.533 198.504 L
127.408 199.656 L
126.284 200.75 L
125.159 201.786 L
124.035 202.766 L
122.911 203.689 L
121.786 204.558 L
120.662 205.372 L
119.537 206.133 L
118.413 206.842 L
117.288 207.499 L
116.164 208.106 L
115.039 208.663 L
113.915 209.173 L
112.79 209.636 L
111.666 210.053 L
110.542 210.425 L
109.417 210.755 L
108.293 211.043 L
107.168 211.291 L
106.044 211.5 L
104.919 211.672 L
103.795 211.809 L
102.67 211.911 L
101.546 211.981 L
100.421 212.021 L
99.297 212.032 L
98.172 212.017 L
97.048 211.976 L
95.924 211.913 L
94.799 211.828 L
93.675 211.724 L
92.55 211.604 L
91.426 211.468 L
90.301 211.319 L
89.177 211.159 L
88.052 210.99 L
86.928 210.814 L
85.803 210.632 L
84.679 210.447 L
83.555 210.26 L
82.43 210.072 L
81.306 209.885 L
80.181 209.701 L
79.057 209.52 L
77.932 209.344 L
76.808 209.174 L
75.683 209.01 L
74.559 208.853 L
73.434 208.705 L
72.31 208.564 L
71.186 208.432 L
70.061 208.309 L
68.937 208.195 L
67.812 208.089 L
66.688 207.992 L
65.563 207.903 L
64.439 207.823 L
63.314 207.75 L
62.19 207.685 L
61.065 207.627 L
59.941 207.575 L
58.816 207.529 L
57.692 207.49 L
56.568 207.455 L
55.443 207.425 L
54.319 207.4 L
53.194 207.379 L
52.07 207.362 L
50.945 207.348 L
50.465 207.343 L
50.465 207.347 L
50.465 207.348 L
50.465 207.348 L
50.465 207.361 L
50.465 207.363 L
50.465 207.378 L
50.465 207.38 L
50.465 207.397 L
50.465 207.401 L
50.465 207.404 L
50.465 207.424 L
50.465 207.428 L
50.465 207.45 L
50.465 207.455 L
50.465 207.46 L
50.465 207.486 L
50.465 207.491 L
50.465 207.497 L
50.465 207.526 L
50.465 207.532 L
50.465 207.537 L
50.465 207.57 L
50.465 207.576 L
50.465 207.581 L
50.465 207.618 L
50.465 207.624 L
50.465 207.629 L
50.465 207.634 L
50.465 207.676 L
50.465 207.681 L
50.465 207.686 L
50.465 207.689 L
50.465 207.693 L
50.465 207.74 L
50.465 207.744 L
50.465 207.747 L
50.465 207.749 L
50.465 207.751 L
50.465 207.752 L
50.465 207.753 L
50.465 207.753 L
50.465 207.808 L
50.465 207.828 L
50.465 207.896 L
50.465 207.916 L
50.465 207.99 L
50.465 208.07 L
50.465 208.091 L
50.465 208.176 L
50.465 208.198 L
50.465 208.289 L
50.465 208.311 L
50.465 208.332 L
50.465 208.43 L
50.465 208.451 L
50.465 208.554 L
50.465 208.575 L
50.465 208.682 L
50.465 208.702 L
50.465 208.723 L
50.465 208.834 L
50.465 208.854 L
50.465 208.873 L
50.465 208.987 L
50.465 209.006 L
50.465 209.024 L
50.465 209.041 L
50.465 209.158 L
50.465 209.175 L
50.465 209.191 L
50.465 209.207 L
50.465 209.326 L
50.465 209.341 L
50.465 209.357 L
50.465 209.372 L
50.465 209.49 L
50.465 209.505 L
50.465 209.52 L
50.465 209.534 L
50.465 209.549 L
50.465 209.666 L
50.465 209.68 L
50.465 209.695 L
50.465 209.709 L
50.465 209.724 L
50.465 209.738 L
50.465 209.851 L
50.465 209.865 L
50.465 209.879 L
50.465 209.893 L
50.465 209.928 L
50.465 209.93 L
50.945 209.931 L
52.07 209.938 L
53.194 209.95 L
54.319 209.967 L
55.443 209.991 L
56.568 210.02 L
57.692 210.057 L
58.816 210.1 L
59.941 210.151 L
61.065 210.209 L
62.19 210.275 L
63.314 210.349 L
64.439 210.431 L
65.563 210.521 L
66.688 210.619 L
67.812 210.726 L
68.937 210.84 L
70.061 210.962 L
71.186 211.092 L
72.31 211.229 L
73.434 211.373 L
74.559 211.523 L
75.683 211.679 L
76.808 211.84 L
77.932 212.005 L
79.057 212.174 L
80.181 212.345 L
81.306 212.518 L
82.43 212.691 L
83.555 212.863 L
84.679 213.033 L
85.803 213.2 L
86.928 213.362 L
88.052 213.517 L
89.177 213.664 L
90.301 213.801 L
91.426 213.927 L
92.55 214.039 L
93.675 214.137 L
94.799 214.218 L
95.924 214.281 L
97.048 214.323 L
98.172 214.344 L
99.297 214.34 L
100.421 214.312 L
101.546 214.255 L
102.67 214.17 L
103.795 214.055 L
104.919 213.907 L
106.044 213.726 L
107.168 213.509 L
108.293 213.256 L
109.417 212.965 L
110.542 212.636 L
111.666 212.266 L
112.79 211.854 L
113.915 211.4 L
115.039 210.903 L
116.164 210.361 L
117.288 209.774 L
118.413 209.14 L
119.537 208.46 L
120.662 207.731 L
121.786 206.953 L
122.911 206.126 L
124.035 205.248 L
125.159 204.319 L
126.284 203.337 L
cp
f
GR
GS
0.906 0.549 0.608 RC
1 LJ
0.5 LW
N
50.465 209.93 M
50.945 209.931 L
52.07 209.938 L
53.194 209.95 L
54.319 209.967 L
55.443 209.991 L
56.568 210.02 L
57.692 210.057 L
58.816 210.1 L
59.941 210.151 L
61.065 210.209 L
62.19 210.275 L
63.314 210.349 L
64.439 210.431 L
65.563 210.521 L
66.688 210.619 L
67.812 210.726 L
68.937 210.84 L
70.061 210.962 L
71.186 211.092 L
72.31 211.229 L
73.434 211.373 L
74.559 211.523 L
75.683 211.679 L
76.808 211.84 L
77.932 212.005 L
79.057 212.174 L
80.181 212.345 L
81.306 212.518 L
82.43 212.691 L
83.555 212.863 L
84.679 213.033 L
85.803 213.2 L
86.928 213.362 L
88.052 213.517 L
89.177 213.664 L
90.301 213.801 L
91.426 213.927 L
92.55 214.039 L
93.675 214.137 L
94.799 214.218 L
95.924 214.281 L
97.048 214.323 L
98.172 214.344 L
99.297 214.34 L
100.421 214.312 L
101.546 214.255 L
102.67 214.17 L
103.795 214.055 L
104.919 213.907 L
106.044 213.726 L
107.168 213.509 L
108.293 213.256 L
109.417 212.965 L
110.542 212.636 L
111.666 212.266 L
112.79 211.854 L
113.915 211.4 L
115.039 210.903 L
116.164 210.361 L
117.288 209.774 L
118.413 209.14 L
119.537 208.46 L
120.662 207.731 L
121.786 206.953 L
122.911 206.126 L
124.035 205.248 L
125.159 204.319 L
126.284 203.337 L
127.408 202.303 L
128.533 201.215 L
129.657 200.072 L
130.782 198.875 L
131.906 197.621 L
133.031 196.312 L
134.155 194.945 L
135.28 193.521 L
136.404 192.039 L
137.528 190.5 L
138.653 188.903 L
139.777 187.249 L
140.902 185.537 L
142.026 183.768 L
143.151 181.944 L
144.275 180.064 L
145.4 178.13 L
146.524 176.144 L
147.649 174.108 L
148.773 172.022 L
149.897 169.891 L
151.022 167.715 L
152.146 165.499 L
153.271 163.244 L
154.395 160.955 L
155.52 158.636 L
156.644 156.289 L
157.769 153.92 L
158.893 151.533 L
160.018 149.131 L
161.142 146.721 L
162.267 144.307 L
163.391 141.894 L
164.515 139.487 L
165.64 137.092 L
166.764 134.713 L
167.889 132.356 L
169.013 130.026 L
170.138 127.729 L
171.262 125.47 L
172.387 123.252 L
173.511 121.083 L
174.636 118.965 L
175.76 116.904 L
176.884 114.904 L
178.009 112.968 L
179.133 111.102 L
180.258 109.309 L
181.382 107.591 L
182.507 105.953 L
183.631 104.397 L
184.756 102.926 L
185.88 101.543 L
187.005 100.25 L
188.129 99.05 L
189.253 97.945 L
190.378 96.936 L
191.502 96.025 L
192.627 95.215 L
193.751 94.507 L
194.876 93.903 L
196 93.404 L
197.125 93.012 L
198.249 92.728 L
199.374 92.554 L
200.498 92.491 L
201.623 92.54 L
202.747 92.704 L
203.871 92.982 L
204.996 93.377 L
206.12 93.888 L
207.245 94.518 L
208.369 95.266 L
209.494 96.133 L
210.618 97.12 L
211.743 98.225 L
212.867 99.45 L
213.992 100.793 L
215.116 102.252 L
216.24 103.828 L
217.365 105.517 L
218.489 107.318 L
219.614 109.228 L
220.738 111.244 L
221.863 113.362 L
222.987 115.578 L
224.112 117.887 L
225.236 120.285 L
226.361 122.766 L
227.485 125.324 L
228.609 127.954 L
229.734 130.648 L
230.858 133.4 L
231.983 136.203 L
233.107 139.05 L
234.232 141.933 L
235.356 144.845 L
236.481 147.779 L
237.605 150.726 L
238.73 153.679 L
239.854 156.632 L
240.979 159.576 L
242.103 162.505 L
243.227 165.412 L
244.352 168.29 L
245.476 171.134 L
246.601 173.937 L
247.725 176.695 L
248.85 179.401 L
249.974 182.051 L
251.099 184.642 L
252.223 187.169 L
253.348 189.629 L
254.472 192.019 L
255.596 194.337 L
256.721 196.58 L
257.845 198.747 L
258.97 200.837 L
260.094 202.848 L
261.219 204.781 L
262.343 206.635 L
263.468 208.411 L
264.592 210.109 L
265.717 211.73 L
266.841 213.274 L
267.965 214.744 L
269.09 216.14 L
270.214 217.465 L
271.339 218.721 L
272.463 219.908 L
273.588 221.03 L
274.712 222.088 L
275.837 223.085 L
276.961 224.022 L
278.086 224.902 L
279.21 225.727 L
280.334 226.5 L
281.459 227.222 L
282.583 227.896 L
283.708 228.523 L
284.832 229.106 L
285.957 229.647 L
287.081 230.148 L
288.206 230.61 L
289.33 231.035 L
290.455 231.426 L
291.579 231.784 L
292.704 232.111 L
293.828 232.408 L
294.952 232.677 L
296.077 232.921 L
297.201 233.14 L
298.326 233.336 L
299.45 233.511 L
300.575 233.667 L
301.699 233.805 L
302.824 233.927 L
303.948 234.034 L
305.073 234.128 L
306.197 234.211 L
307.321 234.284 L
308.446 234.348 L
309.57 234.405 L
310.695 234.457 L
311.819 234.505 L
312.944 234.55 L
314.068 234.594 L
315.193 234.637 L
316.317 234.681 L
317.442 234.727 L
318.566 234.775 L
319.69 234.827 L
320.815 234.884 L
321.939 234.946 L
323.064 235.014 L
324.188 235.088 L
325.313 235.169 L
326.437 235.257 L
327.562 235.352 L
328.686 235.454 L
329.811 235.564 L
330.935 235.681 L
332.06 235.805 L
333.184 235.936 L
334.308 236.073 L
335.433 236.217 L
336.557 236.366 L
337.682 236.521 L
338.806 236.681 L
339.931 236.844 L
341.055 237.011 L
342.18 237.181 L
343.304 237.352 L
344.429 237.526 L
345.553 237.699 L
346.677 237.873 L
347.535 238.005 L
S
GR
GS
0.906 0.549 0.608 RC
1 LJ
0.5 LW
N
50.465 207.343 M
50.945 207.348 L
52.07 207.362 L
53.194 207.379 L
54.319 207.4 L
55.443 207.425 L
56.568 207.455 L
57.692 207.49 L
58.816 207.529 L
59.941 207.575 L
61.065 207.627 L
62.19 207.685 L
63.314 207.75 L
64.439 207.823 L
65.563 207.903 L
66.688 207.992 L
67.812 208.089 L
68.937 208.195 L
70.061 208.309 L
71.186 208.432 L
72.31 208.564 L
73.434 208.705 L
74.559 208.853 L
75.683 209.01 L
76.808 209.174 L
77.932 209.344 L
79.057 209.52 L
80.181 209.701 L
81.306 209.885 L
82.43 210.072 L
83.555 210.26 L
84.679 210.447 L
85.803 210.632 L
86.928 210.814 L
88.052 210.99 L
89.177 211.159 L
90.301 211.319 L
91.426 211.468 L
92.55 211.604 L
93.675 211.724 L
94.799 211.828 L
95.924 211.913 L
97.048 211.976 L
98.172 212.017 L
99.297 212.032 L
100.421 212.021 L
101.546 211.981 L
102.67 211.911 L
103.795 211.809 L
104.919 211.672 L
106.044 211.5 L
107.168 211.291 L
108.293 211.043 L
109.417 210.755 L
110.542 210.425 L
111.666 210.053 L
112.79 209.636 L
113.915 209.173 L
115.039 208.663 L
116.164 208.106 L
117.288 207.499 L
118.413 206.842 L
119.537 206.133 L
120.662 205.372 L
121.786 204.558 L
122.911 203.689 L
124.035 202.766 L
125.159 201.786 L
126.284 200.75 L
127.408 199.656 L
128.533 198.504 L
129.657 197.294 L
130.782 196.025 L
131.906 194.696 L
133.031 193.308 L
134.155 191.859 L
135.28 190.351 L
136.404 188.781 L
137.528 187.152 L
138.653 185.462 L
139.777 183.713 L
140.902 181.905 L
142.026 180.037 L
143.151 178.112 L
144.275 176.131 L
145.4 174.094 L
146.524 172.002 L
147.649 169.859 L
148.773 167.666 L
149.897 165.425 L
151.022 163.139 L
152.146 160.81 L
153.271 158.443 L
154.395 156.04 L
155.52 153.605 L
156.644 151.142 L
157.769 148.655 L
158.893 146.15 L
160.018 143.63 L
161.142 141.101 L
162.267 138.567 L
163.391 136.035 L
164.515 133.509 L
165.64 130.995 L
166.764 128.498 L
167.889 126.024 L
169.013 123.579 L
170.138 121.168 L
171.262 118.796 L
172.387 116.469 L
173.511 114.192 L
174.636 111.969 L
175.76 109.806 L
176.884 107.707 L
178.009 105.676 L
179.133 103.718 L
180.258 101.837 L
181.382 100.036 L
182.507 98.318 L
183.631 96.687 L
184.756 95.145 L
185.88 93.696 L
187.005 92.342 L
188.129 91.085 L
189.253 89.928 L
190.378 88.872 L
191.502 87.92 L
192.627 87.073 L
193.751 86.334 L
194.876 85.704 L
196 85.185 L
197.125 84.778 L
198.249 84.485 L
199.374 84.307 L
200.498 84.247 L
201.623 84.305 L
202.747 84.483 L
203.871 84.783 L
204.996 85.205 L
206.12 85.751 L
207.245 86.422 L
208.369 87.218 L
209.494 88.14 L
210.618 89.189 L
211.743 90.364 L
212.867 91.666 L
213.992 93.093 L
215.116 94.644 L
216.24 96.319 L
217.365 98.114 L
218.489 100.028 L
219.614 102.058 L
220.738 104.2 L
221.863 106.451 L
222.987 108.806 L
224.112 111.26 L
225.236 113.808 L
226.361 116.444 L
227.485 119.162 L
228.609 121.954 L
229.734 124.815 L
230.858 127.736 L
231.983 130.709 L
233.107 133.728 L
234.232 136.784 L
235.356 139.869 L
236.481 142.974 L
237.605 146.091 L
238.73 149.213 L
239.854 152.331 L
240.979 155.437 L
242.103 158.525 L
243.227 161.585 L
244.352 164.613 L
245.476 167.6 L
246.601 170.541 L
247.725 173.431 L
248.85 176.263 L
249.974 179.033 L
251.099 181.737 L
252.223 184.371 L
253.348 186.933 L
254.472 189.418 L
255.596 191.826 L
256.721 194.153 L
257.845 196.4 L
258.97 198.564 L
260.094 200.647 L
261.219 202.647 L
262.343 204.564 L
263.468 206.4 L
264.592 208.155 L
265.717 209.831 L
266.841 211.427 L
267.965 212.948 L
269.09 214.392 L
270.214 215.764 L
271.339 217.063 L
272.463 218.293 L
273.588 219.455 L
274.712 220.552 L
275.837 221.585 L
276.961 222.558 L
278.086 223.47 L
279.21 224.326 L
280.334 225.128 L
281.459 225.876 L
282.583 226.574 L
283.708 227.223 L
284.832 227.826 L
285.957 228.385 L
287.081 228.901 L
288.206 229.378 L
289.33 229.815 L
290.455 230.217 L
291.579 230.584 L
292.704 230.918 L
293.828 231.222 L
294.952 231.497 L
296.077 231.745 L
297.201 231.968 L
298.326 232.168 L
299.45 232.345 L
300.575 232.503 L
301.699 232.643 L
302.824 232.767 L
303.948 232.875 L
305.073 232.971 L
306.197 233.055 L
307.321 233.129 L
308.446 233.195 L
309.57 233.255 L
310.695 233.308 L
311.819 233.359 L
312.944 233.406 L
314.068 233.453 L
315.193 233.499 L
316.317 233.547 L
317.442 233.598 L
318.566 233.651 L
319.69 233.709 L
320.815 233.772 L
321.939 233.842 L
323.064 233.917 L
324.188 234 L
325.313 234.09 L
326.437 234.187 L
327.562 234.293 L
328.686 234.406 L
329.811 234.528 L
330.935 234.657 L
332.06 234.794 L
333.184 234.938 L
334.308 235.089 L
335.433 235.246 L
336.557 235.409 L
337.682 235.577 L
338.806 235.75 L
339.931 235.927 L
341.055 236.107 L
342.18 236.289 L
343.304 236.473 L
344.429 236.658 L
345.553 236.843 L
346.677 237.027 L
347.535 237.167 L
S
GR
GS
0.792 0 0.125 RC
1 LJ
N
50.465 208.637 M
50.945 208.639 L
52.07 208.65 L
53.194 208.664 L
54.319 208.684 L
55.443 208.708 L
56.568 208.738 L
57.692 208.773 L
58.816 208.815 L
59.941 208.863 L
61.065 208.918 L
62.19 208.98 L
63.314 209.049 L
64.439 209.127 L
65.563 209.212 L
66.688 209.306 L
67.812 209.407 L
68.937 209.517 L
70.061 209.636 L
71.186 209.762 L
72.31 209.897 L
73.434 210.039 L
74.559 210.188 L
75.683 210.344 L
76.808 210.507 L
77.932 210.675 L
79.057 210.847 L
80.181 211.023 L
81.306 211.202 L
82.43 211.381 L
83.555 211.561 L
84.679 211.74 L
85.803 211.916 L
86.928 212.088 L
88.052 212.253 L
89.177 212.411 L
90.301 212.56 L
91.426 212.697 L
92.55 212.821 L
93.675 212.931 L
94.799 213.023 L
95.924 213.097 L
97.048 213.15 L
98.172 213.18 L
99.297 213.186 L
100.421 213.166 L
101.546 213.118 L
102.67 213.041 L
103.795 212.932 L
104.919 212.79 L
106.044 212.613 L
107.168 212.4 L
108.293 212.15 L
109.417 211.86 L
110.542 211.531 L
111.666 211.159 L
112.79 210.745 L
113.915 210.287 L
115.039 209.783 L
116.164 209.233 L
117.288 208.636 L
118.413 207.991 L
119.537 207.296 L
120.662 206.552 L
121.786 205.756 L
122.911 204.908 L
124.035 204.007 L
125.159 203.052 L
126.284 202.043 L
127.408 200.979 L
128.533 199.86 L
129.657 198.683 L
130.782 197.45 L
131.906 196.159 L
133.031 194.81 L
134.155 193.402 L
135.28 191.936 L
136.404 190.41 L
137.528 188.826 L
138.653 187.183 L
139.777 185.481 L
140.902 183.721 L
142.026 181.903 L
143.151 180.028 L
144.275 178.097 L
145.4 176.112 L
146.524 174.073 L
147.649 171.984 L
148.773 169.844 L
149.897 167.658 L
151.022 165.427 L
152.146 163.155 L
153.271 160.844 L
154.395 158.498 L
155.52 156.12 L
156.644 153.716 L
157.769 151.288 L
158.893 148.841 L
160.018 146.381 L
161.142 143.911 L
162.267 141.437 L
163.391 138.964 L
164.515 136.498 L
165.64 134.043 L
166.764 131.605 L
167.889 129.19 L
169.013 126.803 L
170.138 124.449 L
171.262 122.133 L
172.387 119.861 L
173.511 117.637 L
174.636 115.467 L
175.76 113.355 L
176.884 111.305 L
178.009 109.322 L
179.133 107.41 L
180.258 105.573 L
181.382 103.813 L
182.507 102.135 L
183.631 100.542 L
184.756 99.036 L
185.88 97.62 L
187.005 96.296 L
188.129 95.068 L
189.253 93.936 L
190.378 92.904 L
191.502 91.973 L
192.627 91.144 L
193.751 90.421 L
194.876 89.803 L
196 89.294 L
197.125 88.895 L
198.249 88.606 L
199.374 88.43 L
200.498 88.369 L
201.623 88.423 L
202.747 88.593 L
203.871 88.883 L
204.996 89.291 L
206.12 89.82 L
207.245 90.47 L
208.369 91.242 L
209.494 92.137 L
210.618 93.154 L
211.743 94.295 L
212.867 95.558 L
213.992 96.943 L
215.116 98.448 L
216.24 100.073 L
217.365 101.816 L
218.489 103.673 L
219.614 105.643 L
220.738 107.722 L
221.863 109.906 L
222.987 112.192 L
224.112 114.574 L
225.236 117.046 L
226.361 119.605 L
227.485 122.243 L
228.609 124.954 L
229.734 127.731 L
230.858 130.568 L
231.983 133.456 L
233.107 136.389 L
234.232 139.359 L
235.356 142.357 L
236.481 145.376 L
237.605 148.409 L
238.73 151.446 L
239.854 154.481 L
240.979 157.507 L
242.103 160.515 L
243.227 163.499 L
244.352 166.452 L
245.476 169.367 L
246.601 172.239 L
247.725 175.063 L
248.85 177.832 L
249.974 180.542 L
251.099 183.19 L
252.223 185.77 L
253.348 188.281 L
254.472 190.719 L
255.596 193.081 L
256.721 195.367 L
257.845 197.573 L
258.97 199.701 L
260.094 201.748 L
261.219 203.714 L
262.343 205.6 L
263.468 207.406 L
264.592 209.132 L
265.717 210.78 L
266.841 212.351 L
267.965 213.846 L
269.09 215.266 L
270.214 216.614 L
271.339 217.892 L
272.463 219.101 L
273.588 220.243 L
274.712 221.32 L
275.837 222.335 L
276.961 223.29 L
278.086 224.186 L
279.21 225.027 L
280.334 225.814 L
281.459 226.549 L
282.583 227.235 L
283.708 227.873 L
284.832 228.466 L
285.957 229.016 L
287.081 229.525 L
288.206 229.994 L
289.33 230.425 L
290.455 230.821 L
291.579 231.184 L
292.704 231.514 L
293.828 231.815 L
294.952 232.087 L
296.077 232.333 L
297.201 232.554 L
298.326 232.752 L
299.45 232.928 L
300.575 233.085 L
301.699 233.224 L
302.824 233.347 L
303.948 233.455 L
305.073 233.55 L
306.197 233.633 L
307.321 233.706 L
308.446 233.772 L
309.57 233.83 L
310.695 233.883 L
311.819 233.932 L
312.944 233.978 L
314.068 234.023 L
315.193 234.068 L
316.317 234.114 L
317.442 234.162 L
318.566 234.213 L
319.69 234.268 L
320.815 234.328 L
321.939 234.394 L
323.064 234.466 L
324.188 234.544 L
325.313 234.629 L
326.437 234.722 L
327.562 234.822 L
328.686 234.93 L
329.811 235.046 L
330.935 235.169 L
332.06 235.299 L
333.184 235.437 L
334.308 235.581 L
335.433 235.731 L
336.557 235.888 L
337.682 236.049 L
338.806 236.215 L
339.931 236.386 L
341.055 236.559 L
342.18 236.735 L
343.304 236.913 L
344.429 237.092 L
345.553 237.271 L
346.677 237.45 L
347.535 237.586 L
S
GR
GS
0.804 0.889 0.938 RC
N
272.463 219.016 M
273.588 220.264 L
274.712 221.427 L
275.837 222.51 L
276.961 223.516 L
278.086 224.449 L
279.21 225.313 L
280.334 226.112 L
281.459 226.848 L
282.583 227.526 L
283.708 228.15 L
284.832 228.721 L
285.957 229.244 L
287.081 229.721 L
288.206 230.156 L
289.33 230.551 L
290.455 230.909 L
291.579 231.232 L
292.704 231.523 L
293.828 231.784 L
294.952 232.018 L
296.077 232.226 L
297.201 232.41 L
298.326 232.573 L
299.45 232.716 L
300.575 232.842 L
301.699 232.951 L
302.824 233.046 L
303.948 233.129 L
305.073 233.2 L
306.197 233.261 L
307.321 233.315 L
308.446 233.362 L
309.57 233.403 L
310.695 233.441 L
311.819 233.476 L
312.944 233.509 L
314.068 233.542 L
315.193 233.576 L
316.317 233.611 L
317.442 233.649 L
318.566 233.691 L
319.69 233.737 L
320.815 233.787 L
321.939 233.844 L
323.064 233.906 L
324.188 233.974 L
325.313 234.05 L
326.437 234.132 L
327.562 234.222 L
328.686 234.319 L
329.811 234.423 L
330.935 234.535 L
332.06 234.653 L
333.184 234.779 L
334.308 234.91 L
335.433 235.048 L
336.557 235.192 L
337.682 235.341 L
338.806 235.495 L
339.931 235.652 L
341.055 235.814 L
342.18 235.979 L
343.304 236.146 L
344.429 236.315 L
345.553 236.485 L
346.677 236.655 L
347.535 236.785 L
347.535 236.661 L
347.535 236.629 L
347.535 236.497 L
347.535 236.423 L
347.535 236.332 L
347.535 236.214 L
347.535 236.163 L
347.535 235.999 L
347.535 235.989 L
347.535 235.947 L
346.677 235.809 L
345.553 235.628 L
344.429 235.447 L
343.304 235.266 L
342.18 235.087 L
341.055 234.91 L
339.931 234.735 L
338.806 234.564 L
337.682 234.397 L
336.557 234.234 L
335.433 234.077 L
334.308 233.926 L
333.184 233.781 L
332.06 233.642 L
330.935 233.511 L
329.811 233.388 L
328.686 233.272 L
327.562 233.163 L
326.437 233.063 L
325.313 232.971 L
324.188 232.886 L
323.064 232.809 L
321.939 232.739 L
320.815 232.676 L
319.69 232.619 L
318.566 232.567 L
317.442 232.52 L
316.317 232.478 L
315.193 232.438 L
314.068 232.401 L
312.944 232.365 L
311.819 232.329 L
310.695 232.292 L
309.57 232.252 L
308.446 232.209 L
307.321 232.161 L
306.197 232.106 L
305.073 232.043 L
303.948 231.97 L
302.824 231.886 L
301.699 231.79 L
300.575 231.678 L
299.45 231.551 L
298.326 231.405 L
297.201 231.238 L
296.077 231.05 L
294.952 230.837 L
293.828 230.598 L
292.704 230.331 L
291.579 230.032 L
290.455 229.699 L
289.33 229.331 L
288.206 228.924 L
287.081 228.475 L
285.957 227.982 L
284.832 227.441 L
283.708 226.85 L
282.583 226.204 L
281.459 225.502 L
280.334 224.739 L
279.21 223.912 L
278.086 223.018 L
276.961 222.052 L
275.837 221.011 L
274.712 219.891 L
273.588 218.689 L
272.463 217.4 L
271.339 216.022 L
270.214 214.55 L
269.09 212.98 L
267.965 211.31 L
266.841 209.537 L
265.717 207.656 L
264.592 205.666 L
263.468 203.564 L
262.343 201.347 L
261.219 199.015 L
260.094 196.565 L
258.97 193.998 L
257.845 191.312 L
256.721 188.509 L
255.596 185.589 L
254.472 182.553 L
253.348 179.405 L
252.223 176.148 L
251.099 172.784 L
249.974 169.319 L
248.85 165.757 L
247.725 162.106 L
246.601 158.372 L
245.476 154.562 L
244.352 150.684 L
243.227 146.748 L
242.103 142.763 L
240.979 138.739 L
239.854 134.686 L
238.73 130.616 L
237.605 126.539 L
236.481 122.467 L
235.356 118.411 L
234.232 114.384 L
233.107 110.396 L
231.983 106.461 L
230.858 102.588 L
229.734 98.789 L
228.609 95.076 L
227.485 91.458 L
226.361 87.945 L
225.236 84.546 L
224.112 81.272 L
222.987 78.128 L
221.863 75.123 L
220.738 72.264 L
219.614 69.556 L
218.489 67.004 L
217.365 64.613 L
216.24 62.387 L
215.116 60.327 L
213.992 58.436 L
212.867 56.716 L
211.743 55.167 L
210.618 53.789 L
209.494 52.582 L
208.369 51.545 L
207.245 50.676 L
206.12 49.973 L
204.996 49.435 L
203.871 49.058 L
202.747 48.84 L
201.623 48.777 L
200.498 48.867 L
199.374 49.106 L
198.249 49.491 L
197.125 50.018 L
196 50.685 L
194.876 51.486 L
193.751 52.419 L
192.627 53.481 L
191.502 54.668 L
190.378 55.976 L
189.253 57.401 L
188.129 58.942 L
187.005 60.592 L
185.88 62.351 L
184.756 64.212 L
183.631 66.174 L
182.507 68.232 L
181.382 70.381 L
180.258 72.619 L
179.133 74.941 L
178.009 77.342 L
176.884 79.818 L
175.76 82.365 L
174.636 84.977 L
173.511 87.649 L
172.387 90.377 L
171.262 93.156 L
170.138 95.979 L
169.013 98.842 L
167.889 101.739 L
166.764 104.664 L
165.64 107.613 L
164.515 110.579 L
163.391 113.558 L
162.267 116.543 L
161.142 119.53 L
160.018 122.513 L
158.893 125.488 L
157.769 128.45 L
156.644 131.394 L
155.52 134.315 L
154.395 137.21 L
153.271 140.075 L
152.146 142.907 L
151.022 145.701 L
149.897 148.454 L
148.773 151.165 L
147.649 153.829 L
146.524 156.446 L
145.4 159.012 L
144.275 161.525 L
143.151 163.984 L
142.026 166.388 L
140.902 168.734 L
139.777 171.021 L
138.653 173.248 L
137.528 175.415 L
136.404 177.52 L
135.28 179.561 L
134.155 181.54 L
133.031 183.453 L
131.906 185.302 L
130.782 187.085 L
129.657 188.801 L
128.533 190.45 L
127.408 192.033 L
126.284 193.547 L
125.159 194.993 L
124.035 196.371 L
122.911 197.68 L
121.786 198.921 L
120.662 200.093 L
119.537 201.196 L
118.413 202.231 L
117.288 203.199 L
116.164 204.099 L
115.039 204.932 L
113.915 205.699 L
112.79 206.402 L
111.666 207.04 L
110.542 207.616 L
109.417 208.131 L
108.293 208.586 L
107.168 208.984 L
106.044 209.326 L
104.919 209.614 L
103.795 209.85 L
102.67 210.037 L
101.546 210.178 L
100.421 210.275 L
99.297 210.33 L
98.172 210.348 L
97.048 210.33 L
95.924 210.28 L
94.799 210.202 L
93.675 210.098 L
92.55 209.972 L
91.426 209.826 L
90.301 209.665 L
89.177 209.492 L
88.052 209.309 L
86.928 209.12 L
85.803 208.927 L
84.679 208.734 L
83.555 208.544 L
82.43 208.358 L
81.306 208.18 L
80.181 208.011 L
79.057 207.853 L
77.932 207.708 L
76.808 207.577 L
75.683 207.462 L
74.559 207.363 L
73.434 207.282 L
72.31 207.219 L
71.186 207.174 L
70.061 207.146 L
68.937 207.137 L
67.812 207.145 L
66.688 207.171 L
65.563 207.212 L
64.439 207.269 L
63.314 207.34 L
62.19 207.424 L
61.065 207.52 L
59.941 207.627 L
58.816 207.743 L
57.692 207.866 L
56.568 207.997 L
55.443 208.132 L
54.319 208.272 L
53.194 208.414 L
52.07 208.557 L
50.945 208.7 L
50.465 208.761 L
50.465 208.84 L
50.465 208.844 L
50.465 208.979 L
50.465 208.988 L
50.465 209.119 L
50.465 209.239 L
50.465 209.257 L
50.465 209.371 L
50.465 209.393 L
50.465 209.501 L
50.465 209.598 L
50.465 209.626 L
50.465 209.717 L
50.465 209.746 L
50.465 209.746 L
50.465 209.814 L
50.465 209.819 L
50.465 209.83 L
50.465 209.85 L
50.465 209.904 L
50.465 209.931 L
50.465 209.977 L
50.465 210.013 L
50.465 210.051 L
50.465 210.097 L
50.465 210.128 L
50.465 210.186 L
50.465 210.21 L
50.465 210.23 L
50.465 210.301 L
50.465 210.316 L
50.465 210.328 L
50.465 210.413 L
50.465 210.422 L
50.465 210.428 L
50.465 210.431 L
50.465 210.433 L
50.465 210.434 L
50.465 210.44 L
50.465 210.56 L
50.465 210.571 L
50.465 210.699 L
50.465 210.834 L
50.465 210.841 L
50.465 210.982 L
50.465 210.987 L
50.465 211.132 L
50.465 211.135 L
50.465 211.283 L
50.465 211.284 L
50.465 211.347 L
50.945 211.283 L
52.07 211.133 L
53.194 210.984 L
54.319 210.839 L
55.443 210.698 L
56.568 210.562 L
57.692 210.433 L
58.816 210.313 L
59.941 210.202 L
61.065 210.102 L
62.19 210.014 L
63.314 209.938 L
64.439 209.877 L
65.563 209.83 L
66.688 209.798 L
67.812 209.782 L
68.937 209.783 L
70.061 209.8 L
71.186 209.834 L
72.31 209.884 L
73.434 209.951 L
74.559 210.033 L
75.683 210.131 L
76.808 210.243 L
77.932 210.369 L
79.057 210.507 L
80.181 210.655 L
81.306 210.813 L
82.43 210.977 L
83.555 211.148 L
84.679 211.321 L
85.803 211.495 L
86.928 211.667 L
88.052 211.835 L
89.177 211.996 L
90.301 212.147 L
91.426 212.285 L
92.55 212.407 L
93.675 212.511 L
94.799 212.592 L
95.924 212.649 L
97.048 212.677 L
98.172 212.675 L
99.297 212.638 L
100.421 212.565 L
101.546 212.452 L
102.67 212.296 L
103.795 212.096 L
104.919 211.848 L
106.044 211.551 L
107.168 211.202 L
108.293 210.799 L
109.417 210.341 L
110.542 209.826 L
111.666 209.253 L
112.79 208.62 L
113.915 207.926 L
115.039 207.171 L
116.164 206.354 L
117.288 205.473 L
118.413 204.53 L
119.537 203.522 L
120.662 202.451 L
121.786 201.316 L
122.911 200.117 L
124.035 198.853 L
125.159 197.526 L
126.284 196.135 L
127.408 194.68 L
128.533 193.161 L
129.657 191.579 L
130.782 189.934 L
131.906 188.227 L
133.031 186.457 L
134.155 184.625 L
135.28 182.732 L
136.404 180.778 L
137.528 178.763 L
138.653 176.689 L
139.777 174.556 L
140.902 172.366 L
142.026 170.118 L
143.151 167.815 L
144.275 165.458 L
145.4 163.048 L
146.524 160.588 L
147.649 158.078 L
148.773 155.521 L
149.897 152.92 L
151.022 150.277 L
152.146 147.595 L
153.271 144.877 L
154.395 142.126 L
155.52 139.346 L
156.644 136.541 L
157.769 133.715 L
158.893 130.871 L
160.018 128.015 L
161.142 125.151 L
162.267 122.283 L
163.391 119.417 L
164.515 116.558 L
165.64 113.71 L
166.764 110.879 L
167.889 108.07 L
169.013 105.289 L
170.138 102.54 L
171.262 99.829 L
172.387 97.161 L
173.511 94.54 L
174.636 91.973 L
175.76 89.463 L
176.884 87.015 L
178.009 84.634 L
179.133 82.325 L
180.258 80.091 L
181.382 77.937 L
182.507 75.867 L
183.631 73.884 L
184.756 71.993 L
185.88 70.198 L
187.005 68.501 L
188.129 66.907 L
189.253 65.418 L
190.378 64.039 L
191.502 62.773 L
192.627 61.623 L
193.751 60.592 L
194.876 59.685 L
196 58.904 L
197.125 58.253 L
198.249 57.734 L
199.374 57.353 L
200.498 57.111 L
201.623 57.013 L
202.747 57.06 L
203.871 57.257 L
204.996 57.607 L
206.12 58.111 L
207.245 58.772 L
208.369 59.593 L
209.494 60.575 L
210.618 61.72 L
211.743 63.028 L
212.867 64.5 L
213.992 66.136 L
215.116 67.935 L
216.24 69.896 L
217.365 72.017 L
218.489 74.295 L
219.614 76.726 L
220.738 79.308 L
221.863 82.034 L
222.987 84.9 L
224.112 87.898 L
225.236 91.023 L
226.361 94.267 L
227.485 97.62 L
228.609 101.075 L
229.734 104.623 L
230.858 108.252 L
231.983 111.954 L
233.107 115.718 L
234.232 119.533 L
235.356 123.388 L
236.481 127.271 L
237.605 131.173 L
238.73 135.082 L
239.854 138.987 L
240.979 142.878 L
242.103 146.744 L
243.227 150.575 L
244.352 154.362 L
245.476 158.096 L
246.601 161.768 L
247.725 165.37 L
248.85 168.896 L
249.974 172.337 L
251.099 175.689 L
252.223 178.945 L
253.348 182.102 L
254.472 185.155 L
255.596 188.1 L
256.721 190.936 L
257.845 193.66 L
258.97 196.27 L
260.094 198.767 L
261.219 201.149 L
262.343 203.418 L
263.468 205.575 L
264.592 207.62 L
265.717 209.555 L
266.841 211.383 L
267.965 213.107 L
269.09 214.729 L
270.214 216.252 L
271.339 217.68 L
cp
f
GR
GS
0.561 0.749 0.859 RC
1 LJ
0.5 LW
N
50.465 211.347 M
50.945 211.283 L
52.07 211.133 L
53.194 210.984 L
54.319 210.839 L
55.443 210.698 L
56.568 210.562 L
57.692 210.433 L
58.816 210.313 L
59.941 210.202 L
61.065 210.102 L
62.19 210.014 L
63.314 209.938 L
64.439 209.877 L
65.563 209.83 L
66.688 209.798 L
67.812 209.782 L
68.937 209.783 L
70.061 209.8 L
71.186 209.834 L
72.31 209.884 L
73.434 209.951 L
74.559 210.033 L
75.683 210.131 L
76.808 210.243 L
77.932 210.369 L
79.057 210.507 L
80.181 210.655 L
81.306 210.813 L
82.43 210.977 L
83.555 211.148 L
84.679 211.321 L
85.803 211.495 L
86.928 211.667 L
88.052 211.835 L
89.177 211.996 L
90.301 212.147 L
91.426 212.285 L
92.55 212.407 L
93.675 212.511 L
94.799 212.592 L
95.924 212.649 L
97.048 212.677 L
98.172 212.675 L
99.297 212.638 L
100.421 212.565 L
101.546 212.452 L
102.67 212.296 L
103.795 212.096 L
104.919 211.848 L
106.044 211.551 L
107.168 211.202 L
108.293 210.799 L
109.417 210.341 L
110.542 209.826 L
111.666 209.253 L
112.79 208.62 L
113.915 207.926 L
115.039 207.171 L
116.164 206.354 L
117.288 205.473 L
118.413 204.53 L
119.537 203.522 L
120.662 202.451 L
121.786 201.316 L
122.911 200.117 L
124.035 198.853 L
125.159 197.526 L
126.284 196.135 L
127.408 194.68 L
128.533 193.161 L
129.657 191.579 L
130.782 189.934 L
131.906 188.227 L
133.031 186.457 L
134.155 184.625 L
135.28 182.732 L
136.404 180.778 L
137.528 178.763 L
138.653 176.689 L
139.777 174.556 L
140.902 172.366 L
142.026 170.118 L
143.151 167.815 L
144.275 165.458 L
145.4 163.048 L
146.524 160.588 L
147.649 158.078 L
148.773 155.521 L
149.897 152.92 L
151.022 150.277 L
152.146 147.595 L
153.271 144.877 L
154.395 142.126 L
155.52 139.346 L
156.644 136.541 L
157.769 133.715 L
158.893 130.871 L
160.018 128.015 L
161.142 125.151 L
162.267 122.283 L
163.391 119.417 L
164.515 116.558 L
165.64 113.71 L
166.764 110.879 L
167.889 108.07 L
169.013 105.289 L
170.138 102.54 L
171.262 99.829 L
172.387 97.161 L
173.511 94.54 L
174.636 91.973 L
175.76 89.463 L
176.884 87.015 L
178.009 84.634 L
179.133 82.325 L
180.258 80.091 L
181.382 77.937 L
182.507 75.867 L
183.631 73.884 L
184.756 71.993 L
185.88 70.198 L
187.005 68.501 L
188.129 66.907 L
189.253 65.418 L
190.378 64.039 L
191.502 62.773 L
192.627 61.623 L
193.751 60.592 L
194.876 59.685 L
196 58.904 L
197.125 58.253 L
198.249 57.734 L
199.374 57.353 L
200.498 57.111 L
201.623 57.013 L
202.747 57.06 L
203.871 57.257 L
204.996 57.607 L
206.12 58.111 L
207.245 58.772 L
208.369 59.593 L
209.494 60.575 L
210.618 61.72 L
211.743 63.028 L
212.867 64.5 L
213.992 66.136 L
215.116 67.935 L
216.24 69.896 L
217.365 72.017 L
218.489 74.295 L
219.614 76.726 L
220.738 79.308 L
221.863 82.034 L
222.987 84.9 L
224.112 87.898 L
225.236 91.023 L
226.361 94.267 L
227.485 97.62 L
228.609 101.075 L
229.734 104.623 L
230.858 108.252 L
231.983 111.954 L
233.107 115.718 L
234.232 119.533 L
235.356 123.388 L
236.481 127.271 L
237.605 131.173 L
238.73 135.082 L
239.854 138.987 L
240.979 142.878 L
242.103 146.744 L
243.227 150.575 L
244.352 154.362 L
245.476 158.096 L
246.601 161.768 L
247.725 165.37 L
248.85 168.896 L
249.974 172.337 L
251.099 175.689 L
252.223 178.945 L
253.348 182.102 L
254.472 185.155 L
255.596 188.1 L
256.721 190.936 L
257.845 193.66 L
258.97 196.27 L
260.094 198.767 L
261.219 201.149 L
262.343 203.418 L
263.468 205.575 L
264.592 207.62 L
265.717 209.555 L
266.841 211.383 L
267.965 213.107 L
269.09 214.729 L
270.214 216.252 L
271.339 217.68 L
272.463 219.016 L
273.588 220.264 L
274.712 221.427 L
275.837 222.51 L
276.961 223.516 L
278.086 224.449 L
279.21 225.313 L
280.334 226.112 L
281.459 226.848 L
282.583 227.526 L
283.708 228.15 L
284.832 228.721 L
285.957 229.244 L
287.081 229.721 L
288.206 230.156 L
289.33 230.551 L
290.455 230.909 L
291.579 231.232 L
292.704 231.523 L
293.828 231.784 L
294.952 232.018 L
296.077 232.226 L
297.201 232.41 L
298.326 232.573 L
299.45 232.716 L
300.575 232.842 L
301.699 232.951 L
302.824 233.046 L
303.948 233.129 L
305.073 233.2 L
306.197 233.261 L
307.321 233.315 L
308.446 233.362 L
309.57 233.403 L
310.695 233.441 L
311.819 233.476 L
312.944 233.509 L
314.068 233.542 L
315.193 233.576 L
316.317 233.611 L
317.442 233.649 L
318.566 233.691 L
319.69 233.737 L
320.815 233.787 L
321.939 233.844 L
323.064 233.906 L
324.188 233.974 L
325.313 234.05 L
326.437 234.132 L
327.562 234.222 L
328.686 234.319 L
329.811 234.423 L
330.935 234.535 L
332.06 234.653 L
333.184 234.779 L
334.308 234.91 L
335.433 235.048 L
336.557 235.192 L
337.682 235.341 L
338.806 235.495 L
339.931 235.652 L
341.055 235.814 L
342.18 235.979 L
343.304 236.146 L
344.429 236.315 L
345.553 236.485 L
346.677 236.655 L
347.535 236.785 L
S
GR
GS
0.561 0.749 0.859 RC
1 LJ
0.5 LW
N
50.465 208.761 M
50.945 208.7 L
52.07 208.557 L
53.194 208.414 L
54.319 208.272 L
55.443 208.132 L
56.568 207.997 L
57.692 207.866 L
58.816 207.743 L
59.941 207.627 L
61.065 207.52 L
62.19 207.424 L
63.314 207.34 L
64.439 207.269 L
65.563 207.212 L
66.688 207.171 L
67.812 207.145 L
68.937 207.137 L
70.061 207.146 L
71.186 207.174 L
72.31 207.219 L
73.434 207.282 L
74.559 207.363 L
75.683 207.462 L
76.808 207.577 L
77.932 207.708 L
79.057 207.853 L
80.181 208.011 L
81.306 208.18 L
82.43 208.358 L
83.555 208.544 L
84.679 208.734 L
85.803 208.927 L
86.928 209.12 L
88.052 209.309 L
89.177 209.492 L
90.301 209.665 L
91.426 209.826 L
92.55 209.972 L
93.675 210.098 L
94.799 210.202 L
95.924 210.28 L
97.048 210.33 L
98.172 210.348 L
99.297 210.33 L
100.421 210.275 L
101.546 210.178 L
102.67 210.037 L
103.795 209.85 L
104.919 209.614 L
106.044 209.326 L
107.168 208.984 L
108.293 208.586 L
109.417 208.131 L
110.542 207.616 L
111.666 207.04 L
112.79 206.402 L
113.915 205.699 L
115.039 204.932 L
116.164 204.099 L
117.288 203.199 L
118.413 202.231 L
119.537 201.196 L
120.662 200.093 L
121.786 198.921 L
122.911 197.68 L
124.035 196.371 L
125.159 194.993 L
126.284 193.547 L
127.408 192.033 L
128.533 190.45 L
129.657 188.801 L
130.782 187.085 L
131.906 185.302 L
133.031 183.453 L
134.155 181.54 L
135.28 179.561 L
136.404 177.52 L
137.528 175.415 L
138.653 173.248 L
139.777 171.021 L
140.902 168.734 L
142.026 166.388 L
143.151 163.984 L
144.275 161.525 L
145.4 159.012 L
146.524 156.446 L
147.649 153.829 L
148.773 151.165 L
149.897 148.454 L
151.022 145.701 L
152.146 142.907 L
153.271 140.075 L
154.395 137.21 L
155.52 134.315 L
156.644 131.394 L
157.769 128.45 L
158.893 125.488 L
160.018 122.513 L
161.142 119.53 L
162.267 116.543 L
163.391 113.558 L
164.515 110.579 L
165.64 107.613 L
166.764 104.664 L
167.889 101.739 L
169.013 98.842 L
170.138 95.979 L
171.262 93.156 L
172.387 90.377 L
173.511 87.649 L
174.636 84.977 L
175.76 82.365 L
176.884 79.818 L
178.009 77.342 L
179.133 74.941 L
180.258 72.619 L
181.382 70.381 L
182.507 68.232 L
183.631 66.174 L
184.756 64.212 L
185.88 62.351 L
187.005 60.592 L
188.129 58.942 L
189.253 57.401 L
190.378 55.976 L
191.502 54.668 L
192.627 53.481 L
193.751 52.419 L
194.876 51.486 L
196 50.685 L
197.125 50.018 L
198.249 49.491 L
199.374 49.106 L
200.498 48.867 L
201.623 48.777 L
202.747 48.84 L
203.871 49.058 L
204.996 49.435 L
206.12 49.973 L
207.245 50.676 L
208.369 51.545 L
209.494 52.582 L
210.618 53.789 L
211.743 55.167 L
212.867 56.716 L
213.992 58.436 L
215.116 60.327 L
216.24 62.387 L
217.365 64.613 L
218.489 67.004 L
219.614 69.556 L
220.738 72.264 L
221.863 75.123 L
222.987 78.128 L
224.112 81.272 L
225.236 84.546 L
226.361 87.945 L
227.485 91.458 L
228.609 95.076 L
229.734 98.789 L
230.858 102.588 L
231.983 106.461 L
233.107 110.396 L
234.232 114.384 L
235.356 118.411 L
236.481 122.467 L
237.605 126.539 L
238.73 130.616 L
239.854 134.686 L
240.979 138.739 L
242.103 142.763 L
243.227 146.748 L
244.352 150.684 L
245.476 154.562 L
246.601 158.372 L
247.725 162.106 L
248.85 165.757 L
249.974 169.319 L
251.099 172.784 L
252.223 176.148 L
253.348 179.405 L
254.472 182.553 L
255.596 185.589 L
256.721 188.509 L
257.845 191.312 L
258.97 193.998 L
260.094 196.565 L
261.219 199.015 L
262.343 201.347 L
263.468 203.564 L
264.592 205.666 L
265.717 207.656 L
266.841 209.537 L
267.965 211.31 L
269.09 212.98 L
270.214 214.55 L
271.339 216.022 L
272.463 217.4 L
273.588 218.689 L
274.712 219.891 L
275.837 221.011 L
276.961 222.052 L
278.086 223.018 L
279.21 223.912 L
280.334 224.739 L
281.459 225.502 L
282.583 226.204 L
283.708 226.85 L
284.832 227.441 L
285.957 227.982 L
287.081 228.475 L
288.206 228.924 L
289.33 229.331 L
290.455 229.699 L
291.579 230.032 L
292.704 230.331 L
293.828 230.598 L
294.952 230.837 L
296.077 231.05 L
297.201 231.238 L
298.326 231.405 L
299.45 231.551 L
300.575 231.678 L
301.699 231.79 L
302.824 231.886 L
303.948 231.97 L
305.073 232.043 L
306.197 232.106 L
307.321 232.161 L
308.446 232.209 L
309.57 232.252 L
310.695 232.292 L
311.819 232.329 L
312.944 232.365 L
314.068 232.401 L
315.193 232.438 L
316.317 232.478 L
317.442 232.52 L
318.566 232.567 L
319.69 232.619 L
320.815 232.676 L
321.939 232.739 L
323.064 232.809 L
324.188 232.886 L
325.313 232.971 L
326.437 233.063 L
327.562 233.163 L
328.686 233.272 L
329.811 233.388 L
330.935 233.511 L
332.06 233.642 L
333.184 233.781 L
334.308 233.926 L
335.433 234.077 L
336.557 234.234 L
337.682 234.397 L
338.806 234.564 L
339.931 234.735 L
341.055 234.91 L
342.18 235.087 L
343.304 235.266 L
344.429 235.447 L
345.553 235.628 L
346.677 235.809 L
347.535 235.947 L
S
GR
GS
0.02 0.443 0.69 RC
1 LJ
N
50.465 210.054 M
50.945 209.991 L
52.07 209.845 L
53.194 209.699 L
54.319 209.555 L
55.443 209.415 L
56.568 209.279 L
57.692 209.15 L
58.816 209.028 L
59.941 208.914 L
61.065 208.811 L
62.19 208.719 L
63.314 208.639 L
64.439 208.573 L
65.563 208.521 L
66.688 208.484 L
67.812 208.464 L
68.937 208.46 L
70.061 208.473 L
71.186 208.504 L
72.31 208.551 L
73.434 208.616 L
74.559 208.698 L
75.683 208.796 L
76.808 208.91 L
77.932 209.038 L
79.057 209.18 L
80.181 209.333 L
81.306 209.496 L
82.43 209.668 L
83.555 209.846 L
84.679 210.028 L
85.803 210.211 L
86.928 210.393 L
88.052 210.572 L
89.177 210.744 L
90.301 210.906 L
91.426 211.056 L
92.55 211.189 L
93.675 211.304 L
94.799 211.397 L
95.924 211.465 L
97.048 211.504 L
98.172 211.511 L
99.297 211.484 L
100.421 211.42 L
101.546 211.315 L
102.67 211.167 L
103.795 210.973 L
104.919 210.731 L
106.044 210.438 L
107.168 210.093 L
108.293 209.693 L
109.417 209.236 L
110.542 208.721 L
111.666 208.147 L
112.79 207.511 L
113.915 206.813 L
115.039 206.051 L
116.164 205.226 L
117.288 204.336 L
118.413 203.381 L
119.537 202.359 L
120.662 201.272 L
121.786 200.118 L
122.911 198.898 L
124.035 197.612 L
125.159 196.26 L
126.284 194.841 L
127.408 193.356 L
128.533 191.806 L
129.657 190.19 L
130.782 188.509 L
131.906 186.764 L
133.031 184.955 L
134.155 183.082 L
135.28 181.147 L
136.404 179.149 L
137.528 177.089 L
138.653 174.969 L
139.777 172.789 L
140.902 170.55 L
142.026 168.253 L
143.151 165.9 L
144.275 163.492 L
145.4 161.03 L
146.524 158.517 L
147.649 155.954 L
148.773 153.343 L
149.897 150.687 L
151.022 147.989 L
152.146 145.251 L
153.271 142.476 L
154.395 139.668 L
155.52 136.831 L
156.644 133.967 L
157.769 131.082 L
158.893 128.18 L
160.018 125.264 L
161.142 122.34 L
162.267 119.413 L
163.391 116.487 L
164.515 113.569 L
165.64 110.662 L
166.764 107.772 L
167.889 104.905 L
169.013 102.065 L
170.138 99.26 L
171.262 96.492 L
172.387 93.769 L
173.511 91.095 L
174.636 88.475 L
175.76 85.914 L
176.884 83.416 L
178.009 80.988 L
179.133 78.633 L
180.258 76.355 L
181.382 74.159 L
182.507 72.049 L
183.631 70.029 L
184.756 68.103 L
185.88 66.274 L
187.005 64.547 L
188.129 62.924 L
189.253 61.41 L
190.378 60.007 L
191.502 58.72 L
192.627 57.552 L
193.751 56.506 L
194.876 55.586 L
196 54.794 L
197.125 54.135 L
198.249 53.613 L
199.374 53.23 L
200.498 52.989 L
201.623 52.895 L
202.747 52.95 L
203.871 53.158 L
204.996 53.521 L
206.12 54.042 L
207.245 54.724 L
208.369 55.569 L
209.494 56.579 L
210.618 57.755 L
211.743 59.098 L
212.867 60.608 L
213.992 62.286 L
215.116 64.131 L
216.24 66.141 L
217.365 68.315 L
218.489 70.65 L
219.614 73.141 L
220.738 75.786 L
221.863 78.579 L
222.987 81.514 L
224.112 84.585 L
225.236 87.785 L
226.361 91.106 L
227.485 94.539 L
228.609 98.076 L
229.734 101.706 L
230.858 105.42 L
231.983 109.208 L
233.107 113.057 L
234.232 116.958 L
235.356 120.899 L
236.481 124.869 L
237.605 128.856 L
238.73 132.849 L
239.854 136.837 L
240.979 140.808 L
242.103 144.753 L
243.227 148.662 L
244.352 152.523 L
245.476 156.329 L
246.601 160.07 L
247.725 163.738 L
248.85 167.326 L
249.974 170.828 L
251.099 174.236 L
252.223 177.546 L
253.348 180.754 L
254.472 183.854 L
255.596 186.844 L
256.721 189.722 L
257.845 192.486 L
258.97 195.134 L
260.094 197.666 L
261.219 200.082 L
262.343 202.383 L
263.468 204.569 L
264.592 206.643 L
265.717 208.606 L
266.841 210.46 L
267.965 212.209 L
269.09 213.855 L
270.214 215.401 L
271.339 216.851 L
272.463 218.208 L
273.588 219.476 L
274.712 220.659 L
275.837 221.761 L
276.961 222.784 L
278.086 223.734 L
279.21 224.613 L
280.334 225.426 L
281.459 226.175 L
282.583 226.865 L
283.708 227.5 L
284.832 228.081 L
285.957 228.613 L
287.081 229.098 L
288.206 229.54 L
289.33 229.941 L
290.455 230.304 L
291.579 230.632 L
292.704 230.927 L
293.828 231.191 L
294.952 231.428 L
296.077 231.638 L
297.201 231.824 L
298.326 231.989 L
299.45 232.133 L
300.575 232.26 L
301.699 232.37 L
302.824 232.466 L
303.948 232.549 L
305.073 232.621 L
306.197 232.684 L
307.321 232.738 L
308.446 232.785 L
309.57 232.828 L
310.695 232.866 L
311.819 232.902 L
312.944 232.937 L
314.068 232.972 L
315.193 233.007 L
316.317 233.045 L
317.442 233.085 L
318.566 233.129 L
319.69 233.178 L
320.815 233.232 L
321.939 233.291 L
323.064 233.357 L
324.188 233.43 L
325.313 233.51 L
326.437 233.598 L
327.562 233.693 L
328.686 233.795 L
329.811 233.905 L
330.935 234.023 L
332.06 234.148 L
333.184 234.28 L
334.308 234.418 L
335.433 234.563 L
336.557 234.713 L
337.682 234.869 L
338.806 235.029 L
339.931 235.194 L
341.055 235.362 L
342.18 235.533 L
343.304 235.706 L
344.429 235.881 L
345.553 236.056 L
346.677 236.232 L
347.535 236.366 L
S
GR
GS
[1 0 0 1 95.5 42.25] CT
/Helvetica 18 F
GS
[1 0 0 1 0 0] CT
0 7 moveto 
1 -1 scale
(L1) t 
GR
GR
GS
0.792 0 0.125 RC
1 LJ
N
62.5 42.25 M
92.5 42.25 L
S
GR
GS
[1 0 0 1 95.5 64.25] CT
/Helvetica 18 F
GS
[1 0 0 1 0 0] CT
0 7 moveto 
1 -1 scale
(L4) t 
GR
GR
GS
0.02 0.443 0.69 RC
1 LJ
N
62.5 64.25 M
92.5 64.25 L
S
GR
%%Trailer
%%Pages: 1
%%EOF
