
                            < M A T L A B (R) >
                  Copyright 1984-2020 The MathWorks, Inc.
                  R2020a (9.8.0.1323502) 64-bit (glnxa64)
                             February 25, 2020

 
To get started, type doc.
For product information, visit www.mathworks.com.
 
loading /home/mpib/LNDG/stateswitch/stsw_fmri_task/spectrum/data/standards/data/mni_icbm152_nlin_sym_09c/mni_icbm152_gm_tal_nlin_sym_09c_MNI_3mm.nii
...done
 
Processing subject 2123.
loading /home/mpib/LNDG/stateswitch/stsw_fmri_task/spectrum/../extended_preproc/data/data_clean/2123_run-1_regressed.nii
...done
 
Block 1 finished: 38.4915
Block 2 finished: 37.1738
Block 3 finished: 37.2028
Block 4 finished: 37.185
Block 5 finished: 37.479
Block 6 finished: 37.4193
Block 7 finished: 37.7458
Block 8 finished: 37.5382
loading /home/mpib/LNDG/stateswitch/stsw_fmri_task/spectrum/../extended_preproc/data/data_clean/2123_run-2_regressed.nii
...done
 
Block 1 finished: 38.2414
Block 2 finished: 37.6142
Block 3 finished: 37.8168
Block 4 finished: 37.7612
Block 5 finished: 37.8042
Block 6 finished: 37.6345
Block 7 finished: 37.8268
Block 8 finished: 37.923
loading /home/mpib/LNDG/stateswitch/stsw_fmri_task/spectrum/../extended_preproc/data/data_clean/2123_run-3_regressed.nii
...done
 
Block 1 finished: 38.7837
Block 2 finished: 37.85
Block 3 finished: 37.8558
Block 4 finished: 37.911
Block 5 finished: 38.2807
Block 6 finished: 38.0963
Block 7 finished: 38.178
Block 8 finished: 38.5315
loading /home/mpib/LNDG/stateswitch/stsw_fmri_task/spectrum/../extended_preproc/data/data_clean/2123_run-4_regressed.nii
...done
 
Block 1 finished: 39.2475
Block 2 finished: 38.259
Block 3 finished: 38.3113
Block 4 finished: 38.3301
Block 5 finished: 38.5604
Block 6 finished: 38.4616
Block 7 finished: 38.6138
Block 8 finished: 39.4503
