
                            < M A T L A B (R) >
                  Copyright 1984-2020 The MathWorks, Inc.
                  R2020a (9.8.0.1323502) 64-bit (glnxa64)
                             February 25, 2020

 
To get started, type doc.
For product information, visit www.mathworks.com.
 
loading /home/mpib/LNDG/stateswitch/stsw_fmri_task/spectrum/data/standards/data/mni_icbm152_nlin_sym_09c/mni_icbm152_gm_tal_nlin_sym_09c_MNI_3mm.nii
...done
 
Processing subject 1276.
loading /home/mpib/LNDG/stateswitch/stsw_fmri_task/spectrum/../extended_preproc/data/data_clean/1276_run-1_regressed.nii
...done
 
Block 1 finished: 48.8582
Block 2 finished: 45.9844
Block 3 finished: 46.0236
Block 4 finished: 46.063
Block 5 finished: 46.23
Block 6 finished: 46.284
Block 7 finished: 46.3389
Block 8 finished: 46.3504
loading /home/mpib/LNDG/stateswitch/stsw_fmri_task/spectrum/../extended_preproc/data/data_clean/1276_run-2_regressed.nii
...done
 
Block 1 finished: 46.4491
Block 2 finished: 46.4447
Block 3 finished: 46.684
Block 4 finished: 46.6009
Block 5 finished: 46.4844
Block 6 finished: 46.6705
Block 7 finished: 46.5789
Block 8 finished: 46.7185
loading /home/mpib/LNDG/stateswitch/stsw_fmri_task/spectrum/../extended_preproc/data/data_clean/1276_run-3_regressed.nii
...done
 
Block 1 finished: 46.6665
Block 2 finished: 46.8661
Block 3 finished: 46.7114
Block 4 finished: 46.8823
Block 5 finished: 47.1564
Block 6 finished: 46.9673
Block 7 finished: 47.0525
Block 8 finished: 47.047
loading /home/mpib/LNDG/stateswitch/stsw_fmri_task/spectrum/../extended_preproc/data/data_clean/1276_run-4_regressed.nii
...done
 
Block 1 finished: 47.0788
Block 2 finished: 47.076
Block 3 finished: 47.1816
Block 4 finished: 47.218
Block 5 finished: 47.242
Block 6 finished: 47.2665
Block 7 finished: 47.3195
Block 8 finished: 47.9218
