
                            < M A T L A B (R) >
                  Copyright 1984-2020 The MathWorks, Inc.
                  R2020a (9.8.0.1323502) 64-bit (glnxa64)
                             February 25, 2020

 
To get started, type doc.
For product information, visit www.mathworks.com.
 
loading /home/mpib/LNDG/stateswitch/stsw_fmri_task/spectrum/data/standards/data/mni_icbm152_nlin_sym_09c/mni_icbm152_gm_tal_nlin_sym_09c_MNI_3mm.nii
...done
 
Processing subject 1216.
loading /home/mpib/LNDG/stateswitch/stsw_fmri_task/spectrum/../extended_preproc/data/data_clean/1216_run-1_regressed.nii
...done
 
Block 1 finished: 40.4887
Block 2 finished: 37.0958
Block 3 finished: 37.1459
Block 4 finished: 37.1515
Block 5 finished: 37.3596
Block 6 finished: 37.3364
Block 7 finished: 37.4063
Block 8 finished: 37.4451
loading /home/mpib/LNDG/stateswitch/stsw_fmri_task/spectrum/../extended_preproc/data/data_clean/1216_run-2_regressed.nii
...done
 
Block 1 finished: 37.595
Block 2 finished: 37.92
Block 3 finished: 37.858
Block 4 finished: 37.6447
Block 5 finished: 37.7017
Block 6 finished: 37.6404
Block 7 finished: 37.6943
Block 8 finished: 37.771
loading /home/mpib/LNDG/stateswitch/stsw_fmri_task/spectrum/../extended_preproc/data/data_clean/1216_run-3_regressed.nii
...done
 
Block 1 finished: 37.7306
Block 2 finished: 37.7962
Block 3 finished: 37.8349
Block 4 finished: 37.8387
Block 5 finished: 38.2383
Block 6 finished: 38.0444
Block 7 finished: 38.1186
Block 8 finished: 38.1691
loading /home/mpib/LNDG/stateswitch/stsw_fmri_task/spectrum/../extended_preproc/data/data_clean/1216_run-4_regressed.nii
...done
 
Block 1 finished: 38.2452
Block 2 finished: 38.2357
Block 3 finished: 38.3321
Block 4 finished: 38.2888
Block 5 finished: 38.3805
Block 6 finished: 38.386
Block 7 finished: 38.4203
Block 8 finished: 39.054
