
                            < M A T L A B (R) >
                  Copyright 1984-2020 The MathWorks, Inc.
                  R2020a (9.8.0.1323502) 64-bit (glnxa64)
                             February 25, 2020

 
To get started, type doc.
For product information, visit www.mathworks.com.
 
loading /home/mpib/LNDG/stateswitch/stsw_fmri_task/spectrum/data/standards/data/mni_icbm152_nlin_sym_09c/mni_icbm152_gm_tal_nlin_sym_09c_MNI_3mm.nii
...done
 
Processing subject 2201.
loading /home/mpib/LNDG/stateswitch/stsw_fmri_task/spectrum/../extended_preproc/data/data_clean/2201_run-1_regressed.nii
...done
 
Block 1 finished: 50.0501
Block 2 finished: 46.1433
Block 3 finished: 46.2447
Block 4 finished: 46.2672
Block 5 finished: 46.4129
Block 6 finished: 46.458
Block 7 finished: 46.4628
Block 8 finished: 46.5133
loading /home/mpib/LNDG/stateswitch/stsw_fmri_task/spectrum/../extended_preproc/data/data_clean/2201_run-2_regressed.nii
...done
 
Block 1 finished: 46.5554
Block 2 finished: 46.6037
Block 3 finished: 46.8505
Block 4 finished: 46.7179
Block 5 finished: 46.7027
Block 6 finished: 46.8052
Block 7 finished: 47.0946
Block 8 finished: 46.8557
loading /home/mpib/LNDG/stateswitch/stsw_fmri_task/spectrum/../extended_preproc/data/data_clean/2201_run-3_regressed.nii
...done
 
Block 1 finished: 46.8451
Block 2 finished: 46.9341
Block 3 finished: 46.9235
Block 4 finished: 46.9826
Block 5 finished: 47.3868
Block 6 finished: 47.1011
Block 7 finished: 47.166
Block 8 finished: 47.1488
loading /home/mpib/LNDG/stateswitch/stsw_fmri_task/spectrum/../extended_preproc/data/data_clean/2201_run-4_regressed.nii
...done
 
Block 1 finished: 47.2492
Block 2 finished: 47.1953
Block 3 finished: 47.241
Block 4 finished: 47.2696
Block 5 finished: 47.3193
Block 6 finished: 47.3409
Block 7 finished: 47.4009
Block 8 finished: 47.954
