
                            < M A T L A B (R) >
                  Copyright 1984-2016 The MathWorks, Inc.
                   R2016b (9.1.0.441655) 64-bit (glnxa64)
                             September 7, 2016

 
To get started, type one of these: helpwin, helpdesk, or demo.
For product information, visit www.mathworks.com.
 
loading /home/mpib/LNDG/stateswitch/stsw_fmri_task/spectrum/../pls_vartbx/data/pls/taskPLS_STSWD_VarTbx_YA_OA_3mm_1000P1000B_BfMRIbsr_lv1.img
...done
 
Processing subject 2125.
loading /home/mpib/LNDG/stateswitch/stsw_fmri_task/spectrum/../extended_preproc/data/data_clean/2125_run-1_regressed.nii
...done
 
{Undefined function or variable 'pspectrum'.

Error in L1_calcPowerPLS (line 66)
                [pxx,f] = pspectrum(curSignal,1/0.645);
} 
>> 