
                            < M A T L A B (R) >
                  Copyright 1984-2020 The MathWorks, Inc.
                  R2020a (9.8.0.1323502) 64-bit (glnxa64)
                             February 25, 2020

 
To get started, type doc.
For product information, visit www.mathworks.com.
 
loading /home/mpib/LNDG/stateswitch/stsw_fmri_task/spectrum/../pls_vartbx/data/pls/taskPLS_STSWD_VarTbx_YA_OA_3mm_1000P1000B_BfMRIbsr_lv1.img
...done
 
Processing subject 2213.
loading /home/mpib/LNDG/stateswitch/stsw_fmri_task/spectrum/../extended_preproc/data/data_clean/2213_run-1_regressed.nii
...done
 
Block 1 finished: 24.3026
Block 2 finished: 18.1076
Block 3 finished: 18.8794
Block 4 finished: 19.0254
Block 5 finished: 20.046
Block 6 finished: 20.6031
Block 7 finished: 21.1637
Block 8 finished: 20.7538
loading /home/mpib/LNDG/stateswitch/stsw_fmri_task/spectrum/../extended_preproc/data/data_clean/2213_run-2_regressed.nii
...done
 
Block 1 finished: 22.2495
Block 2 finished: 22.771
Block 3 finished: 23.2904
Block 4 finished: 22.3232
Block 5 finished: 24.2172
Block 6 finished: 24.7455
Block 7 finished: 25.189
Block 8 finished: 23.6749
loading /home/mpib/LNDG/stateswitch/stsw_fmri_task/spectrum/../extended_preproc/data/data_clean/2213_run-3_regressed.nii
...done
 
Block 1 finished: 26.3204
Block 2 finished: 27.0113
Block 3 finished: 27.7248
Block 4 finished: 25.3395
Block 5 finished: 28.8942
Block 6 finished: 30.9025
Block 7 finished: 30.9617
Block 8 finished: 29.5716
loading /home/mpib/LNDG/stateswitch/stsw_fmri_task/spectrum/../extended_preproc/data/data_clean/2213_run-4_regressed.nii
...done
 
Block 1 finished: 31.723
Block 2 finished: 34.5826
Block 3 finished: 30.7779
Block 4 finished: 33.9477
Block 5 finished: 37.4683
Block 6 finished: 36.5388
Block 7 finished: 36.1017
Block 8 finished: 43.0726
[Warning: Variable 'fftpower_merged' was not saved. For variables larger than
2GB use MAT-file version 7.3 or later.] 
[> In L1_calcPowerPLS (line 105)] 
