%!PS-Adobe-3.0 EPSF-3.0
%%Creator: (MATLAB, The Mathworks, Inc. Version 9.8.0.1323502 \(R2020a\). Operating System: Mac OS X)
%%Title: /Users/kosciessa/Desktop/tardis/LNDG/stateswitch/stsw_fmri_task/spectrum/figures/l2_exponent_drift_corr.eps
%%CreationDate: 2022-11-01T12:41:58
%%Pages: (atend)
%%BoundingBox:   -10     0   281   194
%%LanguageLevel: 3
%%EndComments
%%BeginProlog
%%BeginResource: procset (Apache XML Graphics Std ProcSet) 1.2 0
%%Version: 1.2 0
%%Copyright: (Copyright 2001-2003,2010 The Apache Software Foundation. License terms: http://www.apache.org/licenses/LICENSE-2.0)
/bd{bind def}bind def
/ld{load def}bd
/GR/grestore ld
/GS/gsave ld
/RM/rmoveto ld
/C/curveto ld
/t/show ld
/L/lineto ld
/ML/setmiterlimit ld
/CT/concat ld
/f/fill ld
/N/newpath ld
/S/stroke ld
/CC/setcmykcolor ld
/A/ashow ld
/cp/closepath ld
/RC/setrgbcolor ld
/LJ/setlinejoin ld
/GC/setgray ld
/LW/setlinewidth ld
/M/moveto ld
/re {4 2 roll M
1 index 0 rlineto
0 exch rlineto
neg 0 rlineto
cp } bd
/_ctm matrix def
/_tm matrix def
/BT { _ctm currentmatrix pop matrix _tm copy pop 0 0 moveto } bd
/ET { _ctm setmatrix } bd
/iTm { _ctm setmatrix _tm concat } bd
/Tm { _tm astore pop iTm 0 0 moveto } bd
/ux 0.0 def
/uy 0.0 def
/F {
  /Tp exch def
  /Tf exch def
  Tf findfont Tp scalefont setfont
  /cf Tf def  /cs Tp def
} bd
/ULS {currentpoint /uy exch def /ux exch def} bd
/ULE {
  /Tcx currentpoint pop def
  gsave
  newpath
  cf findfont cs scalefont dup
  /FontMatrix get 0 get /Ts exch def /FontInfo get dup
  /UnderlinePosition get Ts mul /To exch def
  /UnderlineThickness get Ts mul /Tt exch def
  ux uy To add moveto  Tcx uy To add lineto
  Tt setlinewidth stroke
  grestore
} bd
/OLE {
  /Tcx currentpoint pop def
  gsave
  newpath
  cf findfont cs scalefont dup
  /FontMatrix get 0 get /Ts exch def /FontInfo get dup
  /UnderlinePosition get Ts mul /To exch def
  /UnderlineThickness get Ts mul /Tt exch def
  ux uy To add cs add moveto Tcx uy To add cs add lineto
  Tt setlinewidth stroke
  grestore
} bd
/SOE {
  /Tcx currentpoint pop def
  gsave
  newpath
  cf findfont cs scalefont dup
  /FontMatrix get 0 get /Ts exch def /FontInfo get dup
  /UnderlinePosition get Ts mul /To exch def
  /UnderlineThickness get Ts mul /Tt exch def
  ux uy To add cs 10 mul 26 idiv add moveto Tcx uy To add cs 10 mul 26 idiv add lineto
  Tt setlinewidth stroke
  grestore
} bd
/QT {
/Y22 exch store
/X22 exch store
/Y21 exch store
/X21 exch store
currentpoint
/Y21 load 2 mul add 3 div exch
/X21 load 2 mul add 3 div exch
/X21 load 2 mul /X22 load add 3 div
/Y21 load 2 mul /Y22 load add 3 div
/X22 load /Y22 load curveto
} bd
/SSPD {
dup length /d exch dict def
{
/v exch def
/k exch def
currentpagedevice k known {
/cpdv currentpagedevice k get def
v cpdv ne {
/upd false def
/nullv v type /nulltype eq def
/nullcpdv cpdv type /nulltype eq def
nullv nullcpdv or
{
/upd true def
} {
/sametype v type cpdv type eq def
sametype {
v type /arraytype eq {
/vlen v length def
/cpdvlen cpdv length def
vlen cpdvlen eq {
0 1 vlen 1 sub {
/i exch def
/obj v i get def
/cpdobj cpdv i get def
obj cpdobj ne {
/upd true def
exit
} if
} for
} {
/upd true def
} ifelse
} {
v type /dicttype eq {
v {
/dv exch def
/dk exch def
/cpddv cpdv dk get def
dv cpddv ne {
/upd true def
exit
} if
} forall
} {
/upd true def
} ifelse
} ifelse
} if
} ifelse
upd true eq {
d k v put
} if
} if
} if
} forall
d length 0 gt {
d setpagedevice
} if
} bd
/RE { % /NewFontName [NewEncodingArray] /FontName RE -
  findfont dup length dict begin
  {
    1 index /FID ne
    {def} {pop pop} ifelse
  } forall
  /Encoding exch def
  /FontName 1 index def
  currentdict definefont pop
  end
} bind def
%%EndResource
%%BeginResource: procset (Apache XML Graphics EPS ProcSet) 1.0 0
%%Version: 1.0 0
%%Copyright: (Copyright 2002-2003 The Apache Software Foundation. License terms: http://www.apache.org/licenses/LICENSE-2.0)
/BeginEPSF { %def
/b4_Inc_state save def         % Save state for cleanup
/dict_count countdictstack def % Count objects on dict stack
/op_count count 1 sub def      % Count objects on operand stack
userdict begin                 % Push userdict on dict stack
/showpage { } def              % Redefine showpage, { } = null proc
0 setgray 0 setlinecap         % Prepare graphics state
1 setlinewidth 0 setlinejoin
10 setmiterlimit [ ] 0 setdash newpath
/languagelevel where           % If level not equal to 1 then
{pop languagelevel             % set strokeadjust and
1 ne                           % overprint to their defaults.
{false setstrokeadjust false setoverprint
} if
} if
} bd
/EndEPSF { %def
count op_count sub {pop} repeat            % Clean up stacks
countdictstack dict_count sub {end} repeat
b4_Inc_state restore
} bd
%%EndResource
%FOPBeginFontDict
%%IncludeResource: font Courier-Oblique
%%IncludeResource: font Courier-BoldOblique
%%IncludeResource: font Courier-Bold
%%IncludeResource: font ZapfDingbats
%%IncludeResource: font Symbol
%%IncludeResource: font Helvetica
%%IncludeResource: font Helvetica-Oblique
%%IncludeResource: font Helvetica-Bold
%%IncludeResource: font Helvetica-BoldOblique
%%IncludeResource: font Times-Roman
%%IncludeResource: font Times-Italic
%%IncludeResource: font Times-Bold
%%IncludeResource: font Times-BoldItalic
%%IncludeResource: font Courier
%FOPEndFontDict
%%BeginResource: encoding WinAnsiEncoding
/WinAnsiEncoding [
/.notdef /.notdef /.notdef /.notdef /.notdef
/.notdef /.notdef /.notdef /.notdef /.notdef
/.notdef /.notdef /.notdef /.notdef /.notdef
/.notdef /.notdef /.notdef /.notdef /.notdef
/.notdef /.notdef /.notdef /.notdef /.notdef
/.notdef /.notdef /.notdef /.notdef /.notdef
/.notdef /.notdef /space /exclam /quotedbl
/numbersign /dollar /percent /ampersand /quotesingle
/parenleft /parenright /asterisk /plus /comma
/hyphen /period /slash /zero /one
/two /three /four /five /six
/seven /eight /nine /colon /semicolon
/less /equal /greater /question /at
/A /B /C /D /E
/F /G /H /I /J
/K /L /M /N /O
/P /Q /R /S /T
/U /V /W /X /Y
/Z /bracketleft /backslash /bracketright /asciicircum
/underscore /quoteleft /a /b /c
/d /e /f /g /h
/i /j /k /l /m
/n /o /p /q /r
/s /t /u /v /w
/x /y /z /braceleft /bar
/braceright /asciitilde /bullet /Euro /bullet
/quotesinglbase /florin /quotedblbase /ellipsis /dagger
/daggerdbl /circumflex /perthousand /Scaron /guilsinglleft
/OE /bullet /Zcaron /bullet /bullet
/quoteleft /quoteright /quotedblleft /quotedblright /bullet
/endash /emdash /asciitilde /trademark /scaron
/guilsinglright /oe /bullet /zcaron /Ydieresis
/space /exclamdown /cent /sterling /currency
/yen /brokenbar /section /dieresis /copyright
/ordfeminine /guillemotleft /logicalnot /sfthyphen /registered
/macron /degree /plusminus /twosuperior /threesuperior
/acute /mu /paragraph /middot /cedilla
/onesuperior /ordmasculine /guillemotright /onequarter /onehalf
/threequarters /questiondown /Agrave /Aacute /Acircumflex
/Atilde /Adieresis /Aring /AE /Ccedilla
/Egrave /Eacute /Ecircumflex /Edieresis /Igrave
/Iacute /Icircumflex /Idieresis /Eth /Ntilde
/Ograve /Oacute /Ocircumflex /Otilde /Odieresis
/multiply /Oslash /Ugrave /Uacute /Ucircumflex
/Udieresis /Yacute /Thorn /germandbls /agrave
/aacute /acircumflex /atilde /adieresis /aring
/ae /ccedilla /egrave /eacute /ecircumflex
/edieresis /igrave /iacute /icircumflex /idieresis
/eth /ntilde /ograve /oacute /ocircumflex
/otilde /odieresis /divide /oslash /ugrave
/uacute /ucircumflex /udieresis /yacute /thorn
/ydieresis
] def
%%EndResource
%FOPBeginFontReencode
/Courier-Oblique findfont
dup length dict begin
  {1 index /FID ne {def} {pop pop} ifelse} forall
  /Encoding WinAnsiEncoding def
  currentdict
end
/Courier-Oblique exch definefont pop
/Courier-BoldOblique findfont
dup length dict begin
  {1 index /FID ne {def} {pop pop} ifelse} forall
  /Encoding WinAnsiEncoding def
  currentdict
end
/Courier-BoldOblique exch definefont pop
/Courier-Bold findfont
dup length dict begin
  {1 index /FID ne {def} {pop pop} ifelse} forall
  /Encoding WinAnsiEncoding def
  currentdict
end
/Courier-Bold exch definefont pop
/Helvetica findfont
dup length dict begin
  {1 index /FID ne {def} {pop pop} ifelse} forall
  /Encoding WinAnsiEncoding def
  currentdict
end
/Helvetica exch definefont pop
/Helvetica-Oblique findfont
dup length dict begin
  {1 index /FID ne {def} {pop pop} ifelse} forall
  /Encoding WinAnsiEncoding def
  currentdict
end
/Helvetica-Oblique exch definefont pop
/Helvetica-Bold findfont
dup length dict begin
  {1 index /FID ne {def} {pop pop} ifelse} forall
  /Encoding WinAnsiEncoding def
  currentdict
end
/Helvetica-Bold exch definefont pop
/Helvetica-BoldOblique findfont
dup length dict begin
  {1 index /FID ne {def} {pop pop} ifelse} forall
  /Encoding WinAnsiEncoding def
  currentdict
end
/Helvetica-BoldOblique exch definefont pop
/Times-Roman findfont
dup length dict begin
  {1 index /FID ne {def} {pop pop} ifelse} forall
  /Encoding WinAnsiEncoding def
  currentdict
end
/Times-Roman exch definefont pop
/Times-Italic findfont
dup length dict begin
  {1 index /FID ne {def} {pop pop} ifelse} forall
  /Encoding WinAnsiEncoding def
  currentdict
end
/Times-Italic exch definefont pop
/Times-Bold findfont
dup length dict begin
  {1 index /FID ne {def} {pop pop} ifelse} forall
  /Encoding WinAnsiEncoding def
  currentdict
end
/Times-Bold exch definefont pop
/Times-BoldItalic findfont
dup length dict begin
  {1 index /FID ne {def} {pop pop} ifelse} forall
  /Encoding WinAnsiEncoding def
  currentdict
end
/Times-BoldItalic exch definefont pop
/Courier findfont
dup length dict begin
  {1 index /FID ne {def} {pop pop} ifelse} forall
  /Encoding WinAnsiEncoding def
  currentdict
end
/Courier exch definefont pop
%FOPEndFontReencode
%%EndProlog
%%Page: 1 1
%%PageBoundingBox: 0 0 227 198
%%BeginPageSetup
[1 0 0 -1 0 198] CT
%%EndPageSetup
GS
[0.99899 0 0 1.00215 0 -0.4252] CT
N
0 0 M
227 0 L
227 198 L
0 198 L
0 0 L
cp
clip
1 GC
N
0 0 227 198 re
f
GR
GS
[0.99899 0 0 1.00215 0 -0.4252] CT
1 GC
N
0 0 227 198 re
f
GR
GS
[0.99899 0 0 1.00215 0 -0.4252] CT
1 GC
N
61 160.5 M
205.5 160.5 L
205.5 21 L
61 21 L
cp
f
GR
GS
[0.99899 0 0 1.00215 0 -0.4252] CT
0.149 GC
2 setlinecap
1 LJ
0.5 LW
N
61 160.5 M
205.5 160.5 L
S
GR
GS
[0.99899 0 0 1.00215 0 -0.4252] CT
0.149 GC
2 setlinecap
1 LJ
0.5 LW
N
90.989 160.5 M
90.989 159.055 L
S
GR
GS
[0.99899 0 0 1.00215 0 -0.4252] CT
0.149 GC
2 setlinecap
1 LJ
0.5 LW
N
144.351 160.5 M
144.351 159.055 L
S
GR
GS
[0.99899 0 0 1.00215 0 -0.4252] CT
0.149 GC
2 setlinecap
1 LJ
0.5 LW
N
197.713 160.5 M
197.713 159.055 L
S
GR
GS
[0.99899 0 0 1.00215 90.89766 165.22978] CT
0.149 GC
/Helvetica 14 F
GS
[1 0 0 1 0 0] CT
-4 14 moveto 
1 -1 scale
(0) t 
GR
GR
GS
[0.99899 0 0 1.00215 144.20567 165.22978] CT
0.149 GC
/Helvetica 14 F
GS
[1 0 0 1 0 0] CT
-8 14 moveto 
1 -1 scale
(20) t 
GR
GR
GS
[0.99899 0 0 1.00215 197.5137 165.22978] CT
0.149 GC
/Helvetica 14 F
GS
[1 0 0 1 0 0] CT
-8 14 moveto 
1 -1 scale
(40) t 
GR
GR
GS
[0.99899 0 0 1.00215 133.11604 182.26629] CT
0.149 GC
/Helvetica 14 F
GS
[1 0 0 1 0 0] CT
-32 14 moveto 
1 -1 scale
(exp. mod.) t 
GR
GR
GS
[0.99899 0 0 1.00215 0 -0.4252] CT
0.149 GC
2 setlinecap
1 LJ
0.5 LW
N
61 160.5 M
61 21 L
S
GR
GS
[0.99899 0 0 1.00215 0 -0.4252] CT
0.149 GC
2 setlinecap
1 LJ
0.5 LW
N
61 148.366 M
62.445 148.366 L
S
GR
GS
[0.99899 0 0 1.00215 0 -0.4252] CT
0.149 GC
2 setlinecap
1 LJ
0.5 LW
N
61 119.912 M
62.445 119.912 L
S
GR
GS
[0.99899 0 0 1.00215 0 -0.4252] CT
0.149 GC
2 setlinecap
1 LJ
0.5 LW
N
61 91.458 M
62.445 91.458 L
S
GR
GS
[0.99899 0 0 1.00215 0 -0.4252] CT
0.149 GC
2 setlinecap
1 LJ
0.5 LW
N
61 63.004 M
62.445 63.004 L
S
GR
GS
[0.99899 0 0 1.00215 0 -0.4252] CT
0.149 GC
2 setlinecap
1 LJ
0.5 LW
N
61 34.55 M
62.445 34.55 L
S
GR
GS
[0.99899 0 0 1.00215 56.14346 148.25907] CT
0.149 GC
/Helvetica 14 F
GS
[1 0 0 1 0 0] CT
-8 5.5 moveto 
1 -1 scale
(0) t 
GR
GR
GS
[0.99899 0 0 1.00215 56.14346 119.74408] CT
0.149 GC
/Helvetica 14 F
GS
[1 0 0 1 0 0] CT
-20 5.5 moveto 
1 -1 scale
(0.5) t 
GR
GR
GS
[0.99899 0 0 1.00215 56.14346 91.2291] CT
0.149 GC
/Helvetica 14 F
GS
[1 0 0 1 0 0] CT
-8 5.5 moveto 
1 -1 scale
(1) t 
GR
GR
GS
[0.99899 0 0 1.00215 56.14346 62.71411] CT
0.149 GC
/Helvetica 14 F
GS
[1 0 0 1 0 0] CT
-20 5.5 moveto 
1 -1 scale
(1.5) t 
GR
GR
GS
[0.99899 0 0 1.00215 56.14346 34.19912] CT
0.149 GC
/Helvetica 14 F
GS
[1 0 0 1 0 0] CT
-8 5.5 moveto 
1 -1 scale
(2) t 
GR
GR
GS
[0 -1.00215 0.99899 0 33.6661 90.51961] CT
0.149 GC
/Helvetica 14 F
GS
[1 0 0 1 0 0] CT
-26.5 -20 moveto 
1 -1 scale
(drift rate) t 
GR
GR
GS
[0 -1.00215 0.99899 0 33.6661 90.51961] CT
0.149 GC
/Helvetica 14 F
GS
[1 0 0 1 0 0] CT
-17 -3 moveto 
1 -1 scale
(\(avg.\)) t 
GR
GR
GS
[0.99899 0 0 1.00215 133.11608 18.85983] CT
/Helvetica-Bold 14 F
GS
[1 0 0 1 0 0] CT
-145 -4 moveto 
1 -1 scale
(r\(95\) = 0.67, 95%CI = [0.54,0.77], p = 5.5e-14) t 
GR
GR
GS
[0.99899 0 0 1.00215 105.54911 62.72448] CT
0.702 0.2 0.2 RC
N
0.5 0 M
0.5 -0.276 0.276 -0.5 0 -0.5 C
-0.276 -0.5 -0.5 -0.276 -0.5 0 C
-0.5 0.276 -0.276 0.5 0 0.5 C
0.276 0.5 0.5 0.276 0.5 0 C
cp
f
GR
GS
[0.99899 0 0 1.00215 95.10509 90.45368] CT
0.702 0.2 0.2 RC
N
/f-2105962265{0.5 0 M
0.5 -0.276 0.276 -0.5 0 -0.5 C
-0.276 -0.5 -0.5 -0.276 -0.5 0 C
-0.5 0.276 -0.276 0.5 0 0.5 C
0.276 0.5 0.5 0.276 0.5 0 C
cp}def
f-2105962265
f
GR
GS
[0.99899 0 0 1.00215 129.71887 67.00608] CT
0.702 0.2 0.2 RC
N
f-2105962265
f
GR
GS
[0.99899 0 0 1.00215 131.73109 56.39441] CT
0.702 0.2 0.2 RC
N
f-2105962265
f
GR
GS
[0.99899 0 0 1.00215 107.27016 89.16581] CT
0.702 0.2 0.2 RC
N
f-2105962265
f
GR
GS
[0.99899 0 0 1.00215 95.2088 99.23516] CT
0.702 0.2 0.2 RC
N
f-2105962265
f
GR
GS
[0.99899 0 0 1.00215 82.51354 56.16934] CT
0.702 0.2 0.2 RC
N
f-2105962265
f
GR
GS
[0.99899 0 0 1.00215 193.26372 63.3752] CT
0.702 0.2 0.2 RC
N
f-2105962265
f
GR
GS
[0.99899 0 0 1.00215 134.71094 50.74157] CT
0.702 0.2 0.2 RC
N
f-2105962265
f
GR
GS
[0.99899 0 0 1.00215 96.73178 84.65673] CT
0.702 0.2 0.2 RC
N
f-2105962265
f
GR
GS
[0.99899 0 0 1.00215 107.14363 68.02352] CT
0.702 0.2 0.2 RC
N
f-2105962265
f
GR
GS
[0.99899 0 0 1.00215 126.0106 73.56804] CT
0.702 0.2 0.2 RC
N
f-2105962265
f
GR
GS
[0.99899 0 0 1.00215 137.69274 63.18674] CT
0.702 0.2 0.2 RC
N
f-2105962265
f
GR
GS
[0.99899 0 0 1.00215 128.57925 72.18867] CT
0.702 0.2 0.2 RC
N
f-2105962265
f
GR
GS
[0.99899 0 0 1.00215 113.60326 54.3192] CT
0.702 0.2 0.2 RC
N
f-2105962265
f
GR
GS
[0.99899 0 0 1.00215 110.747 95.37957] CT
0.702 0.2 0.2 RC
N
f-2105962265
f
GR
GS
[0.99899 0 0 1.00215 85.09999 130.33098] CT
0.702 0.2 0.2 RC
N
f-2105962265
f
GR
GS
[0.99899 0 0 1.00215 105.77187 89.45552] CT
0.702 0.2 0.2 RC
N
f-2105962265
f
GR
GS
[0.99899 0 0 1.00215 136.48009 61.41177] CT
0.702 0.2 0.2 RC
N
f-2105962265
f
GR
GS
[0.99899 0 0 1.00215 121.164 58.73609] CT
0.702 0.2 0.2 RC
N
f-2105962265
f
GR
GS
[0.99899 0 0 1.00215 86.91489 83.90303] CT
0.702 0.2 0.2 RC
N
f-2105962265
f
GR
GS
[0.99899 0 0 1.00215 108.88141 88.04046] CT
0.702 0.2 0.2 RC
N
f-2105962265
f
GR
GS
[0.99899 0 0 1.00215 121.37151 54.33619] CT
0.702 0.2 0.2 RC
N
f-2105962265
f
GR
GS
[0.99899 0 0 1.00215 93.58225 86.17046] CT
0.702 0.2 0.2 RC
N
f-2105962265
f
GR
GS
[0.99899 0 0 1.00215 100.6379 103.90585] CT
0.702 0.2 0.2 RC
N
f-2105962265
f
GR
GS
[0.99899 0 0 1.00215 128.61292 69.41746] CT
0.702 0.2 0.2 RC
N
f-2105962265
f
GR
GS
[0.99899 0 0 1.00215 115.48226 42.54363] CT
0.702 0.2 0.2 RC
N
f-2105962265
f
GR
GS
[0.99899 0 0 1.00215 79.2222 103.31748] CT
0.702 0.2 0.2 RC
N
f-2105962265
f
GR
GS
[0.99899 0 0 1.00215 94.45489 73.40409] CT
0.702 0.2 0.2 RC
N
f-2105962265
f
GR
GS
[0.99899 0 0 1.00215 115.69989 64.50724] CT
0.702 0.2 0.2 RC
N
f-2105962265
f
GR
GS
[0.99899 0 0 1.00215 106.87926 57.97253] CT
0.702 0.2 0.2 RC
N
f-2105962265
f
GR
GS
[0.99899 0 0 1.00215 98.55811 91.70128] CT
0.702 0.2 0.2 RC
N
f-2105962265
f
GR
GS
[0.99899 0 0 1.00215 167.79899 58.44868] CT
0.702 0.2 0.2 RC
N
f-2105962265
f
GR
GS
[0.99899 0 0 1.00215 138.52294 34.10564] CT
0.702 0.2 0.2 RC
N
f-2105962265
f
GR
GS
[0.99899 0 0 1.00215 153.56351 52.85102] CT
0.702 0.2 0.2 RC
N
f-2105962265
f
GR
GS
[0.99899 0 0 1.00215 142.52816 45.60563] CT
0.702 0.2 0.2 RC
N
f-2105962265
f
GR
GS
[0.99899 0 0 1.00215 91.99378 71.71619] CT
0.702 0.2 0.2 RC
N
f-2105962265
f
GR
GS
[0.99899 0 0 1.00215 183.31328 32.26986] CT
0.702 0.2 0.2 RC
N
f-2105962265
f
GR
GS
[0.99899 0 0 1.00215 190.488 79.1426] CT
0.702 0.2 0.2 RC
N
f-2105962265
f
GR
GS
[0.99899 0 0 1.00215 105.97256 45.21453] CT
0.702 0.2 0.2 RC
N
f-2105962265
f
GR
GS
[0.99899 0 0 1.00215 111.01938 90.50779] CT
0.702 0.2 0.2 RC
N
f-2105962265
f
GR
GS
[0.99899 0 0 1.00215 106.94088 72.02256] CT
0.702 0.2 0.2 RC
N
f-2105962265
f
GR
GS
[0.99899 0 0 1.00215 83.55195 75.65859] CT
0.702 0.2 0.2 RC
N
f-2105962265
f
GR
GS
[0.99899 0 0 1.00215 127.25836 50.69754] CT
0.702 0.2 0.2 RC
N
f-2105962265
f
GR
GS
[0.99899 0 0 1.00215 97.14704 125.68079] CT
0.702 0.2 0.2 RC
N
f-2105962265
f
GR
GS
[0.99899 0 0 1.00215 84.76144 122.70511] CT
0.702 0.2 0.2 RC
N
f-2105962265
f
GR
GS
[0.99899 0 0 1.00215 98.59104 94.12532] CT
0.702 0.2 0.2 RC
N
f-2105962265
f
GR
GS
[0.99899 0 0 1.00215 89.84236 147.27092] CT
0.702 0.2 0.2 RC
N
f-2105962265
f
GR
GS
[0.99899 0 0 1.00215 72.96819 106.53149] CT
0.702 0.2 0.2 RC
N
f-2105962265
f
GR
GS
[0.99899 0 0 1.00215 99.19586 124.46712] CT
0.702 0.2 0.2 RC
N
f-2105962265
f
GR
GS
[0.99899 0 0 1.00215 83.66371 91.11002] CT
0.702 0.2 0.2 RC
N
f-2105962265
f
GR
GS
[0.99899 0 0 1.00215 87.23946 118.50969] CT
0.702 0.2 0.2 RC
N
f-2105962265
f
GR
GS
[0.99899 0 0 1.00215 91.48212 119.81409] CT
0.702 0.2 0.2 RC
N
f-2105962265
f
GR
GS
[0.99899 0 0 1.00215 98.40595 102.86694] CT
0.702 0.2 0.2 RC
N
f-2105962265
f
GR
GS
[0.99899 0 0 1.00215 93.11876 109.67142] CT
0.702 0.2 0.2 RC
N
f-2105962265
f
GR
GS
[0.99899 0 0 1.00215 73.61804 125.89066] CT
0.702 0.2 0.2 RC
N
f-2105962265
f
GR
GS
[0.99899 0 0 1.00215 90.99871 94.21351] CT
0.702 0.2 0.2 RC
N
f-2105962265
f
GR
GS
[0.99899 0 0 1.00215 86.37558 103.34819] CT
0.702 0.2 0.2 RC
N
f-2105962265
f
GR
GS
[0.99899 0 0 1.00215 101.97272 106.49823] CT
0.702 0.2 0.2 RC
N
f-2105962265
f
GR
GS
[0.99899 0 0 1.00215 74.30575 105.41038] CT
0.702 0.2 0.2 RC
N
f-2105962265
f
GR
GS
[0.99899 0 0 1.00215 83.53996 106.0364] CT
0.702 0.2 0.2 RC
N
f-2105962265
f
GR
GS
[0.99899 0 0 1.00215 89.45219 116.81634] CT
0.702 0.2 0.2 RC
N
f-2105962265
f
GR
GS
[0.99899 0 0 1.00215 83.35361 111.12688] CT
0.702 0.2 0.2 RC
N
f-2105962265
f
GR
GS
[0.99899 0 0 1.00215 90.59723 132.14136] CT
0.702 0.2 0.2 RC
N
f-2105962265
f
GR
GS
[0.99899 0 0 1.00215 82.85671 115.55278] CT
0.702 0.2 0.2 RC
N
f-2105962265
f
GR
GS
[0.99899 0 0 1.00215 78.08062 117.81401] CT
0.702 0.2 0.2 RC
N
f-2105962265
f
GR
GS
[0.99899 0 0 1.00215 87.87289 115.76084] CT
0.702 0.2 0.2 RC
N
f-2105962265
f
GR
GS
[0.99899 0 0 1.00215 84.94429 112.38776] CT
0.702 0.2 0.2 RC
N
f-2105962265
f
GR
GS
[0.99899 0 0 1.00215 79.33465 115.59622] CT
0.702 0.2 0.2 RC
N
f-2105962265
f
GR
GS
[0.99899 0 0 1.00215 79.93123 98.05393] CT
0.702 0.2 0.2 RC
N
f-2105962265
f
GR
GS
[0.99899 0 0 1.00215 100.22959 94.17042] CT
0.702 0.2 0.2 RC
N
f-2105962265
f
GR
GS
[0.99899 0 0 1.00215 87.44102 112.26745] CT
0.702 0.2 0.2 RC
N
f-2105962265
f
GR
GS
[0.99899 0 0 1.00215 83.28536 114.21657] CT
0.702 0.2 0.2 RC
N
f-2105962265
f
GR
GS
[0.99899 0 0 1.00215 82.80634 113.92854] CT
0.702 0.2 0.2 RC
N
f-2105962265
f
GR
GS
[0.99899 0 0 1.00215 94.50943 124.91565] CT
0.702 0.2 0.2 RC
N
f-2105962265
f
GR
GS
[0.99899 0 0 1.00215 81.54014 97.17916] CT
0.702 0.2 0.2 RC
N
f-2105962265
f
GR
GS
[0.99899 0 0 1.00215 82.86062 127.59488] CT
0.702 0.2 0.2 RC
N
f-2105962265
f
GR
GS
[0.99899 0 0 1.00215 91.9086 120.22363] CT
0.702 0.2 0.2 RC
N
f-2105962265
f
GR
GS
[0.99899 0 0 1.00215 99.09112 104.02441] CT
0.702 0.2 0.2 RC
N
f-2105962265
f
GR
GS
[0.99899 0 0 1.00215 97.43895 148.7695] CT
0.702 0.2 0.2 RC
N
f-2105962265
f
GR
GS
[0.99899 0 0 1.00215 80.5628 125.55824] CT
0.702 0.2 0.2 RC
N
f-2105962265
f
GR
GS
[0.99899 0 0 1.00215 96.5183 126.62661] CT
0.702 0.2 0.2 RC
N
f-2105962265
f
GR
GS
[0.99899 0 0 1.00215 94.39652 103.26875] CT
0.702 0.2 0.2 RC
N
f-2105962265
f
GR
GS
[0.99899 0 0 1.00215 85.70262 105.52631] CT
0.702 0.2 0.2 RC
N
f-2105962265
f
GR
GS
[0.99899 0 0 1.00215 78.69285 140.41747] CT
0.702 0.2 0.2 RC
N
f-2105962265
f
GR
GS
[0.99899 0 0 1.00215 85.5612 136.80671] CT
0.702 0.2 0.2 RC
N
f-2105962265
f
GR
GS
[0.99899 0 0 1.00215 77.40944 113.70756] CT
0.702 0.2 0.2 RC
N
f-2105962265
f
GR
GS
[0.99899 0 0 1.00215 103.79315 109.64099] CT
0.702 0.2 0.2 RC
N
f-2105962265
f
GR
GS
[0.99899 0 0 1.00215 100.27982 116.81644] CT
0.702 0.2 0.2 RC
N
f-2105962265
f
GR
GS
[0.99899 0 0 1.00215 83.47635 116.25129] CT
0.702 0.2 0.2 RC
N
f-2105962265
f
GR
GS
[0.99899 0 0 1.00215 94.05583 107.99521] CT
0.702 0.2 0.2 RC
N
f-2105962265
f
GR
GS
[0.99899 0 0 1.00215 106.9943 111.46746] CT
0.702 0.2 0.2 RC
N
f-2105962265
f
GR
GS
[0.99899 0 0 1.00215 83.42607 104.70621] CT
0.702 0.2 0.2 RC
N
f-2105962265
f
GR
GS
[0.99899 0 0 1.00215 75.77525 92.86129] CT
0.702 0.2 0.2 RC
N
f-2105962265
f
GR
GS
[0.99899 0 0 1.00215 87.81112 87.81429] CT
0.702 0.2 0.2 RC
N
f-2105962265
f
GR
GS
[0.99899 0 0 1.00215 96.85107 126.50531] CT
0.702 0.2 0.2 RC
N
f-2105962265
f
GR
GS
[0.99899 0 0 1.00215 81.34262 119.71897] CT
0.702 0.2 0.2 RC
N
f-2105962265
f
GR
GS
[0.99899 0 0 1.00215 0 -0.4252] CT
0.8 0.302 0.302 RC
1 LJ
3 LW
N
64.308 122.709 M
197.713 23.029 L
S
GR
GS
[0.99899 0 0 1.00215 105.54911 62.72448] CT
0.898 0.4 0.4 RC
N
/f227889816{-3 -3 M
-3 3 L
3 3 L
3 -3 L
cp}def
f227889816
f
GR
GS
[0.99899 0 0 1.00215 95.10509 90.45368] CT
0.898 0.4 0.4 RC
N
f227889816
f
GR
GS
[0.99899 0 0 1.00215 129.71887 67.00608] CT
0.898 0.4 0.4 RC
N
f227889816
f
GR
GS
[0.99899 0 0 1.00215 131.73109 56.39441] CT
0.898 0.4 0.4 RC
N
f227889816
f
GR
GS
[0.99899 0 0 1.00215 107.27016 89.16581] CT
0.898 0.4 0.4 RC
N
f227889816
f
GR
GS
[0.99899 0 0 1.00215 95.2088 99.23516] CT
0.898 0.4 0.4 RC
N
f227889816
f
GR
GS
[0.99899 0 0 1.00215 82.51354 56.16934] CT
0.898 0.4 0.4 RC
N
f227889816
f
GR
GS
[0.99899 0 0 1.00215 193.26372 63.3752] CT
0.898 0.4 0.4 RC
N
f227889816
f
GR
GS
[0.99899 0 0 1.00215 134.71094 50.74157] CT
0.898 0.4 0.4 RC
N
f227889816
f
GR
GS
[0.99899 0 0 1.00215 96.73178 84.65673] CT
0.898 0.4 0.4 RC
N
f227889816
f
GR
GS
[0.99899 0 0 1.00215 107.14363 68.02352] CT
0.898 0.4 0.4 RC
N
f227889816
f
GR
GS
[0.99899 0 0 1.00215 126.0106 73.56804] CT
0.898 0.4 0.4 RC
N
f227889816
f
GR
GS
[0.99899 0 0 1.00215 137.69274 63.18674] CT
0.898 0.4 0.4 RC
N
f227889816
f
GR
GS
[0.99899 0 0 1.00215 128.57925 72.18867] CT
0.898 0.4 0.4 RC
N
f227889816
f
GR
GS
[0.99899 0 0 1.00215 113.60326 54.3192] CT
0.898 0.4 0.4 RC
N
f227889816
f
GR
GS
[0.99899 0 0 1.00215 110.747 95.37957] CT
0.898 0.4 0.4 RC
N
f227889816
f
GR
GS
[0.99899 0 0 1.00215 85.09999 130.33098] CT
0.898 0.4 0.4 RC
N
f227889816
f
GR
GS
[0.99899 0 0 1.00215 105.77187 89.45552] CT
0.898 0.4 0.4 RC
N
f227889816
f
GR
GS
[0.99899 0 0 1.00215 136.48009 61.41177] CT
0.898 0.4 0.4 RC
N
f227889816
f
GR
GS
[0.99899 0 0 1.00215 121.164 58.73609] CT
0.898 0.4 0.4 RC
N
f227889816
f
GR
GS
[0.99899 0 0 1.00215 86.91489 83.90303] CT
0.898 0.4 0.4 RC
N
f227889816
f
GR
GS
[0.99899 0 0 1.00215 108.88141 88.04046] CT
0.898 0.4 0.4 RC
N
f227889816
f
GR
GS
[0.99899 0 0 1.00215 121.37151 54.33619] CT
0.898 0.4 0.4 RC
N
f227889816
f
GR
GS
[0.99899 0 0 1.00215 93.58225 86.17046] CT
0.898 0.4 0.4 RC
N
f227889816
f
GR
GS
[0.99899 0 0 1.00215 100.6379 103.90585] CT
0.898 0.4 0.4 RC
N
f227889816
f
GR
GS
[0.99899 0 0 1.00215 128.61292 69.41746] CT
0.898 0.4 0.4 RC
N
f227889816
f
GR
GS
[0.99899 0 0 1.00215 115.48226 42.54363] CT
0.898 0.4 0.4 RC
N
f227889816
f
GR
GS
[0.99899 0 0 1.00215 79.2222 103.31748] CT
0.898 0.4 0.4 RC
N
f227889816
f
GR
GS
[0.99899 0 0 1.00215 94.45489 73.40409] CT
0.898 0.4 0.4 RC
N
f227889816
f
GR
GS
[0.99899 0 0 1.00215 115.69989 64.50724] CT
0.898 0.4 0.4 RC
N
f227889816
f
GR
GS
[0.99899 0 0 1.00215 106.87926 57.97253] CT
0.898 0.4 0.4 RC
N
f227889816
f
GR
GS
[0.99899 0 0 1.00215 98.55811 91.70128] CT
0.898 0.4 0.4 RC
N
f227889816
f
GR
GS
[0.99899 0 0 1.00215 167.79899 58.44868] CT
0.898 0.4 0.4 RC
N
f227889816
f
GR
GS
[0.99899 0 0 1.00215 138.52294 34.10564] CT
0.898 0.4 0.4 RC
N
f227889816
f
GR
GS
[0.99899 0 0 1.00215 153.56351 52.85102] CT
0.898 0.4 0.4 RC
N
f227889816
f
GR
GS
[0.99899 0 0 1.00215 142.52816 45.60563] CT
0.898 0.4 0.4 RC
N
f227889816
f
GR
GS
[0.99899 0 0 1.00215 91.99378 71.71619] CT
0.898 0.4 0.4 RC
N
f227889816
f
GR
GS
[0.99899 0 0 1.00215 183.31328 32.26986] CT
0.898 0.4 0.4 RC
N
f227889816
f
GR
GS
[0.99899 0 0 1.00215 190.488 79.1426] CT
0.898 0.4 0.4 RC
N
f227889816
f
GR
GS
[0.99899 0 0 1.00215 105.97256 45.21453] CT
0.898 0.4 0.4 RC
N
f227889816
f
GR
GS
[0.99899 0 0 1.00215 111.01938 90.50779] CT
0.898 0.4 0.4 RC
N
f227889816
f
GR
GS
[0.99899 0 0 1.00215 106.94088 72.02256] CT
0.898 0.4 0.4 RC
N
f227889816
f
GR
GS
[0.99899 0 0 1.00215 83.55195 75.65859] CT
0.898 0.4 0.4 RC
N
f227889816
f
GR
GS
[0.99899 0 0 1.00215 127.25836 50.69754] CT
0.898 0.4 0.4 RC
N
f227889816
f
GR
GS
[0.99899 0 0 1.00215 97.14704 125.68079] CT
0.702 0.2 0.2 RC
N
/f-1969333140{-3.536 0 M
0 4.702 L
3.536 0 L
0 -4.702 L
cp}def
f-1969333140
f
GR
GS
[0.99899 0 0 1.00215 84.76144 122.70511] CT
0.702 0.2 0.2 RC
N
f-1969333140
f
GR
GS
[0.99899 0 0 1.00215 98.59104 94.12532] CT
0.702 0.2 0.2 RC
N
f-1969333140
f
GR
GS
[0.99899 0 0 1.00215 89.84236 147.27092] CT
0.702 0.2 0.2 RC
N
f-1969333140
f
GR
GS
[0.99899 0 0 1.00215 72.96819 106.53149] CT
0.702 0.2 0.2 RC
N
f-1969333140
f
GR
GS
[0.99899 0 0 1.00215 99.19586 124.46712] CT
0.702 0.2 0.2 RC
N
f-1969333140
f
GR
GS
[0.99899 0 0 1.00215 83.66371 91.11002] CT
0.702 0.2 0.2 RC
N
f-1969333140
f
GR
GS
[0.99899 0 0 1.00215 87.23946 118.50969] CT
0.702 0.2 0.2 RC
N
f-1969333140
f
GR
GS
[0.99899 0 0 1.00215 91.48212 119.81409] CT
0.702 0.2 0.2 RC
N
f-1969333140
f
GR
GS
[0.99899 0 0 1.00215 98.40595 102.86694] CT
0.702 0.2 0.2 RC
N
f-1969333140
f
GR
GS
[0.99899 0 0 1.00215 93.11876 109.67142] CT
0.702 0.2 0.2 RC
N
f-1969333140
f
GR
GS
[0.99899 0 0 1.00215 73.61804 125.89066] CT
0.702 0.2 0.2 RC
N
f-1969333140
f
GR
GS
[0.99899 0 0 1.00215 90.99871 94.21351] CT
0.702 0.2 0.2 RC
N
f-1969333140
f
GR
GS
[0.99899 0 0 1.00215 86.37558 103.34819] CT
0.702 0.2 0.2 RC
N
f-1969333140
f
GR
GS
[0.99899 0 0 1.00215 101.97272 106.49823] CT
0.702 0.2 0.2 RC
N
f-1969333140
f
GR
GS
[0.99899 0 0 1.00215 74.30575 105.41038] CT
0.702 0.2 0.2 RC
N
f-1969333140
f
GR
GS
[0.99899 0 0 1.00215 83.53996 106.0364] CT
0.702 0.2 0.2 RC
N
f-1969333140
f
GR
GS
[0.99899 0 0 1.00215 89.45219 116.81634] CT
0.702 0.2 0.2 RC
N
f-1969333140
f
GR
GS
[0.99899 0 0 1.00215 83.35361 111.12688] CT
0.702 0.2 0.2 RC
N
f-1969333140
f
GR
GS
[0.99899 0 0 1.00215 90.59723 132.14136] CT
0.702 0.2 0.2 RC
N
f-1969333140
f
GR
GS
[0.99899 0 0 1.00215 82.85671 115.55278] CT
0.702 0.2 0.2 RC
N
f-1969333140
f
GR
GS
[0.99899 0 0 1.00215 78.08062 117.81401] CT
0.702 0.2 0.2 RC
N
f-1969333140
f
GR
GS
[0.99899 0 0 1.00215 87.87289 115.76084] CT
0.702 0.2 0.2 RC
N
f-1969333140
f
GR
GS
[0.99899 0 0 1.00215 84.94429 112.38776] CT
0.702 0.2 0.2 RC
N
f-1969333140
f
GR
GS
[0.99899 0 0 1.00215 79.33465 115.59622] CT
0.702 0.2 0.2 RC
N
f-1969333140
f
GR
GS
[0.99899 0 0 1.00215 79.93123 98.05393] CT
0.702 0.2 0.2 RC
N
f-1969333140
f
GR
GS
[0.99899 0 0 1.00215 100.22959 94.17042] CT
0.702 0.2 0.2 RC
N
f-1969333140
f
GR
GS
[0.99899 0 0 1.00215 87.44102 112.26745] CT
0.702 0.2 0.2 RC
N
f-1969333140
f
GR
GS
[0.99899 0 0 1.00215 83.28536 114.21657] CT
0.702 0.2 0.2 RC
N
f-1969333140
f
GR
GS
[0.99899 0 0 1.00215 82.80634 113.92854] CT
0.702 0.2 0.2 RC
N
f-1969333140
f
GR
GS
[0.99899 0 0 1.00215 94.50943 124.91565] CT
0.702 0.2 0.2 RC
N
f-1969333140
f
GR
GS
[0.99899 0 0 1.00215 81.54014 97.17916] CT
0.702 0.2 0.2 RC
N
f-1969333140
f
GR
GS
[0.99899 0 0 1.00215 82.86062 127.59488] CT
0.702 0.2 0.2 RC
N
f-1969333140
f
GR
GS
[0.99899 0 0 1.00215 91.9086 120.22363] CT
0.702 0.2 0.2 RC
N
f-1969333140
f
GR
GS
[0.99899 0 0 1.00215 99.09112 104.02441] CT
0.702 0.2 0.2 RC
N
f-1969333140
f
GR
GS
[0.99899 0 0 1.00215 97.43895 148.7695] CT
0.702 0.2 0.2 RC
N
f-1969333140
f
GR
GS
[0.99899 0 0 1.00215 80.5628 125.55824] CT
0.702 0.2 0.2 RC
N
f-1969333140
f
GR
GS
[0.99899 0 0 1.00215 96.5183 126.62661] CT
0.702 0.2 0.2 RC
N
f-1969333140
f
GR
GS
[0.99899 0 0 1.00215 94.39652 103.26875] CT
0.702 0.2 0.2 RC
N
f-1969333140
f
GR
GS
[0.99899 0 0 1.00215 85.70262 105.52631] CT
0.702 0.2 0.2 RC
N
f-1969333140
f
GR
GS
[0.99899 0 0 1.00215 78.69285 140.41747] CT
0.702 0.2 0.2 RC
N
f-1969333140
f
GR
GS
[0.99899 0 0 1.00215 85.5612 136.80671] CT
0.702 0.2 0.2 RC
N
f-1969333140
f
GR
GS
[0.99899 0 0 1.00215 77.40944 113.70756] CT
0.702 0.2 0.2 RC
N
f-1969333140
f
GR
GS
[0.99899 0 0 1.00215 103.79315 109.64099] CT
0.702 0.2 0.2 RC
N
f-1969333140
f
GR
GS
[0.99899 0 0 1.00215 100.27982 116.81644] CT
0.702 0.2 0.2 RC
N
f-1969333140
f
GR
GS
[0.99899 0 0 1.00215 83.47635 116.25129] CT
0.702 0.2 0.2 RC
N
f-1969333140
f
GR
GS
[0.99899 0 0 1.00215 94.05583 107.99521] CT
0.702 0.2 0.2 RC
N
f-1969333140
f
GR
GS
[0.99899 0 0 1.00215 106.9943 111.46746] CT
0.702 0.2 0.2 RC
N
f-1969333140
f
GR
GS
[0.99899 0 0 1.00215 83.42607 104.70621] CT
0.702 0.2 0.2 RC
N
f-1969333140
f
GR
GS
[0.99899 0 0 1.00215 75.77525 92.86129] CT
0.702 0.2 0.2 RC
N
f-1969333140
f
GR
GS
[0.99899 0 0 1.00215 87.81112 87.81429] CT
0.702 0.2 0.2 RC
N
f-1969333140
f
GR
GS
[0.99899 0 0 1.00215 96.85107 126.50531] CT
0.702 0.2 0.2 RC
N
f-1969333140
f
GR
GS
[0.99899 0 0 1.00215 81.34262 119.71897] CT
0.702 0.2 0.2 RC
N
f-1969333140
f
GR
%%Trailer
%%Pages: 1
%%EOF
