L3_runFOOOF.py
/home/mpib/LNDG/stateswitch/stsw_fmri_task/spectrum
2203
Setting up paths ...

Loading backgrounds from .mat ...

Running FOOOFGroup across 4 power spectra.
==================================================================================================
                                                                                                  
                                       FOOOF - GROUP RESULTS                                      
                                                                                                  
                             Number of power spectra in the Group: 4                              
                                                                                                  
                        The model was run on the frequency range 0 - 1 Hz                         
                                 Frequency Resolution is 0.00 Hz                                  
                                                                                                  
                              Power spectra were fit without a knee.                              
                                                                                                  
                                      Aperiodic Fit Values:                                       
                        Exponents - Min:  0.716, Max:  0.764, Mean: 0.733                         
                                                                                                  
                          In total 4 peaks were extracted from the group                          
                                                                                                  
                                     Goodness of fit metrics:                                     
                            R2s -  Min:  0.932, Max:  0.951, Mean: 0.941                          
                         Errors -  Min:  0.043, Max:  0.051, Mean: 0.047                          
                                                                                                  
==================================================================================================
2203Done!
