
                            < M A T L A B (R) >
                  Copyright 1984-2020 The MathWorks, Inc.
                  R2020a (9.8.0.1323502) 64-bit (glnxa64)
                             February 25, 2020

 
To get started, type doc.
For product information, visit www.mathworks.com.
 
loading /home/mpib/LNDG/stateswitch/stsw_fmri_task/spectrum/../pls_vartbx/data/pls/taskPLS_STSWD_VarTbx_YA_OA_3mm_1000P1000B_BfMRIbsr_lv1.img
...done
 
Processing subject 1124.
loading /home/mpib/LNDG/stateswitch/stsw_fmri_task/spectrum/../extended_preproc/data/data_clean/1124_run-1_regressed.nii
...done
 
Block 1 finished: 18.6902
Block 2 finished: 18.1222
Block 3 finished: 18.8787
Block 4 finished: 19.0123
Block 5 finished: 19.9962
Block 6 finished: 20.5289
Block 7 finished: 21.0826
Block 8 finished: 20.7047
loading /home/mpib/LNDG/stateswitch/stsw_fmri_task/spectrum/../extended_preproc/data/data_clean/1124_run-2_regressed.nii
...done
 
Block 1 finished: 22.0248
Block 2 finished: 22.5106
Block 3 finished: 23.0022
Block 4 finished: 22.0285
Block 5 finished: 24.0067
Block 6 finished: 24.456
Block 7 finished: 24.9055
Block 8 finished: 23.455
loading /home/mpib/LNDG/stateswitch/stsw_fmri_task/spectrum/../extended_preproc/data/data_clean/1124_run-3_regressed.nii
...done
 
Block 1 finished: 25.8036
Block 2 finished: 26.4419
Block 3 finished: 26.8293
Block 4 finished: 24.5235
Block 5 finished: 28.1053
Block 6 finished: 28.5709
Block 7 finished: 29.6318
Block 8 finished: 27.5537
loading /home/mpib/LNDG/stateswitch/stsw_fmri_task/spectrum/../extended_preproc/data/data_clean/1124_run-4_regressed.nii
...done
 
Block 1 finished: 31.3517
Block 2 finished: 32.3735
Block 3 finished: 30.6253
Block 4 finished: 33.3502
Block 5 finished: 38.4669
Block 6 finished: 36.4962
Block 7 finished: 27.8213
Block 8 finished: 38.1243
[Warning: Variable 'fftpower_merged' was not saved. For variables larger than
2GB use MAT-file version 7.3 or later.] 
[> In L1_calcPowerPLS (line 105)] 
