{"freq_range": [0.03502096525352339, 0.4499720778790546], "freq_res": 0.00018930251488390865, "aperiodic_params_": [0.2987591675125426, 1.2672764228670106], "gaussian_params_": [], "peak_params_": [], "r_squared_": 0.9274708011022842, "error_": 0.07576303399576582}
{"freq_range": [0.03502096525352339, 0.4499720778790546], "freq_res": 0.00018930251488390865, "aperiodic_params_": [0.44621280511296074, 1.0197983176180114], "gaussian_params_": [[0.10429807405196415, 0.5105165215315559, 0.007890928722154697]], "peak_params_": [[0.10429807405196415, 0.5105162840220598, 0.015781857444309395]], "r_squared_": 0.9474635642838679, "error_": 0.06182362695596767}
{"freq_range": [0.03502096525352339, 0.4499720778790546], "freq_res": 0.00018930251488390865, "aperiodic_params_": [0.38960244819683254, 1.0895621274387233], "gaussian_params_": [[0.10488956531908925, 0.577536302844667, 0.007756701519919769]], "peak_params_": [[0.10488956531908925, 0.5775350784617341, 0.015513403039839538]], "r_squared_": 0.951577497763678, "error_": 0.064691042446518}
{"freq_range": [0.03502096525352339, 0.4499720778790546], "freq_res": 0.00018930251488390865, "aperiodic_params_": [0.4681836466827928, 1.0645246316376709], "gaussian_params_": [[0.10537375325956344, 0.5579529210662653, 0.008038462988907563]], "peak_params_": [[0.10537375325956344, 0.5579331057614776, 0.016076925977815126]], "r_squared_": 0.9550254725060988, "error_": 0.06236664363155207}
