%!PS-Adobe-3.0 EPSF-3.0
%%Creator: (MATLAB, The Mathworks, Inc. Version 9.8.0.1323502 \(R2020a\). Operating System: Mac OS X)
%%Title: /Users/kosciessa/Desktop/mntTardisLNDG/LNDG/stateswitch/stsw_fmri_task/pls_mean/figures/behavPLS_1group/d_correlations_pupil.eps
%%CreationDate: 2022-05-16T17:36:08
%%Pages: (atend)
%%BoundingBox:    48     0   506   185
%%LanguageLevel: 3
%%EndComments
%%BeginProlog
%%BeginResource: procset (Apache XML Graphics Std ProcSet) 1.2 0
%%Version: 1.2 0
%%Copyright: (Copyright 2001-2003,2010 The Apache Software Foundation. License terms: http://www.apache.org/licenses/LICENSE-2.0)
/bd{bind def}bind def
/ld{load def}bd
/GR/grestore ld
/GS/gsave ld
/RM/rmoveto ld
/C/curveto ld
/t/show ld
/L/lineto ld
/ML/setmiterlimit ld
/CT/concat ld
/f/fill ld
/N/newpath ld
/S/stroke ld
/CC/setcmykcolor ld
/A/ashow ld
/cp/closepath ld
/RC/setrgbcolor ld
/LJ/setlinejoin ld
/GC/setgray ld
/LW/setlinewidth ld
/M/moveto ld
/re {4 2 roll M
1 index 0 rlineto
0 exch rlineto
neg 0 rlineto
cp } bd
/_ctm matrix def
/_tm matrix def
/BT { _ctm currentmatrix pop matrix _tm copy pop 0 0 moveto } bd
/ET { _ctm setmatrix } bd
/iTm { _ctm setmatrix _tm concat } bd
/Tm { _tm astore pop iTm 0 0 moveto } bd
/ux 0.0 def
/uy 0.0 def
/F {
  /Tp exch def
  /Tf exch def
  Tf findfont Tp scalefont setfont
  /cf Tf def  /cs Tp def
} bd
/ULS {currentpoint /uy exch def /ux exch def} bd
/ULE {
  /Tcx currentpoint pop def
  gsave
  newpath
  cf findfont cs scalefont dup
  /FontMatrix get 0 get /Ts exch def /FontInfo get dup
  /UnderlinePosition get Ts mul /To exch def
  /UnderlineThickness get Ts mul /Tt exch def
  ux uy To add moveto  Tcx uy To add lineto
  Tt setlinewidth stroke
  grestore
} bd
/OLE {
  /Tcx currentpoint pop def
  gsave
  newpath
  cf findfont cs scalefont dup
  /FontMatrix get 0 get /Ts exch def /FontInfo get dup
  /UnderlinePosition get Ts mul /To exch def
  /UnderlineThickness get Ts mul /Tt exch def
  ux uy To add cs add moveto Tcx uy To add cs add lineto
  Tt setlinewidth stroke
  grestore
} bd
/SOE {
  /Tcx currentpoint pop def
  gsave
  newpath
  cf findfont cs scalefont dup
  /FontMatrix get 0 get /Ts exch def /FontInfo get dup
  /UnderlinePosition get Ts mul /To exch def
  /UnderlineThickness get Ts mul /Tt exch def
  ux uy To add cs 10 mul 26 idiv add moveto Tcx uy To add cs 10 mul 26 idiv add lineto
  Tt setlinewidth stroke
  grestore
} bd
/QT {
/Y22 exch store
/X22 exch store
/Y21 exch store
/X21 exch store
currentpoint
/Y21 load 2 mul add 3 div exch
/X21 load 2 mul add 3 div exch
/X21 load 2 mul /X22 load add 3 div
/Y21 load 2 mul /Y22 load add 3 div
/X22 load /Y22 load curveto
} bd
/SSPD {
dup length /d exch dict def
{
/v exch def
/k exch def
currentpagedevice k known {
/cpdv currentpagedevice k get def
v cpdv ne {
/upd false def
/nullv v type /nulltype eq def
/nullcpdv cpdv type /nulltype eq def
nullv nullcpdv or
{
/upd true def
} {
/sametype v type cpdv type eq def
sametype {
v type /arraytype eq {
/vlen v length def
/cpdvlen cpdv length def
vlen cpdvlen eq {
0 1 vlen 1 sub {
/i exch def
/obj v i get def
/cpdobj cpdv i get def
obj cpdobj ne {
/upd true def
exit
} if
} for
} {
/upd true def
} ifelse
} {
v type /dicttype eq {
v {
/dv exch def
/dk exch def
/cpddv cpdv dk get def
dv cpddv ne {
/upd true def
exit
} if
} forall
} {
/upd true def
} ifelse
} ifelse
} if
} ifelse
upd true eq {
d k v put
} if
} if
} if
} forall
d length 0 gt {
d setpagedevice
} if
} bd
/RE { % /NewFontName [NewEncodingArray] /FontName RE -
  findfont dup length dict begin
  {
    1 index /FID ne
    {def} {pop pop} ifelse
  } forall
  /Encoding exch def
  /FontName 1 index def
  currentdict definefont pop
  end
} bind def
%%EndResource
%%BeginResource: procset (Apache XML Graphics EPS ProcSet) 1.0 0
%%Version: 1.0 0
%%Copyright: (Copyright 2002-2003 The Apache Software Foundation. License terms: http://www.apache.org/licenses/LICENSE-2.0)
/BeginEPSF { %def
/b4_Inc_state save def         % Save state for cleanup
/dict_count countdictstack def % Count objects on dict stack
/op_count count 1 sub def      % Count objects on operand stack
userdict begin                 % Push userdict on dict stack
/showpage { } def              % Redefine showpage, { } = null proc
0 setgray 0 setlinecap         % Prepare graphics state
1 setlinewidth 0 setlinejoin
10 setmiterlimit [ ] 0 setdash newpath
/languagelevel where           % If level not equal to 1 then
{pop languagelevel             % set strokeadjust and
1 ne                           % overprint to their defaults.
{false setstrokeadjust false setoverprint
} if
} if
} bd
/EndEPSF { %def
count op_count sub {pop} repeat            % Clean up stacks
countdictstack dict_count sub {end} repeat
b4_Inc_state restore
} bd
%%EndResource
%FOPBeginFontDict
%%IncludeResource: font Courier-Oblique
%%IncludeResource: font Courier-BoldOblique
%%IncludeResource: font Courier-Bold
%%IncludeResource: font ZapfDingbats
%%IncludeResource: font Symbol
%%IncludeResource: font Helvetica
%%IncludeResource: font Helvetica-Oblique
%%IncludeResource: font Helvetica-Bold
%%IncludeResource: font Helvetica-BoldOblique
%%IncludeResource: font Times-Roman
%%IncludeResource: font Times-Italic
%%IncludeResource: font Times-Bold
%%IncludeResource: font Times-BoldItalic
%%IncludeResource: font Courier
%FOPEndFontDict
%%BeginResource: encoding WinAnsiEncoding
/WinAnsiEncoding [
/.notdef /.notdef /.notdef /.notdef /.notdef
/.notdef /.notdef /.notdef /.notdef /.notdef
/.notdef /.notdef /.notdef /.notdef /.notdef
/.notdef /.notdef /.notdef /.notdef /.notdef
/.notdef /.notdef /.notdef /.notdef /.notdef
/.notdef /.notdef /.notdef /.notdef /.notdef
/.notdef /.notdef /space /exclam /quotedbl
/numbersign /dollar /percent /ampersand /quotesingle
/parenleft /parenright /asterisk /plus /comma
/hyphen /period /slash /zero /one
/two /three /four /five /six
/seven /eight /nine /colon /semicolon
/less /equal /greater /question /at
/A /B /C /D /E
/F /G /H /I /J
/K /L /M /N /O
/P /Q /R /S /T
/U /V /W /X /Y
/Z /bracketleft /backslash /bracketright /asciicircum
/underscore /quoteleft /a /b /c
/d /e /f /g /h
/i /j /k /l /m
/n /o /p /q /r
/s /t /u /v /w
/x /y /z /braceleft /bar
/braceright /asciitilde /bullet /Euro /bullet
/quotesinglbase /florin /quotedblbase /ellipsis /dagger
/daggerdbl /circumflex /perthousand /Scaron /guilsinglleft
/OE /bullet /Zcaron /bullet /bullet
/quoteleft /quoteright /quotedblleft /quotedblright /bullet
/endash /emdash /asciitilde /trademark /scaron
/guilsinglright /oe /bullet /zcaron /Ydieresis
/space /exclamdown /cent /sterling /currency
/yen /brokenbar /section /dieresis /copyright
/ordfeminine /guillemotleft /logicalnot /sfthyphen /registered
/macron /degree /plusminus /twosuperior /threesuperior
/acute /mu /paragraph /middot /cedilla
/onesuperior /ordmasculine /guillemotright /onequarter /onehalf
/threequarters /questiondown /Agrave /Aacute /Acircumflex
/Atilde /Adieresis /Aring /AE /Ccedilla
/Egrave /Eacute /Ecircumflex /Edieresis /Igrave
/Iacute /Icircumflex /Idieresis /Eth /Ntilde
/Ograve /Oacute /Ocircumflex /Otilde /Odieresis
/multiply /Oslash /Ugrave /Uacute /Ucircumflex
/Udieresis /Yacute /Thorn /germandbls /agrave
/aacute /acircumflex /atilde /adieresis /aring
/ae /ccedilla /egrave /eacute /ecircumflex
/edieresis /igrave /iacute /icircumflex /idieresis
/eth /ntilde /ograve /oacute /ocircumflex
/otilde /odieresis /divide /oslash /ugrave
/uacute /ucircumflex /udieresis /yacute /thorn
/ydieresis
] def
%%EndResource
%FOPBeginFontReencode
/Courier-Oblique findfont
dup length dict begin
  {1 index /FID ne {def} {pop pop} ifelse} forall
  /Encoding WinAnsiEncoding def
  currentdict
end
/Courier-Oblique exch definefont pop
/Courier-BoldOblique findfont
dup length dict begin
  {1 index /FID ne {def} {pop pop} ifelse} forall
  /Encoding WinAnsiEncoding def
  currentdict
end
/Courier-BoldOblique exch definefont pop
/Courier-Bold findfont
dup length dict begin
  {1 index /FID ne {def} {pop pop} ifelse} forall
  /Encoding WinAnsiEncoding def
  currentdict
end
/Courier-Bold exch definefont pop
/Helvetica findfont
dup length dict begin
  {1 index /FID ne {def} {pop pop} ifelse} forall
  /Encoding WinAnsiEncoding def
  currentdict
end
/Helvetica exch definefont pop
/Helvetica-Oblique findfont
dup length dict begin
  {1 index /FID ne {def} {pop pop} ifelse} forall
  /Encoding WinAnsiEncoding def
  currentdict
end
/Helvetica-Oblique exch definefont pop
/Helvetica-Bold findfont
dup length dict begin
  {1 index /FID ne {def} {pop pop} ifelse} forall
  /Encoding WinAnsiEncoding def
  currentdict
end
/Helvetica-Bold exch definefont pop
/Helvetica-BoldOblique findfont
dup length dict begin
  {1 index /FID ne {def} {pop pop} ifelse} forall
  /Encoding WinAnsiEncoding def
  currentdict
end
/Helvetica-BoldOblique exch definefont pop
/Times-Roman findfont
dup length dict begin
  {1 index /FID ne {def} {pop pop} ifelse} forall
  /Encoding WinAnsiEncoding def
  currentdict
end
/Times-Roman exch definefont pop
/Times-Italic findfont
dup length dict begin
  {1 index /FID ne {def} {pop pop} ifelse} forall
  /Encoding WinAnsiEncoding def
  currentdict
end
/Times-Italic exch definefont pop
/Times-Bold findfont
dup length dict begin
  {1 index /FID ne {def} {pop pop} ifelse} forall
  /Encoding WinAnsiEncoding def
  currentdict
end
/Times-Bold exch definefont pop
/Times-BoldItalic findfont
dup length dict begin
  {1 index /FID ne {def} {pop pop} ifelse} forall
  /Encoding WinAnsiEncoding def
  currentdict
end
/Times-BoldItalic exch definefont pop
/Courier findfont
dup length dict begin
  {1 index /FID ne {def} {pop pop} ifelse} forall
  /Encoding WinAnsiEncoding def
  currentdict
end
/Courier exch definefont pop
%FOPEndFontReencode
%%EndProlog
%%Page: 1 1
%%PageBoundingBox: 0 0 512 187
%%BeginPageSetup
[1 0 0 -1 0 187] CT
%%EndPageSetup
GS
[1 0 0 1.00107 0 -0.2] CT
1 GC
N
0 0 512 187 re
f
GR
GS
[1 0 0 1.00107 0 -0.2] CT
1 GC
N
0 0 512 187 re
f
GR
GS
[1 0 0 1.00107 0 -0.2] CT
0.2 GC
N
102.5 149.5 M
256 149.5 L
256 18.5 L
102.5 18.5 L
cp
f
GR
GS
[1 0 0 1.00107 0 -0.2] CT
0.149 GC
2 setlinecap
1 LJ
0.5 LW
N
102.5 149.5 M
256 149.5 L
S
GR
GS
[1 0 0 1.00107 0 -0.2] CT
0.149 GC
2 setlinecap
1 LJ
0.5 LW
N
129.103 149.5 M
129.103 147.965 L
S
GR
GS
[1 0 0 1.00107 0 -0.2] CT
0.149 GC
2 setlinecap
1 LJ
0.5 LW
N
169.201 149.5 M
169.201 147.965 L
S
GR
GS
[1 0 0 1.00107 0 -0.2] CT
0.149 GC
2 setlinecap
1 LJ
0.5 LW
N
209.299 149.5 M
209.299 147.965 L
S
GR
GS
[1 0 0 1.00107 0 -0.2] CT
0.149 GC
2 setlinecap
1 LJ
0.5 LW
N
249.397 149.5 M
249.397 147.965 L
S
GR
GS
[1 0 0 1.00107 129.10255 154.26503] CT
0.149 GC
/Helvetica 14 F
GS
[1 0 0 1 0 0] CT
-4 14 moveto 
1 -1 scale
(0) t 
GR
GR
GS
[1 0 0 1.00107 169.20079 154.26503] CT
0.149 GC
/Helvetica 14 F
GS
[1 0 0 1 0 0] CT
-16 14 moveto 
1 -1 scale
(5000) t 
GR
GR
GS
[1 0 0 1.00107 209.29903 154.26503] CT
0.149 GC
/Helvetica 14 F
GS
[1 0 0 1 0 0] CT
-19.5 14 moveto 
1 -1 scale
(10000) t 
GR
GR
GS
[1 0 0 1.00107 249.39726 154.26503] CT
0.149 GC
/Helvetica 14 F
GS
[1 0 0 1 0 0] CT
-19.5 14 moveto 
1 -1 scale
(15000) t 
GR
GR
GS
[1 0 0 1.00107 179.25008 171.78375] CT
0.149 GC
/Helvetica 14 F
GS
[1 0 0 1 0 0] CT
-74.5 14 moveto 
1 -1 scale
(fMRI Brainscore \(arb.u.\)) t 
GR
GR
GS
[1 0 0 1.00107 0 -0.2] CT
0.149 GC
2 setlinecap
1 LJ
0.5 LW
N
102.5 149.5 M
102.5 18.5 L
S
GR
GS
[1 0 0 1.00107 0 -0.2] CT
0.149 GC
2 setlinecap
1 LJ
0.5 LW
N
102.5 117.207 M
104.035 117.207 L
S
GR
GS
[1 0 0 1.00107 0 -0.2] CT
0.149 GC
2 setlinecap
1 LJ
0.5 LW
N
102.5 78.153 M
104.035 78.153 L
S
GR
GS
[1 0 0 1.00107 0 -0.2] CT
0.149 GC
2 setlinecap
1 LJ
0.5 LW
N
102.5 39.1 M
104.035 39.1 L
S
GR
GS
[1 0 0 1.00107 97.7 117.13214] CT
0.149 GC
/Helvetica 14 F
GS
[1 0 0 1 0 0] CT
-8 5.5 moveto 
1 -1 scale
(0) t 
GR
GR
GS
[1 0 0 1.00107 97.7 78.03689] CT
0.149 GC
/Helvetica 14 F
GS
[1 0 0 1 0 0] CT
-8 5.5 moveto 
1 -1 scale
(5) t 
GR
GR
GS
[1 0 0 1.00107 97.7 38.94163] CT
0.149 GC
/Helvetica 14 F
GS
[1 0 0 1 0 0] CT
-16 5.5 moveto 
1 -1 scale
(10) t 
GR
GR
GS
[0 -1.00107 1 0 78.7 83.88978] CT
0.149 GC
/Helvetica 14 F
GS
[1 0 0 1 0 0] CT
-15.5 -20 moveto 
1 -1 scale
(pupil) t 
GR
GR
GS
[0 -1.00107 1 0 78.7 83.88978] CT
0.149 GC
/Helvetica 14 F
GS
[1 0 0 1 0 0] CT
-39 -3 moveto 
1 -1 scale
(\(linear mod.\)) t 
GR
GR
GS
[1 0 0 1.00107 179.25017 16.56792] CT
/Helvetica-Bold 14 F
GS
[1 0 0 1 0 0] CT
-76 -4 moveto 
1 -1 scale
(r = 0.45 CI = [0.27,0.59]) t 
GR
GR
GS
[1 0 0 1.00107 151.85092 138.53155] CT
0.8 GC
N
0.5 0 M
0.5 -0.276 0.276 -0.5 0 -0.5 C
-0.276 -0.5 -0.5 -0.276 -0.5 0 C
-0.5 0.276 -0.276 0.5 0 0.5 C
0.276 0.5 0.5 0.276 0.5 0 C
cp
f
GR
GS
[1 0 0 1.00107 144.24544 47.88861] CT
0.8 GC
N
/f-2105962265{0.5 0 M
0.5 -0.276 0.276 -0.5 0 -0.5 C
-0.276 -0.5 -0.5 -0.276 -0.5 0 C
-0.5 0.276 -0.276 0.5 0 0.5 C
0.276 0.5 0.5 0.276 0.5 0 C
cp}def
f-2105962265
f
GR
GS
[1 0 0 1.00107 181.3502 93.62194] CT
0.8 GC
N
f-2105962265
f
GR
GS
[1 0 0 1.00107 175.20338 113.61454] CT
0.8 GC
N
f-2105962265
f
GR
GS
[1 0 0 1.00107 152.32356 78.07413] CT
0.8 GC
N
f-2105962265
f
GR
GS
[1 0 0 1.00107 172.06783 42.81294] CT
0.8 GC
N
f-2105962265
f
GR
GS
[1 0 0 1.00107 205.48311 65.17879] CT
0.8 GC
N
f-2105962265
f
GR
GS
[1 0 0 1.00107 205.59962 62.60605] CT
0.8 GC
N
f-2105962265
f
GR
GS
[1 0 0 1.00107 128.21817 92.28787] CT
0.8 GC
N
f-2105962265
f
GR
GS
[1 0 0 1.00107 193.08842 110.10267] CT
0.8 GC
N
f-2105962265
f
GR
GS
[1 0 0 1.00107 168.64771 92.71416] CT
0.8 GC
N
f-2105962265
f
GR
GS
[1 0 0 1.00107 190.1317 101.61076] CT
0.8 GC
N
f-2105962265
f
GR
GS
[1 0 0 1.00107 152.15416 92.28066] CT
0.8 GC
N
f-2105962265
f
GR
GS
[1 0 0 1.00107 164.23561 138.53155] CT
0.8 GC
N
f-2105962265
f
GR
GS
[1 0 0 1.00107 155.69623 77.73409] CT
0.8 GC
N
f-2105962265
f
GR
GS
[1 0 0 1.00107 137.33371 76.99137] CT
0.8 GC
N
f-2105962265
f
GR
GS
[1 0 0 1.00107 160.05399 88.58935] CT
0.8 GC
N
f-2105962265
f
GR
GS
[1 0 0 1.00107 162.64647 71.62862] CT
0.8 GC
N
f-2105962265
f
GR
GS
[1 0 0 1.00107 160.55821 81.27535] CT
0.8 GC
N
f-2105962265
f
GR
GS
[1 0 0 1.00107 173.07581 35.3879] CT
0.8 GC
N
f-2105962265
f
GR
GS
[1 0 0 1.00107 174.72037 132.57867] CT
0.8 GC
N
f-2105962265
f
GR
GS
[1 0 0 1.00107 136.82932 96.91635] CT
0.8 GC
N
f-2105962265
f
GR
GS
[1 0 0 1.00107 150.99184 111.17811] CT
0.8 GC
N
f-2105962265
f
GR
GS
[1 0 0 1.00107 185.70612 45.56953] CT
0.8 GC
N
f-2105962265
f
GR
GS
[1 0 0 1.00107 182.49751 86.47657] CT
0.8 GC
N
f-2105962265
f
GR
GS
[1 0 0 1.00107 144.91469 138.27053] CT
0.8 GC
N
f-2105962265
f
GR
GS
[1 0 0 1.00107 160.0265 93.6713] CT
0.8 GC
N
f-2105962265
f
GR
GS
[1 0 0 1.00107 185.59795 42.4051] CT
0.8 GC
N
f-2105962265
f
GR
GS
[1 0 0 1.00107 166.74693 100.85647] CT
0.8 GC
N
f-2105962265
f
GR
GS
[1 0 0 1.00107 156.34604 126.2561] CT
0.8 GC
N
f-2105962265
f
GR
GS
[1 0 0 1.00107 197.87573 86.77513] CT
0.8 GC
N
f-2105962265
f
GR
GS
[1 0 0 1.00107 204.53181 99.42059] CT
0.8 GC
N
f-2105962265
f
GR
GS
[1 0 0 1.00107 243.20833 29.24813] CT
0.8 GC
N
f-2105962265
f
GR
GS
[1 0 0 1.00107 215.05717 35.2862] CT
0.8 GC
N
f-2105962265
f
GR
GS
[1 0 0 1.00107 142.14415 98.65353] CT
0.8 GC
N
f-2105962265
f
GR
GS
[1 0 0 1.00107 217.9738 43.6482] CT
0.8 GC
N
f-2105962265
f
GR
GS
[1 0 0 1.00107 209.29594 41.94132] CT
0.8 GC
N
f-2105962265
f
GR
GS
[1 0 0 1.00107 188.36264 42.24329] CT
0.8 GC
N
f-2105962265
f
GR
GS
[1 0 0 1.00107 183.68954 88.19134] CT
0.8 GC
N
f-2105962265
f
GR
GS
[1 0 0 1.00107 165.34248 83.44032] CT
0.8 GC
N
f-2105962265
f
GR
GS
[1 0 0 1.00107 162.5114 86.81283] CT
0.8 GC
N
f-2105962265
f
GR
GS
[1 0 0 1.00107 191.74933 75.96343] CT
0.8 GC
N
f-2105962265
f
GR
GS
[1 0 0 1.00107 140.67679 114.68713] CT
0.8 GC
N
f-2105962265
f
GR
GS
[1 0 0 1.00107 138.97743 107.47023] CT
0.8 GC
N
f-2105962265
f
GR
GS
[1 0 0 1.00107 156.59213 92.04284] CT
0.8 GC
N
f-2105962265
f
GR
GS
[1 0 0 1.00107 130.69681 119.88741] CT
0.8 GC
N
f-2105962265
f
GR
GS
[1 0 0 1.00107 144.2182 78.13465] CT
0.8 GC
N
f-2105962265
f
GR
GS
[1 0 0 1.00107 132.03259 102.90569] CT
0.8 GC
N
f-2105962265
f
GR
GS
[1 0 0 1.00107 132.75345 137.88119] CT
0.8 GC
N
f-2105962265
f
GR
GS
[1 0 0 1.00107 129.9669 102.65866] CT
0.8 GC
N
f-2105962265
f
GR
GS
[1 0 0 1.00107 134.42291 135.57832] CT
0.8 GC
N
f-2105962265
f
GR
GS
[1 0 0 1.00107 159.0567 115.49791] CT
0.8 GC
N
f-2105962265
f
GR
GS
[1 0 0 1.00107 140.37825 105.79751] CT
0.8 GC
N
f-2105962265
f
GR
GS
[1 0 0 1.00107 121.01725 129.58114] CT
0.8 GC
N
f-2105962265
f
GR
GS
[1 0 0 1.00107 141.13179 103.06141] CT
0.8 GC
N
f-2105962265
f
GR
GS
[1 0 0 1.00107 142.92714 117.5786] CT
0.8 GC
N
f-2105962265
f
GR
GS
[1 0 0 1.00107 170.64149 86.44662] CT
0.8 GC
N
f-2105962265
f
GR
GS
[1 0 0 1.00107 152.18207 90.68641] CT
0.8 GC
N
f-2105962265
f
GR
GS
[1 0 0 1.00107 150.07739 74.44008] CT
0.8 GC
N
f-2105962265
f
GR
GS
[1 0 0 1.00107 142.7296 78.29264] CT
0.8 GC
N
f-2105962265
f
GR
GS
[1 0 0 1.00107 127.81736 93.3591] CT
0.8 GC
N
f-2105962265
f
GR
GS
[1 0 0 1.00107 122.50857 118.41207] CT
0.8 GC
N
f-2105962265
f
GR
GS
[1 0 0 1.00107 154.60814 72.90497] CT
0.8 GC
N
f-2105962265
f
GR
GS
[1 0 0 1.00107 136.39948 86.48441] CT
0.8 GC
N
f-2105962265
f
GR
GS
[1 0 0 1.00107 132.16058 103.90768] CT
0.8 GC
N
f-2105962265
f
GR
GS
[1 0 0 1.00107 141.92664 101.84966] CT
0.8 GC
N
f-2105962265
f
GR
GS
[1 0 0 1.00107 151.00449 80.93142] CT
0.8 GC
N
f-2105962265
f
GR
GS
[1 0 0 1.00107 130.71852 87.04682] CT
0.8 GC
N
f-2105962265
f
GR
GS
[1 0 0 1.00107 177.19667 52.76763] CT
0.8 GC
N
f-2105962265
f
GR
GS
[1 0 0 1.00107 128.33073 108.14042] CT
0.8 GC
N
f-2105962265
f
GR
GS
[1 0 0 1.00107 163.092 100.12314] CT
0.8 GC
N
f-2105962265
f
GR
GS
[1 0 0 1.00107 163.81694 84.21808] CT
0.8 GC
N
f-2105962265
f
GR
GS
[1 0 0 1.00107 146.55592 51.96637] CT
0.8 GC
N
f-2105962265
f
GR
GS
[1 0 0 1.00107 136.82182 42.43202] CT
0.8 GC
N
f-2105962265
f
GR
GS
[1 0 0 1.00107 126.8021 91.51457] CT
0.8 GC
N
f-2105962265
f
GR
GS
[1 0 0 1.00107 138.04414 88.57756] CT
0.8 GC
N
f-2105962265
f
GR
GS
[1 0 0 1.00107 161.0493 107.41323] CT
0.8 GC
N
f-2105962265
f
GR
GS
[1 0 0 1.00107 159.99164 118.86268] CT
0.8 GC
N
f-2105962265
f
GR
GS
[1 0 0 1.00107 115.29166 51.38753] CT
0.8 GC
N
f-2105962265
f
GR
GS
[1 0 0 1.00107 157.85533 85.78544] CT
0.8 GC
N
f-2105962265
f
GR
GS
[1 0 0 1.00107 155.90544 124.28134] CT
0.8 GC
N
f-2105962265
f
GR
GS
[1 0 0 1.00107 147.81425 84.13201] CT
0.8 GC
N
f-2105962265
f
GR
GS
[1 0 0 1.00107 122.13152 105.83049] CT
0.8 GC
N
f-2105962265
f
GR
GS
[1 0 0 1.00107 121.78762 89.8904] CT
0.8 GC
N
f-2105962265
f
GR
GS
[1 0 0 1.00107 128.06819 79.61206] CT
0.8 GC
N
f-2105962265
f
GR
GS
[1 0 0 1.00107 169.48984 82.02251] CT
0.8 GC
N
f-2105962265
f
GR
GS
[1 0 0 1.00107 153.06995 100.34067] CT
0.8 GC
N
f-2105962265
f
GR
GS
[1 0 0 1.00107 140.45755 97.10366] CT
0.8 GC
N
f-2105962265
f
GR
GS
[1 0 0 1.00107 173.21864 57.5251] CT
0.8 GC
N
f-2105962265
f
GR
GS
[1 0 0 1.00107 143.6488 92.8065] CT
0.8 GC
N
f-2105962265
f
GR
GS
[1 0 0 1.00107 151.01816 126.41685] CT
0.8 GC
N
f-2105962265
f
GR
GS
[1 0 0 1.00107 150.65219 65.47678] CT
0.8 GC
N
f-2105962265
f
GR
GS
[1 0 0 1.00107 148.59163 120.62089] CT
0.8 GC
N
f-2105962265
f
GR
GS
[1 0 0 1.00107 147.58763 111.43237] CT
0.8 GC
N
f-2105962265
f
GR
GS
[1 0 0 1.00107 145.84164 94.49834] CT
0.8 GC
N
f-2105962265
f
GR
GS
[1 0 0 1.00107 0 -0.2] CT
1 0.6 0.6 RC
1 LJ
3 LW
N
102.482 115.934 M
249.397 46.268 L
S
GR
GS
[1 0 0 1.00107 151.85092 138.53155] CT
0.8 1 1 RC
N
/f227889816{-3 -3 M
-3 3 L
3 3 L
3 -3 L
cp}def
f227889816
f
GR
GS
[1 0 0 1.00107 144.24544 47.88861] CT
0.8 1 1 RC
N
f227889816
f
GR
GS
[1 0 0 1.00107 181.3502 93.62194] CT
0.8 1 1 RC
N
f227889816
f
GR
GS
[1 0 0 1.00107 175.20338 113.61454] CT
0.8 1 1 RC
N
f227889816
f
GR
GS
[1 0 0 1.00107 152.32356 78.07413] CT
0.8 1 1 RC
N
f227889816
f
GR
GS
[1 0 0 1.00107 172.06783 42.81294] CT
0.8 1 1 RC
N
f227889816
f
GR
GS
[1 0 0 1.00107 205.48311 65.17879] CT
0.8 1 1 RC
N
f227889816
f
GR
GS
[1 0 0 1.00107 205.59962 62.60605] CT
0.8 1 1 RC
N
f227889816
f
GR
GS
[1 0 0 1.00107 128.21817 92.28787] CT
0.8 1 1 RC
N
f227889816
f
GR
GS
[1 0 0 1.00107 193.08842 110.10267] CT
0.8 1 1 RC
N
f227889816
f
GR
GS
[1 0 0 1.00107 168.64771 92.71416] CT
0.8 1 1 RC
N
f227889816
f
GR
GS
[1 0 0 1.00107 190.1317 101.61076] CT
0.8 1 1 RC
N
f227889816
f
GR
GS
[1 0 0 1.00107 152.15416 92.28066] CT
0.8 1 1 RC
N
f227889816
f
GR
GS
[1 0 0 1.00107 164.23561 138.53155] CT
0.8 1 1 RC
N
f227889816
f
GR
GS
[1 0 0 1.00107 155.69623 77.73409] CT
0.8 1 1 RC
N
f227889816
f
GR
GS
[1 0 0 1.00107 137.33371 76.99137] CT
0.8 1 1 RC
N
f227889816
f
GR
GS
[1 0 0 1.00107 160.05399 88.58935] CT
0.8 1 1 RC
N
f227889816
f
GR
GS
[1 0 0 1.00107 162.64647 71.62862] CT
0.8 1 1 RC
N
f227889816
f
GR
GS
[1 0 0 1.00107 160.55821 81.27535] CT
0.8 1 1 RC
N
f227889816
f
GR
GS
[1 0 0 1.00107 173.07581 35.3879] CT
0.8 1 1 RC
N
f227889816
f
GR
GS
[1 0 0 1.00107 174.72037 132.57867] CT
0.8 1 1 RC
N
f227889816
f
GR
GS
[1 0 0 1.00107 136.82932 96.91635] CT
0.8 1 1 RC
N
f227889816
f
GR
GS
[1 0 0 1.00107 150.99184 111.17811] CT
0.8 1 1 RC
N
f227889816
f
GR
GS
[1 0 0 1.00107 185.70612 45.56953] CT
0.8 1 1 RC
N
f227889816
f
GR
GS
[1 0 0 1.00107 182.49751 86.47657] CT
0.8 1 1 RC
N
f227889816
f
GR
GS
[1 0 0 1.00107 144.91469 138.27053] CT
0.8 1 1 RC
N
f227889816
f
GR
GS
[1 0 0 1.00107 160.0265 93.6713] CT
0.8 1 1 RC
N
f227889816
f
GR
GS
[1 0 0 1.00107 185.59795 42.4051] CT
0.8 1 1 RC
N
f227889816
f
GR
GS
[1 0 0 1.00107 166.74693 100.85647] CT
0.8 1 1 RC
N
f227889816
f
GR
GS
[1 0 0 1.00107 156.34604 126.2561] CT
0.8 1 1 RC
N
f227889816
f
GR
GS
[1 0 0 1.00107 197.87573 86.77513] CT
0.8 1 1 RC
N
f227889816
f
GR
GS
[1 0 0 1.00107 204.53181 99.42059] CT
0.8 1 1 RC
N
f227889816
f
GR
GS
[1 0 0 1.00107 243.20833 29.24813] CT
0.8 1 1 RC
N
f227889816
f
GR
GS
[1 0 0 1.00107 215.05717 35.2862] CT
0.8 1 1 RC
N
f227889816
f
GR
GS
[1 0 0 1.00107 142.14415 98.65353] CT
0.8 1 1 RC
N
f227889816
f
GR
GS
[1 0 0 1.00107 217.9738 43.6482] CT
0.8 1 1 RC
N
f227889816
f
GR
GS
[1 0 0 1.00107 209.29594 41.94132] CT
0.8 1 1 RC
N
f227889816
f
GR
GS
[1 0 0 1.00107 188.36264 42.24329] CT
0.8 1 1 RC
N
f227889816
f
GR
GS
[1 0 0 1.00107 183.68954 88.19134] CT
0.8 1 1 RC
N
f227889816
f
GR
GS
[1 0 0 1.00107 165.34248 83.44032] CT
0.8 1 1 RC
N
f227889816
f
GR
GS
[1 0 0 1.00107 162.5114 86.81283] CT
0.8 1 1 RC
N
f227889816
f
GR
GS
[1 0 0 1.00107 191.74933 75.96343] CT
0.8 1 1 RC
N
f227889816
f
GR
GS
[1 0 0 1.00107 140.67679 114.68713] CT
0.6 0.8 0.8 RC
N
/f-1969333140{-3.536 0 M
0 4.702 L
3.536 0 L
0 -4.702 L
cp}def
f-1969333140
f
GR
GS
[1 0 0 1.00107 138.97743 107.47023] CT
0.6 0.8 0.8 RC
N
f-1969333140
f
GR
GS
[1 0 0 1.00107 156.59213 92.04284] CT
0.6 0.8 0.8 RC
N
f-1969333140
f
GR
GS
[1 0 0 1.00107 130.69681 119.88741] CT
0.6 0.8 0.8 RC
N
f-1969333140
f
GR
GS
[1 0 0 1.00107 144.2182 78.13465] CT
0.6 0.8 0.8 RC
N
f-1969333140
f
GR
GS
[1 0 0 1.00107 132.03259 102.90569] CT
0.6 0.8 0.8 RC
N
f-1969333140
f
GR
GS
[1 0 0 1.00107 132.75345 137.88119] CT
0.6 0.8 0.8 RC
N
f-1969333140
f
GR
GS
[1 0 0 1.00107 129.9669 102.65866] CT
0.6 0.8 0.8 RC
N
f-1969333140
f
GR
GS
[1 0 0 1.00107 134.42291 135.57832] CT
0.6 0.8 0.8 RC
N
f-1969333140
f
GR
GS
[1 0 0 1.00107 159.0567 115.49791] CT
0.6 0.8 0.8 RC
N
f-1969333140
f
GR
GS
[1 0 0 1.00107 140.37825 105.79751] CT
0.6 0.8 0.8 RC
N
f-1969333140
f
GR
GS
[1 0 0 1.00107 121.01725 129.58114] CT
0.6 0.8 0.8 RC
N
f-1969333140
f
GR
GS
[1 0 0 1.00107 141.13179 103.06141] CT
0.6 0.8 0.8 RC
N
f-1969333140
f
GR
GS
[1 0 0 1.00107 142.92714 117.5786] CT
0.6 0.8 0.8 RC
N
f-1969333140
f
GR
GS
[1 0 0 1.00107 170.64149 86.44662] CT
0.6 0.8 0.8 RC
N
f-1969333140
f
GR
GS
[1 0 0 1.00107 152.18207 90.68641] CT
0.6 0.8 0.8 RC
N
f-1969333140
f
GR
GS
[1 0 0 1.00107 150.07739 74.44008] CT
0.6 0.8 0.8 RC
N
f-1969333140
f
GR
GS
[1 0 0 1.00107 142.7296 78.29264] CT
0.6 0.8 0.8 RC
N
f-1969333140
f
GR
GS
[1 0 0 1.00107 127.81736 93.3591] CT
0.6 0.8 0.8 RC
N
f-1969333140
f
GR
GS
[1 0 0 1.00107 122.50857 118.41207] CT
0.6 0.8 0.8 RC
N
f-1969333140
f
GR
GS
[1 0 0 1.00107 154.60814 72.90497] CT
0.6 0.8 0.8 RC
N
f-1969333140
f
GR
GS
[1 0 0 1.00107 136.39948 86.48441] CT
0.6 0.8 0.8 RC
N
f-1969333140
f
GR
GS
[1 0 0 1.00107 132.16058 103.90768] CT
0.6 0.8 0.8 RC
N
f-1969333140
f
GR
GS
[1 0 0 1.00107 141.92664 101.84966] CT
0.6 0.8 0.8 RC
N
f-1969333140
f
GR
GS
[1 0 0 1.00107 151.00449 80.93142] CT
0.6 0.8 0.8 RC
N
f-1969333140
f
GR
GS
[1 0 0 1.00107 130.71852 87.04682] CT
0.6 0.8 0.8 RC
N
f-1969333140
f
GR
GS
[1 0 0 1.00107 177.19667 52.76763] CT
0.6 0.8 0.8 RC
N
f-1969333140
f
GR
GS
[1 0 0 1.00107 128.33073 108.14042] CT
0.6 0.8 0.8 RC
N
f-1969333140
f
GR
GS
[1 0 0 1.00107 163.092 100.12314] CT
0.6 0.8 0.8 RC
N
f-1969333140
f
GR
GS
[1 0 0 1.00107 163.81694 84.21808] CT
0.6 0.8 0.8 RC
N
f-1969333140
f
GR
GS
[1 0 0 1.00107 146.55592 51.96637] CT
0.6 0.8 0.8 RC
N
f-1969333140
f
GR
GS
[1 0 0 1.00107 136.82182 42.43202] CT
0.6 0.8 0.8 RC
N
f-1969333140
f
GR
GS
[1 0 0 1.00107 126.8021 91.51457] CT
0.6 0.8 0.8 RC
N
f-1969333140
f
GR
GS
[1 0 0 1.00107 138.04414 88.57756] CT
0.6 0.8 0.8 RC
N
f-1969333140
f
GR
GS
[1 0 0 1.00107 161.0493 107.41323] CT
0.6 0.8 0.8 RC
N
f-1969333140
f
GR
GS
[1 0 0 1.00107 159.99164 118.86268] CT
0.6 0.8 0.8 RC
N
f-1969333140
f
GR
GS
[1 0 0 1.00107 115.29166 51.38753] CT
0.6 0.8 0.8 RC
N
f-1969333140
f
GR
GS
[1 0 0 1.00107 157.85533 85.78544] CT
0.6 0.8 0.8 RC
N
f-1969333140
f
GR
GS
[1 0 0 1.00107 155.90544 124.28134] CT
0.6 0.8 0.8 RC
N
f-1969333140
f
GR
GS
[1 0 0 1.00107 147.81425 84.13201] CT
0.6 0.8 0.8 RC
N
f-1969333140
f
GR
GS
[1 0 0 1.00107 122.13152 105.83049] CT
0.6 0.8 0.8 RC
N
f-1969333140
f
GR
GS
[1 0 0 1.00107 121.78762 89.8904] CT
0.6 0.8 0.8 RC
N
f-1969333140
f
GR
GS
[1 0 0 1.00107 128.06819 79.61206] CT
0.6 0.8 0.8 RC
N
f-1969333140
f
GR
GS
[1 0 0 1.00107 169.48984 82.02251] CT
0.6 0.8 0.8 RC
N
f-1969333140
f
GR
GS
[1 0 0 1.00107 153.06995 100.34067] CT
0.6 0.8 0.8 RC
N
f-1969333140
f
GR
GS
[1 0 0 1.00107 140.45755 97.10366] CT
0.6 0.8 0.8 RC
N
f-1969333140
f
GR
GS
[1 0 0 1.00107 173.21864 57.5251] CT
0.6 0.8 0.8 RC
N
f-1969333140
f
GR
GS
[1 0 0 1.00107 143.6488 92.8065] CT
0.6 0.8 0.8 RC
N
f-1969333140
f
GR
GS
[1 0 0 1.00107 151.01816 126.41685] CT
0.6 0.8 0.8 RC
N
f-1969333140
f
GR
GS
[1 0 0 1.00107 150.65219 65.47678] CT
0.6 0.8 0.8 RC
N
f-1969333140
f
GR
GS
[1 0 0 1.00107 148.59163 120.62089] CT
0.6 0.8 0.8 RC
N
f-1969333140
f
GR
GS
[1 0 0 1.00107 147.58763 111.43237] CT
0.6 0.8 0.8 RC
N
f-1969333140
f
GR
GS
[1 0 0 1.00107 145.84164 94.49834] CT
0.6 0.8 0.8 RC
N
f-1969333140
f
GR
GS
[1 0 0 1.00107 0 -0.2] CT
0.2 GC
N
/f-436321476{333 149.5 M
486.5 149.5 L
486.5 18.5 L
333 18.5 L
cp}def
f-436321476
f
GR
GS
[1 0 0 1.00107 0 -0.2] CT
0.149 GC
2 setlinecap
1 LJ
0.5 LW
N
333 149.5 M
486.5 149.5 L
S
GR
GS
[1 0 0 1.00107 0 -0.2] CT
0.149 GC
2 setlinecap
1 LJ
0.5 LW
N
351.905 149.5 M
351.905 147.965 L
S
GR
GS
[1 0 0 1.00107 0 -0.2] CT
0.149 GC
2 setlinecap
1 LJ
0.5 LW
N
396.51 149.5 M
396.51 147.965 L
S
GR
GS
[1 0 0 1.00107 0 -0.2] CT
0.149 GC
2 setlinecap
1 LJ
0.5 LW
N
441.116 149.5 M
441.116 147.965 L
S
GR
GS
[1 0 0 1.00107 0 -0.2] CT
0.149 GC
2 setlinecap
1 LJ
0.5 LW
N
485.722 149.5 M
485.722 147.965 L
S
GR
GS
[1 0 0 1.00107 351.90451 154.26503] CT
0.149 GC
/Helvetica 14 F
GS
[1 0 0 1 0 0] CT
-18.5 14 moveto 
1 -1 scale
(-5000) t 
GR
GR
GS
[1 0 0 1.00107 396.51035 154.26503] CT
0.149 GC
/Helvetica 14 F
GS
[1 0 0 1 0 0] CT
-4 14 moveto 
1 -1 scale
(0) t 
GR
GR
GS
[1 0 0 1.00107 441.11618 154.26503] CT
0.149 GC
/Helvetica 14 F
GS
[1 0 0 1 0 0] CT
-16 14 moveto 
1 -1 scale
(5000) t 
GR
GR
GS
[1 0 0 1.00107 485.72205 154.26503] CT
0.149 GC
/Helvetica 14 F
GS
[1 0 0 1 0 0] CT
-19.5 14 moveto 
1 -1 scale
(10000) t 
GR
GR
GS
[1 0 0 1.00107 409.75006 171.78375] CT
0.149 GC
/Helvetica 14 F
GS
[1 0 0 1 0 0] CT
-74.5 14 moveto 
1 -1 scale
(fMRI Brainscore \(arb.u.\)) t 
GR
GR
GS
[1 0 0 1.00107 0 -0.2] CT
0.149 GC
2 setlinecap
1 LJ
0.5 LW
N
333 149.5 M
333 18.5 L
S
GR
GS
[1 0 0 1.00107 0 -0.2] CT
0.149 GC
2 setlinecap
1 LJ
0.5 LW
N
333 122.195 M
334.535 122.195 L
S
GR
GS
[1 0 0 1.00107 0 -0.2] CT
0.149 GC
2 setlinecap
1 LJ
0.5 LW
N
333 83.141 M
334.535 83.141 L
S
GR
GS
[1 0 0 1.00107 0 -0.2] CT
0.149 GC
2 setlinecap
1 LJ
0.5 LW
N
333 44.088 M
334.535 44.088 L
S
GR
GS
[1 0 0 1.00107 328.20001 122.1254] CT
0.149 GC
/Helvetica 14 F
GS
[1 0 0 1 0 0] CT
-14 5.5 moveto 
1 -1 scale
(-5) t 
GR
GR
GS
[1 0 0 1.00107 328.20001 83.03014] CT
0.149 GC
/Helvetica 14 F
GS
[1 0 0 1 0 0] CT
-8 5.5 moveto 
1 -1 scale
(0) t 
GR
GR
GS
[1 0 0 1.00107 328.20001 43.93488] CT
0.149 GC
/Helvetica 14 F
GS
[1 0 0 1 0 0] CT
-8 5.5 moveto 
1 -1 scale
(5) t 
GR
GR
GS
[0 -1.00107 1 0 311.70001 83.88978] CT
0.149 GC
/Helvetica 14 F
GS
[1 0 0 1 0 0] CT
-15.5 -20 moveto 
1 -1 scale
(pupil) t 
GR
GR
GS
[0 -1.00107 1 0 311.70001 83.88978] CT
0.149 GC
/Helvetica 14 F
GS
[1 0 0 1 0 0] CT
-39 -3 moveto 
1 -1 scale
(\(linear mod.\)) t 
GR
GR
GS
[1 0 0 1.00107 409.7504 16.56792] CT
/Helvetica-Bold 14 F
GS
[1 0 0 1 0 0] CT
-76 -4 moveto 
1 -1 scale
(r = 0.39 CI = [0.21,0.55]) t 
GR
GR
GS
[1 0 0 1.00107 372.08109 138.53155] CT
0.8 GC
N
/f-1618671862{3.162 0 M
3.162 -1.746 1.746 -3.162 0 -3.162 C
-1.746 -3.162 -3.162 -1.746 -3.162 0 C
-3.162 1.746 -1.746 3.162 0 3.162 C
1.746 3.162 3.162 1.746 3.162 0 C
cp}def
f-1618671862
f
GR
GS
[1 0 0 1.00107 363.62064 47.88861] CT
0.8 GC
N
f-1618671862
f
GR
GS
[1 0 0 1.00107 404.89648 93.62194] CT
0.8 GC
N
f-1618671862
f
GR
GS
[1 0 0 1.00107 398.05869 113.61454] CT
0.8 GC
N
f-1618671862
f
GR
GS
[1 0 0 1.00107 372.60684 78.07413] CT
0.8 GC
N
f-1618671862
f
GR
GS
[1 0 0 1.00107 394.57065 42.81294] CT
0.8 GC
N
f-1618671862
f
GR
GS
[1 0 0 1.00107 431.74228 65.17878] CT
0.8 GC
N
f-1618671862
f
GR
GS
[1 0 0 1.00107 431.87189 62.60605] CT
0.8 GC
N
f-1618671862
f
GR
GS
[1 0 0 1.00107 345.79166 92.28787] CT
0.8 GC
N
f-1618671862
f
GR
GS
[1 0 0 1.00107 417.95425 110.10267] CT
0.8 GC
N
f-1618671862
f
GR
GS
[1 0 0 1.00107 390.76605 92.71416] CT
0.8 GC
N
f-1618671862
f
GR
GS
[1 0 0 1.00107 414.66513 101.61076] CT
0.8 GC
N
f-1618671862
f
GR
GS
[1 0 0 1.00107 372.4184 92.28066] CT
0.8 GC
N
f-1618671862
f
GR
GS
[1 0 0 1.00107 385.85797 138.53155] CT
0.8 GC
N
f-1618671862
f
GR
GS
[1 0 0 1.00107 376.35864 77.73409] CT
0.8 GC
N
f-1618671862
f
GR
GS
[1 0 0 1.00107 355.93192 76.99137] CT
0.8 GC
N
f-1618671862
f
GR
GS
[1 0 0 1.00107 381.20627 88.58935] CT
0.8 GC
N
f-1618671862
f
GR
GS
[1 0 0 1.00107 384.09018 71.62862] CT
0.8 GC
N
f-1618671862
f
GR
GS
[1 0 0 1.00107 381.76718 81.27535] CT
0.8 GC
N
f-1618671862
f
GR
GS
[1 0 0 1.00107 395.69193 35.3879] CT
0.8 GC
N
f-1618671862
f
GR
GS
[1 0 0 1.00107 397.52136 132.57867] CT
0.8 GC
N
f-1618671862
f
GR
GS
[1 0 0 1.00107 355.37082 96.91635] CT
0.8 GC
N
f-1618671862
f
GR
GS
[1 0 0 1.00107 371.12543 111.17811] CT
0.8 GC
N
f-1618671862
f
GR
GS
[1 0 0 1.00107 409.74207 45.56953] CT
0.8 GC
N
f-1618671862
f
GR
GS
[1 0 0 1.00107 406.17276 86.47657] CT
0.8 GC
N
f-1618671862
f
GR
GS
[1 0 0 1.00107 364.36511 138.27053] CT
0.8 GC
N
f-1618671862
f
GR
GS
[1 0 0 1.00107 381.17572 93.6713] CT
0.8 GC
N
f-1618671862
f
GR
GS
[1 0 0 1.00107 409.62173 42.4051] CT
0.8 GC
N
f-1618671862
f
GR
GS
[1 0 0 1.00107 388.65161 100.85647] CT
0.8 GC
N
f-1618671862
f
GR
GS
[1 0 0 1.00107 377.08151 126.2561] CT
0.8 GC
N
f-1618671862
f
GR
GS
[1 0 0 1.00107 423.27972 86.77513] CT
0.8 GC
N
f-1618671862
f
GR
GS
[1 0 0 1.00107 430.68405 99.42059] CT
0.8 GC
N
f-1618671862
f
GR
GS
[1 0 0 1.00107 473.70834 29.24813] CT
0.8 GC
N
f-1618671862
f
GR
GS
[1 0 0 1.00107 442.39258 35.2862] CT
0.8 GC
N
f-1618671862
f
GR
GS
[1 0 0 1.00107 361.28311 98.65353] CT
0.8 GC
N
f-1618671862
f
GR
GS
[1 0 0 1.00107 445.63708 43.6482] CT
0.8 GC
N
f-1618671862
f
GR
GS
[1 0 0 1.00107 435.9837 41.94132] CT
0.8 GC
N
f-1618671862
f
GR
GS
[1 0 0 1.00107 412.6972 42.24328] CT
0.8 GC
N
f-1618671862
f
GR
GS
[1 0 0 1.00107 407.49878 88.19134] CT
0.8 GC
N
f-1618671862
f
GR
GS
[1 0 0 1.00107 387.08926 83.44032] CT
0.8 GC
N
f-1618671862
f
GR
GS
[1 0 0 1.00107 383.93994 86.81283] CT
0.8 GC
N
f-1618671862
f
GR
GS
[1 0 0 1.00107 416.46463 75.96343] CT
0.8 GC
N
f-1618671862
f
GR
GS
[1 0 0 1.00107 392.81873 102.38325] CT
0.8 GC
N
f-1618671862
f
GR
GS
[1 0 0 1.00107 390.92834 95.16635] CT
0.8 GC
N
f-1618671862
f
GR
GS
[1 0 0 1.00107 410.52316 79.73896] CT
0.8 GC
N
f-1618671862
f
GR
GS
[1 0 0 1.00107 381.71683 107.58353] CT
0.8 GC
N
f-1618671862
f
GR
GS
[1 0 0 1.00107 396.75824 65.83078] CT
0.8 GC
N
f-1618671862
f
GR
GS
[1 0 0 1.00107 383.20279 90.6018] CT
0.8 GC
N
f-1618671862
f
GR
GS
[1 0 0 1.00107 384.00467 125.57732] CT
0.8 GC
N
f-1618671862
f
GR
GS
[1 0 0 1.00107 380.90491 90.35477] CT
0.8 GC
N
f-1618671862
f
GR
GS
[1 0 0 1.00107 385.86182 123.27443] CT
0.8 GC
N
f-1618671862
f
GR
GS
[1 0 0 1.00107 413.2648 103.19403] CT
0.8 GC
N
f-1618671862
f
GR
GS
[1 0 0 1.00107 392.4866 93.49362] CT
0.8 GC
N
f-1618671862
f
GR
GS
[1 0 0 1.00107 370.94916 117.27726] CT
0.8 GC
N
f-1618671862
f
GR
GS
[1 0 0 1.00107 393.32486 90.75753] CT
0.8 GC
N
f-1618671862
f
GR
GS
[1 0 0 1.00107 395.32205 105.27471] CT
0.8 GC
N
f-1618671862
f
GR
GS
[1 0 0 1.00107 426.15189 74.14274] CT
0.8 GC
N
f-1618671862
f
GR
GS
[1 0 0 1.00107 405.61734 78.38253] CT
0.8 GC
N
f-1618671862
f
GR
GS
[1 0 0 1.00107 403.27606 62.1362] CT
0.8 GC
N
f-1618671862
f
GR
GS
[1 0 0 1.00107 395.10229 65.98876] CT
0.8 GC
N
f-1618671862
f
GR
GS
[1 0 0 1.00107 378.5137 81.05522] CT
0.8 GC
N
f-1618671862
f
GR
GS
[1 0 0 1.00107 372.60812 106.10819] CT
0.8 GC
N
f-1618671862
f
GR
GS
[1 0 0 1.00107 408.31616 60.60108] CT
0.8 GC
N
f-1618671862
f
GR
GS
[1 0 0 1.00107 388.06058 74.18053] CT
0.8 GC
N
f-1618671862
f
GR
GS
[1 0 0 1.00107 383.34515 91.60379] CT
0.8 GC
N
f-1618671862
f
GR
GS
[1 0 0 1.00107 394.20908 89.54578] CT
0.8 GC
N
f-1618671862
f
GR
GS
[1 0 0 1.00107 404.3074 68.62753] CT
0.8 GC
N
f-1618671862
f
GR
GS
[1 0 0 1.00107 381.741 74.74293] CT
0.8 GC
N
f-1618671862
f
GR
GS
[1 0 0 1.00107 433.44394 40.46375] CT
0.8 GC
N
f-1618671862
f
GR
GS
[1 0 0 1.00107 379.08481 95.83654] CT
0.8 GC
N
f-1618671862
f
GR
GS
[1 0 0 1.00107 417.75372 87.81926] CT
0.8 GC
N
f-1618671862
f
GR
GS
[1 0 0 1.00107 418.56015 71.91419] CT
0.8 GC
N
f-1618671862
f
GR
GS
[1 0 0 1.00107 399.35876 39.66249] CT
0.8 GC
N
f-1618671862
f
GR
GS
[1 0 0 1.00107 388.5304 30.12815] CT
0.8 GC
N
f-1618671862
f
GR
GS
[1 0 0 1.00107 377.38434 79.21069] CT
0.8 GC
N
f-1618671862
f
GR
GS
[1 0 0 1.00107 389.89014 76.27368] CT
0.8 GC
N
f-1618671862
f
GR
GS
[1 0 0 1.00107 415.48138 95.10934] CT
0.8 GC
N
f-1618671862
f
GR
GS
[1 0 0 1.00107 414.30484 106.55879] CT
0.8 GC
N
f-1618671862
f
GR
GS
[1 0 0 1.00107 364.57996 39.08366] CT
0.8 GC
N
f-1618671862
f
GR
GS
[1 0 0 1.00107 411.92838 73.48157] CT
0.8 GC
N
f-1618671862
f
GR
GS
[1 0 0 1.00107 409.75928 111.97747] CT
0.8 GC
N
f-1618671862
f
GR
GS
[1 0 0 1.00107 400.75851 71.82813] CT
0.8 GC
N
f-1618671862
f
GR
GS
[1 0 0 1.00107 372.18869 93.5266] CT
0.8 GC
N
f-1618671862
f
GR
GS
[1 0 0 1.00107 371.80615 77.58651] CT
0.8 GC
N
f-1618671862
f
GR
GS
[1 0 0 1.00107 378.79276 67.30818] CT
0.8 GC
N
f-1618671862
f
GR
GS
[1 0 0 1.00107 424.87076 69.71863] CT
0.8 GC
N
f-1618671862
f
GR
GS
[1 0 0 1.00107 406.60504 88.0368] CT
0.8 GC
N
f-1618671862
f
GR
GS
[1 0 0 1.00107 392.57483 84.79978] CT
0.8 GC
N
f-1618671862
f
GR
GS
[1 0 0 1.00107 429.01874 45.22122] CT
0.8 GC
N
f-1618671862
f
GR
GS
[1 0 0 1.00107 396.12485 80.50262] CT
0.8 GC
N
f-1618671862
f
GR
GS
[1 0 0 1.00107 404.3226 114.11297] CT
0.8 GC
N
f-1618671862
f
GR
GS
[1 0 0 1.00107 403.9155 53.1729] CT
0.8 GC
N
f-1618671862
f
GR
GS
[1 0 0 1.00107 401.62329 108.31702] CT
0.8 GC
N
f-1618671862
f
GR
GS
[1 0 0 1.00107 400.50644 99.12849] CT
0.8 GC
N
f-1618671862
f
GR
GS
[1 0 0 1.00107 398.56418 82.19446] CT
0.8 GC
N
f-1618671862
f
GR
GS
[1 0 0 1.00107 0 -0.2] CT
1 0.6 0.6 RC
1 LJ
3 LW
N
345.792 106.352 M
485.722 42.315 L
S
GR
%%Trailer
%%Pages: 1
%%EOF
