%!PS-Adobe-3.0 EPSF-3.0
%%Creator: (MATLAB, The Mathworks, Inc. Version 9.8.0.1323502 \(R2020a\). Operating System: Mac OS X)
%%Title: /Users/kosciessa/Desktop/mntTardisLNDG/LNDG/stateswitch/stsw_fmri_task/pls_mean/figures/behavPLS_1group/d_correlations_1group_behavpls.eps
%%CreationDate: 2022-05-16T17:32:04
%%Pages: (atend)
%%BoundingBox:    18     0   257   216
%%LanguageLevel: 3
%%EndComments
%%BeginProlog
%%BeginResource: procset (Apache XML Graphics Std ProcSet) 1.2 0
%%Version: 1.2 0
%%Copyright: (Copyright 2001-2003,2010 The Apache Software Foundation. License terms: http://www.apache.org/licenses/LICENSE-2.0)
/bd{bind def}bind def
/ld{load def}bd
/GR/grestore ld
/GS/gsave ld
/RM/rmoveto ld
/C/curveto ld
/t/show ld
/L/lineto ld
/ML/setmiterlimit ld
/CT/concat ld
/f/fill ld
/N/newpath ld
/S/stroke ld
/CC/setcmykcolor ld
/A/ashow ld
/cp/closepath ld
/RC/setrgbcolor ld
/LJ/setlinejoin ld
/GC/setgray ld
/LW/setlinewidth ld
/M/moveto ld
/re {4 2 roll M
1 index 0 rlineto
0 exch rlineto
neg 0 rlineto
cp } bd
/_ctm matrix def
/_tm matrix def
/BT { _ctm currentmatrix pop matrix _tm copy pop 0 0 moveto } bd
/ET { _ctm setmatrix } bd
/iTm { _ctm setmatrix _tm concat } bd
/Tm { _tm astore pop iTm 0 0 moveto } bd
/ux 0.0 def
/uy 0.0 def
/F {
  /Tp exch def
  /Tf exch def
  Tf findfont Tp scalefont setfont
  /cf Tf def  /cs Tp def
} bd
/ULS {currentpoint /uy exch def /ux exch def} bd
/ULE {
  /Tcx currentpoint pop def
  gsave
  newpath
  cf findfont cs scalefont dup
  /FontMatrix get 0 get /Ts exch def /FontInfo get dup
  /UnderlinePosition get Ts mul /To exch def
  /UnderlineThickness get Ts mul /Tt exch def
  ux uy To add moveto  Tcx uy To add lineto
  Tt setlinewidth stroke
  grestore
} bd
/OLE {
  /Tcx currentpoint pop def
  gsave
  newpath
  cf findfont cs scalefont dup
  /FontMatrix get 0 get /Ts exch def /FontInfo get dup
  /UnderlinePosition get Ts mul /To exch def
  /UnderlineThickness get Ts mul /Tt exch def
  ux uy To add cs add moveto Tcx uy To add cs add lineto
  Tt setlinewidth stroke
  grestore
} bd
/SOE {
  /Tcx currentpoint pop def
  gsave
  newpath
  cf findfont cs scalefont dup
  /FontMatrix get 0 get /Ts exch def /FontInfo get dup
  /UnderlinePosition get Ts mul /To exch def
  /UnderlineThickness get Ts mul /Tt exch def
  ux uy To add cs 10 mul 26 idiv add moveto Tcx uy To add cs 10 mul 26 idiv add lineto
  Tt setlinewidth stroke
  grestore
} bd
/QT {
/Y22 exch store
/X22 exch store
/Y21 exch store
/X21 exch store
currentpoint
/Y21 load 2 mul add 3 div exch
/X21 load 2 mul add 3 div exch
/X21 load 2 mul /X22 load add 3 div
/Y21 load 2 mul /Y22 load add 3 div
/X22 load /Y22 load curveto
} bd
/SSPD {
dup length /d exch dict def
{
/v exch def
/k exch def
currentpagedevice k known {
/cpdv currentpagedevice k get def
v cpdv ne {
/upd false def
/nullv v type /nulltype eq def
/nullcpdv cpdv type /nulltype eq def
nullv nullcpdv or
{
/upd true def
} {
/sametype v type cpdv type eq def
sametype {
v type /arraytype eq {
/vlen v length def
/cpdvlen cpdv length def
vlen cpdvlen eq {
0 1 vlen 1 sub {
/i exch def
/obj v i get def
/cpdobj cpdv i get def
obj cpdobj ne {
/upd true def
exit
} if
} for
} {
/upd true def
} ifelse
} {
v type /dicttype eq {
v {
/dv exch def
/dk exch def
/cpddv cpdv dk get def
dv cpddv ne {
/upd true def
exit
} if
} forall
} {
/upd true def
} ifelse
} ifelse
} if
} ifelse
upd true eq {
d k v put
} if
} if
} if
} forall
d length 0 gt {
d setpagedevice
} if
} bd
/RE { % /NewFontName [NewEncodingArray] /FontName RE -
  findfont dup length dict begin
  {
    1 index /FID ne
    {def} {pop pop} ifelse
  } forall
  /Encoding exch def
  /FontName 1 index def
  currentdict definefont pop
  end
} bind def
%%EndResource
%%BeginResource: procset (Apache XML Graphics EPS ProcSet) 1.0 0
%%Version: 1.0 0
%%Copyright: (Copyright 2002-2003 The Apache Software Foundation. License terms: http://www.apache.org/licenses/LICENSE-2.0)
/BeginEPSF { %def
/b4_Inc_state save def         % Save state for cleanup
/dict_count countdictstack def % Count objects on dict stack
/op_count count 1 sub def      % Count objects on operand stack
userdict begin                 % Push userdict on dict stack
/showpage { } def              % Redefine showpage, { } = null proc
0 setgray 0 setlinecap         % Prepare graphics state
1 setlinewidth 0 setlinejoin
10 setmiterlimit [ ] 0 setdash newpath
/languagelevel where           % If level not equal to 1 then
{pop languagelevel             % set strokeadjust and
1 ne                           % overprint to their defaults.
{false setstrokeadjust false setoverprint
} if
} if
} bd
/EndEPSF { %def
count op_count sub {pop} repeat            % Clean up stacks
countdictstack dict_count sub {end} repeat
b4_Inc_state restore
} bd
%%EndResource
%FOPBeginFontDict
%%IncludeResource: font Courier-Oblique
%%IncludeResource: font Courier-BoldOblique
%%IncludeResource: font Courier-Bold
%%IncludeResource: font ZapfDingbats
%%IncludeResource: font Symbol
%%IncludeResource: font Helvetica
%%IncludeResource: font Helvetica-Oblique
%%IncludeResource: font Helvetica-Bold
%%IncludeResource: font Helvetica-BoldOblique
%%IncludeResource: font Times-Roman
%%IncludeResource: font Times-Italic
%%IncludeResource: font Times-Bold
%%IncludeResource: font Times-BoldItalic
%%IncludeResource: font Courier
%FOPEndFontDict
%%BeginResource: encoding WinAnsiEncoding
/WinAnsiEncoding [
/.notdef /.notdef /.notdef /.notdef /.notdef
/.notdef /.notdef /.notdef /.notdef /.notdef
/.notdef /.notdef /.notdef /.notdef /.notdef
/.notdef /.notdef /.notdef /.notdef /.notdef
/.notdef /.notdef /.notdef /.notdef /.notdef
/.notdef /.notdef /.notdef /.notdef /.notdef
/.notdef /.notdef /space /exclam /quotedbl
/numbersign /dollar /percent /ampersand /quotesingle
/parenleft /parenright /asterisk /plus /comma
/hyphen /period /slash /zero /one
/two /three /four /five /six
/seven /eight /nine /colon /semicolon
/less /equal /greater /question /at
/A /B /C /D /E
/F /G /H /I /J
/K /L /M /N /O
/P /Q /R /S /T
/U /V /W /X /Y
/Z /bracketleft /backslash /bracketright /asciicircum
/underscore /quoteleft /a /b /c
/d /e /f /g /h
/i /j /k /l /m
/n /o /p /q /r
/s /t /u /v /w
/x /y /z /braceleft /bar
/braceright /asciitilde /bullet /Euro /bullet
/quotesinglbase /florin /quotedblbase /ellipsis /dagger
/daggerdbl /circumflex /perthousand /Scaron /guilsinglleft
/OE /bullet /Zcaron /bullet /bullet
/quoteleft /quoteright /quotedblleft /quotedblright /bullet
/endash /emdash /asciitilde /trademark /scaron
/guilsinglright /oe /bullet /zcaron /Ydieresis
/space /exclamdown /cent /sterling /currency
/yen /brokenbar /section /dieresis /copyright
/ordfeminine /guillemotleft /logicalnot /sfthyphen /registered
/macron /degree /plusminus /twosuperior /threesuperior
/acute /mu /paragraph /middot /cedilla
/onesuperior /ordmasculine /guillemotright /onequarter /onehalf
/threequarters /questiondown /Agrave /Aacute /Acircumflex
/Atilde /Adieresis /Aring /AE /Ccedilla
/Egrave /Eacute /Ecircumflex /Edieresis /Igrave
/Iacute /Icircumflex /Idieresis /Eth /Ntilde
/Ograve /Oacute /Ocircumflex /Otilde /Odieresis
/multiply /Oslash /Ugrave /Uacute /Ucircumflex
/Udieresis /Yacute /Thorn /germandbls /agrave
/aacute /acircumflex /atilde /adieresis /aring
/ae /ccedilla /egrave /eacute /ecircumflex
/edieresis /igrave /iacute /icircumflex /idieresis
/eth /ntilde /ograve /oacute /ocircumflex
/otilde /odieresis /divide /oslash /ugrave
/uacute /ucircumflex /udieresis /yacute /thorn
/ydieresis
] def
%%EndResource
%FOPBeginFontReencode
/Courier-Oblique findfont
dup length dict begin
  {1 index /FID ne {def} {pop pop} ifelse} forall
  /Encoding WinAnsiEncoding def
  currentdict
end
/Courier-Oblique exch definefont pop
/Courier-BoldOblique findfont
dup length dict begin
  {1 index /FID ne {def} {pop pop} ifelse} forall
  /Encoding WinAnsiEncoding def
  currentdict
end
/Courier-BoldOblique exch definefont pop
/Courier-Bold findfont
dup length dict begin
  {1 index /FID ne {def} {pop pop} ifelse} forall
  /Encoding WinAnsiEncoding def
  currentdict
end
/Courier-Bold exch definefont pop
/Helvetica findfont
dup length dict begin
  {1 index /FID ne {def} {pop pop} ifelse} forall
  /Encoding WinAnsiEncoding def
  currentdict
end
/Helvetica exch definefont pop
/Helvetica-Oblique findfont
dup length dict begin
  {1 index /FID ne {def} {pop pop} ifelse} forall
  /Encoding WinAnsiEncoding def
  currentdict
end
/Helvetica-Oblique exch definefont pop
/Helvetica-Bold findfont
dup length dict begin
  {1 index /FID ne {def} {pop pop} ifelse} forall
  /Encoding WinAnsiEncoding def
  currentdict
end
/Helvetica-Bold exch definefont pop
/Helvetica-BoldOblique findfont
dup length dict begin
  {1 index /FID ne {def} {pop pop} ifelse} forall
  /Encoding WinAnsiEncoding def
  currentdict
end
/Helvetica-BoldOblique exch definefont pop
/Times-Roman findfont
dup length dict begin
  {1 index /FID ne {def} {pop pop} ifelse} forall
  /Encoding WinAnsiEncoding def
  currentdict
end
/Times-Roman exch definefont pop
/Times-Italic findfont
dup length dict begin
  {1 index /FID ne {def} {pop pop} ifelse} forall
  /Encoding WinAnsiEncoding def
  currentdict
end
/Times-Italic exch definefont pop
/Times-Bold findfont
dup length dict begin
  {1 index /FID ne {def} {pop pop} ifelse} forall
  /Encoding WinAnsiEncoding def
  currentdict
end
/Times-Bold exch definefont pop
/Times-BoldItalic findfont
dup length dict begin
  {1 index /FID ne {def} {pop pop} ifelse} forall
  /Encoding WinAnsiEncoding def
  currentdict
end
/Times-BoldItalic exch definefont pop
/Courier findfont
dup length dict begin
  {1 index /FID ne {def} {pop pop} ifelse} forall
  /Encoding WinAnsiEncoding def
  currentdict
end
/Courier exch definefont pop
%FOPEndFontReencode
%%EndProlog
%%Page: 1 1
%%PageBoundingBox: 0 0 283 227
%%BeginPageSetup
[1 0 0 -1 0 227] CT
%%EndPageSetup
GS
[1.00164 0 0 0.99899 0 0.22835] CT
N
0 0 M
283 0 L
283 227 L
0 227 L
0 0 L
cp
clip
1 GC
N
0 0 283 227 re
f
GR
GS
[1.00164 0 0 0.99899 0 0.22835] CT
1 GC
N
0 0 283 227 re
f
GR
GS
[1.00164 0 0 0.99899 0 0.22835] CT
1 GC
N
59 160.5 M
256 160.5 L
256 17 L
59 17 L
cp
f
GR
GS
[1.00164 0 0 0.99899 0 0.22835] CT
0.149 GC
1 LJ
0.5 LW
N
59 88.75 M
256 88.75 L
S
GR
GS
[1.00164 0 0 0.99899 0 0.22835] CT
0.6 0.8 0.8 RC
N
80.297 88.75 M
80.297 132.831 L
101.595 132.831 L
101.595 88.75 L
cp
128.216 88.75 M
128.216 56.779 L
106.919 56.779 L
106.919 88.75 L
cp
154.838 88.75 M
154.838 47.625 L
133.541 47.625 L
133.541 88.75 L
cp
181.459 88.75 M
181.459 51.109 L
160.162 51.109 L
160.162 88.75 L
cp
208.081 88.75 M
208.081 72.3 L
186.784 72.3 L
186.784 88.75 L
cp
234.703 88.75 M
234.703 68.589 L
213.405 68.589 L
213.405 88.75 L
cp
f
GR
GS
[1.00164 0 0 0.99899 0 0.22835] CT
1 LJ
1.5 LW
N
90.946 132.831 M
90.946 140.929 L
S
GR
GS
[1.00164 0 0 0.99899 0 0.22835] CT
1 LJ
1.5 LW
N
117.568 56.779 M
117.568 68.847 L
S
GR
GS
[1.00164 0 0 0.99899 0 0.22835] CT
1 LJ
1.5 LW
N
144.189 47.625 M
144.189 52.872 L
S
GR
GS
[1.00164 0 0 0.99899 0 0.22835] CT
1 LJ
1.5 LW
N
170.811 51.109 M
170.811 54.842 L
S
GR
GS
[1.00164 0 0 0.99899 0 0.22835] CT
1 LJ
1.5 LW
N
197.432 72.3 M
197.432 80.866 L
S
GR
GS
[1.00164 0 0 0.99899 0 0.22835] CT
1 LJ
1.5 LW
N
224.054 68.589 M
224.054 77.678 L
S
GR
GS
[1.00164 0 0 0.99899 0 0.22835] CT
1 LJ
1.5 LW
N
90.946 132.831 M
90.946 128.247 L
S
GR
GS
[1.00164 0 0 0.99899 0 0.22835] CT
1 LJ
1.5 LW
N
117.568 56.779 M
117.568 44.572 L
S
GR
GS
[1.00164 0 0 0.99899 0 0.22835] CT
1 LJ
1.5 LW
N
144.189 47.625 M
144.189 35.851 L
S
GR
GS
[1.00164 0 0 0.99899 0 0.22835] CT
1 LJ
1.5 LW
N
170.811 51.109 M
170.811 41.272 L
S
GR
GS
[1.00164 0 0 0.99899 0 0.22835] CT
1 LJ
1.5 LW
N
197.432 72.3 M
197.432 57.593 L
S
GR
GS
[1.00164 0 0 0.99899 0 0.22835] CT
1 LJ
1.5 LW
N
224.054 68.589 M
224.054 55.991 L
S
GR
GS
[1.00164 0 0 0.99899 91.09524 141.01587] CT
N
-3 0 M
3 0 L
f
GR
GS
[1.00164 0 0 0.99899 91.09524 141.01587] CT
10.0 ML
1.5 LW
N
-3 0 M
3 0 L
S
GR
GS
[1.00164 0 0 0.99899 117.76056 69.00637] CT
N
/f1394637256{-3 0 M
3 0 L}def
f1394637256
f
GR
GS
[1.00164 0 0 0.99899 117.76056 69.00637] CT
10.0 ML
1.5 LW
N
-3 0 M
3 0 L
S
GR
GS
[1.00164 0 0 0.99899 144.42589 53.04729] CT
N
f1394637256
f
GR
GS
[1.00164 0 0 0.99899 144.42589 53.04729] CT
10.0 ML
1.5 LW
N
-3 0 M
3 0 L
S
GR
GS
[1.00164 0 0 0.99899 171.09121 55.01533] CT
N
f1394637256
f
GR
GS
[1.00164 0 0 0.99899 171.09121 55.01533] CT
10.0 ML
1.5 LW
N
-3 0 M
3 0 L
S
GR
GS
[1.00164 0 0 0.99899 197.75654 81.0126] CT
N
f1394637256
f
GR
GS
[1.00164 0 0 0.99899 197.75654 81.0126] CT
10.0 ML
1.5 LW
N
-3 0 M
3 0 L
S
GR
GS
[1.00164 0 0 0.99899 224.42185 77.82837] CT
N
f1394637256
f
GR
GS
[1.00164 0 0 0.99899 224.42185 77.82837] CT
10.0 ML
1.5 LW
N
-3 0 M
3 0 L
S
GR
GS
[1.00164 0 0 0.99899 91.09524 128.34592] CT
N
f1394637256
f
GR
GS
[1.00164 0 0 0.99899 91.09524 128.34592] CT
10.0 ML
1.5 LW
N
-3 0 M
3 0 L
S
GR
GS
[1.00164 0 0 0.99899 117.76056 44.75549] CT
N
f1394637256
f
GR
GS
[1.00164 0 0 0.99899 117.76056 44.75549] CT
10.0 ML
1.5 LW
N
-3 0 M
3 0 L
S
GR
GS
[1.00164 0 0 0.99899 144.42589 36.04291] CT
N
f1394637256
f
GR
GS
[1.00164 0 0 0.99899 144.42589 36.04291] CT
10.0 ML
1.5 LW
N
-3 0 M
3 0 L
S
GR
GS
[1.00164 0 0 0.99899 171.09121 41.45928] CT
N
f1394637256
f
GR
GS
[1.00164 0 0 0.99899 171.09121 41.45928] CT
10.0 ML
1.5 LW
N
-3 0 M
3 0 L
S
GR
GS
[1.00164 0 0 0.99899 197.75654 57.76294] CT
N
f1394637256
f
GR
GS
[1.00164 0 0 0.99899 197.75654 57.76294] CT
10.0 ML
1.5 LW
N
-3 0 M
3 0 L
S
GR
GS
[1.00164 0 0 0.99899 224.42185 56.16305] CT
N
f1394637256
f
GR
GS
[1.00164 0 0 0.99899 224.42185 56.16305] CT
10.0 ML
1.5 LW
N
-3 0 M
3 0 L
S
GR
GS
[1.00164 0 0 0.99899 0 0.22835] CT
0.149 GC
2 setlinecap
1 LJ
0.5 LW
N
59 160.5 M
256 160.5 L
S
GR
GS
[1.00164 0 0 0.99899 0 0.22835] CT
0.149 GC
2 setlinecap
1 LJ
0.5 LW
N
59 17 M
256 17 L
S
GR
GS
[1.00164 0 0 0.99899 0 0.22835] CT
0.149 GC
2 setlinecap
1 LJ
0.5 LW
N
90.946 160.5 M
90.946 158.535 L
S
GR
GS
[1.00164 0 0 0.99899 0 0.22835] CT
0.149 GC
2 setlinecap
1 LJ
0.5 LW
N
117.568 160.5 M
117.568 158.535 L
S
GR
GS
[1.00164 0 0 0.99899 0 0.22835] CT
0.149 GC
2 setlinecap
1 LJ
0.5 LW
N
144.189 160.5 M
144.189 158.535 L
S
GR
GS
[1.00164 0 0 0.99899 0 0.22835] CT
0.149 GC
2 setlinecap
1 LJ
0.5 LW
N
170.811 160.5 M
170.811 158.535 L
S
GR
GS
[1.00164 0 0 0.99899 0 0.22835] CT
0.149 GC
2 setlinecap
1 LJ
0.5 LW
N
197.432 160.5 M
197.432 158.535 L
S
GR
GS
[1.00164 0 0 0.99899 0 0.22835] CT
0.149 GC
2 setlinecap
1 LJ
0.5 LW
N
224.054 160.5 M
224.054 158.535 L
S
GR
GS
[1.00164 0 0 0.99899 0 0.22835] CT
0.149 GC
2 setlinecap
1 LJ
0.5 LW
N
90.946 17 M
90.946 18.965 L
S
GR
GS
[1.00164 0 0 0.99899 0 0.22835] CT
0.149 GC
2 setlinecap
1 LJ
0.5 LW
N
117.568 17 M
117.568 18.965 L
S
GR
GS
[1.00164 0 0 0.99899 0 0.22835] CT
0.149 GC
2 setlinecap
1 LJ
0.5 LW
N
144.189 17 M
144.189 18.965 L
S
GR
GS
[1.00164 0 0 0.99899 0 0.22835] CT
0.149 GC
2 setlinecap
1 LJ
0.5 LW
N
170.811 17 M
170.811 18.965 L
S
GR
GS
[1.00164 0 0 0.99899 0 0.22835] CT
0.149 GC
2 setlinecap
1 LJ
0.5 LW
N
197.432 17 M
197.432 18.965 L
S
GR
GS
[1.00164 0 0 0.99899 0 0.22835] CT
0.149 GC
2 setlinecap
1 LJ
0.5 LW
N
224.054 17 M
224.054 18.965 L
S
GR
GS
[0 -0.99899 1.00164 0 91.09524 165.96147] CT
0.149 GC
/Helvetica 17 F
GS
[1 0 0 1 0 0] CT
-30 6.5 moveto 
1 -1 scale
(drift) t 
GR
GR
GS
[0 -0.99899 1.00164 0 117.76056 165.96147] CT
0.149 GC
/Helvetica 17 F
GS
[1 0 0 1 0 0] CT
-38 6.5 moveto 
1 -1 scale
(pupil) t 
GR
GR
GS
[0 -0.99899 1.00164 0 144.42589 165.96147] CT
0.149 GC
/Helvetica 17 F
GS
[1 0 0 1 0 0] CT
-39 6.5 moveto 
1 -1 scale
(theta) t 
GR
GR
GS
[0 -0.99899 1.00164 0 171.09121 165.96147] CT
0.149 GC
/Helvetica 17 F
GS
[1 0 0 1 0 0] CT
-42 6.5 moveto 
1 -1 scale
(alpha) t 
GR
GR
GS
[0 -0.99899 1.00164 0 197.75654 165.96147] CT
0.149 GC
/Helvetica 17 F
GS
[1 0 0 1 0 0] CT
-40 6.5 moveto 
1 -1 scale
(fooof) t 
GR
GR
GS
[0 -0.99899 1.00164 0 224.42185 165.96147] CT
0.149 GC
/Helvetica 17 F
GS
[1 0 0 1 0 0] CT
-61 6.5 moveto 
1 -1 scale
(sampen) t 
GR
GR
GS
[1.00164 0 0 0.99899 0 0.22835] CT
0.149 GC
2 setlinecap
1 LJ
0.5 LW
N
59 160.5 M
59 17 L
S
GR
GS
[1.00164 0 0 0.99899 0 0.22835] CT
0.149 GC
2 setlinecap
1 LJ
0.5 LW
N
256 160.5 M
256 17 L
S
GR
GS
[1.00164 0 0 0.99899 0 0.22835] CT
0.149 GC
2 setlinecap
1 LJ
0.5 LW
N
59 160.5 M
60.965 160.5 L
S
GR
GS
[1.00164 0 0 0.99899 0 0.22835] CT
0.149 GC
2 setlinecap
1 LJ
0.5 LW
N
59 88.75 M
60.965 88.75 L
S
GR
GS
[1.00164 0 0 0.99899 0 0.22835] CT
0.149 GC
2 setlinecap
1 LJ
0.5 LW
N
59 17 M
60.965 17 L
S
GR
GS
[1.00164 0 0 0.99899 0 0.22835] CT
0.149 GC
2 setlinecap
1 LJ
0.5 LW
N
256 160.5 M
254.035 160.5 L
S
GR
GS
[1.00164 0 0 0.99899 0 0.22835] CT
0.149 GC
2 setlinecap
1 LJ
0.5 LW
N
256 88.75 M
254.035 88.75 L
S
GR
GS
[1.00164 0 0 0.99899 0 0.22835] CT
0.149 GC
2 setlinecap
1 LJ
0.5 LW
N
256 17 M
254.035 17 L
S
GR
GS
[1.00164 0 0 0.99899 53.68799 160.56689] CT
0.149 GC
/Helvetica 17 F
GS
[1 0 0 1 0 0] CT
-17 6.5 moveto 
1 -1 scale
(-1) t 
GR
GR
GS
[1.00164 0 0 0.99899 53.68799 88.88907] CT
0.149 GC
/Helvetica 17 F
GS
[1 0 0 1 0 0] CT
-10 6.5 moveto 
1 -1 scale
(0) t 
GR
GR
GS
[1.00164 0 0 0.99899 53.68799 17.21125] CT
0.149 GC
/Helvetica 17 F
GS
[1 0 0 1 0 0] CT
-10 6.5 moveto 
1 -1 scale
(1) t 
GR
GR
GS
[0 -0.99899 1.00164 0 34.6568 88.889] CT
0.149 GC
/Helvetica 17 F
GS
[1 0 0 1 0 0] CT
-42 -4 moveto 
1 -1 scale
(Correlation) t 
GR
GR
%%Trailer
%%Pages: 1
%%EOF
