%!PS-Adobe-3.0 EPSF-3.0
%%Creator: (MATLAB, The Mathworks, Inc. Version 9.8.0.1323502 \(R2020a\). Operating System: Mac OS X)
%%Title: /Users/kosciessa/Desktop/mntTardisLNDG/LNDG/stateswitch/stsw_fmri_task/pls_mean/figures/behavPLS_1group/d_correlations_1group_behavpls_extended.eps
%%CreationDate: 2022-05-16T17:35:56
%%Pages: (atend)
%%BoundingBox:     2     0   257   214
%%LanguageLevel: 3
%%EndComments
%%BeginProlog
%%BeginResource: procset (Apache XML Graphics Std ProcSet) 1.2 0
%%Version: 1.2 0
%%Copyright: (Copyright 2001-2003,2010 The Apache Software Foundation. License terms: http://www.apache.org/licenses/LICENSE-2.0)
/bd{bind def}bind def
/ld{load def}bd
/GR/grestore ld
/GS/gsave ld
/RM/rmoveto ld
/C/curveto ld
/t/show ld
/L/lineto ld
/ML/setmiterlimit ld
/CT/concat ld
/f/fill ld
/N/newpath ld
/S/stroke ld
/CC/setcmykcolor ld
/A/ashow ld
/cp/closepath ld
/RC/setrgbcolor ld
/LJ/setlinejoin ld
/GC/setgray ld
/LW/setlinewidth ld
/M/moveto ld
/re {4 2 roll M
1 index 0 rlineto
0 exch rlineto
neg 0 rlineto
cp } bd
/_ctm matrix def
/_tm matrix def
/BT { _ctm currentmatrix pop matrix _tm copy pop 0 0 moveto } bd
/ET { _ctm setmatrix } bd
/iTm { _ctm setmatrix _tm concat } bd
/Tm { _tm astore pop iTm 0 0 moveto } bd
/ux 0.0 def
/uy 0.0 def
/F {
  /Tp exch def
  /Tf exch def
  Tf findfont Tp scalefont setfont
  /cf Tf def  /cs Tp def
} bd
/ULS {currentpoint /uy exch def /ux exch def} bd
/ULE {
  /Tcx currentpoint pop def
  gsave
  newpath
  cf findfont cs scalefont dup
  /FontMatrix get 0 get /Ts exch def /FontInfo get dup
  /UnderlinePosition get Ts mul /To exch def
  /UnderlineThickness get Ts mul /Tt exch def
  ux uy To add moveto  Tcx uy To add lineto
  Tt setlinewidth stroke
  grestore
} bd
/OLE {
  /Tcx currentpoint pop def
  gsave
  newpath
  cf findfont cs scalefont dup
  /FontMatrix get 0 get /Ts exch def /FontInfo get dup
  /UnderlinePosition get Ts mul /To exch def
  /UnderlineThickness get Ts mul /Tt exch def
  ux uy To add cs add moveto Tcx uy To add cs add lineto
  Tt setlinewidth stroke
  grestore
} bd
/SOE {
  /Tcx currentpoint pop def
  gsave
  newpath
  cf findfont cs scalefont dup
  /FontMatrix get 0 get /Ts exch def /FontInfo get dup
  /UnderlinePosition get Ts mul /To exch def
  /UnderlineThickness get Ts mul /Tt exch def
  ux uy To add cs 10 mul 26 idiv add moveto Tcx uy To add cs 10 mul 26 idiv add lineto
  Tt setlinewidth stroke
  grestore
} bd
/QT {
/Y22 exch store
/X22 exch store
/Y21 exch store
/X21 exch store
currentpoint
/Y21 load 2 mul add 3 div exch
/X21 load 2 mul add 3 div exch
/X21 load 2 mul /X22 load add 3 div
/Y21 load 2 mul /Y22 load add 3 div
/X22 load /Y22 load curveto
} bd
/SSPD {
dup length /d exch dict def
{
/v exch def
/k exch def
currentpagedevice k known {
/cpdv currentpagedevice k get def
v cpdv ne {
/upd false def
/nullv v type /nulltype eq def
/nullcpdv cpdv type /nulltype eq def
nullv nullcpdv or
{
/upd true def
} {
/sametype v type cpdv type eq def
sametype {
v type /arraytype eq {
/vlen v length def
/cpdvlen cpdv length def
vlen cpdvlen eq {
0 1 vlen 1 sub {
/i exch def
/obj v i get def
/cpdobj cpdv i get def
obj cpdobj ne {
/upd true def
exit
} if
} for
} {
/upd true def
} ifelse
} {
v type /dicttype eq {
v {
/dv exch def
/dk exch def
/cpddv cpdv dk get def
dv cpddv ne {
/upd true def
exit
} if
} forall
} {
/upd true def
} ifelse
} ifelse
} if
} ifelse
upd true eq {
d k v put
} if
} if
} if
} forall
d length 0 gt {
d setpagedevice
} if
} bd
/RE { % /NewFontName [NewEncodingArray] /FontName RE -
  findfont dup length dict begin
  {
    1 index /FID ne
    {def} {pop pop} ifelse
  } forall
  /Encoding exch def
  /FontName 1 index def
  currentdict definefont pop
  end
} bind def
%%EndResource
%%BeginResource: procset (Apache XML Graphics EPS ProcSet) 1.0 0
%%Version: 1.0 0
%%Copyright: (Copyright 2002-2003 The Apache Software Foundation. License terms: http://www.apache.org/licenses/LICENSE-2.0)
/BeginEPSF { %def
/b4_Inc_state save def         % Save state for cleanup
/dict_count countdictstack def % Count objects on dict stack
/op_count count 1 sub def      % Count objects on operand stack
userdict begin                 % Push userdict on dict stack
/showpage { } def              % Redefine showpage, { } = null proc
0 setgray 0 setlinecap         % Prepare graphics state
1 setlinewidth 0 setlinejoin
10 setmiterlimit [ ] 0 setdash newpath
/languagelevel where           % If level not equal to 1 then
{pop languagelevel             % set strokeadjust and
1 ne                           % overprint to their defaults.
{false setstrokeadjust false setoverprint
} if
} if
} bd
/EndEPSF { %def
count op_count sub {pop} repeat            % Clean up stacks
countdictstack dict_count sub {end} repeat
b4_Inc_state restore
} bd
%%EndResource
%FOPBeginFontDict
%%IncludeResource: font Courier-Oblique
%%IncludeResource: font Courier-BoldOblique
%%IncludeResource: font Courier-Bold
%%IncludeResource: font ZapfDingbats
%%IncludeResource: font Symbol
%%IncludeResource: font Helvetica
%%IncludeResource: font Helvetica-Oblique
%%IncludeResource: font Helvetica-Bold
%%IncludeResource: font Helvetica-BoldOblique
%%IncludeResource: font Times-Roman
%%IncludeResource: font Times-Italic
%%IncludeResource: font Times-Bold
%%IncludeResource: font Times-BoldItalic
%%IncludeResource: font Courier
%FOPEndFontDict
%%BeginResource: encoding WinAnsiEncoding
/WinAnsiEncoding [
/.notdef /.notdef /.notdef /.notdef /.notdef
/.notdef /.notdef /.notdef /.notdef /.notdef
/.notdef /.notdef /.notdef /.notdef /.notdef
/.notdef /.notdef /.notdef /.notdef /.notdef
/.notdef /.notdef /.notdef /.notdef /.notdef
/.notdef /.notdef /.notdef /.notdef /.notdef
/.notdef /.notdef /space /exclam /quotedbl
/numbersign /dollar /percent /ampersand /quotesingle
/parenleft /parenright /asterisk /plus /comma
/hyphen /period /slash /zero /one
/two /three /four /five /six
/seven /eight /nine /colon /semicolon
/less /equal /greater /question /at
/A /B /C /D /E
/F /G /H /I /J
/K /L /M /N /O
/P /Q /R /S /T
/U /V /W /X /Y
/Z /bracketleft /backslash /bracketright /asciicircum
/underscore /quoteleft /a /b /c
/d /e /f /g /h
/i /j /k /l /m
/n /o /p /q /r
/s /t /u /v /w
/x /y /z /braceleft /bar
/braceright /asciitilde /bullet /Euro /bullet
/quotesinglbase /florin /quotedblbase /ellipsis /dagger
/daggerdbl /circumflex /perthousand /Scaron /guilsinglleft
/OE /bullet /Zcaron /bullet /bullet
/quoteleft /quoteright /quotedblleft /quotedblright /bullet
/endash /emdash /asciitilde /trademark /scaron
/guilsinglright /oe /bullet /zcaron /Ydieresis
/space /exclamdown /cent /sterling /currency
/yen /brokenbar /section /dieresis /copyright
/ordfeminine /guillemotleft /logicalnot /sfthyphen /registered
/macron /degree /plusminus /twosuperior /threesuperior
/acute /mu /paragraph /middot /cedilla
/onesuperior /ordmasculine /guillemotright /onequarter /onehalf
/threequarters /questiondown /Agrave /Aacute /Acircumflex
/Atilde /Adieresis /Aring /AE /Ccedilla
/Egrave /Eacute /Ecircumflex /Edieresis /Igrave
/Iacute /Icircumflex /Idieresis /Eth /Ntilde
/Ograve /Oacute /Ocircumflex /Otilde /Odieresis
/multiply /Oslash /Ugrave /Uacute /Ucircumflex
/Udieresis /Yacute /Thorn /germandbls /agrave
/aacute /acircumflex /atilde /adieresis /aring
/ae /ccedilla /egrave /eacute /ecircumflex
/edieresis /igrave /iacute /icircumflex /idieresis
/eth /ntilde /ograve /oacute /ocircumflex
/otilde /odieresis /divide /oslash /ugrave
/uacute /ucircumflex /udieresis /yacute /thorn
/ydieresis
] def
%%EndResource
%FOPBeginFontReencode
/Courier-Oblique findfont
dup length dict begin
  {1 index /FID ne {def} {pop pop} ifelse} forall
  /Encoding WinAnsiEncoding def
  currentdict
end
/Courier-Oblique exch definefont pop
/Courier-BoldOblique findfont
dup length dict begin
  {1 index /FID ne {def} {pop pop} ifelse} forall
  /Encoding WinAnsiEncoding def
  currentdict
end
/Courier-BoldOblique exch definefont pop
/Courier-Bold findfont
dup length dict begin
  {1 index /FID ne {def} {pop pop} ifelse} forall
  /Encoding WinAnsiEncoding def
  currentdict
end
/Courier-Bold exch definefont pop
/Helvetica findfont
dup length dict begin
  {1 index /FID ne {def} {pop pop} ifelse} forall
  /Encoding WinAnsiEncoding def
  currentdict
end
/Helvetica exch definefont pop
/Helvetica-Oblique findfont
dup length dict begin
  {1 index /FID ne {def} {pop pop} ifelse} forall
  /Encoding WinAnsiEncoding def
  currentdict
end
/Helvetica-Oblique exch definefont pop
/Helvetica-Bold findfont
dup length dict begin
  {1 index /FID ne {def} {pop pop} ifelse} forall
  /Encoding WinAnsiEncoding def
  currentdict
end
/Helvetica-Bold exch definefont pop
/Helvetica-BoldOblique findfont
dup length dict begin
  {1 index /FID ne {def} {pop pop} ifelse} forall
  /Encoding WinAnsiEncoding def
  currentdict
end
/Helvetica-BoldOblique exch definefont pop
/Times-Roman findfont
dup length dict begin
  {1 index /FID ne {def} {pop pop} ifelse} forall
  /Encoding WinAnsiEncoding def
  currentdict
end
/Times-Roman exch definefont pop
/Times-Italic findfont
dup length dict begin
  {1 index /FID ne {def} {pop pop} ifelse} forall
  /Encoding WinAnsiEncoding def
  currentdict
end
/Times-Italic exch definefont pop
/Times-Bold findfont
dup length dict begin
  {1 index /FID ne {def} {pop pop} ifelse} forall
  /Encoding WinAnsiEncoding def
  currentdict
end
/Times-Bold exch definefont pop
/Times-BoldItalic findfont
dup length dict begin
  {1 index /FID ne {def} {pop pop} ifelse} forall
  /Encoding WinAnsiEncoding def
  currentdict
end
/Times-BoldItalic exch definefont pop
/Courier findfont
dup length dict begin
  {1 index /FID ne {def} {pop pop} ifelse} forall
  /Encoding WinAnsiEncoding def
  currentdict
end
/Courier exch definefont pop
%FOPEndFontReencode
%%EndProlog
%%Page: 1 1
%%PageBoundingBox: 0 0 283 227
%%BeginPageSetup
[1 0 0 -1 0 227] CT
%%EndPageSetup
GS
[1.00164 0 0 0.99899 0 0.22835] CT
N
0 0 M
283 0 L
283 227 L
0 227 L
0 0 L
cp
clip
1 GC
N
0 0 283 227 re
f
GR
GS
[1.00164 0 0 0.99899 0 0.22835] CT
1 GC
N
0 0 283 227 re
f
GR
GS
[1.00164 0 0 0.99899 0 0.22835] CT
1 GC
N
43 152.5 M
256 152.5 L
256 17 L
43 17 L
cp
f
GR
GS
[1.00164 0 0 0.99899 0 0.22835] CT
0.149 GC
1 LJ
0.5 LW
N
43 84.75 M
256 84.75 L
S
GR
GS
[1.00164 0 0 0.99899 0 0.22835] CT
0.6 0.8 0.8 RC
N
63.78 84.75 M
63.78 34.316 L
53.39 34.316 L
53.39 84.75 L
cp
76.768 84.75 M
76.768 45.918 L
66.378 45.918 L
66.378 84.75 L
cp
89.756 84.75 M
89.756 49.208 L
79.366 49.208 L
79.366 84.75 L
cp
102.744 84.75 M
102.744 54.562 L
92.354 54.562 L
92.354 84.75 L
cp
115.732 84.75 M
115.732 64.863 L
105.341 64.863 L
105.341 84.75 L
cp
128.72 84.75 M
128.72 65.633 L
118.329 65.633 L
118.329 84.75 L
cp
141.707 84.75 M
141.707 65.802 L
131.317 65.802 L
131.317 84.75 L
cp
154.695 84.75 M
154.695 69.217 L
144.305 69.217 L
144.305 84.75 L
cp
167.683 84.75 M
167.683 72.013 L
157.293 72.013 L
157.293 84.75 L
cp
180.671 84.75 M
180.671 72.62 L
170.28 72.62 L
170.28 84.75 L
cp
193.659 84.75 M
193.659 81.494 L
183.268 81.494 L
183.268 84.75 L
cp
196.256 84.75 M
196.256 105.043 L
206.646 105.043 L
206.646 84.75 L
cp
209.244 84.75 M
209.244 113.396 L
219.634 113.396 L
219.634 84.75 L
cp
222.232 84.75 M
222.232 113.432 L
232.622 113.432 L
232.622 84.75 L
cp
235.22 84.75 M
235.22 126.374 L
245.61 126.374 L
245.61 84.75 L
cp
f
GR
GS
[1.00164 0 0 0.99899 0 0.22835] CT
1 LJ
1.5 LW
N
58.585 34.316 M
58.585 41.479 L
S
GR
GS
[1.00164 0 0 0.99899 0 0.22835] CT
1 LJ
1.5 LW
N
71.573 45.918 M
71.573 56.284 L
S
GR
GS
[1.00164 0 0 0.99899 0 0.22835] CT
1 LJ
1.5 LW
N
84.561 49.208 M
84.561 60.275 L
S
GR
GS
[1.00164 0 0 0.99899 0 0.22835] CT
1 LJ
1.5 LW
N
97.549 54.562 M
97.549 66.585 L
S
GR
GS
[1.00164 0 0 0.99899 0 0.22835] CT
1 LJ
1.5 LW
N
110.537 64.863 M
110.537 78.126 L
S
GR
GS
[1.00164 0 0 0.99899 0 0.22835] CT
1 LJ
1.5 LW
N
123.524 65.633 M
123.524 78.958 L
S
GR
GS
[1.00164 0 0 0.99899 0 0.22835] CT
1 LJ
1.5 LW
N
136.512 65.802 M
136.512 79.14 L
S
GR
GS
[1.00164 0 0 0.99899 0 0.22835] CT
1 LJ
1.5 LW
N
149.5 69.217 M
149.5 82.781 L
S
GR
GS
[1.00164 0 0 0.99899 0 0.22835] CT
1 LJ
1.5 LW
N
162.488 72.013 M
162.488 85.704 L
S
GR
GS
[1.00164 0 0 0.99899 0 0.22835] CT
1 LJ
1.5 LW
N
175.476 72.62 M
175.476 86.332 L
S
GR
GS
[1.00164 0 0 0.99899 0 0.22835] CT
1 LJ
1.5 LW
N
188.463 81.494 M
188.463 95.25 L
S
GR
GS
[1.00164 0 0 0.99899 0 0.22835] CT
1 LJ
1.5 LW
N
201.451 105.043 M
201.451 116.764 L
S
GR
GS
[1.00164 0 0 0.99899 0 0.22835] CT
1 LJ
1.5 LW
N
214.439 113.396 M
214.439 123.729 L
S
GR
GS
[1.00164 0 0 0.99899 0 0.22835] CT
1 LJ
1.5 LW
N
227.427 113.432 M
227.427 123.758 L
S
GR
GS
[1.00164 0 0 0.99899 0 0.22835] CT
1 LJ
1.5 LW
N
240.415 126.374 M
240.415 133.938 L
S
GR
GS
[1.00164 0 0 0.99899 0 0.22835] CT
1 LJ
1.5 LW
N
58.585 34.316 M
58.585 29.023 L
S
GR
GS
[1.00164 0 0 0.99899 0 0.22835] CT
1 LJ
1.5 LW
N
71.573 45.918 M
71.573 37.698 L
S
GR
GS
[1.00164 0 0 0.99899 0 0.22835] CT
1 LJ
1.5 LW
N
84.561 49.208 M
84.561 40.258 L
S
GR
GS
[1.00164 0 0 0.99899 0 0.22835] CT
1 LJ
1.5 LW
N
97.549 54.562 M
97.549 44.52 L
S
GR
GS
[1.00164 0 0 0.99899 0 0.22835] CT
1 LJ
1.5 LW
N
110.537 64.863 M
110.537 53.082 L
S
GR
GS
[1.00164 0 0 0.99899 0 0.22835] CT
1 LJ
1.5 LW
N
123.524 65.633 M
123.524 53.742 L
S
GR
GS
[1.00164 0 0 0.99899 0 0.22835] CT
1 LJ
1.5 LW
N
136.512 65.802 M
136.512 53.887 L
S
GR
GS
[1.00164 0 0 0.99899 0 0.22835] CT
1 LJ
1.5 LW
N
149.5 69.217 M
149.5 56.852 L
S
GR
GS
[1.00164 0 0 0.99899 0 0.22835] CT
1 LJ
1.5 LW
N
162.488 72.013 M
162.488 59.322 L
S
GR
GS
[1.00164 0 0 0.99899 0 0.22835] CT
1 LJ
1.5 LW
N
175.476 72.62 M
175.476 59.864 L
S
GR
GS
[1.00164 0 0 0.99899 0 0.22835] CT
1 LJ
1.5 LW
N
188.463 81.494 M
188.463 68.002 L
S
GR
GS
[1.00164 0 0 0.99899 0 0.22835] CT
1 LJ
1.5 LW
N
201.451 105.043 M
201.451 91.814 L
S
GR
GS
[1.00164 0 0 0.99899 0 0.22835] CT
1 LJ
1.5 LW
N
214.439 113.396 M
214.439 101.138 L
S
GR
GS
[1.00164 0 0 0.99899 0 0.22835] CT
1 LJ
1.5 LW
N
227.427 113.432 M
227.427 101.179 L
S
GR
GS
[1.00164 0 0 0.99899 0 0.22835] CT
1 LJ
1.5 LW
N
240.415 126.374 M
240.415 116.672 L
S
GR
GS
[1.00164 0 0 0.99899 58.68154 41.66562] CT
N
-3 0 M
3 0 L
f
GR
GS
[1.00164 0 0 0.99899 58.68154 41.66562] CT
10.0 ML
1.5 LW
N
-3 0 M
3 0 L
S
GR
GS
[1.00164 0 0 0.99899 71.69067 56.45553] CT
N
/f1394637256{-3 0 M
3 0 L}def
f1394637256
f
GR
GS
[1.00164 0 0 0.99899 71.69067 56.45553] CT
10.0 ML
1.5 LW
N
-3 0 M
3 0 L
S
GR
GS
[1.00164 0 0 0.99899 84.69979 60.44232] CT
N
f1394637256
f
GR
GS
[1.00164 0 0 0.99899 84.69979 60.44232] CT
10.0 ML
1.5 LW
N
-3 0 M
3 0 L
S
GR
GS
[1.00164 0 0 0.99899 97.70892 66.74609] CT
N
f1394637256
f
GR
GS
[1.00164 0 0 0.99899 97.70892 66.74609] CT
10.0 ML
1.5 LW
N
-3 0 M
3 0 L
S
GR
GS
[1.00164 0 0 0.99899 110.71804 78.27553] CT
N
f1394637256
f
GR
GS
[1.00164 0 0 0.99899 110.71804 78.27553] CT
10.0 ML
1.5 LW
N
-3 0 M
3 0 L
S
GR
GS
[1.00164 0 0 0.99899 123.72717 79.1072] CT
N
f1394637256
f
GR
GS
[1.00164 0 0 0.99899 123.72717 79.1072] CT
10.0 ML
1.5 LW
N
-3 0 M
3 0 L
S
GR
GS
[1.00164 0 0 0.99899 136.73629 79.28893] CT
N
f1394637256
f
GR
GS
[1.00164 0 0 0.99899 136.73629 79.28893] CT
10.0 ML
1.5 LW
N
-3 0 M
3 0 L
S
GR
GS
[1.00164 0 0 0.99899 149.74542 82.92573] CT
N
f1394637256
f
GR
GS
[1.00164 0 0 0.99899 149.74542 82.92573] CT
10.0 ML
1.5 LW
N
-3 0 M
3 0 L
S
GR
GS
[1.00164 0 0 0.99899 162.75455 85.84583] CT
N
f1394637256
f
GR
GS
[1.00164 0 0 0.99899 162.75455 85.84583] CT
10.0 ML
1.5 LW
N
-3 0 M
3 0 L
S
GR
GS
[1.00164 0 0 0.99899 175.76367 86.47361] CT
N
f1394637256
f
GR
GS
[1.00164 0 0 0.99899 175.76367 86.47361] CT
10.0 ML
1.5 LW
N
-3 0 M
3 0 L
S
GR
GS
[1.00164 0 0 0.99899 188.77279 95.38291] CT
N
f1394637256
f
GR
GS
[1.00164 0 0 0.99899 188.77279 95.38291] CT
10.0 ML
1.5 LW
N
-3 0 M
3 0 L
S
GR
GS
[1.00164 0 0 0.99899 201.78192 116.87537] CT
N
f1394637256
f
GR
GS
[1.00164 0 0 0.99899 201.78192 116.87537] CT
10.0 ML
1.5 LW
N
-3 0 M
3 0 L
S
GR
GS
[1.00164 0 0 0.99899 214.79105 123.83283] CT
N
f1394637256
f
GR
GS
[1.00164 0 0 0.99899 214.79105 123.83283] CT
10.0 ML
1.5 LW
N
-3 0 M
3 0 L
S
GR
GS
[1.00164 0 0 0.99899 227.80018 123.86174] CT
N
f1394637256
f
GR
GS
[1.00164 0 0 0.99899 227.80018 123.86174] CT
10.0 ML
1.5 LW
N
-3 0 M
3 0 L
S
GR
GS
[1.00164 0 0 0.99899 240.80929 134.0315] CT
N
f1394637256
f
GR
GS
[1.00164 0 0 0.99899 240.80929 134.0315] CT
10.0 ML
1.5 LW
N
-3 0 M
3 0 L
S
GR
GS
[1.00164 0 0 0.99899 58.68154 29.22181] CT
N
f1394637256
f
GR
GS
[1.00164 0 0 0.99899 58.68154 29.22181] CT
10.0 ML
1.5 LW
N
-3 0 M
3 0 L
S
GR
GS
[1.00164 0 0 0.99899 71.69067 37.88886] CT
N
f1394637256
f
GR
GS
[1.00164 0 0 0.99899 71.69067 37.88886] CT
10.0 ML
1.5 LW
N
-3 0 M
3 0 L
S
GR
GS
[1.00164 0 0 0.99899 84.69979 40.4454] CT
N
f1394637256
f
GR
GS
[1.00164 0 0 0.99899 84.69979 40.4454] CT
10.0 ML
1.5 LW
N
-3 0 M
3 0 L
S
GR
GS
[1.00164 0 0 0.99899 97.70892 44.7034] CT
N
f1394637256
f
GR
GS
[1.00164 0 0 0.99899 97.70892 44.7034] CT
10.0 ML
1.5 LW
N
-3 0 M
3 0 L
S
GR
GS
[1.00164 0 0 0.99899 110.71804 53.25699] CT
N
f1394637256
f
GR
GS
[1.00164 0 0 0.99899 110.71804 53.25699] CT
10.0 ML
1.5 LW
N
-3 0 M
3 0 L
S
GR
GS
[1.00164 0 0 0.99899 123.72717 53.91626] CT
N
f1394637256
f
GR
GS
[1.00164 0 0 0.99899 123.72717 53.91626] CT
10.0 ML
1.5 LW
N
-3 0 M
3 0 L
S
GR
GS
[1.00164 0 0 0.99899 136.73629 54.06112] CT
N
f1394637256
f
GR
GS
[1.00164 0 0 0.99899 136.73629 54.06112] CT
10.0 ML
1.5 LW
N
-3 0 M
3 0 L
S
GR
GS
[1.00164 0 0 0.99899 149.74542 57.02284] CT
N
f1394637256
f
GR
GS
[1.00164 0 0 0.99899 149.74542 57.02284] CT
10.0 ML
1.5 LW
N
-3 0 M
3 0 L
S
GR
GS
[1.00164 0 0 0.99899 162.75455 59.49062] CT
N
f1394637256
f
GR
GS
[1.00164 0 0 0.99899 162.75455 59.49062] CT
10.0 ML
1.5 LW
N
-3 0 M
3 0 L
S
GR
GS
[1.00164 0 0 0.99899 175.76367 60.03204] CT
N
f1394637256
f
GR
GS
[1.00164 0 0 0.99899 175.76367 60.03204] CT
10.0 ML
1.5 LW
N
-3 0 M
3 0 L
S
GR
GS
[1.00164 0 0 0.99899 188.77279 68.16176] CT
N
f1394637256
f
GR
GS
[1.00164 0 0 0.99899 188.77279 68.16176] CT
10.0 ML
1.5 LW
N
-3 0 M
3 0 L
S
GR
GS
[1.00164 0 0 0.99899 201.78192 91.95044] CT
N
f1394637256
f
GR
GS
[1.00164 0 0 0.99899 201.78192 91.95044] CT
10.0 ML
1.5 LW
N
-3 0 M
3 0 L
S
GR
GS
[1.00164 0 0 0.99899 214.79105 101.26466] CT
N
f1394637256
f
GR
GS
[1.00164 0 0 0.99899 214.79105 101.26466] CT
10.0 ML
1.5 LW
N
-3 0 M
3 0 L
S
GR
GS
[1.00164 0 0 0.99899 227.80018 101.30535] CT
N
f1394637256
f
GR
GS
[1.00164 0 0 0.99899 227.80018 101.30535] CT
10.0 ML
1.5 LW
N
-3 0 M
3 0 L
S
GR
GS
[1.00164 0 0 0.99899 240.80929 116.78306] CT
N
f1394637256
f
GR
GS
[1.00164 0 0 0.99899 240.80929 116.78306] CT
10.0 ML
1.5 LW
N
-3 0 M
3 0 L
S
GR
GS
[1.00164 0 0 0.99899 0 0.22835] CT
0.149 GC
2 setlinecap
1 LJ
0.5 LW
N
43 152.5 M
256 152.5 L
S
GR
GS
[1.00164 0 0 0.99899 0 0.22835] CT
0.149 GC
2 setlinecap
1 LJ
0.5 LW
N
43 17 M
256 17 L
S
GR
GS
[1.00164 0 0 0.99899 0 0.22835] CT
0.149 GC
2 setlinecap
1 LJ
0.5 LW
N
58.585 152.5 M
58.585 150.375 L
S
GR
GS
[1.00164 0 0 0.99899 0 0.22835] CT
0.149 GC
2 setlinecap
1 LJ
0.5 LW
N
71.573 152.5 M
71.573 150.375 L
S
GR
GS
[1.00164 0 0 0.99899 0 0.22835] CT
0.149 GC
2 setlinecap
1 LJ
0.5 LW
N
84.561 152.5 M
84.561 150.375 L
S
GR
GS
[1.00164 0 0 0.99899 0 0.22835] CT
0.149 GC
2 setlinecap
1 LJ
0.5 LW
N
97.549 152.5 M
97.549 150.375 L
S
GR
GS
[1.00164 0 0 0.99899 0 0.22835] CT
0.149 GC
2 setlinecap
1 LJ
0.5 LW
N
110.537 152.5 M
110.537 150.375 L
S
GR
GS
[1.00164 0 0 0.99899 0 0.22835] CT
0.149 GC
2 setlinecap
1 LJ
0.5 LW
N
123.524 152.5 M
123.524 150.375 L
S
GR
GS
[1.00164 0 0 0.99899 0 0.22835] CT
0.149 GC
2 setlinecap
1 LJ
0.5 LW
N
136.512 152.5 M
136.512 150.375 L
S
GR
GS
[1.00164 0 0 0.99899 0 0.22835] CT
0.149 GC
2 setlinecap
1 LJ
0.5 LW
N
149.5 152.5 M
149.5 150.375 L
S
GR
GS
[1.00164 0 0 0.99899 0 0.22835] CT
0.149 GC
2 setlinecap
1 LJ
0.5 LW
N
162.488 152.5 M
162.488 150.375 L
S
GR
GS
[1.00164 0 0 0.99899 0 0.22835] CT
0.149 GC
2 setlinecap
1 LJ
0.5 LW
N
175.476 152.5 M
175.476 150.375 L
S
GR
GS
[1.00164 0 0 0.99899 0 0.22835] CT
0.149 GC
2 setlinecap
1 LJ
0.5 LW
N
188.463 152.5 M
188.463 150.375 L
S
GR
GS
[1.00164 0 0 0.99899 0 0.22835] CT
0.149 GC
2 setlinecap
1 LJ
0.5 LW
N
201.451 152.5 M
201.451 150.375 L
S
GR
GS
[1.00164 0 0 0.99899 0 0.22835] CT
0.149 GC
2 setlinecap
1 LJ
0.5 LW
N
214.439 152.5 M
214.439 150.375 L
S
GR
GS
[1.00164 0 0 0.99899 0 0.22835] CT
0.149 GC
2 setlinecap
1 LJ
0.5 LW
N
227.427 152.5 M
227.427 150.375 L
S
GR
GS
[1.00164 0 0 0.99899 0 0.22835] CT
0.149 GC
2 setlinecap
1 LJ
0.5 LW
N
240.415 152.5 M
240.415 150.375 L
S
GR
GS
[1.00164 0 0 0.99899 0 0.22835] CT
0.149 GC
2 setlinecap
1 LJ
0.5 LW
N
58.585 17 M
58.585 19.125 L
S
GR
GS
[1.00164 0 0 0.99899 0 0.22835] CT
0.149 GC
2 setlinecap
1 LJ
0.5 LW
N
71.573 17 M
71.573 19.125 L
S
GR
GS
[1.00164 0 0 0.99899 0 0.22835] CT
0.149 GC
2 setlinecap
1 LJ
0.5 LW
N
84.561 17 M
84.561 19.125 L
S
GR
GS
[1.00164 0 0 0.99899 0 0.22835] CT
0.149 GC
2 setlinecap
1 LJ
0.5 LW
N
97.549 17 M
97.549 19.125 L
S
GR
GS
[1.00164 0 0 0.99899 0 0.22835] CT
0.149 GC
2 setlinecap
1 LJ
0.5 LW
N
110.537 17 M
110.537 19.125 L
S
GR
GS
[1.00164 0 0 0.99899 0 0.22835] CT
0.149 GC
2 setlinecap
1 LJ
0.5 LW
N
123.524 17 M
123.524 19.125 L
S
GR
GS
[1.00164 0 0 0.99899 0 0.22835] CT
0.149 GC
2 setlinecap
1 LJ
0.5 LW
N
136.512 17 M
136.512 19.125 L
S
GR
GS
[1.00164 0 0 0.99899 0 0.22835] CT
0.149 GC
2 setlinecap
1 LJ
0.5 LW
N
149.5 17 M
149.5 19.125 L
S
GR
GS
[1.00164 0 0 0.99899 0 0.22835] CT
0.149 GC
2 setlinecap
1 LJ
0.5 LW
N
162.488 17 M
162.488 19.125 L
S
GR
GS
[1.00164 0 0 0.99899 0 0.22835] CT
0.149 GC
2 setlinecap
1 LJ
0.5 LW
N
175.476 17 M
175.476 19.125 L
S
GR
GS
[1.00164 0 0 0.99899 0 0.22835] CT
0.149 GC
2 setlinecap
1 LJ
0.5 LW
N
188.463 17 M
188.463 19.125 L
S
GR
GS
[1.00164 0 0 0.99899 0 0.22835] CT
0.149 GC
2 setlinecap
1 LJ
0.5 LW
N
201.451 17 M
201.451 19.125 L
S
GR
GS
[1.00164 0 0 0.99899 0 0.22835] CT
0.149 GC
2 setlinecap
1 LJ
0.5 LW
N
214.439 17 M
214.439 19.125 L
S
GR
GS
[1.00164 0 0 0.99899 0 0.22835] CT
0.149 GC
2 setlinecap
1 LJ
0.5 LW
N
227.427 17 M
227.427 19.125 L
S
GR
GS
[1.00164 0 0 0.99899 0 0.22835] CT
0.149 GC
2 setlinecap
1 LJ
0.5 LW
N
240.415 17 M
240.415 19.125 L
S
GR
GS
[0 -0.99899 1.00164 0 58.68154 156.97051] CT
0.149 GC
/Helvetica 12 F
GS
[1 0 0 1 0 0] CT
-36 4.5 moveto 
1 -1 scale
(drift-l1) t 
GR
GR
GS
[0 -0.99899 1.00164 0 71.69067 156.97051] CT
0.149 GC
/Helvetica 12 F
GS
[1 0 0 1 0 0] CT
-28 4.5 moveto 
1 -1 scale
(theta) t 
GR
GR
GS
[0 -0.99899 1.00164 0 84.69979 156.97051] CT
0.149 GC
/Helvetica 12 F
GS
[1 0 0 1 0 0] CT
-30 4.5 moveto 
1 -1 scale
(alpha) t 
GR
GR
GS
[0 -0.99899 1.00164 0 97.70892 156.97051] CT
0.149 GC
/Helvetica 12 F
GS
[1 0 0 1 0 0] CT
-27 4.5 moveto 
1 -1 scale
(pupil) t 
GR
GR
GS
[0 -0.99899 1.00164 0 110.71804 156.97051] CT
0.149 GC
/Helvetica 12 F
GS
[1 0 0 1 0 0] CT
-51 4.5 moveto 
1 -1 scale
(threshold) t 
GR
GR
GS
[0 -0.99899 1.00164 0 123.72717 156.97051] CT
0.149 GC
/Helvetica 12 F
GS
[1 0 0 1 0 0] CT
-43 4.5 moveto 
1 -1 scale
(sampen) t 
GR
GR
GS
[0 -0.99899 1.00164 0 136.73629 156.97051] CT
0.149 GC
/Helvetica 12 F
GS
[1 0 0 1 0 0] CT
-18 4.5 moveto 
1 -1 scale
(ndt) t 
GR
GR
GS
[0 -0.99899 1.00164 0 149.74542 156.97051] CT
0.149 GC
/Helvetica 12 F
GS
[1 0 0 1 0 0] CT
-28 4.5 moveto 
1 -1 scale
(fooof) t 
GR
GR
GS
[0 -0.99899 1.00164 0 162.75455 156.97051] CT
0.149 GC
/Helvetica 12 F
GS
[1 0 0 1 0 0] CT
-70 4.5 moveto 
1 -1 scale
(prestimalpha) t 
GR
GR
GS
[0 -0.99899 1.00164 0 175.76367 156.97051] CT
0.149 GC
/Helvetica 12 F
GS
[1 0 0 1 0 0] CT
-55 4.5 moveto 
1 -1 scale
(cppthresh) t 
GR
GR
GS
[0 -0.99899 1.00164 0 188.77279 156.97051] CT
0.149 GC
/Helvetica 12 F
GS
[1 0 0 1 0 0] CT
-32 4.5 moveto 
1 -1 scale
(ssvep) t 
GR
GR
GS
[0 -0.99899 1.00164 0 201.78192 156.97051] CT
0.149 GC
/Helvetica 12 F
GS
[1 0 0 1 0 0] CT
-65 4.5 moveto 
1 -1 scale
(threshold-l1) t 
GR
GR
GS
[0 -0.99899 1.00164 0 214.79105 156.97051] CT
0.149 GC
/Helvetica 12 F
GS
[1 0 0 1 0 0] CT
-32 4.5 moveto 
1 -1 scale
(ndt-l1) t 
GR
GR
GS
[0 -0.99899 1.00164 0 227.80018 156.97051] CT
0.149 GC
/Helvetica 12 F
GS
[1 0 0 1 0 0] CT
-21 4.5 moveto 
1 -1 scale
(cpp) t 
GR
GR
GS
[0 -0.99899 1.00164 0 240.80929 156.97051] CT
0.149 GC
/Helvetica 12 F
GS
[1 0 0 1 0 0] CT
-22 4.5 moveto 
1 -1 scale
(drift) t 
GR
GR
GS
[1.00164 0 0 0.99899 0 0.22835] CT
0.149 GC
2 setlinecap
1 LJ
0.5 LW
N
43 152.5 M
43 17 L
S
GR
GS
[1.00164 0 0 0.99899 0 0.22835] CT
0.149 GC
2 setlinecap
1 LJ
0.5 LW
N
256 152.5 M
256 17 L
S
GR
GS
[1.00164 0 0 0.99899 0 0.22835] CT
0.149 GC
2 setlinecap
1 LJ
0.5 LW
N
43 152.5 M
45.125 152.5 L
S
GR
GS
[1.00164 0 0 0.99899 0 0.22835] CT
0.149 GC
2 setlinecap
1 LJ
0.5 LW
N
43 118.625 M
45.125 118.625 L
S
GR
GS
[1.00164 0 0 0.99899 0 0.22835] CT
0.149 GC
2 setlinecap
1 LJ
0.5 LW
N
43 84.75 M
45.125 84.75 L
S
GR
GS
[1.00164 0 0 0.99899 0 0.22835] CT
0.149 GC
2 setlinecap
1 LJ
0.5 LW
N
43 50.875 M
45.125 50.875 L
S
GR
GS
[1.00164 0 0 0.99899 0 0.22835] CT
0.149 GC
2 setlinecap
1 LJ
0.5 LW
N
43 17 M
45.125 17 L
S
GR
GS
[1.00164 0 0 0.99899 0 0.22835] CT
0.149 GC
2 setlinecap
1 LJ
0.5 LW
N
256 152.5 M
253.875 152.5 L
S
GR
GS
[1.00164 0 0 0.99899 0 0.22835] CT
0.149 GC
2 setlinecap
1 LJ
0.5 LW
N
256 118.625 M
253.875 118.625 L
S
GR
GS
[1.00164 0 0 0.99899 0 0.22835] CT
0.149 GC
2 setlinecap
1 LJ
0.5 LW
N
256 84.75 M
253.875 84.75 L
S
GR
GS
[1.00164 0 0 0.99899 0 0.22835] CT
0.149 GC
2 setlinecap
1 LJ
0.5 LW
N
256 50.875 M
253.875 50.875 L
S
GR
GS
[1.00164 0 0 0.99899 0 0.22835] CT
0.149 GC
2 setlinecap
1 LJ
0.5 LW
N
256 17 M
253.875 17 L
S
GR
GS
[1.00164 0 0 0.99899 38.66336 152.57494] CT
0.149 GC
/Helvetica 12 F
GS
[1 0 0 1 0 0] CT
-12 4.5 moveto 
1 -1 scale
(-1) t 
GR
GR
GS
[1.00164 0 0 0.99899 38.66336 118.73402] CT
0.149 GC
/Helvetica 12 F
GS
[1 0 0 1 0 0] CT
-22 4.5 moveto 
1 -1 scale
(-0.5) t 
GR
GR
GS
[1.00164 0 0 0.99899 38.66336 84.89309] CT
0.149 GC
/Helvetica 12 F
GS
[1 0 0 1 0 0] CT
-7 4.5 moveto 
1 -1 scale
(0) t 
GR
GR
GS
[1.00164 0 0 0.99899 38.66336 51.05217] CT
0.149 GC
/Helvetica 12 F
GS
[1 0 0 1 0 0] CT
-17 4.5 moveto 
1 -1 scale
(0.5) t 
GR
GR
GS
[1.00164 0 0 0.99899 38.66336 17.21125] CT
0.149 GC
/Helvetica 12 F
GS
[1 0 0 1 0 0] CT
-7 4.5 moveto 
1 -1 scale
(1) t 
GR
GR
GS
[0 -0.99899 1.00164 0 14.62397 84.89303] CT
0.149 GC
/Helvetica 12 F
GS
[1 0 0 1 0 0] CT
-30 -3 moveto 
1 -1 scale
(Correlation) t 
GR
GR
%%Trailer
%%Pages: 1
%%EOF
