%!PS-Adobe-3.0 EPSF-3.0
%%Creator: (MATLAB, The Mathworks, Inc. Version 9.8.0.1323502 \(R2020a\). Operating System: Mac OS X)
%%Title: /Users/kosciessa/Desktop/mntTardisLNDG/LNDG/stateswitch/stsw_fmri_task/pls_mean/figures/behavPLS_1group/d_correlations_behavscore.eps
%%CreationDate: 2022-03-03T13:55:18
%%Pages: (atend)
%%BoundingBox:    37     0   480   183
%%LanguageLevel: 3
%%EndComments
%%BeginProlog
%%BeginResource: procset (Apache XML Graphics Std ProcSet) 1.2 0
%%Version: 1.2 0
%%Copyright: (Copyright 2001-2003,2010 The Apache Software Foundation. License terms: http://www.apache.org/licenses/LICENSE-2.0)
/bd{bind def}bind def
/ld{load def}bd
/GR/grestore ld
/GS/gsave ld
/RM/rmoveto ld
/C/curveto ld
/t/show ld
/L/lineto ld
/ML/setmiterlimit ld
/CT/concat ld
/f/fill ld
/N/newpath ld
/S/stroke ld
/CC/setcmykcolor ld
/A/ashow ld
/cp/closepath ld
/RC/setrgbcolor ld
/LJ/setlinejoin ld
/GC/setgray ld
/LW/setlinewidth ld
/M/moveto ld
/re {4 2 roll M
1 index 0 rlineto
0 exch rlineto
neg 0 rlineto
cp } bd
/_ctm matrix def
/_tm matrix def
/BT { _ctm currentmatrix pop matrix _tm copy pop 0 0 moveto } bd
/ET { _ctm setmatrix } bd
/iTm { _ctm setmatrix _tm concat } bd
/Tm { _tm astore pop iTm 0 0 moveto } bd
/ux 0.0 def
/uy 0.0 def
/F {
  /Tp exch def
  /Tf exch def
  Tf findfont Tp scalefont setfont
  /cf Tf def  /cs Tp def
} bd
/ULS {currentpoint /uy exch def /ux exch def} bd
/ULE {
  /Tcx currentpoint pop def
  gsave
  newpath
  cf findfont cs scalefont dup
  /FontMatrix get 0 get /Ts exch def /FontInfo get dup
  /UnderlinePosition get Ts mul /To exch def
  /UnderlineThickness get Ts mul /Tt exch def
  ux uy To add moveto  Tcx uy To add lineto
  Tt setlinewidth stroke
  grestore
} bd
/OLE {
  /Tcx currentpoint pop def
  gsave
  newpath
  cf findfont cs scalefont dup
  /FontMatrix get 0 get /Ts exch def /FontInfo get dup
  /UnderlinePosition get Ts mul /To exch def
  /UnderlineThickness get Ts mul /Tt exch def
  ux uy To add cs add moveto Tcx uy To add cs add lineto
  Tt setlinewidth stroke
  grestore
} bd
/SOE {
  /Tcx currentpoint pop def
  gsave
  newpath
  cf findfont cs scalefont dup
  /FontMatrix get 0 get /Ts exch def /FontInfo get dup
  /UnderlinePosition get Ts mul /To exch def
  /UnderlineThickness get Ts mul /Tt exch def
  ux uy To add cs 10 mul 26 idiv add moveto Tcx uy To add cs 10 mul 26 idiv add lineto
  Tt setlinewidth stroke
  grestore
} bd
/QT {
/Y22 exch store
/X22 exch store
/Y21 exch store
/X21 exch store
currentpoint
/Y21 load 2 mul add 3 div exch
/X21 load 2 mul add 3 div exch
/X21 load 2 mul /X22 load add 3 div
/Y21 load 2 mul /Y22 load add 3 div
/X22 load /Y22 load curveto
} bd
/SSPD {
dup length /d exch dict def
{
/v exch def
/k exch def
currentpagedevice k known {
/cpdv currentpagedevice k get def
v cpdv ne {
/upd false def
/nullv v type /nulltype eq def
/nullcpdv cpdv type /nulltype eq def
nullv nullcpdv or
{
/upd true def
} {
/sametype v type cpdv type eq def
sametype {
v type /arraytype eq {
/vlen v length def
/cpdvlen cpdv length def
vlen cpdvlen eq {
0 1 vlen 1 sub {
/i exch def
/obj v i get def
/cpdobj cpdv i get def
obj cpdobj ne {
/upd true def
exit
} if
} for
} {
/upd true def
} ifelse
} {
v type /dicttype eq {
v {
/dv exch def
/dk exch def
/cpddv cpdv dk get def
dv cpddv ne {
/upd true def
exit
} if
} forall
} {
/upd true def
} ifelse
} ifelse
} if
} ifelse
upd true eq {
d k v put
} if
} if
} if
} forall
d length 0 gt {
d setpagedevice
} if
} bd
/RE { % /NewFontName [NewEncodingArray] /FontName RE -
  findfont dup length dict begin
  {
    1 index /FID ne
    {def} {pop pop} ifelse
  } forall
  /Encoding exch def
  /FontName 1 index def
  currentdict definefont pop
  end
} bind def
%%EndResource
%%BeginResource: procset (Apache XML Graphics EPS ProcSet) 1.0 0
%%Version: 1.0 0
%%Copyright: (Copyright 2002-2003 The Apache Software Foundation. License terms: http://www.apache.org/licenses/LICENSE-2.0)
/BeginEPSF { %def
/b4_Inc_state save def         % Save state for cleanup
/dict_count countdictstack def % Count objects on dict stack
/op_count count 1 sub def      % Count objects on operand stack
userdict begin                 % Push userdict on dict stack
/showpage { } def              % Redefine showpage, { } = null proc
0 setgray 0 setlinecap         % Prepare graphics state
1 setlinewidth 0 setlinejoin
10 setmiterlimit [ ] 0 setdash newpath
/languagelevel where           % If level not equal to 1 then
{pop languagelevel             % set strokeadjust and
1 ne                           % overprint to their defaults.
{false setstrokeadjust false setoverprint
} if
} if
} bd
/EndEPSF { %def
count op_count sub {pop} repeat            % Clean up stacks
countdictstack dict_count sub {end} repeat
b4_Inc_state restore
} bd
%%EndResource
%FOPBeginFontDict
%%IncludeResource: font Courier-Oblique
%%IncludeResource: font Courier-BoldOblique
%%IncludeResource: font Courier-Bold
%%IncludeResource: font ZapfDingbats
%%IncludeResource: font Symbol
%%IncludeResource: font Helvetica
%%IncludeResource: font Helvetica-Oblique
%%IncludeResource: font Helvetica-Bold
%%IncludeResource: font Helvetica-BoldOblique
%%IncludeResource: font Times-Roman
%%IncludeResource: font Times-Italic
%%IncludeResource: font Times-Bold
%%IncludeResource: font Times-BoldItalic
%%IncludeResource: font Courier
%FOPEndFontDict
%%BeginResource: encoding WinAnsiEncoding
/WinAnsiEncoding [
/.notdef /.notdef /.notdef /.notdef /.notdef
/.notdef /.notdef /.notdef /.notdef /.notdef
/.notdef /.notdef /.notdef /.notdef /.notdef
/.notdef /.notdef /.notdef /.notdef /.notdef
/.notdef /.notdef /.notdef /.notdef /.notdef
/.notdef /.notdef /.notdef /.notdef /.notdef
/.notdef /.notdef /space /exclam /quotedbl
/numbersign /dollar /percent /ampersand /quotesingle
/parenleft /parenright /asterisk /plus /comma
/hyphen /period /slash /zero /one
/two /three /four /five /six
/seven /eight /nine /colon /semicolon
/less /equal /greater /question /at
/A /B /C /D /E
/F /G /H /I /J
/K /L /M /N /O
/P /Q /R /S /T
/U /V /W /X /Y
/Z /bracketleft /backslash /bracketright /asciicircum
/underscore /quoteleft /a /b /c
/d /e /f /g /h
/i /j /k /l /m
/n /o /p /q /r
/s /t /u /v /w
/x /y /z /braceleft /bar
/braceright /asciitilde /bullet /Euro /bullet
/quotesinglbase /florin /quotedblbase /ellipsis /dagger
/daggerdbl /circumflex /perthousand /Scaron /guilsinglleft
/OE /bullet /Zcaron /bullet /bullet
/quoteleft /quoteright /quotedblleft /quotedblright /bullet
/endash /emdash /asciitilde /trademark /scaron
/guilsinglright /oe /bullet /zcaron /Ydieresis
/space /exclamdown /cent /sterling /currency
/yen /brokenbar /section /dieresis /copyright
/ordfeminine /guillemotleft /logicalnot /sfthyphen /registered
/macron /degree /plusminus /twosuperior /threesuperior
/acute /mu /paragraph /middot /cedilla
/onesuperior /ordmasculine /guillemotright /onequarter /onehalf
/threequarters /questiondown /Agrave /Aacute /Acircumflex
/Atilde /Adieresis /Aring /AE /Ccedilla
/Egrave /Eacute /Ecircumflex /Edieresis /Igrave
/Iacute /Icircumflex /Idieresis /Eth /Ntilde
/Ograve /Oacute /Ocircumflex /Otilde /Odieresis
/multiply /Oslash /Ugrave /Uacute /Ucircumflex
/Udieresis /Yacute /Thorn /germandbls /agrave
/aacute /acircumflex /atilde /adieresis /aring
/ae /ccedilla /egrave /eacute /ecircumflex
/edieresis /igrave /iacute /icircumflex /idieresis
/eth /ntilde /ograve /oacute /ocircumflex
/otilde /odieresis /divide /oslash /ugrave
/uacute /ucircumflex /udieresis /yacute /thorn
/ydieresis
] def
%%EndResource
%FOPBeginFontReencode
/Courier-Oblique findfont
dup length dict begin
  {1 index /FID ne {def} {pop pop} ifelse} forall
  /Encoding WinAnsiEncoding def
  currentdict
end
/Courier-Oblique exch definefont pop
/Courier-BoldOblique findfont
dup length dict begin
  {1 index /FID ne {def} {pop pop} ifelse} forall
  /Encoding WinAnsiEncoding def
  currentdict
end
/Courier-BoldOblique exch definefont pop
/Courier-Bold findfont
dup length dict begin
  {1 index /FID ne {def} {pop pop} ifelse} forall
  /Encoding WinAnsiEncoding def
  currentdict
end
/Courier-Bold exch definefont pop
/Helvetica findfont
dup length dict begin
  {1 index /FID ne {def} {pop pop} ifelse} forall
  /Encoding WinAnsiEncoding def
  currentdict
end
/Helvetica exch definefont pop
/Helvetica-Oblique findfont
dup length dict begin
  {1 index /FID ne {def} {pop pop} ifelse} forall
  /Encoding WinAnsiEncoding def
  currentdict
end
/Helvetica-Oblique exch definefont pop
/Helvetica-Bold findfont
dup length dict begin
  {1 index /FID ne {def} {pop pop} ifelse} forall
  /Encoding WinAnsiEncoding def
  currentdict
end
/Helvetica-Bold exch definefont pop
/Helvetica-BoldOblique findfont
dup length dict begin
  {1 index /FID ne {def} {pop pop} ifelse} forall
  /Encoding WinAnsiEncoding def
  currentdict
end
/Helvetica-BoldOblique exch definefont pop
/Times-Roman findfont
dup length dict begin
  {1 index /FID ne {def} {pop pop} ifelse} forall
  /Encoding WinAnsiEncoding def
  currentdict
end
/Times-Roman exch definefont pop
/Times-Italic findfont
dup length dict begin
  {1 index /FID ne {def} {pop pop} ifelse} forall
  /Encoding WinAnsiEncoding def
  currentdict
end
/Times-Italic exch definefont pop
/Times-Bold findfont
dup length dict begin
  {1 index /FID ne {def} {pop pop} ifelse} forall
  /Encoding WinAnsiEncoding def
  currentdict
end
/Times-Bold exch definefont pop
/Times-BoldItalic findfont
dup length dict begin
  {1 index /FID ne {def} {pop pop} ifelse} forall
  /Encoding WinAnsiEncoding def
  currentdict
end
/Times-BoldItalic exch definefont pop
/Courier findfont
dup length dict begin
  {1 index /FID ne {def} {pop pop} ifelse} forall
  /Encoding WinAnsiEncoding def
  currentdict
end
/Courier exch definefont pop
%FOPEndFontReencode
%%EndProlog
%%Page: 1 1
%%PageBoundingBox: 0 0 512 187
%%BeginPageSetup
[1 0 0 -1 0 187] CT
%%EndPageSetup
GS
[1 0 0 1.00107 0 -0.2] CT
1 GC
N
0 0 512 187 re
f
GR
GS
[1 0 0 1.00107 0 -0.2] CT
1 GC
N
0 0 512 187 re
f
GR
GS
[1 0 0 1.00107 0 -0.2] CT
0.2 GC
N
66.5 148 M
235 148 L
235 21 L
66.5 21 L
cp
f
GR
GS
[1 0 0 1.00107 0 -0.2] CT
0.149 GC
2 setlinecap
1 LJ
0.5 LW
N
66.5 148 M
235 148 L
S
GR
GS
[1 0 0 1.00107 0 -0.2] CT
0.149 GC
2 setlinecap
1 LJ
0.5 LW
N
95.702 148 M
95.702 146.315 L
S
GR
GS
[1 0 0 1.00107 0 -0.2] CT
0.149 GC
2 setlinecap
1 LJ
0.5 LW
N
139.719 148 M
139.719 146.315 L
S
GR
GS
[1 0 0 1.00107 0 -0.2] CT
0.149 GC
2 setlinecap
1 LJ
0.5 LW
N
183.735 148 M
183.735 146.315 L
S
GR
GS
[1 0 0 1.00107 0 -0.2] CT
0.149 GC
2 setlinecap
1 LJ
0.5 LW
N
227.752 148 M
227.752 146.315 L
S
GR
GS
[1 0 0 1.00107 95.70215 152.76343] CT
0.149 GC
/Helvetica 14 F
GS
[1 0 0 1 0 0] CT
-4 14 moveto 
1 -1 scale
(0) t 
GR
GR
GS
[1 0 0 1.00107 139.71878 152.76343] CT
0.149 GC
/Helvetica 14 F
GS
[1 0 0 1 0 0] CT
-16 14 moveto 
1 -1 scale
(5000) t 
GR
GR
GS
[1 0 0 1.00107 183.73541 152.76343] CT
0.149 GC
/Helvetica 14 F
GS
[1 0 0 1 0 0] CT
-19.5 14 moveto 
1 -1 scale
(10000) t 
GR
GR
GS
[1 0 0 1.00107 227.75204 152.76343] CT
0.149 GC
/Helvetica 14 F
GS
[1 0 0 1 0 0] CT
-19.5 14 moveto 
1 -1 scale
(15000) t 
GR
GR
GS
[1 0 0 1.00107 150.75008 170.28214] CT
0.149 GC
/Helvetica 14 F
GS
[1 0 0 1 0 0] CT
-74.5 14 moveto 
1 -1 scale
(fMRI Brainscore \(arb.u.\)) t 
GR
GR
GS
[1 0 0 1.00107 0 -0.2] CT
0.149 GC
2 setlinecap
1 LJ
0.5 LW
N
66.5 148 M
66.5 21 L
S
GR
GS
[1 0 0 1.00107 0 -0.2] CT
0.149 GC
2 setlinecap
1 LJ
0.5 LW
N
66.5 120.88 M
68.185 120.88 L
S
GR
GS
[1 0 0 1.00107 0 -0.2] CT
0.149 GC
2 setlinecap
1 LJ
0.5 LW
N
66.5 83.361 M
68.185 83.361 L
S
GR
GS
[1 0 0 1.00107 0 -0.2] CT
0.149 GC
2 setlinecap
1 LJ
0.5 LW
N
66.5 45.841 M
68.185 45.841 L
S
GR
GS
[1 0 0 1.00107 61.7 120.80966] CT
0.149 GC
/Helvetica 14 F
GS
[1 0 0 1 0 0] CT
-8 5.5 moveto 
1 -1 scale
(0) t 
GR
GR
GS
[1 0 0 1.00107 61.7 83.24997] CT
0.149 GC
/Helvetica 14 F
GS
[1 0 0 1 0 0] CT
-8 5.5 moveto 
1 -1 scale
(2) t 
GR
GR
GS
[1 0 0 1.00107 61.7 45.69027] CT
0.149 GC
/Helvetica 14 F
GS
[1 0 0 1 0 0] CT
-8 5.5 moveto 
1 -1 scale
(4) t 
GR
GR
GS
[0 -1.00107 1 0 50.7 84.39031] CT
0.149 GC
/Helvetica 14 F
GS
[1 0 0 1 0 0] CT
-53.5 -3 moveto 
1 -1 scale
(Behavioral Score) t 
GR
GR
GS
[1 0 0 1.00107 150.75014 19.07059] CT
/Helvetica-Bold 14 F
GS
[1 0 0 1 0 0] CT
-72 -4 moveto 
1 -1 scale
(r = 0.5 CI = [0.34,0.64]) t 
GR
GR
GS
[1 0 0 1.00107 120.67349 135.71428] CT
0.8 GC
N
0.5 0 M
0.5 -0.276 0.276 -0.5 0 -0.5 C
-0.276 -0.5 -0.5 -0.276 -0.5 0 C
-0.5 0.276 -0.276 0.5 0 0.5 C
0.276 0.5 0.5 0.276 0.5 0 C
cp
f
GR
GS
[1 0 0 1.00107 112.3248 54.1848] CT
0.8 GC
N
/f-2105962265{0.5 0 M
0.5 -0.276 0.276 -0.5 0 -0.5 C
-0.276 -0.5 -0.5 -0.276 -0.5 0 C
-0.5 0.276 -0.276 0.5 0 0.5 C
0.276 0.5 0.5 0.276 0.5 0 C
cp}def
f-2105962265
f
GR
GS
[1 0 0 1.00107 153.05544 92.42951] CT
0.8 GC
N
f-2105962265
f
GR
GS
[1 0 0 1.00107 146.30795 112.23272] CT
0.8 GC
N
f-2105962265
f
GR
GS
[1 0 0 1.00107 121.19232 83.02642] CT
0.8 GC
N
f-2105962265
f
GR
GS
[1 0 0 1.00107 142.866 47.46184] CT
0.8 GC
N
f-2105962265
f
GR
GS
[1 0 0 1.00107 179.5466 67.23907] CT
0.8 GC
N
f-2105962265
f
GR
GS
[1 0 0 1.00107 179.67451 63.6694] CT
0.8 GC
N
f-2105962265
f
GR
GS
[1 0 0 1.00107 94.73135 96.92346] CT
0.8 GC
N
f-2105962265
f
GR
GS
[1 0 0 1.00107 165.94072 108.24661] CT
0.8 GC
N
f-2105962265
f
GR
GS
[1 0 0 1.00107 139.11165 92.56985] CT
0.8 GC
N
f-2105962265
f
GR
GS
[1 0 0 1.00107 162.69505 101.87205] CT
0.8 GC
N
f-2105962265
f
GR
GS
[1 0 0 1.00107 121.00636 95.86993] CT
0.8 GC
N
f-2105962265
f
GR
GS
[1 0 0 1.00107 134.2684 137.36364] CT
0.8 GC
N
f-2105962265
f
GR
GS
[1 0 0 1.00107 124.89455 77.89851] CT
0.8 GC
N
f-2105962265
f
GR
GS
[1 0 0 1.00107 104.73766 83.19342] CT
0.8 GC
N
f-2105962265
f
GR
GS
[1 0 0 1.00107 129.67816 90.85587] CT
0.8 GC
N
f-2105962265
f
GR
GS
[1 0 0 1.00107 132.52397 72.7916] CT
0.8 GC
N
f-2105962265
f
GR
GS
[1 0 0 1.00107 130.23166 79.62797] CT
0.8 GC
N
f-2105962265
f
GR
GS
[1 0 0 1.00107 143.97247 42.52765] CT
0.8 GC
N
f-2105962265
f
GR
GS
[1 0 0 1.00107 145.77774 126.82913] CT
0.8 GC
N
f-2105962265
f
GR
GS
[1 0 0 1.00107 104.18398 94.33724] CT
0.8 GC
N
f-2105962265
f
GR
GS
[1 0 0 1.00107 119.73045 113.48206] CT
0.8 GC
N
f-2105962265
f
GR
GS
[1 0 0 1.00107 157.83701 46.30306] CT
0.8 GC
N
f-2105962265
f
GR
GS
[1 0 0 1.00107 154.31485 85.08613] CT
0.8 GC
N
f-2105962265
f
GR
GS
[1 0 0 1.00107 113.05946 135.20926] CT
0.8 GC
N
f-2105962265
f
GR
GS
[1 0 0 1.00107 129.64799 94.17419] CT
0.8 GC
N
f-2105962265
f
GR
GS
[1 0 0 1.00107 157.71826 43.55005] CT
0.8 GC
N
f-2105962265
f
GR
GS
[1 0 0 1.00107 137.02513 98.88414] CT
0.8 GC
N
f-2105962265
f
GR
GS
[1 0 0 1.00107 125.60787 122.14428] CT
0.8 GC
N
f-2105962265
f
GR
GS
[1 0 0 1.00107 171.19583 87.45099] CT
0.8 GC
N
f-2105962265
f
GR
GS
[1 0 0 1.00107 178.50235 93.19506] CT
0.8 GC
N
f-2105962265
f
GR
GS
[1 0 0 1.00107 220.95833 31.41711] CT
0.8 GC
N
f-2105962265
f
GR
GS
[1 0 0 1.00107 190.05624 37.14632] CT
0.8 GC
N
f-2105962265
f
GR
GS
[1 0 0 1.00107 110.01817 93.88654] CT
0.8 GC
N
f-2105962265
f
GR
GS
[1 0 0 1.00107 193.25789 43.35624] CT
0.8 GC
N
f-2105962265
f
GR
GS
[1 0 0 1.00107 183.73203 47.66229] CT
0.8 GC
N
f-2105962265
f
GR
GS
[1 0 0 1.00107 160.75313 45.0052] CT
0.8 GC
N
f-2105962265
f
GR
GS
[1 0 0 1.00107 155.62337 92.70535] CT
0.8 GC
N
f-2105962265
f
GR
GS
[1 0 0 1.00107 135.48343 84.76616] CT
0.8 GC
N
f-2105962265
f
GR
GS
[1 0 0 1.00107 132.37572 90.01954] CT
0.8 GC
N
f-2105962265
f
GR
GS
[1 0 0 1.00107 164.47076 78.70551] CT
0.8 GC
N
f-2105962265
f
GR
GS
[1 0 0 1.00107 108.40742 116.20073] CT
0.8 GC
N
f-2105962265
f
GR
GS
[1 0 0 1.00107 106.54201 109.48238] CT
0.8 GC
N
f-2105962265
f
GR
GS
[1 0 0 1.00107 125.87801 94.20097] CT
0.8 GC
N
f-2105962265
f
GR
GS
[1 0 0 1.00107 97.45219 124.46318] CT
0.8 GC
N
f-2105962265
f
GR
GS
[1 0 0 1.00107 112.2949 80.45575] CT
0.8 GC
N
f-2105962265
f
GR
GS
[1 0 0 1.00107 98.91851 107.99951] CT
0.8 GC
N
f-2105962265
f
GR
GS
[1 0 0 1.00107 99.70981 137.00819] CT
0.8 GC
N
f-2105962265
f
GR
GS
[1 0 0 1.00107 96.65097 104.55479] CT
0.8 GC
N
f-2105962265
f
GR
GS
[1 0 0 1.00107 101.5424 135.93631] CT
0.8 GC
N
f-2105962265
f
GR
GS
[1 0 0 1.00107 128.58342 115.82274] CT
0.8 GC
N
f-2105962265
f
GR
GS
[1 0 0 1.00107 108.0797 108.41494] CT
0.8 GC
N
f-2105962265
f
GR
GS
[1 0 0 1.00107 86.82675 133.67121] CT
0.8 GC
N
f-2105962265
f
GR
GS
[1 0 0 1.00107 108.90688 104.0696] CT
0.8 GC
N
f-2105962265
f
GR
GS
[1 0 0 1.00107 110.87768 119.03758] CT
0.8 GC
N
f-2105962265
f
GR
GS
[1 0 0 1.00107 141.30028 90.61354] CT
0.8 GC
N
f-2105962265
f
GR
GS
[1 0 0 1.00107 121.03699 92.69429] CT
0.8 GC
N
f-2105962265
f
GR
GS
[1 0 0 1.00107 118.72664 79.39112] CT
0.8 GC
N
f-2105962265
f
GR
GS
[1 0 0 1.00107 110.66084 82.00453] CT
0.8 GC
N
f-2105962265
f
GR
GS
[1 0 0 1.00107 94.29137 98.38244] CT
0.8 GC
N
f-2105962265
f
GR
GS
[1 0 0 1.00107 88.4638 121.21092] CT
0.8 GC
N
f-2105962265
f
GR
GS
[1 0 0 1.00107 123.70015 76.96512] CT
0.8 GC
N
f-2105962265
f
GR
GS
[1 0 0 1.00107 103.71213 89.8451] CT
0.8 GC
N
f-2105962265
f
GR
GS
[1 0 0 1.00107 99.05901 106.45396] CT
0.8 GC
N
f-2105962265
f
GR
GS
[1 0 0 1.00107 109.7794 105.97617] CT
0.8 GC
N
f-2105962265
f
GR
GS
[1 0 0 1.00107 119.74435 85.05101] CT
0.8 GC
N
f-2105962265
f
GR
GS
[1 0 0 1.00107 97.47603 89.94257] CT
0.8 GC
N
f-2105962265
f
GR
GS
[1 0 0 1.00107 148.49602 56.96166] CT
0.8 GC
N
f-2105962265
f
GR
GS
[1 0 0 1.00107 94.85492 110.69264] CT
0.8 GC
N
f-2105962265
f
GR
GS
[1 0 0 1.00107 133.01305 101.07299] CT
0.8 GC
N
f-2105962265
f
GR
GS
[1 0 0 1.00107 133.80882 87.68364] CT
0.8 GC
N
f-2105962265
f
GR
GS
[1 0 0 1.00107 114.86106 60.36875] CT
0.8 GC
N
f-2105962265
f
GR
GS
[1 0 0 1.00107 104.17575 48.12141] CT
0.8 GC
N
f-2105962265
f
GR
GS
[1 0 0 1.00107 93.1769 96.45477] CT
0.8 GC
N
f-2105962265
f
GR
GS
[1 0 0 1.00107 105.51752 93.47423] CT
0.8 GC
N
f-2105962265
f
GR
GS
[1 0 0 1.00107 130.77074 109.34116] CT
0.8 GC
N
f-2105962265
f
GR
GS
[1 0 0 1.00107 129.60971 121.57201] CT
0.8 GC
N
f-2105962265
f
GR
GS
[1 0 0 1.00107 80.54166 58.76846] CT
0.8 GC
N
f-2105962265
f
GR
GS
[1 0 0 1.00107 127.26465 89.52824] CT
0.8 GC
N
f-2105962265
f
GR
GS
[1 0 0 1.00107 125.12421 125.11125] CT
0.8 GC
N
f-2105962265
f
GR
GS
[1 0 0 1.00107 116.24235 88.20082] CT
0.8 GC
N
f-2105962265
f
GR
GS
[1 0 0 1.00107 88.0499 111.43271] CT
0.8 GC
N
f-2105962265
f
GR
GS
[1 0 0 1.00107 87.67241 96.74108] CT
0.8 GC
N
f-2105962265
f
GR
GS
[1 0 0 1.00107 94.56671 85.44531] CT
0.8 GC
N
f-2105962265
f
GR
GS
[1 0 0 1.00107 140.03607 83.93386] CT
0.8 GC
N
f-2105962265
f
GR
GS
[1 0 0 1.00107 122.01163 103.46319] CT
0.8 GC
N
f-2105962265
f
GR
GS
[1 0 0 1.00107 108.16676 100.64295] CT
0.8 GC
N
f-2105962265
f
GR
GS
[1 0 0 1.00107 144.12926 64.34739] CT
0.8 GC
N
f-2105962265
f
GR
GS
[1 0 0 1.00107 111.66986 96.30737] CT
0.8 GC
N
f-2105962265
f
GR
GS
[1 0 0 1.00107 119.75935 126.45577] CT
0.8 GC
N
f-2105962265
f
GR
GS
[1 0 0 1.00107 119.35763 69.28028] CT
0.8 GC
N
f-2105962265
f
GR
GS
[1 0 0 1.00107 117.0957 121.27165] CT
0.8 GC
N
f-2105962265
f
GR
GS
[1 0 0 1.00107 115.9936 113.79487] CT
0.8 GC
N
f-2105962265
f
GR
GS
[1 0 0 1.00107 114.07698 97.86763] CT
0.8 GC
N
f-2105962265
f
GR
GS
[1 0 0 1.00107 0 -0.2] CT
0.6 0.8 0.8 RC
1 LJ
3 LW
N
66.48 120.111 M
227.752 45.136 L
S
GR
GS
[1 0 0 1.00107 120.67349 135.71428] CT
0.8 1 1 RC
N
/f227889816{-3 -3 M
-3 3 L
3 3 L
3 -3 L
cp}def
f227889816
f
GR
GS
[1 0 0 1.00107 112.3248 54.1848] CT
0.8 1 1 RC
N
f227889816
f
GR
GS
[1 0 0 1.00107 153.05544 92.42951] CT
0.8 1 1 RC
N
f227889816
f
GR
GS
[1 0 0 1.00107 146.30795 112.23272] CT
0.8 1 1 RC
N
f227889816
f
GR
GS
[1 0 0 1.00107 121.19232 83.02642] CT
0.8 1 1 RC
N
f227889816
f
GR
GS
[1 0 0 1.00107 142.866 47.46184] CT
0.8 1 1 RC
N
f227889816
f
GR
GS
[1 0 0 1.00107 179.5466 67.23907] CT
0.8 1 1 RC
N
f227889816
f
GR
GS
[1 0 0 1.00107 179.67451 63.6694] CT
0.8 1 1 RC
N
f227889816
f
GR
GS
[1 0 0 1.00107 94.73135 96.92346] CT
0.8 1 1 RC
N
f227889816
f
GR
GS
[1 0 0 1.00107 165.94072 108.24661] CT
0.8 1 1 RC
N
f227889816
f
GR
GS
[1 0 0 1.00107 139.11165 92.56985] CT
0.8 1 1 RC
N
f227889816
f
GR
GS
[1 0 0 1.00107 162.69505 101.87205] CT
0.8 1 1 RC
N
f227889816
f
GR
GS
[1 0 0 1.00107 121.00636 95.86993] CT
0.8 1 1 RC
N
f227889816
f
GR
GS
[1 0 0 1.00107 134.2684 137.36364] CT
0.8 1 1 RC
N
f227889816
f
GR
GS
[1 0 0 1.00107 124.89455 77.89851] CT
0.8 1 1 RC
N
f227889816
f
GR
GS
[1 0 0 1.00107 104.73766 83.19342] CT
0.8 1 1 RC
N
f227889816
f
GR
GS
[1 0 0 1.00107 129.67816 90.85587] CT
0.8 1 1 RC
N
f227889816
f
GR
GS
[1 0 0 1.00107 132.52397 72.7916] CT
0.8 1 1 RC
N
f227889816
f
GR
GS
[1 0 0 1.00107 130.23166 79.62797] CT
0.8 1 1 RC
N
f227889816
f
GR
GS
[1 0 0 1.00107 143.97247 42.52765] CT
0.8 1 1 RC
N
f227889816
f
GR
GS
[1 0 0 1.00107 145.77774 126.82913] CT
0.8 1 1 RC
N
f227889816
f
GR
GS
[1 0 0 1.00107 104.18398 94.33724] CT
0.8 1 1 RC
N
f227889816
f
GR
GS
[1 0 0 1.00107 119.73045 113.48206] CT
0.8 1 1 RC
N
f227889816
f
GR
GS
[1 0 0 1.00107 157.83701 46.30306] CT
0.8 1 1 RC
N
f227889816
f
GR
GS
[1 0 0 1.00107 154.31485 85.08613] CT
0.8 1 1 RC
N
f227889816
f
GR
GS
[1 0 0 1.00107 113.05946 135.20926] CT
0.8 1 1 RC
N
f227889816
f
GR
GS
[1 0 0 1.00107 129.64799 94.17419] CT
0.8 1 1 RC
N
f227889816
f
GR
GS
[1 0 0 1.00107 157.71826 43.55005] CT
0.8 1 1 RC
N
f227889816
f
GR
GS
[1 0 0 1.00107 137.02513 98.88414] CT
0.8 1 1 RC
N
f227889816
f
GR
GS
[1 0 0 1.00107 125.60787 122.14428] CT
0.8 1 1 RC
N
f227889816
f
GR
GS
[1 0 0 1.00107 171.19583 87.45099] CT
0.8 1 1 RC
N
f227889816
f
GR
GS
[1 0 0 1.00107 178.50235 93.19506] CT
0.8 1 1 RC
N
f227889816
f
GR
GS
[1 0 0 1.00107 220.95833 31.41711] CT
0.8 1 1 RC
N
f227889816
f
GR
GS
[1 0 0 1.00107 190.05624 37.14632] CT
0.8 1 1 RC
N
f227889816
f
GR
GS
[1 0 0 1.00107 110.01817 93.88654] CT
0.8 1 1 RC
N
f227889816
f
GR
GS
[1 0 0 1.00107 193.25789 43.35624] CT
0.8 1 1 RC
N
f227889816
f
GR
GS
[1 0 0 1.00107 183.73203 47.66229] CT
0.8 1 1 RC
N
f227889816
f
GR
GS
[1 0 0 1.00107 160.75313 45.0052] CT
0.8 1 1 RC
N
f227889816
f
GR
GS
[1 0 0 1.00107 155.62337 92.70535] CT
0.8 1 1 RC
N
f227889816
f
GR
GS
[1 0 0 1.00107 135.48343 84.76616] CT
0.8 1 1 RC
N
f227889816
f
GR
GS
[1 0 0 1.00107 132.37572 90.01954] CT
0.8 1 1 RC
N
f227889816
f
GR
GS
[1 0 0 1.00107 164.47076 78.70551] CT
0.8 1 1 RC
N
f227889816
f
GR
GS
[1 0 0 1.00107 108.40742 116.20073] CT
0.6 0.8 0.8 RC
N
/f-1969333140{-3.536 0 M
0 4.702 L
3.536 0 L
0 -4.702 L
cp}def
f-1969333140
f
GR
GS
[1 0 0 1.00107 106.54201 109.48238] CT
0.6 0.8 0.8 RC
N
f-1969333140
f
GR
GS
[1 0 0 1.00107 125.87801 94.20097] CT
0.6 0.8 0.8 RC
N
f-1969333140
f
GR
GS
[1 0 0 1.00107 97.45219 124.46318] CT
0.6 0.8 0.8 RC
N
f-1969333140
f
GR
GS
[1 0 0 1.00107 112.2949 80.45575] CT
0.6 0.8 0.8 RC
N
f-1969333140
f
GR
GS
[1 0 0 1.00107 98.91851 107.99951] CT
0.6 0.8 0.8 RC
N
f-1969333140
f
GR
GS
[1 0 0 1.00107 99.70981 137.00819] CT
0.6 0.8 0.8 RC
N
f-1969333140
f
GR
GS
[1 0 0 1.00107 96.65097 104.55479] CT
0.6 0.8 0.8 RC
N
f-1969333140
f
GR
GS
[1 0 0 1.00107 101.5424 135.93631] CT
0.6 0.8 0.8 RC
N
f-1969333140
f
GR
GS
[1 0 0 1.00107 128.58342 115.82274] CT
0.6 0.8 0.8 RC
N
f-1969333140
f
GR
GS
[1 0 0 1.00107 108.0797 108.41494] CT
0.6 0.8 0.8 RC
N
f-1969333140
f
GR
GS
[1 0 0 1.00107 86.82675 133.67121] CT
0.6 0.8 0.8 RC
N
f-1969333140
f
GR
GS
[1 0 0 1.00107 108.90688 104.0696] CT
0.6 0.8 0.8 RC
N
f-1969333140
f
GR
GS
[1 0 0 1.00107 110.87768 119.03758] CT
0.6 0.8 0.8 RC
N
f-1969333140
f
GR
GS
[1 0 0 1.00107 141.30028 90.61354] CT
0.6 0.8 0.8 RC
N
f-1969333140
f
GR
GS
[1 0 0 1.00107 121.03699 92.69429] CT
0.6 0.8 0.8 RC
N
f-1969333140
f
GR
GS
[1 0 0 1.00107 118.72664 79.39112] CT
0.6 0.8 0.8 RC
N
f-1969333140
f
GR
GS
[1 0 0 1.00107 110.66084 82.00453] CT
0.6 0.8 0.8 RC
N
f-1969333140
f
GR
GS
[1 0 0 1.00107 94.29137 98.38244] CT
0.6 0.8 0.8 RC
N
f-1969333140
f
GR
GS
[1 0 0 1.00107 88.4638 121.21092] CT
0.6 0.8 0.8 RC
N
f-1969333140
f
GR
GS
[1 0 0 1.00107 123.70015 76.96512] CT
0.6 0.8 0.8 RC
N
f-1969333140
f
GR
GS
[1 0 0 1.00107 103.71213 89.8451] CT
0.6 0.8 0.8 RC
N
f-1969333140
f
GR
GS
[1 0 0 1.00107 99.05901 106.45396] CT
0.6 0.8 0.8 RC
N
f-1969333140
f
GR
GS
[1 0 0 1.00107 109.7794 105.97617] CT
0.6 0.8 0.8 RC
N
f-1969333140
f
GR
GS
[1 0 0 1.00107 119.74435 85.05101] CT
0.6 0.8 0.8 RC
N
f-1969333140
f
GR
GS
[1 0 0 1.00107 97.47603 89.94257] CT
0.6 0.8 0.8 RC
N
f-1969333140
f
GR
GS
[1 0 0 1.00107 148.49602 56.96166] CT
0.6 0.8 0.8 RC
N
f-1969333140
f
GR
GS
[1 0 0 1.00107 94.85492 110.69264] CT
0.6 0.8 0.8 RC
N
f-1969333140
f
GR
GS
[1 0 0 1.00107 133.01305 101.07299] CT
0.6 0.8 0.8 RC
N
f-1969333140
f
GR
GS
[1 0 0 1.00107 133.80882 87.68364] CT
0.6 0.8 0.8 RC
N
f-1969333140
f
GR
GS
[1 0 0 1.00107 114.86106 60.36875] CT
0.6 0.8 0.8 RC
N
f-1969333140
f
GR
GS
[1 0 0 1.00107 104.17575 48.12141] CT
0.6 0.8 0.8 RC
N
f-1969333140
f
GR
GS
[1 0 0 1.00107 93.1769 96.45477] CT
0.6 0.8 0.8 RC
N
f-1969333140
f
GR
GS
[1 0 0 1.00107 105.51752 93.47423] CT
0.6 0.8 0.8 RC
N
f-1969333140
f
GR
GS
[1 0 0 1.00107 130.77074 109.34116] CT
0.6 0.8 0.8 RC
N
f-1969333140
f
GR
GS
[1 0 0 1.00107 129.60971 121.57201] CT
0.6 0.8 0.8 RC
N
f-1969333140
f
GR
GS
[1 0 0 1.00107 80.54166 58.76846] CT
0.6 0.8 0.8 RC
N
f-1969333140
f
GR
GS
[1 0 0 1.00107 127.26465 89.52824] CT
0.6 0.8 0.8 RC
N
f-1969333140
f
GR
GS
[1 0 0 1.00107 125.12421 125.11125] CT
0.6 0.8 0.8 RC
N
f-1969333140
f
GR
GS
[1 0 0 1.00107 116.24235 88.20082] CT
0.6 0.8 0.8 RC
N
f-1969333140
f
GR
GS
[1 0 0 1.00107 88.0499 111.43271] CT
0.6 0.8 0.8 RC
N
f-1969333140
f
GR
GS
[1 0 0 1.00107 87.67241 96.74108] CT
0.6 0.8 0.8 RC
N
f-1969333140
f
GR
GS
[1 0 0 1.00107 94.56671 85.44531] CT
0.6 0.8 0.8 RC
N
f-1969333140
f
GR
GS
[1 0 0 1.00107 140.03607 83.93386] CT
0.6 0.8 0.8 RC
N
f-1969333140
f
GR
GS
[1 0 0 1.00107 122.01163 103.46319] CT
0.6 0.8 0.8 RC
N
f-1969333140
f
GR
GS
[1 0 0 1.00107 108.16676 100.64295] CT
0.6 0.8 0.8 RC
N
f-1969333140
f
GR
GS
[1 0 0 1.00107 144.12926 64.34739] CT
0.6 0.8 0.8 RC
N
f-1969333140
f
GR
GS
[1 0 0 1.00107 111.66986 96.30737] CT
0.6 0.8 0.8 RC
N
f-1969333140
f
GR
GS
[1 0 0 1.00107 119.75935 126.45577] CT
0.6 0.8 0.8 RC
N
f-1969333140
f
GR
GS
[1 0 0 1.00107 119.35763 69.28028] CT
0.6 0.8 0.8 RC
N
f-1969333140
f
GR
GS
[1 0 0 1.00107 117.0957 121.27165] CT
0.6 0.8 0.8 RC
N
f-1969333140
f
GR
GS
[1 0 0 1.00107 115.9936 113.79487] CT
0.6 0.8 0.8 RC
N
f-1969333140
f
GR
GS
[1 0 0 1.00107 114.07698 97.86763] CT
0.6 0.8 0.8 RC
N
f-1969333140
f
GR
GS
[1 0 0 1.00107 0 -0.2] CT
0.2 GC
N
/f568683572{292 148 M
460.5 148 L
460.5 21 L
292 21 L
cp}def
f568683572
f
GR
GS
[1 0 0 1.00107 0 -0.2] CT
0.149 GC
2 setlinecap
1 LJ
0.5 LW
N
292 148 M
460.5 148 L
S
GR
GS
[1 0 0 1.00107 0 -0.2] CT
0.149 GC
2 setlinecap
1 LJ
0.5 LW
N
312.752 148 M
312.752 146.315 L
S
GR
GS
[1 0 0 1.00107 0 -0.2] CT
0.149 GC
2 setlinecap
1 LJ
0.5 LW
N
361.717 148 M
361.717 146.315 L
S
GR
GS
[1 0 0 1.00107 0 -0.2] CT
0.149 GC
2 setlinecap
1 LJ
0.5 LW
N
410.681 148 M
410.681 146.315 L
S
GR
GS
[1 0 0 1.00107 0 -0.2] CT
0.149 GC
2 setlinecap
1 LJ
0.5 LW
N
459.646 148 M
459.646 146.315 L
S
GR
GS
[1 0 0 1.00107 312.75186 152.76343] CT
0.149 GC
/Helvetica 14 F
GS
[1 0 0 1 0 0] CT
-18.5 14 moveto 
1 -1 scale
(-5000) t 
GR
GR
GS
[1 0 0 1.00107 361.71658 152.76343] CT
0.149 GC
/Helvetica 14 F
GS
[1 0 0 1 0 0] CT
-4 14 moveto 
1 -1 scale
(0) t 
GR
GR
GS
[1 0 0 1.00107 410.6813 152.76343] CT
0.149 GC
/Helvetica 14 F
GS
[1 0 0 1 0 0] CT
-16 14 moveto 
1 -1 scale
(5000) t 
GR
GR
GS
[1 0 0 1.00107 459.64603 152.76343] CT
0.149 GC
/Helvetica 14 F
GS
[1 0 0 1 0 0] CT
-19.5 14 moveto 
1 -1 scale
(10000) t 
GR
GR
GS
[1 0 0 1.00107 376.25009 170.28214] CT
0.149 GC
/Helvetica 14 F
GS
[1 0 0 1 0 0] CT
-74.5 14 moveto 
1 -1 scale
(fMRI Brainscore \(arb.u.\)) t 
GR
GR
GS
[1 0 0 1.00107 0 -0.2] CT
0.149 GC
2 setlinecap
1 LJ
0.5 LW
N
292 148 M
292 21 L
S
GR
GS
[1 0 0 1.00107 0 -0.2] CT
0.149 GC
2 setlinecap
1 LJ
0.5 LW
N
292 121.463 M
293.685 121.463 L
S
GR
GS
[1 0 0 1.00107 0 -0.2] CT
0.149 GC
2 setlinecap
1 LJ
0.5 LW
N
292 83.944 M
293.685 83.944 L
S
GR
GS
[1 0 0 1.00107 0 -0.2] CT
0.149 GC
2 setlinecap
1 LJ
0.5 LW
N
292 46.424 M
293.685 46.424 L
S
GR
GS
[1 0 0 1.00107 287.20001 121.39337] CT
0.149 GC
/Helvetica 14 F
GS
[1 0 0 1 0 0] CT
-14 5.5 moveto 
1 -1 scale
(-2) t 
GR
GR
GS
[1 0 0 1.00107 287.20001 83.83367] CT
0.149 GC
/Helvetica 14 F
GS
[1 0 0 1 0 0] CT
-8 5.5 moveto 
1 -1 scale
(0) t 
GR
GR
GS
[1 0 0 1.00107 287.20001 46.27398] CT
0.149 GC
/Helvetica 14 F
GS
[1 0 0 1 0 0] CT
-8 5.5 moveto 
1 -1 scale
(2) t 
GR
GR
GS
[0 -1.00107 1 0 270.70001 84.39031] CT
0.149 GC
/Helvetica 14 F
GS
[1 0 0 1 0 0] CT
-53.5 -3 moveto 
1 -1 scale
(Behavioral Score) t 
GR
GR
GS
[1 0 0 1.00107 376.25037 19.07059] CT
/Helvetica-Bold 14 F
GS
[1 0 0 1 0 0] CT
-76 -4 moveto 
1 -1 scale
(r = 0.43 CI = [0.25,0.58]) t 
GR
GR
GS
[1 0 0 1.00107 334.90005 135.71428] CT
0.8 GC
N
/f-1618671862{3.162 0 M
3.162 -1.746 1.746 -3.162 0 -3.162 C
-1.746 -3.162 -3.162 -1.746 -3.162 0 C
-3.162 1.746 -1.746 3.162 0 3.162 C
1.746 3.162 3.162 1.746 3.162 0 C
cp}def
f-1618671862
f
GR
GS
[1 0 0 1.00107 325.61285 54.18481] CT
0.8 GC
N
f-1618671862
f
GR
GS
[1 0 0 1.00107 370.92221 92.42951] CT
0.8 GC
N
f-1618671862
f
GR
GS
[1 0 0 1.00107 363.4162 112.23272] CT
0.8 GC
N
f-1618671862
f
GR
GS
[1 0 0 1.00107 335.47723 83.02642] CT
0.8 GC
N
f-1618671862
f
GR
GS
[1 0 0 1.00107 359.58731 47.46184] CT
0.8 GC
N
f-1618671862
f
GR
GS
[1 0 0 1.00107 400.39136 67.23908] CT
0.8 GC
N
f-1618671862
f
GR
GS
[1 0 0 1.00107 400.53363 63.66941] CT
0.8 GC
N
f-1618671862
f
GR
GS
[1 0 0 1.00107 306.04166 96.92346] CT
0.8 GC
N
f-1618671862
f
GR
GS
[1 0 0 1.00107 385.25595 108.24661] CT
0.8 GC
N
f-1618671862
f
GR
GS
[1 0 0 1.00107 355.41095 92.56985] CT
0.8 GC
N
f-1618671862
f
GR
GS
[1 0 0 1.00107 381.64545 101.87205] CT
0.8 GC
N
f-1618671862
f
GR
GS
[1 0 0 1.00107 335.27036 95.86993] CT
0.8 GC
N
f-1618671862
f
GR
GS
[1 0 0 1.00107 350.02322 137.36364] CT
0.8 GC
N
f-1618671862
f
GR
GS
[1 0 0 1.00107 339.59564 77.89851] CT
0.8 GC
N
f-1618671862
f
GR
GS
[1 0 0 1.00107 317.17282 83.19342] CT
0.8 GC
N
f-1618671862
f
GR
GS
[1 0 0 1.00107 344.91699 90.85587] CT
0.8 GC
N
f-1618671862
f
GR
GS
[1 0 0 1.00107 348.0827 72.7916] CT
0.8 GC
N
f-1618671862
f
GR
GS
[1 0 0 1.00107 345.53271 79.62798] CT
0.8 GC
N
f-1618671862
f
GR
GS
[1 0 0 1.00107 360.81818 42.52765] CT
0.8 GC
N
f-1618671862
f
GR
GS
[1 0 0 1.00107 362.82639 126.82913] CT
0.8 GC
N
f-1618671862
f
GR
GS
[1 0 0 1.00107 316.55688 94.33724] CT
0.8 GC
N
f-1618671862
f
GR
GS
[1 0 0 1.00107 333.85101 113.48206] CT
0.8 GC
N
f-1618671862
f
GR
GS
[1 0 0 1.00107 376.24127 46.30307] CT
0.8 GC
N
f-1618671862
f
GR
GS
[1 0 0 1.00107 372.32318 85.08614] CT
0.8 GC
N
f-1618671862
f
GR
GS
[1 0 0 1.00107 326.43011 135.20926] CT
0.8 GC
N
f-1618671862
f
GR
GS
[1 0 0 1.00107 344.88342 94.17419] CT
0.8 GC
N
f-1618671862
f
GR
GS
[1 0 0 1.00107 376.10919 43.55005] CT
0.8 GC
N
f-1618671862
f
GR
GS
[1 0 0 1.00107 353.08987 98.88414] CT
0.8 GC
N
f-1618671862
f
GR
GS
[1 0 0 1.00107 340.38913 122.14428] CT
0.8 GC
N
f-1618671862
f
GR
GS
[1 0 0 1.00107 391.10184 87.45099] CT
0.8 GC
N
f-1618671862
f
GR
GS
[1 0 0 1.00107 399.22971 93.19506] CT
0.8 GC
N
f-1618671862
f
GR
GS
[1 0 0 1.00107 446.45834 31.41712] CT
0.8 GC
N
f-1618671862
f
GR
GS
[1 0 0 1.00107 412.08243 37.14633] CT
0.8 GC
N
f-1618671862
f
GR
GS
[1 0 0 1.00107 323.04694 93.88655] CT
0.8 GC
N
f-1618671862
f
GR
GS
[1 0 0 1.00107 415.64398 43.35624] CT
0.8 GC
N
f-1618671862
f
GR
GS
[1 0 0 1.00107 405.04727 47.66229] CT
0.8 GC
N
f-1618671862
f
GR
GS
[1 0 0 1.00107 379.4852 45.00521] CT
0.8 GC
N
f-1618671862
f
GR
GS
[1 0 0 1.00107 373.77881 92.70535] CT
0.8 GC
N
f-1618671862
f
GR
GS
[1 0 0 1.00107 351.37485 84.76616] CT
0.8 GC
N
f-1618671862
f
GR
GS
[1 0 0 1.00107 347.91779 90.01954] CT
0.8 GC
N
f-1618671862
f
GR
GS
[1 0 0 1.00107 383.62079 78.70551] CT
0.8 GC
N
f-1618671862
f
GR
GS
[1 0 0 1.00107 357.66418 101.38941] CT
0.8 GC
N
f-1618671862
f
GR
GS
[1 0 0 1.00107 355.58908 94.67105] CT
0.8 GC
N
f-1618671862
f
GR
GS
[1 0 0 1.00107 377.09872 79.38966] CT
0.8 GC
N
f-1618671862
f
GR
GS
[1 0 0 1.00107 345.47745 109.65185] CT
0.8 GC
N
f-1618671862
f
GR
GS
[1 0 0 1.00107 361.98868 65.64443] CT
0.8 GC
N
f-1618671862
f
GR
GS
[1 0 0 1.00107 347.10861 93.18818] CT
0.8 GC
N
f-1618671862
f
GR
GS
[1 0 0 1.00107 347.98886 122.19686] CT
0.8 GC
N
f-1618671862
f
GR
GS
[1 0 0 1.00107 344.58615 89.74348] CT
0.8 GC
N
f-1618671862
f
GR
GS
[1 0 0 1.00107 350.02747 121.12497] CT
0.8 GC
N
f-1618671862
f
GR
GS
[1 0 0 1.00107 380.10828 101.01142] CT
0.8 GC
N
f-1618671862
f
GR
GS
[1 0 0 1.00107 357.29965 93.60362] CT
0.8 GC
N
f-1618671862
f
GR
GS
[1 0 0 1.00107 333.65756 118.85989] CT
0.8 GC
N
f-1618671862
f
GR
GS
[1 0 0 1.00107 358.21979 89.25828] CT
0.8 GC
N
f-1618671862
f
GR
GS
[1 0 0 1.00107 360.41214 104.22627] CT
0.8 GC
N
f-1618671862
f
GR
GS
[1 0 0 1.00107 394.25467 75.80222] CT
0.8 GC
N
f-1618671862
f
GR
GS
[1 0 0 1.00107 371.7135 77.88297] CT
0.8 GC
N
f-1618671862
f
GR
GS
[1 0 0 1.00107 369.14343 64.57981] CT
0.8 GC
N
f-1618671862
f
GR
GS
[1 0 0 1.00107 360.17093 67.19322] CT
0.8 GC
N
f-1618671862
f
GR
GS
[1 0 0 1.00107 341.9613 83.57112] CT
0.8 GC
N
f-1618671862
f
GR
GS
[1 0 0 1.00107 335.47864 106.3996] CT
0.8 GC
N
f-1618671862
f
GR
GS
[1 0 0 1.00107 374.67606 62.15381] CT
0.8 GC
N
f-1618671862
f
GR
GS
[1 0 0 1.00107 352.4411 75.03378] CT
0.8 GC
N
f-1618671862
f
GR
GS
[1 0 0 1.00107 347.26489 91.64265] CT
0.8 GC
N
f-1618671862
f
GR
GS
[1 0 0 1.00107 359.1904 91.16485] CT
0.8 GC
N
f-1618671862
f
GR
GS
[1 0 0 1.00107 370.27554 70.23969] CT
0.8 GC
N
f-1618671862
f
GR
GS
[1 0 0 1.00107 345.50397 75.13125] CT
0.8 GC
N
f-1618671862
f
GR
GS
[1 0 0 1.00107 402.25931 42.15034] CT
0.8 GC
N
f-1618671862
f
GR
GS
[1 0 0 1.00107 342.5882 95.88131] CT
0.8 GC
N
f-1618671862
f
GR
GS
[1 0 0 1.00107 385.03583 86.26167] CT
0.8 GC
N
f-1618671862
f
GR
GS
[1 0 0 1.00107 385.92108 72.87233] CT
0.8 GC
N
f-1618671862
f
GR
GS
[1 0 0 1.00107 364.84332 45.55743] CT
0.8 GC
N
f-1618671862
f
GR
GS
[1 0 0 1.00107 352.95682 33.31009] CT
0.8 GC
N
f-1618671862
f
GR
GS
[1 0 0 1.00107 340.72156 81.64345] CT
0.8 GC
N
f-1618671862
f
GR
GS
[1 0 0 1.00107 354.44943 78.66291] CT
0.8 GC
N
f-1618671862
f
GR
GS
[1 0 0 1.00107 382.54147 94.52983] CT
0.8 GC
N
f-1618671862
f
GR
GS
[1 0 0 1.00107 381.24994 106.76069] CT
0.8 GC
N
f-1618671862
f
GR
GS
[1 0 0 1.00107 326.66595 43.95714] CT
0.8 GC
N
f-1618671862
f
GR
GS
[1 0 0 1.00107 378.64124 74.71691] CT
0.8 GC
N
f-1618671862
f
GR
GS
[1 0 0 1.00107 376.26019 110.29992] CT
0.8 GC
N
f-1618671862
f
GR
GS
[1 0 0 1.00107 366.37988 73.3895] CT
0.8 GC
N
f-1618671862
f
GR
GS
[1 0 0 1.00107 335.01822 96.62138] CT
0.8 GC
N
f-1618671862
f
GR
GS
[1 0 0 1.00107 334.59827 81.92975] CT
0.8 GC
N
f-1618671862
f
GR
GS
[1 0 0 1.00107 342.26761 70.63399] CT
0.8 GC
N
f-1618671862
f
GR
GS
[1 0 0 1.00107 392.84836 69.12255] CT
0.8 GC
N
f-1618671862
f
GR
GS
[1 0 0 1.00107 372.79773 88.65186] CT
0.8 GC
N
f-1618671862
f
GR
GS
[1 0 0 1.00107 357.39648 85.83162] CT
0.8 GC
N
f-1618671862
f
GR
GS
[1 0 0 1.00107 397.40167 49.53607] CT
0.8 GC
N
f-1618671862
f
GR
GS
[1 0 0 1.00107 361.2934 81.49606] CT
0.8 GC
N
f-1618671862
f
GR
GS
[1 0 0 1.00107 370.29224 111.64445] CT
0.8 GC
N
f-1618671862
f
GR
GS
[1 0 0 1.00107 369.84537 54.46897] CT
0.8 GC
N
f-1618671862
f
GR
GS
[1 0 0 1.00107 367.32916 106.46033] CT
0.8 GC
N
f-1618671862
f
GR
GS
[1 0 0 1.00107 366.10318 98.98354] CT
0.8 GC
N
f-1618671862
f
GR
GS
[1 0 0 1.00107 363.9711 83.05631] CT
0.8 GC
N
f-1618671862
f
GR
GS
[1 0 0 1.00107 0 -0.2] CT
1 0.6 0.6 RC
1 LJ
3 LW
N
306.042 107.573 M
459.646 42.381 L
S
GR
%%Trailer
%%Pages: 1
%%EOF
