%!PS-Adobe-3.0 EPSF-3.0
%%Creator: (MATLAB, The Mathworks, Inc. Version 9.8.0.1323502 \(R2020a\). Operating System: Mac OS X)
%%Title: /Users/kosciessa/Desktop/mntTardisLNDG/LNDG/stateswitch/stsw_fmri_task/pls_mean/figures/behavPLS_1group/d_correlations_prestimalpha.eps
%%CreationDate: 2022-05-16T17:36:08
%%Pages: (atend)
%%BoundingBox:    39     0   506   185
%%LanguageLevel: 3
%%EndComments
%%BeginProlog
%%BeginResource: procset (Apache XML Graphics Std ProcSet) 1.2 0
%%Version: 1.2 0
%%Copyright: (Copyright 2001-2003,2010 The Apache Software Foundation. License terms: http://www.apache.org/licenses/LICENSE-2.0)
/bd{bind def}bind def
/ld{load def}bd
/GR/grestore ld
/GS/gsave ld
/RM/rmoveto ld
/C/curveto ld
/t/show ld
/L/lineto ld
/ML/setmiterlimit ld
/CT/concat ld
/f/fill ld
/N/newpath ld
/S/stroke ld
/CC/setcmykcolor ld
/A/ashow ld
/cp/closepath ld
/RC/setrgbcolor ld
/LJ/setlinejoin ld
/GC/setgray ld
/LW/setlinewidth ld
/M/moveto ld
/re {4 2 roll M
1 index 0 rlineto
0 exch rlineto
neg 0 rlineto
cp } bd
/_ctm matrix def
/_tm matrix def
/BT { _ctm currentmatrix pop matrix _tm copy pop 0 0 moveto } bd
/ET { _ctm setmatrix } bd
/iTm { _ctm setmatrix _tm concat } bd
/Tm { _tm astore pop iTm 0 0 moveto } bd
/ux 0.0 def
/uy 0.0 def
/F {
  /Tp exch def
  /Tf exch def
  Tf findfont Tp scalefont setfont
  /cf Tf def  /cs Tp def
} bd
/ULS {currentpoint /uy exch def /ux exch def} bd
/ULE {
  /Tcx currentpoint pop def
  gsave
  newpath
  cf findfont cs scalefont dup
  /FontMatrix get 0 get /Ts exch def /FontInfo get dup
  /UnderlinePosition get Ts mul /To exch def
  /UnderlineThickness get Ts mul /Tt exch def
  ux uy To add moveto  Tcx uy To add lineto
  Tt setlinewidth stroke
  grestore
} bd
/OLE {
  /Tcx currentpoint pop def
  gsave
  newpath
  cf findfont cs scalefont dup
  /FontMatrix get 0 get /Ts exch def /FontInfo get dup
  /UnderlinePosition get Ts mul /To exch def
  /UnderlineThickness get Ts mul /Tt exch def
  ux uy To add cs add moveto Tcx uy To add cs add lineto
  Tt setlinewidth stroke
  grestore
} bd
/SOE {
  /Tcx currentpoint pop def
  gsave
  newpath
  cf findfont cs scalefont dup
  /FontMatrix get 0 get /Ts exch def /FontInfo get dup
  /UnderlinePosition get Ts mul /To exch def
  /UnderlineThickness get Ts mul /Tt exch def
  ux uy To add cs 10 mul 26 idiv add moveto Tcx uy To add cs 10 mul 26 idiv add lineto
  Tt setlinewidth stroke
  grestore
} bd
/QT {
/Y22 exch store
/X22 exch store
/Y21 exch store
/X21 exch store
currentpoint
/Y21 load 2 mul add 3 div exch
/X21 load 2 mul add 3 div exch
/X21 load 2 mul /X22 load add 3 div
/Y21 load 2 mul /Y22 load add 3 div
/X22 load /Y22 load curveto
} bd
/SSPD {
dup length /d exch dict def
{
/v exch def
/k exch def
currentpagedevice k known {
/cpdv currentpagedevice k get def
v cpdv ne {
/upd false def
/nullv v type /nulltype eq def
/nullcpdv cpdv type /nulltype eq def
nullv nullcpdv or
{
/upd true def
} {
/sametype v type cpdv type eq def
sametype {
v type /arraytype eq {
/vlen v length def
/cpdvlen cpdv length def
vlen cpdvlen eq {
0 1 vlen 1 sub {
/i exch def
/obj v i get def
/cpdobj cpdv i get def
obj cpdobj ne {
/upd true def
exit
} if
} for
} {
/upd true def
} ifelse
} {
v type /dicttype eq {
v {
/dv exch def
/dk exch def
/cpddv cpdv dk get def
dv cpddv ne {
/upd true def
exit
} if
} forall
} {
/upd true def
} ifelse
} ifelse
} if
} ifelse
upd true eq {
d k v put
} if
} if
} if
} forall
d length 0 gt {
d setpagedevice
} if
} bd
/RE { % /NewFontName [NewEncodingArray] /FontName RE -
  findfont dup length dict begin
  {
    1 index /FID ne
    {def} {pop pop} ifelse
  } forall
  /Encoding exch def
  /FontName 1 index def
  currentdict definefont pop
  end
} bind def
%%EndResource
%%BeginResource: procset (Apache XML Graphics EPS ProcSet) 1.0 0
%%Version: 1.0 0
%%Copyright: (Copyright 2002-2003 The Apache Software Foundation. License terms: http://www.apache.org/licenses/LICENSE-2.0)
/BeginEPSF { %def
/b4_Inc_state save def         % Save state for cleanup
/dict_count countdictstack def % Count objects on dict stack
/op_count count 1 sub def      % Count objects on operand stack
userdict begin                 % Push userdict on dict stack
/showpage { } def              % Redefine showpage, { } = null proc
0 setgray 0 setlinecap         % Prepare graphics state
1 setlinewidth 0 setlinejoin
10 setmiterlimit [ ] 0 setdash newpath
/languagelevel where           % If level not equal to 1 then
{pop languagelevel             % set strokeadjust and
1 ne                           % overprint to their defaults.
{false setstrokeadjust false setoverprint
} if
} if
} bd
/EndEPSF { %def
count op_count sub {pop} repeat            % Clean up stacks
countdictstack dict_count sub {end} repeat
b4_Inc_state restore
} bd
%%EndResource
%FOPBeginFontDict
%%IncludeResource: font Courier-Oblique
%%IncludeResource: font Courier-BoldOblique
%%IncludeResource: font Courier-Bold
%%IncludeResource: font ZapfDingbats
%%IncludeResource: font Symbol
%%IncludeResource: font Helvetica
%%IncludeResource: font Helvetica-Oblique
%%IncludeResource: font Helvetica-Bold
%%IncludeResource: font Helvetica-BoldOblique
%%IncludeResource: font Times-Roman
%%IncludeResource: font Times-Italic
%%IncludeResource: font Times-Bold
%%IncludeResource: font Times-BoldItalic
%%IncludeResource: font Courier
%FOPEndFontDict
%%BeginResource: encoding WinAnsiEncoding
/WinAnsiEncoding [
/.notdef /.notdef /.notdef /.notdef /.notdef
/.notdef /.notdef /.notdef /.notdef /.notdef
/.notdef /.notdef /.notdef /.notdef /.notdef
/.notdef /.notdef /.notdef /.notdef /.notdef
/.notdef /.notdef /.notdef /.notdef /.notdef
/.notdef /.notdef /.notdef /.notdef /.notdef
/.notdef /.notdef /space /exclam /quotedbl
/numbersign /dollar /percent /ampersand /quotesingle
/parenleft /parenright /asterisk /plus /comma
/hyphen /period /slash /zero /one
/two /three /four /five /six
/seven /eight /nine /colon /semicolon
/less /equal /greater /question /at
/A /B /C /D /E
/F /G /H /I /J
/K /L /M /N /O
/P /Q /R /S /T
/U /V /W /X /Y
/Z /bracketleft /backslash /bracketright /asciicircum
/underscore /quoteleft /a /b /c
/d /e /f /g /h
/i /j /k /l /m
/n /o /p /q /r
/s /t /u /v /w
/x /y /z /braceleft /bar
/braceright /asciitilde /bullet /Euro /bullet
/quotesinglbase /florin /quotedblbase /ellipsis /dagger
/daggerdbl /circumflex /perthousand /Scaron /guilsinglleft
/OE /bullet /Zcaron /bullet /bullet
/quoteleft /quoteright /quotedblleft /quotedblright /bullet
/endash /emdash /asciitilde /trademark /scaron
/guilsinglright /oe /bullet /zcaron /Ydieresis
/space /exclamdown /cent /sterling /currency
/yen /brokenbar /section /dieresis /copyright
/ordfeminine /guillemotleft /logicalnot /sfthyphen /registered
/macron /degree /plusminus /twosuperior /threesuperior
/acute /mu /paragraph /middot /cedilla
/onesuperior /ordmasculine /guillemotright /onequarter /onehalf
/threequarters /questiondown /Agrave /Aacute /Acircumflex
/Atilde /Adieresis /Aring /AE /Ccedilla
/Egrave /Eacute /Ecircumflex /Edieresis /Igrave
/Iacute /Icircumflex /Idieresis /Eth /Ntilde
/Ograve /Oacute /Ocircumflex /Otilde /Odieresis
/multiply /Oslash /Ugrave /Uacute /Ucircumflex
/Udieresis /Yacute /Thorn /germandbls /agrave
/aacute /acircumflex /atilde /adieresis /aring
/ae /ccedilla /egrave /eacute /ecircumflex
/edieresis /igrave /iacute /icircumflex /idieresis
/eth /ntilde /ograve /oacute /ocircumflex
/otilde /odieresis /divide /oslash /ugrave
/uacute /ucircumflex /udieresis /yacute /thorn
/ydieresis
] def
%%EndResource
%FOPBeginFontReencode
/Courier-Oblique findfont
dup length dict begin
  {1 index /FID ne {def} {pop pop} ifelse} forall
  /Encoding WinAnsiEncoding def
  currentdict
end
/Courier-Oblique exch definefont pop
/Courier-BoldOblique findfont
dup length dict begin
  {1 index /FID ne {def} {pop pop} ifelse} forall
  /Encoding WinAnsiEncoding def
  currentdict
end
/Courier-BoldOblique exch definefont pop
/Courier-Bold findfont
dup length dict begin
  {1 index /FID ne {def} {pop pop} ifelse} forall
  /Encoding WinAnsiEncoding def
  currentdict
end
/Courier-Bold exch definefont pop
/Helvetica findfont
dup length dict begin
  {1 index /FID ne {def} {pop pop} ifelse} forall
  /Encoding WinAnsiEncoding def
  currentdict
end
/Helvetica exch definefont pop
/Helvetica-Oblique findfont
dup length dict begin
  {1 index /FID ne {def} {pop pop} ifelse} forall
  /Encoding WinAnsiEncoding def
  currentdict
end
/Helvetica-Oblique exch definefont pop
/Helvetica-Bold findfont
dup length dict begin
  {1 index /FID ne {def} {pop pop} ifelse} forall
  /Encoding WinAnsiEncoding def
  currentdict
end
/Helvetica-Bold exch definefont pop
/Helvetica-BoldOblique findfont
dup length dict begin
  {1 index /FID ne {def} {pop pop} ifelse} forall
  /Encoding WinAnsiEncoding def
  currentdict
end
/Helvetica-BoldOblique exch definefont pop
/Times-Roman findfont
dup length dict begin
  {1 index /FID ne {def} {pop pop} ifelse} forall
  /Encoding WinAnsiEncoding def
  currentdict
end
/Times-Roman exch definefont pop
/Times-Italic findfont
dup length dict begin
  {1 index /FID ne {def} {pop pop} ifelse} forall
  /Encoding WinAnsiEncoding def
  currentdict
end
/Times-Italic exch definefont pop
/Times-Bold findfont
dup length dict begin
  {1 index /FID ne {def} {pop pop} ifelse} forall
  /Encoding WinAnsiEncoding def
  currentdict
end
/Times-Bold exch definefont pop
/Times-BoldItalic findfont
dup length dict begin
  {1 index /FID ne {def} {pop pop} ifelse} forall
  /Encoding WinAnsiEncoding def
  currentdict
end
/Times-BoldItalic exch definefont pop
/Courier findfont
dup length dict begin
  {1 index /FID ne {def} {pop pop} ifelse} forall
  /Encoding WinAnsiEncoding def
  currentdict
end
/Courier exch definefont pop
%FOPEndFontReencode
%%EndProlog
%%Page: 1 1
%%PageBoundingBox: 0 0 512 187
%%BeginPageSetup
[1 0 0 -1 0 187] CT
%%EndPageSetup
GS
[1 0 0 1.00107 0 -0.2] CT
1 GC
N
0 0 512 187 re
f
GR
GS
[1 0 0 1.00107 0 -0.2] CT
1 GC
N
0 0 512 187 re
f
GR
GS
[1 0 0 1.00107 0 -0.2] CT
0.2 GC
N
102.5 149.5 M
256 149.5 L
256 18.5 L
102.5 18.5 L
cp
f
GR
GS
[1 0 0 1.00107 0 -0.2] CT
0.149 GC
2 setlinecap
1 LJ
0.5 LW
N
102.5 149.5 M
256 149.5 L
S
GR
GS
[1 0 0 1.00107 0 -0.2] CT
0.149 GC
2 setlinecap
1 LJ
0.5 LW
N
129.103 149.5 M
129.103 147.965 L
S
GR
GS
[1 0 0 1.00107 0 -0.2] CT
0.149 GC
2 setlinecap
1 LJ
0.5 LW
N
169.201 149.5 M
169.201 147.965 L
S
GR
GS
[1 0 0 1.00107 0 -0.2] CT
0.149 GC
2 setlinecap
1 LJ
0.5 LW
N
209.299 149.5 M
209.299 147.965 L
S
GR
GS
[1 0 0 1.00107 0 -0.2] CT
0.149 GC
2 setlinecap
1 LJ
0.5 LW
N
249.397 149.5 M
249.397 147.965 L
S
GR
GS
[1 0 0 1.00107 129.10255 154.26503] CT
0.149 GC
/Helvetica 14 F
GS
[1 0 0 1 0 0] CT
-4 14 moveto 
1 -1 scale
(0) t 
GR
GR
GS
[1 0 0 1.00107 169.20079 154.26503] CT
0.149 GC
/Helvetica 14 F
GS
[1 0 0 1 0 0] CT
-16 14 moveto 
1 -1 scale
(5000) t 
GR
GR
GS
[1 0 0 1.00107 209.29903 154.26503] CT
0.149 GC
/Helvetica 14 F
GS
[1 0 0 1 0 0] CT
-19.5 14 moveto 
1 -1 scale
(10000) t 
GR
GR
GS
[1 0 0 1.00107 249.39726 154.26503] CT
0.149 GC
/Helvetica 14 F
GS
[1 0 0 1 0 0] CT
-19.5 14 moveto 
1 -1 scale
(15000) t 
GR
GR
GS
[1 0 0 1.00107 179.25008 171.78375] CT
0.149 GC
/Helvetica 14 F
GS
[1 0 0 1 0 0] CT
-74.5 14 moveto 
1 -1 scale
(fMRI Brainscore \(arb.u.\)) t 
GR
GR
GS
[1 0 0 1.00107 0 -0.2] CT
0.149 GC
2 setlinecap
1 LJ
0.5 LW
N
102.5 149.5 M
102.5 18.5 L
S
GR
GS
[1 0 0 1.00107 0 -0.2] CT
0.149 GC
2 setlinecap
1 LJ
0.5 LW
N
102.5 147.463 M
104.035 147.463 L
S
GR
GS
[1 0 0 1.00107 0 -0.2] CT
0.149 GC
2 setlinecap
1 LJ
0.5 LW
N
102.5 100.119 M
104.035 100.119 L
S
GR
GS
[1 0 0 1.00107 0 -0.2] CT
0.149 GC
2 setlinecap
1 LJ
0.5 LW
N
102.5 52.775 M
104.035 52.775 L
S
GR
GS
[1 0 0 1.00107 97.7 147.42114] CT
0.149 GC
/Helvetica 14 F
GS
[1 0 0 1 0 0] CT
-25 5.5 moveto 
1 -1 scale
(-0.5) t 
GR
GR
GS
[1 0 0 1.00107 97.7 100.02623] CT
0.149 GC
/Helvetica 14 F
GS
[1 0 0 1 0 0] CT
-8 5.5 moveto 
1 -1 scale
(0) t 
GR
GR
GS
[1 0 0 1.00107 97.7 52.63132] CT
0.149 GC
/Helvetica 14 F
GS
[1 0 0 1 0 0] CT
-20 5.5 moveto 
1 -1 scale
(0.5) t 
GR
GR
GS
[0 -1.00107 1 0 69.7 83.88978] CT
0.149 GC
/Helvetica 14 F
GS
[1 0 0 1 0 0] CT
-41 -20 moveto 
1 -1 scale
(prestimalpha) t 
GR
GR
GS
[0 -1.00107 1 0 69.7 83.88978] CT
0.149 GC
/Helvetica 14 F
GS
[1 0 0 1 0 0] CT
-39 -3 moveto 
1 -1 scale
(\(linear mod.\)) t 
GR
GR
GS
[1 0 0 1.00107 179.25017 16.56792] CT
/Helvetica-Bold 14 F
GS
[1 0 0 1 0 0] CT
-78.5 -4 moveto 
1 -1 scale
(r = 0.19 CI = [-0.01,0.38]) t 
GR
GR
GS
[1 0 0 1.00107 151.85092 80.46896] CT
0.8 GC
N
0.5 0 M
0.5 -0.276 0.276 -0.5 0 -0.5 C
-0.276 -0.5 -0.5 -0.276 -0.5 0 C
-0.5 0.276 -0.276 0.5 0 0.5 C
0.276 0.5 0.5 0.276 0.5 0 C
cp
f
GR
GS
[1 0 0 1.00107 144.24544 90.58402] CT
0.8 GC
N
/f-2105962265{0.5 0 M
0.5 -0.276 0.276 -0.5 0 -0.5 C
-0.276 -0.5 -0.5 -0.276 -0.5 0 C
-0.5 0.276 -0.276 0.5 0 0.5 C
0.276 0.5 0.5 0.276 0.5 0 C
cp}def
f-2105962265
f
GR
GS
[1 0 0 1.00107 181.3502 81.62053] CT
0.8 GC
N
f-2105962265
f
GR
GS
[1 0 0 1.00107 175.20338 97.12758] CT
0.8 GC
N
f-2105962265
f
GR
GS
[1 0 0 1.00107 152.32356 63.37964] CT
0.8 GC
N
f-2105962265
f
GR
GS
[1 0 0 1.00107 172.06783 97.31105] CT
0.8 GC
N
f-2105962265
f
GR
GS
[1 0 0 1.00107 205.48311 101.97674] CT
0.8 GC
N
f-2105962265
f
GR
GS
[1 0 0 1.00107 205.59962 87.49134] CT
0.8 GC
N
f-2105962265
f
GR
GS
[1 0 0 1.00107 128.21817 83.67214] CT
0.8 GC
N
f-2105962265
f
GR
GS
[1 0 0 1.00107 193.08842 108.79041] CT
0.8 GC
N
f-2105962265
f
GR
GS
[1 0 0 1.00107 168.64771 35.60561] CT
0.8 GC
N
f-2105962265
f
GR
GS
[1 0 0 1.00107 190.1317 58.37626] CT
0.8 GC
N
f-2105962265
f
GR
GS
[1 0 0 1.00107 152.15416 87.40112] CT
0.8 GC
N
f-2105962265
f
GR
GS
[1 0 0 1.00107 164.23561 71.59413] CT
0.8 GC
N
f-2105962265
f
GR
GS
[1 0 0 1.00107 155.69623 90.71966] CT
0.8 GC
N
f-2105962265
f
GR
GS
[1 0 0 1.00107 137.33371 126.09823] CT
0.8 GC
N
f-2105962265
f
GR
GS
[1 0 0 1.00107 160.05399 81.41753] CT
0.8 GC
N
f-2105962265
f
GR
GS
[1 0 0 1.00107 162.64647 102.01008] CT
0.8 GC
N
f-2105962265
f
GR
GS
[1 0 0 1.00107 160.55821 111.03761] CT
0.8 GC
N
f-2105962265
f
GR
GS
[1 0 0 1.00107 173.07581 78.45354] CT
0.8 GC
N
f-2105962265
f
GR
GS
[1 0 0 1.00107 174.72037 80.25566] CT
0.8 GC
N
f-2105962265
f
GR
GS
[1 0 0 1.00107 136.82932 138.53155] CT
0.8 GC
N
f-2105962265
f
GR
GS
[1 0 0 1.00107 150.99184 59.97433] CT
0.8 GC
N
f-2105962265
f
GR
GS
[1 0 0 1.00107 185.70612 84.28826] CT
0.8 GC
N
f-2105962265
f
GR
GS
[1 0 0 1.00107 182.49751 66.02684] CT
0.8 GC
N
f-2105962265
f
GR
GS
[1 0 0 1.00107 144.91469 75.95948] CT
0.8 GC
N
f-2105962265
f
GR
GS
[1 0 0 1.00107 160.0265 57.85499] CT
0.8 GC
N
f-2105962265
f
GR
GS
[1 0 0 1.00107 185.59795 70.70678] CT
0.8 GC
N
f-2105962265
f
GR
GS
[1 0 0 1.00107 166.74693 65.40924] CT
0.8 GC
N
f-2105962265
f
GR
GS
[1 0 0 1.00107 156.34604 95.24143] CT
0.8 GC
N
f-2105962265
f
GR
GS
[1 0 0 1.00107 197.87573 29.24813] CT
0.8 GC
N
f-2105962265
f
GR
GS
[1 0 0 1.00107 204.53181 108.81091] CT
0.8 GC
N
f-2105962265
f
GR
GS
[1 0 0 1.00107 243.20833 74.48786] CT
0.8 GC
N
f-2105962265
f
GR
GS
[1 0 0 1.00107 215.05717 58.22168] CT
0.8 GC
N
f-2105962265
f
GR
GS
[1 0 0 1.00107 142.14415 91.27785] CT
0.8 GC
N
f-2105962265
f
GR
GS
[1 0 0 1.00107 217.9738 37.91512] CT
0.8 GC
N
f-2105962265
f
GR
GS
[1 0 0 1.00107 209.29594 91.14142] CT
0.8 GC
N
f-2105962265
f
GR
GS
[1 0 0 1.00107 188.36264 102.50785] CT
0.8 GC
N
f-2105962265
f
GR
GS
[1 0 0 1.00107 183.68954 70.41012] CT
0.8 GC
N
f-2105962265
f
GR
GS
[1 0 0 1.00107 165.34248 83.23635] CT
0.8 GC
N
f-2105962265
f
GR
GS
[1 0 0 1.00107 162.5114 80.9894] CT
0.8 GC
N
f-2105962265
f
GR
GS
[1 0 0 1.00107 191.74933 111.69297] CT
0.8 GC
N
f-2105962265
f
GR
GS
[1 0 0 1.00107 140.67679 93.12748] CT
0.8 GC
N
f-2105962265
f
GR
GS
[1 0 0 1.00107 138.97743 83.3113] CT
0.8 GC
N
f-2105962265
f
GR
GS
[1 0 0 1.00107 156.59213 76.05736] CT
0.8 GC
N
f-2105962265
f
GR
GS
[1 0 0 1.00107 130.69681 104.34378] CT
0.8 GC
N
f-2105962265
f
GR
GS
[1 0 0 1.00107 144.2182 40.54239] CT
0.8 GC
N
f-2105962265
f
GR
GS
[1 0 0 1.00107 132.03259 69.49023] CT
0.8 GC
N
f-2105962265
f
GR
GS
[1 0 0 1.00107 132.75345 107.49948] CT
0.8 GC
N
f-2105962265
f
GR
GS
[1 0 0 1.00107 129.9669 82.25119] CT
0.8 GC
N
f-2105962265
f
GR
GS
[1 0 0 1.00107 134.42291 87.57006] CT
0.8 GC
N
f-2105962265
f
GR
GS
[1 0 0 1.00107 159.0567 79.7231] CT
0.8 GC
N
f-2105962265
f
GR
GS
[1 0 0 1.00107 140.37825 84.12819] CT
0.8 GC
N
f-2105962265
f
GR
GS
[1 0 0 1.00107 121.01725 67.70558] CT
0.8 GC
N
f-2105962265
f
GR
GS
[1 0 0 1.00107 141.13179 80.40402] CT
0.8 GC
N
f-2105962265
f
GR
GS
[1 0 0 1.00107 142.92714 89.57644] CT
0.8 GC
N
f-2105962265
f
GR
GS
[1 0 0 1.00107 170.64149 90.24995] CT
0.8 GC
N
f-2105962265
f
GR
GS
[1 0 0 1.00107 152.18207 108.54872] CT
0.8 GC
N
f-2105962265
f
GR
GS
[1 0 0 1.00107 150.07739 100.0476] CT
0.8 GC
N
f-2105962265
f
GR
GS
[1 0 0 1.00107 142.7296 103.58027] CT
0.8 GC
N
f-2105962265
f
GR
GS
[1 0 0 1.00107 127.81736 71.07073] CT
0.8 GC
N
f-2105962265
f
GR
GS
[1 0 0 1.00107 122.50857 85.99618] CT
0.8 GC
N
f-2105962265
f
GR
GS
[1 0 0 1.00107 154.60814 48.09704] CT
0.8 GC
N
f-2105962265
f
GR
GS
[1 0 0 1.00107 136.39948 91.28255] CT
0.8 GC
N
f-2105962265
f
GR
GS
[1 0 0 1.00107 132.16058 74.4568] CT
0.8 GC
N
f-2105962265
f
GR
GS
[1 0 0 1.00107 141.92664 40.54239] CT
0.8 GC
N
f-2105962265
f
GR
GS
[1 0 0 1.00107 151.00449 61.28352] CT
0.8 GC
N
f-2105962265
f
GR
GS
[1 0 0 1.00107 130.71852 104.58919] CT
0.8 GC
N
f-2105962265
f
GR
GS
[1 0 0 1.00107 177.19667 68.97756] CT
0.8 GC
N
f-2105962265
f
GR
GS
[1 0 0 1.00107 128.33073 90.49717] CT
0.8 GC
N
f-2105962265
f
GR
GS
[1 0 0 1.00107 163.092 88.87592] CT
0.8 GC
N
f-2105962265
f
GR
GS
[1 0 0 1.00107 163.81694 80.63616] CT
0.8 GC
N
f-2105962265
f
GR
GS
[1 0 0 1.00107 146.55592 94.80719] CT
0.8 GC
N
f-2105962265
f
GR
GS
[1 0 0 1.00107 136.82182 88.49274] CT
0.8 GC
N
f-2105962265
f
GR
GS
[1 0 0 1.00107 126.8021 73.36468] CT
0.8 GC
N
f-2105962265
f
GR
GS
[1 0 0 1.00107 138.04414 72.23137] CT
0.8 GC
N
f-2105962265
f
GR
GS
[1 0 0 1.00107 161.0493 53.96799] CT
0.8 GC
N
f-2105962265
f
GR
GS
[1 0 0 1.00107 159.99164 72.75203] CT
0.8 GC
N
f-2105962265
f
GR
GS
[1 0 0 1.00107 115.29166 76.15495] CT
0.8 GC
N
f-2105962265
f
GR
GS
[1 0 0 1.00107 157.85533 91.51961] CT
0.8 GC
N
f-2105962265
f
GR
GS
[1 0 0 1.00107 155.90544 85.50626] CT
0.8 GC
N
f-2105962265
f
GR
GS
[1 0 0 1.00107 147.81425 86.96128] CT
0.8 GC
N
f-2105962265
f
GR
GS
[1 0 0 1.00107 122.13152 86.24149] CT
0.8 GC
N
f-2105962265
f
GR
GS
[1 0 0 1.00107 121.78762 107.8964] CT
0.8 GC
N
f-2105962265
f
GR
GS
[1 0 0 1.00107 128.06819 90.20377] CT
0.8 GC
N
f-2105962265
f
GR
GS
[1 0 0 1.00107 169.48984 40.54239] CT
0.8 GC
N
f-2105962265
f
GR
GS
[1 0 0 1.00107 153.06995 73.7219] CT
0.8 GC
N
f-2105962265
f
GR
GS
[1 0 0 1.00107 140.45755 102.36318] CT
0.8 GC
N
f-2105962265
f
GR
GS
[1 0 0 1.00107 173.21864 65.14025] CT
0.8 GC
N
f-2105962265
f
GR
GS
[1 0 0 1.00107 143.6488 100.38077] CT
0.8 GC
N
f-2105962265
f
GR
GS
[1 0 0 1.00107 151.01816 76.3777] CT
0.8 GC
N
f-2105962265
f
GR
GS
[1 0 0 1.00107 150.65219 94.9007] CT
0.8 GC
N
f-2105962265
f
GR
GS
[1 0 0 1.00107 148.59163 83.41942] CT
0.8 GC
N
f-2105962265
f
GR
GS
[1 0 0 1.00107 147.58763 80.01686] CT
0.8 GC
N
f-2105962265
f
GR
GS
[1 0 0 1.00107 145.84164 82.58859] CT
0.8 GC
N
f-2105962265
f
GR
GS
[1 0 0 1.00107 0 -0.2] CT
1 0.6 0.6 RC
1 LJ
3 LW
N
102.482 90.311 M
249.397 68.665 L
S
GR
GS
[1 0 0 1.00107 151.85092 80.46896] CT
0.8 1 1 RC
N
/f227889816{-3 -3 M
-3 3 L
3 3 L
3 -3 L
cp}def
f227889816
f
GR
GS
[1 0 0 1.00107 144.24544 90.58402] CT
0.8 1 1 RC
N
f227889816
f
GR
GS
[1 0 0 1.00107 181.3502 81.62053] CT
0.8 1 1 RC
N
f227889816
f
GR
GS
[1 0 0 1.00107 175.20338 97.12758] CT
0.8 1 1 RC
N
f227889816
f
GR
GS
[1 0 0 1.00107 152.32356 63.37964] CT
0.8 1 1 RC
N
f227889816
f
GR
GS
[1 0 0 1.00107 172.06783 97.31105] CT
0.8 1 1 RC
N
f227889816
f
GR
GS
[1 0 0 1.00107 205.48311 101.97674] CT
0.8 1 1 RC
N
f227889816
f
GR
GS
[1 0 0 1.00107 205.59962 87.49134] CT
0.8 1 1 RC
N
f227889816
f
GR
GS
[1 0 0 1.00107 128.21817 83.67214] CT
0.8 1 1 RC
N
f227889816
f
GR
GS
[1 0 0 1.00107 193.08842 108.79041] CT
0.8 1 1 RC
N
f227889816
f
GR
GS
[1 0 0 1.00107 168.64771 35.60561] CT
0.8 1 1 RC
N
f227889816
f
GR
GS
[1 0 0 1.00107 190.1317 58.37626] CT
0.8 1 1 RC
N
f227889816
f
GR
GS
[1 0 0 1.00107 152.15416 87.40112] CT
0.8 1 1 RC
N
f227889816
f
GR
GS
[1 0 0 1.00107 164.23561 71.59413] CT
0.8 1 1 RC
N
f227889816
f
GR
GS
[1 0 0 1.00107 155.69623 90.71966] CT
0.8 1 1 RC
N
f227889816
f
GR
GS
[1 0 0 1.00107 137.33371 126.09823] CT
0.8 1 1 RC
N
f227889816
f
GR
GS
[1 0 0 1.00107 160.05399 81.41753] CT
0.8 1 1 RC
N
f227889816
f
GR
GS
[1 0 0 1.00107 162.64647 102.01008] CT
0.8 1 1 RC
N
f227889816
f
GR
GS
[1 0 0 1.00107 160.55821 111.03761] CT
0.8 1 1 RC
N
f227889816
f
GR
GS
[1 0 0 1.00107 173.07581 78.45354] CT
0.8 1 1 RC
N
f227889816
f
GR
GS
[1 0 0 1.00107 174.72037 80.25566] CT
0.8 1 1 RC
N
f227889816
f
GR
GS
[1 0 0 1.00107 136.82932 138.53155] CT
0.8 1 1 RC
N
f227889816
f
GR
GS
[1 0 0 1.00107 150.99184 59.97433] CT
0.8 1 1 RC
N
f227889816
f
GR
GS
[1 0 0 1.00107 185.70612 84.28826] CT
0.8 1 1 RC
N
f227889816
f
GR
GS
[1 0 0 1.00107 182.49751 66.02684] CT
0.8 1 1 RC
N
f227889816
f
GR
GS
[1 0 0 1.00107 144.91469 75.95948] CT
0.8 1 1 RC
N
f227889816
f
GR
GS
[1 0 0 1.00107 160.0265 57.85499] CT
0.8 1 1 RC
N
f227889816
f
GR
GS
[1 0 0 1.00107 185.59795 70.70678] CT
0.8 1 1 RC
N
f227889816
f
GR
GS
[1 0 0 1.00107 166.74693 65.40924] CT
0.8 1 1 RC
N
f227889816
f
GR
GS
[1 0 0 1.00107 156.34604 95.24143] CT
0.8 1 1 RC
N
f227889816
f
GR
GS
[1 0 0 1.00107 197.87573 29.24813] CT
0.8 1 1 RC
N
f227889816
f
GR
GS
[1 0 0 1.00107 204.53181 108.81091] CT
0.8 1 1 RC
N
f227889816
f
GR
GS
[1 0 0 1.00107 243.20833 74.48786] CT
0.8 1 1 RC
N
f227889816
f
GR
GS
[1 0 0 1.00107 215.05717 58.22168] CT
0.8 1 1 RC
N
f227889816
f
GR
GS
[1 0 0 1.00107 142.14415 91.27785] CT
0.8 1 1 RC
N
f227889816
f
GR
GS
[1 0 0 1.00107 217.9738 37.91512] CT
0.8 1 1 RC
N
f227889816
f
GR
GS
[1 0 0 1.00107 209.29594 91.14142] CT
0.8 1 1 RC
N
f227889816
f
GR
GS
[1 0 0 1.00107 188.36264 102.50785] CT
0.8 1 1 RC
N
f227889816
f
GR
GS
[1 0 0 1.00107 183.68954 70.41012] CT
0.8 1 1 RC
N
f227889816
f
GR
GS
[1 0 0 1.00107 165.34248 83.23635] CT
0.8 1 1 RC
N
f227889816
f
GR
GS
[1 0 0 1.00107 162.5114 80.9894] CT
0.8 1 1 RC
N
f227889816
f
GR
GS
[1 0 0 1.00107 191.74933 111.69297] CT
0.8 1 1 RC
N
f227889816
f
GR
GS
[1 0 0 1.00107 140.67679 93.12748] CT
0.6 0.8 0.8 RC
N
/f-1969333140{-3.536 0 M
0 4.702 L
3.536 0 L
0 -4.702 L
cp}def
f-1969333140
f
GR
GS
[1 0 0 1.00107 138.97743 83.3113] CT
0.6 0.8 0.8 RC
N
f-1969333140
f
GR
GS
[1 0 0 1.00107 156.59213 76.05736] CT
0.6 0.8 0.8 RC
N
f-1969333140
f
GR
GS
[1 0 0 1.00107 130.69681 104.34378] CT
0.6 0.8 0.8 RC
N
f-1969333140
f
GR
GS
[1 0 0 1.00107 144.2182 40.54239] CT
0.6 0.8 0.8 RC
N
f-1969333140
f
GR
GS
[1 0 0 1.00107 132.03259 69.49023] CT
0.6 0.8 0.8 RC
N
f-1969333140
f
GR
GS
[1 0 0 1.00107 132.75345 107.49948] CT
0.6 0.8 0.8 RC
N
f-1969333140
f
GR
GS
[1 0 0 1.00107 129.9669 82.25119] CT
0.6 0.8 0.8 RC
N
f-1969333140
f
GR
GS
[1 0 0 1.00107 134.42291 87.57006] CT
0.6 0.8 0.8 RC
N
f-1969333140
f
GR
GS
[1 0 0 1.00107 159.0567 79.7231] CT
0.6 0.8 0.8 RC
N
f-1969333140
f
GR
GS
[1 0 0 1.00107 140.37825 84.12819] CT
0.6 0.8 0.8 RC
N
f-1969333140
f
GR
GS
[1 0 0 1.00107 121.01725 67.70558] CT
0.6 0.8 0.8 RC
N
f-1969333140
f
GR
GS
[1 0 0 1.00107 141.13179 80.40402] CT
0.6 0.8 0.8 RC
N
f-1969333140
f
GR
GS
[1 0 0 1.00107 142.92714 89.57644] CT
0.6 0.8 0.8 RC
N
f-1969333140
f
GR
GS
[1 0 0 1.00107 170.64149 90.24995] CT
0.6 0.8 0.8 RC
N
f-1969333140
f
GR
GS
[1 0 0 1.00107 152.18207 108.54872] CT
0.6 0.8 0.8 RC
N
f-1969333140
f
GR
GS
[1 0 0 1.00107 150.07739 100.0476] CT
0.6 0.8 0.8 RC
N
f-1969333140
f
GR
GS
[1 0 0 1.00107 142.7296 103.58027] CT
0.6 0.8 0.8 RC
N
f-1969333140
f
GR
GS
[1 0 0 1.00107 127.81736 71.07073] CT
0.6 0.8 0.8 RC
N
f-1969333140
f
GR
GS
[1 0 0 1.00107 122.50857 85.99618] CT
0.6 0.8 0.8 RC
N
f-1969333140
f
GR
GS
[1 0 0 1.00107 154.60814 48.09704] CT
0.6 0.8 0.8 RC
N
f-1969333140
f
GR
GS
[1 0 0 1.00107 136.39948 91.28255] CT
0.6 0.8 0.8 RC
N
f-1969333140
f
GR
GS
[1 0 0 1.00107 132.16058 74.4568] CT
0.6 0.8 0.8 RC
N
f-1969333140
f
GR
GS
[1 0 0 1.00107 141.92664 40.54239] CT
0.6 0.8 0.8 RC
N
f-1969333140
f
GR
GS
[1 0 0 1.00107 151.00449 61.28352] CT
0.6 0.8 0.8 RC
N
f-1969333140
f
GR
GS
[1 0 0 1.00107 130.71852 104.58919] CT
0.6 0.8 0.8 RC
N
f-1969333140
f
GR
GS
[1 0 0 1.00107 177.19667 68.97756] CT
0.6 0.8 0.8 RC
N
f-1969333140
f
GR
GS
[1 0 0 1.00107 128.33073 90.49717] CT
0.6 0.8 0.8 RC
N
f-1969333140
f
GR
GS
[1 0 0 1.00107 163.092 88.87592] CT
0.6 0.8 0.8 RC
N
f-1969333140
f
GR
GS
[1 0 0 1.00107 163.81694 80.63616] CT
0.6 0.8 0.8 RC
N
f-1969333140
f
GR
GS
[1 0 0 1.00107 146.55592 94.80719] CT
0.6 0.8 0.8 RC
N
f-1969333140
f
GR
GS
[1 0 0 1.00107 136.82182 88.49274] CT
0.6 0.8 0.8 RC
N
f-1969333140
f
GR
GS
[1 0 0 1.00107 126.8021 73.36468] CT
0.6 0.8 0.8 RC
N
f-1969333140
f
GR
GS
[1 0 0 1.00107 138.04414 72.23137] CT
0.6 0.8 0.8 RC
N
f-1969333140
f
GR
GS
[1 0 0 1.00107 161.0493 53.96799] CT
0.6 0.8 0.8 RC
N
f-1969333140
f
GR
GS
[1 0 0 1.00107 159.99164 72.75203] CT
0.6 0.8 0.8 RC
N
f-1969333140
f
GR
GS
[1 0 0 1.00107 115.29166 76.15495] CT
0.6 0.8 0.8 RC
N
f-1969333140
f
GR
GS
[1 0 0 1.00107 157.85533 91.51961] CT
0.6 0.8 0.8 RC
N
f-1969333140
f
GR
GS
[1 0 0 1.00107 155.90544 85.50626] CT
0.6 0.8 0.8 RC
N
f-1969333140
f
GR
GS
[1 0 0 1.00107 147.81425 86.96128] CT
0.6 0.8 0.8 RC
N
f-1969333140
f
GR
GS
[1 0 0 1.00107 122.13152 86.24149] CT
0.6 0.8 0.8 RC
N
f-1969333140
f
GR
GS
[1 0 0 1.00107 121.78762 107.8964] CT
0.6 0.8 0.8 RC
N
f-1969333140
f
GR
GS
[1 0 0 1.00107 128.06819 90.20377] CT
0.6 0.8 0.8 RC
N
f-1969333140
f
GR
GS
[1 0 0 1.00107 169.48984 40.54239] CT
0.6 0.8 0.8 RC
N
f-1969333140
f
GR
GS
[1 0 0 1.00107 153.06995 73.7219] CT
0.6 0.8 0.8 RC
N
f-1969333140
f
GR
GS
[1 0 0 1.00107 140.45755 102.36318] CT
0.6 0.8 0.8 RC
N
f-1969333140
f
GR
GS
[1 0 0 1.00107 173.21864 65.14025] CT
0.6 0.8 0.8 RC
N
f-1969333140
f
GR
GS
[1 0 0 1.00107 143.6488 100.38077] CT
0.6 0.8 0.8 RC
N
f-1969333140
f
GR
GS
[1 0 0 1.00107 151.01816 76.3777] CT
0.6 0.8 0.8 RC
N
f-1969333140
f
GR
GS
[1 0 0 1.00107 150.65219 94.9007] CT
0.6 0.8 0.8 RC
N
f-1969333140
f
GR
GS
[1 0 0 1.00107 148.59163 83.41942] CT
0.6 0.8 0.8 RC
N
f-1969333140
f
GR
GS
[1 0 0 1.00107 147.58763 80.01686] CT
0.6 0.8 0.8 RC
N
f-1969333140
f
GR
GS
[1 0 0 1.00107 145.84164 82.58859] CT
0.6 0.8 0.8 RC
N
f-1969333140
f
GR
GS
[1 0 0 1.00107 0 -0.2] CT
0.2 GC
N
/f-436321476{333 149.5 M
486.5 149.5 L
486.5 18.5 L
333 18.5 L
cp}def
f-436321476
f
GR
GS
[1 0 0 1.00107 0 -0.2] CT
0.149 GC
2 setlinecap
1 LJ
0.5 LW
N
333 149.5 M
486.5 149.5 L
S
GR
GS
[1 0 0 1.00107 0 -0.2] CT
0.149 GC
2 setlinecap
1 LJ
0.5 LW
N
351.905 149.5 M
351.905 147.965 L
S
GR
GS
[1 0 0 1.00107 0 -0.2] CT
0.149 GC
2 setlinecap
1 LJ
0.5 LW
N
396.51 149.5 M
396.51 147.965 L
S
GR
GS
[1 0 0 1.00107 0 -0.2] CT
0.149 GC
2 setlinecap
1 LJ
0.5 LW
N
441.116 149.5 M
441.116 147.965 L
S
GR
GS
[1 0 0 1.00107 0 -0.2] CT
0.149 GC
2 setlinecap
1 LJ
0.5 LW
N
485.722 149.5 M
485.722 147.965 L
S
GR
GS
[1 0 0 1.00107 351.90451 154.26503] CT
0.149 GC
/Helvetica 14 F
GS
[1 0 0 1 0 0] CT
-18.5 14 moveto 
1 -1 scale
(-5000) t 
GR
GR
GS
[1 0 0 1.00107 396.51035 154.26503] CT
0.149 GC
/Helvetica 14 F
GS
[1 0 0 1 0 0] CT
-4 14 moveto 
1 -1 scale
(0) t 
GR
GR
GS
[1 0 0 1.00107 441.11618 154.26503] CT
0.149 GC
/Helvetica 14 F
GS
[1 0 0 1 0 0] CT
-16 14 moveto 
1 -1 scale
(5000) t 
GR
GR
GS
[1 0 0 1.00107 485.72205 154.26503] CT
0.149 GC
/Helvetica 14 F
GS
[1 0 0 1 0 0] CT
-19.5 14 moveto 
1 -1 scale
(10000) t 
GR
GR
GS
[1 0 0 1.00107 409.75006 171.78375] CT
0.149 GC
/Helvetica 14 F
GS
[1 0 0 1 0 0] CT
-74.5 14 moveto 
1 -1 scale
(fMRI Brainscore \(arb.u.\)) t 
GR
GR
GS
[1 0 0 1.00107 0 -0.2] CT
0.149 GC
2 setlinecap
1 LJ
0.5 LW
N
333 149.5 M
333 18.5 L
S
GR
GS
[1 0 0 1.00107 0 -0.2] CT
0.149 GC
2 setlinecap
1 LJ
0.5 LW
N
333 130.059 M
334.535 130.059 L
S
GR
GS
[1 0 0 1.00107 0 -0.2] CT
0.149 GC
2 setlinecap
1 LJ
0.5 LW
N
333 82.714 M
334.535 82.714 L
S
GR
GS
[1 0 0 1.00107 0 -0.2] CT
0.149 GC
2 setlinecap
1 LJ
0.5 LW
N
333 35.37 M
334.535 35.37 L
S
GR
GS
[1 0 0 1.00107 328.20001 129.99786] CT
0.149 GC
/Helvetica 14 F
GS
[1 0 0 1 0 0] CT
-25 5.5 moveto 
1 -1 scale
(-0.5) t 
GR
GR
GS
[1 0 0 1.00107 328.20001 82.60296] CT
0.149 GC
/Helvetica 14 F
GS
[1 0 0 1 0 0] CT
-8 5.5 moveto 
1 -1 scale
(0) t 
GR
GR
GS
[1 0 0 1.00107 328.20001 35.20806] CT
0.149 GC
/Helvetica 14 F
GS
[1 0 0 1 0 0] CT
-20 5.5 moveto 
1 -1 scale
(0.5) t 
GR
GR
GS
[0 -1.00107 1 0 300.20001 83.88978] CT
0.149 GC
/Helvetica 14 F
GS
[1 0 0 1 0 0] CT
-41 -20 moveto 
1 -1 scale
(prestimalpha) t 
GR
GR
GS
[0 -1.00107 1 0 300.20001 83.88978] CT
0.149 GC
/Helvetica 14 F
GS
[1 0 0 1 0 0] CT
-39 -3 moveto 
1 -1 scale
(\(linear mod.\)) t 
GR
GR
GS
[1 0 0 1.00107 409.7504 16.56791] CT
/Helvetica-Bold 14 F
GS
[1 0 0 1 0 0] CT
-76 -4 moveto 
1 -1 scale
(r = 0.25 CI = [0.05,0.43]) t 
GR
GR
GS
[1 0 0 1.00107 372.08109 80.46896] CT
0.8 GC
N
/f-1618671862{3.162 0 M
3.162 -1.746 1.746 -3.162 0 -3.162 C
-1.746 -3.162 -3.162 -1.746 -3.162 0 C
-3.162 1.746 -1.746 3.162 0 3.162 C
1.746 3.162 3.162 1.746 3.162 0 C
cp}def
f-1618671862
f
GR
GS
[1 0 0 1.00107 363.62064 90.58402] CT
0.8 GC
N
f-1618671862
f
GR
GS
[1 0 0 1.00107 404.89648 81.62053] CT
0.8 GC
N
f-1618671862
f
GR
GS
[1 0 0 1.00107 398.05869 97.12758] CT
0.8 GC
N
f-1618671862
f
GR
GS
[1 0 0 1.00107 372.60684 63.37964] CT
0.8 GC
N
f-1618671862
f
GR
GS
[1 0 0 1.00107 394.57065 97.31105] CT
0.8 GC
N
f-1618671862
f
GR
GS
[1 0 0 1.00107 431.74228 101.97674] CT
0.8 GC
N
f-1618671862
f
GR
GS
[1 0 0 1.00107 431.87189 87.49134] CT
0.8 GC
N
f-1618671862
f
GR
GS
[1 0 0 1.00107 345.79166 83.67214] CT
0.8 GC
N
f-1618671862
f
GR
GS
[1 0 0 1.00107 417.95425 108.79041] CT
0.8 GC
N
f-1618671862
f
GR
GS
[1 0 0 1.00107 390.76605 35.60561] CT
0.8 GC
N
f-1618671862
f
GR
GS
[1 0 0 1.00107 414.66513 58.37626] CT
0.8 GC
N
f-1618671862
f
GR
GS
[1 0 0 1.00107 372.4184 87.40112] CT
0.8 GC
N
f-1618671862
f
GR
GS
[1 0 0 1.00107 385.85797 71.59413] CT
0.8 GC
N
f-1618671862
f
GR
GS
[1 0 0 1.00107 376.35864 90.71966] CT
0.8 GC
N
f-1618671862
f
GR
GS
[1 0 0 1.00107 355.93192 126.09823] CT
0.8 GC
N
f-1618671862
f
GR
GS
[1 0 0 1.00107 381.20627 81.41753] CT
0.8 GC
N
f-1618671862
f
GR
GS
[1 0 0 1.00107 384.09018 102.01008] CT
0.8 GC
N
f-1618671862
f
GR
GS
[1 0 0 1.00107 381.76718 111.03761] CT
0.8 GC
N
f-1618671862
f
GR
GS
[1 0 0 1.00107 395.69193 78.45354] CT
0.8 GC
N
f-1618671862
f
GR
GS
[1 0 0 1.00107 397.52136 80.25566] CT
0.8 GC
N
f-1618671862
f
GR
GS
[1 0 0 1.00107 355.37082 138.53155] CT
0.8 GC
N
f-1618671862
f
GR
GS
[1 0 0 1.00107 371.12543 59.97433] CT
0.8 GC
N
f-1618671862
f
GR
GS
[1 0 0 1.00107 409.74207 84.28826] CT
0.8 GC
N
f-1618671862
f
GR
GS
[1 0 0 1.00107 406.17276 66.02684] CT
0.8 GC
N
f-1618671862
f
GR
GS
[1 0 0 1.00107 364.36511 75.95948] CT
0.8 GC
N
f-1618671862
f
GR
GS
[1 0 0 1.00107 381.17572 57.85499] CT
0.8 GC
N
f-1618671862
f
GR
GS
[1 0 0 1.00107 409.62173 70.70678] CT
0.8 GC
N
f-1618671862
f
GR
GS
[1 0 0 1.00107 388.65161 65.40924] CT
0.8 GC
N
f-1618671862
f
GR
GS
[1 0 0 1.00107 377.08151 95.24143] CT
0.8 GC
N
f-1618671862
f
GR
GS
[1 0 0 1.00107 423.27972 29.24813] CT
0.8 GC
N
f-1618671862
f
GR
GS
[1 0 0 1.00107 430.68405 108.81091] CT
0.8 GC
N
f-1618671862
f
GR
GS
[1 0 0 1.00107 473.70834 74.48786] CT
0.8 GC
N
f-1618671862
f
GR
GS
[1 0 0 1.00107 442.39258 58.22168] CT
0.8 GC
N
f-1618671862
f
GR
GS
[1 0 0 1.00107 361.28311 91.27785] CT
0.8 GC
N
f-1618671862
f
GR
GS
[1 0 0 1.00107 445.63708 37.91511] CT
0.8 GC
N
f-1618671862
f
GR
GS
[1 0 0 1.00107 435.9837 91.14142] CT
0.8 GC
N
f-1618671862
f
GR
GS
[1 0 0 1.00107 412.6972 102.50785] CT
0.8 GC
N
f-1618671862
f
GR
GS
[1 0 0 1.00107 407.49878 70.41012] CT
0.8 GC
N
f-1618671862
f
GR
GS
[1 0 0 1.00107 387.08926 83.23635] CT
0.8 GC
N
f-1618671862
f
GR
GS
[1 0 0 1.00107 383.93994 80.9894] CT
0.8 GC
N
f-1618671862
f
GR
GS
[1 0 0 1.00107 416.46463 111.69296] CT
0.8 GC
N
f-1618671862
f
GR
GS
[1 0 0 1.00107 392.81873 93.9566] CT
0.8 GC
N
f-1618671862
f
GR
GS
[1 0 0 1.00107 390.92834 84.14042] CT
0.8 GC
N
f-1618671862
f
GR
GS
[1 0 0 1.00107 410.52316 76.88648] CT
0.8 GC
N
f-1618671862
f
GR
GS
[1 0 0 1.00107 381.71683 105.17289] CT
0.8 GC
N
f-1618671862
f
GR
GS
[1 0 0 1.00107 396.75824 41.3715] CT
0.8 GC
N
f-1618671862
f
GR
GS
[1 0 0 1.00107 383.20279 70.31934] CT
0.8 GC
N
f-1618671862
f
GR
GS
[1 0 0 1.00107 384.00467 108.3286] CT
0.8 GC
N
f-1618671862
f
GR
GS
[1 0 0 1.00107 380.90491 83.0803] CT
0.8 GC
N
f-1618671862
f
GR
GS
[1 0 0 1.00107 385.86182 88.39918] CT
0.8 GC
N
f-1618671862
f
GR
GS
[1 0 0 1.00107 413.2648 80.55221] CT
0.8 GC
N
f-1618671862
f
GR
GS
[1 0 0 1.00107 392.4866 84.9573] CT
0.8 GC
N
f-1618671862
f
GR
GS
[1 0 0 1.00107 370.94916 68.5347] CT
0.8 GC
N
f-1618671862
f
GR
GS
[1 0 0 1.00107 393.32486 81.23313] CT
0.8 GC
N
f-1618671862
f
GR
GS
[1 0 0 1.00107 395.32205 90.40555] CT
0.8 GC
N
f-1618671862
f
GR
GS
[1 0 0 1.00107 426.15189 91.07906] CT
0.8 GC
N
f-1618671862
f
GR
GS
[1 0 0 1.00107 405.61734 109.37783] CT
0.8 GC
N
f-1618671862
f
GR
GS
[1 0 0 1.00107 403.27606 100.87672] CT
0.8 GC
N
f-1618671862
f
GR
GS
[1 0 0 1.00107 395.10229 104.40938] CT
0.8 GC
N
f-1618671862
f
GR
GS
[1 0 0 1.00107 378.5137 71.89984] CT
0.8 GC
N
f-1618671862
f
GR
GS
[1 0 0 1.00107 372.60812 86.8253] CT
0.8 GC
N
f-1618671862
f
GR
GS
[1 0 0 1.00107 408.31616 48.92615] CT
0.8 GC
N
f-1618671862
f
GR
GS
[1 0 0 1.00107 388.06058 92.11167] CT
0.8 GC
N
f-1618671862
f
GR
GS
[1 0 0 1.00107 383.34515 75.28591] CT
0.8 GC
N
f-1618671862
f
GR
GS
[1 0 0 1.00107 394.20908 41.3715] CT
0.8 GC
N
f-1618671862
f
GR
GS
[1 0 0 1.00107 404.3074 62.11263] CT
0.8 GC
N
f-1618671862
f
GR
GS
[1 0 0 1.00107 381.741 105.4183] CT
0.8 GC
N
f-1618671862
f
GR
GS
[1 0 0 1.00107 433.44394 69.80668] CT
0.8 GC
N
f-1618671862
f
GR
GS
[1 0 0 1.00107 379.08481 91.32628] CT
0.8 GC
N
f-1618671862
f
GR
GS
[1 0 0 1.00107 417.75372 89.70504] CT
0.8 GC
N
f-1618671862
f
GR
GS
[1 0 0 1.00107 418.56015 81.46528] CT
0.8 GC
N
f-1618671862
f
GR
GS
[1 0 0 1.00107 399.35876 95.63631] CT
0.8 GC
N
f-1618671862
f
GR
GS
[1 0 0 1.00107 388.5304 89.32185] CT
0.8 GC
N
f-1618671862
f
GR
GS
[1 0 0 1.00107 377.38434 74.19379] CT
0.8 GC
N
f-1618671862
f
GR
GS
[1 0 0 1.00107 389.89014 73.06048] CT
0.8 GC
N
f-1618671862
f
GR
GS
[1 0 0 1.00107 415.48138 54.79711] CT
0.8 GC
N
f-1618671862
f
GR
GS
[1 0 0 1.00107 414.30484 73.58114] CT
0.8 GC
N
f-1618671862
f
GR
GS
[1 0 0 1.00107 364.57996 76.98407] CT
0.8 GC
N
f-1618671862
f
GR
GS
[1 0 0 1.00107 411.92838 92.34872] CT
0.8 GC
N
f-1618671862
f
GR
GS
[1 0 0 1.00107 409.75928 86.33538] CT
0.8 GC
N
f-1618671862
f
GR
GS
[1 0 0 1.00107 400.75851 87.79039] CT
0.8 GC
N
f-1618671862
f
GR
GS
[1 0 0 1.00107 372.18869 87.07061] CT
0.8 GC
N
f-1618671862
f
GR
GS
[1 0 0 1.00107 371.80615 108.72552] CT
0.8 GC
N
f-1618671862
f
GR
GS
[1 0 0 1.00107 378.79276 91.03289] CT
0.8 GC
N
f-1618671862
f
GR
GS
[1 0 0 1.00107 424.87076 41.3715] CT
0.8 GC
N
f-1618671862
f
GR
GS
[1 0 0 1.00107 406.60504 74.55101] CT
0.8 GC
N
f-1618671862
f
GR
GS
[1 0 0 1.00107 392.57483 103.19229] CT
0.8 GC
N
f-1618671862
f
GR
GS
[1 0 0 1.00107 429.01874 65.96937] CT
0.8 GC
N
f-1618671862
f
GR
GS
[1 0 0 1.00107 396.12485 101.20989] CT
0.8 GC
N
f-1618671862
f
GR
GS
[1 0 0 1.00107 404.3226 77.20681] CT
0.8 GC
N
f-1618671862
f
GR
GS
[1 0 0 1.00107 403.9155 95.72981] CT
0.8 GC
N
f-1618671862
f
GR
GS
[1 0 0 1.00107 401.62329 84.24854] CT
0.8 GC
N
f-1618671862
f
GR
GS
[1 0 0 1.00107 400.50644 80.84597] CT
0.8 GC
N
f-1618671862
f
GR
GS
[1 0 0 1.00107 398.56418 83.4177] CT
0.8 GC
N
f-1618671862
f
GR
GS
[1 0 0 1.00107 0 -0.2] CT
1 0.6 0.6 RC
1 LJ
3 LW
N
345.792 93.926 M
485.722 62.994 L
S
GR
%%Trailer
%%Pages: 1
%%EOF
