%!PS-Adobe-3.0 EPSF-3.0
%%Creator: (MATLAB, The Mathworks, Inc. Version 9.8.0.1323502 \(R2020a\). Operating System: Mac OS X)
%%Title: /Users/kosciessa/Desktop/mntTardisLNDG/LNDG/stateswitch/stsw_fmri_task/pls_mean/figures/behavPLS_1group/d_correlations_ndt.eps
%%CreationDate: 2022-05-16T17:36:07
%%Pages: (atend)
%%BoundingBox:    37     0   506   185
%%LanguageLevel: 3
%%EndComments
%%BeginProlog
%%BeginResource: procset (Apache XML Graphics Std ProcSet) 1.2 0
%%Version: 1.2 0
%%Copyright: (Copyright 2001-2003,2010 The Apache Software Foundation. License terms: http://www.apache.org/licenses/LICENSE-2.0)
/bd{bind def}bind def
/ld{load def}bd
/GR/grestore ld
/GS/gsave ld
/RM/rmoveto ld
/C/curveto ld
/t/show ld
/L/lineto ld
/ML/setmiterlimit ld
/CT/concat ld
/f/fill ld
/N/newpath ld
/S/stroke ld
/CC/setcmykcolor ld
/A/ashow ld
/cp/closepath ld
/RC/setrgbcolor ld
/LJ/setlinejoin ld
/GC/setgray ld
/LW/setlinewidth ld
/M/moveto ld
/re {4 2 roll M
1 index 0 rlineto
0 exch rlineto
neg 0 rlineto
cp } bd
/_ctm matrix def
/_tm matrix def
/BT { _ctm currentmatrix pop matrix _tm copy pop 0 0 moveto } bd
/ET { _ctm setmatrix } bd
/iTm { _ctm setmatrix _tm concat } bd
/Tm { _tm astore pop iTm 0 0 moveto } bd
/ux 0.0 def
/uy 0.0 def
/F {
  /Tp exch def
  /Tf exch def
  Tf findfont Tp scalefont setfont
  /cf Tf def  /cs Tp def
} bd
/ULS {currentpoint /uy exch def /ux exch def} bd
/ULE {
  /Tcx currentpoint pop def
  gsave
  newpath
  cf findfont cs scalefont dup
  /FontMatrix get 0 get /Ts exch def /FontInfo get dup
  /UnderlinePosition get Ts mul /To exch def
  /UnderlineThickness get Ts mul /Tt exch def
  ux uy To add moveto  Tcx uy To add lineto
  Tt setlinewidth stroke
  grestore
} bd
/OLE {
  /Tcx currentpoint pop def
  gsave
  newpath
  cf findfont cs scalefont dup
  /FontMatrix get 0 get /Ts exch def /FontInfo get dup
  /UnderlinePosition get Ts mul /To exch def
  /UnderlineThickness get Ts mul /Tt exch def
  ux uy To add cs add moveto Tcx uy To add cs add lineto
  Tt setlinewidth stroke
  grestore
} bd
/SOE {
  /Tcx currentpoint pop def
  gsave
  newpath
  cf findfont cs scalefont dup
  /FontMatrix get 0 get /Ts exch def /FontInfo get dup
  /UnderlinePosition get Ts mul /To exch def
  /UnderlineThickness get Ts mul /Tt exch def
  ux uy To add cs 10 mul 26 idiv add moveto Tcx uy To add cs 10 mul 26 idiv add lineto
  Tt setlinewidth stroke
  grestore
} bd
/QT {
/Y22 exch store
/X22 exch store
/Y21 exch store
/X21 exch store
currentpoint
/Y21 load 2 mul add 3 div exch
/X21 load 2 mul add 3 div exch
/X21 load 2 mul /X22 load add 3 div
/Y21 load 2 mul /Y22 load add 3 div
/X22 load /Y22 load curveto
} bd
/SSPD {
dup length /d exch dict def
{
/v exch def
/k exch def
currentpagedevice k known {
/cpdv currentpagedevice k get def
v cpdv ne {
/upd false def
/nullv v type /nulltype eq def
/nullcpdv cpdv type /nulltype eq def
nullv nullcpdv or
{
/upd true def
} {
/sametype v type cpdv type eq def
sametype {
v type /arraytype eq {
/vlen v length def
/cpdvlen cpdv length def
vlen cpdvlen eq {
0 1 vlen 1 sub {
/i exch def
/obj v i get def
/cpdobj cpdv i get def
obj cpdobj ne {
/upd true def
exit
} if
} for
} {
/upd true def
} ifelse
} {
v type /dicttype eq {
v {
/dv exch def
/dk exch def
/cpddv cpdv dk get def
dv cpddv ne {
/upd true def
exit
} if
} forall
} {
/upd true def
} ifelse
} ifelse
} if
} ifelse
upd true eq {
d k v put
} if
} if
} if
} forall
d length 0 gt {
d setpagedevice
} if
} bd
/RE { % /NewFontName [NewEncodingArray] /FontName RE -
  findfont dup length dict begin
  {
    1 index /FID ne
    {def} {pop pop} ifelse
  } forall
  /Encoding exch def
  /FontName 1 index def
  currentdict definefont pop
  end
} bind def
%%EndResource
%%BeginResource: procset (Apache XML Graphics EPS ProcSet) 1.0 0
%%Version: 1.0 0
%%Copyright: (Copyright 2002-2003 The Apache Software Foundation. License terms: http://www.apache.org/licenses/LICENSE-2.0)
/BeginEPSF { %def
/b4_Inc_state save def         % Save state for cleanup
/dict_count countdictstack def % Count objects on dict stack
/op_count count 1 sub def      % Count objects on operand stack
userdict begin                 % Push userdict on dict stack
/showpage { } def              % Redefine showpage, { } = null proc
0 setgray 0 setlinecap         % Prepare graphics state
1 setlinewidth 0 setlinejoin
10 setmiterlimit [ ] 0 setdash newpath
/languagelevel where           % If level not equal to 1 then
{pop languagelevel             % set strokeadjust and
1 ne                           % overprint to their defaults.
{false setstrokeadjust false setoverprint
} if
} if
} bd
/EndEPSF { %def
count op_count sub {pop} repeat            % Clean up stacks
countdictstack dict_count sub {end} repeat
b4_Inc_state restore
} bd
%%EndResource
%FOPBeginFontDict
%%IncludeResource: font Courier-Oblique
%%IncludeResource: font Courier-BoldOblique
%%IncludeResource: font Courier-Bold
%%IncludeResource: font ZapfDingbats
%%IncludeResource: font Symbol
%%IncludeResource: font Helvetica
%%IncludeResource: font Helvetica-Oblique
%%IncludeResource: font Helvetica-Bold
%%IncludeResource: font Helvetica-BoldOblique
%%IncludeResource: font Times-Roman
%%IncludeResource: font Times-Italic
%%IncludeResource: font Times-Bold
%%IncludeResource: font Times-BoldItalic
%%IncludeResource: font Courier
%FOPEndFontDict
%%BeginResource: encoding WinAnsiEncoding
/WinAnsiEncoding [
/.notdef /.notdef /.notdef /.notdef /.notdef
/.notdef /.notdef /.notdef /.notdef /.notdef
/.notdef /.notdef /.notdef /.notdef /.notdef
/.notdef /.notdef /.notdef /.notdef /.notdef
/.notdef /.notdef /.notdef /.notdef /.notdef
/.notdef /.notdef /.notdef /.notdef /.notdef
/.notdef /.notdef /space /exclam /quotedbl
/numbersign /dollar /percent /ampersand /quotesingle
/parenleft /parenright /asterisk /plus /comma
/hyphen /period /slash /zero /one
/two /three /four /five /six
/seven /eight /nine /colon /semicolon
/less /equal /greater /question /at
/A /B /C /D /E
/F /G /H /I /J
/K /L /M /N /O
/P /Q /R /S /T
/U /V /W /X /Y
/Z /bracketleft /backslash /bracketright /asciicircum
/underscore /quoteleft /a /b /c
/d /e /f /g /h
/i /j /k /l /m
/n /o /p /q /r
/s /t /u /v /w
/x /y /z /braceleft /bar
/braceright /asciitilde /bullet /Euro /bullet
/quotesinglbase /florin /quotedblbase /ellipsis /dagger
/daggerdbl /circumflex /perthousand /Scaron /guilsinglleft
/OE /bullet /Zcaron /bullet /bullet
/quoteleft /quoteright /quotedblleft /quotedblright /bullet
/endash /emdash /asciitilde /trademark /scaron
/guilsinglright /oe /bullet /zcaron /Ydieresis
/space /exclamdown /cent /sterling /currency
/yen /brokenbar /section /dieresis /copyright
/ordfeminine /guillemotleft /logicalnot /sfthyphen /registered
/macron /degree /plusminus /twosuperior /threesuperior
/acute /mu /paragraph /middot /cedilla
/onesuperior /ordmasculine /guillemotright /onequarter /onehalf
/threequarters /questiondown /Agrave /Aacute /Acircumflex
/Atilde /Adieresis /Aring /AE /Ccedilla
/Egrave /Eacute /Ecircumflex /Edieresis /Igrave
/Iacute /Icircumflex /Idieresis /Eth /Ntilde
/Ograve /Oacute /Ocircumflex /Otilde /Odieresis
/multiply /Oslash /Ugrave /Uacute /Ucircumflex
/Udieresis /Yacute /Thorn /germandbls /agrave
/aacute /acircumflex /atilde /adieresis /aring
/ae /ccedilla /egrave /eacute /ecircumflex
/edieresis /igrave /iacute /icircumflex /idieresis
/eth /ntilde /ograve /oacute /ocircumflex
/otilde /odieresis /divide /oslash /ugrave
/uacute /ucircumflex /udieresis /yacute /thorn
/ydieresis
] def
%%EndResource
%FOPBeginFontReencode
/Courier-Oblique findfont
dup length dict begin
  {1 index /FID ne {def} {pop pop} ifelse} forall
  /Encoding WinAnsiEncoding def
  currentdict
end
/Courier-Oblique exch definefont pop
/Courier-BoldOblique findfont
dup length dict begin
  {1 index /FID ne {def} {pop pop} ifelse} forall
  /Encoding WinAnsiEncoding def
  currentdict
end
/Courier-BoldOblique exch definefont pop
/Courier-Bold findfont
dup length dict begin
  {1 index /FID ne {def} {pop pop} ifelse} forall
  /Encoding WinAnsiEncoding def
  currentdict
end
/Courier-Bold exch definefont pop
/Helvetica findfont
dup length dict begin
  {1 index /FID ne {def} {pop pop} ifelse} forall
  /Encoding WinAnsiEncoding def
  currentdict
end
/Helvetica exch definefont pop
/Helvetica-Oblique findfont
dup length dict begin
  {1 index /FID ne {def} {pop pop} ifelse} forall
  /Encoding WinAnsiEncoding def
  currentdict
end
/Helvetica-Oblique exch definefont pop
/Helvetica-Bold findfont
dup length dict begin
  {1 index /FID ne {def} {pop pop} ifelse} forall
  /Encoding WinAnsiEncoding def
  currentdict
end
/Helvetica-Bold exch definefont pop
/Helvetica-BoldOblique findfont
dup length dict begin
  {1 index /FID ne {def} {pop pop} ifelse} forall
  /Encoding WinAnsiEncoding def
  currentdict
end
/Helvetica-BoldOblique exch definefont pop
/Times-Roman findfont
dup length dict begin
  {1 index /FID ne {def} {pop pop} ifelse} forall
  /Encoding WinAnsiEncoding def
  currentdict
end
/Times-Roman exch definefont pop
/Times-Italic findfont
dup length dict begin
  {1 index /FID ne {def} {pop pop} ifelse} forall
  /Encoding WinAnsiEncoding def
  currentdict
end
/Times-Italic exch definefont pop
/Times-Bold findfont
dup length dict begin
  {1 index /FID ne {def} {pop pop} ifelse} forall
  /Encoding WinAnsiEncoding def
  currentdict
end
/Times-Bold exch definefont pop
/Times-BoldItalic findfont
dup length dict begin
  {1 index /FID ne {def} {pop pop} ifelse} forall
  /Encoding WinAnsiEncoding def
  currentdict
end
/Times-BoldItalic exch definefont pop
/Courier findfont
dup length dict begin
  {1 index /FID ne {def} {pop pop} ifelse} forall
  /Encoding WinAnsiEncoding def
  currentdict
end
/Courier exch definefont pop
%FOPEndFontReencode
%%EndProlog
%%Page: 1 1
%%PageBoundingBox: 0 0 512 187
%%BeginPageSetup
[1 0 0 -1 0 187] CT
%%EndPageSetup
GS
[1 0 0 1.00107 0 -0.2] CT
1 GC
N
0 0 512 187 re
f
GR
GS
[1 0 0 1.00107 0 -0.2] CT
1 GC
N
0 0 512 187 re
f
GR
GS
[1 0 0 1.00107 0 -0.2] CT
0.2 GC
N
102.5 149.5 M
256 149.5 L
256 18.5 L
102.5 18.5 L
cp
f
GR
GS
[1 0 0 1.00107 0 -0.2] CT
0.149 GC
2 setlinecap
1 LJ
0.5 LW
N
102.5 149.5 M
256 149.5 L
S
GR
GS
[1 0 0 1.00107 0 -0.2] CT
0.149 GC
2 setlinecap
1 LJ
0.5 LW
N
129.103 149.5 M
129.103 147.965 L
S
GR
GS
[1 0 0 1.00107 0 -0.2] CT
0.149 GC
2 setlinecap
1 LJ
0.5 LW
N
169.201 149.5 M
169.201 147.965 L
S
GR
GS
[1 0 0 1.00107 0 -0.2] CT
0.149 GC
2 setlinecap
1 LJ
0.5 LW
N
209.299 149.5 M
209.299 147.965 L
S
GR
GS
[1 0 0 1.00107 0 -0.2] CT
0.149 GC
2 setlinecap
1 LJ
0.5 LW
N
249.397 149.5 M
249.397 147.965 L
S
GR
GS
[1 0 0 1.00107 129.10255 154.26503] CT
0.149 GC
/Helvetica 14 F
GS
[1 0 0 1 0 0] CT
-4 14 moveto 
1 -1 scale
(0) t 
GR
GR
GS
[1 0 0 1.00107 169.20079 154.26503] CT
0.149 GC
/Helvetica 14 F
GS
[1 0 0 1 0 0] CT
-16 14 moveto 
1 -1 scale
(5000) t 
GR
GR
GS
[1 0 0 1.00107 209.29903 154.26503] CT
0.149 GC
/Helvetica 14 F
GS
[1 0 0 1 0 0] CT
-19.5 14 moveto 
1 -1 scale
(10000) t 
GR
GR
GS
[1 0 0 1.00107 249.39726 154.26503] CT
0.149 GC
/Helvetica 14 F
GS
[1 0 0 1 0 0] CT
-19.5 14 moveto 
1 -1 scale
(15000) t 
GR
GR
GS
[1 0 0 1.00107 179.25008 171.78375] CT
0.149 GC
/Helvetica 14 F
GS
[1 0 0 1 0 0] CT
-74.5 14 moveto 
1 -1 scale
(fMRI Brainscore \(arb.u.\)) t 
GR
GR
GS
[1 0 0 1.00107 0 -0.2] CT
0.149 GC
2 setlinecap
1 LJ
0.5 LW
N
102.5 149.5 M
102.5 18.5 L
S
GR
GS
[1 0 0 1.00107 0 -0.2] CT
0.149 GC
2 setlinecap
1 LJ
0.5 LW
N
102.5 133.615 M
104.035 133.615 L
S
GR
GS
[1 0 0 1.00107 0 -0.2] CT
0.149 GC
2 setlinecap
1 LJ
0.5 LW
N
102.5 83.764 M
104.035 83.764 L
S
GR
GS
[1 0 0 1.00107 0 -0.2] CT
0.149 GC
2 setlinecap
1 LJ
0.5 LW
N
102.5 33.914 M
104.035 33.914 L
S
GR
GS
[1 0 0 1.00107 97.7 133.55759] CT
0.149 GC
/Helvetica 14 F
GS
[1 0 0 1 0 0] CT
-8 5.5 moveto 
1 -1 scale
(0) t 
GR
GR
GS
[1 0 0 1.00107 97.7 83.65389] CT
0.149 GC
/Helvetica 14 F
GS
[1 0 0 1 0 0] CT
-28 5.5 moveto 
1 -1 scale
(0.05) t 
GR
GR
GS
[1 0 0 1.00107 97.7 33.75019] CT
0.149 GC
/Helvetica 14 F
GS
[1 0 0 1 0 0] CT
-20 5.5 moveto 
1 -1 scale
(0.1) t 
GR
GR
GS
[0 -1.00107 1 0 67.2 83.88977] CT
0.149 GC
/Helvetica 14 F
GS
[1 0 0 1 0 0] CT
-10.5 -20 moveto 
1 -1 scale
(ndt) t 
GR
GR
GS
[0 -1.00107 1 0 67.2 83.88977] CT
0.149 GC
/Helvetica 14 F
GS
[1 0 0 1 0 0] CT
-39 -3 moveto 
1 -1 scale
(\(linear mod.\)) t 
GR
GR
GS
[1 0 0 1.00107 179.25017 16.56791] CT
/Helvetica-Bold 14 F
GS
[1 0 0 1 0 0] CT
-76 -4 moveto 
1 -1 scale
(r = 0.28 CI = [0.08,0.46]) t 
GR
GR
GS
[1 0 0 1.00107 151.85092 63.94803] CT
0.8 GC
N
0.5 0 M
0.5 -0.276 0.276 -0.5 0 -0.5 C
-0.276 -0.5 -0.5 -0.276 -0.5 0 C
-0.5 0.276 -0.276 0.5 0 0.5 C
0.276 0.5 0.5 0.276 0.5 0 C
cp
f
GR
GS
[1 0 0 1.00107 144.24544 86.14296] CT
0.8 GC
N
/f-2105962265{0.5 0 M
0.5 -0.276 0.276 -0.5 0 -0.5 C
-0.276 -0.5 -0.5 -0.276 -0.5 0 C
-0.5 0.276 -0.276 0.5 0 0.5 C
0.276 0.5 0.5 0.276 0.5 0 C
cp}def
f-2105962265
f
GR
GS
[1 0 0 1.00107 181.3502 40.13797] CT
0.8 GC
N
f-2105962265
f
GR
GS
[1 0 0 1.00107 175.20338 75.93585] CT
0.8 GC
N
f-2105962265
f
GR
GS
[1 0 0 1.00107 152.32356 89.82035] CT
0.8 GC
N
f-2105962265
f
GR
GS
[1 0 0 1.00107 172.06783 88.3491] CT
0.8 GC
N
f-2105962265
f
GR
GS
[1 0 0 1.00107 205.48311 34.5373] CT
0.8 GC
N
f-2105962265
f
GR
GS
[1 0 0 1.00107 205.59962 89.95437] CT
0.8 GC
N
f-2105962265
f
GR
GS
[1 0 0 1.00107 128.21817 65.413] CT
0.8 GC
N
f-2105962265
f
GR
GS
[1 0 0 1.00107 193.08842 63.13545] CT
0.8 GC
N
f-2105962265
f
GR
GS
[1 0 0 1.00107 168.64771 63.51903] CT
0.8 GC
N
f-2105962265
f
GR
GS
[1 0 0 1.00107 190.1317 68.11523] CT
0.8 GC
N
f-2105962265
f
GR
GS
[1 0 0 1.00107 152.15416 72.70878] CT
0.8 GC
N
f-2105962265
f
GR
GS
[1 0 0 1.00107 164.23561 60.60047] CT
0.8 GC
N
f-2105962265
f
GR
GS
[1 0 0 1.00107 155.69623 81.22434] CT
0.8 GC
N
f-2105962265
f
GR
GS
[1 0 0 1.00107 137.33371 105.40347] CT
0.8 GC
N
f-2105962265
f
GR
GS
[1 0 0 1.00107 160.05399 51.65367] CT
0.8 GC
N
f-2105962265
f
GR
GS
[1 0 0 1.00107 162.64647 62.69917] CT
0.8 GC
N
f-2105962265
f
GR
GS
[1 0 0 1.00107 160.55821 104.87265] CT
0.8 GC
N
f-2105962265
f
GR
GS
[1 0 0 1.00107 173.07581 78.37653] CT
0.8 GC
N
f-2105962265
f
GR
GS
[1 0 0 1.00107 174.72037 50.31327] CT
0.8 GC
N
f-2105962265
f
GR
GS
[1 0 0 1.00107 136.82932 83.59013] CT
0.8 GC
N
f-2105962265
f
GR
GS
[1 0 0 1.00107 150.99184 51.95364] CT
0.8 GC
N
f-2105962265
f
GR
GS
[1 0 0 1.00107 185.70612 132.77274] CT
0.8 GC
N
f-2105962265
f
GR
GS
[1 0 0 1.00107 182.49751 97.29121] CT
0.8 GC
N
f-2105962265
f
GR
GS
[1 0 0 1.00107 144.91469 89.50946] CT
0.8 GC
N
f-2105962265
f
GR
GS
[1 0 0 1.00107 160.0265 75.17596] CT
0.8 GC
N
f-2105962265
f
GR
GS
[1 0 0 1.00107 185.59795 105.52828] CT
0.8 GC
N
f-2105962265
f
GR
GS
[1 0 0 1.00107 166.74693 60.13471] CT
0.8 GC
N
f-2105962265
f
GR
GS
[1 0 0 1.00107 156.34604 86.92949] CT
0.8 GC
N
f-2105962265
f
GR
GS
[1 0 0 1.00107 197.87573 75.62605] CT
0.8 GC
N
f-2105962265
f
GR
GS
[1 0 0 1.00107 204.53181 131.11935] CT
0.8 GC
N
f-2105962265
f
GR
GS
[1 0 0 1.00107 243.20833 80.11914] CT
0.8 GC
N
f-2105962265
f
GR
GS
[1 0 0 1.00107 215.05717 63.61509] CT
0.8 GC
N
f-2105962265
f
GR
GS
[1 0 0 1.00107 142.14415 96.47935] CT
0.8 GC
N
f-2105962265
f
GR
GS
[1 0 0 1.00107 217.9738 76.19104] CT
0.8 GC
N
f-2105962265
f
GR
GS
[1 0 0 1.00107 209.29594 107.04496] CT
0.8 GC
N
f-2105962265
f
GR
GS
[1 0 0 1.00107 188.36264 92.47005] CT
0.8 GC
N
f-2105962265
f
GR
GS
[1 0 0 1.00107 183.68954 66.98843] CT
0.8 GC
N
f-2105962265
f
GR
GS
[1 0 0 1.00107 165.34248 81.92739] CT
0.8 GC
N
f-2105962265
f
GR
GS
[1 0 0 1.00107 162.5114 82.79559] CT
0.8 GC
N
f-2105962265
f
GR
GS
[1 0 0 1.00107 191.74933 61.62366] CT
0.8 GC
N
f-2105962265
f
GR
GS
[1 0 0 1.00107 140.67679 120.32946] CT
0.8 GC
N
f-2105962265
f
GR
GS
[1 0 0 1.00107 138.97743 79.89341] CT
0.8 GC
N
f-2105962265
f
GR
GS
[1 0 0 1.00107 156.59213 29.24813] CT
0.8 GC
N
f-2105962265
f
GR
GS
[1 0 0 1.00107 130.69681 95.97004] CT
0.8 GC
N
f-2105962265
f
GR
GS
[1 0 0 1.00107 144.2182 90.78042] CT
0.8 GC
N
f-2105962265
f
GR
GS
[1 0 0 1.00107 132.03259 126.4299] CT
0.8 GC
N
f-2105962265
f
GR
GS
[1 0 0 1.00107 132.75345 112.73129] CT
0.8 GC
N
f-2105962265
f
GR
GS
[1 0 0 1.00107 129.9669 101.74265] CT
0.8 GC
N
f-2105962265
f
GR
GS
[1 0 0 1.00107 134.42291 112.98154] CT
0.8 GC
N
f-2105962265
f
GR
GS
[1 0 0 1.00107 159.0567 80.90761] CT
0.8 GC
N
f-2105962265
f
GR
GS
[1 0 0 1.00107 140.37825 39.47687] CT
0.8 GC
N
f-2105962265
f
GR
GS
[1 0 0 1.00107 121.01725 71.13676] CT
0.8 GC
N
f-2105962265
f
GR
GS
[1 0 0 1.00107 141.13179 138.53155] CT
0.8 GC
N
f-2105962265
f
GR
GS
[1 0 0 1.00107 142.92714 90.55553] CT
0.8 GC
N
f-2105962265
f
GR
GS
[1 0 0 1.00107 170.64149 88.53166] CT
0.8 GC
N
f-2105962265
f
GR
GS
[1 0 0 1.00107 152.18207 89.51521] CT
0.8 GC
N
f-2105962265
f
GR
GS
[1 0 0 1.00107 150.07739 76.01594] CT
0.8 GC
N
f-2105962265
f
GR
GS
[1 0 0 1.00107 142.7296 120.47334] CT
0.8 GC
N
f-2105962265
f
GR
GS
[1 0 0 1.00107 127.81736 135.63807] CT
0.8 GC
N
f-2105962265
f
GR
GS
[1 0 0 1.00107 122.50857 117.71873] CT
0.8 GC
N
f-2105962265
f
GR
GS
[1 0 0 1.00107 154.60814 99.46911] CT
0.8 GC
N
f-2105962265
f
GR
GS
[1 0 0 1.00107 136.39948 87.95834] CT
0.8 GC
N
f-2105962265
f
GR
GS
[1 0 0 1.00107 132.16058 103.10797] CT
0.8 GC
N
f-2105962265
f
GR
GS
[1 0 0 1.00107 141.92664 114.25443] CT
0.8 GC
N
f-2105962265
f
GR
GS
[1 0 0 1.00107 151.00449 87.47406] CT
0.8 GC
N
f-2105962265
f
GR
GS
[1 0 0 1.00107 130.71852 134.89056] CT
0.8 GC
N
f-2105962265
f
GR
GS
[1 0 0 1.00107 177.19667 82.80535] CT
0.8 GC
N
f-2105962265
f
GR
GS
[1 0 0 1.00107 128.33073 83.83581] CT
0.8 GC
N
f-2105962265
f
GR
GS
[1 0 0 1.00107 163.092 91.29221] CT
0.8 GC
N
f-2105962265
f
GR
GS
[1 0 0 1.00107 163.81694 55.54576] CT
0.8 GC
N
f-2105962265
f
GR
GS
[1 0 0 1.00107 146.55592 125.60998] CT
0.8 GC
N
f-2105962265
f
GR
GS
[1 0 0 1.00107 136.82182 81.8597] CT
0.8 GC
N
f-2105962265
f
GR
GS
[1 0 0 1.00107 126.8021 53.35898] CT
0.8 GC
N
f-2105962265
f
GR
GS
[1 0 0 1.00107 138.04414 131.91839] CT
0.8 GC
N
f-2105962265
f
GR
GS
[1 0 0 1.00107 161.0493 92.04398] CT
0.8 GC
N
f-2105962265
f
GR
GS
[1 0 0 1.00107 159.99164 96.65274] CT
0.8 GC
N
f-2105962265
f
GR
GS
[1 0 0 1.00107 115.29166 86.0706] CT
0.8 GC
N
f-2105962265
f
GR
GS
[1 0 0 1.00107 157.85533 111.48865] CT
0.8 GC
N
f-2105962265
f
GR
GS
[1 0 0 1.00107 155.90544 63.54] CT
0.8 GC
N
f-2105962265
f
GR
GS
[1 0 0 1.00107 147.81425 115.0346] CT
0.8 GC
N
f-2105962265
f
GR
GS
[1 0 0 1.00107 122.13152 137.04248] CT
0.8 GC
N
f-2105962265
f
GR
GS
[1 0 0 1.00107 121.78762 124.25559] CT
0.8 GC
N
f-2105962265
f
GR
GS
[1 0 0 1.00107 128.06819 115.40645] CT
0.8 GC
N
f-2105962265
f
GR
GS
[1 0 0 1.00107 169.48984 77.45955] CT
0.8 GC
N
f-2105962265
f
GR
GS
[1 0 0 1.00107 153.06995 89.73414] CT
0.8 GC
N
f-2105962265
f
GR
GS
[1 0 0 1.00107 140.45755 49.86069] CT
0.8 GC
N
f-2105962265
f
GR
GS
[1 0 0 1.00107 173.21864 136.1137] CT
0.8 GC
N
f-2105962265
f
GR
GS
[1 0 0 1.00107 143.6488 81.48206] CT
0.8 GC
N
f-2105962265
f
GR
GS
[1 0 0 1.00107 151.01816 127.0009] CT
0.8 GC
N
f-2105962265
f
GR
GS
[1 0 0 1.00107 150.65219 62.46736] CT
0.8 GC
N
f-2105962265
f
GR
GS
[1 0 0 1.00107 148.59163 84.88924] CT
0.8 GC
N
f-2105962265
f
GR
GS
[1 0 0 1.00107 147.58763 88.10596] CT
0.8 GC
N
f-2105962265
f
GR
GS
[1 0 0 1.00107 145.84164 119.27167] CT
0.8 GC
N
f-2105962265
f
GR
GS
[1 0 0 1.00107 0 -0.2] CT
1 0.6 0.6 RC
1 LJ
3 LW
N
102.482 104.383 M
249.397 61.952 L
S
GR
GS
[1 0 0 1.00107 151.85092 63.94803] CT
0.8 1 1 RC
N
/f227889816{-3 -3 M
-3 3 L
3 3 L
3 -3 L
cp}def
f227889816
f
GR
GS
[1 0 0 1.00107 144.24544 86.14296] CT
0.8 1 1 RC
N
f227889816
f
GR
GS
[1 0 0 1.00107 181.3502 40.13797] CT
0.8 1 1 RC
N
f227889816
f
GR
GS
[1 0 0 1.00107 175.20338 75.93585] CT
0.8 1 1 RC
N
f227889816
f
GR
GS
[1 0 0 1.00107 152.32356 89.82035] CT
0.8 1 1 RC
N
f227889816
f
GR
GS
[1 0 0 1.00107 172.06783 88.3491] CT
0.8 1 1 RC
N
f227889816
f
GR
GS
[1 0 0 1.00107 205.48311 34.5373] CT
0.8 1 1 RC
N
f227889816
f
GR
GS
[1 0 0 1.00107 205.59962 89.95437] CT
0.8 1 1 RC
N
f227889816
f
GR
GS
[1 0 0 1.00107 128.21817 65.413] CT
0.8 1 1 RC
N
f227889816
f
GR
GS
[1 0 0 1.00107 193.08842 63.13545] CT
0.8 1 1 RC
N
f227889816
f
GR
GS
[1 0 0 1.00107 168.64771 63.51903] CT
0.8 1 1 RC
N
f227889816
f
GR
GS
[1 0 0 1.00107 190.1317 68.11523] CT
0.8 1 1 RC
N
f227889816
f
GR
GS
[1 0 0 1.00107 152.15416 72.70878] CT
0.8 1 1 RC
N
f227889816
f
GR
GS
[1 0 0 1.00107 164.23561 60.60047] CT
0.8 1 1 RC
N
f227889816
f
GR
GS
[1 0 0 1.00107 155.69623 81.22434] CT
0.8 1 1 RC
N
f227889816
f
GR
GS
[1 0 0 1.00107 137.33371 105.40347] CT
0.8 1 1 RC
N
f227889816
f
GR
GS
[1 0 0 1.00107 160.05399 51.65367] CT
0.8 1 1 RC
N
f227889816
f
GR
GS
[1 0 0 1.00107 162.64647 62.69917] CT
0.8 1 1 RC
N
f227889816
f
GR
GS
[1 0 0 1.00107 160.55821 104.87265] CT
0.8 1 1 RC
N
f227889816
f
GR
GS
[1 0 0 1.00107 173.07581 78.37653] CT
0.8 1 1 RC
N
f227889816
f
GR
GS
[1 0 0 1.00107 174.72037 50.31327] CT
0.8 1 1 RC
N
f227889816
f
GR
GS
[1 0 0 1.00107 136.82932 83.59013] CT
0.8 1 1 RC
N
f227889816
f
GR
GS
[1 0 0 1.00107 150.99184 51.95364] CT
0.8 1 1 RC
N
f227889816
f
GR
GS
[1 0 0 1.00107 185.70612 132.77274] CT
0.8 1 1 RC
N
f227889816
f
GR
GS
[1 0 0 1.00107 182.49751 97.29121] CT
0.8 1 1 RC
N
f227889816
f
GR
GS
[1 0 0 1.00107 144.91469 89.50946] CT
0.8 1 1 RC
N
f227889816
f
GR
GS
[1 0 0 1.00107 160.0265 75.17596] CT
0.8 1 1 RC
N
f227889816
f
GR
GS
[1 0 0 1.00107 185.59795 105.52828] CT
0.8 1 1 RC
N
f227889816
f
GR
GS
[1 0 0 1.00107 166.74693 60.13471] CT
0.8 1 1 RC
N
f227889816
f
GR
GS
[1 0 0 1.00107 156.34604 86.92949] CT
0.8 1 1 RC
N
f227889816
f
GR
GS
[1 0 0 1.00107 197.87573 75.62605] CT
0.8 1 1 RC
N
f227889816
f
GR
GS
[1 0 0 1.00107 204.53181 131.11935] CT
0.8 1 1 RC
N
f227889816
f
GR
GS
[1 0 0 1.00107 243.20833 80.11914] CT
0.8 1 1 RC
N
f227889816
f
GR
GS
[1 0 0 1.00107 215.05717 63.61509] CT
0.8 1 1 RC
N
f227889816
f
GR
GS
[1 0 0 1.00107 142.14415 96.47935] CT
0.8 1 1 RC
N
f227889816
f
GR
GS
[1 0 0 1.00107 217.9738 76.19104] CT
0.8 1 1 RC
N
f227889816
f
GR
GS
[1 0 0 1.00107 209.29594 107.04496] CT
0.8 1 1 RC
N
f227889816
f
GR
GS
[1 0 0 1.00107 188.36264 92.47005] CT
0.8 1 1 RC
N
f227889816
f
GR
GS
[1 0 0 1.00107 183.68954 66.98843] CT
0.8 1 1 RC
N
f227889816
f
GR
GS
[1 0 0 1.00107 165.34248 81.92739] CT
0.8 1 1 RC
N
f227889816
f
GR
GS
[1 0 0 1.00107 162.5114 82.79559] CT
0.8 1 1 RC
N
f227889816
f
GR
GS
[1 0 0 1.00107 191.74933 61.62366] CT
0.8 1 1 RC
N
f227889816
f
GR
GS
[1 0 0 1.00107 140.67679 120.32946] CT
0.6 0.8 0.8 RC
N
/f-1969333140{-3.536 0 M
0 4.702 L
3.536 0 L
0 -4.702 L
cp}def
f-1969333140
f
GR
GS
[1 0 0 1.00107 138.97743 79.89341] CT
0.6 0.8 0.8 RC
N
f-1969333140
f
GR
GS
[1 0 0 1.00107 156.59213 29.24813] CT
0.6 0.8 0.8 RC
N
f-1969333140
f
GR
GS
[1 0 0 1.00107 130.69681 95.97004] CT
0.6 0.8 0.8 RC
N
f-1969333140
f
GR
GS
[1 0 0 1.00107 144.2182 90.78042] CT
0.6 0.8 0.8 RC
N
f-1969333140
f
GR
GS
[1 0 0 1.00107 132.03259 126.4299] CT
0.6 0.8 0.8 RC
N
f-1969333140
f
GR
GS
[1 0 0 1.00107 132.75345 112.73129] CT
0.6 0.8 0.8 RC
N
f-1969333140
f
GR
GS
[1 0 0 1.00107 129.9669 101.74265] CT
0.6 0.8 0.8 RC
N
f-1969333140
f
GR
GS
[1 0 0 1.00107 134.42291 112.98154] CT
0.6 0.8 0.8 RC
N
f-1969333140
f
GR
GS
[1 0 0 1.00107 159.0567 80.90761] CT
0.6 0.8 0.8 RC
N
f-1969333140
f
GR
GS
[1 0 0 1.00107 140.37825 39.47687] CT
0.6 0.8 0.8 RC
N
f-1969333140
f
GR
GS
[1 0 0 1.00107 121.01725 71.13676] CT
0.6 0.8 0.8 RC
N
f-1969333140
f
GR
GS
[1 0 0 1.00107 141.13179 138.53155] CT
0.6 0.8 0.8 RC
N
f-1969333140
f
GR
GS
[1 0 0 1.00107 142.92714 90.55553] CT
0.6 0.8 0.8 RC
N
f-1969333140
f
GR
GS
[1 0 0 1.00107 170.64149 88.53166] CT
0.6 0.8 0.8 RC
N
f-1969333140
f
GR
GS
[1 0 0 1.00107 152.18207 89.51521] CT
0.6 0.8 0.8 RC
N
f-1969333140
f
GR
GS
[1 0 0 1.00107 150.07739 76.01594] CT
0.6 0.8 0.8 RC
N
f-1969333140
f
GR
GS
[1 0 0 1.00107 142.7296 120.47334] CT
0.6 0.8 0.8 RC
N
f-1969333140
f
GR
GS
[1 0 0 1.00107 127.81736 135.63807] CT
0.6 0.8 0.8 RC
N
f-1969333140
f
GR
GS
[1 0 0 1.00107 122.50857 117.71873] CT
0.6 0.8 0.8 RC
N
f-1969333140
f
GR
GS
[1 0 0 1.00107 154.60814 99.46911] CT
0.6 0.8 0.8 RC
N
f-1969333140
f
GR
GS
[1 0 0 1.00107 136.39948 87.95834] CT
0.6 0.8 0.8 RC
N
f-1969333140
f
GR
GS
[1 0 0 1.00107 132.16058 103.10797] CT
0.6 0.8 0.8 RC
N
f-1969333140
f
GR
GS
[1 0 0 1.00107 141.92664 114.25443] CT
0.6 0.8 0.8 RC
N
f-1969333140
f
GR
GS
[1 0 0 1.00107 151.00449 87.47406] CT
0.6 0.8 0.8 RC
N
f-1969333140
f
GR
GS
[1 0 0 1.00107 130.71852 134.89056] CT
0.6 0.8 0.8 RC
N
f-1969333140
f
GR
GS
[1 0 0 1.00107 177.19667 82.80535] CT
0.6 0.8 0.8 RC
N
f-1969333140
f
GR
GS
[1 0 0 1.00107 128.33073 83.83581] CT
0.6 0.8 0.8 RC
N
f-1969333140
f
GR
GS
[1 0 0 1.00107 163.092 91.29221] CT
0.6 0.8 0.8 RC
N
f-1969333140
f
GR
GS
[1 0 0 1.00107 163.81694 55.54576] CT
0.6 0.8 0.8 RC
N
f-1969333140
f
GR
GS
[1 0 0 1.00107 146.55592 125.60998] CT
0.6 0.8 0.8 RC
N
f-1969333140
f
GR
GS
[1 0 0 1.00107 136.82182 81.8597] CT
0.6 0.8 0.8 RC
N
f-1969333140
f
GR
GS
[1 0 0 1.00107 126.8021 53.35898] CT
0.6 0.8 0.8 RC
N
f-1969333140
f
GR
GS
[1 0 0 1.00107 138.04414 131.91839] CT
0.6 0.8 0.8 RC
N
f-1969333140
f
GR
GS
[1 0 0 1.00107 161.0493 92.04398] CT
0.6 0.8 0.8 RC
N
f-1969333140
f
GR
GS
[1 0 0 1.00107 159.99164 96.65274] CT
0.6 0.8 0.8 RC
N
f-1969333140
f
GR
GS
[1 0 0 1.00107 115.29166 86.0706] CT
0.6 0.8 0.8 RC
N
f-1969333140
f
GR
GS
[1 0 0 1.00107 157.85533 111.48865] CT
0.6 0.8 0.8 RC
N
f-1969333140
f
GR
GS
[1 0 0 1.00107 155.90544 63.54] CT
0.6 0.8 0.8 RC
N
f-1969333140
f
GR
GS
[1 0 0 1.00107 147.81425 115.0346] CT
0.6 0.8 0.8 RC
N
f-1969333140
f
GR
GS
[1 0 0 1.00107 122.13152 137.04248] CT
0.6 0.8 0.8 RC
N
f-1969333140
f
GR
GS
[1 0 0 1.00107 121.78762 124.25559] CT
0.6 0.8 0.8 RC
N
f-1969333140
f
GR
GS
[1 0 0 1.00107 128.06819 115.40645] CT
0.6 0.8 0.8 RC
N
f-1969333140
f
GR
GS
[1 0 0 1.00107 169.48984 77.45955] CT
0.6 0.8 0.8 RC
N
f-1969333140
f
GR
GS
[1 0 0 1.00107 153.06995 89.73414] CT
0.6 0.8 0.8 RC
N
f-1969333140
f
GR
GS
[1 0 0 1.00107 140.45755 49.86069] CT
0.6 0.8 0.8 RC
N
f-1969333140
f
GR
GS
[1 0 0 1.00107 173.21864 136.1137] CT
0.6 0.8 0.8 RC
N
f-1969333140
f
GR
GS
[1 0 0 1.00107 143.6488 81.48206] CT
0.6 0.8 0.8 RC
N
f-1969333140
f
GR
GS
[1 0 0 1.00107 151.01816 127.0009] CT
0.6 0.8 0.8 RC
N
f-1969333140
f
GR
GS
[1 0 0 1.00107 150.65219 62.46736] CT
0.6 0.8 0.8 RC
N
f-1969333140
f
GR
GS
[1 0 0 1.00107 148.59163 84.88924] CT
0.6 0.8 0.8 RC
N
f-1969333140
f
GR
GS
[1 0 0 1.00107 147.58763 88.10596] CT
0.6 0.8 0.8 RC
N
f-1969333140
f
GR
GS
[1 0 0 1.00107 145.84164 119.27167] CT
0.6 0.8 0.8 RC
N
f-1969333140
f
GR
GS
[1 0 0 1.00107 0 -0.2] CT
0.2 GC
N
/f-436321476{333 149.5 M
486.5 149.5 L
486.5 18.5 L
333 18.5 L
cp}def
f-436321476
f
GR
GS
[1 0 0 1.00107 0 -0.2] CT
0.149 GC
2 setlinecap
1 LJ
0.5 LW
N
333 149.5 M
486.5 149.5 L
S
GR
GS
[1 0 0 1.00107 0 -0.2] CT
0.149 GC
2 setlinecap
1 LJ
0.5 LW
N
351.905 149.5 M
351.905 147.965 L
S
GR
GS
[1 0 0 1.00107 0 -0.2] CT
0.149 GC
2 setlinecap
1 LJ
0.5 LW
N
396.51 149.5 M
396.51 147.965 L
S
GR
GS
[1 0 0 1.00107 0 -0.2] CT
0.149 GC
2 setlinecap
1 LJ
0.5 LW
N
441.116 149.5 M
441.116 147.965 L
S
GR
GS
[1 0 0 1.00107 0 -0.2] CT
0.149 GC
2 setlinecap
1 LJ
0.5 LW
N
485.722 149.5 M
485.722 147.965 L
S
GR
GS
[1 0 0 1.00107 351.90451 154.26503] CT
0.149 GC
/Helvetica 14 F
GS
[1 0 0 1 0 0] CT
-18.5 14 moveto 
1 -1 scale
(-5000) t 
GR
GR
GS
[1 0 0 1.00107 396.51035 154.26503] CT
0.149 GC
/Helvetica 14 F
GS
[1 0 0 1 0 0] CT
-4 14 moveto 
1 -1 scale
(0) t 
GR
GR
GS
[1 0 0 1.00107 441.11618 154.26503] CT
0.149 GC
/Helvetica 14 F
GS
[1 0 0 1 0 0] CT
-16 14 moveto 
1 -1 scale
(5000) t 
GR
GR
GS
[1 0 0 1.00107 485.72205 154.26503] CT
0.149 GC
/Helvetica 14 F
GS
[1 0 0 1 0 0] CT
-19.5 14 moveto 
1 -1 scale
(10000) t 
GR
GR
GS
[1 0 0 1.00107 409.75006 171.78375] CT
0.149 GC
/Helvetica 14 F
GS
[1 0 0 1 0 0] CT
-74.5 14 moveto 
1 -1 scale
(fMRI Brainscore \(arb.u.\)) t 
GR
GR
GS
[1 0 0 1.00107 0 -0.2] CT
0.149 GC
2 setlinecap
1 LJ
0.5 LW
N
333 149.5 M
333 18.5 L
S
GR
GS
[1 0 0 1.00107 0 -0.2] CT
0.149 GC
2 setlinecap
1 LJ
0.5 LW
N
333 134.63 M
334.535 134.63 L
S
GR
GS
[1 0 0 1.00107 0 -0.2] CT
0.149 GC
2 setlinecap
1 LJ
0.5 LW
N
333 89.78 M
334.535 89.78 L
S
GR
GS
[1 0 0 1.00107 0 -0.2] CT
0.149 GC
2 setlinecap
1 LJ
0.5 LW
N
333 44.93 M
334.535 44.93 L
S
GR
GS
[1 0 0 1.00107 328.20001 134.57392] CT
0.149 GC
/Helvetica 14 F
GS
[1 0 0 1 0 0] CT
-33 5.5 moveto 
1 -1 scale
(-0.05) t 
GR
GR
GS
[1 0 0 1.00107 328.20001 89.67604] CT
0.149 GC
/Helvetica 14 F
GS
[1 0 0 1 0 0] CT
-8 5.5 moveto 
1 -1 scale
(0) t 
GR
GR
GS
[1 0 0 1.00107 328.20001 44.77818] CT
0.149 GC
/Helvetica 14 F
GS
[1 0 0 1 0 0] CT
-28 5.5 moveto 
1 -1 scale
(0.05) t 
GR
GR
GS
[0 -1.00107 1 0 292.20001 83.88978] CT
0.149 GC
/Helvetica 14 F
GS
[1 0 0 1 0 0] CT
-10.5 -20 moveto 
1 -1 scale
(ndt) t 
GR
GR
GS
[0 -1.00107 1 0 292.20001 83.88978] CT
0.149 GC
/Helvetica 14 F
GS
[1 0 0 1 0 0] CT
-39 -3 moveto 
1 -1 scale
(\(linear mod.\)) t 
GR
GR
GS
[1 0 0 1.00107 409.7504 16.56792] CT
/Helvetica-Bold 14 F
GS
[1 0 0 1 0 0] CT
-78.5 -4 moveto 
1 -1 scale
(r = 0.09 CI = [-0.11,0.29]) t 
GR
GR
GS
[1 0 0 1.00107 372.08109 76.61063] CT
0.8 GC
N
/f-1618671862{3.162 0 M
3.162 -1.746 1.746 -3.162 0 -3.162 C
-1.746 -3.162 -3.162 -1.746 -3.162 0 C
-3.162 1.746 -1.746 3.162 0 3.162 C
1.746 3.162 3.162 1.746 3.162 0 C
cp}def
f-1618671862
f
GR
GS
[1 0 0 1.00107 363.62064 96.57919] CT
0.8 GC
N
f-1618671862
f
GR
GS
[1 0 0 1.00107 404.89648 55.18895] CT
0.8 GC
N
f-1618671862
f
GR
GS
[1 0 0 1.00107 398.05869 87.39595] CT
0.8 GC
N
f-1618671862
f
GR
GS
[1 0 0 1.00107 372.60684 99.8877] CT
0.8 GC
N
f-1618671862
f
GR
GS
[1 0 0 1.00107 394.57065 98.56403] CT
0.8 GC
N
f-1618671862
f
GR
GS
[1 0 0 1.00107 431.74228 50.15008] CT
0.8 GC
N
f-1618671862
f
GR
GS
[1 0 0 1.00107 431.87189 100.00828] CT
0.8 GC
N
f-1618671862
f
GR
GS
[1 0 0 1.00107 345.79166 77.92865] CT
0.8 GC
N
f-1618671862
f
GR
GS
[1 0 0 1.00107 417.95425 75.87956] CT
0.8 GC
N
f-1618671862
f
GR
GS
[1 0 0 1.00107 390.76605 76.22467] CT
0.8 GC
N
f-1618671862
f
GR
GS
[1 0 0 1.00107 414.66513 80.35982] CT
0.8 GC
N
f-1618671862
f
GR
GS
[1 0 0 1.00107 372.4184 84.4926] CT
0.8 GC
N
f-1618671862
f
GR
GS
[1 0 0 1.00107 385.85797 73.59886] CT
0.8 GC
N
f-1618671862
f
GR
GS
[1 0 0 1.00107 376.35864 92.15396] CT
0.8 GC
N
f-1618671862
f
GR
GS
[1 0 0 1.00107 355.93192 113.90768] CT
0.8 GC
N
f-1618671862
f
GR
GS
[1 0 0 1.00107 381.20627 65.54952] CT
0.8 GC
N
f-1618671862
f
GR
GS
[1 0 0 1.00107 384.09018 75.48704] CT
0.8 GC
N
f-1618671862
f
GR
GS
[1 0 0 1.00107 381.76718 113.43011] CT
0.8 GC
N
f-1618671862
f
GR
GS
[1 0 0 1.00107 395.69193 89.59181] CT
0.8 GC
N
f-1618671862
f
GR
GS
[1 0 0 1.00107 397.52136 64.34357] CT
0.8 GC
N
f-1618671862
f
GR
GS
[1 0 0 1.00107 355.37082 94.28243] CT
0.8 GC
N
f-1618671862
f
GR
GS
[1 0 0 1.00107 371.12543 65.8194] CT
0.8 GC
N
f-1618671862
f
GR
GS
[1 0 0 1.00107 409.74207 138.53155] CT
0.8 GC
N
f-1618671862
f
GR
GS
[1 0 0 1.00107 406.17276 106.60917] CT
0.8 GC
N
f-1618671862
f
GR
GS
[1 0 0 1.00107 364.36511 99.608] CT
0.8 GC
N
f-1618671862
f
GR
GS
[1 0 0 1.00107 381.17572 86.71228] CT
0.8 GC
N
f-1618671862
f
GR
GS
[1 0 0 1.00107 409.62173 114.01998] CT
0.8 GC
N
f-1618671862
f
GR
GS
[1 0 0 1.00107 388.65161 73.17983] CT
0.8 GC
N
f-1618671862
f
GR
GS
[1 0 0 1.00107 377.08151 97.28682] CT
0.8 GC
N
f-1618671862
f
GR
GS
[1 0 0 1.00107 423.27972 87.11723] CT
0.8 GC
N
f-1618671862
f
GR
GS
[1 0 0 1.00107 430.68405 137.04401] CT
0.8 GC
N
f-1618671862
f
GR
GS
[1 0 0 1.00107 473.70834 91.15962] CT
0.8 GC
N
f-1618671862
f
GR
GS
[1 0 0 1.00107 442.39258 76.31108] CT
0.8 GC
N
f-1618671862
f
GR
GS
[1 0 0 1.00107 361.28311 105.87873] CT
0.8 GC
N
f-1618671862
f
GR
GS
[1 0 0 1.00107 445.63708 87.62554] CT
0.8 GC
N
f-1618671862
f
GR
GS
[1 0 0 1.00107 435.9837 115.38452] CT
0.8 GC
N
f-1618671862
f
GR
GS
[1 0 0 1.00107 412.6972 102.27162] CT
0.8 GC
N
f-1618671862
f
GR
GS
[1 0 0 1.00107 407.49878 79.34605] CT
0.8 GC
N
f-1618671862
f
GR
GS
[1 0 0 1.00107 387.08926 92.78648] CT
0.8 GC
N
f-1618671862
f
GR
GS
[1 0 0 1.00107 383.93994 93.5676] CT
0.8 GC
N
f-1618671862
f
GR
GS
[1 0 0 1.00107 416.46463 74.51941] CT
0.8 GC
N
f-1618671862
f
GR
GS
[1 0 0 1.00107 392.81873 111.19311] CT
0.8 GC
N
f-1618671862
f
GR
GS
[1 0 0 1.00107 390.92834 74.81319] CT
0.8 GC
N
f-1618671862
f
GR
GS
[1 0 0 1.00107 410.52316 29.24813] CT
0.8 GC
N
f-1618671862
f
GR
GS
[1 0 0 1.00107 381.71683 89.27717] CT
0.8 GC
N
f-1618671862
f
GR
GS
[1 0 0 1.00107 396.75824 84.60813] CT
0.8 GC
N
f-1618671862
f
GR
GS
[1 0 0 1.00107 383.20279 116.68162] CT
0.8 GC
N
f-1618671862
f
GR
GS
[1 0 0 1.00107 384.00467 104.35711] CT
0.8 GC
N
f-1618671862
f
GR
GS
[1 0 0 1.00107 380.90491 94.47073] CT
0.8 GC
N
f-1618671862
f
GR
GS
[1 0 0 1.00107 385.86182 104.58226] CT
0.8 GC
N
f-1618671862
f
GR
GS
[1 0 0 1.00107 413.2648 75.72566] CT
0.8 GC
N
f-1618671862
f
GR
GS
[1 0 0 1.00107 392.4866 38.45083] CT
0.8 GC
N
f-1618671862
f
GR
GS
[1 0 0 1.00107 370.94916 66.93492] CT
0.8 GC
N
f-1618671862
f
GR
GS
[1 0 0 1.00107 393.32486 127.56936] CT
0.8 GC
N
f-1618671862
f
GR
GS
[1 0 0 1.00107 395.32205 84.4058] CT
0.8 GC
N
f-1618671862
f
GR
GS
[1 0 0 1.00107 426.15189 82.58495] CT
0.8 GC
N
f-1618671862
f
GR
GS
[1 0 0 1.00107 405.61734 83.46982] CT
0.8 GC
N
f-1618671862
f
GR
GS
[1 0 0 1.00107 403.27606 71.32467] CT
0.8 GC
N
f-1618671862
f
GR
GS
[1 0 0 1.00107 395.10229 111.32255] CT
0.8 GC
N
f-1618671862
f
GR
GS
[1 0 0 1.00107 378.5137 124.96613] CT
0.8 GC
N
f-1618671862
f
GR
GS
[1 0 0 1.00107 372.60812 108.84426] CT
0.8 GC
N
f-1618671862
f
GR
GS
[1 0 0 1.00107 408.31616 92.42526] CT
0.8 GC
N
f-1618671862
f
GR
GS
[1 0 0 1.00107 388.06058 82.06913] CT
0.8 GC
N
f-1618671862
f
GR
GS
[1 0 0 1.00107 383.34515 95.6991] CT
0.8 GC
N
f-1618671862
f
GR
GS
[1 0 0 1.00107 394.20908 105.72747] CT
0.8 GC
N
f-1618671862
f
GR
GS
[1 0 0 1.00107 404.3074 81.63343] CT
0.8 GC
N
f-1618671862
f
GR
GS
[1 0 0 1.00107 381.741 124.2936] CT
0.8 GC
N
f-1618671862
f
GR
GS
[1 0 0 1.00107 433.44394 77.43305] CT
0.8 GC
N
f-1618671862
f
GR
GS
[1 0 0 1.00107 379.08481 78.36014] CT
0.8 GC
N
f-1618671862
f
GR
GS
[1 0 0 1.00107 417.75372 85.06858] CT
0.8 GC
N
f-1618671862
f
GR
GS
[1 0 0 1.00107 418.56015 52.90786] CT
0.8 GC
N
f-1618671862
f
GR
GS
[1 0 0 1.00107 399.35876 115.94395] CT
0.8 GC
N
f-1618671862
f
GR
GS
[1 0 0 1.00107 388.5304 76.58224] CT
0.8 GC
N
f-1618671862
f
GR
GS
[1 0 0 1.00107 377.38434 50.94042] CT
0.8 GC
N
f-1618671862
f
GR
GS
[1 0 0 1.00107 389.89014 121.61955] CT
0.8 GC
N
f-1618671862
f
GR
GS
[1 0 0 1.00107 415.48138 85.74493] CT
0.8 GC
N
f-1618671862
f
GR
GS
[1 0 0 1.00107 414.30484 89.89139] CT
0.8 GC
N
f-1618671862
f
GR
GS
[1 0 0 1.00107 364.57996 80.37075] CT
0.8 GC
N
f-1618671862
f
GR
GS
[1 0 0 1.00107 411.92838 103.23912] CT
0.8 GC
N
f-1618671862
f
GR
GS
[1 0 0 1.00107 409.75928 60.10019] CT
0.8 GC
N
f-1618671862
f
GR
GS
[1 0 0 1.00107 400.75851 106.42937] CT
0.8 GC
N
f-1618671862
f
GR
GS
[1 0 0 1.00107 372.18869 126.22966] CT
0.8 GC
N
f-1618671862
f
GR
GS
[1 0 0 1.00107 371.80615 114.72541] CT
0.8 GC
N
f-1618671862
f
GR
GS
[1 0 0 1.00107 378.79276 106.76392] CT
0.8 GC
N
f-1618671862
f
GR
GS
[1 0 0 1.00107 424.87076 72.62346] CT
0.8 GC
N
f-1618671862
f
GR
GS
[1 0 0 1.00107 406.60504 83.66679] CT
0.8 GC
N
f-1618671862
f
GR
GS
[1 0 0 1.00107 392.57483 47.79305] CT
0.8 GC
N
f-1618671862
f
GR
GS
[1 0 0 1.00107 429.01874 125.39404] CT
0.8 GC
N
f-1618671862
f
GR
GS
[1 0 0 1.00107 396.12485 76.24249] CT
0.8 GC
N
f-1618671862
f
GR
GS
[1 0 0 1.00107 404.3226 117.19534] CT
0.8 GC
N
f-1618671862
f
GR
GS
[1 0 0 1.00107 403.9155 59.13515] CT
0.8 GC
N
f-1618671862
f
GR
GS
[1 0 0 1.00107 401.62329 79.30789] CT
0.8 GC
N
f-1618671862
f
GR
GS
[1 0 0 1.00107 400.50644 82.20195] CT
0.8 GC
N
f-1618671862
f
GR
GS
[1 0 0 1.00107 398.56418 110.24143] CT
0.8 GC
N
f-1618671862
f
GR
GS
[1 0 0 1.00107 0 -0.2] CT
1 0.6 0.6 RC
1 LJ
3 LW
N
345.792 94.416 M
485.722 81.626 L
S
GR
%%Trailer
%%Pages: 1
%%EOF
