%!PS-Adobe-3.0 EPSF-3.0
%%Creator: (MATLAB, The Mathworks, Inc. Version 9.8.0.1323502 \(R2020a\). Operating System: Mac OS X)
%%Title: /Users/kosciessa/Desktop/mntTardisLNDG/LNDG/stateswitch/stsw_fmri_task/pls_mean/figures/behavPLS_1group/d_correlations_cppthresh.eps
%%CreationDate: 2022-05-16T17:36:09
%%Pages: (atend)
%%BoundingBox:    51     0   506   187
%%LanguageLevel: 3
%%EndComments
%%BeginProlog
%%BeginResource: procset (Apache XML Graphics Std ProcSet) 1.2 0
%%Version: 1.2 0
%%Copyright: (Copyright 2001-2003,2010 The Apache Software Foundation. License terms: http://www.apache.org/licenses/LICENSE-2.0)
/bd{bind def}bind def
/ld{load def}bd
/GR/grestore ld
/GS/gsave ld
/RM/rmoveto ld
/C/curveto ld
/t/show ld
/L/lineto ld
/ML/setmiterlimit ld
/CT/concat ld
/f/fill ld
/N/newpath ld
/S/stroke ld
/CC/setcmykcolor ld
/A/ashow ld
/cp/closepath ld
/RC/setrgbcolor ld
/LJ/setlinejoin ld
/GC/setgray ld
/LW/setlinewidth ld
/M/moveto ld
/re {4 2 roll M
1 index 0 rlineto
0 exch rlineto
neg 0 rlineto
cp } bd
/_ctm matrix def
/_tm matrix def
/BT { _ctm currentmatrix pop matrix _tm copy pop 0 0 moveto } bd
/ET { _ctm setmatrix } bd
/iTm { _ctm setmatrix _tm concat } bd
/Tm { _tm astore pop iTm 0 0 moveto } bd
/ux 0.0 def
/uy 0.0 def
/F {
  /Tp exch def
  /Tf exch def
  Tf findfont Tp scalefont setfont
  /cf Tf def  /cs Tp def
} bd
/ULS {currentpoint /uy exch def /ux exch def} bd
/ULE {
  /Tcx currentpoint pop def
  gsave
  newpath
  cf findfont cs scalefont dup
  /FontMatrix get 0 get /Ts exch def /FontInfo get dup
  /UnderlinePosition get Ts mul /To exch def
  /UnderlineThickness get Ts mul /Tt exch def
  ux uy To add moveto  Tcx uy To add lineto
  Tt setlinewidth stroke
  grestore
} bd
/OLE {
  /Tcx currentpoint pop def
  gsave
  newpath
  cf findfont cs scalefont dup
  /FontMatrix get 0 get /Ts exch def /FontInfo get dup
  /UnderlinePosition get Ts mul /To exch def
  /UnderlineThickness get Ts mul /Tt exch def
  ux uy To add cs add moveto Tcx uy To add cs add lineto
  Tt setlinewidth stroke
  grestore
} bd
/SOE {
  /Tcx currentpoint pop def
  gsave
  newpath
  cf findfont cs scalefont dup
  /FontMatrix get 0 get /Ts exch def /FontInfo get dup
  /UnderlinePosition get Ts mul /To exch def
  /UnderlineThickness get Ts mul /Tt exch def
  ux uy To add cs 10 mul 26 idiv add moveto Tcx uy To add cs 10 mul 26 idiv add lineto
  Tt setlinewidth stroke
  grestore
} bd
/QT {
/Y22 exch store
/X22 exch store
/Y21 exch store
/X21 exch store
currentpoint
/Y21 load 2 mul add 3 div exch
/X21 load 2 mul add 3 div exch
/X21 load 2 mul /X22 load add 3 div
/Y21 load 2 mul /Y22 load add 3 div
/X22 load /Y22 load curveto
} bd
/SSPD {
dup length /d exch dict def
{
/v exch def
/k exch def
currentpagedevice k known {
/cpdv currentpagedevice k get def
v cpdv ne {
/upd false def
/nullv v type /nulltype eq def
/nullcpdv cpdv type /nulltype eq def
nullv nullcpdv or
{
/upd true def
} {
/sametype v type cpdv type eq def
sametype {
v type /arraytype eq {
/vlen v length def
/cpdvlen cpdv length def
vlen cpdvlen eq {
0 1 vlen 1 sub {
/i exch def
/obj v i get def
/cpdobj cpdv i get def
obj cpdobj ne {
/upd true def
exit
} if
} for
} {
/upd true def
} ifelse
} {
v type /dicttype eq {
v {
/dv exch def
/dk exch def
/cpddv cpdv dk get def
dv cpddv ne {
/upd true def
exit
} if
} forall
} {
/upd true def
} ifelse
} ifelse
} if
} ifelse
upd true eq {
d k v put
} if
} if
} if
} forall
d length 0 gt {
d setpagedevice
} if
} bd
/RE { % /NewFontName [NewEncodingArray] /FontName RE -
  findfont dup length dict begin
  {
    1 index /FID ne
    {def} {pop pop} ifelse
  } forall
  /Encoding exch def
  /FontName 1 index def
  currentdict definefont pop
  end
} bind def
%%EndResource
%%BeginResource: procset (Apache XML Graphics EPS ProcSet) 1.0 0
%%Version: 1.0 0
%%Copyright: (Copyright 2002-2003 The Apache Software Foundation. License terms: http://www.apache.org/licenses/LICENSE-2.0)
/BeginEPSF { %def
/b4_Inc_state save def         % Save state for cleanup
/dict_count countdictstack def % Count objects on dict stack
/op_count count 1 sub def      % Count objects on operand stack
userdict begin                 % Push userdict on dict stack
/showpage { } def              % Redefine showpage, { } = null proc
0 setgray 0 setlinecap         % Prepare graphics state
1 setlinewidth 0 setlinejoin
10 setmiterlimit [ ] 0 setdash newpath
/languagelevel where           % If level not equal to 1 then
{pop languagelevel             % set strokeadjust and
1 ne                           % overprint to their defaults.
{false setstrokeadjust false setoverprint
} if
} if
} bd
/EndEPSF { %def
count op_count sub {pop} repeat            % Clean up stacks
countdictstack dict_count sub {end} repeat
b4_Inc_state restore
} bd
%%EndResource
%FOPBeginFontDict
%%IncludeResource: font Courier-Oblique
%%IncludeResource: font Courier-BoldOblique
%%IncludeResource: font Courier-Bold
%%IncludeResource: font ZapfDingbats
%%IncludeResource: font Symbol
%%IncludeResource: font Helvetica
%%IncludeResource: font Helvetica-Oblique
%%IncludeResource: font Helvetica-Bold
%%IncludeResource: font Helvetica-BoldOblique
%%IncludeResource: font Times-Roman
%%IncludeResource: font Times-Italic
%%IncludeResource: font Times-Bold
%%IncludeResource: font Times-BoldItalic
%%IncludeResource: font Courier
%FOPEndFontDict
%%BeginResource: encoding WinAnsiEncoding
/WinAnsiEncoding [
/.notdef /.notdef /.notdef /.notdef /.notdef
/.notdef /.notdef /.notdef /.notdef /.notdef
/.notdef /.notdef /.notdef /.notdef /.notdef
/.notdef /.notdef /.notdef /.notdef /.notdef
/.notdef /.notdef /.notdef /.notdef /.notdef
/.notdef /.notdef /.notdef /.notdef /.notdef
/.notdef /.notdef /space /exclam /quotedbl
/numbersign /dollar /percent /ampersand /quotesingle
/parenleft /parenright /asterisk /plus /comma
/hyphen /period /slash /zero /one
/two /three /four /five /six
/seven /eight /nine /colon /semicolon
/less /equal /greater /question /at
/A /B /C /D /E
/F /G /H /I /J
/K /L /M /N /O
/P /Q /R /S /T
/U /V /W /X /Y
/Z /bracketleft /backslash /bracketright /asciicircum
/underscore /quoteleft /a /b /c
/d /e /f /g /h
/i /j /k /l /m
/n /o /p /q /r
/s /t /u /v /w
/x /y /z /braceleft /bar
/braceright /asciitilde /bullet /Euro /bullet
/quotesinglbase /florin /quotedblbase /ellipsis /dagger
/daggerdbl /circumflex /perthousand /Scaron /guilsinglleft
/OE /bullet /Zcaron /bullet /bullet
/quoteleft /quoteright /quotedblleft /quotedblright /bullet
/endash /emdash /asciitilde /trademark /scaron
/guilsinglright /oe /bullet /zcaron /Ydieresis
/space /exclamdown /cent /sterling /currency
/yen /brokenbar /section /dieresis /copyright
/ordfeminine /guillemotleft /logicalnot /sfthyphen /registered
/macron /degree /plusminus /twosuperior /threesuperior
/acute /mu /paragraph /middot /cedilla
/onesuperior /ordmasculine /guillemotright /onequarter /onehalf
/threequarters /questiondown /Agrave /Aacute /Acircumflex
/Atilde /Adieresis /Aring /AE /Ccedilla
/Egrave /Eacute /Ecircumflex /Edieresis /Igrave
/Iacute /Icircumflex /Idieresis /Eth /Ntilde
/Ograve /Oacute /Ocircumflex /Otilde /Odieresis
/multiply /Oslash /Ugrave /Uacute /Ucircumflex
/Udieresis /Yacute /Thorn /germandbls /agrave
/aacute /acircumflex /atilde /adieresis /aring
/ae /ccedilla /egrave /eacute /ecircumflex
/edieresis /igrave /iacute /icircumflex /idieresis
/eth /ntilde /ograve /oacute /ocircumflex
/otilde /odieresis /divide /oslash /ugrave
/uacute /ucircumflex /udieresis /yacute /thorn
/ydieresis
] def
%%EndResource
%FOPBeginFontReencode
/Courier-Oblique findfont
dup length dict begin
  {1 index /FID ne {def} {pop pop} ifelse} forall
  /Encoding WinAnsiEncoding def
  currentdict
end
/Courier-Oblique exch definefont pop
/Courier-BoldOblique findfont
dup length dict begin
  {1 index /FID ne {def} {pop pop} ifelse} forall
  /Encoding WinAnsiEncoding def
  currentdict
end
/Courier-BoldOblique exch definefont pop
/Courier-Bold findfont
dup length dict begin
  {1 index /FID ne {def} {pop pop} ifelse} forall
  /Encoding WinAnsiEncoding def
  currentdict
end
/Courier-Bold exch definefont pop
/Helvetica findfont
dup length dict begin
  {1 index /FID ne {def} {pop pop} ifelse} forall
  /Encoding WinAnsiEncoding def
  currentdict
end
/Helvetica exch definefont pop
/Helvetica-Oblique findfont
dup length dict begin
  {1 index /FID ne {def} {pop pop} ifelse} forall
  /Encoding WinAnsiEncoding def
  currentdict
end
/Helvetica-Oblique exch definefont pop
/Helvetica-Bold findfont
dup length dict begin
  {1 index /FID ne {def} {pop pop} ifelse} forall
  /Encoding WinAnsiEncoding def
  currentdict
end
/Helvetica-Bold exch definefont pop
/Helvetica-BoldOblique findfont
dup length dict begin
  {1 index /FID ne {def} {pop pop} ifelse} forall
  /Encoding WinAnsiEncoding def
  currentdict
end
/Helvetica-BoldOblique exch definefont pop
/Times-Roman findfont
dup length dict begin
  {1 index /FID ne {def} {pop pop} ifelse} forall
  /Encoding WinAnsiEncoding def
  currentdict
end
/Times-Roman exch definefont pop
/Times-Italic findfont
dup length dict begin
  {1 index /FID ne {def} {pop pop} ifelse} forall
  /Encoding WinAnsiEncoding def
  currentdict
end
/Times-Italic exch definefont pop
/Times-Bold findfont
dup length dict begin
  {1 index /FID ne {def} {pop pop} ifelse} forall
  /Encoding WinAnsiEncoding def
  currentdict
end
/Times-Bold exch definefont pop
/Times-BoldItalic findfont
dup length dict begin
  {1 index /FID ne {def} {pop pop} ifelse} forall
  /Encoding WinAnsiEncoding def
  currentdict
end
/Times-BoldItalic exch definefont pop
/Courier findfont
dup length dict begin
  {1 index /FID ne {def} {pop pop} ifelse} forall
  /Encoding WinAnsiEncoding def
  currentdict
end
/Courier exch definefont pop
%FOPEndFontReencode
%%EndProlog
%%Page: 1 1
%%PageBoundingBox: 0 0 512 187
%%BeginPageSetup
[1 0 0 -1 0 187] CT
%%EndPageSetup
GS
[1 0 0 1.00107 0 -0.2] CT
1 GC
N
0 0 512 187 re
f
GR
GS
[1 0 0 1.00107 0 -0.2] CT
1 GC
N
0 0 512 187 re
f
GR
GS
[1 0 0 1.00107 0 -0.2] CT
0.2 GC
N
102.5 149.5 M
256 149.5 L
256 18.5 L
102.5 18.5 L
cp
f
GR
GS
[1 0 0 1.00107 0 -0.2] CT
0.149 GC
2 setlinecap
1 LJ
0.5 LW
N
102.5 149.5 M
256 149.5 L
S
GR
GS
[1 0 0 1.00107 0 -0.2] CT
0.149 GC
2 setlinecap
1 LJ
0.5 LW
N
129.103 149.5 M
129.103 147.965 L
S
GR
GS
[1 0 0 1.00107 0 -0.2] CT
0.149 GC
2 setlinecap
1 LJ
0.5 LW
N
169.201 149.5 M
169.201 147.965 L
S
GR
GS
[1 0 0 1.00107 0 -0.2] CT
0.149 GC
2 setlinecap
1 LJ
0.5 LW
N
209.299 149.5 M
209.299 147.965 L
S
GR
GS
[1 0 0 1.00107 0 -0.2] CT
0.149 GC
2 setlinecap
1 LJ
0.5 LW
N
249.397 149.5 M
249.397 147.965 L
S
GR
GS
[1 0 0 1.00107 129.10255 154.26503] CT
0.149 GC
/Helvetica 14 F
GS
[1 0 0 1 0 0] CT
-4 14 moveto 
1 -1 scale
(0) t 
GR
GR
GS
[1 0 0 1.00107 169.20079 154.26503] CT
0.149 GC
/Helvetica 14 F
GS
[1 0 0 1 0 0] CT
-16 14 moveto 
1 -1 scale
(5000) t 
GR
GR
GS
[1 0 0 1.00107 209.29903 154.26503] CT
0.149 GC
/Helvetica 14 F
GS
[1 0 0 1 0 0] CT
-19.5 14 moveto 
1 -1 scale
(10000) t 
GR
GR
GS
[1 0 0 1.00107 249.39726 154.26503] CT
0.149 GC
/Helvetica 14 F
GS
[1 0 0 1 0 0] CT
-19.5 14 moveto 
1 -1 scale
(15000) t 
GR
GR
GS
[1 0 0 1.00107 179.25008 171.78375] CT
0.149 GC
/Helvetica 14 F
GS
[1 0 0 1 0 0] CT
-74.5 14 moveto 
1 -1 scale
(fMRI Brainscore \(arb.u.\)) t 
GR
GR
GS
[1 0 0 1.00107 0 -0.2] CT
0.149 GC
2 setlinecap
1 LJ
0.5 LW
N
102.5 149.5 M
102.5 18.5 L
S
GR
GS
[1 0 0 1.00107 0 -0.2] CT
0.149 GC
2 setlinecap
1 LJ
0.5 LW
N
102.5 124.46 M
104.035 124.46 L
S
GR
GS
[1 0 0 1.00107 0 -0.2] CT
0.149 GC
2 setlinecap
1 LJ
0.5 LW
N
102.5 86.319 M
104.035 86.319 L
S
GR
GS
[1 0 0 1.00107 0 -0.2] CT
0.149 GC
2 setlinecap
1 LJ
0.5 LW
N
102.5 48.177 M
104.035 48.177 L
S
GR
GS
[1 0 0 1.00107 97.7 124.3931] CT
0.149 GC
/Helvetica 14 F
GS
[1 0 0 1 0 0] CT
-14 5.5 moveto 
1 -1 scale
(-2) t 
GR
GR
GS
[1 0 0 1.00107 97.7 86.21099] CT
0.149 GC
/Helvetica 14 F
GS
[1 0 0 1 0 0] CT
-8 5.5 moveto 
1 -1 scale
(0) t 
GR
GR
GS
[1 0 0 1.00107 97.7 48.02887] CT
0.149 GC
/Helvetica 14 F
GS
[1 0 0 1 0 0] CT
-8 5.5 moveto 
1 -1 scale
(2) t 
GR
GR
GS
[0 -1.00107 1 0 81.2 83.88978] CT
0.149 GC
/Helvetica 14 F
GS
[1 0 0 1 0 0] CT
-32 -20 moveto 
1 -1 scale
(cppthresh) t 
GR
GR
GS
[0 -1.00107 1 0 81.2 83.88978] CT
0.149 GC
/Helvetica 14 F
GS
[1 0 0 1 0 0] CT
-39 -3 moveto 
1 -1 scale
(\(linear mod.\)) t 
GR
GR
GS
[1 0 0 1.00107 103 15.81712] CT
0.149 GC
N
2.063 -0.406 M
2.063 -0.516 2.125 -0.609 QT
5.031 -3.5 L
2.125 -6.406 L
2.063 -6.484 2.063 -6.594 QT
2.063 -6.703 2.141 -6.789 QT
2.219 -6.875 2.344 -6.875 QT
2.438 -6.875 2.547 -6.781 QT
5.453 -3.891 L
8.328 -6.781 L
8.453 -6.875 8.531 -6.875 QT
8.656 -6.875 8.734 -6.797 QT
8.813 -6.719 8.813 -6.594 QT
8.813 -6.484 8.75 -6.406 QT
5.844 -3.5 L
8.75 -0.609 L
8.813 -0.516 8.813 -0.406 QT
8.813 -0.281 8.734 -0.203 QT
8.656 -0.125 8.531 -0.125 QT
8.438 -0.125 8.328 -0.219 QT
5.453 -3.109 L
2.547 -0.219 L
2.453 -0.125 2.344 -0.125 QT
2.219 -0.125 2.141 -0.211 QT
2.063 -0.297 2.063 -0.406 QT
cp
f
GR
GS
[1 0 0 1.00107 114 15.81712] CT
0.149 GC
/Helvetica 14 F
GS
[1 0 0 1 0 0] CT
0 0 moveto 
1 -1 scale
(10) t 
GR
GR
GS
[1 0 0 1.00107 130 8.80963] CT
0.149 GC
/Helvetica 11.2 F
GS
[1 0 0 1 0 0] CT
0 0 moveto 
1 -1 scale
(-4) t 
GR
GR
GS
[1 0 0 1.00107 179.25017 16.56792] CT
/Helvetica-Bold 14 F
GS
[1 0 0 1 0 0] CT
-78.5 -4 moveto 
1 -1 scale
(r = 0.18 CI = [-0.02,0.37]) t 
GR
GR
GS
[1 0 0 1.00107 151.85092 72.18673] CT
0.8 GC
N
0.5 0 M
0.5 -0.276 0.276 -0.5 0 -0.5 C
-0.276 -0.5 -0.5 -0.276 -0.5 0 C
-0.5 0.276 -0.276 0.5 0 0.5 C
0.276 0.5 0.5 0.276 0.5 0 C
cp
f
GR
GS
[1 0 0 1.00107 144.24544 94.45188] CT
0.8 GC
N
/f-2105962265{0.5 0 M
0.5 -0.276 0.276 -0.5 0 -0.5 C
-0.276 -0.5 -0.5 -0.276 -0.5 0 C
-0.5 0.276 -0.276 0.5 0 0.5 C
0.276 0.5 0.5 0.276 0.5 0 C
cp}def
f-2105962265
f
GR
GS
[1 0 0 1.00107 181.3502 81.44751] CT
0.8 GC
N
f-2105962265
f
GR
GS
[1 0 0 1.00107 175.20338 100.39023] CT
0.8 GC
N
f-2105962265
f
GR
GS
[1 0 0 1.00107 152.32356 87.60443] CT
0.8 GC
N
f-2105962265
f
GR
GS
[1 0 0 1.00107 172.06783 30.96408] CT
0.8 GC
N
f-2105962265
f
GR
GS
[1 0 0 1.00107 205.48311 110.57277] CT
0.8 GC
N
f-2105962265
f
GR
GS
[1 0 0 1.00107 205.59962 54.36718] CT
0.8 GC
N
f-2105962265
f
GR
GS
[1 0 0 1.00107 128.21817 90.02711] CT
0.8 GC
N
f-2105962265
f
GR
GS
[1 0 0 1.00107 193.08842 91.69385] CT
0.8 GC
N
f-2105962265
f
GR
GS
[1 0 0 1.00107 168.64771 93.60473] CT
0.8 GC
N
f-2105962265
f
GR
GS
[1 0 0 1.00107 190.1317 132.02426] CT
0.8 GC
N
f-2105962265
f
GR
GS
[1 0 0 1.00107 152.15416 49.64532] CT
0.8 GC
N
f-2105962265
f
GR
GS
[1 0 0 1.00107 164.23561 105.48046] CT
0.8 GC
N
f-2105962265
f
GR
GS
[1 0 0 1.00107 155.69623 55.28066] CT
0.8 GC
N
f-2105962265
f
GR
GS
[1 0 0 1.00107 137.33371 98.9363] CT
0.8 GC
N
f-2105962265
f
GR
GS
[1 0 0 1.00107 160.05399 105.74736] CT
0.8 GC
N
f-2105962265
f
GR
GS
[1 0 0 1.00107 162.64647 102.61399] CT
0.8 GC
N
f-2105962265
f
GR
GS
[1 0 0 1.00107 160.55821 83.60793] CT
0.8 GC
N
f-2105962265
f
GR
GS
[1 0 0 1.00107 173.07581 116.64015] CT
0.8 GC
N
f-2105962265
f
GR
GS
[1 0 0 1.00107 174.72037 88.06264] CT
0.8 GC
N
f-2105962265
f
GR
GS
[1 0 0 1.00107 136.82932 138.53155] CT
0.8 GC
N
f-2105962265
f
GR
GS
[1 0 0 1.00107 150.99184 124.77481] CT
0.8 GC
N
f-2105962265
f
GR
GS
[1 0 0 1.00107 185.70612 29.24813] CT
0.8 GC
N
f-2105962265
f
GR
GS
[1 0 0 1.00107 182.49751 82.40844] CT
0.8 GC
N
f-2105962265
f
GR
GS
[1 0 0 1.00107 144.91469 66.31206] CT
0.8 GC
N
f-2105962265
f
GR
GS
[1 0 0 1.00107 160.0265 78.3412] CT
0.8 GC
N
f-2105962265
f
GR
GS
[1 0 0 1.00107 185.59795 101.84848] CT
0.8 GC
N
f-2105962265
f
GR
GS
[1 0 0 1.00107 166.74693 119.73198] CT
0.8 GC
N
f-2105962265
f
GR
GS
[1 0 0 1.00107 156.34604 128.08696] CT
0.8 GC
N
f-2105962265
f
GR
GS
[1 0 0 1.00107 197.87573 51.32813] CT
0.8 GC
N
f-2105962265
f
GR
GS
[1 0 0 1.00107 204.53181 116.13728] CT
0.8 GC
N
f-2105962265
f
GR
GS
[1 0 0 1.00107 243.20833 43.02387] CT
0.8 GC
N
f-2105962265
f
GR
GS
[1 0 0 1.00107 215.05717 100.34758] CT
0.8 GC
N
f-2105962265
f
GR
GS
[1 0 0 1.00107 142.14415 120.31343] CT
0.8 GC
N
f-2105962265
f
GR
GS
[1 0 0 1.00107 217.9738 101.4919] CT
0.8 GC
N
f-2105962265
f
GR
GS
[1 0 0 1.00107 209.29594 86.79808] CT
0.8 GC
N
f-2105962265
f
GR
GS
[1 0 0 1.00107 188.36264 92.55202] CT
0.8 GC
N
f-2105962265
f
GR
GS
[1 0 0 1.00107 183.68954 112.32714] CT
0.8 GC
N
f-2105962265
f
GR
GS
[1 0 0 1.00107 165.34248 45.13014] CT
0.8 GC
N
f-2105962265
f
GR
GS
[1 0 0 1.00107 162.5114 135.90602] CT
0.8 GC
N
f-2105962265
f
GR
GS
[1 0 0 1.00107 191.74933 74.82193] CT
0.8 GC
N
f-2105962265
f
GR
GS
[1 0 0 1.00107 140.67679 125.44262] CT
0.8 GC
N
f-2105962265
f
GR
GS
[1 0 0 1.00107 138.97743 97.31271] CT
0.8 GC
N
f-2105962265
f
GR
GS
[1 0 0 1.00107 156.59213 136.18906] CT
0.8 GC
N
f-2105962265
f
GR
GS
[1 0 0 1.00107 130.69681 86.33032] CT
0.8 GC
N
f-2105962265
f
GR
GS
[1 0 0 1.00107 144.2182 116.26343] CT
0.8 GC
N
f-2105962265
f
GR
GS
[1 0 0 1.00107 132.03259 79.39233] CT
0.8 GC
N
f-2105962265
f
GR
GS
[1 0 0 1.00107 132.75345 113.35113] CT
0.8 GC
N
f-2105962265
f
GR
GS
[1 0 0 1.00107 129.9669 96.77034] CT
0.8 GC
N
f-2105962265
f
GR
GS
[1 0 0 1.00107 134.42291 103.5717] CT
0.8 GC
N
f-2105962265
f
GR
GS
[1 0 0 1.00107 159.0567 108.74508] CT
0.8 GC
N
f-2105962265
f
GR
GS
[1 0 0 1.00107 140.37825 86.64222] CT
0.8 GC
N
f-2105962265
f
GR
GS
[1 0 0 1.00107 121.01725 60.86756] CT
0.8 GC
N
f-2105962265
f
GR
GS
[1 0 0 1.00107 141.13179 87.74901] CT
0.8 GC
N
f-2105962265
f
GR
GS
[1 0 0 1.00107 142.92714 89.42181] CT
0.8 GC
N
f-2105962265
f
GR
GS
[1 0 0 1.00107 170.64149 95.56667] CT
0.8 GC
N
f-2105962265
f
GR
GS
[1 0 0 1.00107 152.18207 113.30819] CT
0.8 GC
N
f-2105962265
f
GR
GS
[1 0 0 1.00107 150.07739 99.22927] CT
0.8 GC
N
f-2105962265
f
GR
GS
[1 0 0 1.00107 142.7296 115.14193] CT
0.8 GC
N
f-2105962265
f
GR
GS
[1 0 0 1.00107 127.81736 87.91754] CT
0.8 GC
N
f-2105962265
f
GR
GS
[1 0 0 1.00107 122.50857 90.83889] CT
0.8 GC
N
f-2105962265
f
GR
GS
[1 0 0 1.00107 154.60814 136.18906] CT
0.8 GC
N
f-2105962265
f
GR
GS
[1 0 0 1.00107 136.39948 136.18906] CT
0.8 GC
N
f-2105962265
f
GR
GS
[1 0 0 1.00107 132.16058 91.9906] CT
0.8 GC
N
f-2105962265
f
GR
GS
[1 0 0 1.00107 141.92664 120.71029] CT
0.8 GC
N
f-2105962265
f
GR
GS
[1 0 0 1.00107 151.00449 116.56184] CT
0.8 GC
N
f-2105962265
f
GR
GS
[1 0 0 1.00107 130.71852 95.4434] CT
0.8 GC
N
f-2105962265
f
GR
GS
[1 0 0 1.00107 177.19667 104.50874] CT
0.8 GC
N
f-2105962265
f
GR
GS
[1 0 0 1.00107 128.33073 91.65439] CT
0.8 GC
N
f-2105962265
f
GR
GS
[1 0 0 1.00107 163.092 136.18906] CT
0.8 GC
N
f-2105962265
f
GR
GS
[1 0 0 1.00107 163.81694 92.53904] CT
0.8 GC
N
f-2105962265
f
GR
GS
[1 0 0 1.00107 146.55592 86.78821] CT
0.8 GC
N
f-2105962265
f
GR
GS
[1 0 0 1.00107 136.82182 130.23095] CT
0.8 GC
N
f-2105962265
f
GR
GS
[1 0 0 1.00107 126.8021 125.37788] CT
0.8 GC
N
f-2105962265
f
GR
GS
[1 0 0 1.00107 138.04414 76.41778] CT
0.8 GC
N
f-2105962265
f
GR
GS
[1 0 0 1.00107 161.0493 95.6787] CT
0.8 GC
N
f-2105962265
f
GR
GS
[1 0 0 1.00107 159.99164 91.53461] CT
0.8 GC
N
f-2105962265
f
GR
GS
[1 0 0 1.00107 115.29166 71.78728] CT
0.8 GC
N
f-2105962265
f
GR
GS
[1 0 0 1.00107 157.85533 95.97253] CT
0.8 GC
N
f-2105962265
f
GR
GS
[1 0 0 1.00107 155.90544 60.86756] CT
0.8 GC
N
f-2105962265
f
GR
GS
[1 0 0 1.00107 147.81425 105.99541] CT
0.8 GC
N
f-2105962265
f
GR
GS
[1 0 0 1.00107 122.13152 98.11541] CT
0.8 GC
N
f-2105962265
f
GR
GS
[1 0 0 1.00107 121.78762 83.0489] CT
0.8 GC
N
f-2105962265
f
GR
GS
[1 0 0 1.00107 128.06819 93.76867] CT
0.8 GC
N
f-2105962265
f
GR
GS
[1 0 0 1.00107 169.48984 95.72016] CT
0.8 GC
N
f-2105962265
f
GR
GS
[1 0 0 1.00107 153.06995 81.58634] CT
0.8 GC
N
f-2105962265
f
GR
GS
[1 0 0 1.00107 140.45755 105.58767] CT
0.8 GC
N
f-2105962265
f
GR
GS
[1 0 0 1.00107 173.21864 84.33371] CT
0.8 GC
N
f-2105962265
f
GR
GS
[1 0 0 1.00107 143.6488 78.5196] CT
0.8 GC
N
f-2105962265
f
GR
GS
[1 0 0 1.00107 151.01816 112.95224] CT
0.8 GC
N
f-2105962265
f
GR
GS
[1 0 0 1.00107 150.65219 108.20162] CT
0.8 GC
N
f-2105962265
f
GR
GS
[1 0 0 1.00107 148.59163 117.19292] CT
0.8 GC
N
f-2105962265
f
GR
GS
[1 0 0 1.00107 147.58763 136.18906] CT
0.8 GC
N
f-2105962265
f
GR
GS
[1 0 0 1.00107 145.84164 99.67497] CT
0.8 GC
N
f-2105962265
f
GR
GS
[1 0 0 1.00107 0 -0.2] CT
1 0.6 0.6 RC
1 LJ
3 LW
N
102.482 105.774 M
249.397 80.414 L
S
GR
GS
[1 0 0 1.00107 151.85092 72.18673] CT
0.8 1 1 RC
N
/f227889816{-3 -3 M
-3 3 L
3 3 L
3 -3 L
cp}def
f227889816
f
GR
GS
[1 0 0 1.00107 144.24544 94.45188] CT
0.8 1 1 RC
N
f227889816
f
GR
GS
[1 0 0 1.00107 181.3502 81.44751] CT
0.8 1 1 RC
N
f227889816
f
GR
GS
[1 0 0 1.00107 175.20338 100.39023] CT
0.8 1 1 RC
N
f227889816
f
GR
GS
[1 0 0 1.00107 152.32356 87.60443] CT
0.8 1 1 RC
N
f227889816
f
GR
GS
[1 0 0 1.00107 172.06783 30.96408] CT
0.8 1 1 RC
N
f227889816
f
GR
GS
[1 0 0 1.00107 205.48311 110.57277] CT
0.8 1 1 RC
N
f227889816
f
GR
GS
[1 0 0 1.00107 205.59962 54.36718] CT
0.8 1 1 RC
N
f227889816
f
GR
GS
[1 0 0 1.00107 128.21817 90.02711] CT
0.8 1 1 RC
N
f227889816
f
GR
GS
[1 0 0 1.00107 193.08842 91.69385] CT
0.8 1 1 RC
N
f227889816
f
GR
GS
[1 0 0 1.00107 168.64771 93.60473] CT
0.8 1 1 RC
N
f227889816
f
GR
GS
[1 0 0 1.00107 190.1317 132.02426] CT
0.8 1 1 RC
N
f227889816
f
GR
GS
[1 0 0 1.00107 152.15416 49.64532] CT
0.8 1 1 RC
N
f227889816
f
GR
GS
[1 0 0 1.00107 164.23561 105.48046] CT
0.8 1 1 RC
N
f227889816
f
GR
GS
[1 0 0 1.00107 155.69623 55.28066] CT
0.8 1 1 RC
N
f227889816
f
GR
GS
[1 0 0 1.00107 137.33371 98.9363] CT
0.8 1 1 RC
N
f227889816
f
GR
GS
[1 0 0 1.00107 160.05399 105.74736] CT
0.8 1 1 RC
N
f227889816
f
GR
GS
[1 0 0 1.00107 162.64647 102.61399] CT
0.8 1 1 RC
N
f227889816
f
GR
GS
[1 0 0 1.00107 160.55821 83.60793] CT
0.8 1 1 RC
N
f227889816
f
GR
GS
[1 0 0 1.00107 173.07581 116.64015] CT
0.8 1 1 RC
N
f227889816
f
GR
GS
[1 0 0 1.00107 174.72037 88.06264] CT
0.8 1 1 RC
N
f227889816
f
GR
GS
[1 0 0 1.00107 136.82932 138.53155] CT
0.8 1 1 RC
N
f227889816
f
GR
GS
[1 0 0 1.00107 150.99184 124.77481] CT
0.8 1 1 RC
N
f227889816
f
GR
GS
[1 0 0 1.00107 185.70612 29.24813] CT
0.8 1 1 RC
N
f227889816
f
GR
GS
[1 0 0 1.00107 182.49751 82.40844] CT
0.8 1 1 RC
N
f227889816
f
GR
GS
[1 0 0 1.00107 144.91469 66.31206] CT
0.8 1 1 RC
N
f227889816
f
GR
GS
[1 0 0 1.00107 160.0265 78.3412] CT
0.8 1 1 RC
N
f227889816
f
GR
GS
[1 0 0 1.00107 185.59795 101.84848] CT
0.8 1 1 RC
N
f227889816
f
GR
GS
[1 0 0 1.00107 166.74693 119.73198] CT
0.8 1 1 RC
N
f227889816
f
GR
GS
[1 0 0 1.00107 156.34604 128.08696] CT
0.8 1 1 RC
N
f227889816
f
GR
GS
[1 0 0 1.00107 197.87573 51.32813] CT
0.8 1 1 RC
N
f227889816
f
GR
GS
[1 0 0 1.00107 204.53181 116.13728] CT
0.8 1 1 RC
N
f227889816
f
GR
GS
[1 0 0 1.00107 243.20833 43.02387] CT
0.8 1 1 RC
N
f227889816
f
GR
GS
[1 0 0 1.00107 215.05717 100.34758] CT
0.8 1 1 RC
N
f227889816
f
GR
GS
[1 0 0 1.00107 142.14415 120.31343] CT
0.8 1 1 RC
N
f227889816
f
GR
GS
[1 0 0 1.00107 217.9738 101.4919] CT
0.8 1 1 RC
N
f227889816
f
GR
GS
[1 0 0 1.00107 209.29594 86.79808] CT
0.8 1 1 RC
N
f227889816
f
GR
GS
[1 0 0 1.00107 188.36264 92.55202] CT
0.8 1 1 RC
N
f227889816
f
GR
GS
[1 0 0 1.00107 183.68954 112.32714] CT
0.8 1 1 RC
N
f227889816
f
GR
GS
[1 0 0 1.00107 165.34248 45.13014] CT
0.8 1 1 RC
N
f227889816
f
GR
GS
[1 0 0 1.00107 162.5114 135.90602] CT
0.8 1 1 RC
N
f227889816
f
GR
GS
[1 0 0 1.00107 191.74933 74.82193] CT
0.8 1 1 RC
N
f227889816
f
GR
GS
[1 0 0 1.00107 140.67679 125.44262] CT
0.6 0.8 0.8 RC
N
/f-1969333140{-3.536 0 M
0 4.702 L
3.536 0 L
0 -4.702 L
cp}def
f-1969333140
f
GR
GS
[1 0 0 1.00107 138.97743 97.31271] CT
0.6 0.8 0.8 RC
N
f-1969333140
f
GR
GS
[1 0 0 1.00107 156.59213 136.18906] CT
0.6 0.8 0.8 RC
N
f-1969333140
f
GR
GS
[1 0 0 1.00107 130.69681 86.33032] CT
0.6 0.8 0.8 RC
N
f-1969333140
f
GR
GS
[1 0 0 1.00107 144.2182 116.26343] CT
0.6 0.8 0.8 RC
N
f-1969333140
f
GR
GS
[1 0 0 1.00107 132.03259 79.39233] CT
0.6 0.8 0.8 RC
N
f-1969333140
f
GR
GS
[1 0 0 1.00107 132.75345 113.35113] CT
0.6 0.8 0.8 RC
N
f-1969333140
f
GR
GS
[1 0 0 1.00107 129.9669 96.77034] CT
0.6 0.8 0.8 RC
N
f-1969333140
f
GR
GS
[1 0 0 1.00107 134.42291 103.5717] CT
0.6 0.8 0.8 RC
N
f-1969333140
f
GR
GS
[1 0 0 1.00107 159.0567 108.74508] CT
0.6 0.8 0.8 RC
N
f-1969333140
f
GR
GS
[1 0 0 1.00107 140.37825 86.64222] CT
0.6 0.8 0.8 RC
N
f-1969333140
f
GR
GS
[1 0 0 1.00107 121.01725 60.86756] CT
0.6 0.8 0.8 RC
N
f-1969333140
f
GR
GS
[1 0 0 1.00107 141.13179 87.74901] CT
0.6 0.8 0.8 RC
N
f-1969333140
f
GR
GS
[1 0 0 1.00107 142.92714 89.42181] CT
0.6 0.8 0.8 RC
N
f-1969333140
f
GR
GS
[1 0 0 1.00107 170.64149 95.56667] CT
0.6 0.8 0.8 RC
N
f-1969333140
f
GR
GS
[1 0 0 1.00107 152.18207 113.30819] CT
0.6 0.8 0.8 RC
N
f-1969333140
f
GR
GS
[1 0 0 1.00107 150.07739 99.22927] CT
0.6 0.8 0.8 RC
N
f-1969333140
f
GR
GS
[1 0 0 1.00107 142.7296 115.14193] CT
0.6 0.8 0.8 RC
N
f-1969333140
f
GR
GS
[1 0 0 1.00107 127.81736 87.91754] CT
0.6 0.8 0.8 RC
N
f-1969333140
f
GR
GS
[1 0 0 1.00107 122.50857 90.83889] CT
0.6 0.8 0.8 RC
N
f-1969333140
f
GR
GS
[1 0 0 1.00107 154.60814 136.18906] CT
0.6 0.8 0.8 RC
N
f-1969333140
f
GR
GS
[1 0 0 1.00107 136.39948 136.18906] CT
0.6 0.8 0.8 RC
N
f-1969333140
f
GR
GS
[1 0 0 1.00107 132.16058 91.9906] CT
0.6 0.8 0.8 RC
N
f-1969333140
f
GR
GS
[1 0 0 1.00107 141.92664 120.71029] CT
0.6 0.8 0.8 RC
N
f-1969333140
f
GR
GS
[1 0 0 1.00107 151.00449 116.56184] CT
0.6 0.8 0.8 RC
N
f-1969333140
f
GR
GS
[1 0 0 1.00107 130.71852 95.4434] CT
0.6 0.8 0.8 RC
N
f-1969333140
f
GR
GS
[1 0 0 1.00107 177.19667 104.50874] CT
0.6 0.8 0.8 RC
N
f-1969333140
f
GR
GS
[1 0 0 1.00107 128.33073 91.65439] CT
0.6 0.8 0.8 RC
N
f-1969333140
f
GR
GS
[1 0 0 1.00107 163.092 136.18906] CT
0.6 0.8 0.8 RC
N
f-1969333140
f
GR
GS
[1 0 0 1.00107 163.81694 92.53904] CT
0.6 0.8 0.8 RC
N
f-1969333140
f
GR
GS
[1 0 0 1.00107 146.55592 86.78821] CT
0.6 0.8 0.8 RC
N
f-1969333140
f
GR
GS
[1 0 0 1.00107 136.82182 130.23095] CT
0.6 0.8 0.8 RC
N
f-1969333140
f
GR
GS
[1 0 0 1.00107 126.8021 125.37788] CT
0.6 0.8 0.8 RC
N
f-1969333140
f
GR
GS
[1 0 0 1.00107 138.04414 76.41778] CT
0.6 0.8 0.8 RC
N
f-1969333140
f
GR
GS
[1 0 0 1.00107 161.0493 95.6787] CT
0.6 0.8 0.8 RC
N
f-1969333140
f
GR
GS
[1 0 0 1.00107 159.99164 91.53461] CT
0.6 0.8 0.8 RC
N
f-1969333140
f
GR
GS
[1 0 0 1.00107 115.29166 71.78728] CT
0.6 0.8 0.8 RC
N
f-1969333140
f
GR
GS
[1 0 0 1.00107 157.85533 95.97253] CT
0.6 0.8 0.8 RC
N
f-1969333140
f
GR
GS
[1 0 0 1.00107 155.90544 60.86756] CT
0.6 0.8 0.8 RC
N
f-1969333140
f
GR
GS
[1 0 0 1.00107 147.81425 105.99541] CT
0.6 0.8 0.8 RC
N
f-1969333140
f
GR
GS
[1 0 0 1.00107 122.13152 98.11541] CT
0.6 0.8 0.8 RC
N
f-1969333140
f
GR
GS
[1 0 0 1.00107 121.78762 83.0489] CT
0.6 0.8 0.8 RC
N
f-1969333140
f
GR
GS
[1 0 0 1.00107 128.06819 93.76867] CT
0.6 0.8 0.8 RC
N
f-1969333140
f
GR
GS
[1 0 0 1.00107 169.48984 95.72016] CT
0.6 0.8 0.8 RC
N
f-1969333140
f
GR
GS
[1 0 0 1.00107 153.06995 81.58634] CT
0.6 0.8 0.8 RC
N
f-1969333140
f
GR
GS
[1 0 0 1.00107 140.45755 105.58767] CT
0.6 0.8 0.8 RC
N
f-1969333140
f
GR
GS
[1 0 0 1.00107 173.21864 84.33371] CT
0.6 0.8 0.8 RC
N
f-1969333140
f
GR
GS
[1 0 0 1.00107 143.6488 78.5196] CT
0.6 0.8 0.8 RC
N
f-1969333140
f
GR
GS
[1 0 0 1.00107 151.01816 112.95224] CT
0.6 0.8 0.8 RC
N
f-1969333140
f
GR
GS
[1 0 0 1.00107 150.65219 108.20162] CT
0.6 0.8 0.8 RC
N
f-1969333140
f
GR
GS
[1 0 0 1.00107 148.59163 117.19292] CT
0.6 0.8 0.8 RC
N
f-1969333140
f
GR
GS
[1 0 0 1.00107 147.58763 136.18906] CT
0.6 0.8 0.8 RC
N
f-1969333140
f
GR
GS
[1 0 0 1.00107 145.84164 99.67497] CT
0.6 0.8 0.8 RC
N
f-1969333140
f
GR
GS
[1 0 0 1.00107 0 -0.2] CT
0.2 GC
N
/f-436321476{333 149.5 M
486.5 149.5 L
486.5 18.5 L
333 18.5 L
cp}def
f-436321476
f
GR
GS
[1 0 0 1.00107 0 -0.2] CT
0.149 GC
2 setlinecap
1 LJ
0.5 LW
N
333 149.5 M
486.5 149.5 L
S
GR
GS
[1 0 0 1.00107 0 -0.2] CT
0.149 GC
2 setlinecap
1 LJ
0.5 LW
N
351.905 149.5 M
351.905 147.965 L
S
GR
GS
[1 0 0 1.00107 0 -0.2] CT
0.149 GC
2 setlinecap
1 LJ
0.5 LW
N
396.51 149.5 M
396.51 147.965 L
S
GR
GS
[1 0 0 1.00107 0 -0.2] CT
0.149 GC
2 setlinecap
1 LJ
0.5 LW
N
441.116 149.5 M
441.116 147.965 L
S
GR
GS
[1 0 0 1.00107 0 -0.2] CT
0.149 GC
2 setlinecap
1 LJ
0.5 LW
N
485.722 149.5 M
485.722 147.965 L
S
GR
GS
[1 0 0 1.00107 351.90451 154.26503] CT
0.149 GC
/Helvetica 14 F
GS
[1 0 0 1 0 0] CT
-18.5 14 moveto 
1 -1 scale
(-5000) t 
GR
GR
GS
[1 0 0 1.00107 396.51035 154.26503] CT
0.149 GC
/Helvetica 14 F
GS
[1 0 0 1 0 0] CT
-4 14 moveto 
1 -1 scale
(0) t 
GR
GR
GS
[1 0 0 1.00107 441.11618 154.26503] CT
0.149 GC
/Helvetica 14 F
GS
[1 0 0 1 0 0] CT
-16 14 moveto 
1 -1 scale
(5000) t 
GR
GR
GS
[1 0 0 1.00107 485.72205 154.26503] CT
0.149 GC
/Helvetica 14 F
GS
[1 0 0 1 0 0] CT
-19.5 14 moveto 
1 -1 scale
(10000) t 
GR
GR
GS
[1 0 0 1.00107 409.75006 171.78375] CT
0.149 GC
/Helvetica 14 F
GS
[1 0 0 1 0 0] CT
-74.5 14 moveto 
1 -1 scale
(fMRI Brainscore \(arb.u.\)) t 
GR
GR
GS
[1 0 0 1.00107 0 -0.2] CT
0.149 GC
2 setlinecap
1 LJ
0.5 LW
N
333 149.5 M
333 18.5 L
S
GR
GS
[1 0 0 1.00107 0 -0.2] CT
0.149 GC
2 setlinecap
1 LJ
0.5 LW
N
333 128.597 M
334.535 128.597 L
S
GR
GS
[1 0 0 1.00107 0 -0.2] CT
0.149 GC
2 setlinecap
1 LJ
0.5 LW
N
333 90.456 M
334.535 90.456 L
S
GR
GS
[1 0 0 1.00107 0 -0.2] CT
0.149 GC
2 setlinecap
1 LJ
0.5 LW
N
333 52.315 M
334.535 52.315 L
S
GR
GS
[1 0 0 1.00107 328.20001 128.53475] CT
0.149 GC
/Helvetica 14 F
GS
[1 0 0 1 0 0] CT
-14 5.5 moveto 
1 -1 scale
(-2) t 
GR
GR
GS
[1 0 0 1.00107 328.20001 90.35263] CT
0.149 GC
/Helvetica 14 F
GS
[1 0 0 1 0 0] CT
-8 5.5 moveto 
1 -1 scale
(0) t 
GR
GR
GS
[1 0 0 1.00107 328.20001 52.17052] CT
0.149 GC
/Helvetica 14 F
GS
[1 0 0 1 0 0] CT
-8 5.5 moveto 
1 -1 scale
(2) t 
GR
GR
GS
[0 -1.00107 1 0 311.70001 83.88978] CT
0.149 GC
/Helvetica 14 F
GS
[1 0 0 1 0 0] CT
-32 -20 moveto 
1 -1 scale
(cppthresh) t 
GR
GR
GS
[0 -1.00107 1 0 311.70001 83.88978] CT
0.149 GC
/Helvetica 14 F
GS
[1 0 0 1 0 0] CT
-39 -3 moveto 
1 -1 scale
(\(linear mod.\)) t 
GR
GR
GS
[1 0 0 1.00107 333 15.81712] CT
0.149 GC
N
/f-716611200{2.063 -0.406 M
2.063 -0.516 2.125 -0.609 QT
5.031 -3.5 L
2.125 -6.406 L
2.063 -6.484 2.063 -6.594 QT
2.063 -6.703 2.141 -6.789 QT
2.219 -6.875 2.344 -6.875 QT
2.438 -6.875 2.547 -6.781 QT
5.453 -3.891 L
8.328 -6.781 L
8.453 -6.875 8.531 -6.875 QT
8.656 -6.875 8.734 -6.797 QT
8.813 -6.719 8.813 -6.594 QT
8.813 -6.484 8.75 -6.406 QT
5.844 -3.5 L
8.75 -0.609 L
8.813 -0.516 8.813 -0.406 QT
8.813 -0.281 8.734 -0.203 QT
8.656 -0.125 8.531 -0.125 QT
8.438 -0.125 8.328 -0.219 QT
5.453 -3.109 L
2.547 -0.219 L
2.453 -0.125 2.344 -0.125 QT
2.219 -0.125 2.141 -0.211 QT
2.063 -0.297 2.063 -0.406 QT
cp}def
f-716611200
f
GR
GS
[1 0 0 1.00107 344 15.81712] CT
0.149 GC
/Helvetica 14 F
GS
[1 0 0 1 0 0] CT
0 0 moveto 
1 -1 scale
(10) t 
GR
GR
GS
[1 0 0 1.00107 360 8.80963] CT
0.149 GC
/Helvetica 11.2 F
GS
[1 0 0 1 0 0] CT
0 0 moveto 
1 -1 scale
(-4) t 
GR
GR
GS
[1 0 0 1.00107 409.7504 16.56792] CT
/Helvetica-Bold 14 F
GS
[1 0 0 1 0 0] CT
-78.5 -4 moveto 
1 -1 scale
(r = 0.06 CI = [-0.14,0.26]) t 
GR
GR
GS
[1 0 0 1.00107 372.08109 72.18673] CT
0.8 GC
N
/f-1618671862{3.162 0 M
3.162 -1.746 1.746 -3.162 0 -3.162 C
-1.746 -3.162 -3.162 -1.746 -3.162 0 C
-3.162 1.746 -1.746 3.162 0 3.162 C
1.746 3.162 3.162 1.746 3.162 0 C
cp}def
f-1618671862
f
GR
GS
[1 0 0 1.00107 363.62064 94.45188] CT
0.8 GC
N
f-1618671862
f
GR
GS
[1 0 0 1.00107 404.89648 81.44752] CT
0.8 GC
N
f-1618671862
f
GR
GS
[1 0 0 1.00107 398.05869 100.39023] CT
0.8 GC
N
f-1618671862
f
GR
GS
[1 0 0 1.00107 372.60684 87.60443] CT
0.8 GC
N
f-1618671862
f
GR
GS
[1 0 0 1.00107 394.57065 30.96408] CT
0.8 GC
N
f-1618671862
f
GR
GS
[1 0 0 1.00107 431.74228 110.57277] CT
0.8 GC
N
f-1618671862
f
GR
GS
[1 0 0 1.00107 431.87189 54.36718] CT
0.8 GC
N
f-1618671862
f
GR
GS
[1 0 0 1.00107 345.79166 90.02711] CT
0.8 GC
N
f-1618671862
f
GR
GS
[1 0 0 1.00107 417.95425 91.69385] CT
0.8 GC
N
f-1618671862
f
GR
GS
[1 0 0 1.00107 390.76605 93.60473] CT
0.8 GC
N
f-1618671862
f
GR
GS
[1 0 0 1.00107 414.66513 132.02427] CT
0.8 GC
N
f-1618671862
f
GR
GS
[1 0 0 1.00107 372.4184 49.64532] CT
0.8 GC
N
f-1618671862
f
GR
GS
[1 0 0 1.00107 385.85797 105.48046] CT
0.8 GC
N
f-1618671862
f
GR
GS
[1 0 0 1.00107 376.35864 55.28066] CT
0.8 GC
N
f-1618671862
f
GR
GS
[1 0 0 1.00107 355.93192 98.9363] CT
0.8 GC
N
f-1618671862
f
GR
GS
[1 0 0 1.00107 381.20627 105.74736] CT
0.8 GC
N
f-1618671862
f
GR
GS
[1 0 0 1.00107 384.09018 102.61399] CT
0.8 GC
N
f-1618671862
f
GR
GS
[1 0 0 1.00107 381.76718 83.60793] CT
0.8 GC
N
f-1618671862
f
GR
GS
[1 0 0 1.00107 395.69193 116.64015] CT
0.8 GC
N
f-1618671862
f
GR
GS
[1 0 0 1.00107 397.52136 88.06264] CT
0.8 GC
N
f-1618671862
f
GR
GS
[1 0 0 1.00107 355.37082 138.53155] CT
0.8 GC
N
f-1618671862
f
GR
GS
[1 0 0 1.00107 371.12543 124.77481] CT
0.8 GC
N
f-1618671862
f
GR
GS
[1 0 0 1.00107 409.74207 29.24813] CT
0.8 GC
N
f-1618671862
f
GR
GS
[1 0 0 1.00107 406.17276 82.40844] CT
0.8 GC
N
f-1618671862
f
GR
GS
[1 0 0 1.00107 364.36511 66.31206] CT
0.8 GC
N
f-1618671862
f
GR
GS
[1 0 0 1.00107 381.17572 78.3412] CT
0.8 GC
N
f-1618671862
f
GR
GS
[1 0 0 1.00107 409.62173 101.84848] CT
0.8 GC
N
f-1618671862
f
GR
GS
[1 0 0 1.00107 388.65161 119.73198] CT
0.8 GC
N
f-1618671862
f
GR
GS
[1 0 0 1.00107 377.08151 128.08696] CT
0.8 GC
N
f-1618671862
f
GR
GS
[1 0 0 1.00107 423.27972 51.32813] CT
0.8 GC
N
f-1618671862
f
GR
GS
[1 0 0 1.00107 430.68405 116.13728] CT
0.8 GC
N
f-1618671862
f
GR
GS
[1 0 0 1.00107 473.70834 43.02387] CT
0.8 GC
N
f-1618671862
f
GR
GS
[1 0 0 1.00107 442.39258 100.34758] CT
0.8 GC
N
f-1618671862
f
GR
GS
[1 0 0 1.00107 361.28311 120.31342] CT
0.8 GC
N
f-1618671862
f
GR
GS
[1 0 0 1.00107 445.63708 101.4919] CT
0.8 GC
N
f-1618671862
f
GR
GS
[1 0 0 1.00107 435.9837 86.79808] CT
0.8 GC
N
f-1618671862
f
GR
GS
[1 0 0 1.00107 412.6972 92.55202] CT
0.8 GC
N
f-1618671862
f
GR
GS
[1 0 0 1.00107 407.49878 112.32714] CT
0.8 GC
N
f-1618671862
f
GR
GS
[1 0 0 1.00107 387.08926 45.13014] CT
0.8 GC
N
f-1618671862
f
GR
GS
[1 0 0 1.00107 383.93994 135.90602] CT
0.8 GC
N
f-1618671862
f
GR
GS
[1 0 0 1.00107 416.46463 74.82193] CT
0.8 GC
N
f-1618671862
f
GR
GS
[1 0 0 1.00107 392.81873 114.89772] CT
0.8 GC
N
f-1618671862
f
GR
GS
[1 0 0 1.00107 390.92834 86.76781] CT
0.8 GC
N
f-1618671862
f
GR
GS
[1 0 0 1.00107 410.52316 125.64415] CT
0.8 GC
N
f-1618671862
f
GR
GS
[1 0 0 1.00107 381.71683 75.78543] CT
0.8 GC
N
f-1618671862
f
GR
GS
[1 0 0 1.00107 396.75824 105.71854] CT
0.8 GC
N
f-1618671862
f
GR
GS
[1 0 0 1.00107 383.20279 68.84743] CT
0.8 GC
N
f-1618671862
f
GR
GS
[1 0 0 1.00107 384.00467 102.80623] CT
0.8 GC
N
f-1618671862
f
GR
GS
[1 0 0 1.00107 380.90491 86.22544] CT
0.8 GC
N
f-1618671862
f
GR
GS
[1 0 0 1.00107 385.86182 93.02679] CT
0.8 GC
N
f-1618671862
f
GR
GS
[1 0 0 1.00107 413.2648 98.20017] CT
0.8 GC
N
f-1618671862
f
GR
GS
[1 0 0 1.00107 392.4866 76.09732] CT
0.8 GC
N
f-1618671862
f
GR
GS
[1 0 0 1.00107 370.94916 50.32266] CT
0.8 GC
N
f-1618671862
f
GR
GS
[1 0 0 1.00107 393.32486 77.20411] CT
0.8 GC
N
f-1618671862
f
GR
GS
[1 0 0 1.00107 395.32205 78.87691] CT
0.8 GC
N
f-1618671862
f
GR
GS
[1 0 0 1.00107 426.15189 85.02176] CT
0.8 GC
N
f-1618671862
f
GR
GS
[1 0 0 1.00107 405.61734 102.76329] CT
0.8 GC
N
f-1618671862
f
GR
GS
[1 0 0 1.00107 403.27606 88.68437] CT
0.8 GC
N
f-1618671862
f
GR
GS
[1 0 0 1.00107 395.10229 104.59702] CT
0.8 GC
N
f-1618671862
f
GR
GS
[1 0 0 1.00107 378.5137 77.37264] CT
0.8 GC
N
f-1618671862
f
GR
GS
[1 0 0 1.00107 372.60812 80.29399] CT
0.8 GC
N
f-1618671862
f
GR
GS
[1 0 0 1.00107 408.31616 125.64415] CT
0.8 GC
N
f-1618671862
f
GR
GS
[1 0 0 1.00107 388.06058 125.64415] CT
0.8 GC
N
f-1618671862
f
GR
GS
[1 0 0 1.00107 383.34515 81.4457] CT
0.8 GC
N
f-1618671862
f
GR
GS
[1 0 0 1.00107 394.20908 110.16539] CT
0.8 GC
N
f-1618671862
f
GR
GS
[1 0 0 1.00107 404.3074 106.01694] CT
0.8 GC
N
f-1618671862
f
GR
GS
[1 0 0 1.00107 381.741 84.8985] CT
0.8 GC
N
f-1618671862
f
GR
GS
[1 0 0 1.00107 433.44394 93.96384] CT
0.8 GC
N
f-1618671862
f
GR
GS
[1 0 0 1.00107 379.08481 81.10949] CT
0.8 GC
N
f-1618671862
f
GR
GS
[1 0 0 1.00107 417.75372 125.64415] CT
0.8 GC
N
f-1618671862
f
GR
GS
[1 0 0 1.00107 418.56015 81.99414] CT
0.8 GC
N
f-1618671862
f
GR
GS
[1 0 0 1.00107 399.35876 76.24331] CT
0.8 GC
N
f-1618671862
f
GR
GS
[1 0 0 1.00107 388.5304 119.68605] CT
0.8 GC
N
f-1618671862
f
GR
GS
[1 0 0 1.00107 377.38434 114.83298] CT
0.8 GC
N
f-1618671862
f
GR
GS
[1 0 0 1.00107 389.89014 65.87287] CT
0.8 GC
N
f-1618671862
f
GR
GS
[1 0 0 1.00107 415.48138 85.1338] CT
0.8 GC
N
f-1618671862
f
GR
GS
[1 0 0 1.00107 414.30484 80.9897] CT
0.8 GC
N
f-1618671862
f
GR
GS
[1 0 0 1.00107 364.57996 61.24238] CT
0.8 GC
N
f-1618671862
f
GR
GS
[1 0 0 1.00107 411.92838 85.42762] CT
0.8 GC
N
f-1618671862
f
GR
GS
[1 0 0 1.00107 409.75928 50.32266] CT
0.8 GC
N
f-1618671862
f
GR
GS
[1 0 0 1.00107 400.75851 95.4505] CT
0.8 GC
N
f-1618671862
f
GR
GS
[1 0 0 1.00107 372.18869 87.57051] CT
0.8 GC
N
f-1618671862
f
GR
GS
[1 0 0 1.00107 371.80615 72.504] CT
0.8 GC
N
f-1618671862
f
GR
GS
[1 0 0 1.00107 378.79276 83.22376] CT
0.8 GC
N
f-1618671862
f
GR
GS
[1 0 0 1.00107 424.87076 85.17526] CT
0.8 GC
N
f-1618671862
f
GR
GS
[1 0 0 1.00107 406.60504 71.04144] CT
0.8 GC
N
f-1618671862
f
GR
GS
[1 0 0 1.00107 392.57483 95.04277] CT
0.8 GC
N
f-1618671862
f
GR
GS
[1 0 0 1.00107 429.01874 73.78881] CT
0.8 GC
N
f-1618671862
f
GR
GS
[1 0 0 1.00107 396.12485 67.97471] CT
0.8 GC
N
f-1618671862
f
GR
GS
[1 0 0 1.00107 404.3226 102.40734] CT
0.8 GC
N
f-1618671862
f
GR
GS
[1 0 0 1.00107 403.9155 97.65672] CT
0.8 GC
N
f-1618671862
f
GR
GS
[1 0 0 1.00107 401.62329 106.64803] CT
0.8 GC
N
f-1618671862
f
GR
GS
[1 0 0 1.00107 400.50644 125.64415] CT
0.8 GC
N
f-1618671862
f
GR
GS
[1 0 0 1.00107 398.56418 89.13007] CT
0.8 GC
N
f-1618671862
f
GR
GS
[1 0 0 1.00107 0 -0.2] CT
1 0.6 0.6 RC
1 LJ
3 LW
N
345.792 93.69 M
485.722 84.768 L
S
GR
%%Trailer
%%Pages: 1
%%EOF
