%!PS-Adobe-3.0 EPSF-3.0
%%Creator: (MATLAB, The Mathworks, Inc. Version 9.8.0.1323502 \(R2020a\). Operating System: Mac OS X)
%%Title: /Users/kosciessa/Desktop/mntTardisLNDG/LNDG/stateswitch/stsw_fmri_task/pls_mean/figures/behavPLS_1group/d_correlations_1group_behavpls_partialed.eps
%%CreationDate: 2022-05-16T17:35:56
%%Pages: (atend)
%%BoundingBox:     2     0   257   222
%%LanguageLevel: 3
%%EndComments
%%BeginProlog
%%BeginResource: procset (Apache XML Graphics Std ProcSet) 1.2 0
%%Version: 1.2 0
%%Copyright: (Copyright 2001-2003,2010 The Apache Software Foundation. License terms: http://www.apache.org/licenses/LICENSE-2.0)
/bd{bind def}bind def
/ld{load def}bd
/GR/grestore ld
/GS/gsave ld
/RM/rmoveto ld
/C/curveto ld
/t/show ld
/L/lineto ld
/ML/setmiterlimit ld
/CT/concat ld
/f/fill ld
/N/newpath ld
/S/stroke ld
/CC/setcmykcolor ld
/A/ashow ld
/cp/closepath ld
/RC/setrgbcolor ld
/LJ/setlinejoin ld
/GC/setgray ld
/LW/setlinewidth ld
/M/moveto ld
/re {4 2 roll M
1 index 0 rlineto
0 exch rlineto
neg 0 rlineto
cp } bd
/_ctm matrix def
/_tm matrix def
/BT { _ctm currentmatrix pop matrix _tm copy pop 0 0 moveto } bd
/ET { _ctm setmatrix } bd
/iTm { _ctm setmatrix _tm concat } bd
/Tm { _tm astore pop iTm 0 0 moveto } bd
/ux 0.0 def
/uy 0.0 def
/F {
  /Tp exch def
  /Tf exch def
  Tf findfont Tp scalefont setfont
  /cf Tf def  /cs Tp def
} bd
/ULS {currentpoint /uy exch def /ux exch def} bd
/ULE {
  /Tcx currentpoint pop def
  gsave
  newpath
  cf findfont cs scalefont dup
  /FontMatrix get 0 get /Ts exch def /FontInfo get dup
  /UnderlinePosition get Ts mul /To exch def
  /UnderlineThickness get Ts mul /Tt exch def
  ux uy To add moveto  Tcx uy To add lineto
  Tt setlinewidth stroke
  grestore
} bd
/OLE {
  /Tcx currentpoint pop def
  gsave
  newpath
  cf findfont cs scalefont dup
  /FontMatrix get 0 get /Ts exch def /FontInfo get dup
  /UnderlinePosition get Ts mul /To exch def
  /UnderlineThickness get Ts mul /Tt exch def
  ux uy To add cs add moveto Tcx uy To add cs add lineto
  Tt setlinewidth stroke
  grestore
} bd
/SOE {
  /Tcx currentpoint pop def
  gsave
  newpath
  cf findfont cs scalefont dup
  /FontMatrix get 0 get /Ts exch def /FontInfo get dup
  /UnderlinePosition get Ts mul /To exch def
  /UnderlineThickness get Ts mul /Tt exch def
  ux uy To add cs 10 mul 26 idiv add moveto Tcx uy To add cs 10 mul 26 idiv add lineto
  Tt setlinewidth stroke
  grestore
} bd
/QT {
/Y22 exch store
/X22 exch store
/Y21 exch store
/X21 exch store
currentpoint
/Y21 load 2 mul add 3 div exch
/X21 load 2 mul add 3 div exch
/X21 load 2 mul /X22 load add 3 div
/Y21 load 2 mul /Y22 load add 3 div
/X22 load /Y22 load curveto
} bd
/SSPD {
dup length /d exch dict def
{
/v exch def
/k exch def
currentpagedevice k known {
/cpdv currentpagedevice k get def
v cpdv ne {
/upd false def
/nullv v type /nulltype eq def
/nullcpdv cpdv type /nulltype eq def
nullv nullcpdv or
{
/upd true def
} {
/sametype v type cpdv type eq def
sametype {
v type /arraytype eq {
/vlen v length def
/cpdvlen cpdv length def
vlen cpdvlen eq {
0 1 vlen 1 sub {
/i exch def
/obj v i get def
/cpdobj cpdv i get def
obj cpdobj ne {
/upd true def
exit
} if
} for
} {
/upd true def
} ifelse
} {
v type /dicttype eq {
v {
/dv exch def
/dk exch def
/cpddv cpdv dk get def
dv cpddv ne {
/upd true def
exit
} if
} forall
} {
/upd true def
} ifelse
} ifelse
} if
} ifelse
upd true eq {
d k v put
} if
} if
} if
} forall
d length 0 gt {
d setpagedevice
} if
} bd
/RE { % /NewFontName [NewEncodingArray] /FontName RE -
  findfont dup length dict begin
  {
    1 index /FID ne
    {def} {pop pop} ifelse
  } forall
  /Encoding exch def
  /FontName 1 index def
  currentdict definefont pop
  end
} bind def
%%EndResource
%%BeginResource: procset (Apache XML Graphics EPS ProcSet) 1.0 0
%%Version: 1.0 0
%%Copyright: (Copyright 2002-2003 The Apache Software Foundation. License terms: http://www.apache.org/licenses/LICENSE-2.0)
/BeginEPSF { %def
/b4_Inc_state save def         % Save state for cleanup
/dict_count countdictstack def % Count objects on dict stack
/op_count count 1 sub def      % Count objects on operand stack
userdict begin                 % Push userdict on dict stack
/showpage { } def              % Redefine showpage, { } = null proc
0 setgray 0 setlinecap         % Prepare graphics state
1 setlinewidth 0 setlinejoin
10 setmiterlimit [ ] 0 setdash newpath
/languagelevel where           % If level not equal to 1 then
{pop languagelevel             % set strokeadjust and
1 ne                           % overprint to their defaults.
{false setstrokeadjust false setoverprint
} if
} if
} bd
/EndEPSF { %def
count op_count sub {pop} repeat            % Clean up stacks
countdictstack dict_count sub {end} repeat
b4_Inc_state restore
} bd
%%EndResource
%FOPBeginFontDict
%%IncludeResource: font Courier-Oblique
%%IncludeResource: font Courier-BoldOblique
%%IncludeResource: font Courier-Bold
%%IncludeResource: font ZapfDingbats
%%IncludeResource: font Symbol
%%IncludeResource: font Helvetica
%%IncludeResource: font Helvetica-Oblique
%%IncludeResource: font Helvetica-Bold
%%IncludeResource: font Helvetica-BoldOblique
%%IncludeResource: font Times-Roman
%%IncludeResource: font Times-Italic
%%IncludeResource: font Times-Bold
%%IncludeResource: font Times-BoldItalic
%%IncludeResource: font Courier
%FOPEndFontDict
%%BeginResource: encoding WinAnsiEncoding
/WinAnsiEncoding [
/.notdef /.notdef /.notdef /.notdef /.notdef
/.notdef /.notdef /.notdef /.notdef /.notdef
/.notdef /.notdef /.notdef /.notdef /.notdef
/.notdef /.notdef /.notdef /.notdef /.notdef
/.notdef /.notdef /.notdef /.notdef /.notdef
/.notdef /.notdef /.notdef /.notdef /.notdef
/.notdef /.notdef /space /exclam /quotedbl
/numbersign /dollar /percent /ampersand /quotesingle
/parenleft /parenright /asterisk /plus /comma
/hyphen /period /slash /zero /one
/two /three /four /five /six
/seven /eight /nine /colon /semicolon
/less /equal /greater /question /at
/A /B /C /D /E
/F /G /H /I /J
/K /L /M /N /O
/P /Q /R /S /T
/U /V /W /X /Y
/Z /bracketleft /backslash /bracketright /asciicircum
/underscore /quoteleft /a /b /c
/d /e /f /g /h
/i /j /k /l /m
/n /o /p /q /r
/s /t /u /v /w
/x /y /z /braceleft /bar
/braceright /asciitilde /bullet /Euro /bullet
/quotesinglbase /florin /quotedblbase /ellipsis /dagger
/daggerdbl /circumflex /perthousand /Scaron /guilsinglleft
/OE /bullet /Zcaron /bullet /bullet
/quoteleft /quoteright /quotedblleft /quotedblright /bullet
/endash /emdash /asciitilde /trademark /scaron
/guilsinglright /oe /bullet /zcaron /Ydieresis
/space /exclamdown /cent /sterling /currency
/yen /brokenbar /section /dieresis /copyright
/ordfeminine /guillemotleft /logicalnot /sfthyphen /registered
/macron /degree /plusminus /twosuperior /threesuperior
/acute /mu /paragraph /middot /cedilla
/onesuperior /ordmasculine /guillemotright /onequarter /onehalf
/threequarters /questiondown /Agrave /Aacute /Acircumflex
/Atilde /Adieresis /Aring /AE /Ccedilla
/Egrave /Eacute /Ecircumflex /Edieresis /Igrave
/Iacute /Icircumflex /Idieresis /Eth /Ntilde
/Ograve /Oacute /Ocircumflex /Otilde /Odieresis
/multiply /Oslash /Ugrave /Uacute /Ucircumflex
/Udieresis /Yacute /Thorn /germandbls /agrave
/aacute /acircumflex /atilde /adieresis /aring
/ae /ccedilla /egrave /eacute /ecircumflex
/edieresis /igrave /iacute /icircumflex /idieresis
/eth /ntilde /ograve /oacute /ocircumflex
/otilde /odieresis /divide /oslash /ugrave
/uacute /ucircumflex /udieresis /yacute /thorn
/ydieresis
] def
%%EndResource
%FOPBeginFontReencode
/Courier-Oblique findfont
dup length dict begin
  {1 index /FID ne {def} {pop pop} ifelse} forall
  /Encoding WinAnsiEncoding def
  currentdict
end
/Courier-Oblique exch definefont pop
/Courier-BoldOblique findfont
dup length dict begin
  {1 index /FID ne {def} {pop pop} ifelse} forall
  /Encoding WinAnsiEncoding def
  currentdict
end
/Courier-BoldOblique exch definefont pop
/Courier-Bold findfont
dup length dict begin
  {1 index /FID ne {def} {pop pop} ifelse} forall
  /Encoding WinAnsiEncoding def
  currentdict
end
/Courier-Bold exch definefont pop
/Helvetica findfont
dup length dict begin
  {1 index /FID ne {def} {pop pop} ifelse} forall
  /Encoding WinAnsiEncoding def
  currentdict
end
/Helvetica exch definefont pop
/Helvetica-Oblique findfont
dup length dict begin
  {1 index /FID ne {def} {pop pop} ifelse} forall
  /Encoding WinAnsiEncoding def
  currentdict
end
/Helvetica-Oblique exch definefont pop
/Helvetica-Bold findfont
dup length dict begin
  {1 index /FID ne {def} {pop pop} ifelse} forall
  /Encoding WinAnsiEncoding def
  currentdict
end
/Helvetica-Bold exch definefont pop
/Helvetica-BoldOblique findfont
dup length dict begin
  {1 index /FID ne {def} {pop pop} ifelse} forall
  /Encoding WinAnsiEncoding def
  currentdict
end
/Helvetica-BoldOblique exch definefont pop
/Times-Roman findfont
dup length dict begin
  {1 index /FID ne {def} {pop pop} ifelse} forall
  /Encoding WinAnsiEncoding def
  currentdict
end
/Times-Roman exch definefont pop
/Times-Italic findfont
dup length dict begin
  {1 index /FID ne {def} {pop pop} ifelse} forall
  /Encoding WinAnsiEncoding def
  currentdict
end
/Times-Italic exch definefont pop
/Times-Bold findfont
dup length dict begin
  {1 index /FID ne {def} {pop pop} ifelse} forall
  /Encoding WinAnsiEncoding def
  currentdict
end
/Times-Bold exch definefont pop
/Times-BoldItalic findfont
dup length dict begin
  {1 index /FID ne {def} {pop pop} ifelse} forall
  /Encoding WinAnsiEncoding def
  currentdict
end
/Times-BoldItalic exch definefont pop
/Courier findfont
dup length dict begin
  {1 index /FID ne {def} {pop pop} ifelse} forall
  /Encoding WinAnsiEncoding def
  currentdict
end
/Courier exch definefont pop
%FOPEndFontReencode
%%EndProlog
%%Page: 1 1
%%PageBoundingBox: 0 0 283 227
%%BeginPageSetup
[1 0 0 -1 0 227] CT
%%EndPageSetup
GS
[1.00164 0 0 0.99899 0 0.22835] CT
N
0 0 M
283 0 L
283 227 L
0 227 L
0 0 L
cp
clip
1 GC
N
0 0 283 227 re
f
GR
GS
[1.00164 0 0 0.99899 0 0.22835] CT
1 GC
N
0 0 283 227 re
f
GR
GS
[1.00164 0 0 0.99899 0 0.22835] CT
1 GC
N
43 152.5 M
256 152.5 L
256 18 L
43 18 L
cp
f
GR
GS
[1.00164 0 0 0.99899 149.74557 16.71175] CT
/Helvetica-Bold 12 F
GS
[1 0 0 1 0 0] CT
-39 -3 moveto 
1 -1 scale
(Age-partialed) t 
GR
GR
GS
[1.00164 0 0 0.99899 0 0.22835] CT
0.149 GC
1 LJ
0.5 LW
N
43 94.857 M
256 94.857 L
S
GR
GS
[1.00164 0 0 0.99899 0 0.22835] CT
0.6 0.8 0.8 RC
N
63.78 94.857 M
63.78 41.732 L
53.39 41.732 L
53.39 94.857 L
cp
76.768 94.857 M
76.768 56.432 L
66.378 56.432 L
66.378 94.857 L
cp
89.756 94.857 M
89.756 64.733 L
79.366 64.733 L
79.366 94.857 L
cp
102.744 94.857 M
102.744 57.06 L
92.354 57.06 L
92.354 94.857 L
cp
115.732 94.857 M
115.732 65.671 L
105.341 65.671 L
105.341 94.857 L
cp
128.72 94.857 M
128.72 79.291 L
118.329 79.291 L
118.329 94.857 L
cp
141.707 94.857 M
141.707 85.882 L
131.317 85.882 L
131.317 94.857 L
cp
154.695 94.857 M
154.695 93.781 L
144.305 93.781 L
144.305 94.857 L
cp
167.683 94.857 M
167.683 70.739 L
157.293 70.739 L
157.293 94.857 L
cp
180.671 94.857 M
180.671 89.062 L
170.28 89.062 L
170.28 94.857 L
cp
183.268 94.857 M
183.268 95.215 L
193.659 95.215 L
193.659 94.857 L
cp
196.256 94.857 M
196.256 115.751 L
206.646 115.751 L
206.646 94.857 L
cp
209.244 94.857 M
209.244 106.426 L
219.634 106.426 L
219.634 94.857 L
cp
222.232 94.857 M
222.232 117.795 L
232.622 117.795 L
232.622 94.857 L
cp
235.22 94.857 M
235.22 133.887 L
245.61 133.887 L
245.61 94.857 L
cp
f
GR
GS
[1.00164 0 0 0.99899 0 0.22835] CT
1 LJ
1.5 LW
N
58.585 41.732 M
58.585 56.86 L
S
GR
GS
[1.00164 0 0 0.99899 0 0.22835] CT
1 LJ
1.5 LW
N
71.573 56.432 M
71.573 74.124 L
S
GR
GS
[1.00164 0 0 0.99899 0 0.22835] CT
1 LJ
1.5 LW
N
84.561 64.733 M
84.561 83.37 L
S
GR
GS
[1.00164 0 0 0.99899 0 0.22835] CT
1 LJ
1.5 LW
N
97.549 57.06 M
97.549 74.835 L
S
GR
GS
[1.00164 0 0 0.99899 0 0.22835] CT
1 LJ
1.5 LW
N
110.537 65.671 M
110.537 84.393 L
S
GR
GS
[1.00164 0 0 0.99899 0 0.22835] CT
1 LJ
1.5 LW
N
123.524 79.291 M
123.524 98.781 L
S
GR
GS
[1.00164 0 0 0.99899 0 0.22835] CT
1 LJ
1.5 LW
N
136.512 85.882 M
136.512 105.444 L
S
GR
GS
[1.00164 0 0 0.99899 0 0.22835] CT
1 LJ
1.5 LW
N
149.5 93.781 M
149.5 113.185 L
S
GR
GS
[1.00164 0 0 0.99899 0 0.22835] CT
1 LJ
1.5 LW
N
162.488 70.739 M
162.488 89.848 L
S
GR
GS
[1.00164 0 0 0.99899 0 0.22835] CT
1 LJ
1.5 LW
N
175.476 89.062 M
175.476 108.591 L
S
GR
GS
[1.00164 0 0 0.99899 0 0.22835] CT
1 LJ
1.5 LW
N
188.463 95.215 M
188.463 114.562 L
S
GR
GS
[1.00164 0 0 0.99899 0 0.22835] CT
1 LJ
1.5 LW
N
201.451 115.751 M
201.451 133.423 L
S
GR
GS
[1.00164 0 0 0.99899 0 0.22835] CT
1 LJ
1.5 LW
N
214.439 106.426 M
214.439 125.055 L
S
GR
GS
[1.00164 0 0 0.99899 0 0.22835] CT
1 LJ
1.5 LW
N
227.427 117.795 M
227.427 135.216 L
S
GR
GS
[1.00164 0 0 0.99899 0 0.22835] CT
1 LJ
1.5 LW
N
240.415 133.887 M
240.415 148.83 L
S
GR
GS
[1.00164 0 0 0.99899 0 0.22835] CT
1 LJ
1.5 LW
N
58.585 41.732 M
58.585 29.638 L
S
GR
GS
[1.00164 0 0 0.99899 0 0.22835] CT
1 LJ
1.5 LW
N
71.573 56.432 M
71.573 41.381 L
S
GR
GS
[1.00164 0 0 0.99899 0 0.22835] CT
1 LJ
1.5 LW
N
84.561 64.733 M
84.561 48.312 L
S
GR
GS
[1.00164 0 0 0.99899 0 0.22835] CT
1 LJ
1.5 LW
N
97.549 57.06 M
97.549 41.897 L
S
GR
GS
[1.00164 0 0 0.99899 0 0.22835] CT
1 LJ
1.5 LW
N
110.537 65.671 M
110.537 49.11 L
S
GR
GS
[1.00164 0 0 0.99899 0 0.22835] CT
1 LJ
1.5 LW
N
123.524 79.291 M
123.524 61.033 L
S
GR
GS
[1.00164 0 0 0.99899 0 0.22835] CT
1 LJ
1.5 LW
N
136.512 85.882 M
136.512 67.043 L
S
GR
GS
[1.00164 0 0 0.99899 0 0.22835] CT
1 LJ
1.5 LW
N
149.5 93.781 M
149.5 74.465 L
S
GR
GS
[1.00164 0 0 0.99899 0 0.22835] CT
1 LJ
1.5 LW
N
162.488 70.739 M
162.488 53.471 L
S
GR
GS
[1.00164 0 0 0.99899 0 0.22835] CT
1 LJ
1.5 LW
N
175.476 89.062 M
175.476 70.002 L
S
GR
GS
[1.00164 0 0 0.99899 0 0.22835] CT
1 LJ
1.5 LW
N
188.463 95.215 M
188.463 75.838 L
S
GR
GS
[1.00164 0 0 0.99899 0 0.22835] CT
1 LJ
1.5 LW
N
201.451 115.751 M
201.451 96.459 L
S
GR
GS
[1.00164 0 0 0.99899 0 0.22835] CT
1 LJ
1.5 LW
N
214.439 106.426 M
214.439 86.869 L
S
GR
GS
[1.00164 0 0 0.99899 0 0.22835] CT
1 LJ
1.5 LW
N
227.427 117.795 M
227.427 98.613 L
S
GR
GS
[1.00164 0 0 0.99899 0 0.22835] CT
1 LJ
1.5 LW
N
240.415 133.887 M
240.415 116.278 L
S
GR
GS
[1.00164 0 0 0.99899 58.68154 57.03085] CT
N
-3 0 M
3 0 L
f
GR
GS
[1.00164 0 0 0.99899 58.68154 57.03085] CT
10.0 ML
1.5 LW
N
-3 0 M
3 0 L
S
GR
GS
[1.00164 0 0 0.99899 71.69067 74.27751] CT
N
/f1394637256{-3 0 M
3 0 L}def
f1394637256
f
GR
GS
[1.00164 0 0 0.99899 71.69067 74.27751] CT
10.0 ML
1.5 LW
N
-3 0 M
3 0 L
S
GR
GS
[1.00164 0 0 0.99899 84.69979 83.51436] CT
N
f1394637256
f
GR
GS
[1.00164 0 0 0.99899 84.69979 83.51436] CT
10.0 ML
1.5 LW
N
-3 0 M
3 0 L
S
GR
GS
[1.00164 0 0 0.99899 97.70892 74.98813] CT
N
f1394637256
f
GR
GS
[1.00164 0 0 0.99899 97.70892 74.98813] CT
10.0 ML
1.5 LW
N
-3 0 M
3 0 L
S
GR
GS
[1.00164 0 0 0.99899 110.71804 84.53669] CT
N
f1394637256
f
GR
GS
[1.00164 0 0 0.99899 110.71804 84.53669] CT
10.0 ML
1.5 LW
N
-3 0 M
3 0 L
S
GR
GS
[1.00164 0 0 0.99899 123.72717 98.91035] CT
N
f1394637256
f
GR
GS
[1.00164 0 0 0.99899 123.72717 98.91035] CT
10.0 ML
1.5 LW
N
-3 0 M
3 0 L
S
GR
GS
[1.00164 0 0 0.99899 136.73629 105.56593] CT
N
f1394637256
f
GR
GS
[1.00164 0 0 0.99899 136.73629 105.56593] CT
10.0 ML
1.5 LW
N
-3 0 M
3 0 L
S
GR
GS
[1.00164 0 0 0.99899 149.74542 113.29983] CT
N
f1394637256
f
GR
GS
[1.00164 0 0 0.99899 149.74542 113.29983] CT
10.0 ML
1.5 LW
N
-3 0 M
3 0 L
S
GR
GS
[1.00164 0 0 0.99899 162.75455 89.9863] CT
N
f1394637256
f
GR
GS
[1.00164 0 0 0.99899 162.75455 89.9863] CT
10.0 ML
1.5 LW
N
-3 0 M
3 0 L
S
GR
GS
[1.00164 0 0 0.99899 175.76367 108.71057] CT
N
f1394637256
f
GR
GS
[1.00164 0 0 0.99899 175.76367 108.71057] CT
10.0 ML
1.5 LW
N
-3 0 M
3 0 L
S
GR
GS
[1.00164 0 0 0.99899 188.77279 114.67545] CT
N
f1394637256
f
GR
GS
[1.00164 0 0 0.99899 188.77279 114.67545] CT
10.0 ML
1.5 LW
N
-3 0 M
3 0 L
S
GR
GS
[1.00164 0 0 0.99899 201.78192 133.51712] CT
N
f1394637256
f
GR
GS
[1.00164 0 0 0.99899 201.78192 133.51712] CT
10.0 ML
1.5 LW
N
-3 0 M
3 0 L
S
GR
GS
[1.00164 0 0 0.99899 214.79105 125.1579] CT
N
f1394637256
f
GR
GS
[1.00164 0 0 0.99899 214.79105 125.1579] CT
10.0 ML
1.5 LW
N
-3 0 M
3 0 L
S
GR
GS
[1.00164 0 0 0.99899 227.80018 135.30801] CT
N
f1394637256
f
GR
GS
[1.00164 0 0 0.99899 227.80018 135.30801] CT
10.0 ML
1.5 LW
N
-3 0 M
3 0 L
S
GR
GS
[1.00164 0 0 0.99899 240.80929 148.90867] CT
N
f1394637256
f
GR
GS
[1.00164 0 0 0.99899 240.80929 148.90867] CT
10.0 ML
1.5 LW
N
-3 0 M
3 0 L
S
GR
GS
[1.00164 0 0 0.99899 58.68154 29.83652] CT
N
f1394637256
f
GR
GS
[1.00164 0 0 0.99899 58.68154 29.83652] CT
10.0 ML
1.5 LW
N
-3 0 M
3 0 L
S
GR
GS
[1.00164 0 0 0.99899 71.69067 41.56738] CT
N
f1394637256
f
GR
GS
[1.00164 0 0 0.99899 71.69067 41.56738] CT
10.0 ML
1.5 LW
N
-3 0 M
3 0 L
S
GR
GS
[1.00164 0 0 0.99899 84.69979 48.49193] CT
N
f1394637256
f
GR
GS
[1.00164 0 0 0.99899 84.69979 48.49193] CT
10.0 ML
1.5 LW
N
-3 0 M
3 0 L
S
GR
GS
[1.00164 0 0 0.99899 97.70892 42.08314] CT
N
f1394637256
f
GR
GS
[1.00164 0 0 0.99899 97.70892 42.08314] CT
10.0 ML
1.5 LW
N
-3 0 M
3 0 L
S
GR
GS
[1.00164 0 0 0.99899 110.71804 49.28879] CT
N
f1394637256
f
GR
GS
[1.00164 0 0 0.99899 110.71804 49.28879] CT
10.0 ML
1.5 LW
N
-3 0 M
3 0 L
S
GR
GS
[1.00164 0 0 0.99899 123.72717 61.1997] CT
N
f1394637256
f
GR
GS
[1.00164 0 0 0.99899 123.72717 61.1997] CT
10.0 ML
1.5 LW
N
-3 0 M
3 0 L
S
GR
GS
[1.00164 0 0 0.99899 136.73629 67.20389] CT
N
f1394637256
f
GR
GS
[1.00164 0 0 0.99899 136.73629 67.20389] CT
10.0 ML
1.5 LW
N
-3 0 M
3 0 L
S
GR
GS
[1.00164 0 0 0.99899 149.74542 74.61839] CT
N
f1394637256
f
GR
GS
[1.00164 0 0 0.99899 149.74542 74.61839] CT
10.0 ML
1.5 LW
N
-3 0 M
3 0 L
S
GR
GS
[1.00164 0 0 0.99899 162.75455 53.64525] CT
N
f1394637256
f
GR
GS
[1.00164 0 0 0.99899 162.75455 53.64525] CT
10.0 ML
1.5 LW
N
-3 0 M
3 0 L
S
GR
GS
[1.00164 0 0 0.99899 175.76367 70.15955] CT
N
f1394637256
f
GR
GS
[1.00164 0 0 0.99899 175.76367 70.15955] CT
10.0 ML
1.5 LW
N
-3 0 M
3 0 L
S
GR
GS
[1.00164 0 0 0.99899 188.77279 75.98987] CT
N
f1394637256
f
GR
GS
[1.00164 0 0 0.99899 188.77279 75.98987] CT
10.0 ML
1.5 LW
N
-3 0 M
3 0 L
S
GR
GS
[1.00164 0 0 0.99899 201.78192 96.58986] CT
N
f1394637256
f
GR
GS
[1.00164 0 0 0.99899 201.78192 96.58986] CT
10.0 ML
1.5 LW
N
-3 0 M
3 0 L
S
GR
GS
[1.00164 0 0 0.99899 214.79105 87.01029] CT
N
f1394637256
f
GR
GS
[1.00164 0 0 0.99899 214.79105 87.01029] CT
10.0 ML
1.5 LW
N
-3 0 M
3 0 L
S
GR
GS
[1.00164 0 0 0.99899 227.80018 98.74261] CT
N
f1394637256
f
GR
GS
[1.00164 0 0 0.99899 227.80018 98.74261] CT
10.0 ML
1.5 LW
N
-3 0 M
3 0 L
S
GR
GS
[1.00164 0 0 0.99899 240.80929 116.38946] CT
N
f1394637256
f
GR
GS
[1.00164 0 0 0.99899 240.80929 116.38946] CT
10.0 ML
1.5 LW
N
-3 0 M
3 0 L
S
GR
GS
[1.00164 0 0 0.99899 0 0.22835] CT
0.149 GC
2 setlinecap
1 LJ
0.5 LW
N
43 152.5 M
256 152.5 L
S
GR
GS
[1.00164 0 0 0.99899 0 0.22835] CT
0.149 GC
2 setlinecap
1 LJ
0.5 LW
N
43 18 M
256 18 L
S
GR
GS
[1.00164 0 0 0.99899 0 0.22835] CT
0.149 GC
2 setlinecap
1 LJ
0.5 LW
N
58.585 152.5 M
58.585 150.375 L
S
GR
GS
[1.00164 0 0 0.99899 0 0.22835] CT
0.149 GC
2 setlinecap
1 LJ
0.5 LW
N
71.573 152.5 M
71.573 150.375 L
S
GR
GS
[1.00164 0 0 0.99899 0 0.22835] CT
0.149 GC
2 setlinecap
1 LJ
0.5 LW
N
84.561 152.5 M
84.561 150.375 L
S
GR
GS
[1.00164 0 0 0.99899 0 0.22835] CT
0.149 GC
2 setlinecap
1 LJ
0.5 LW
N
97.549 152.5 M
97.549 150.375 L
S
GR
GS
[1.00164 0 0 0.99899 0 0.22835] CT
0.149 GC
2 setlinecap
1 LJ
0.5 LW
N
110.537 152.5 M
110.537 150.375 L
S
GR
GS
[1.00164 0 0 0.99899 0 0.22835] CT
0.149 GC
2 setlinecap
1 LJ
0.5 LW
N
123.524 152.5 M
123.524 150.375 L
S
GR
GS
[1.00164 0 0 0.99899 0 0.22835] CT
0.149 GC
2 setlinecap
1 LJ
0.5 LW
N
136.512 152.5 M
136.512 150.375 L
S
GR
GS
[1.00164 0 0 0.99899 0 0.22835] CT
0.149 GC
2 setlinecap
1 LJ
0.5 LW
N
149.5 152.5 M
149.5 150.375 L
S
GR
GS
[1.00164 0 0 0.99899 0 0.22835] CT
0.149 GC
2 setlinecap
1 LJ
0.5 LW
N
162.488 152.5 M
162.488 150.375 L
S
GR
GS
[1.00164 0 0 0.99899 0 0.22835] CT
0.149 GC
2 setlinecap
1 LJ
0.5 LW
N
175.476 152.5 M
175.476 150.375 L
S
GR
GS
[1.00164 0 0 0.99899 0 0.22835] CT
0.149 GC
2 setlinecap
1 LJ
0.5 LW
N
188.463 152.5 M
188.463 150.375 L
S
GR
GS
[1.00164 0 0 0.99899 0 0.22835] CT
0.149 GC
2 setlinecap
1 LJ
0.5 LW
N
201.451 152.5 M
201.451 150.375 L
S
GR
GS
[1.00164 0 0 0.99899 0 0.22835] CT
0.149 GC
2 setlinecap
1 LJ
0.5 LW
N
214.439 152.5 M
214.439 150.375 L
S
GR
GS
[1.00164 0 0 0.99899 0 0.22835] CT
0.149 GC
2 setlinecap
1 LJ
0.5 LW
N
227.427 152.5 M
227.427 150.375 L
S
GR
GS
[1.00164 0 0 0.99899 0 0.22835] CT
0.149 GC
2 setlinecap
1 LJ
0.5 LW
N
240.415 152.5 M
240.415 150.375 L
S
GR
GS
[1.00164 0 0 0.99899 0 0.22835] CT
0.149 GC
2 setlinecap
1 LJ
0.5 LW
N
58.585 18 M
58.585 20.125 L
S
GR
GS
[1.00164 0 0 0.99899 0 0.22835] CT
0.149 GC
2 setlinecap
1 LJ
0.5 LW
N
71.573 18 M
71.573 20.125 L
S
GR
GS
[1.00164 0 0 0.99899 0 0.22835] CT
0.149 GC
2 setlinecap
1 LJ
0.5 LW
N
84.561 18 M
84.561 20.125 L
S
GR
GS
[1.00164 0 0 0.99899 0 0.22835] CT
0.149 GC
2 setlinecap
1 LJ
0.5 LW
N
97.549 18 M
97.549 20.125 L
S
GR
GS
[1.00164 0 0 0.99899 0 0.22835] CT
0.149 GC
2 setlinecap
1 LJ
0.5 LW
N
110.537 18 M
110.537 20.125 L
S
GR
GS
[1.00164 0 0 0.99899 0 0.22835] CT
0.149 GC
2 setlinecap
1 LJ
0.5 LW
N
123.524 18 M
123.524 20.125 L
S
GR
GS
[1.00164 0 0 0.99899 0 0.22835] CT
0.149 GC
2 setlinecap
1 LJ
0.5 LW
N
136.512 18 M
136.512 20.125 L
S
GR
GS
[1.00164 0 0 0.99899 0 0.22835] CT
0.149 GC
2 setlinecap
1 LJ
0.5 LW
N
149.5 18 M
149.5 20.125 L
S
GR
GS
[1.00164 0 0 0.99899 0 0.22835] CT
0.149 GC
2 setlinecap
1 LJ
0.5 LW
N
162.488 18 M
162.488 20.125 L
S
GR
GS
[1.00164 0 0 0.99899 0 0.22835] CT
0.149 GC
2 setlinecap
1 LJ
0.5 LW
N
175.476 18 M
175.476 20.125 L
S
GR
GS
[1.00164 0 0 0.99899 0 0.22835] CT
0.149 GC
2 setlinecap
1 LJ
0.5 LW
N
188.463 18 M
188.463 20.125 L
S
GR
GS
[1.00164 0 0 0.99899 0 0.22835] CT
0.149 GC
2 setlinecap
1 LJ
0.5 LW
N
201.451 18 M
201.451 20.125 L
S
GR
GS
[1.00164 0 0 0.99899 0 0.22835] CT
0.149 GC
2 setlinecap
1 LJ
0.5 LW
N
214.439 18 M
214.439 20.125 L
S
GR
GS
[1.00164 0 0 0.99899 0 0.22835] CT
0.149 GC
2 setlinecap
1 LJ
0.5 LW
N
227.427 18 M
227.427 20.125 L
S
GR
GS
[1.00164 0 0 0.99899 0 0.22835] CT
0.149 GC
2 setlinecap
1 LJ
0.5 LW
N
240.415 18 M
240.415 20.125 L
S
GR
GS
[0 -0.99899 1.00164 0 58.68154 156.97053] CT
0.149 GC
/Helvetica 12 F
GS
[1 0 0 1 0 0] CT
-36 4.5 moveto 
1 -1 scale
(drift-l1) t 
GR
GR
GS
[0 -0.99899 1.00164 0 71.69067 156.97053] CT
0.149 GC
/Helvetica 12 F
GS
[1 0 0 1 0 0] CT
-28 4.5 moveto 
1 -1 scale
(theta) t 
GR
GR
GS
[0 -0.99899 1.00164 0 84.69979 156.97053] CT
0.149 GC
/Helvetica 12 F
GS
[1 0 0 1 0 0] CT
-30 4.5 moveto 
1 -1 scale
(alpha) t 
GR
GR
GS
[0 -0.99899 1.00164 0 97.70892 156.97053] CT
0.149 GC
/Helvetica 12 F
GS
[1 0 0 1 0 0] CT
-27 4.5 moveto 
1 -1 scale
(pupil) t 
GR
GR
GS
[0 -0.99899 1.00164 0 110.71804 156.97053] CT
0.149 GC
/Helvetica 12 F
GS
[1 0 0 1 0 0] CT
-51 4.5 moveto 
1 -1 scale
(threshold) t 
GR
GR
GS
[0 -0.99899 1.00164 0 123.72717 156.97053] CT
0.149 GC
/Helvetica 12 F
GS
[1 0 0 1 0 0] CT
-43 4.5 moveto 
1 -1 scale
(sampen) t 
GR
GR
GS
[0 -0.99899 1.00164 0 136.73629 156.97053] CT
0.149 GC
/Helvetica 12 F
GS
[1 0 0 1 0 0] CT
-18 4.5 moveto 
1 -1 scale
(ndt) t 
GR
GR
GS
[0 -0.99899 1.00164 0 149.74542 156.97053] CT
0.149 GC
/Helvetica 12 F
GS
[1 0 0 1 0 0] CT
-28 4.5 moveto 
1 -1 scale
(fooof) t 
GR
GR
GS
[0 -0.99899 1.00164 0 162.75455 156.97053] CT
0.149 GC
/Helvetica 12 F
GS
[1 0 0 1 0 0] CT
-70 4.5 moveto 
1 -1 scale
(prestimalpha) t 
GR
GR
GS
[0 -0.99899 1.00164 0 175.76367 156.97053] CT
0.149 GC
/Helvetica 12 F
GS
[1 0 0 1 0 0] CT
-55 4.5 moveto 
1 -1 scale
(cppthresh) t 
GR
GR
GS
[0 -0.99899 1.00164 0 188.77279 156.97053] CT
0.149 GC
/Helvetica 12 F
GS
[1 0 0 1 0 0] CT
-32 4.5 moveto 
1 -1 scale
(ssvep) t 
GR
GR
GS
[0 -0.99899 1.00164 0 201.78192 156.97053] CT
0.149 GC
/Helvetica 12 F
GS
[1 0 0 1 0 0] CT
-65 4.5 moveto 
1 -1 scale
(threshold-l1) t 
GR
GR
GS
[0 -0.99899 1.00164 0 214.79105 156.97053] CT
0.149 GC
/Helvetica 12 F
GS
[1 0 0 1 0 0] CT
-32 4.5 moveto 
1 -1 scale
(ndt-l1) t 
GR
GR
GS
[0 -0.99899 1.00164 0 227.80018 156.97053] CT
0.149 GC
/Helvetica 12 F
GS
[1 0 0 1 0 0] CT
-21 4.5 moveto 
1 -1 scale
(cpp) t 
GR
GR
GS
[0 -0.99899 1.00164 0 240.80929 156.97053] CT
0.149 GC
/Helvetica 12 F
GS
[1 0 0 1 0 0] CT
-22 4.5 moveto 
1 -1 scale
(drift) t 
GR
GR
GS
[1.00164 0 0 0.99899 0 0.22835] CT
0.149 GC
2 setlinecap
1 LJ
0.5 LW
N
43 152.5 M
43 18 L
S
GR
GS
[1.00164 0 0 0.99899 0 0.22835] CT
0.149 GC
2 setlinecap
1 LJ
0.5 LW
N
256 152.5 M
256 18 L
S
GR
GS
[1.00164 0 0 0.99899 0 0.22835] CT
0.149 GC
2 setlinecap
1 LJ
0.5 LW
N
43 142.893 M
45.125 142.893 L
S
GR
GS
[1.00164 0 0 0.99899 0 0.22835] CT
0.149 GC
2 setlinecap
1 LJ
0.5 LW
N
43 94.857 M
45.125 94.857 L
S
GR
GS
[1.00164 0 0 0.99899 0 0.22835] CT
0.149 GC
2 setlinecap
1 LJ
0.5 LW
N
43 46.821 M
45.125 46.821 L
S
GR
GS
[1.00164 0 0 0.99899 0 0.22835] CT
0.149 GC
2 setlinecap
1 LJ
0.5 LW
N
256 142.893 M
253.875 142.893 L
S
GR
GS
[1.00164 0 0 0.99899 0 0.22835] CT
0.149 GC
2 setlinecap
1 LJ
0.5 LW
N
256 94.857 M
253.875 94.857 L
S
GR
GS
[1.00164 0 0 0.99899 0 0.22835] CT
0.149 GC
2 setlinecap
1 LJ
0.5 LW
N
256 46.821 M
253.875 46.821 L
S
GR
GS
[1.00164 0 0 0.99899 38.66336 142.97746] CT
0.149 GC
/Helvetica 12 F
GS
[1 0 0 1 0 0] CT
-22 4.5 moveto 
1 -1 scale
(-0.5) t 
GR
GR
GS
[1.00164 0 0 0.99899 38.66336 94.99007] CT
0.149 GC
/Helvetica 12 F
GS
[1 0 0 1 0 0] CT
-7 4.5 moveto 
1 -1 scale
(0) t 
GR
GR
GS
[1.00164 0 0 0.99899 38.66336 47.00268] CT
0.149 GC
/Helvetica 12 F
GS
[1 0 0 1 0 0] CT
-17 4.5 moveto 
1 -1 scale
(0.5) t 
GR
GR
GS
[0 -0.99899 1.00164 0 14.62397 85.39253] CT
0.149 GC
/Helvetica 12 F
GS
[1 0 0 1 0 0] CT
-30 -3 moveto 
1 -1 scale
(Correlation) t 
GR
GR
%%Trailer
%%Pages: 1
%%EOF
