%!PS-Adobe-3.0 EPSF-3.0
%%Creator: (MATLAB, The Mathworks, Inc. Version 9.8.0.1323502 \(R2020a\). Operating System: Mac OS X)
%%Title: /Users/kosciessa/Desktop/mntTardisLNDG/LNDG/stateswitch/stsw_fmri_task/pls_mean/figures/behavPLS_1group/d_correlations_fooof.eps
%%CreationDate: 2022-05-16T17:36:11
%%Pages: (atend)
%%BoundingBox:    39     0   506   185
%%LanguageLevel: 3
%%EndComments
%%BeginProlog
%%BeginResource: procset (Apache XML Graphics Std ProcSet) 1.2 0
%%Version: 1.2 0
%%Copyright: (Copyright 2001-2003,2010 The Apache Software Foundation. License terms: http://www.apache.org/licenses/LICENSE-2.0)
/bd{bind def}bind def
/ld{load def}bd
/GR/grestore ld
/GS/gsave ld
/RM/rmoveto ld
/C/curveto ld
/t/show ld
/L/lineto ld
/ML/setmiterlimit ld
/CT/concat ld
/f/fill ld
/N/newpath ld
/S/stroke ld
/CC/setcmykcolor ld
/A/ashow ld
/cp/closepath ld
/RC/setrgbcolor ld
/LJ/setlinejoin ld
/GC/setgray ld
/LW/setlinewidth ld
/M/moveto ld
/re {4 2 roll M
1 index 0 rlineto
0 exch rlineto
neg 0 rlineto
cp } bd
/_ctm matrix def
/_tm matrix def
/BT { _ctm currentmatrix pop matrix _tm copy pop 0 0 moveto } bd
/ET { _ctm setmatrix } bd
/iTm { _ctm setmatrix _tm concat } bd
/Tm { _tm astore pop iTm 0 0 moveto } bd
/ux 0.0 def
/uy 0.0 def
/F {
  /Tp exch def
  /Tf exch def
  Tf findfont Tp scalefont setfont
  /cf Tf def  /cs Tp def
} bd
/ULS {currentpoint /uy exch def /ux exch def} bd
/ULE {
  /Tcx currentpoint pop def
  gsave
  newpath
  cf findfont cs scalefont dup
  /FontMatrix get 0 get /Ts exch def /FontInfo get dup
  /UnderlinePosition get Ts mul /To exch def
  /UnderlineThickness get Ts mul /Tt exch def
  ux uy To add moveto  Tcx uy To add lineto
  Tt setlinewidth stroke
  grestore
} bd
/OLE {
  /Tcx currentpoint pop def
  gsave
  newpath
  cf findfont cs scalefont dup
  /FontMatrix get 0 get /Ts exch def /FontInfo get dup
  /UnderlinePosition get Ts mul /To exch def
  /UnderlineThickness get Ts mul /Tt exch def
  ux uy To add cs add moveto Tcx uy To add cs add lineto
  Tt setlinewidth stroke
  grestore
} bd
/SOE {
  /Tcx currentpoint pop def
  gsave
  newpath
  cf findfont cs scalefont dup
  /FontMatrix get 0 get /Ts exch def /FontInfo get dup
  /UnderlinePosition get Ts mul /To exch def
  /UnderlineThickness get Ts mul /Tt exch def
  ux uy To add cs 10 mul 26 idiv add moveto Tcx uy To add cs 10 mul 26 idiv add lineto
  Tt setlinewidth stroke
  grestore
} bd
/QT {
/Y22 exch store
/X22 exch store
/Y21 exch store
/X21 exch store
currentpoint
/Y21 load 2 mul add 3 div exch
/X21 load 2 mul add 3 div exch
/X21 load 2 mul /X22 load add 3 div
/Y21 load 2 mul /Y22 load add 3 div
/X22 load /Y22 load curveto
} bd
/SSPD {
dup length /d exch dict def
{
/v exch def
/k exch def
currentpagedevice k known {
/cpdv currentpagedevice k get def
v cpdv ne {
/upd false def
/nullv v type /nulltype eq def
/nullcpdv cpdv type /nulltype eq def
nullv nullcpdv or
{
/upd true def
} {
/sametype v type cpdv type eq def
sametype {
v type /arraytype eq {
/vlen v length def
/cpdvlen cpdv length def
vlen cpdvlen eq {
0 1 vlen 1 sub {
/i exch def
/obj v i get def
/cpdobj cpdv i get def
obj cpdobj ne {
/upd true def
exit
} if
} for
} {
/upd true def
} ifelse
} {
v type /dicttype eq {
v {
/dv exch def
/dk exch def
/cpddv cpdv dk get def
dv cpddv ne {
/upd true def
exit
} if
} forall
} {
/upd true def
} ifelse
} ifelse
} if
} ifelse
upd true eq {
d k v put
} if
} if
} if
} forall
d length 0 gt {
d setpagedevice
} if
} bd
/RE { % /NewFontName [NewEncodingArray] /FontName RE -
  findfont dup length dict begin
  {
    1 index /FID ne
    {def} {pop pop} ifelse
  } forall
  /Encoding exch def
  /FontName 1 index def
  currentdict definefont pop
  end
} bind def
%%EndResource
%%BeginResource: procset (Apache XML Graphics EPS ProcSet) 1.0 0
%%Version: 1.0 0
%%Copyright: (Copyright 2002-2003 The Apache Software Foundation. License terms: http://www.apache.org/licenses/LICENSE-2.0)
/BeginEPSF { %def
/b4_Inc_state save def         % Save state for cleanup
/dict_count countdictstack def % Count objects on dict stack
/op_count count 1 sub def      % Count objects on operand stack
userdict begin                 % Push userdict on dict stack
/showpage { } def              % Redefine showpage, { } = null proc
0 setgray 0 setlinecap         % Prepare graphics state
1 setlinewidth 0 setlinejoin
10 setmiterlimit [ ] 0 setdash newpath
/languagelevel where           % If level not equal to 1 then
{pop languagelevel             % set strokeadjust and
1 ne                           % overprint to their defaults.
{false setstrokeadjust false setoverprint
} if
} if
} bd
/EndEPSF { %def
count op_count sub {pop} repeat            % Clean up stacks
countdictstack dict_count sub {end} repeat
b4_Inc_state restore
} bd
%%EndResource
%FOPBeginFontDict
%%IncludeResource: font Courier-Oblique
%%IncludeResource: font Courier-BoldOblique
%%IncludeResource: font Courier-Bold
%%IncludeResource: font ZapfDingbats
%%IncludeResource: font Symbol
%%IncludeResource: font Helvetica
%%IncludeResource: font Helvetica-Oblique
%%IncludeResource: font Helvetica-Bold
%%IncludeResource: font Helvetica-BoldOblique
%%IncludeResource: font Times-Roman
%%IncludeResource: font Times-Italic
%%IncludeResource: font Times-Bold
%%IncludeResource: font Times-BoldItalic
%%IncludeResource: font Courier
%FOPEndFontDict
%%BeginResource: encoding WinAnsiEncoding
/WinAnsiEncoding [
/.notdef /.notdef /.notdef /.notdef /.notdef
/.notdef /.notdef /.notdef /.notdef /.notdef
/.notdef /.notdef /.notdef /.notdef /.notdef
/.notdef /.notdef /.notdef /.notdef /.notdef
/.notdef /.notdef /.notdef /.notdef /.notdef
/.notdef /.notdef /.notdef /.notdef /.notdef
/.notdef /.notdef /space /exclam /quotedbl
/numbersign /dollar /percent /ampersand /quotesingle
/parenleft /parenright /asterisk /plus /comma
/hyphen /period /slash /zero /one
/two /three /four /five /six
/seven /eight /nine /colon /semicolon
/less /equal /greater /question /at
/A /B /C /D /E
/F /G /H /I /J
/K /L /M /N /O
/P /Q /R /S /T
/U /V /W /X /Y
/Z /bracketleft /backslash /bracketright /asciicircum
/underscore /quoteleft /a /b /c
/d /e /f /g /h
/i /j /k /l /m
/n /o /p /q /r
/s /t /u /v /w
/x /y /z /braceleft /bar
/braceright /asciitilde /bullet /Euro /bullet
/quotesinglbase /florin /quotedblbase /ellipsis /dagger
/daggerdbl /circumflex /perthousand /Scaron /guilsinglleft
/OE /bullet /Zcaron /bullet /bullet
/quoteleft /quoteright /quotedblleft /quotedblright /bullet
/endash /emdash /asciitilde /trademark /scaron
/guilsinglright /oe /bullet /zcaron /Ydieresis
/space /exclamdown /cent /sterling /currency
/yen /brokenbar /section /dieresis /copyright
/ordfeminine /guillemotleft /logicalnot /sfthyphen /registered
/macron /degree /plusminus /twosuperior /threesuperior
/acute /mu /paragraph /middot /cedilla
/onesuperior /ordmasculine /guillemotright /onequarter /onehalf
/threequarters /questiondown /Agrave /Aacute /Acircumflex
/Atilde /Adieresis /Aring /AE /Ccedilla
/Egrave /Eacute /Ecircumflex /Edieresis /Igrave
/Iacute /Icircumflex /Idieresis /Eth /Ntilde
/Ograve /Oacute /Ocircumflex /Otilde /Odieresis
/multiply /Oslash /Ugrave /Uacute /Ucircumflex
/Udieresis /Yacute /Thorn /germandbls /agrave
/aacute /acircumflex /atilde /adieresis /aring
/ae /ccedilla /egrave /eacute /ecircumflex
/edieresis /igrave /iacute /icircumflex /idieresis
/eth /ntilde /ograve /oacute /ocircumflex
/otilde /odieresis /divide /oslash /ugrave
/uacute /ucircumflex /udieresis /yacute /thorn
/ydieresis
] def
%%EndResource
%FOPBeginFontReencode
/Courier-Oblique findfont
dup length dict begin
  {1 index /FID ne {def} {pop pop} ifelse} forall
  /Encoding WinAnsiEncoding def
  currentdict
end
/Courier-Oblique exch definefont pop
/Courier-BoldOblique findfont
dup length dict begin
  {1 index /FID ne {def} {pop pop} ifelse} forall
  /Encoding WinAnsiEncoding def
  currentdict
end
/Courier-BoldOblique exch definefont pop
/Courier-Bold findfont
dup length dict begin
  {1 index /FID ne {def} {pop pop} ifelse} forall
  /Encoding WinAnsiEncoding def
  currentdict
end
/Courier-Bold exch definefont pop
/Helvetica findfont
dup length dict begin
  {1 index /FID ne {def} {pop pop} ifelse} forall
  /Encoding WinAnsiEncoding def
  currentdict
end
/Helvetica exch definefont pop
/Helvetica-Oblique findfont
dup length dict begin
  {1 index /FID ne {def} {pop pop} ifelse} forall
  /Encoding WinAnsiEncoding def
  currentdict
end
/Helvetica-Oblique exch definefont pop
/Helvetica-Bold findfont
dup length dict begin
  {1 index /FID ne {def} {pop pop} ifelse} forall
  /Encoding WinAnsiEncoding def
  currentdict
end
/Helvetica-Bold exch definefont pop
/Helvetica-BoldOblique findfont
dup length dict begin
  {1 index /FID ne {def} {pop pop} ifelse} forall
  /Encoding WinAnsiEncoding def
  currentdict
end
/Helvetica-BoldOblique exch definefont pop
/Times-Roman findfont
dup length dict begin
  {1 index /FID ne {def} {pop pop} ifelse} forall
  /Encoding WinAnsiEncoding def
  currentdict
end
/Times-Roman exch definefont pop
/Times-Italic findfont
dup length dict begin
  {1 index /FID ne {def} {pop pop} ifelse} forall
  /Encoding WinAnsiEncoding def
  currentdict
end
/Times-Italic exch definefont pop
/Times-Bold findfont
dup length dict begin
  {1 index /FID ne {def} {pop pop} ifelse} forall
  /Encoding WinAnsiEncoding def
  currentdict
end
/Times-Bold exch definefont pop
/Times-BoldItalic findfont
dup length dict begin
  {1 index /FID ne {def} {pop pop} ifelse} forall
  /Encoding WinAnsiEncoding def
  currentdict
end
/Times-BoldItalic exch definefont pop
/Courier findfont
dup length dict begin
  {1 index /FID ne {def} {pop pop} ifelse} forall
  /Encoding WinAnsiEncoding def
  currentdict
end
/Courier exch definefont pop
%FOPEndFontReencode
%%EndProlog
%%Page: 1 1
%%PageBoundingBox: 0 0 512 187
%%BeginPageSetup
[1 0 0 -1 0 187] CT
%%EndPageSetup
GS
[1 0 0 1.00107 0 -0.2] CT
1 GC
N
0 0 512 187 re
f
GR
GS
[1 0 0 1.00107 0 -0.2] CT
1 GC
N
0 0 512 187 re
f
GR
GS
[1 0 0 1.00107 0 -0.2] CT
0.2 GC
N
102.5 149.5 M
256 149.5 L
256 18.5 L
102.5 18.5 L
cp
f
GR
GS
[1 0 0 1.00107 0 -0.2] CT
0.149 GC
2 setlinecap
1 LJ
0.5 LW
N
102.5 149.5 M
256 149.5 L
S
GR
GS
[1 0 0 1.00107 0 -0.2] CT
0.149 GC
2 setlinecap
1 LJ
0.5 LW
N
129.103 149.5 M
129.103 147.965 L
S
GR
GS
[1 0 0 1.00107 0 -0.2] CT
0.149 GC
2 setlinecap
1 LJ
0.5 LW
N
169.201 149.5 M
169.201 147.965 L
S
GR
GS
[1 0 0 1.00107 0 -0.2] CT
0.149 GC
2 setlinecap
1 LJ
0.5 LW
N
209.299 149.5 M
209.299 147.965 L
S
GR
GS
[1 0 0 1.00107 0 -0.2] CT
0.149 GC
2 setlinecap
1 LJ
0.5 LW
N
249.397 149.5 M
249.397 147.965 L
S
GR
GS
[1 0 0 1.00107 129.10255 154.26503] CT
0.149 GC
/Helvetica 14 F
GS
[1 0 0 1 0 0] CT
-4 14 moveto 
1 -1 scale
(0) t 
GR
GR
GS
[1 0 0 1.00107 169.20079 154.26503] CT
0.149 GC
/Helvetica 14 F
GS
[1 0 0 1 0 0] CT
-16 14 moveto 
1 -1 scale
(5000) t 
GR
GR
GS
[1 0 0 1.00107 209.29903 154.26503] CT
0.149 GC
/Helvetica 14 F
GS
[1 0 0 1 0 0] CT
-19.5 14 moveto 
1 -1 scale
(10000) t 
GR
GR
GS
[1 0 0 1.00107 249.39726 154.26503] CT
0.149 GC
/Helvetica 14 F
GS
[1 0 0 1 0 0] CT
-19.5 14 moveto 
1 -1 scale
(15000) t 
GR
GR
GS
[1 0 0 1.00107 179.25008 171.78375] CT
0.149 GC
/Helvetica 14 F
GS
[1 0 0 1 0 0] CT
-74.5 14 moveto 
1 -1 scale
(fMRI Brainscore \(arb.u.\)) t 
GR
GR
GS
[1 0 0 1.00107 0 -0.2] CT
0.149 GC
2 setlinecap
1 LJ
0.5 LW
N
102.5 149.5 M
102.5 18.5 L
S
GR
GS
[1 0 0 1.00107 0 -0.2] CT
0.149 GC
2 setlinecap
1 LJ
0.5 LW
N
102.5 144.454 M
104.035 144.454 L
S
GR
GS
[1 0 0 1.00107 0 -0.2] CT
0.149 GC
2 setlinecap
1 LJ
0.5 LW
N
102.5 99.341 M
104.035 99.341 L
S
GR
GS
[1 0 0 1.00107 0 -0.2] CT
0.149 GC
2 setlinecap
1 LJ
0.5 LW
N
102.5 54.229 M
104.035 54.229 L
S
GR
GS
[1 0 0 1.00107 97.7 144.40846] CT
0.149 GC
/Helvetica 14 F
GS
[1 0 0 1 0 0] CT
-25 5.5 moveto 
1 -1 scale
(-0.1) t 
GR
GR
GS
[1 0 0 1.00107 97.7 99.24762] CT
0.149 GC
/Helvetica 14 F
GS
[1 0 0 1 0 0] CT
-8 5.5 moveto 
1 -1 scale
(0) t 
GR
GR
GS
[1 0 0 1.00107 97.7 54.08678] CT
0.149 GC
/Helvetica 14 F
GS
[1 0 0 1 0 0] CT
-20 5.5 moveto 
1 -1 scale
(0.1) t 
GR
GR
GS
[0 -1.00107 1 0 69.7 83.88978] CT
0.149 GC
/Helvetica 14 F
GS
[1 0 0 1 0 0] CT
-16.5 -20 moveto 
1 -1 scale
(fooof) t 
GR
GR
GS
[0 -1.00107 1 0 69.7 83.88978] CT
0.149 GC
/Helvetica 14 F
GS
[1 0 0 1 0 0] CT
-39 -3 moveto 
1 -1 scale
(\(linear mod.\)) t 
GR
GR
GS
[1 0 0 1.00107 179.25017 16.56791] CT
/Helvetica-Bold 14 F
GS
[1 0 0 1 0 0] CT
-76 -4 moveto 
1 -1 scale
(r = 0.23 CI = [0.03,0.41]) t 
GR
GR
GS
[1 0 0 1.00107 151.85092 108.60408] CT
0.8 GC
N
0.5 0 M
0.5 -0.276 0.276 -0.5 0 -0.5 C
-0.276 -0.5 -0.5 -0.276 -0.5 0 C
-0.5 0.276 -0.276 0.5 0 0.5 C
0.276 0.5 0.5 0.276 0.5 0 C
cp
f
GR
GS
[1 0 0 1.00107 144.24544 121.66276] CT
0.8 GC
N
/f-2105962265{0.5 0 M
0.5 -0.276 0.276 -0.5 0 -0.5 C
-0.276 -0.5 -0.5 -0.276 -0.5 0 C
-0.5 0.276 -0.276 0.5 0 0.5 C
0.276 0.5 0.5 0.276 0.5 0 C
cp}def
f-2105962265
f
GR
GS
[1 0 0 1.00107 181.3502 61.64928] CT
0.8 GC
N
f-2105962265
f
GR
GS
[1 0 0 1.00107 175.20338 50.67633] CT
0.8 GC
N
f-2105962265
f
GR
GS
[1 0 0 1.00107 152.32356 66.63481] CT
0.8 GC
N
f-2105962265
f
GR
GS
[1 0 0 1.00107 172.06783 84.19136] CT
0.8 GC
N
f-2105962265
f
GR
GS
[1 0 0 1.00107 205.48311 89.03958] CT
0.8 GC
N
f-2105962265
f
GR
GS
[1 0 0 1.00107 205.59962 79.89775] CT
0.8 GC
N
f-2105962265
f
GR
GS
[1 0 0 1.00107 128.21817 80.03273] CT
0.8 GC
N
f-2105962265
f
GR
GS
[1 0 0 1.00107 193.08842 56.3749] CT
0.8 GC
N
f-2105962265
f
GR
GS
[1 0 0 1.00107 168.64771 82.65597] CT
0.8 GC
N
f-2105962265
f
GR
GS
[1 0 0 1.00107 190.1317 93.4213] CT
0.8 GC
N
f-2105962265
f
GR
GS
[1 0 0 1.00107 152.15416 113.99261] CT
0.8 GC
N
f-2105962265
f
GR
GS
[1 0 0 1.00107 164.23561 110.49826] CT
0.8 GC
N
f-2105962265
f
GR
GS
[1 0 0 1.00107 155.69623 33.71734] CT
0.8 GC
N
f-2105962265
f
GR
GS
[1 0 0 1.00107 137.33371 106.14577] CT
0.8 GC
N
f-2105962265
f
GR
GS
[1 0 0 1.00107 160.05399 95.13299] CT
0.8 GC
N
f-2105962265
f
GR
GS
[1 0 0 1.00107 162.64647 73.39609] CT
0.8 GC
N
f-2105962265
f
GR
GS
[1 0 0 1.00107 160.55821 70.28041] CT
0.8 GC
N
f-2105962265
f
GR
GS
[1 0 0 1.00107 173.07581 67.76784] CT
0.8 GC
N
f-2105962265
f
GR
GS
[1 0 0 1.00107 174.72037 29.24813] CT
0.8 GC
N
f-2105962265
f
GR
GS
[1 0 0 1.00107 136.82932 59.36735] CT
0.8 GC
N
f-2105962265
f
GR
GS
[1 0 0 1.00107 150.99184 92.19962] CT
0.8 GC
N
f-2105962265
f
GR
GS
[1 0 0 1.00107 185.70612 95.23047] CT
0.8 GC
N
f-2105962265
f
GR
GS
[1 0 0 1.00107 182.49751 62.15393] CT
0.8 GC
N
f-2105962265
f
GR
GS
[1 0 0 1.00107 144.91469 63.60065] CT
0.8 GC
N
f-2105962265
f
GR
GS
[1 0 0 1.00107 160.0265 67.83763] CT
0.8 GC
N
f-2105962265
f
GR
GS
[1 0 0 1.00107 185.59795 98.99567] CT
0.8 GC
N
f-2105962265
f
GR
GS
[1 0 0 1.00107 166.74693 72.96362] CT
0.8 GC
N
f-2105962265
f
GR
GS
[1 0 0 1.00107 156.34604 74.58428] CT
0.8 GC
N
f-2105962265
f
GR
GS
[1 0 0 1.00107 197.87573 95.97922] CT
0.8 GC
N
f-2105962265
f
GR
GS
[1 0 0 1.00107 204.53181 29.24813] CT
0.8 GC
N
f-2105962265
f
GR
GS
[1 0 0 1.00107 243.20833 98.68638] CT
0.8 GC
N
f-2105962265
f
GR
GS
[1 0 0 1.00107 215.05717 107.36926] CT
0.8 GC
N
f-2105962265
f
GR
GS
[1 0 0 1.00107 142.14415 86.43522] CT
0.8 GC
N
f-2105962265
f
GR
GS
[1 0 0 1.00107 217.9738 69.79362] CT
0.8 GC
N
f-2105962265
f
GR
GS
[1 0 0 1.00107 209.29594 98.93981] CT
0.8 GC
N
f-2105962265
f
GR
GS
[1 0 0 1.00107 188.36264 99.38223] CT
0.8 GC
N
f-2105962265
f
GR
GS
[1 0 0 1.00107 183.68954 119.08598] CT
0.8 GC
N
f-2105962265
f
GR
GS
[1 0 0 1.00107 165.34248 76.0276] CT
0.8 GC
N
f-2105962265
f
GR
GS
[1 0 0 1.00107 162.5114 112.90478] CT
0.8 GC
N
f-2105962265
f
GR
GS
[1 0 0 1.00107 191.74933 103.82672] CT
0.8 GC
N
f-2105962265
f
GR
GS
[1 0 0 1.00107 140.67679 111.15057] CT
0.8 GC
N
f-2105962265
f
GR
GS
[1 0 0 1.00107 138.97743 117.02888] CT
0.8 GC
N
f-2105962265
f
GR
GS
[1 0 0 1.00107 156.59213 101.88294] CT
0.8 GC
N
f-2105962265
f
GR
GS
[1 0 0 1.00107 130.69681 83.94818] CT
0.8 GC
N
f-2105962265
f
GR
GS
[1 0 0 1.00107 144.2182 80.76134] CT
0.8 GC
N
f-2105962265
f
GR
GS
[1 0 0 1.00107 132.03259 88.09661] CT
0.8 GC
N
f-2105962265
f
GR
GS
[1 0 0 1.00107 132.75345 97.00288] CT
0.8 GC
N
f-2105962265
f
GR
GS
[1 0 0 1.00107 129.9669 88.12062] CT
0.8 GC
N
f-2105962265
f
GR
GS
[1 0 0 1.00107 134.42291 116.02477] CT
0.8 GC
N
f-2105962265
f
GR
GS
[1 0 0 1.00107 159.0567 84.25423] CT
0.8 GC
N
f-2105962265
f
GR
GS
[1 0 0 1.00107 140.37825 116.56143] CT
0.8 GC
N
f-2105962265
f
GR
GS
[1 0 0 1.00107 121.01725 133.33537] CT
0.8 GC
N
f-2105962265
f
GR
GS
[1 0 0 1.00107 141.13179 138.53155] CT
0.8 GC
N
f-2105962265
f
GR
GS
[1 0 0 1.00107 142.92714 80.8194] CT
0.8 GC
N
f-2105962265
f
GR
GS
[1 0 0 1.00107 170.64149 107.10828] CT
0.8 GC
N
f-2105962265
f
GR
GS
[1 0 0 1.00107 152.18207 115.47946] CT
0.8 GC
N
f-2105962265
f
GR
GS
[1 0 0 1.00107 150.07739 87.69297] CT
0.8 GC
N
f-2105962265
f
GR
GS
[1 0 0 1.00107 142.7296 93.25771] CT
0.8 GC
N
f-2105962265
f
GR
GS
[1 0 0 1.00107 127.81736 116.47633] CT
0.8 GC
N
f-2105962265
f
GR
GS
[1 0 0 1.00107 122.50857 91.02759] CT
0.8 GC
N
f-2105962265
f
GR
GS
[1 0 0 1.00107 154.60814 114.70052] CT
0.8 GC
N
f-2105962265
f
GR
GS
[1 0 0 1.00107 136.39948 82.79462] CT
0.8 GC
N
f-2105962265
f
GR
GS
[1 0 0 1.00107 132.16058 95.07742] CT
0.8 GC
N
f-2105962265
f
GR
GS
[1 0 0 1.00107 141.92664 90.42009] CT
0.8 GC
N
f-2105962265
f
GR
GS
[1 0 0 1.00107 151.00449 92.71865] CT
0.8 GC
N
f-2105962265
f
GR
GS
[1 0 0 1.00107 130.71852 117.23715] CT
0.8 GC
N
f-2105962265
f
GR
GS
[1 0 0 1.00107 177.19667 72.60563] CT
0.8 GC
N
f-2105962265
f
GR
GS
[1 0 0 1.00107 128.33073 94.1162] CT
0.8 GC
N
f-2105962265
f
GR
GS
[1 0 0 1.00107 163.092 102.27143] CT
0.8 GC
N
f-2105962265
f
GR
GS
[1 0 0 1.00107 163.81694 109.38303] CT
0.8 GC
N
f-2105962265
f
GR
GS
[1 0 0 1.00107 146.55592 88.48836] CT
0.8 GC
N
f-2105962265
f
GR
GS
[1 0 0 1.00107 136.82182 127.66024] CT
0.8 GC
N
f-2105962265
f
GR
GS
[1 0 0 1.00107 126.8021 52.87756] CT
0.8 GC
N
f-2105962265
f
GR
GS
[1 0 0 1.00107 138.04414 86.94878] CT
0.8 GC
N
f-2105962265
f
GR
GS
[1 0 0 1.00107 161.0493 84.91148] CT
0.8 GC
N
f-2105962265
f
GR
GS
[1 0 0 1.00107 159.99164 105.50833] CT
0.8 GC
N
f-2105962265
f
GR
GS
[1 0 0 1.00107 115.29166 95.37678] CT
0.8 GC
N
f-2105962265
f
GR
GS
[1 0 0 1.00107 157.85533 114.24845] CT
0.8 GC
N
f-2105962265
f
GR
GS
[1 0 0 1.00107 155.90544 94.3176] CT
0.8 GC
N
f-2105962265
f
GR
GS
[1 0 0 1.00107 147.81425 116.18735] CT
0.8 GC
N
f-2105962265
f
GR
GS
[1 0 0 1.00107 122.13152 98.5362] CT
0.8 GC
N
f-2105962265
f
GR
GS
[1 0 0 1.00107 121.78762 117.3091] CT
0.8 GC
N
f-2105962265
f
GR
GS
[1 0 0 1.00107 128.06819 110.49124] CT
0.8 GC
N
f-2105962265
f
GR
GS
[1 0 0 1.00107 169.48984 104.96951] CT
0.8 GC
N
f-2105962265
f
GR
GS
[1 0 0 1.00107 153.06995 71.53323] CT
0.8 GC
N
f-2105962265
f
GR
GS
[1 0 0 1.00107 140.45755 129.82437] CT
0.8 GC
N
f-2105962265
f
GR
GS
[1 0 0 1.00107 173.21864 111.39717] CT
0.8 GC
N
f-2105962265
f
GR
GS
[1 0 0 1.00107 143.6488 70.18463] CT
0.8 GC
N
f-2105962265
f
GR
GS
[1 0 0 1.00107 151.01816 104.05451] CT
0.8 GC
N
f-2105962265
f
GR
GS
[1 0 0 1.00107 150.65219 69.81785] CT
0.8 GC
N
f-2105962265
f
GR
GS
[1 0 0 1.00107 148.59163 110.4233] CT
0.8 GC
N
f-2105962265
f
GR
GS
[1 0 0 1.00107 147.58763 52.87756] CT
0.8 GC
N
f-2105962265
f
GR
GS
[1 0 0 1.00107 145.84164 102.76364] CT
0.8 GC
N
f-2105962265
f
GR
GS
[1 0 0 1.00107 0 -0.2] CT
1 0.6 0.6 RC
1 LJ
3 LW
N
102.482 102.988 M
249.397 72.623 L
S
GR
GS
[1 0 0 1.00107 151.85092 108.60408] CT
0.8 1 1 RC
N
/f227889816{-3 -3 M
-3 3 L
3 3 L
3 -3 L
cp}def
f227889816
f
GR
GS
[1 0 0 1.00107 144.24544 121.66276] CT
0.8 1 1 RC
N
f227889816
f
GR
GS
[1 0 0 1.00107 181.3502 61.64928] CT
0.8 1 1 RC
N
f227889816
f
GR
GS
[1 0 0 1.00107 175.20338 50.67633] CT
0.8 1 1 RC
N
f227889816
f
GR
GS
[1 0 0 1.00107 152.32356 66.63481] CT
0.8 1 1 RC
N
f227889816
f
GR
GS
[1 0 0 1.00107 172.06783 84.19136] CT
0.8 1 1 RC
N
f227889816
f
GR
GS
[1 0 0 1.00107 205.48311 89.03958] CT
0.8 1 1 RC
N
f227889816
f
GR
GS
[1 0 0 1.00107 205.59962 79.89775] CT
0.8 1 1 RC
N
f227889816
f
GR
GS
[1 0 0 1.00107 128.21817 80.03273] CT
0.8 1 1 RC
N
f227889816
f
GR
GS
[1 0 0 1.00107 193.08842 56.3749] CT
0.8 1 1 RC
N
f227889816
f
GR
GS
[1 0 0 1.00107 168.64771 82.65597] CT
0.8 1 1 RC
N
f227889816
f
GR
GS
[1 0 0 1.00107 190.1317 93.4213] CT
0.8 1 1 RC
N
f227889816
f
GR
GS
[1 0 0 1.00107 152.15416 113.99261] CT
0.8 1 1 RC
N
f227889816
f
GR
GS
[1 0 0 1.00107 164.23561 110.49826] CT
0.8 1 1 RC
N
f227889816
f
GR
GS
[1 0 0 1.00107 155.69623 33.71734] CT
0.8 1 1 RC
N
f227889816
f
GR
GS
[1 0 0 1.00107 137.33371 106.14577] CT
0.8 1 1 RC
N
f227889816
f
GR
GS
[1 0 0 1.00107 160.05399 95.13299] CT
0.8 1 1 RC
N
f227889816
f
GR
GS
[1 0 0 1.00107 162.64647 73.39609] CT
0.8 1 1 RC
N
f227889816
f
GR
GS
[1 0 0 1.00107 160.55821 70.28041] CT
0.8 1 1 RC
N
f227889816
f
GR
GS
[1 0 0 1.00107 173.07581 67.76784] CT
0.8 1 1 RC
N
f227889816
f
GR
GS
[1 0 0 1.00107 174.72037 29.24813] CT
0.8 1 1 RC
N
f227889816
f
GR
GS
[1 0 0 1.00107 136.82932 59.36735] CT
0.8 1 1 RC
N
f227889816
f
GR
GS
[1 0 0 1.00107 150.99184 92.19962] CT
0.8 1 1 RC
N
f227889816
f
GR
GS
[1 0 0 1.00107 185.70612 95.23047] CT
0.8 1 1 RC
N
f227889816
f
GR
GS
[1 0 0 1.00107 182.49751 62.15393] CT
0.8 1 1 RC
N
f227889816
f
GR
GS
[1 0 0 1.00107 144.91469 63.60065] CT
0.8 1 1 RC
N
f227889816
f
GR
GS
[1 0 0 1.00107 160.0265 67.83763] CT
0.8 1 1 RC
N
f227889816
f
GR
GS
[1 0 0 1.00107 185.59795 98.99567] CT
0.8 1 1 RC
N
f227889816
f
GR
GS
[1 0 0 1.00107 166.74693 72.96362] CT
0.8 1 1 RC
N
f227889816
f
GR
GS
[1 0 0 1.00107 156.34604 74.58428] CT
0.8 1 1 RC
N
f227889816
f
GR
GS
[1 0 0 1.00107 197.87573 95.97922] CT
0.8 1 1 RC
N
f227889816
f
GR
GS
[1 0 0 1.00107 204.53181 29.24813] CT
0.8 1 1 RC
N
f227889816
f
GR
GS
[1 0 0 1.00107 243.20833 98.68638] CT
0.8 1 1 RC
N
f227889816
f
GR
GS
[1 0 0 1.00107 215.05717 107.36926] CT
0.8 1 1 RC
N
f227889816
f
GR
GS
[1 0 0 1.00107 142.14415 86.43522] CT
0.8 1 1 RC
N
f227889816
f
GR
GS
[1 0 0 1.00107 217.9738 69.79362] CT
0.8 1 1 RC
N
f227889816
f
GR
GS
[1 0 0 1.00107 209.29594 98.93981] CT
0.8 1 1 RC
N
f227889816
f
GR
GS
[1 0 0 1.00107 188.36264 99.38223] CT
0.8 1 1 RC
N
f227889816
f
GR
GS
[1 0 0 1.00107 183.68954 119.08598] CT
0.8 1 1 RC
N
f227889816
f
GR
GS
[1 0 0 1.00107 165.34248 76.0276] CT
0.8 1 1 RC
N
f227889816
f
GR
GS
[1 0 0 1.00107 162.5114 112.90478] CT
0.8 1 1 RC
N
f227889816
f
GR
GS
[1 0 0 1.00107 191.74933 103.82672] CT
0.8 1 1 RC
N
f227889816
f
GR
GS
[1 0 0 1.00107 140.67679 111.15057] CT
0.6 0.8 0.8 RC
N
/f-1969333140{-3.536 0 M
0 4.702 L
3.536 0 L
0 -4.702 L
cp}def
f-1969333140
f
GR
GS
[1 0 0 1.00107 138.97743 117.02888] CT
0.6 0.8 0.8 RC
N
f-1969333140
f
GR
GS
[1 0 0 1.00107 156.59213 101.88294] CT
0.6 0.8 0.8 RC
N
f-1969333140
f
GR
GS
[1 0 0 1.00107 130.69681 83.94818] CT
0.6 0.8 0.8 RC
N
f-1969333140
f
GR
GS
[1 0 0 1.00107 144.2182 80.76134] CT
0.6 0.8 0.8 RC
N
f-1969333140
f
GR
GS
[1 0 0 1.00107 132.03259 88.09661] CT
0.6 0.8 0.8 RC
N
f-1969333140
f
GR
GS
[1 0 0 1.00107 132.75345 97.00288] CT
0.6 0.8 0.8 RC
N
f-1969333140
f
GR
GS
[1 0 0 1.00107 129.9669 88.12062] CT
0.6 0.8 0.8 RC
N
f-1969333140
f
GR
GS
[1 0 0 1.00107 134.42291 116.02477] CT
0.6 0.8 0.8 RC
N
f-1969333140
f
GR
GS
[1 0 0 1.00107 159.0567 84.25423] CT
0.6 0.8 0.8 RC
N
f-1969333140
f
GR
GS
[1 0 0 1.00107 140.37825 116.56143] CT
0.6 0.8 0.8 RC
N
f-1969333140
f
GR
GS
[1 0 0 1.00107 121.01725 133.33537] CT
0.6 0.8 0.8 RC
N
f-1969333140
f
GR
GS
[1 0 0 1.00107 141.13179 138.53155] CT
0.6 0.8 0.8 RC
N
f-1969333140
f
GR
GS
[1 0 0 1.00107 142.92714 80.8194] CT
0.6 0.8 0.8 RC
N
f-1969333140
f
GR
GS
[1 0 0 1.00107 170.64149 107.10828] CT
0.6 0.8 0.8 RC
N
f-1969333140
f
GR
GS
[1 0 0 1.00107 152.18207 115.47946] CT
0.6 0.8 0.8 RC
N
f-1969333140
f
GR
GS
[1 0 0 1.00107 150.07739 87.69297] CT
0.6 0.8 0.8 RC
N
f-1969333140
f
GR
GS
[1 0 0 1.00107 142.7296 93.25771] CT
0.6 0.8 0.8 RC
N
f-1969333140
f
GR
GS
[1 0 0 1.00107 127.81736 116.47633] CT
0.6 0.8 0.8 RC
N
f-1969333140
f
GR
GS
[1 0 0 1.00107 122.50857 91.02759] CT
0.6 0.8 0.8 RC
N
f-1969333140
f
GR
GS
[1 0 0 1.00107 154.60814 114.70052] CT
0.6 0.8 0.8 RC
N
f-1969333140
f
GR
GS
[1 0 0 1.00107 136.39948 82.79462] CT
0.6 0.8 0.8 RC
N
f-1969333140
f
GR
GS
[1 0 0 1.00107 132.16058 95.07742] CT
0.6 0.8 0.8 RC
N
f-1969333140
f
GR
GS
[1 0 0 1.00107 141.92664 90.42009] CT
0.6 0.8 0.8 RC
N
f-1969333140
f
GR
GS
[1 0 0 1.00107 151.00449 92.71865] CT
0.6 0.8 0.8 RC
N
f-1969333140
f
GR
GS
[1 0 0 1.00107 130.71852 117.23715] CT
0.6 0.8 0.8 RC
N
f-1969333140
f
GR
GS
[1 0 0 1.00107 177.19667 72.60563] CT
0.6 0.8 0.8 RC
N
f-1969333140
f
GR
GS
[1 0 0 1.00107 128.33073 94.1162] CT
0.6 0.8 0.8 RC
N
f-1969333140
f
GR
GS
[1 0 0 1.00107 163.092 102.27143] CT
0.6 0.8 0.8 RC
N
f-1969333140
f
GR
GS
[1 0 0 1.00107 163.81694 109.38303] CT
0.6 0.8 0.8 RC
N
f-1969333140
f
GR
GS
[1 0 0 1.00107 146.55592 88.48836] CT
0.6 0.8 0.8 RC
N
f-1969333140
f
GR
GS
[1 0 0 1.00107 136.82182 127.66024] CT
0.6 0.8 0.8 RC
N
f-1969333140
f
GR
GS
[1 0 0 1.00107 126.8021 52.87756] CT
0.6 0.8 0.8 RC
N
f-1969333140
f
GR
GS
[1 0 0 1.00107 138.04414 86.94878] CT
0.6 0.8 0.8 RC
N
f-1969333140
f
GR
GS
[1 0 0 1.00107 161.0493 84.91148] CT
0.6 0.8 0.8 RC
N
f-1969333140
f
GR
GS
[1 0 0 1.00107 159.99164 105.50833] CT
0.6 0.8 0.8 RC
N
f-1969333140
f
GR
GS
[1 0 0 1.00107 115.29166 95.37678] CT
0.6 0.8 0.8 RC
N
f-1969333140
f
GR
GS
[1 0 0 1.00107 157.85533 114.24845] CT
0.6 0.8 0.8 RC
N
f-1969333140
f
GR
GS
[1 0 0 1.00107 155.90544 94.3176] CT
0.6 0.8 0.8 RC
N
f-1969333140
f
GR
GS
[1 0 0 1.00107 147.81425 116.18735] CT
0.6 0.8 0.8 RC
N
f-1969333140
f
GR
GS
[1 0 0 1.00107 122.13152 98.5362] CT
0.6 0.8 0.8 RC
N
f-1969333140
f
GR
GS
[1 0 0 1.00107 121.78762 117.3091] CT
0.6 0.8 0.8 RC
N
f-1969333140
f
GR
GS
[1 0 0 1.00107 128.06819 110.49124] CT
0.6 0.8 0.8 RC
N
f-1969333140
f
GR
GS
[1 0 0 1.00107 169.48984 104.96951] CT
0.6 0.8 0.8 RC
N
f-1969333140
f
GR
GS
[1 0 0 1.00107 153.06995 71.53323] CT
0.6 0.8 0.8 RC
N
f-1969333140
f
GR
GS
[1 0 0 1.00107 140.45755 129.82437] CT
0.6 0.8 0.8 RC
N
f-1969333140
f
GR
GS
[1 0 0 1.00107 173.21864 111.39717] CT
0.6 0.8 0.8 RC
N
f-1969333140
f
GR
GS
[1 0 0 1.00107 143.6488 70.18463] CT
0.6 0.8 0.8 RC
N
f-1969333140
f
GR
GS
[1 0 0 1.00107 151.01816 104.05451] CT
0.6 0.8 0.8 RC
N
f-1969333140
f
GR
GS
[1 0 0 1.00107 150.65219 69.81785] CT
0.6 0.8 0.8 RC
N
f-1969333140
f
GR
GS
[1 0 0 1.00107 148.59163 110.4233] CT
0.6 0.8 0.8 RC
N
f-1969333140
f
GR
GS
[1 0 0 1.00107 147.58763 52.87756] CT
0.6 0.8 0.8 RC
N
f-1969333140
f
GR
GS
[1 0 0 1.00107 145.84164 102.76364] CT
0.6 0.8 0.8 RC
N
f-1969333140
f
GR
GS
[1 0 0 1.00107 0 -0.2] CT
0.2 GC
N
/f-436321476{333 149.5 M
486.5 149.5 L
486.5 18.5 L
333 18.5 L
cp}def
f-436321476
f
GR
GS
[1 0 0 1.00107 0 -0.2] CT
0.149 GC
2 setlinecap
1 LJ
0.5 LW
N
333 149.5 M
486.5 149.5 L
S
GR
GS
[1 0 0 1.00107 0 -0.2] CT
0.149 GC
2 setlinecap
1 LJ
0.5 LW
N
351.905 149.5 M
351.905 147.965 L
S
GR
GS
[1 0 0 1.00107 0 -0.2] CT
0.149 GC
2 setlinecap
1 LJ
0.5 LW
N
396.51 149.5 M
396.51 147.965 L
S
GR
GS
[1 0 0 1.00107 0 -0.2] CT
0.149 GC
2 setlinecap
1 LJ
0.5 LW
N
441.116 149.5 M
441.116 147.965 L
S
GR
GS
[1 0 0 1.00107 0 -0.2] CT
0.149 GC
2 setlinecap
1 LJ
0.5 LW
N
485.722 149.5 M
485.722 147.965 L
S
GR
GS
[1 0 0 1.00107 351.90451 154.26503] CT
0.149 GC
/Helvetica 14 F
GS
[1 0 0 1 0 0] CT
-18.5 14 moveto 
1 -1 scale
(-5000) t 
GR
GR
GS
[1 0 0 1.00107 396.51035 154.26503] CT
0.149 GC
/Helvetica 14 F
GS
[1 0 0 1 0 0] CT
-4 14 moveto 
1 -1 scale
(0) t 
GR
GR
GS
[1 0 0 1.00107 441.11618 154.26503] CT
0.149 GC
/Helvetica 14 F
GS
[1 0 0 1 0 0] CT
-16 14 moveto 
1 -1 scale
(5000) t 
GR
GR
GS
[1 0 0 1.00107 485.72205 154.26503] CT
0.149 GC
/Helvetica 14 F
GS
[1 0 0 1 0 0] CT
-19.5 14 moveto 
1 -1 scale
(10000) t 
GR
GR
GS
[1 0 0 1.00107 409.75006 171.78375] CT
0.149 GC
/Helvetica 14 F
GS
[1 0 0 1 0 0] CT
-74.5 14 moveto 
1 -1 scale
(fMRI Brainscore \(arb.u.\)) t 
GR
GR
GS
[1 0 0 1.00107 0 -0.2] CT
0.149 GC
2 setlinecap
1 LJ
0.5 LW
N
333 149.5 M
333 18.5 L
S
GR
GS
[1 0 0 1.00107 0 -0.2] CT
0.149 GC
2 setlinecap
1 LJ
0.5 LW
N
333 145.065 M
334.535 145.065 L
S
GR
GS
[1 0 0 1.00107 0 -0.2] CT
0.149 GC
2 setlinecap
1 LJ
0.5 LW
N
333 118.495 M
334.535 118.495 L
S
GR
GS
[1 0 0 1.00107 0 -0.2] CT
0.149 GC
2 setlinecap
1 LJ
0.5 LW
N
333 91.926 M
334.535 91.926 L
S
GR
GS
[1 0 0 1.00107 0 -0.2] CT
0.149 GC
2 setlinecap
1 LJ
0.5 LW
N
333 65.356 M
334.535 65.356 L
S
GR
GS
[1 0 0 1.00107 0 -0.2] CT
0.149 GC
2 setlinecap
1 LJ
0.5 LW
N
333 38.787 M
334.535 38.787 L
S
GR
GS
[1 0 0 1.00107 328.20001 145.02002] CT
0.149 GC
/Helvetica 14 F
GS
[1 0 0 1 0 0] CT
-25 5.5 moveto 
1 -1 scale
(-0.1) t 
GR
GR
GS
[1 0 0 1.00107 328.20001 118.42206] CT
0.149 GC
/Helvetica 14 F
GS
[1 0 0 1 0 0] CT
-33 5.5 moveto 
1 -1 scale
(-0.05) t 
GR
GR
GS
[1 0 0 1.00107 328.20001 91.82411] CT
0.149 GC
/Helvetica 14 F
GS
[1 0 0 1 0 0] CT
-8 5.5 moveto 
1 -1 scale
(0) t 
GR
GR
GS
[1 0 0 1.00107 328.20001 65.22614] CT
0.149 GC
/Helvetica 14 F
GS
[1 0 0 1 0 0] CT
-28 5.5 moveto 
1 -1 scale
(0.05) t 
GR
GR
GS
[1 0 0 1.00107 328.20001 38.62818] CT
0.149 GC
/Helvetica 14 F
GS
[1 0 0 1 0 0] CT
-20 5.5 moveto 
1 -1 scale
(0.1) t 
GR
GR
GS
[0 -1.00107 1 0 292.20001 83.88978] CT
0.149 GC
/Helvetica 14 F
GS
[1 0 0 1 0 0] CT
-16.5 -20 moveto 
1 -1 scale
(fooof) t 
GR
GR
GS
[0 -1.00107 1 0 292.20001 83.88978] CT
0.149 GC
/Helvetica 14 F
GS
[1 0 0 1 0 0] CT
-39 -3 moveto 
1 -1 scale
(\(linear mod.\)) t 
GR
GR
GS
[1 0 0 1.00107 409.7504 16.56792] CT
/Helvetica-Bold 14 F
GS
[1 0 0 1 0 0] CT
-78.5 -4 moveto 
1 -1 scale
(r = 0.01 CI = [-0.19,0.21]) t 
GR
GR
GS
[1 0 0 1.00107 372.08109 122.72319] CT
0.8 GC
N
/f-1618671862{3.162 0 M
3.162 -1.746 1.746 -3.162 0 -3.162 C
-1.746 -3.162 -3.162 -1.746 -3.162 0 C
-3.162 1.746 -1.746 3.162 0 3.162 C
1.746 3.162 3.162 1.746 3.162 0 C
cp}def
f-1618671862
f
GR
GS
[1 0 0 1.00107 363.62064 138.10529] CT
0.8 GC
N
f-1618671862
f
GR
GS
[1 0 0 1.00107 404.89648 67.41412] CT
0.8 GC
N
f-1618671862
f
GR
GS
[1 0 0 1.00107 398.05869 54.48887] CT
0.8 GC
N
f-1618671862
f
GR
GS
[1 0 0 1.00107 372.60684 73.28669] CT
0.8 GC
N
f-1618671862
f
GR
GS
[1 0 0 1.00107 394.57065 93.96693] CT
0.8 GC
N
f-1618671862
f
GR
GS
[1 0 0 1.00107 431.74228 99.67774] CT
0.8 GC
N
f-1618671862
f
GR
GS
[1 0 0 1.00107 431.87189 88.90939] CT
0.8 GC
N
f-1618671862
f
GR
GS
[1 0 0 1.00107 345.79166 89.06839] CT
0.8 GC
N
f-1618671862
f
GR
GS
[1 0 0 1.00107 417.95425 61.20133] CT
0.8 GC
N
f-1618671862
f
GR
GS
[1 0 0 1.00107 390.76605 92.15836] CT
0.8 GC
N
f-1618671862
f
GR
GS
[1 0 0 1.00107 414.66513 104.83907] CT
0.8 GC
N
f-1618671862
f
GR
GS
[1 0 0 1.00107 372.4184 129.07047] CT
0.8 GC
N
f-1618671862
f
GR
GS
[1 0 0 1.00107 385.85797 124.95439] CT
0.8 GC
N
f-1618671862
f
GR
GS
[1 0 0 1.00107 376.35864 34.51251] CT
0.8 GC
N
f-1618671862
f
GR
GS
[1 0 0 1.00107 355.93192 119.82749] CT
0.8 GC
N
f-1618671862
f
GR
GS
[1 0 0 1.00107 381.20627 106.85532] CT
0.8 GC
N
f-1618671862
f
GR
GS
[1 0 0 1.00107 384.09018 81.25096] CT
0.8 GC
N
f-1618671862
f
GR
GS
[1 0 0 1.00107 381.76718 77.58093] CT
0.8 GC
N
f-1618671862
f
GR
GS
[1 0 0 1.00107 395.69193 74.62131] CT
0.8 GC
N
f-1618671862
f
GR
GS
[1 0 0 1.00107 397.52136 29.24813] CT
0.8 GC
N
f-1618671862
f
GR
GS
[1 0 0 1.00107 355.37082 64.72619] CT
0.8 GC
N
f-1618671862
f
GR
GS
[1 0 0 1.00107 371.12543 103.40003] CT
0.8 GC
N
f-1618671862
f
GR
GS
[1 0 0 1.00107 409.74207 106.97013] CT
0.8 GC
N
f-1618671862
f
GR
GS
[1 0 0 1.00107 406.17276 68.00857] CT
0.8 GC
N
f-1618671862
f
GR
GS
[1 0 0 1.00107 364.36511 69.71269] CT
0.8 GC
N
f-1618671862
f
GR
GS
[1 0 0 1.00107 381.17572 74.70352] CT
0.8 GC
N
f-1618671862
f
GR
GS
[1 0 0 1.00107 409.62173 111.40524] CT
0.8 GC
N
f-1618671862
f
GR
GS
[1 0 0 1.00107 388.65161 80.74153] CT
0.8 GC
N
f-1618671862
f
GR
GS
[1 0 0 1.00107 377.08151 82.65053] CT
0.8 GC
N
f-1618671862
f
GR
GS
[1 0 0 1.00107 423.27972 107.8521] CT
0.8 GC
N
f-1618671862
f
GR
GS
[1 0 0 1.00107 430.68405 29.24813] CT
0.8 GC
N
f-1618671862
f
GR
GS
[1 0 0 1.00107 473.70834 111.04092] CT
0.8 GC
N
f-1618671862
f
GR
GS
[1 0 0 1.00107 442.39258 121.26867] CT
0.8 GC
N
f-1618671862
f
GR
GS
[1 0 0 1.00107 361.28311 96.61002] CT
0.8 GC
N
f-1618671862
f
GR
GS
[1 0 0 1.00107 445.63708 77.00752] CT
0.8 GC
N
f-1618671862
f
GR
GS
[1 0 0 1.00107 435.9837 111.33944] CT
0.8 GC
N
f-1618671862
f
GR
GS
[1 0 0 1.00107 412.6972 111.86057] CT
0.8 GC
N
f-1618671862
f
GR
GS
[1 0 0 1.00107 407.49878 135.07005] CT
0.8 GC
N
f-1618671862
f
GR
GS
[1 0 0 1.00107 387.08926 84.35065] CT
0.8 GC
N
f-1618671862
f
GR
GS
[1 0 0 1.00107 383.93994 127.78907] CT
0.8 GC
N
f-1618671862
f
GR
GS
[1 0 0 1.00107 416.46463 117.09584] CT
0.8 GC
N
f-1618671862
f
GR
GS
[1 0 0 1.00107 392.81873 106.27891] CT
0.8 GC
N
f-1618671862
f
GR
GS
[1 0 0 1.00107 390.92834 113.2031] CT
0.8 GC
N
f-1618671862
f
GR
GS
[1 0 0 1.00107 410.52316 95.36237] CT
0.8 GC
N
f-1618671862
f
GR
GS
[1 0 0 1.00107 381.71683 74.23664] CT
0.8 GC
N
f-1618671862
f
GR
GS
[1 0 0 1.00107 396.75824 70.48279] CT
0.8 GC
N
f-1618671862
f
GR
GS
[1 0 0 1.00107 383.20279 79.12317] CT
0.8 GC
N
f-1618671862
f
GR
GS
[1 0 0 1.00107 384.00467 89.61404] CT
0.8 GC
N
f-1618671862
f
GR
GS
[1 0 0 1.00107 380.90491 79.15144] CT
0.8 GC
N
f-1618671862
f
GR
GS
[1 0 0 1.00107 385.86182 112.02034] CT
0.8 GC
N
f-1618671862
f
GR
GS
[1 0 0 1.00107 413.2648 74.59714] CT
0.8 GC
N
f-1618671862
f
GR
GS
[1 0 0 1.00107 392.4866 112.65248] CT
0.8 GC
N
f-1618671862
f
GR
GS
[1 0 0 1.00107 370.94916 132.41086] CT
0.8 GC
N
f-1618671862
f
GR
GS
[1 0 0 1.00107 393.32486 138.53155] CT
0.8 GC
N
f-1618671862
f
GR
GS
[1 0 0 1.00107 395.32205 70.55118] CT
0.8 GC
N
f-1618671862
f
GR
GS
[1 0 0 1.00107 426.15189 101.51741] CT
0.8 GC
N
f-1618671862
f
GR
GS
[1 0 0 1.00107 405.61734 111.378] CT
0.8 GC
N
f-1618671862
f
GR
GS
[1 0 0 1.00107 403.27606 78.64771] CT
0.8 GC
N
f-1618671862
f
GR
GS
[1 0 0 1.00107 395.10229 85.20254] CT
0.8 GC
N
f-1618671862
f
GR
GS
[1 0 0 1.00107 378.5137 112.55224] CT
0.8 GC
N
f-1618671862
f
GR
GS
[1 0 0 1.00107 372.60812 82.57563] CT
0.8 GC
N
f-1618671862
f
GR
GS
[1 0 0 1.00107 408.31616 110.46047] CT
0.8 GC
N
f-1618671862
f
GR
GS
[1 0 0 1.00107 388.06058 72.87783] CT
0.8 GC
N
f-1618671862
f
GR
GS
[1 0 0 1.00107 383.34515 87.34601] CT
0.8 GC
N
f-1618671862
f
GR
GS
[1 0 0 1.00107 394.20908 81.86004] CT
0.8 GC
N
f-1618671862
f
GR
GS
[1 0 0 1.00107 404.3074 84.56756] CT
0.8 GC
N
f-1618671862
f
GR
GS
[1 0 0 1.00107 381.741 113.44842] CT
0.8 GC
N
f-1618671862
f
GR
GS
[1 0 0 1.00107 433.44394 60.87601] CT
0.8 GC
N
f-1618671862
f
GR
GS
[1 0 0 1.00107 379.08481 86.21376] CT
0.8 GC
N
f-1618671862
f
GR
GS
[1 0 0 1.00107 417.75372 95.81998] CT
0.8 GC
N
f-1618671862
f
GR
GS
[1 0 0 1.00107 418.56015 104.19688] CT
0.8 GC
N
f-1618671862
f
GR
GS
[1 0 0 1.00107 399.35876 79.58461] CT
0.8 GC
N
f-1618671862
f
GR
GS
[1 0 0 1.00107 388.5304 125.72601] CT
0.8 GC
N
f-1618671862
f
GR
GS
[1 0 0 1.00107 377.38434 37.63789] CT
0.8 GC
N
f-1618671862
f
GR
GS
[1 0 0 1.00107 389.89014 77.77111] CT
0.8 GC
N
f-1618671862
f
GR
GS
[1 0 0 1.00107 415.48138 75.37133] CT
0.8 GC
N
f-1618671862
f
GR
GS
[1 0 0 1.00107 414.30484 99.6328] CT
0.8 GC
N
f-1618671862
f
GR
GS
[1 0 0 1.00107 364.57996 87.69862] CT
0.8 GC
N
f-1618671862
f
GR
GS
[1 0 0 1.00107 411.92838 109.92797] CT
0.8 GC
N
f-1618671862
f
GR
GS
[1 0 0 1.00107 409.75928 86.451] CT
0.8 GC
N
f-1618671862
f
GR
GS
[1 0 0 1.00107 400.75851 112.21184] CT
0.8 GC
N
f-1618671862
f
GR
GS
[1 0 0 1.00107 372.18869 91.42018] CT
0.8 GC
N
f-1618671862
f
GR
GS
[1 0 0 1.00107 371.80615 113.53317] CT
0.8 GC
N
f-1618671862
f
GR
GS
[1 0 0 1.00107 378.79276 105.50227] CT
0.8 GC
N
f-1618671862
f
GR
GS
[1 0 0 1.00107 424.87076 98.99811] CT
0.8 GC
N
f-1618671862
f
GR
GS
[1 0 0 1.00107 406.60504 59.61281] CT
0.8 GC
N
f-1618671862
f
GR
GS
[1 0 0 1.00107 392.57483 128.27517] CT
0.8 GC
N
f-1618671862
f
GR
GS
[1 0 0 1.00107 429.01874 106.56939] CT
0.8 GC
N
f-1618671862
f
GR
GS
[1 0 0 1.00107 396.12485 58.02426] CT
0.8 GC
N
f-1618671862
f
GR
GS
[1 0 0 1.00107 404.3226 97.92031] CT
0.8 GC
N
f-1618671862
f
GR
GS
[1 0 0 1.00107 403.9155 57.59222] CT
0.8 GC
N
f-1618671862
f
GR
GS
[1 0 0 1.00107 401.62329 105.42225] CT
0.8 GC
N
f-1618671862
f
GR
GS
[1 0 0 1.00107 400.50644 37.63789] CT
0.8 GC
N
f-1618671862
f
GR
GS
[1 0 0 1.00107 398.56418 96.39976] CT
0.8 GC
N
f-1618671862
f
GR
GS
[1 0 0 1.00107 0 -0.2] CT
1 0.6 0.6 RC
1 LJ
3 LW
N
345.792 92.556 M
485.722 90.818 L
S
GR
%%Trailer
%%Pages: 1
%%EOF
