%!PS-Adobe-3.0 EPSF-3.0
%%Creator: (MATLAB, The Mathworks, Inc. Version 9.1.0.441655 \(R2016b\). Operating System: Mac OS X)
%%Title: /Users/kosciessa/Desktop/TemporalSequence.eps
%%CreationDate: 2019-06-26T12:47:22
%%Pages: (atend)
%%BoundingBox:   256    28  2049   456
%%LanguageLevel: 3
%%EndComments
%%BeginProlog
%%BeginResource: procset (Apache XML Graphics Std ProcSet) 1.2 0
%%Version: 1.2 0
%%Copyright: (Copyright 2001-2003,2010 The Apache Software Foundation. License terms: http://www.apache.org/licenses/LICENSE-2.0)
/bd{bind def}bind def
/ld{load def}bd
/GR/grestore ld
/M/moveto ld
/LJ/setlinejoin ld
/C/curveto ld
/f/fill ld
/LW/setlinewidth ld
/GC/setgray ld
/t/show ld
/N/newpath ld
/CT/concat ld
/cp/closepath ld
/S/stroke ld
/L/lineto ld
/CC/setcmykcolor ld
/A/ashow ld
/GS/gsave ld
/RC/setrgbcolor ld
/RM/rmoveto ld
/ML/setmiterlimit ld
/re {4 2 roll M
1 index 0 rlineto
0 exch rlineto
neg 0 rlineto
cp } bd
/_ctm matrix def
/_tm matrix def
/BT { _ctm currentmatrix pop matrix _tm copy pop 0 0 moveto } bd
/ET { _ctm setmatrix } bd
/iTm { _ctm setmatrix _tm concat } bd
/Tm { _tm astore pop iTm 0 0 moveto } bd
/ux 0.0 def
/uy 0.0 def
/F {
  /Tp exch def
  /Tf exch def
  Tf findfont Tp scalefont setfont
  /cf Tf def  /cs Tp def
} bd
/ULS {currentpoint /uy exch def /ux exch def} bd
/ULE {
  /Tcx currentpoint pop def
  gsave
  newpath
  cf findfont cs scalefont dup
  /FontMatrix get 0 get /Ts exch def /FontInfo get dup
  /UnderlinePosition get Ts mul /To exch def
  /UnderlineThickness get Ts mul /Tt exch def
  ux uy To add moveto  Tcx uy To add lineto
  Tt setlinewidth stroke
  grestore
} bd
/OLE {
  /Tcx currentpoint pop def
  gsave
  newpath
  cf findfont cs scalefont dup
  /FontMatrix get 0 get /Ts exch def /FontInfo get dup
  /UnderlinePosition get Ts mul /To exch def
  /UnderlineThickness get Ts mul /Tt exch def
  ux uy To add cs add moveto Tcx uy To add cs add lineto
  Tt setlinewidth stroke
  grestore
} bd
/SOE {
  /Tcx currentpoint pop def
  gsave
  newpath
  cf findfont cs scalefont dup
  /FontMatrix get 0 get /Ts exch def /FontInfo get dup
  /UnderlinePosition get Ts mul /To exch def
  /UnderlineThickness get Ts mul /Tt exch def
  ux uy To add cs 10 mul 26 idiv add moveto Tcx uy To add cs 10 mul 26 idiv add lineto
  Tt setlinewidth stroke
  grestore
} bd
/QT {
/Y22 exch store
/X22 exch store
/Y21 exch store
/X21 exch store
currentpoint
/Y21 load 2 mul add 3 div exch
/X21 load 2 mul add 3 div exch
/X21 load 2 mul /X22 load add 3 div
/Y21 load 2 mul /Y22 load add 3 div
/X22 load /Y22 load curveto
} bd
/SSPD {
dup length /d exch dict def
{
/v exch def
/k exch def
currentpagedevice k known {
/cpdv currentpagedevice k get def
v cpdv ne {
/upd false def
/nullv v type /nulltype eq def
/nullcpdv cpdv type /nulltype eq def
nullv nullcpdv or
{
/upd true def
} {
/sametype v type cpdv type eq def
sametype {
v type /arraytype eq {
/vlen v length def
/cpdvlen cpdv length def
vlen cpdvlen eq {
0 1 vlen 1 sub {
/i exch def
/obj v i get def
/cpdobj cpdv i get def
obj cpdobj ne {
/upd true def
exit
} if
} for
} {
/upd true def
} ifelse
} {
v type /dicttype eq {
v {
/dv exch def
/dk exch def
/cpddv cpdv dk get def
dv cpddv ne {
/upd true def
exit
} if
} forall
} {
/upd true def
} ifelse
} ifelse
} if
} ifelse
upd true eq {
d k v put
} if
} if
} if
} forall
d length 0 gt {
d setpagedevice
} if
} bd
/RE { % /NewFontName [NewEncodingArray] /FontName RE -
  findfont dup length dict begin
  {
    1 index /FID ne
    {def} {pop pop} ifelse
  } forall
  /Encoding exch def
  /FontName 1 index def
  currentdict definefont pop
  end
} bind def
%%EndResource
%%BeginResource: procset (Apache XML Graphics EPS ProcSet) 1.0 0
%%Version: 1.0 0
%%Copyright: (Copyright 2002-2003 The Apache Software Foundation. License terms: http://www.apache.org/licenses/LICENSE-2.0)
/BeginEPSF { %def
/b4_Inc_state save def         % Save state for cleanup
/dict_count countdictstack def % Count objects on dict stack
/op_count count 1 sub def      % Count objects on operand stack
userdict begin                 % Push userdict on dict stack
/showpage { } def              % Redefine showpage, { } = null proc
0 setgray 0 setlinecap         % Prepare graphics state
1 setlinewidth 0 setlinejoin
10 setmiterlimit [ ] 0 setdash newpath
/languagelevel where           % If level not equal to 1 then
{pop languagelevel             % set strokeadjust and
1 ne                           % overprint to their defaults.
{false setstrokeadjust false setoverprint
} if
} if
} bd
/EndEPSF { %def
count op_count sub {pop} repeat            % Clean up stacks
countdictstack dict_count sub {end} repeat
b4_Inc_state restore
} bd
%%EndResource
%FOPBeginFontDict
%%IncludeResource: font Courier-Bold
%%IncludeResource: font Helvetica
%%IncludeResource: font Courier-BoldOblique
%%IncludeResource: font Courier-Oblique
%%IncludeResource: font Times-Roman
%%IncludeResource: font Helvetica-BoldOblique
%%IncludeResource: font Helvetica-Bold
%%IncludeResource: font Helvetica-Oblique
%%IncludeResource: font Times-BoldItalic
%%IncludeResource: font Courier
%%IncludeResource: font Times-Italic
%%IncludeResource: font Times-Bold
%%IncludeResource: font Symbol
%%IncludeResource: font ZapfDingbats
%FOPEndFontDict
%%BeginResource: encoding WinAnsiEncoding
/WinAnsiEncoding [
/.notdef /.notdef /.notdef /.notdef /.notdef
/.notdef /.notdef /.notdef /.notdef /.notdef
/.notdef /.notdef /.notdef /.notdef /.notdef
/.notdef /.notdef /.notdef /.notdef /.notdef
/.notdef /.notdef /.notdef /.notdef /.notdef
/.notdef /.notdef /.notdef /.notdef /.notdef
/.notdef /.notdef /space /exclam /quotedbl
/numbersign /dollar /percent /ampersand /quotesingle
/parenleft /parenright /asterisk /plus /comma
/hyphen /period /slash /zero /one
/two /three /four /five /six
/seven /eight /nine /colon /semicolon
/less /equal /greater /question /at
/A /B /C /D /E
/F /G /H /I /J
/K /L /M /N /O
/P /Q /R /S /T
/U /V /W /X /Y
/Z /bracketleft /backslash /bracketright /asciicircum
/underscore /quoteleft /a /b /c
/d /e /f /g /h
/i /j /k /l /m
/n /o /p /q /r
/s /t /u /v /w
/x /y /z /braceleft /bar
/braceright /asciitilde /bullet /Euro /bullet
/quotesinglbase /florin /quotedblbase /ellipsis /dagger
/daggerdbl /circumflex /perthousand /Scaron /guilsinglleft
/OE /bullet /Zcaron /bullet /bullet
/quoteleft /quoteright /quotedblleft /quotedblright /bullet
/endash /emdash /asciitilde /trademark /scaron
/guilsinglright /oe /bullet /zcaron /Ydieresis
/space /exclamdown /cent /sterling /currency
/yen /brokenbar /section /dieresis /copyright
/ordfeminine /guillemotleft /logicalnot /sfthyphen /registered
/macron /degree /plusminus /twosuperior /threesuperior
/acute /mu /paragraph /middot /cedilla
/onesuperior /ordmasculine /guillemotright /onequarter /onehalf
/threequarters /questiondown /Agrave /Aacute /Acircumflex
/Atilde /Adieresis /Aring /AE /Ccedilla
/Egrave /Eacute /Ecircumflex /Edieresis /Igrave
/Iacute /Icircumflex /Idieresis /Eth /Ntilde
/Ograve /Oacute /Ocircumflex /Otilde /Odieresis
/multiply /Oslash /Ugrave /Uacute /Ucircumflex
/Udieresis /Yacute /Thorn /germandbls /agrave
/aacute /acircumflex /atilde /adieresis /aring
/ae /ccedilla /egrave /eacute /ecircumflex
/edieresis /igrave /iacute /icircumflex /idieresis
/eth /ntilde /ograve /oacute /ocircumflex
/otilde /odieresis /divide /oslash /ugrave
/uacute /ucircumflex /udieresis /yacute /thorn
/ydieresis
] def
%%EndResource
%FOPBeginFontReencode
/Courier-Bold findfont
dup length dict begin
  {1 index /FID ne {def} {pop pop} ifelse} forall
  /Encoding WinAnsiEncoding def
  currentdict
end
/Courier-Bold exch definefont pop
/Helvetica findfont
dup length dict begin
  {1 index /FID ne {def} {pop pop} ifelse} forall
  /Encoding WinAnsiEncoding def
  currentdict
end
/Helvetica exch definefont pop
/Courier-BoldOblique findfont
dup length dict begin
  {1 index /FID ne {def} {pop pop} ifelse} forall
  /Encoding WinAnsiEncoding def
  currentdict
end
/Courier-BoldOblique exch definefont pop
/Courier-Oblique findfont
dup length dict begin
  {1 index /FID ne {def} {pop pop} ifelse} forall
  /Encoding WinAnsiEncoding def
  currentdict
end
/Courier-Oblique exch definefont pop
/Times-Roman findfont
dup length dict begin
  {1 index /FID ne {def} {pop pop} ifelse} forall
  /Encoding WinAnsiEncoding def
  currentdict
end
/Times-Roman exch definefont pop
/Helvetica-BoldOblique findfont
dup length dict begin
  {1 index /FID ne {def} {pop pop} ifelse} forall
  /Encoding WinAnsiEncoding def
  currentdict
end
/Helvetica-BoldOblique exch definefont pop
/Helvetica-Bold findfont
dup length dict begin
  {1 index /FID ne {def} {pop pop} ifelse} forall
  /Encoding WinAnsiEncoding def
  currentdict
end
/Helvetica-Bold exch definefont pop
/Helvetica-Oblique findfont
dup length dict begin
  {1 index /FID ne {def} {pop pop} ifelse} forall
  /Encoding WinAnsiEncoding def
  currentdict
end
/Helvetica-Oblique exch definefont pop
/Times-BoldItalic findfont
dup length dict begin
  {1 index /FID ne {def} {pop pop} ifelse} forall
  /Encoding WinAnsiEncoding def
  currentdict
end
/Times-BoldItalic exch definefont pop
/Courier findfont
dup length dict begin
  {1 index /FID ne {def} {pop pop} ifelse} forall
  /Encoding WinAnsiEncoding def
  currentdict
end
/Courier exch definefont pop
/Times-Italic findfont
dup length dict begin
  {1 index /FID ne {def} {pop pop} ifelse} forall
  /Encoding WinAnsiEncoding def
  currentdict
end
/Times-Italic exch definefont pop
/Times-Bold findfont
dup length dict begin
  {1 index /FID ne {def} {pop pop} ifelse} forall
  /Encoding WinAnsiEncoding def
  currentdict
end
/Times-Bold exch definefont pop
%FOPEndFontReencode
%%EndProlog
%%Page: 1 1
%%PageBoundingBox: 0 0 2262 472
%%BeginPageSetup
[1 0 0 -1 0 472] CT
%%EndPageSetup
GS
1 GC
N
0 0 2262 472 re
f
GR
GS
1 GC
N
0 0 2262 472 re
f
GR
GS
1 GC
N
294 420 M
2047 420 L
2047 35.5 L
294 35.5 L
cp
f
GR
GS
0.149 GC
2 setlinecap
1 LJ
0.5 LW
N
294 420 M
2047 420 L
S
GR
GS
0.149 GC
2 setlinecap
1 LJ
0.5 LW
N
445.95 420 M
445.95 402.47 L
S
GR
GS
0.149 GC
2 setlinecap
1 LJ
0.5 LW
N
960.175 420 M
960.175 402.47 L
S
GR
GS
0.149 GC
2 setlinecap
1 LJ
0.5 LW
N
1474.4 420 M
1474.4 402.47 L
S
GR
GS
0.149 GC
2 setlinecap
1 LJ
0.5 LW
N
1988.625 420 M
1988.625 402.47 L
S
GR
GS
[1 0 0 1 445.95013 425.60001] CT
0.149 GC
/Helvetica 18 F
GS
[1 0 0 1 0 0] CT
-15.5 18 moveto 
1 -1 scale
(400) t 
GR
GR
GS
[1 0 0 1 960.17517 425.60001] CT
0.149 GC
/Helvetica 18 F
GS
[1 0 0 1 0 0] CT
-15.5 18 moveto 
1 -1 scale
(450) t 
GR
GR
GS
[1 0 0 1 1474.40027 425.60001] CT
0.149 GC
/Helvetica 18 F
GS
[1 0 0 1 0 0] CT
-15.5 18 moveto 
1 -1 scale
(500) t 
GR
GR
GS
[1 0 0 1 1988.62537 425.60001] CT
0.149 GC
/Helvetica 18 F
GS
[1 0 0 1 0 0] CT
-15.5 18 moveto 
1 -1 scale
(550) t 
GR
GR
GS
0.149 GC
2 setlinecap
1 LJ
0.5 LW
N
294 420 M
294 35.5 L
S
GR
GS
0.149 GC
2 setlinecap
1 LJ
0.5 LW
N
294 395.184 M
311.53 395.184 L
S
GR
GS
0.149 GC
2 setlinecap
1 LJ
0.5 LW
N
294 319.755 M
311.53 319.755 L
S
GR
GS
0.149 GC
2 setlinecap
1 LJ
0.5 LW
N
294 244.327 M
311.53 244.327 L
S
GR
GS
0.149 GC
2 setlinecap
1 LJ
0.5 LW
N
294 168.898 M
311.53 168.898 L
S
GR
GS
0.149 GC
2 setlinecap
1 LJ
0.5 LW
N
294 93.469 M
311.53 93.469 L
S
GR
GS
[1 0 0 1 288.4003 395.18405] CT
0.149 GC
/Helvetica 18 F
GS
[1 0 0 1 0 0] CT
-18 7 moveto 
1 -1 scale
(-1) t 
GR
GR
GS
[1 0 0 1 288.4003 319.75537] CT
0.149 GC
/Helvetica 18 F
GS
[1 0 0 1 0 0] CT
-33 7 moveto 
1 -1 scale
(-0.5) t 
GR
GR
GS
[1 0 0 1 288.4003 244.32666] CT
0.149 GC
/Helvetica 18 F
GS
[1 0 0 1 0 0] CT
-11 7 moveto 
1 -1 scale
(0) t 
GR
GR
GS
[1 0 0 1 288.4003 168.89796] CT
0.149 GC
/Helvetica 18 F
GS
[1 0 0 1 0 0] CT
-26 7 moveto 
1 -1 scale
(0.5) t 
GR
GR
GS
[1 0 0 1 288.4003 93.46926] CT
0.149 GC
/Helvetica 18 F
GS
[1 0 0 1 0 0] CT
-11 7 moveto 
1 -1 scale
(1) t 
GR
GR
GS
[1 0 0 1 1170.50122 33.25] CT
/Helvetica-Bold 18 F
GS
[1 0 0 1 0 0] CT
-169.5 -4 moveto 
1 -1 scale
(Temporal sequence of spatial networks) t 
GR
GR
GS
0.8 GC
1 LJ
2 LW
N
293.791 347.259 M
301.967 303.047 L
312.252 246.989 L
322.536 188.304 L
332.821 138.842 L
343.105 100.966 L
353.39 98.363 L
363.674 111.998 L
373.959 150.931 L
384.243 202.56 L
394.528 245.717 L
404.812 276.107 L
415.097 313.312 L
425.381 350.306 L
435.666 370.367 L
445.95 375.71 L
456.235 370.228 L
466.519 366.117 L
476.804 372.433 L
487.088 376.041 L
497.373 388.034 L
507.657 386.94 L
517.942 387.24 L
528.226 384.966 L
538.511 384.586 L
548.795 391.157 L
559.08 378.889 L
569.364 330.42 L
579.649 268.543 L
589.933 206.323 L
600.218 151.158 L
610.502 100.648 L
620.787 63.893 L
631.071 63.768 L
641.356 86.407 L
651.64 127.483 L
661.925 181.7 L
672.209 233.771 L
682.494 288.282 L
692.778 341.595 L
703.063 389.6 L
713.347 388.589 L
723.632 342.267 L
733.916 278.97 L
744.201 216.557 L
754.485 162.39 L
764.77 123.922 L
775.054 90.477 L
785.339 96.179 L
795.623 118.162 L
805.908 161.624 L
816.192 217.217 L
826.477 269.443 L
836.761 313.752 L
847.046 366.805 L
857.33 401.432 L
867.615 386.101 L
877.899 333.546 L
888.184 271.741 L
898.468 212.33 L
908.753 155.588 L
919.037 110.487 L
929.322 90.335 L
939.606 93.902 L
949.891 118.722 L
960.175 165.513 L
970.46 216.542 L
980.744 271.658 L
991.029 322.923 L
1001.313 373.916 L
1011.598 403.948 L
1021.882 377.562 L
1032.167 322.004 L
1042.451 254.821 L
1052.736 207.786 L
1063.02 157.029 L
1073.305 108.839 L
1083.589 101.268 L
1093.874 111.484 L
1104.158 142.55 L
1114.443 189.52 L
1124.727 239.54 L
1135.012 287.078 L
1145.296 343.825 L
1155.581 385.827 L
1165.865 399.986 L
1176.15 360.846 L
1186.434 307.406 L
1196.719 248.787 L
1207.003 196.618 L
1217.288 141.478 L
1227.572 104.537 L
1237.857 107.225 L
1248.141 120.405 L
1258.426 155.489 L
1268.71 206.936 L
1278.995 249.423 L
1289.279 296.625 L
1299.564 349.627 L
1309.848 391.19 L
1320.133 385.777 L
1330.417 338.335 L
1340.702 278.932 L
1350.986 223.151 L
1361.271 165.885 L
1371.555 110.595 L
1381.84 94.943 L
1392.124 94.619 L
1402.409 116.807 L
1412.693 158.207 L
1422.978 207.714 L
1433.262 254.895 L
1443.547 307.008 L
1453.831 357.55 L
1464.116 395.054 L
1474.4 379.613 L
1484.685 329.011 L
1494.969 270.161 L
1505.254 215.925 L
1515.538 165.286 L
1525.823 121.299 L
1536.107 90.105 L
1546.392 99.04 L
1556.676 130.454 L
1566.961 174.168 L
1577.245 227.489 L
1587.53 279.192 L
1597.814 329.457 L
1608.099 379.353 L
1618.383 405.996 L
1628.668 373.771 L
1638.952 317.469 L
1649.237 251.513 L
1659.521 202.78 L
1669.806 151.362 L
1680.09 100.632 L
1690.375 95.913 L
1700.659 109.765 L
1710.944 142.354 L
1721.228 185.806 L
1731.513 226.646 L
1741.797 271.556 L
1752.082 307.922 L
1762.366 336.581 L
1772.651 362.147 L
1782.935 374.103 L
1793.22 377.052 L
1803.504 374.812 L
1813.789 379.777 L
1824.073 382.938 L
1834.358 386.571 L
1844.642 390.421 L
1854.927 393.604 L
1865.211 393.953 L
1875.496 397.899 L
1885.78 404.943 L
1896.065 397.47 L
1906.349 358.996 L
1916.634 301.48 L
1926.918 238.598 L
1937.203 174.724 L
1947.487 126.503 L
1957.772 83.791 L
1968.056 61.37 L
1978.341 81.078 L
1988.625 113.312 L
1998.91 164.595 L
2009.194 217.446 L
2019.479 273.301 L
2029.763 325.856 L
2040.048 376.782 L
2047.209 387.506 L
S
GR
GS
0.702 GC
1 LJ
2 LW
N
293.791 321.359 M
301.967 310.466 L
312.252 297.051 L
322.536 275.593 L
332.821 238.735 L
343.105 218.76 L
353.39 209.552 L
363.674 215.983 L
373.959 220.978 L
384.243 228.298 L
394.528 224.295 L
404.812 236.201 L
415.097 241.344 L
425.381 234.468 L
435.666 243.386 L
445.95 231.53 L
456.235 226.92 L
466.519 239.593 L
476.804 231.54 L
487.088 213.539 L
497.373 208.655 L
507.657 213.904 L
517.942 212.938 L
528.226 219.648 L
538.511 230.133 L
548.795 242.456 L
559.08 246.125 L
569.364 250.731 L
579.649 235.425 L
589.933 216.806 L
600.218 207.411 L
610.502 202.032 L
620.787 176.677 L
631.071 159.225 L
641.356 161.263 L
651.64 174.878 L
661.925 197.609 L
672.209 213.887 L
682.494 231.471 L
692.778 262.718 L
703.063 277.06 L
713.347 297.542 L
723.632 289.592 L
733.916 280.084 L
744.201 264.516 L
754.485 251.417 L
764.77 223.226 L
775.054 206.936 L
785.339 209.564 L
795.623 206.641 L
805.908 218.581 L
816.192 246.942 L
826.477 279.689 L
836.761 297.116 L
847.046 313.487 L
857.33 324.902 L
867.615 332.079 L
877.899 334.235 L
888.184 321.677 L
898.468 299.107 L
908.753 267.176 L
919.037 241.282 L
929.322 210.767 L
939.606 202.823 L
949.891 200.229 L
960.175 223.549 L
970.46 233.006 L
980.744 250.667 L
991.029 276.01 L
1001.313 286.421 L
1011.598 307.707 L
1021.882 318.18 L
1032.167 307.461 L
1042.451 291.489 L
1052.736 257.727 L
1063.02 227.603 L
1073.305 213.413 L
1083.589 208.782 L
1093.874 216.319 L
1104.158 210.324 L
1114.443 224.415 L
1124.727 241.785 L
1135.012 266.773 L
1145.296 291.167 L
1155.581 298.387 L
1165.865 306.665 L
1176.15 318.902 L
1186.434 312.373 L
1196.719 290.92 L
1207.003 275.862 L
1217.288 243.681 L
1227.572 217.635 L
1237.857 186.798 L
1248.141 199.447 L
1258.426 212.91 L
1268.71 245.483 L
1278.995 253.647 L
1289.279 264.223 L
1299.564 281.398 L
1309.848 302.762 L
1320.133 302.204 L
1330.417 287.399 L
1340.702 290.224 L
1350.986 276.438 L
1361.271 252.877 L
1371.555 217.318 L
1381.84 200.04 L
1392.124 193.447 L
1402.409 199.126 L
1412.693 210.729 L
1422.978 218.743 L
1433.262 239.452 L
1443.547 264.842 L
1453.831 286.068 L
1464.116 299.294 L
1474.4 313.074 L
1484.685 322.264 L
1494.969 302.704 L
1505.254 282.418 L
1515.538 249.849 L
1525.823 226.098 L
1536.107 213.563 L
1546.392 206.964 L
1556.676 203.651 L
1566.961 212.978 L
1577.245 213.606 L
1587.53 235.867 L
1597.814 262.201 L
1608.099 286.321 L
1618.383 298.412 L
1628.668 305.55 L
1638.952 289.713 L
1649.237 276.549 L
1659.521 263.643 L
1669.806 230.446 L
1680.09 210.352 L
1690.375 203.921 L
1700.659 196.042 L
1710.944 210.544 L
1721.228 210.776 L
1731.513 203.598 L
1741.797 205.764 L
1752.082 217.94 L
1762.366 230.495 L
1772.651 246.784 L
1782.935 260.015 L
1793.22 247.307 L
1803.504 248.425 L
1813.789 244.417 L
1824.073 238.493 L
1834.358 245.397 L
1844.642 241.829 L
1854.927 236.056 L
1865.211 236.003 L
1875.496 246.492 L
1885.78 255.07 L
1896.065 265.615 L
1906.349 269.643 L
1916.634 250.751 L
1926.918 227.078 L
1937.203 218.598 L
1947.487 196.707 L
1957.772 178.859 L
1968.056 174.321 L
1978.341 175.4 L
1988.625 202.104 L
1998.91 217.677 L
2009.194 228.068 L
2019.479 248.472 L
2029.763 280.114 L
2040.048 299.4 L
2047.209 304.017 L
S
GR
GS
0.6 GC
1 LJ
2 LW
N
293.791 320.771 M
301.967 314.332 L
312.252 308.103 L
322.536 295.103 L
332.821 271.689 L
343.105 217.919 L
353.39 165.507 L
363.674 163.651 L
373.959 172.691 L
384.243 167.84 L
394.528 183.768 L
404.812 188.839 L
415.097 199.745 L
425.381 233.602 L
435.666 247.188 L
445.95 288.176 L
456.235 294.581 L
466.519 329.856 L
476.804 324.686 L
487.088 330.76 L
497.373 332.575 L
507.657 331.519 L
517.942 325.666 L
528.226 327.753 L
538.511 313.42 L
548.795 314.018 L
559.08 331.341 L
569.364 317.716 L
579.649 298.577 L
589.933 267.724 L
600.218 244.521 L
610.502 215.596 L
620.787 206.084 L
631.071 182.842 L
641.356 140.843 L
651.64 143.149 L
661.925 152.937 L
672.209 167.364 L
682.494 190.3 L
692.778 227.217 L
703.063 268.075 L
713.347 293.591 L
723.632 315.087 L
733.916 295.255 L
744.201 268.983 L
754.485 247.688 L
764.77 231.39 L
775.054 200.982 L
785.339 173.11 L
795.623 143.56 L
805.908 152.77 L
816.192 182.555 L
826.477 211.478 L
836.761 252.529 L
847.046 307.134 L
857.33 329.528 L
867.615 362.414 L
877.899 377.764 L
888.184 346.648 L
898.468 338.393 L
908.753 288.991 L
919.037 264.818 L
929.322 225.613 L
939.606 203.541 L
949.891 168.369 L
960.175 161.863 L
970.46 177.296 L
980.744 201.746 L
991.029 231.398 L
1001.313 266.305 L
1011.598 302.629 L
1021.882 314.743 L
1032.167 299.837 L
1042.451 278.696 L
1052.736 259.438 L
1063.02 244.252 L
1073.305 220.348 L
1083.589 164.592 L
1093.874 148.579 L
1104.158 133.931 L
1114.443 142.355 L
1124.727 183.925 L
1135.012 201.785 L
1145.296 224.021 L
1155.581 272.098 L
1165.865 301.295 L
1176.15 333.115 L
1186.434 329.133 L
1196.719 319.615 L
1207.003 292.627 L
1217.288 264.587 L
1227.572 239.611 L
1237.857 208.035 L
1248.141 173.005 L
1258.426 154.315 L
1268.71 155.969 L
1278.995 168.507 L
1289.279 202.791 L
1299.564 239.612 L
1309.848 276.773 L
1320.133 309.93 L
1330.417 322.565 L
1340.702 306.87 L
1350.986 299.569 L
1361.271 277.54 L
1371.555 256.622 L
1381.84 209.283 L
1392.124 183.056 L
1402.409 146.471 L
1412.693 129.974 L
1422.978 166.576 L
1433.262 194.007 L
1443.547 208.971 L
1453.831 245.143 L
1464.116 286.622 L
1474.4 320.897 L
1484.685 329.488 L
1494.969 332.55 L
1505.254 313.111 L
1515.538 300.433 L
1525.823 278.124 L
1536.107 242.608 L
1546.392 211.561 L
1556.676 213.994 L
1566.961 194.345 L
1577.245 205.012 L
1587.53 231.343 L
1597.814 262.267 L
1608.099 284.492 L
1618.383 318.297 L
1628.668 327.307 L
1638.952 345.245 L
1649.237 336.889 L
1659.521 329.346 L
1669.806 293.781 L
1680.09 259.47 L
1690.375 227.287 L
1700.659 188.315 L
1710.944 174.082 L
1721.228 182.786 L
1731.513 185.834 L
1741.797 193.949 L
1752.082 212.5 L
1762.366 242.024 L
1772.651 261.392 L
1782.935 265.704 L
1793.22 271.392 L
1803.504 305.796 L
1813.789 317.938 L
1824.073 310.709 L
1834.358 313.697 L
1844.642 312.112 L
1854.927 299.64 L
1865.211 302.246 L
1875.496 305.782 L
1885.78 305.356 L
1896.065 315.905 L
1906.349 317.927 L
1916.634 313.493 L
1926.918 295.13 L
1937.203 268.301 L
1947.487 223.86 L
1957.772 195.638 L
1968.056 156.197 L
1978.341 142.504 L
1988.625 140.123 L
1998.91 133.02 L
2009.194 144.363 L
2019.479 175.949 L
2029.763 218.661 L
2040.048 253.42 L
2047.209 271.682 L
S
GR
GS
0.502 GC
1 LJ
2 LW
N
293.791 305.108 M
301.967 318.597 L
312.252 316.395 L
322.536 309.842 L
332.821 276.419 L
343.105 238.812 L
353.39 195.952 L
363.674 184.433 L
373.959 164.192 L
384.243 148.307 L
394.528 132.313 L
404.812 131.337 L
415.097 148.327 L
425.381 113.63 L
435.666 103.901 L
445.95 86.919 L
456.235 105.071 L
466.519 100.504 L
476.804 113.578 L
487.088 120.297 L
497.373 123.735 L
507.657 147.227 L
517.942 171.369 L
528.226 188.831 L
538.511 225.901 L
548.795 253.609 L
559.08 281.812 L
569.364 294.107 L
579.649 305.418 L
589.933 300.237 L
600.218 278.393 L
610.502 261.623 L
620.787 243.135 L
631.071 232.943 L
641.356 241.427 L
651.64 237.289 L
661.925 231.565 L
672.209 215.039 L
682.494 229.358 L
692.778 252.915 L
703.063 287.737 L
713.347 331.558 L
723.632 348.952 L
733.916 353.704 L
744.201 339.873 L
754.485 341.417 L
764.77 322.439 L
775.054 296.717 L
785.339 270.815 L
795.623 241.812 L
805.908 240.178 L
816.192 239.898 L
826.477 250.411 L
836.761 270.991 L
847.046 286.846 L
857.33 316.105 L
867.615 337.592 L
877.899 367.38 L
888.184 362.135 L
898.468 342.004 L
908.753 320.644 L
919.037 283.092 L
929.322 258.838 L
939.606 254.4 L
949.891 225.963 L
960.175 207.304 L
970.46 194.612 L
980.744 210.743 L
991.029 221.724 L
1001.313 260.784 L
1011.598 299.096 L
1021.882 331.568 L
1032.167 334.453 L
1042.451 341.878 L
1052.736 331.892 L
1063.02 299.734 L
1073.305 264.601 L
1083.589 260.405 L
1093.874 234.081 L
1104.158 208.461 L
1114.443 205.422 L
1124.727 202.242 L
1135.012 218.057 L
1145.296 230.7 L
1155.581 248.253 L
1165.865 280.315 L
1176.15 310.624 L
1186.434 325.476 L
1196.719 317.889 L
1207.003 312.811 L
1217.288 277.015 L
1227.572 272.028 L
1237.857 238.602 L
1248.141 232.54 L
1258.426 211.473 L
1268.71 182.743 L
1278.995 182.885 L
1289.279 185.118 L
1299.564 216.157 L
1309.848 237.661 L
1320.133 277.511 L
1330.417 295.914 L
1340.702 294.588 L
1350.986 300.351 L
1361.271 283.856 L
1371.555 261.267 L
1381.84 225.566 L
1392.124 203.717 L
1402.409 182.116 L
1412.693 176.871 L
1422.978 170.359 L
1433.262 161.026 L
1443.547 196.389 L
1453.831 230.191 L
1464.116 271.301 L
1474.4 279.382 L
1484.685 296.931 L
1494.969 305.117 L
1505.254 281.344 L
1515.538 264.437 L
1525.823 255.935 L
1536.107 221.268 L
1546.392 206.413 L
1556.676 193.689 L
1566.961 194.833 L
1577.245 184.904 L
1587.53 197.75 L
1597.814 209.15 L
1608.099 251.716 L
1618.383 278.648 L
1628.668 308.258 L
1638.952 308.961 L
1649.237 317.161 L
1659.521 302.247 L
1669.806 257.553 L
1680.09 238.861 L
1690.375 205.6 L
1700.659 186.956 L
1710.944 188.701 L
1721.228 183.772 L
1731.513 166.295 L
1741.797 171.478 L
1752.082 149.803 L
1762.366 142.282 L
1772.651 143.338 L
1782.935 153.318 L
1793.22 131.66 L
1803.504 123.062 L
1813.789 102.388 L
1824.073 117.019 L
1834.358 110.965 L
1844.642 147.835 L
1854.927 184.424 L
1865.211 202.165 L
1875.496 229.723 L
1885.78 268.295 L
1896.065 292.286 L
1906.349 318.945 L
1916.634 333.793 L
1926.918 332.186 L
1937.203 313.191 L
1947.487 275.56 L
1957.772 258.984 L
1968.056 224.385 L
1978.341 214.744 L
1988.625 200.387 L
1998.91 205.698 L
2009.194 195.158 L
2019.479 212.122 L
2029.763 243.29 L
2040.048 287.856 L
2047.209 314.244 L
S
GR
GS
1 0.8 0.8 RC
1 LJ
2 LW
N
293.791 180.761 M
301.967 212.745 L
312.252 227.823 L
322.536 242.995 L
332.821 276.783 L
343.105 307.251 L
353.39 322.4 L
363.674 325.342 L
373.959 300.364 L
384.243 287.175 L
394.528 267.067 L
404.812 242.524 L
415.097 218.861 L
425.381 191.694 L
435.666 170.018 L
445.95 184.526 L
456.235 170.823 L
466.519 163.594 L
476.804 192.807 L
487.088 202.264 L
497.373 198.458 L
507.657 195.874 L
517.942 194.201 L
528.226 207.11 L
538.511 208.755 L
548.795 196.407 L
559.08 201.445 L
569.364 190.394 L
579.649 211.775 L
589.933 231.409 L
600.218 246.354 L
610.502 254.816 L
620.787 300.021 L
631.071 296.575 L
641.356 301.72 L
651.64 294.173 L
661.925 282.584 L
672.209 283.284 L
682.494 252.331 L
692.778 202.586 L
703.063 211.702 L
713.347 219.123 L
723.632 215.387 L
733.916 235.538 L
744.201 246.204 L
754.485 254.801 L
764.77 302.498 L
775.054 309.225 L
785.339 315.491 L
795.623 319.92 L
805.908 285.948 L
816.192 264.553 L
826.477 258.875 L
836.761 237.252 L
847.046 204.37 L
857.33 195.031 L
867.615 199.972 L
877.899 209.884 L
888.184 220.11 L
898.468 242.931 L
908.753 268.756 L
919.037 296.213 L
929.322 309.054 L
939.606 321.057 L
949.891 311.149 L
960.175 285.058 L
970.46 275.294 L
980.744 261.914 L
991.029 223.568 L
1001.313 214.421 L
1011.598 197.553 L
1021.882 208.42 L
1032.167 228.321 L
1042.451 233.616 L
1052.736 263.982 L
1063.02 299.561 L
1073.305 334.2 L
1083.589 315.895 L
1093.874 329.183 L
1104.158 305.46 L
1114.443 277.409 L
1124.727 260.325 L
1135.012 242.395 L
1145.296 211.94 L
1155.581 190.38 L
1165.865 169.909 L
1176.15 181.737 L
1186.434 198.412 L
1196.719 224.097 L
1207.003 248.628 L
1217.288 285.436 L
1227.572 311.678 L
1237.857 310.611 L
1248.141 325.105 L
1258.426 298.354 L
1268.71 286.347 L
1278.995 260.046 L
1289.279 235.34 L
1299.564 206.752 L
1309.848 200.879 L
1320.133 174.619 L
1330.417 173.998 L
1340.702 172.921 L
1350.986 190.095 L
1361.271 229.793 L
1371.555 267.978 L
1381.84 288.524 L
1392.124 302.576 L
1402.409 297.604 L
1412.693 282.85 L
1422.978 281.762 L
1433.262 265.84 L
1443.547 229.853 L
1453.831 205.371 L
1464.116 188.146 L
1474.4 202.991 L
1484.685 218.259 L
1494.969 218.343 L
1505.254 240.204 L
1515.538 271.229 L
1525.823 291.156 L
1536.107 301.985 L
1546.392 303.444 L
1556.676 298.656 L
1566.961 283.007 L
1577.245 268.17 L
1587.53 224.887 L
1597.814 202.894 L
1608.099 199.639 L
1618.383 175.428 L
1628.668 164.279 L
1638.952 165.587 L
1649.237 196.98 L
1659.521 253.143 L
1669.806 266.454 L
1680.09 295.128 L
1690.375 293.097 L
1700.659 293.815 L
1710.944 285.982 L
1721.228 271.333 L
1731.513 258.413 L
1741.797 233.119 L
1752.082 208.382 L
1762.366 188.149 L
1772.651 169.571 L
1782.935 162.359 L
1793.22 170.87 L
1803.504 166.231 L
1813.789 176.403 L
1824.073 177.674 L
1834.358 203.689 L
1844.642 223.131 L
1854.927 201.569 L
1865.211 211.068 L
1875.496 211.008 L
1885.78 202.89 L
1896.065 210.948 L
1906.349 210.897 L
1916.634 213.585 L
1926.918 245.381 L
1937.203 252.922 L
1947.487 241.248 L
1957.772 296.704 L
1968.056 318.959 L
1978.341 298.816 L
1988.625 296.718 L
1998.91 276.932 L
2009.194 247.306 L
2019.479 233.64 L
2029.763 228.882 L
2040.048 207.672 L
2047.209 210.912 L
S
GR
GS
1 0.302 0.302 RC
1 LJ
2 LW
N
293.791 180.761 M
301.967 212.745 L
312.252 227.823 L
322.536 242.995 L
332.821 276.783 L
343.105 307.251 L
353.39 322.4 L
363.674 325.342 L
373.959 300.364 L
384.243 287.175 L
394.528 267.067 L
404.812 242.524 L
415.097 218.861 L
425.381 191.694 L
435.666 170.018 L
445.95 184.526 L
456.235 170.823 L
466.519 163.594 L
476.804 192.807 L
487.088 202.264 L
497.373 198.458 L
507.657 195.874 L
517.942 194.201 L
528.226 207.11 L
538.511 208.755 L
548.795 196.407 L
559.08 201.445 L
569.364 190.394 L
579.649 211.775 L
589.933 231.409 L
600.218 246.354 L
610.502 254.816 L
620.787 300.021 L
631.071 296.575 L
641.356 301.72 L
651.64 294.173 L
661.925 282.584 L
672.209 283.284 L
682.494 252.331 L
692.778 202.586 L
703.063 211.702 L
713.347 219.123 L
723.632 215.387 L
733.916 235.538 L
744.201 246.204 L
754.485 254.801 L
764.77 302.498 L
775.054 309.225 L
785.339 315.491 L
795.623 319.92 L
805.908 285.948 L
816.192 264.553 L
826.477 258.875 L
836.761 237.252 L
847.046 204.37 L
857.33 195.031 L
867.615 199.972 L
877.899 209.884 L
888.184 220.11 L
898.468 242.931 L
908.753 268.756 L
919.037 296.213 L
929.322 309.054 L
939.606 321.057 L
949.891 311.149 L
960.175 285.058 L
970.46 275.294 L
980.744 261.914 L
991.029 223.568 L
1001.313 214.421 L
1011.598 197.553 L
1021.882 208.42 L
1032.167 228.321 L
1042.451 233.616 L
1052.736 263.982 L
1063.02 299.561 L
1073.305 334.2 L
1083.589 315.895 L
1093.874 329.183 L
1104.158 305.46 L
1114.443 277.409 L
1124.727 260.325 L
1135.012 242.395 L
1145.296 211.94 L
1155.581 190.38 L
1165.865 169.909 L
1176.15 181.737 L
1186.434 198.412 L
1196.719 224.097 L
1207.003 248.628 L
1217.288 285.436 L
1227.572 311.678 L
1237.857 310.611 L
1248.141 325.105 L
1258.426 298.354 L
1268.71 286.347 L
1278.995 260.046 L
1289.279 235.34 L
1299.564 206.752 L
1309.848 200.879 L
1320.133 174.619 L
1330.417 173.998 L
1340.702 172.921 L
1350.986 190.095 L
1361.271 229.793 L
1371.555 267.978 L
1381.84 288.524 L
1392.124 302.576 L
1402.409 297.604 L
1412.693 282.85 L
1422.978 281.762 L
1433.262 265.84 L
1443.547 229.853 L
1453.831 205.371 L
1464.116 188.146 L
1474.4 202.991 L
1484.685 218.259 L
1494.969 218.343 L
1505.254 240.204 L
1515.538 271.229 L
1525.823 291.156 L
1536.107 301.985 L
1546.392 303.444 L
1556.676 298.656 L
1566.961 283.007 L
1577.245 268.17 L
1587.53 224.887 L
1597.814 202.894 L
1608.099 199.639 L
1618.383 175.428 L
1628.668 164.279 L
1638.952 165.587 L
1649.237 196.98 L
1659.521 253.143 L
1669.806 266.454 L
1680.09 295.128 L
1690.375 293.097 L
1700.659 293.815 L
1710.944 285.982 L
1721.228 271.333 L
1731.513 258.413 L
1741.797 233.119 L
1752.082 208.382 L
1762.366 188.149 L
1772.651 169.571 L
1782.935 162.359 L
1793.22 170.87 L
1803.504 166.231 L
1813.789 176.403 L
1824.073 177.674 L
1834.358 203.689 L
1844.642 223.131 L
1854.927 201.569 L
1865.211 211.068 L
1875.496 211.008 L
1885.78 202.89 L
1896.065 210.948 L
1906.349 210.897 L
1916.634 213.585 L
1926.918 245.381 L
1937.203 252.922 L
1947.487 241.248 L
1957.772 296.704 L
1968.056 318.959 L
1978.341 298.816 L
1988.625 296.718 L
1998.91 276.932 L
2009.194 247.306 L
2019.479 233.64 L
2029.763 228.882 L
2040.048 207.672 L
2047.209 210.912 L
S
GR
GS
1 GC
N
1954.5 159 M
1954.5 45.5 L
2037 45.5 L
2037 159 L
cp
f
GR
GS
[1 0 0 1 1991.5 58.25] CT
/Helvetica 18 F
GS
[1 0 0 1 0 0] CT
0 7 moveto 
1 -1 scale
(1) t 
GR
GR
GS
0.8 GC
1 LJ
2 LW
N
1958.5 58.25 M
1988.5 58.25 L
S
GR
GS
[1 0 0 1 1991.5 80.25] CT
/Helvetica 18 F
GS
[1 0 0 1 0 0] CT
0 7 moveto 
1 -1 scale
(5) t 
GR
GR
GS
0.702 GC
1 LJ
2 LW
N
1958.5 80.25 M
1988.5 80.25 L
S
GR
GS
[1 0 0 1 1991.5 102.25] CT
/Helvetica 18 F
GS
[1 0 0 1 0 0] CT
0 7 moveto 
1 -1 scale
(4) t 
GR
GR
GS
0.6 GC
1 LJ
2 LW
N
1958.5 102.25 M
1988.5 102.25 L
S
GR
GS
[1 0 0 1 1991.5 124.25] CT
/Helvetica 18 F
GS
[1 0 0 1 0 0] CT
0 7 moveto 
1 -1 scale
(3) t 
GR
GR
GS
0.502 GC
1 LJ
2 LW
N
1958.5 124.25 M
1988.5 124.25 L
S
GR
GS
[1 0 0 1 1991.5 146.25] CT
/Helvetica 18 F
GS
[1 0 0 1 0 0] CT
0 7 moveto 
1 -1 scale
(DMN) t 
GR
GR
GS
1 0.8 0.8 RC
1 LJ
2 LW
N
1958.5 146.25 M
1988.5 146.25 L
S
GR
GS
0.149 GC
10.0 ML
0.5 LW
N
1954.5 159 M
1954.5 45.5 L
2037 45.5 L
2037 159 L
cp
S
GR
%%Trailer
%%Pages: 1
%%EOF
