%!PS-Adobe-3.0 EPSF-3.0
%%Creator: (MATLAB, The Mathworks, Inc. Version 9.8.0.1323502 \(R2020a\). Operating System: Mac OS X)
%%Title: /Users/kosciessa/Desktop/tardis/LNDG/stateswitch/stsw_eeg_task/aperiodic/figures/b_1_f_rotation_v3_YA.eps
%%CreationDate: 2022-02-16T14:50:12
%%Pages: (atend)
%%BoundingBox:    13     0   465   282
%%LanguageLevel: 3
%%EndComments
%%BeginProlog
%%BeginResource: procset (Apache XML Graphics Std ProcSet) 1.2 0
%%Version: 1.2 0
%%Copyright: (Copyright 2001-2003,2010 The Apache Software Foundation. License terms: http://www.apache.org/licenses/LICENSE-2.0)
/bd{bind def}bind def
/ld{load def}bd
/GR/grestore ld
/GS/gsave ld
/RM/rmoveto ld
/C/curveto ld
/t/show ld
/L/lineto ld
/ML/setmiterlimit ld
/CT/concat ld
/f/fill ld
/N/newpath ld
/S/stroke ld
/CC/setcmykcolor ld
/A/ashow ld
/cp/closepath ld
/RC/setrgbcolor ld
/LJ/setlinejoin ld
/GC/setgray ld
/LW/setlinewidth ld
/M/moveto ld
/re {4 2 roll M
1 index 0 rlineto
0 exch rlineto
neg 0 rlineto
cp } bd
/_ctm matrix def
/_tm matrix def
/BT { _ctm currentmatrix pop matrix _tm copy pop 0 0 moveto } bd
/ET { _ctm setmatrix } bd
/iTm { _ctm setmatrix _tm concat } bd
/Tm { _tm astore pop iTm 0 0 moveto } bd
/ux 0.0 def
/uy 0.0 def
/F {
  /Tp exch def
  /Tf exch def
  Tf findfont Tp scalefont setfont
  /cf Tf def  /cs Tp def
} bd
/ULS {currentpoint /uy exch def /ux exch def} bd
/ULE {
  /Tcx currentpoint pop def
  gsave
  newpath
  cf findfont cs scalefont dup
  /FontMatrix get 0 get /Ts exch def /FontInfo get dup
  /UnderlinePosition get Ts mul /To exch def
  /UnderlineThickness get Ts mul /Tt exch def
  ux uy To add moveto  Tcx uy To add lineto
  Tt setlinewidth stroke
  grestore
} bd
/OLE {
  /Tcx currentpoint pop def
  gsave
  newpath
  cf findfont cs scalefont dup
  /FontMatrix get 0 get /Ts exch def /FontInfo get dup
  /UnderlinePosition get Ts mul /To exch def
  /UnderlineThickness get Ts mul /Tt exch def
  ux uy To add cs add moveto Tcx uy To add cs add lineto
  Tt setlinewidth stroke
  grestore
} bd
/SOE {
  /Tcx currentpoint pop def
  gsave
  newpath
  cf findfont cs scalefont dup
  /FontMatrix get 0 get /Ts exch def /FontInfo get dup
  /UnderlinePosition get Ts mul /To exch def
  /UnderlineThickness get Ts mul /Tt exch def
  ux uy To add cs 10 mul 26 idiv add moveto Tcx uy To add cs 10 mul 26 idiv add lineto
  Tt setlinewidth stroke
  grestore
} bd
/QT {
/Y22 exch store
/X22 exch store
/Y21 exch store
/X21 exch store
currentpoint
/Y21 load 2 mul add 3 div exch
/X21 load 2 mul add 3 div exch
/X21 load 2 mul /X22 load add 3 div
/Y21 load 2 mul /Y22 load add 3 div
/X22 load /Y22 load curveto
} bd
/SSPD {
dup length /d exch dict def
{
/v exch def
/k exch def
currentpagedevice k known {
/cpdv currentpagedevice k get def
v cpdv ne {
/upd false def
/nullv v type /nulltype eq def
/nullcpdv cpdv type /nulltype eq def
nullv nullcpdv or
{
/upd true def
} {
/sametype v type cpdv type eq def
sametype {
v type /arraytype eq {
/vlen v length def
/cpdvlen cpdv length def
vlen cpdvlen eq {
0 1 vlen 1 sub {
/i exch def
/obj v i get def
/cpdobj cpdv i get def
obj cpdobj ne {
/upd true def
exit
} if
} for
} {
/upd true def
} ifelse
} {
v type /dicttype eq {
v {
/dv exch def
/dk exch def
/cpddv cpdv dk get def
dv cpddv ne {
/upd true def
exit
} if
} forall
} {
/upd true def
} ifelse
} ifelse
} if
} ifelse
upd true eq {
d k v put
} if
} if
} if
} forall
d length 0 gt {
d setpagedevice
} if
} bd
/RE { % /NewFontName [NewEncodingArray] /FontName RE -
  findfont dup length dict begin
  {
    1 index /FID ne
    {def} {pop pop} ifelse
  } forall
  /Encoding exch def
  /FontName 1 index def
  currentdict definefont pop
  end
} bind def
%%EndResource
%%BeginResource: procset (Apache XML Graphics EPS ProcSet) 1.0 0
%%Version: 1.0 0
%%Copyright: (Copyright 2002-2003 The Apache Software Foundation. License terms: http://www.apache.org/licenses/LICENSE-2.0)
/BeginEPSF { %def
/b4_Inc_state save def         % Save state for cleanup
/dict_count countdictstack def % Count objects on dict stack
/op_count count 1 sub def      % Count objects on operand stack
userdict begin                 % Push userdict on dict stack
/showpage { } def              % Redefine showpage, { } = null proc
0 setgray 0 setlinecap         % Prepare graphics state
1 setlinewidth 0 setlinejoin
10 setmiterlimit [ ] 0 setdash newpath
/languagelevel where           % If level not equal to 1 then
{pop languagelevel             % set strokeadjust and
1 ne                           % overprint to their defaults.
{false setstrokeadjust false setoverprint
} if
} if
} bd
/EndEPSF { %def
count op_count sub {pop} repeat            % Clean up stacks
countdictstack dict_count sub {end} repeat
b4_Inc_state restore
} bd
%%EndResource
%FOPBeginFontDict
%%IncludeResource: font Courier-Oblique
%%IncludeResource: font Courier-BoldOblique
%%IncludeResource: font Courier-Bold
%%IncludeResource: font ZapfDingbats
%%IncludeResource: font Symbol
%%IncludeResource: font Helvetica
%%IncludeResource: font Helvetica-Oblique
%%IncludeResource: font Helvetica-Bold
%%IncludeResource: font Helvetica-BoldOblique
%%IncludeResource: font Times-Roman
%%IncludeResource: font Times-Italic
%%IncludeResource: font Times-Bold
%%IncludeResource: font Times-BoldItalic
%%IncludeResource: font Courier
%FOPEndFontDict
%%BeginResource: encoding WinAnsiEncoding
/WinAnsiEncoding [
/.notdef /.notdef /.notdef /.notdef /.notdef
/.notdef /.notdef /.notdef /.notdef /.notdef
/.notdef /.notdef /.notdef /.notdef /.notdef
/.notdef /.notdef /.notdef /.notdef /.notdef
/.notdef /.notdef /.notdef /.notdef /.notdef
/.notdef /.notdef /.notdef /.notdef /.notdef
/.notdef /.notdef /space /exclam /quotedbl
/numbersign /dollar /percent /ampersand /quotesingle
/parenleft /parenright /asterisk /plus /comma
/hyphen /period /slash /zero /one
/two /three /four /five /six
/seven /eight /nine /colon /semicolon
/less /equal /greater /question /at
/A /B /C /D /E
/F /G /H /I /J
/K /L /M /N /O
/P /Q /R /S /T
/U /V /W /X /Y
/Z /bracketleft /backslash /bracketright /asciicircum
/underscore /quoteleft /a /b /c
/d /e /f /g /h
/i /j /k /l /m
/n /o /p /q /r
/s /t /u /v /w
/x /y /z /braceleft /bar
/braceright /asciitilde /bullet /Euro /bullet
/quotesinglbase /florin /quotedblbase /ellipsis /dagger
/daggerdbl /circumflex /perthousand /Scaron /guilsinglleft
/OE /bullet /Zcaron /bullet /bullet
/quoteleft /quoteright /quotedblleft /quotedblright /bullet
/endash /emdash /asciitilde /trademark /scaron
/guilsinglright /oe /bullet /zcaron /Ydieresis
/space /exclamdown /cent /sterling /currency
/yen /brokenbar /section /dieresis /copyright
/ordfeminine /guillemotleft /logicalnot /sfthyphen /registered
/macron /degree /plusminus /twosuperior /threesuperior
/acute /mu /paragraph /middot /cedilla
/onesuperior /ordmasculine /guillemotright /onequarter /onehalf
/threequarters /questiondown /Agrave /Aacute /Acircumflex
/Atilde /Adieresis /Aring /AE /Ccedilla
/Egrave /Eacute /Ecircumflex /Edieresis /Igrave
/Iacute /Icircumflex /Idieresis /Eth /Ntilde
/Ograve /Oacute /Ocircumflex /Otilde /Odieresis
/multiply /Oslash /Ugrave /Uacute /Ucircumflex
/Udieresis /Yacute /Thorn /germandbls /agrave
/aacute /acircumflex /atilde /adieresis /aring
/ae /ccedilla /egrave /eacute /ecircumflex
/edieresis /igrave /iacute /icircumflex /idieresis
/eth /ntilde /ograve /oacute /ocircumflex
/otilde /odieresis /divide /oslash /ugrave
/uacute /ucircumflex /udieresis /yacute /thorn
/ydieresis
] def
%%EndResource
%FOPBeginFontReencode
/Courier-Oblique findfont
dup length dict begin
  {1 index /FID ne {def} {pop pop} ifelse} forall
  /Encoding WinAnsiEncoding def
  currentdict
end
/Courier-Oblique exch definefont pop
/Courier-BoldOblique findfont
dup length dict begin
  {1 index /FID ne {def} {pop pop} ifelse} forall
  /Encoding WinAnsiEncoding def
  currentdict
end
/Courier-BoldOblique exch definefont pop
/Courier-Bold findfont
dup length dict begin
  {1 index /FID ne {def} {pop pop} ifelse} forall
  /Encoding WinAnsiEncoding def
  currentdict
end
/Courier-Bold exch definefont pop
/Helvetica findfont
dup length dict begin
  {1 index /FID ne {def} {pop pop} ifelse} forall
  /Encoding WinAnsiEncoding def
  currentdict
end
/Helvetica exch definefont pop
/Helvetica-Oblique findfont
dup length dict begin
  {1 index /FID ne {def} {pop pop} ifelse} forall
  /Encoding WinAnsiEncoding def
  currentdict
end
/Helvetica-Oblique exch definefont pop
/Helvetica-Bold findfont
dup length dict begin
  {1 index /FID ne {def} {pop pop} ifelse} forall
  /Encoding WinAnsiEncoding def
  currentdict
end
/Helvetica-Bold exch definefont pop
/Helvetica-BoldOblique findfont
dup length dict begin
  {1 index /FID ne {def} {pop pop} ifelse} forall
  /Encoding WinAnsiEncoding def
  currentdict
end
/Helvetica-BoldOblique exch definefont pop
/Times-Roman findfont
dup length dict begin
  {1 index /FID ne {def} {pop pop} ifelse} forall
  /Encoding WinAnsiEncoding def
  currentdict
end
/Times-Roman exch definefont pop
/Times-Italic findfont
dup length dict begin
  {1 index /FID ne {def} {pop pop} ifelse} forall
  /Encoding WinAnsiEncoding def
  currentdict
end
/Times-Italic exch definefont pop
/Times-Bold findfont
dup length dict begin
  {1 index /FID ne {def} {pop pop} ifelse} forall
  /Encoding WinAnsiEncoding def
  currentdict
end
/Times-Bold exch definefont pop
/Times-BoldItalic findfont
dup length dict begin
  {1 index /FID ne {def} {pop pop} ifelse} forall
  /Encoding WinAnsiEncoding def
  currentdict
end
/Times-BoldItalic exch definefont pop
/Courier findfont
dup length dict begin
  {1 index /FID ne {def} {pop pop} ifelse} forall
  /Encoding WinAnsiEncoding def
  currentdict
end
/Courier exch definefont pop
%FOPEndFontReencode
%%EndProlog
%%Page: 1 1
%%PageBoundingBox: 0 0 512 288
%%BeginPageSetup
[1 0 0 -1 0 288] CT
%%EndPageSetup
GS
1 GC
N
0 0 512 288 re
f
GR
GS
1 GC
N
0 0 512 288 re
f
GR
GS
1 GC
N
66.5 238 M
463.5 238 L
463.5 26.5 L
66.5 26.5 L
cp
f
GR
GS
0.149 GC
2 setlinecap
1 LJ
0.5 LW
N
66.5 238 M
463.5 238 L
S
GR
GS
0.149 GC
2 setlinecap
1 LJ
0.5 LW
N
66.5 238 M
66.5 234.03 L
S
GR
GS
0.149 GC
2 setlinecap
1 LJ
0.5 LW
N
170.974 238 M
170.974 234.03 L
S
GR
GS
0.149 GC
2 setlinecap
1 LJ
0.5 LW
N
275.447 238 M
275.447 234.03 L
S
GR
GS
0.149 GC
2 setlinecap
1 LJ
0.5 LW
N
379.921 238 M
379.921 234.03 L
S
GR
GS
[1 0 0 1 66.5 243.60001] CT
0.149 GC
/Helvetica 18 F
GS
[1 0 0 1 0 0] CT
-5.5 18 moveto 
1 -1 scale
(0) t 
GR
GR
GS
[1 0 0 1 170.97368 243.60001] CT
0.149 GC
/Helvetica 18 F
GS
[1 0 0 1 0 0] CT
-13 18 moveto 
1 -1 scale
(0.5) t 
GR
GR
GS
[1 0 0 1 275.44736 243.60001] CT
0.149 GC
/Helvetica 18 F
GS
[1 0 0 1 0 0] CT
-5.5 18 moveto 
1 -1 scale
(1) t 
GR
GR
GS
[1 0 0 1 379.92105 243.60001] CT
0.149 GC
/Helvetica 18 F
GS
[1 0 0 1 0 0] CT
-13 18 moveto 
1 -1 scale
(1.5) t 
GR
GR
GS
[1 0 0 1 265.00018 266.59998] CT
0.149 GC
/Helvetica 18 F
GS
[1 0 0 1 0 0] CT
-72.5 18 moveto 
1 -1 scale
(Frequency \(log10\)) t 
GR
GR
GS
0.149 GC
2 setlinecap
1 LJ
0.5 LW
N
66.5 238 M
66.5 26.5 L
S
GR
GS
0.149 GC
2 setlinecap
1 LJ
0.5 LW
N
66.5 238 M
70.47 238 L
S
GR
GS
0.149 GC
2 setlinecap
1 LJ
0.5 LW
N
66.5 177.571 M
70.47 177.571 L
S
GR
GS
0.149 GC
2 setlinecap
1 LJ
0.5 LW
N
66.5 117.143 M
70.47 117.143 L
S
GR
GS
0.149 GC
2 setlinecap
1 LJ
0.5 LW
N
66.5 56.714 M
70.47 56.714 L
S
GR
GS
[1 0 0 1 60.9 238] CT
0.149 GC
/Helvetica 18 F
GS
[1 0 0 1 0 0] CT
-28 7 moveto 
1 -1 scale
(-10) t 
GR
GR
GS
[1 0 0 1 60.9 177.57143] CT
0.149 GC
/Helvetica 18 F
GS
[1 0 0 1 0 0] CT
-18 7 moveto 
1 -1 scale
(-9) t 
GR
GR
GS
[1 0 0 1 60.9 117.14286] CT
0.149 GC
/Helvetica 18 F
GS
[1 0 0 1 0 0] CT
-18 7 moveto 
1 -1 scale
(-8) t 
GR
GR
GS
[1 0 0 1 60.9 56.71429] CT
0.149 GC
/Helvetica 18 F
GS
[1 0 0 1 0 0] CT
-18 7 moveto 
1 -1 scale
(-7) t 
GR
GR
GS
[0 -1 1 0 30.4 132.24988] CT
0.149 GC
/Helvetica 18 F
GS
[1 0 0 1 0 0] CT
-71 -4 moveto 
1 -1 scale
(Power \(log10; Hz\)) t 
GR
GR
GS
[1 0 0 1 265.00024 24.25531] CT
/Helvetica-Bold 18 F
GS
[1 0 0 1 0 0] CT
-159.5 -4 moveto 
1 -1 scale
(Divided attention induces 1/f rotation) t 
GR
GR
GS
0.754 0.86 0.922 RC
N
114.652 84.176 M
106.269 81.112 L
97.033 77.526 L
90.308 74.89 L
83.045 72.101 L
75.149 69.14 L
66.5 65.821 L
66.5 67.276 L
75.149 70.478 L
83.045 73.361 L
90.308 76.12 L
97.033 78.753 L
106.269 82.314 L
114.652 85.327 L
122.325 87.771 L
129.399 89.7 L
138.048 91.82 L
145.944 93.468 L
153.208 94.436 L
161.539 95.731 L
169.169 97.443 L
176.207 99.072 L
183.99 100.836 L
192.299 102.456 L
199.911 104.73 L
207.893 107.064 L
216.107 109.35 L
223.639 111.779 L
231.333 114.696 L
239.781 115.396 L
247.508 117.426 L
255.198 116.901 L
262.81 113.262 L
270.793 109.761 L
278.569 111.271 L
286.538 118.391 L
294.601 126.266 L
302.344 132.292 L
310.099 137.485 L
318.098 141.459 L
325.97 143.775 L
333.931 145.893 L
341.687 149.182 L
349.638 152.772 L
357.5 155.975 L
365.243 158.179 L
373.153 159.646 L
380.997 161.151 L
388.869 164.064 L
396.711 165.686 L
404.587 167.257 L
412.437 168.442 L
420.308 170.362 L
428.142 171.017 L
436.052 172.613 L
443.897 173.538 L
451.769 174.727 L
459.61 177.421 L
463.547 178.492 L
463.547 177.905 L
463.547 177.315 L
459.61 176.242 L
451.769 173.685 L
443.897 172.28 L
436.052 171.365 L
428.142 169.936 L
420.308 169.095 L
412.437 167.32 L
404.587 166.15 L
396.711 164.656 L
388.869 162.937 L
380.997 160.219 L
373.153 158.398 L
365.243 157.222 L
357.5 154.864 L
349.638 151.943 L
341.687 148.441 L
333.931 144.982 L
325.97 142.95 L
318.098 140.837 L
310.099 136.631 L
302.344 131.464 L
294.601 124.855 L
286.538 117.289 L
278.569 109.987 L
270.793 108.001 L
262.81 112.054 L
255.198 116.095 L
247.508 116.673 L
239.781 114.706 L
231.333 114.038 L
223.639 111.111 L
216.107 108.631 L
207.893 106.442 L
199.911 104.016 L
192.299 101.717 L
183.99 99.902 L
176.207 98.31 L
169.169 96.645 L
161.539 94.921 L
153.208 93.474 L
145.944 92.386 L
138.048 90.761 L
129.399 88.607 L
122.325 86.65 L
cp
f
GR
GS
0.561 0.749 0.859 RC
1 LJ
0.5 LW
N
66.5 67.276 M
75.149 70.478 L
83.045 73.361 L
90.308 76.12 L
97.033 78.753 L
106.269 82.314 L
114.652 85.327 L
122.325 87.771 L
129.399 89.7 L
138.048 91.82 L
145.944 93.468 L
153.208 94.436 L
161.539 95.731 L
169.169 97.443 L
176.207 99.072 L
183.99 100.836 L
192.299 102.456 L
199.911 104.73 L
207.893 107.064 L
216.107 109.35 L
223.639 111.779 L
231.333 114.696 L
239.781 115.396 L
247.508 117.426 L
255.198 116.901 L
262.81 113.262 L
270.793 109.761 L
278.569 111.271 L
286.538 118.391 L
294.601 126.266 L
302.344 132.292 L
310.099 137.485 L
318.098 141.459 L
325.97 143.775 L
333.931 145.893 L
341.687 149.182 L
349.638 152.772 L
357.5 155.975 L
365.243 158.179 L
373.153 159.646 L
380.997 161.151 L
388.869 164.064 L
396.711 165.686 L
404.587 167.257 L
412.437 168.442 L
420.308 170.362 L
428.142 171.017 L
436.052 172.613 L
443.897 173.538 L
451.769 174.727 L
459.61 177.421 L
463.547 178.492 L
S
GR
GS
0.561 0.749 0.859 RC
1 LJ
0.5 LW
N
66.5 65.821 M
75.149 69.14 L
83.045 72.101 L
90.308 74.89 L
97.033 77.526 L
106.269 81.112 L
114.652 84.176 L
122.325 86.65 L
129.399 88.607 L
138.048 90.761 L
145.944 92.386 L
153.208 93.474 L
161.539 94.921 L
169.169 96.645 L
176.207 98.31 L
183.99 99.902 L
192.299 101.717 L
199.911 104.016 L
207.893 106.442 L
216.107 108.631 L
223.639 111.111 L
231.333 114.038 L
239.781 114.706 L
247.508 116.673 L
255.198 116.095 L
262.81 112.054 L
270.793 108.001 L
278.569 109.987 L
286.538 117.289 L
294.601 124.855 L
302.344 131.464 L
310.099 136.631 L
318.098 140.837 L
325.97 142.95 L
333.931 144.982 L
341.687 148.441 L
349.638 151.943 L
357.5 154.864 L
365.243 157.222 L
373.153 158.398 L
380.997 160.219 L
388.869 162.937 L
396.711 164.656 L
404.587 166.15 L
412.437 167.32 L
420.308 169.095 L
428.142 169.936 L
436.052 171.365 L
443.897 172.28 L
451.769 173.685 L
459.61 176.242 L
463.547 177.315 L
S
GR
GS
0.02 0.443 0.69 RC
1 LJ
2 LW
N
66.5 66.548 M
75.149 69.809 L
83.045 72.731 L
90.308 75.505 L
97.033 78.14 L
106.269 81.713 L
114.652 84.751 L
122.325 87.211 L
129.399 89.153 L
138.048 91.29 L
145.944 92.927 L
153.208 93.955 L
161.539 95.326 L
169.169 97.044 L
176.207 98.691 L
183.99 100.369 L
192.299 102.086 L
199.911 104.373 L
207.893 106.753 L
216.107 108.99 L
223.639 111.445 L
231.333 114.367 L
239.781 115.051 L
247.508 117.05 L
255.198 116.498 L
262.81 112.658 L
270.793 108.881 L
278.569 110.629 L
286.538 117.84 L
294.601 125.56 L
302.344 131.878 L
310.099 137.058 L
318.098 141.148 L
325.97 143.363 L
333.931 145.437 L
341.687 148.812 L
349.638 152.357 L
357.5 155.42 L
365.243 157.701 L
373.153 159.022 L
380.997 160.685 L
388.869 163.501 L
396.711 165.171 L
404.587 166.704 L
412.437 167.881 L
420.308 169.729 L
428.142 170.476 L
436.052 171.989 L
443.897 172.909 L
451.769 174.206 L
459.61 176.831 L
463.547 177.904 L
S
GR
GS
0.948 0.749 0.781 RC
N
106.269 84.141 M
114.652 86.666 L
122.325 88.621 L
129.399 90.237 L
138.048 92.208 L
145.944 93.895 L
153.208 95.19 L
161.539 96.649 L
169.169 98.704 L
176.207 100.338 L
183.99 101.322 L
192.299 102.69 L
199.911 104.979 L
207.893 107.626 L
216.107 109.697 L
223.639 112.517 L
231.333 114.903 L
239.781 117.091 L
247.508 118.837 L
255.198 118.535 L
262.81 116.052 L
270.793 114.394 L
278.569 113.634 L
286.538 121.293 L
294.601 128.303 L
302.344 135.011 L
310.099 138.637 L
318.098 142.745 L
325.97 145.155 L
333.931 146.523 L
341.687 148.311 L
349.638 152.109 L
357.5 155.709 L
365.243 157.216 L
373.153 158.17 L
380.997 161.336 L
388.869 161.989 L
396.711 163.27 L
404.587 165.067 L
412.437 166.591 L
420.308 167.653 L
428.142 168.156 L
436.052 169.821 L
443.897 170.958 L
451.769 172.709 L
459.61 175.283 L
463.547 176.005 L
463.547 175.57 L
463.547 175.086 L
459.61 174.315 L
451.769 171.814 L
443.897 170.11 L
436.052 168.993 L
428.142 167.171 L
420.308 166.639 L
412.437 165.739 L
404.587 164.087 L
396.711 162.25 L
388.869 161.139 L
380.997 160.421 L
373.153 157.225 L
365.243 156.321 L
357.5 154.914 L
349.638 151.244 L
341.687 147.454 L
333.931 145.852 L
325.97 144.299 L
318.098 141.895 L
310.099 137.823 L
302.344 134.353 L
294.601 127.41 L
286.538 120.52 L
278.569 112.386 L
270.793 113.265 L
262.81 115.211 L
255.198 117.786 L
247.508 118.272 L
239.781 116.306 L
231.333 114.197 L
223.639 111.834 L
216.107 109.036 L
207.893 106.929 L
199.911 104.238 L
192.299 102.001 L
183.99 100.686 L
176.207 99.605 L
169.169 97.888 L
161.539 96.028 L
153.208 94.478 L
145.944 93.153 L
138.048 91.457 L
129.399 89.414 L
122.325 87.695 L
114.652 85.687 L
106.269 83.175 L
97.033 80.033 L
90.308 77.645 L
83.045 75.1 L
75.149 72.343 L
66.5 69.066 L
66.5 70.102 L
75.149 73.355 L
83.045 76.09 L
90.308 78.616 L
97.033 80.992 L
cp
f
GR
GS
0.906 0.549 0.608 RC
1 LJ
0.5 LW
N
66.5 70.102 M
75.149 73.355 L
83.045 76.09 L
90.308 78.616 L
97.033 80.992 L
106.269 84.141 L
114.652 86.666 L
122.325 88.621 L
129.399 90.237 L
138.048 92.208 L
145.944 93.895 L
153.208 95.19 L
161.539 96.649 L
169.169 98.704 L
176.207 100.338 L
183.99 101.322 L
192.299 102.69 L
199.911 104.979 L
207.893 107.626 L
216.107 109.697 L
223.639 112.517 L
231.333 114.903 L
239.781 117.091 L
247.508 118.837 L
255.198 118.535 L
262.81 116.052 L
270.793 114.394 L
278.569 113.634 L
286.538 121.293 L
294.601 128.303 L
302.344 135.011 L
310.099 138.637 L
318.098 142.745 L
325.97 145.155 L
333.931 146.523 L
341.687 148.311 L
349.638 152.109 L
357.5 155.709 L
365.243 157.216 L
373.153 158.17 L
380.997 161.336 L
388.869 161.989 L
396.711 163.27 L
404.587 165.067 L
412.437 166.591 L
420.308 167.653 L
428.142 168.156 L
436.052 169.821 L
443.897 170.958 L
451.769 172.709 L
459.61 175.283 L
463.547 176.005 L
S
GR
GS
0.906 0.549 0.608 RC
1 LJ
0.5 LW
N
66.5 69.066 M
75.149 72.343 L
83.045 75.1 L
90.308 77.645 L
97.033 80.033 L
106.269 83.175 L
114.652 85.687 L
122.325 87.695 L
129.399 89.414 L
138.048 91.457 L
145.944 93.153 L
153.208 94.478 L
161.539 96.028 L
169.169 97.888 L
176.207 99.605 L
183.99 100.686 L
192.299 102.001 L
199.911 104.238 L
207.893 106.929 L
216.107 109.036 L
223.639 111.834 L
231.333 114.197 L
239.781 116.306 L
247.508 118.272 L
255.198 117.786 L
262.81 115.211 L
270.793 113.265 L
278.569 112.386 L
286.538 120.52 L
294.601 127.41 L
302.344 134.353 L
310.099 137.823 L
318.098 141.895 L
325.97 144.299 L
333.931 145.852 L
341.687 147.454 L
349.638 151.244 L
357.5 154.914 L
365.243 156.321 L
373.153 157.225 L
380.997 160.421 L
388.869 161.139 L
396.711 162.25 L
404.587 164.087 L
412.437 165.739 L
420.308 166.639 L
428.142 167.171 L
436.052 168.993 L
443.897 170.11 L
451.769 171.814 L
459.61 174.315 L
463.547 175.086 L
S
GR
GS
0.792 0 0.125 RC
1 LJ
2 LW
N
66.5 69.584 M
75.149 72.849 L
83.045 75.595 L
90.308 78.13 L
97.033 80.513 L
106.269 83.658 L
114.652 86.176 L
122.325 88.158 L
129.399 89.825 L
138.048 91.833 L
145.944 93.524 L
153.208 94.834 L
161.539 96.339 L
169.169 98.296 L
176.207 99.971 L
183.99 101.004 L
192.299 102.345 L
199.911 104.608 L
207.893 107.278 L
216.107 109.367 L
223.639 112.175 L
231.333 114.55 L
239.781 116.698 L
247.508 118.554 L
255.198 118.161 L
262.81 115.631 L
270.793 113.83 L
278.569 113.01 L
286.538 120.907 L
294.601 127.856 L
302.344 134.682 L
310.099 138.23 L
318.098 142.32 L
325.97 144.727 L
333.931 146.188 L
341.687 147.883 L
349.638 151.677 L
357.5 155.311 L
365.243 156.768 L
373.153 157.698 L
380.997 160.878 L
388.869 161.564 L
396.711 162.76 L
404.587 164.577 L
412.437 166.165 L
420.308 167.146 L
428.142 167.664 L
436.052 169.407 L
443.897 170.534 L
451.769 172.262 L
459.61 174.799 L
463.547 175.546 L
S
GR
GS
[1 0 0 1 375.5 195.75] CT
/Helvetica 18 F
GS
[1 0 0 1 0 0] CT
0 7 moveto 
1 -1 scale
(1 Target) t 
GR
GR
GS
0.02 0.443 0.69 RC
1 LJ
2 LW
N
342.5 195.75 M
372.5 195.75 L
S
GR
GS
[1 0 0 1 375.5 217.75] CT
/Helvetica 18 F
GS
[1 0 0 1 0 0] CT
0 7 moveto 
1 -1 scale
(4 Targets) t 
GR
GR
GS
0.792 0 0.125 RC
1 LJ
2 LW
N
342.5 217.75 M
372.5 217.75 L
S
GR
GS
1 GC
N
112.5 201.5 M
215 201.5 L
215 144 L
112.5 144 L
cp
f
GR
GS
0.149 GC
2 setlinecap
1 LJ
0.5 LW
N
112.5 201.5 M
215 201.5 L
S
GR
GS
0.149 GC
2 setlinecap
1 LJ
0.5 LW
N
112.5 201.5 M
112.5 200.475 L
S
GR
GS
0.149 GC
2 setlinecap
1 LJ
0.5 LW
N
163.75 201.5 M
163.75 200.475 L
S
GR
GS
0.149 GC
2 setlinecap
1 LJ
0.5 LW
N
215 201.5 M
215 200.475 L
S
GR
GS
[1 0 0 1 112.5 206.30002] CT
0.149 GC
/Helvetica 14 F
GS
[1 0 0 1 0 0] CT
-4 14 moveto 
1 -1 scale
(0) t 
GR
GR
GS
[1 0 0 1 163.75 206.30002] CT
0.149 GC
/Helvetica 14 F
GS
[1 0 0 1 0 0] CT
-14 14 moveto 
1 -1 scale
(0.05) t 
GR
GR
GS
[1 0 0 1 215 206.30002] CT
0.149 GC
/Helvetica 14 F
GS
[1 0 0 1 0 0] CT
-10 14 moveto 
1 -1 scale
(0.1) t 
GR
GR
GS
0.149 GC
2 setlinecap
1 LJ
0.5 LW
N
112.5 201.5 M
112.5 144 L
S
GR
GS
0.149 GC
2 setlinecap
1 LJ
0.5 LW
N
112.5 201.5 M
113.525 201.5 L
S
GR
GS
0.149 GC
2 setlinecap
1 LJ
0.5 LW
N
112.5 172.75 M
113.525 172.75 L
S
GR
GS
0.149 GC
2 setlinecap
1 LJ
0.5 LW
N
112.5 144 M
113.525 144 L
S
GR
GS
[1 0 0 1 107.7 201.50006] CT
0.149 GC
/Helvetica 14 F
GS
[1 0 0 1 0 0] CT
-25 5.5 moveto 
1 -1 scale
(-7.3) t 
GR
GR
GS
[1 0 0 1 107.7 172.74994] CT
0.149 GC
/Helvetica 14 F
GS
[1 0 0 1 0 0] CT
-25 5.5 moveto 
1 -1 scale
(-7.2) t 
GR
GR
GS
[1 0 0 1 107.7 143.99997] CT
0.149 GC
/Helvetica 14 F
GS
[1 0 0 1 0 0] CT
-25 5.5 moveto 
1 -1 scale
(-7.1) t 
GR
GR
GS
0.754 0.86 0.922 RC
N
212.817 201.507 M
215.012 201.507 L
215.012 198.809 L
215.012 196.407 L
193.661 188.456 L
154.928 174.369 L
112.5 158.575 L
112.5 165.497 L
154.928 180.732 L
193.661 194.449 L
cp
f
GR
GS
0.561 0.749 0.859 RC
1 LJ
0.5 LW
N
112.5 165.497 M
154.928 180.732 L
193.661 194.449 L
212.817 201.507 L
S
GR
GS
0.561 0.749 0.859 RC
1 LJ
0.5 LW
N
112.5 158.575 M
154.928 174.369 L
193.661 188.456 L
215.012 196.407 L
S
GR
GS
0.02 0.443 0.69 RC
1 LJ
N
112.5 162.036 M
154.928 177.55 L
193.661 191.453 L
215.012 199.361 L
S
GR
GS
0.948 0.749 0.781 RC
N
154.928 189.608 M
112.5 174.016 L
112.5 178.943 L
154.928 194.422 L
176.015 201.507 L
187.986 201.507 L
190.069 201.507 L
cp
f
GR
GS
0.906 0.549 0.608 RC
1 LJ
0.5 LW
N
112.5 178.943 M
154.928 194.422 L
176.015 201.507 L
S
GR
GS
0.906 0.549 0.608 RC
1 LJ
0.5 LW
N
112.5 174.016 M
154.928 189.608 L
190.069 201.507 L
S
GR
GS
0.792 0 0.125 RC
1 LJ
N
112.5 176.48 M
154.928 192.015 L
183.07 201.507 L
S
GR
GS
1 GC
N
348 101 M
450.5 101 L
450.5 43 L
348 43 L
cp
f
GR
GS
0.149 GC
2 setlinecap
1 LJ
0.5 LW
N
348 101 M
450.5 101 L
S
GR
GS
0.149 GC
2 setlinecap
1 LJ
0.5 LW
N
348 101 M
348 99.975 L
S
GR
GS
0.149 GC
2 setlinecap
1 LJ
0.5 LW
N
382.167 101 M
382.167 99.975 L
S
GR
GS
0.149 GC
2 setlinecap
1 LJ
0.5 LW
N
416.333 101 M
416.333 99.975 L
S
GR
GS
[1 0 0 1 348 105.79987] CT
0.149 GC
/Helvetica 14 F
GS
[1 0 0 1 0 0] CT
-14 14 moveto 
1 -1 scale
(1.75) t 
GR
GR
GS
[1 0 0 1 382.16663 105.79987] CT
0.149 GC
/Helvetica 14 F
GS
[1 0 0 1 0 0] CT
-10 14 moveto 
1 -1 scale
(1.8) t 
GR
GR
GS
[1 0 0 1 416.33334 105.79987] CT
0.149 GC
/Helvetica 14 F
GS
[1 0 0 1 0 0] CT
-14 14 moveto 
1 -1 scale
(1.85) t 
GR
GR
GS
0.149 GC
2 setlinecap
1 LJ
0.5 LW
N
348 101 M
348 43 L
S
GR
GS
0.149 GC
2 setlinecap
1 LJ
0.5 LW
N
348 90.259 M
349.025 90.259 L
S
GR
GS
0.149 GC
2 setlinecap
1 LJ
0.5 LW
N
348 68.778 M
349.025 68.778 L
S
GR
GS
0.149 GC
2 setlinecap
1 LJ
0.5 LW
N
348 47.296 M
349.025 47.296 L
S
GR
GS
[1 0 0 1 343.19998 90.25934] CT
0.149 GC
/Helvetica 14 F
GS
[1 0 0 1 0 0] CT
-25 5.5 moveto 
1 -1 scale
(-9.1) t 
GR
GR
GS
[1 0 0 1 343.19998 68.77778] CT
0.149 GC
/Helvetica 14 F
GS
[1 0 0 1 0 0] CT
-14 5.5 moveto 
1 -1 scale
(-9) t 
GR
GR
GS
[1 0 0 1 343.19998 47.29622] CT
0.149 GC
/Helvetica 14 F
GS
[1 0 0 1 0 0] CT
-25 5.5 moveto 
1 -1 scale
(-8.9) t 
GR
GR
GS
0.754 0.86 0.922 RC
N
360.736 51.15 M
386.39 54.439 L
412.135 58.666 L
437.779 68.241 L
450.512 72.007 L
450.512 69.943 L
450.512 67.825 L
437.779 64.053 L
412.135 54.963 L
386.39 49.966 L
360.736 46.716 L
347.988 44.211 L
347.988 46.106 L
347.988 48.354 L
cp
f
GR
GS
0.561 0.749 0.859 RC
1 LJ
0.5 LW
N
347.988 48.354 M
360.736 51.15 L
386.39 54.439 L
412.135 58.666 L
437.779 68.241 L
450.512 72.007 L
S
GR
GS
0.561 0.749 0.859 RC
1 LJ
0.5 LW
N
347.988 44.211 M
360.736 46.716 L
386.39 49.966 L
412.135 54.963 L
437.779 64.053 L
450.512 67.825 L
S
GR
GS
0.02 0.443 0.69 RC
1 LJ
N
347.988 46.283 M
360.736 48.933 L
386.39 52.203 L
412.135 56.815 L
437.779 66.147 L
450.512 69.916 L
S
GR
GS
0.948 0.749 0.781 RC
N
412.135 51.493 M
437.779 60.643 L
450.512 63.181 L
450.512 61.653 L
450.512 59.913 L
437.779 57.203 L
412.135 48.311 L
389.528 42.993 L
386.39 42.993 L
371.943 42.993 L
386.39 45.269 L
cp
f
GR
GS
0.906 0.549 0.608 RC
1 LJ
0.5 LW
N
371.943 42.993 M
386.39 45.269 L
412.135 51.493 L
437.779 60.643 L
450.512 63.181 L
S
GR
GS
0.906 0.549 0.608 RC
1 LJ
0.5 LW
N
389.528 42.993 M
412.135 48.311 L
437.779 57.203 L
450.512 59.913 L
S
GR
GS
0.792 0 0.125 RC
1 LJ
N
381.468 42.993 M
386.39 43.762 L
412.135 49.902 L
437.779 58.923 L
450.512 61.547 L
S
GR
%%Trailer
%%Pages: 1
%%EOF
