%!PS-Adobe-3.0 EPSF-3.0
%%Creator: (MATLAB, The Mathworks, Inc. Version 9.8.0.1323502 \(R2020a\). Operating System: Mac OS X)
%%Title: /Users/kosciessa/Desktop/tardis/LNDG/stateswitch/stsw_eeg_task/aperiodic/figures/b_1_f_rotation_v3_OA.eps
%%CreationDate: 2022-02-16T14:44:34
%%Pages: (atend)
%%BoundingBox:    13     0   465   267
%%LanguageLevel: 3
%%EndComments
%%BeginProlog
%%BeginResource: procset (Apache XML Graphics Std ProcSet) 1.2 0
%%Version: 1.2 0
%%Copyright: (Copyright 2001-2003,2010 The Apache Software Foundation. License terms: http://www.apache.org/licenses/LICENSE-2.0)
/bd{bind def}bind def
/ld{load def}bd
/GR/grestore ld
/GS/gsave ld
/RM/rmoveto ld
/C/curveto ld
/t/show ld
/L/lineto ld
/ML/setmiterlimit ld
/CT/concat ld
/f/fill ld
/N/newpath ld
/S/stroke ld
/CC/setcmykcolor ld
/A/ashow ld
/cp/closepath ld
/RC/setrgbcolor ld
/LJ/setlinejoin ld
/GC/setgray ld
/LW/setlinewidth ld
/M/moveto ld
/re {4 2 roll M
1 index 0 rlineto
0 exch rlineto
neg 0 rlineto
cp } bd
/_ctm matrix def
/_tm matrix def
/BT { _ctm currentmatrix pop matrix _tm copy pop 0 0 moveto } bd
/ET { _ctm setmatrix } bd
/iTm { _ctm setmatrix _tm concat } bd
/Tm { _tm astore pop iTm 0 0 moveto } bd
/ux 0.0 def
/uy 0.0 def
/F {
  /Tp exch def
  /Tf exch def
  Tf findfont Tp scalefont setfont
  /cf Tf def  /cs Tp def
} bd
/ULS {currentpoint /uy exch def /ux exch def} bd
/ULE {
  /Tcx currentpoint pop def
  gsave
  newpath
  cf findfont cs scalefont dup
  /FontMatrix get 0 get /Ts exch def /FontInfo get dup
  /UnderlinePosition get Ts mul /To exch def
  /UnderlineThickness get Ts mul /Tt exch def
  ux uy To add moveto  Tcx uy To add lineto
  Tt setlinewidth stroke
  grestore
} bd
/OLE {
  /Tcx currentpoint pop def
  gsave
  newpath
  cf findfont cs scalefont dup
  /FontMatrix get 0 get /Ts exch def /FontInfo get dup
  /UnderlinePosition get Ts mul /To exch def
  /UnderlineThickness get Ts mul /Tt exch def
  ux uy To add cs add moveto Tcx uy To add cs add lineto
  Tt setlinewidth stroke
  grestore
} bd
/SOE {
  /Tcx currentpoint pop def
  gsave
  newpath
  cf findfont cs scalefont dup
  /FontMatrix get 0 get /Ts exch def /FontInfo get dup
  /UnderlinePosition get Ts mul /To exch def
  /UnderlineThickness get Ts mul /Tt exch def
  ux uy To add cs 10 mul 26 idiv add moveto Tcx uy To add cs 10 mul 26 idiv add lineto
  Tt setlinewidth stroke
  grestore
} bd
/QT {
/Y22 exch store
/X22 exch store
/Y21 exch store
/X21 exch store
currentpoint
/Y21 load 2 mul add 3 div exch
/X21 load 2 mul add 3 div exch
/X21 load 2 mul /X22 load add 3 div
/Y21 load 2 mul /Y22 load add 3 div
/X22 load /Y22 load curveto
} bd
/SSPD {
dup length /d exch dict def
{
/v exch def
/k exch def
currentpagedevice k known {
/cpdv currentpagedevice k get def
v cpdv ne {
/upd false def
/nullv v type /nulltype eq def
/nullcpdv cpdv type /nulltype eq def
nullv nullcpdv or
{
/upd true def
} {
/sametype v type cpdv type eq def
sametype {
v type /arraytype eq {
/vlen v length def
/cpdvlen cpdv length def
vlen cpdvlen eq {
0 1 vlen 1 sub {
/i exch def
/obj v i get def
/cpdobj cpdv i get def
obj cpdobj ne {
/upd true def
exit
} if
} for
} {
/upd true def
} ifelse
} {
v type /dicttype eq {
v {
/dv exch def
/dk exch def
/cpddv cpdv dk get def
dv cpddv ne {
/upd true def
exit
} if
} forall
} {
/upd true def
} ifelse
} ifelse
} if
} ifelse
upd true eq {
d k v put
} if
} if
} if
} forall
d length 0 gt {
d setpagedevice
} if
} bd
/RE { % /NewFontName [NewEncodingArray] /FontName RE -
  findfont dup length dict begin
  {
    1 index /FID ne
    {def} {pop pop} ifelse
  } forall
  /Encoding exch def
  /FontName 1 index def
  currentdict definefont pop
  end
} bind def
%%EndResource
%%BeginResource: procset (Apache XML Graphics EPS ProcSet) 1.0 0
%%Version: 1.0 0
%%Copyright: (Copyright 2002-2003 The Apache Software Foundation. License terms: http://www.apache.org/licenses/LICENSE-2.0)
/BeginEPSF { %def
/b4_Inc_state save def         % Save state for cleanup
/dict_count countdictstack def % Count objects on dict stack
/op_count count 1 sub def      % Count objects on operand stack
userdict begin                 % Push userdict on dict stack
/showpage { } def              % Redefine showpage, { } = null proc
0 setgray 0 setlinecap         % Prepare graphics state
1 setlinewidth 0 setlinejoin
10 setmiterlimit [ ] 0 setdash newpath
/languagelevel where           % If level not equal to 1 then
{pop languagelevel             % set strokeadjust and
1 ne                           % overprint to their defaults.
{false setstrokeadjust false setoverprint
} if
} if
} bd
/EndEPSF { %def
count op_count sub {pop} repeat            % Clean up stacks
countdictstack dict_count sub {end} repeat
b4_Inc_state restore
} bd
%%EndResource
%FOPBeginFontDict
%%IncludeResource: font Courier-Oblique
%%IncludeResource: font Courier-BoldOblique
%%IncludeResource: font Courier-Bold
%%IncludeResource: font ZapfDingbats
%%IncludeResource: font Symbol
%%IncludeResource: font Helvetica
%%IncludeResource: font Helvetica-Oblique
%%IncludeResource: font Helvetica-Bold
%%IncludeResource: font Helvetica-BoldOblique
%%IncludeResource: font Times-Roman
%%IncludeResource: font Times-Italic
%%IncludeResource: font Times-Bold
%%IncludeResource: font Times-BoldItalic
%%IncludeResource: font Courier
%FOPEndFontDict
%%BeginResource: encoding WinAnsiEncoding
/WinAnsiEncoding [
/.notdef /.notdef /.notdef /.notdef /.notdef
/.notdef /.notdef /.notdef /.notdef /.notdef
/.notdef /.notdef /.notdef /.notdef /.notdef
/.notdef /.notdef /.notdef /.notdef /.notdef
/.notdef /.notdef /.notdef /.notdef /.notdef
/.notdef /.notdef /.notdef /.notdef /.notdef
/.notdef /.notdef /space /exclam /quotedbl
/numbersign /dollar /percent /ampersand /quotesingle
/parenleft /parenright /asterisk /plus /comma
/hyphen /period /slash /zero /one
/two /three /four /five /six
/seven /eight /nine /colon /semicolon
/less /equal /greater /question /at
/A /B /C /D /E
/F /G /H /I /J
/K /L /M /N /O
/P /Q /R /S /T
/U /V /W /X /Y
/Z /bracketleft /backslash /bracketright /asciicircum
/underscore /quoteleft /a /b /c
/d /e /f /g /h
/i /j /k /l /m
/n /o /p /q /r
/s /t /u /v /w
/x /y /z /braceleft /bar
/braceright /asciitilde /bullet /Euro /bullet
/quotesinglbase /florin /quotedblbase /ellipsis /dagger
/daggerdbl /circumflex /perthousand /Scaron /guilsinglleft
/OE /bullet /Zcaron /bullet /bullet
/quoteleft /quoteright /quotedblleft /quotedblright /bullet
/endash /emdash /asciitilde /trademark /scaron
/guilsinglright /oe /bullet /zcaron /Ydieresis
/space /exclamdown /cent /sterling /currency
/yen /brokenbar /section /dieresis /copyright
/ordfeminine /guillemotleft /logicalnot /sfthyphen /registered
/macron /degree /plusminus /twosuperior /threesuperior
/acute /mu /paragraph /middot /cedilla
/onesuperior /ordmasculine /guillemotright /onequarter /onehalf
/threequarters /questiondown /Agrave /Aacute /Acircumflex
/Atilde /Adieresis /Aring /AE /Ccedilla
/Egrave /Eacute /Ecircumflex /Edieresis /Igrave
/Iacute /Icircumflex /Idieresis /Eth /Ntilde
/Ograve /Oacute /Ocircumflex /Otilde /Odieresis
/multiply /Oslash /Ugrave /Uacute /Ucircumflex
/Udieresis /Yacute /Thorn /germandbls /agrave
/aacute /acircumflex /atilde /adieresis /aring
/ae /ccedilla /egrave /eacute /ecircumflex
/edieresis /igrave /iacute /icircumflex /idieresis
/eth /ntilde /ograve /oacute /ocircumflex
/otilde /odieresis /divide /oslash /ugrave
/uacute /ucircumflex /udieresis /yacute /thorn
/ydieresis
] def
%%EndResource
%FOPBeginFontReencode
/Courier-Oblique findfont
dup length dict begin
  {1 index /FID ne {def} {pop pop} ifelse} forall
  /Encoding WinAnsiEncoding def
  currentdict
end
/Courier-Oblique exch definefont pop
/Courier-BoldOblique findfont
dup length dict begin
  {1 index /FID ne {def} {pop pop} ifelse} forall
  /Encoding WinAnsiEncoding def
  currentdict
end
/Courier-BoldOblique exch definefont pop
/Courier-Bold findfont
dup length dict begin
  {1 index /FID ne {def} {pop pop} ifelse} forall
  /Encoding WinAnsiEncoding def
  currentdict
end
/Courier-Bold exch definefont pop
/Helvetica findfont
dup length dict begin
  {1 index /FID ne {def} {pop pop} ifelse} forall
  /Encoding WinAnsiEncoding def
  currentdict
end
/Helvetica exch definefont pop
/Helvetica-Oblique findfont
dup length dict begin
  {1 index /FID ne {def} {pop pop} ifelse} forall
  /Encoding WinAnsiEncoding def
  currentdict
end
/Helvetica-Oblique exch definefont pop
/Helvetica-Bold findfont
dup length dict begin
  {1 index /FID ne {def} {pop pop} ifelse} forall
  /Encoding WinAnsiEncoding def
  currentdict
end
/Helvetica-Bold exch definefont pop
/Helvetica-BoldOblique findfont
dup length dict begin
  {1 index /FID ne {def} {pop pop} ifelse} forall
  /Encoding WinAnsiEncoding def
  currentdict
end
/Helvetica-BoldOblique exch definefont pop
/Times-Roman findfont
dup length dict begin
  {1 index /FID ne {def} {pop pop} ifelse} forall
  /Encoding WinAnsiEncoding def
  currentdict
end
/Times-Roman exch definefont pop
/Times-Italic findfont
dup length dict begin
  {1 index /FID ne {def} {pop pop} ifelse} forall
  /Encoding WinAnsiEncoding def
  currentdict
end
/Times-Italic exch definefont pop
/Times-Bold findfont
dup length dict begin
  {1 index /FID ne {def} {pop pop} ifelse} forall
  /Encoding WinAnsiEncoding def
  currentdict
end
/Times-Bold exch definefont pop
/Times-BoldItalic findfont
dup length dict begin
  {1 index /FID ne {def} {pop pop} ifelse} forall
  /Encoding WinAnsiEncoding def
  currentdict
end
/Times-BoldItalic exch definefont pop
/Courier findfont
dup length dict begin
  {1 index /FID ne {def} {pop pop} ifelse} forall
  /Encoding WinAnsiEncoding def
  currentdict
end
/Courier exch definefont pop
%FOPEndFontReencode
%%EndProlog
%%Page: 1 1
%%PageBoundingBox: 0 0 512 288
%%BeginPageSetup
[1 0 0 -1 0 288] CT
%%EndPageSetup
GS
1 GC
N
0 0 512 288 re
f
GR
GS
1 GC
N
0 0 512 288 re
f
GR
GS
1 GC
N
66.5 238 M
463.5 238 L
463.5 21.5 L
66.5 21.5 L
cp
f
GR
GS
0.149 GC
2 setlinecap
1 LJ
0.5 LW
N
66.5 238 M
463.5 238 L
S
GR
GS
0.149 GC
2 setlinecap
1 LJ
0.5 LW
N
66.5 238 M
66.5 234.03 L
S
GR
GS
0.149 GC
2 setlinecap
1 LJ
0.5 LW
N
170.974 238 M
170.974 234.03 L
S
GR
GS
0.149 GC
2 setlinecap
1 LJ
0.5 LW
N
275.447 238 M
275.447 234.03 L
S
GR
GS
0.149 GC
2 setlinecap
1 LJ
0.5 LW
N
379.921 238 M
379.921 234.03 L
S
GR
GS
[1 0 0 1 66.5 243.60001] CT
0.149 GC
/Helvetica 18 F
GS
[1 0 0 1 0 0] CT
-5.5 18 moveto 
1 -1 scale
(0) t 
GR
GR
GS
[1 0 0 1 170.97368 243.60001] CT
0.149 GC
/Helvetica 18 F
GS
[1 0 0 1 0 0] CT
-13 18 moveto 
1 -1 scale
(0.5) t 
GR
GR
GS
[1 0 0 1 275.44736 243.60001] CT
0.149 GC
/Helvetica 18 F
GS
[1 0 0 1 0 0] CT
-5.5 18 moveto 
1 -1 scale
(1) t 
GR
GR
GS
[1 0 0 1 379.92105 243.60001] CT
0.149 GC
/Helvetica 18 F
GS
[1 0 0 1 0 0] CT
-13 18 moveto 
1 -1 scale
(1.5) t 
GR
GR
GS
[1 0 0 1 265.00018 266.5] CT
0.149 GC
/Helvetica 18 F
GS
[1 0 0 1 0 0] CT
-72.5 18 moveto 
1 -1 scale
(Frequency \(log10\)) t 
GR
GR
GS
0.149 GC
2 setlinecap
1 LJ
0.5 LW
N
66.5 238 M
66.5 21.5 L
S
GR
GS
0.149 GC
2 setlinecap
1 LJ
0.5 LW
N
66.5 238 M
70.47 238 L
S
GR
GS
0.149 GC
2 setlinecap
1 LJ
0.5 LW
N
66.5 176.143 M
70.47 176.143 L
S
GR
GS
0.149 GC
2 setlinecap
1 LJ
0.5 LW
N
66.5 114.286 M
70.47 114.286 L
S
GR
GS
0.149 GC
2 setlinecap
1 LJ
0.5 LW
N
66.5 52.429 M
70.47 52.429 L
S
GR
GS
[1 0 0 1 60.9 238] CT
0.149 GC
/Helvetica 18 F
GS
[1 0 0 1 0 0] CT
-28 7 moveto 
1 -1 scale
(-10) t 
GR
GR
GS
[1 0 0 1 60.9 176.14285] CT
0.149 GC
/Helvetica 18 F
GS
[1 0 0 1 0 0] CT
-18 7 moveto 
1 -1 scale
(-9) t 
GR
GR
GS
[1 0 0 1 60.9 114.28571] CT
0.149 GC
/Helvetica 18 F
GS
[1 0 0 1 0 0] CT
-18 7 moveto 
1 -1 scale
(-8) t 
GR
GR
GS
[1 0 0 1 60.9 52.42857] CT
0.149 GC
/Helvetica 18 F
GS
[1 0 0 1 0 0] CT
-18 7 moveto 
1 -1 scale
(-7) t 
GR
GR
GS
[0 -1 1 0 30.4 129.74988] CT
0.149 GC
/Helvetica 18 F
GS
[1 0 0 1 0 0] CT
-71 -4 moveto 
1 -1 scale
(Power \(log10; Hz\)) t 
GR
GR
GS
0.754 0.86 0.922 RC
N
106.269 90.62 M
114.652 93.211 L
122.325 94.818 L
129.399 96.26 L
138.048 98.374 L
145.944 100.233 L
153.208 101.345 L
161.539 102.435 L
169.169 104.08 L
176.207 105.823 L
183.99 107.56 L
192.299 109.245 L
199.911 110.465 L
207.893 112.101 L
216.107 114.318 L
223.639 115.911 L
231.333 118.751 L
239.781 121.859 L
247.508 123.111 L
255.198 124.668 L
262.81 124.996 L
270.793 126.252 L
278.569 128.634 L
286.538 131.392 L
294.601 135.471 L
302.344 138.426 L
310.099 141.66 L
318.098 143.973 L
325.97 147.938 L
333.931 152.315 L
341.687 156.529 L
349.638 161.658 L
357.5 164.666 L
365.243 167.049 L
373.153 168.471 L
380.997 170.667 L
388.869 172.72 L
396.711 174.765 L
404.587 175.858 L
412.437 178.09 L
420.308 178.912 L
428.142 180.98 L
436.052 182.282 L
443.897 183.968 L
451.769 185.982 L
459.61 186.89 L
463.547 188.066 L
463.547 187.584 L
463.547 187.119 L
459.61 185.96 L
451.769 185.072 L
443.897 182.999 L
436.052 181.509 L
428.142 180.113 L
420.308 178.115 L
412.437 177.211 L
404.587 175.12 L
396.711 173.945 L
388.869 171.887 L
380.997 169.957 L
373.153 167.662 L
365.243 166.184 L
357.5 164.042 L
349.638 160.925 L
341.687 155.884 L
333.931 151.557 L
325.97 147.164 L
318.098 143.314 L
310.099 140.871 L
302.344 137.655 L
294.601 134.689 L
286.538 130.494 L
278.569 127.314 L
270.793 125.383 L
262.81 124.311 L
255.198 123.881 L
247.508 122.381 L
239.781 121.066 L
231.333 117.991 L
223.639 115.312 L
216.107 113.686 L
207.893 111.411 L
199.911 109.8 L
192.299 108.603 L
183.99 106.803 L
176.207 105.015 L
169.169 103.343 L
161.539 101.667 L
153.208 100.551 L
145.944 99.525 L
138.048 97.723 L
129.399 95.557 L
122.325 94.08 L
114.652 92.479 L
106.269 89.888 L
97.033 85.851 L
90.308 82.692 L
83.045 79.507 L
75.149 76.43 L
66.5 73.292 L
66.5 74.435 L
75.149 77.453 L
83.045 80.418 L
90.308 83.509 L
97.033 86.609 L
cp
f
GR
GS
0.561 0.749 0.859 RC
1 LJ
0.5 LW
N
66.5 74.435 M
75.149 77.453 L
83.045 80.418 L
90.308 83.509 L
97.033 86.609 L
106.269 90.62 L
114.652 93.211 L
122.325 94.818 L
129.399 96.26 L
138.048 98.374 L
145.944 100.233 L
153.208 101.345 L
161.539 102.435 L
169.169 104.08 L
176.207 105.823 L
183.99 107.56 L
192.299 109.245 L
199.911 110.465 L
207.893 112.101 L
216.107 114.318 L
223.639 115.911 L
231.333 118.751 L
239.781 121.859 L
247.508 123.111 L
255.198 124.668 L
262.81 124.996 L
270.793 126.252 L
278.569 128.634 L
286.538 131.392 L
294.601 135.471 L
302.344 138.426 L
310.099 141.66 L
318.098 143.973 L
325.97 147.938 L
333.931 152.315 L
341.687 156.529 L
349.638 161.658 L
357.5 164.666 L
365.243 167.049 L
373.153 168.471 L
380.997 170.667 L
388.869 172.72 L
396.711 174.765 L
404.587 175.858 L
412.437 178.09 L
420.308 178.912 L
428.142 180.98 L
436.052 182.282 L
443.897 183.968 L
451.769 185.982 L
459.61 186.89 L
463.547 188.066 L
S
GR
GS
0.561 0.749 0.859 RC
1 LJ
0.5 LW
N
66.5 73.292 M
75.149 76.43 L
83.045 79.507 L
90.308 82.692 L
97.033 85.851 L
106.269 89.888 L
114.652 92.479 L
122.325 94.08 L
129.399 95.557 L
138.048 97.723 L
145.944 99.525 L
153.208 100.551 L
161.539 101.667 L
169.169 103.343 L
176.207 105.015 L
183.99 106.803 L
192.299 108.603 L
199.911 109.8 L
207.893 111.411 L
216.107 113.686 L
223.639 115.312 L
231.333 117.991 L
239.781 121.066 L
247.508 122.381 L
255.198 123.881 L
262.81 124.311 L
270.793 125.383 L
278.569 127.314 L
286.538 130.494 L
294.601 134.689 L
302.344 137.655 L
310.099 140.871 L
318.098 143.314 L
325.97 147.164 L
333.931 151.557 L
341.687 155.884 L
349.638 160.925 L
357.5 164.042 L
365.243 166.184 L
373.153 167.662 L
380.997 169.957 L
388.869 171.887 L
396.711 173.945 L
404.587 175.12 L
412.437 177.211 L
420.308 178.115 L
428.142 180.113 L
436.052 181.509 L
443.897 182.999 L
451.769 185.072 L
459.61 185.96 L
463.547 187.119 L
S
GR
GS
0.02 0.443 0.69 RC
1 LJ
2 LW
N
66.5 73.864 M
75.149 76.941 L
83.045 79.963 L
90.308 83.1 L
97.033 86.23 L
106.269 90.254 L
114.652 92.845 L
122.325 94.449 L
129.399 95.908 L
138.048 98.048 L
145.944 99.879 L
153.208 100.948 L
161.539 102.051 L
169.169 103.711 L
176.207 105.419 L
183.99 107.182 L
192.299 108.924 L
199.911 110.132 L
207.893 111.756 L
216.107 114.002 L
223.639 115.612 L
231.333 118.371 L
239.781 121.462 L
247.508 122.746 L
255.198 124.275 L
262.81 124.654 L
270.793 125.818 L
278.569 127.974 L
286.538 130.943 L
294.601 135.08 L
302.344 138.041 L
310.099 141.266 L
318.098 143.644 L
325.97 147.551 L
333.931 151.936 L
341.687 156.207 L
349.638 161.291 L
357.5 164.354 L
365.243 166.617 L
373.153 168.067 L
380.997 170.312 L
388.869 172.304 L
396.711 174.355 L
404.587 175.489 L
412.437 177.65 L
420.308 178.514 L
428.142 180.546 L
436.052 181.895 L
443.897 183.484 L
451.769 185.527 L
459.61 186.425 L
463.547 187.593 L
S
GR
GS
0.948 0.749 0.781 RC
N
106.269 90.358 M
114.652 93.531 L
122.325 95.559 L
129.399 96.814 L
138.048 98.107 L
145.944 99.447 L
153.208 100.574 L
161.539 101.528 L
169.169 102.458 L
176.207 103.756 L
183.99 106.075 L
192.299 108.137 L
199.911 109.561 L
207.893 111.833 L
216.107 113.797 L
223.639 116.179 L
231.333 118.656 L
239.781 121.467 L
247.508 123.017 L
255.198 123.929 L
262.81 124.728 L
270.793 125.725 L
278.569 128.387 L
286.538 132.075 L
294.601 134.66 L
302.344 138.837 L
310.099 141.455 L
318.098 144.031 L
325.97 148.704 L
333.931 152.497 L
341.687 156.545 L
349.638 160.674 L
357.5 164.458 L
365.243 166.345 L
373.153 168.205 L
380.997 170.278 L
388.869 172.74 L
396.711 175.405 L
404.587 175.88 L
412.437 178.192 L
420.308 179.212 L
428.142 180.551 L
436.052 180.935 L
443.897 182.814 L
451.769 184.056 L
459.61 186.26 L
463.547 187.181 L
463.547 186.737 L
463.547 186.36 L
459.61 185.508 L
451.769 183.299 L
443.897 181.933 L
436.052 180.166 L
428.142 179.671 L
420.308 178.372 L
412.437 177.359 L
404.587 175.171 L
396.711 174.641 L
388.869 171.963 L
380.997 169.547 L
373.153 167.537 L
365.243 165.577 L
357.5 163.686 L
349.638 160.036 L
341.687 155.782 L
333.931 151.751 L
325.97 147.893 L
318.098 143.31 L
310.099 140.728 L
302.344 138.082 L
294.601 133.805 L
286.538 131.263 L
278.569 127.464 L
270.793 124.832 L
262.81 123.917 L
255.198 123.236 L
247.508 122.468 L
239.781 120.63 L
231.333 117.89 L
223.639 115.412 L
216.107 113.085 L
207.893 111.104 L
199.911 108.914 L
192.299 107.448 L
183.99 105.495 L
176.207 103.108 L
169.169 101.767 L
161.539 100.809 L
153.208 99.837 L
145.944 98.667 L
138.048 97.338 L
129.399 96.019 L
122.325 94.714 L
114.652 92.672 L
106.269 89.514 L
97.033 85.411 L
90.308 82.509 L
83.045 79.682 L
75.149 76.931 L
66.5 73.995 L
66.5 74.963 L
75.149 77.756 L
83.045 80.457 L
90.308 83.293 L
97.033 86.218 L
cp
f
GR
GS
0.906 0.549 0.608 RC
1 LJ
0.5 LW
N
66.5 74.963 M
75.149 77.756 L
83.045 80.457 L
90.308 83.293 L
97.033 86.218 L
106.269 90.358 L
114.652 93.531 L
122.325 95.559 L
129.399 96.814 L
138.048 98.107 L
145.944 99.447 L
153.208 100.574 L
161.539 101.528 L
169.169 102.458 L
176.207 103.756 L
183.99 106.075 L
192.299 108.137 L
199.911 109.561 L
207.893 111.833 L
216.107 113.797 L
223.639 116.179 L
231.333 118.656 L
239.781 121.467 L
247.508 123.017 L
255.198 123.929 L
262.81 124.728 L
270.793 125.725 L
278.569 128.387 L
286.538 132.075 L
294.601 134.66 L
302.344 138.837 L
310.099 141.455 L
318.098 144.031 L
325.97 148.704 L
333.931 152.497 L
341.687 156.545 L
349.638 160.674 L
357.5 164.458 L
365.243 166.345 L
373.153 168.205 L
380.997 170.278 L
388.869 172.74 L
396.711 175.405 L
404.587 175.88 L
412.437 178.192 L
420.308 179.212 L
428.142 180.551 L
436.052 180.935 L
443.897 182.814 L
451.769 184.056 L
459.61 186.26 L
463.547 187.181 L
S
GR
GS
0.906 0.549 0.608 RC
1 LJ
0.5 LW
N
66.5 73.995 M
75.149 76.931 L
83.045 79.682 L
90.308 82.509 L
97.033 85.411 L
106.269 89.514 L
114.652 92.672 L
122.325 94.714 L
129.399 96.019 L
138.048 97.338 L
145.944 98.667 L
153.208 99.837 L
161.539 100.809 L
169.169 101.767 L
176.207 103.108 L
183.99 105.495 L
192.299 107.448 L
199.911 108.914 L
207.893 111.104 L
216.107 113.085 L
223.639 115.412 L
231.333 117.89 L
239.781 120.63 L
247.508 122.468 L
255.198 123.236 L
262.81 123.917 L
270.793 124.832 L
278.569 127.464 L
286.538 131.263 L
294.601 133.805 L
302.344 138.082 L
310.099 140.728 L
318.098 143.31 L
325.97 147.893 L
333.931 151.751 L
341.687 155.782 L
349.638 160.036 L
357.5 163.686 L
365.243 165.577 L
373.153 167.537 L
380.997 169.547 L
388.869 171.963 L
396.711 174.641 L
404.587 175.171 L
412.437 177.359 L
420.308 178.372 L
428.142 179.671 L
436.052 180.166 L
443.897 181.933 L
451.769 183.299 L
459.61 185.508 L
463.547 186.36 L
S
GR
GS
0.792 0 0.125 RC
1 LJ
2 LW
N
66.5 74.479 M
75.149 77.344 L
83.045 80.07 L
90.308 82.901 L
97.033 85.814 L
106.269 89.936 L
114.652 93.101 L
122.325 95.137 L
129.399 96.417 L
138.048 97.722 L
145.944 99.057 L
153.208 100.205 L
161.539 101.168 L
169.169 102.112 L
176.207 103.432 L
183.99 105.785 L
192.299 107.793 L
199.911 109.237 L
207.893 111.469 L
216.107 113.441 L
223.639 115.795 L
231.333 118.273 L
239.781 121.049 L
247.508 122.742 L
255.198 123.582 L
262.81 124.322 L
270.793 125.278 L
278.569 127.925 L
286.538 131.669 L
294.601 134.233 L
302.344 138.46 L
310.099 141.091 L
318.098 143.671 L
325.97 148.298 L
333.931 152.124 L
341.687 156.164 L
349.638 160.355 L
357.5 164.072 L
365.243 165.961 L
373.153 167.871 L
380.997 169.913 L
388.869 172.351 L
396.711 175.023 L
404.587 175.525 L
412.437 177.775 L
420.308 178.792 L
428.142 180.111 L
436.052 180.55 L
443.897 182.373 L
451.769 183.677 L
459.61 185.884 L
463.547 186.77 L
S
GR
GS
[1 0 0 1 375.5 195.75] CT
/Helvetica 18 F
GS
[1 0 0 1 0 0] CT
0 7 moveto 
1 -1 scale
(1 Target) t 
GR
GR
GS
0.02 0.443 0.69 RC
1 LJ
2 LW
N
342.5 195.75 M
372.5 195.75 L
S
GR
GS
[1 0 0 1 375.5 217.75] CT
/Helvetica 18 F
GS
[1 0 0 1 0 0] CT
0 7 moveto 
1 -1 scale
(4 Targets) t 
GR
GR
GS
0.792 0 0.125 RC
1 LJ
2 LW
N
342.5 217.75 M
372.5 217.75 L
S
GR
GS
1 GC
N
112.5 201.5 M
215 201.5 L
215 144 L
112.5 144 L
cp
f
GR
GS
0.149 GC
2 setlinecap
1 LJ
0.5 LW
N
112.5 201.5 M
215 201.5 L
S
GR
GS
0.149 GC
2 setlinecap
1 LJ
0.5 LW
N
112.5 201.5 M
112.5 200.475 L
S
GR
GS
0.149 GC
2 setlinecap
1 LJ
0.5 LW
N
163.75 201.5 M
163.75 200.475 L
S
GR
GS
0.149 GC
2 setlinecap
1 LJ
0.5 LW
N
215 201.5 M
215 200.475 L
S
GR
GS
[1 0 0 1 112.5 206.29991] CT
0.149 GC
/Helvetica 14 F
GS
[1 0 0 1 0 0] CT
-4 14 moveto 
1 -1 scale
(0) t 
GR
GR
GS
[1 0 0 1 163.75 206.29991] CT
0.149 GC
/Helvetica 14 F
GS
[1 0 0 1 0 0] CT
-14 14 moveto 
1 -1 scale
(0.05) t 
GR
GR
GS
[1 0 0 1 215 206.29991] CT
0.149 GC
/Helvetica 14 F
GS
[1 0 0 1 0 0] CT
-10 14 moveto 
1 -1 scale
(0.1) t 
GR
GR
GS
0.149 GC
2 setlinecap
1 LJ
0.5 LW
N
112.5 201.5 M
112.5 144 L
S
GR
GS
0.149 GC
2 setlinecap
1 LJ
0.5 LW
N
112.5 177.824 M
113.525 177.824 L
S
GR
GS
0.149 GC
2 setlinecap
1 LJ
0.5 LW
N
112.5 144 M
113.525 144 L
S
GR
GS
[1 0 0 1 107.7 177.82359] CT
0.149 GC
/Helvetica 14 F
GS
[1 0 0 1 0 0] CT
-25 5.5 moveto 
1 -1 scale
(-7.3) t 
GR
GR
GS
[1 0 0 1 107.7 143.99994] CT
0.149 GC
/Helvetica 14 F
GS
[1 0 0 1 0 0] CT
-25 5.5 moveto 
1 -1 scale
(-7.2) t 
GR
GR
GS
0.754 0.86 0.922 RC
N
112.5 196.686 M
124.895 201.507 L
131.256 201.507 L
139.882 201.507 L
112.5 190.434 L
cp
f
GR
GS
0.561 0.749 0.859 RC
1 LJ
0.5 LW
N
112.5 196.686 M
124.895 201.507 L
S
GR
GS
0.561 0.749 0.859 RC
1 LJ
0.5 LW
N
112.5 190.434 M
139.882 201.507 L
S
GR
GS
0.02 0.443 0.69 RC
1 LJ
N
112.5 193.56 M
132.534 201.507 L
S
GR
GS
0.948 0.749 0.781 RC
N
112.5 199.571 M
117.879 201.507 L
120.132 201.507 L
131.6 201.507 L
112.5 194.279 L
cp
f
GR
GS
0.906 0.549 0.608 RC
1 LJ
0.5 LW
N
112.5 199.571 M
117.879 201.507 L
S
GR
GS
0.906 0.549 0.608 RC
1 LJ
0.5 LW
N
112.5 194.279 M
131.6 201.507 L
S
GR
GS
0.792 0 0.125 RC
1 LJ
N
112.5 196.925 M
124.911 201.507 L
S
GR
GS
1 GC
N
348 101 M
450.5 101 L
450.5 43 L
348 43 L
cp
f
GR
GS
0.149 GC
2 setlinecap
1 LJ
0.5 LW
N
348 101 M
450.5 101 L
S
GR
GS
0.149 GC
2 setlinecap
1 LJ
0.5 LW
N
348 101 M
348 99.975 L
S
GR
GS
0.149 GC
2 setlinecap
1 LJ
0.5 LW
N
382.167 101 M
382.167 99.975 L
S
GR
GS
0.149 GC
2 setlinecap
1 LJ
0.5 LW
N
416.333 101 M
416.333 99.975 L
S
GR
GS
[1 0 0 1 348 105.80022] CT
0.149 GC
/Helvetica 14 F
GS
[1 0 0 1 0 0] CT
-14 14 moveto 
1 -1 scale
(1.75) t 
GR
GR
GS
[1 0 0 1 382.16663 105.80022] CT
0.149 GC
/Helvetica 14 F
GS
[1 0 0 1 0 0] CT
-10 14 moveto 
1 -1 scale
(1.8) t 
GR
GR
GS
[1 0 0 1 416.33334 105.80022] CT
0.149 GC
/Helvetica 14 F
GS
[1 0 0 1 0 0] CT
-14 14 moveto 
1 -1 scale
(1.85) t 
GR
GR
GS
0.149 GC
2 setlinecap
1 LJ
0.5 LW
N
348 101 M
348 43 L
S
GR
GS
0.149 GC
2 setlinecap
1 LJ
0.5 LW
N
348 101 M
349.025 101 L
S
GR
GS
0.149 GC
2 setlinecap
1 LJ
0.5 LW
N
348 62.333 M
349.025 62.333 L
S
GR
GS
[1 0 0 1 343.19998 101.00014] CT
0.149 GC
/Helvetica 14 F
GS
[1 0 0 1 0 0] CT
-25 5.5 moveto 
1 -1 scale
(-9.1) t 
GR
GR
GS
[1 0 0 1 343.19998 62.33333] CT
0.149 GC
/Helvetica 14 F
GS
[1 0 0 1 0 0] CT
-14 5.5 moveto 
1 -1 scale
(-9) t 
GR
GR
GS
0.754 0.86 0.922 RC
N
360.736 95.877 M
347.988 91.575 L
347.988 94.248 L
347.988 96.698 L
360.736 100.707 L
361.467 101.007 L
362.455 101.007 L
374.866 101.007 L
cp
f
GR
GS
0.561 0.749 0.859 RC
1 LJ
0.5 LW
N
347.988 96.698 M
360.736 100.707 L
361.467 101.007 L
S
GR
GS
0.561 0.749 0.859 RC
1 LJ
0.5 LW
N
347.988 91.575 M
360.736 95.877 L
374.866 101.007 L
S
GR
GS
0.02 0.443 0.69 RC
1 LJ
N
347.988 94.136 M
360.736 98.292 L
367.752 101.007 L
S
GR
GS
0.948 0.749 0.781 RC
N
360.736 87.483 M
347.988 85.957 L
347.988 88.669 L
347.988 91.106 L
360.736 92.287 L
379.78 101.007 L
386.39 101.007 L
393.87 101.007 L
386.39 98.526 L
cp
f
GR
GS
0.906 0.549 0.608 RC
1 LJ
0.5 LW
N
347.988 91.106 M
360.736 92.287 L
379.78 101.007 L
S
GR
GS
0.906 0.549 0.608 RC
1 LJ
0.5 LW
N
347.988 85.957 M
360.736 87.483 L
386.39 98.526 L
393.87 101.007 L
S
GR
GS
0.792 0 0.125 RC
1 LJ
N
347.988 88.531 M
360.736 89.885 L
385.775 101.007 L
S
GR
%%Trailer
%%Pages: 1
%%EOF
