%!PS-Adobe-3.0 EPSF-3.0
%%Creator: (MATLAB, The Mathworks, Inc. Version 9.8.0.1323502 \(R2020a\). Operating System: Mac OS X)
%%Title: /Users/kosciessa/Desktop/tardis/LNDG/stateswitch/stsw_eeg_task/aperiodic/figures/b_1_f_rotation_YAOA.eps
%%CreationDate: 2022-02-16T15:56:04
%%Pages: (atend)
%%BoundingBox:    13     0   465   267
%%LanguageLevel: 3
%%EndComments
%%BeginProlog
%%BeginResource: procset (Apache XML Graphics Std ProcSet) 1.2 0
%%Version: 1.2 0
%%Copyright: (Copyright 2001-2003,2010 The Apache Software Foundation. License terms: http://www.apache.org/licenses/LICENSE-2.0)
/bd{bind def}bind def
/ld{load def}bd
/GR/grestore ld
/GS/gsave ld
/RM/rmoveto ld
/C/curveto ld
/t/show ld
/L/lineto ld
/ML/setmiterlimit ld
/CT/concat ld
/f/fill ld
/N/newpath ld
/S/stroke ld
/CC/setcmykcolor ld
/A/ashow ld
/cp/closepath ld
/RC/setrgbcolor ld
/LJ/setlinejoin ld
/GC/setgray ld
/LW/setlinewidth ld
/M/moveto ld
/re {4 2 roll M
1 index 0 rlineto
0 exch rlineto
neg 0 rlineto
cp } bd
/_ctm matrix def
/_tm matrix def
/BT { _ctm currentmatrix pop matrix _tm copy pop 0 0 moveto } bd
/ET { _ctm setmatrix } bd
/iTm { _ctm setmatrix _tm concat } bd
/Tm { _tm astore pop iTm 0 0 moveto } bd
/ux 0.0 def
/uy 0.0 def
/F {
  /Tp exch def
  /Tf exch def
  Tf findfont Tp scalefont setfont
  /cf Tf def  /cs Tp def
} bd
/ULS {currentpoint /uy exch def /ux exch def} bd
/ULE {
  /Tcx currentpoint pop def
  gsave
  newpath
  cf findfont cs scalefont dup
  /FontMatrix get 0 get /Ts exch def /FontInfo get dup
  /UnderlinePosition get Ts mul /To exch def
  /UnderlineThickness get Ts mul /Tt exch def
  ux uy To add moveto  Tcx uy To add lineto
  Tt setlinewidth stroke
  grestore
} bd
/OLE {
  /Tcx currentpoint pop def
  gsave
  newpath
  cf findfont cs scalefont dup
  /FontMatrix get 0 get /Ts exch def /FontInfo get dup
  /UnderlinePosition get Ts mul /To exch def
  /UnderlineThickness get Ts mul /Tt exch def
  ux uy To add cs add moveto Tcx uy To add cs add lineto
  Tt setlinewidth stroke
  grestore
} bd
/SOE {
  /Tcx currentpoint pop def
  gsave
  newpath
  cf findfont cs scalefont dup
  /FontMatrix get 0 get /Ts exch def /FontInfo get dup
  /UnderlinePosition get Ts mul /To exch def
  /UnderlineThickness get Ts mul /Tt exch def
  ux uy To add cs 10 mul 26 idiv add moveto Tcx uy To add cs 10 mul 26 idiv add lineto
  Tt setlinewidth stroke
  grestore
} bd
/QT {
/Y22 exch store
/X22 exch store
/Y21 exch store
/X21 exch store
currentpoint
/Y21 load 2 mul add 3 div exch
/X21 load 2 mul add 3 div exch
/X21 load 2 mul /X22 load add 3 div
/Y21 load 2 mul /Y22 load add 3 div
/X22 load /Y22 load curveto
} bd
/SSPD {
dup length /d exch dict def
{
/v exch def
/k exch def
currentpagedevice k known {
/cpdv currentpagedevice k get def
v cpdv ne {
/upd false def
/nullv v type /nulltype eq def
/nullcpdv cpdv type /nulltype eq def
nullv nullcpdv or
{
/upd true def
} {
/sametype v type cpdv type eq def
sametype {
v type /arraytype eq {
/vlen v length def
/cpdvlen cpdv length def
vlen cpdvlen eq {
0 1 vlen 1 sub {
/i exch def
/obj v i get def
/cpdobj cpdv i get def
obj cpdobj ne {
/upd true def
exit
} if
} for
} {
/upd true def
} ifelse
} {
v type /dicttype eq {
v {
/dv exch def
/dk exch def
/cpddv cpdv dk get def
dv cpddv ne {
/upd true def
exit
} if
} forall
} {
/upd true def
} ifelse
} ifelse
} if
} ifelse
upd true eq {
d k v put
} if
} if
} if
} forall
d length 0 gt {
d setpagedevice
} if
} bd
/RE { % /NewFontName [NewEncodingArray] /FontName RE -
  findfont dup length dict begin
  {
    1 index /FID ne
    {def} {pop pop} ifelse
  } forall
  /Encoding exch def
  /FontName 1 index def
  currentdict definefont pop
  end
} bind def
%%EndResource
%%BeginResource: procset (Apache XML Graphics EPS ProcSet) 1.0 0
%%Version: 1.0 0
%%Copyright: (Copyright 2002-2003 The Apache Software Foundation. License terms: http://www.apache.org/licenses/LICENSE-2.0)
/BeginEPSF { %def
/b4_Inc_state save def         % Save state for cleanup
/dict_count countdictstack def % Count objects on dict stack
/op_count count 1 sub def      % Count objects on operand stack
userdict begin                 % Push userdict on dict stack
/showpage { } def              % Redefine showpage, { } = null proc
0 setgray 0 setlinecap         % Prepare graphics state
1 setlinewidth 0 setlinejoin
10 setmiterlimit [ ] 0 setdash newpath
/languagelevel where           % If level not equal to 1 then
{pop languagelevel             % set strokeadjust and
1 ne                           % overprint to their defaults.
{false setstrokeadjust false setoverprint
} if
} if
} bd
/EndEPSF { %def
count op_count sub {pop} repeat            % Clean up stacks
countdictstack dict_count sub {end} repeat
b4_Inc_state restore
} bd
%%EndResource
%FOPBeginFontDict
%%IncludeResource: font Courier-Oblique
%%IncludeResource: font Courier-BoldOblique
%%IncludeResource: font Courier-Bold
%%IncludeResource: font ZapfDingbats
%%IncludeResource: font Symbol
%%IncludeResource: font Helvetica
%%IncludeResource: font Helvetica-Oblique
%%IncludeResource: font Helvetica-Bold
%%IncludeResource: font Helvetica-BoldOblique
%%IncludeResource: font Times-Roman
%%IncludeResource: font Times-Italic
%%IncludeResource: font Times-Bold
%%IncludeResource: font Times-BoldItalic
%%IncludeResource: font Courier
%FOPEndFontDict
%%BeginResource: encoding WinAnsiEncoding
/WinAnsiEncoding [
/.notdef /.notdef /.notdef /.notdef /.notdef
/.notdef /.notdef /.notdef /.notdef /.notdef
/.notdef /.notdef /.notdef /.notdef /.notdef
/.notdef /.notdef /.notdef /.notdef /.notdef
/.notdef /.notdef /.notdef /.notdef /.notdef
/.notdef /.notdef /.notdef /.notdef /.notdef
/.notdef /.notdef /space /exclam /quotedbl
/numbersign /dollar /percent /ampersand /quotesingle
/parenleft /parenright /asterisk /plus /comma
/hyphen /period /slash /zero /one
/two /three /four /five /six
/seven /eight /nine /colon /semicolon
/less /equal /greater /question /at
/A /B /C /D /E
/F /G /H /I /J
/K /L /M /N /O
/P /Q /R /S /T
/U /V /W /X /Y
/Z /bracketleft /backslash /bracketright /asciicircum
/underscore /quoteleft /a /b /c
/d /e /f /g /h
/i /j /k /l /m
/n /o /p /q /r
/s /t /u /v /w
/x /y /z /braceleft /bar
/braceright /asciitilde /bullet /Euro /bullet
/quotesinglbase /florin /quotedblbase /ellipsis /dagger
/daggerdbl /circumflex /perthousand /Scaron /guilsinglleft
/OE /bullet /Zcaron /bullet /bullet
/quoteleft /quoteright /quotedblleft /quotedblright /bullet
/endash /emdash /asciitilde /trademark /scaron
/guilsinglright /oe /bullet /zcaron /Ydieresis
/space /exclamdown /cent /sterling /currency
/yen /brokenbar /section /dieresis /copyright
/ordfeminine /guillemotleft /logicalnot /sfthyphen /registered
/macron /degree /plusminus /twosuperior /threesuperior
/acute /mu /paragraph /middot /cedilla
/onesuperior /ordmasculine /guillemotright /onequarter /onehalf
/threequarters /questiondown /Agrave /Aacute /Acircumflex
/Atilde /Adieresis /Aring /AE /Ccedilla
/Egrave /Eacute /Ecircumflex /Edieresis /Igrave
/Iacute /Icircumflex /Idieresis /Eth /Ntilde
/Ograve /Oacute /Ocircumflex /Otilde /Odieresis
/multiply /Oslash /Ugrave /Uacute /Ucircumflex
/Udieresis /Yacute /Thorn /germandbls /agrave
/aacute /acircumflex /atilde /adieresis /aring
/ae /ccedilla /egrave /eacute /ecircumflex
/edieresis /igrave /iacute /icircumflex /idieresis
/eth /ntilde /ograve /oacute /ocircumflex
/otilde /odieresis /divide /oslash /ugrave
/uacute /ucircumflex /udieresis /yacute /thorn
/ydieresis
] def
%%EndResource
%FOPBeginFontReencode
/Courier-Oblique findfont
dup length dict begin
  {1 index /FID ne {def} {pop pop} ifelse} forall
  /Encoding WinAnsiEncoding def
  currentdict
end
/Courier-Oblique exch definefont pop
/Courier-BoldOblique findfont
dup length dict begin
  {1 index /FID ne {def} {pop pop} ifelse} forall
  /Encoding WinAnsiEncoding def
  currentdict
end
/Courier-BoldOblique exch definefont pop
/Courier-Bold findfont
dup length dict begin
  {1 index /FID ne {def} {pop pop} ifelse} forall
  /Encoding WinAnsiEncoding def
  currentdict
end
/Courier-Bold exch definefont pop
/Helvetica findfont
dup length dict begin
  {1 index /FID ne {def} {pop pop} ifelse} forall
  /Encoding WinAnsiEncoding def
  currentdict
end
/Helvetica exch definefont pop
/Helvetica-Oblique findfont
dup length dict begin
  {1 index /FID ne {def} {pop pop} ifelse} forall
  /Encoding WinAnsiEncoding def
  currentdict
end
/Helvetica-Oblique exch definefont pop
/Helvetica-Bold findfont
dup length dict begin
  {1 index /FID ne {def} {pop pop} ifelse} forall
  /Encoding WinAnsiEncoding def
  currentdict
end
/Helvetica-Bold exch definefont pop
/Helvetica-BoldOblique findfont
dup length dict begin
  {1 index /FID ne {def} {pop pop} ifelse} forall
  /Encoding WinAnsiEncoding def
  currentdict
end
/Helvetica-BoldOblique exch definefont pop
/Times-Roman findfont
dup length dict begin
  {1 index /FID ne {def} {pop pop} ifelse} forall
  /Encoding WinAnsiEncoding def
  currentdict
end
/Times-Roman exch definefont pop
/Times-Italic findfont
dup length dict begin
  {1 index /FID ne {def} {pop pop} ifelse} forall
  /Encoding WinAnsiEncoding def
  currentdict
end
/Times-Italic exch definefont pop
/Times-Bold findfont
dup length dict begin
  {1 index /FID ne {def} {pop pop} ifelse} forall
  /Encoding WinAnsiEncoding def
  currentdict
end
/Times-Bold exch definefont pop
/Times-BoldItalic findfont
dup length dict begin
  {1 index /FID ne {def} {pop pop} ifelse} forall
  /Encoding WinAnsiEncoding def
  currentdict
end
/Times-BoldItalic exch definefont pop
/Courier findfont
dup length dict begin
  {1 index /FID ne {def} {pop pop} ifelse} forall
  /Encoding WinAnsiEncoding def
  currentdict
end
/Courier exch definefont pop
%FOPEndFontReencode
%%EndProlog
%%Page: 1 1
%%PageBoundingBox: 0 0 512 288
%%BeginPageSetup
[1 0 0 -1 0 288] CT
%%EndPageSetup
GS
1 GC
N
0 0 512 288 re
f
GR
GS
1 GC
N
0 0 512 288 re
f
GR
GS
1 GC
N
66.5 238 M
463.5 238 L
463.5 21.5 L
66.5 21.5 L
cp
f
GR
GS
0.149 GC
2 setlinecap
1 LJ
0.5 LW
N
66.5 238 M
463.5 238 L
S
GR
GS
0.149 GC
2 setlinecap
1 LJ
0.5 LW
N
66.5 238 M
66.5 234.03 L
S
GR
GS
0.149 GC
2 setlinecap
1 LJ
0.5 LW
N
170.974 238 M
170.974 234.03 L
S
GR
GS
0.149 GC
2 setlinecap
1 LJ
0.5 LW
N
275.447 238 M
275.447 234.03 L
S
GR
GS
0.149 GC
2 setlinecap
1 LJ
0.5 LW
N
379.921 238 M
379.921 234.03 L
S
GR
GS
[1 0 0 1 66.5 243.60001] CT
0.149 GC
/Helvetica 18 F
GS
[1 0 0 1 0 0] CT
-5.5 18 moveto 
1 -1 scale
(0) t 
GR
GR
GS
[1 0 0 1 170.97368 243.60001] CT
0.149 GC
/Helvetica 18 F
GS
[1 0 0 1 0 0] CT
-13 18 moveto 
1 -1 scale
(0.5) t 
GR
GR
GS
[1 0 0 1 275.44736 243.60001] CT
0.149 GC
/Helvetica 18 F
GS
[1 0 0 1 0 0] CT
-5.5 18 moveto 
1 -1 scale
(1) t 
GR
GR
GS
[1 0 0 1 379.92105 243.60001] CT
0.149 GC
/Helvetica 18 F
GS
[1 0 0 1 0 0] CT
-13 18 moveto 
1 -1 scale
(1.5) t 
GR
GR
GS
[1 0 0 1 265.00018 266.5] CT
0.149 GC
/Helvetica 18 F
GS
[1 0 0 1 0 0] CT
-72.5 18 moveto 
1 -1 scale
(Frequency \(log10\)) t 
GR
GR
GS
0.149 GC
2 setlinecap
1 LJ
0.5 LW
N
66.5 238 M
66.5 21.5 L
S
GR
GS
0.149 GC
2 setlinecap
1 LJ
0.5 LW
N
66.5 238 M
70.47 238 L
S
GR
GS
0.149 GC
2 setlinecap
1 LJ
0.5 LW
N
66.5 176.143 M
70.47 176.143 L
S
GR
GS
0.149 GC
2 setlinecap
1 LJ
0.5 LW
N
66.5 114.286 M
70.47 114.286 L
S
GR
GS
0.149 GC
2 setlinecap
1 LJ
0.5 LW
N
66.5 52.429 M
70.47 52.429 L
S
GR
GS
[1 0 0 1 60.9 238] CT
0.149 GC
/Helvetica 18 F
GS
[1 0 0 1 0 0] CT
-28 7 moveto 
1 -1 scale
(-10) t 
GR
GR
GS
[1 0 0 1 60.9 176.14285] CT
0.149 GC
/Helvetica 18 F
GS
[1 0 0 1 0 0] CT
-18 7 moveto 
1 -1 scale
(-9) t 
GR
GR
GS
[1 0 0 1 60.9 114.28571] CT
0.149 GC
/Helvetica 18 F
GS
[1 0 0 1 0 0] CT
-18 7 moveto 
1 -1 scale
(-8) t 
GR
GR
GS
[1 0 0 1 60.9 52.42857] CT
0.149 GC
/Helvetica 18 F
GS
[1 0 0 1 0 0] CT
-18 7 moveto 
1 -1 scale
(-7) t 
GR
GR
GS
[0 -1 1 0 30.4 129.74988] CT
0.149 GC
/Helvetica 18 F
GS
[1 0 0 1 0 0] CT
-71 -4 moveto 
1 -1 scale
(Power \(log10; Hz\)) t 
GR
GR
GS
0.754 0.86 0.922 RC
N
106.269 84.15 M
97.033 80.287 L
90.308 77.351 L
83.045 74.332 L
75.149 71.292 L
66.5 68.051 L
66.5 68.99 L
75.149 72.149 L
83.045 75.123 L
90.308 78.1 L
97.033 81.016 L
106.269 84.856 L
114.652 87.677 L
122.325 89.705 L
129.399 91.402 L
138.048 93.55 L
145.944 95.324 L
153.208 96.377 L
161.539 97.59 L
169.169 99.29 L
176.207 100.997 L
183.99 102.756 L
192.299 104.452 L
199.911 106.19 L
207.893 108.183 L
216.107 110.454 L
223.639 112.473 L
231.333 115.372 L
239.781 117.363 L
247.508 118.995 L
255.198 119.561 L
262.81 117.989 L
270.793 116.933 L
278.569 118.879 L
286.538 123.821 L
294.601 129.766 L
302.344 134.258 L
310.099 138.464 L
318.098 141.626 L
325.97 144.817 L
333.931 148.152 L
341.687 151.988 L
349.638 156.421 L
357.5 159.552 L
365.243 161.859 L
373.153 163.307 L
380.997 165.221 L
388.869 167.692 L
396.711 169.561 L
404.587 170.904 L
412.437 172.637 L
420.308 174.006 L
428.142 175.412 L
436.052 176.87 L
443.897 178.188 L
451.769 179.845 L
459.61 181.614 L
463.547 182.751 L
463.547 182.369 L
463.547 181.991 L
459.61 180.859 L
451.769 179.15 L
443.897 177.392 L
436.052 176.142 L
428.142 174.714 L
420.308 173.246 L
412.437 171.923 L
404.587 170.231 L
396.711 168.898 L
388.869 166.985 L
380.997 164.636 L
373.153 162.569 L
365.243 161.209 L
357.5 158.923 L
349.638 155.86 L
341.687 151.492 L
333.931 147.554 L
325.97 144.245 L
318.098 141.164 L
310.099 137.869 L
302.344 133.672 L
294.601 128.947 L
286.538 123.078 L
278.569 117.934 L
270.793 115.913 L
262.81 117.257 L
255.198 118.978 L
247.508 118.454 L
239.781 116.803 L
231.333 114.859 L
223.639 112.021 L
216.107 109.972 L
207.893 107.71 L
199.911 105.691 L
192.299 103.948 L
183.99 102.145 L
176.207 100.421 L
169.169 98.733 L
161.539 97.02 L
153.208 95.744 L
145.944 94.676 L
138.048 92.933 L
129.399 90.757 L
122.325 89.038 L
114.652 86.999 L
cp
f
GR
GS
0.561 0.749 0.859 RC
1 LJ
0.5 LW
N
66.5 68.99 M
75.149 72.149 L
83.045 75.123 L
90.308 78.1 L
97.033 81.016 L
106.269 84.856 L
114.652 87.677 L
122.325 89.705 L
129.399 91.402 L
138.048 93.55 L
145.944 95.324 L
153.208 96.377 L
161.539 97.59 L
169.169 99.29 L
176.207 100.997 L
183.99 102.756 L
192.299 104.452 L
199.911 106.19 L
207.893 108.183 L
216.107 110.454 L
223.639 112.473 L
231.333 115.372 L
239.781 117.363 L
247.508 118.995 L
255.198 119.561 L
262.81 117.989 L
270.793 116.933 L
278.569 118.879 L
286.538 123.821 L
294.601 129.766 L
302.344 134.258 L
310.099 138.464 L
318.098 141.626 L
325.97 144.817 L
333.931 148.152 L
341.687 151.988 L
349.638 156.421 L
357.5 159.552 L
365.243 161.859 L
373.153 163.307 L
380.997 165.221 L
388.869 167.692 L
396.711 169.561 L
404.587 170.904 L
412.437 172.637 L
420.308 174.006 L
428.142 175.412 L
436.052 176.87 L
443.897 178.188 L
451.769 179.845 L
459.61 181.614 L
463.547 182.751 L
S
GR
GS
0.561 0.749 0.859 RC
1 LJ
0.5 LW
N
66.5 68.051 M
75.149 71.292 L
83.045 74.332 L
90.308 77.351 L
97.033 80.287 L
106.269 84.15 L
114.652 86.999 L
122.325 89.038 L
129.399 90.757 L
138.048 92.933 L
145.944 94.676 L
153.208 95.744 L
161.539 97.02 L
169.169 98.733 L
176.207 100.421 L
183.99 102.145 L
192.299 103.948 L
199.911 105.691 L
207.893 107.71 L
216.107 109.972 L
223.639 112.021 L
231.333 114.859 L
239.781 116.803 L
247.508 118.454 L
255.198 118.978 L
262.81 117.257 L
270.793 115.913 L
278.569 117.934 L
286.538 123.078 L
294.601 128.947 L
302.344 133.672 L
310.099 137.869 L
318.098 141.164 L
325.97 144.245 L
333.931 147.554 L
341.687 151.492 L
349.638 155.86 L
357.5 158.923 L
365.243 161.209 L
373.153 162.569 L
380.997 164.636 L
388.869 166.985 L
396.711 168.898 L
404.587 170.231 L
412.437 171.923 L
420.308 173.246 L
428.142 174.714 L
436.052 176.142 L
443.897 177.392 L
451.769 179.15 L
459.61 180.859 L
463.547 181.991 L
S
GR
GS
0.02 0.443 0.69 RC
1 LJ
2 LW
N
66.5 68.52 M
75.149 71.72 L
83.045 74.728 L
90.308 77.725 L
97.033 80.651 L
106.269 84.503 L
114.652 87.338 L
122.325 89.372 L
129.399 91.08 L
138.048 93.242 L
145.944 95 L
153.208 96.061 L
161.539 97.305 L
169.169 99.011 L
176.207 100.709 L
183.99 102.45 L
192.299 104.2 L
199.911 105.941 L
207.893 107.946 L
216.107 110.213 L
223.639 112.247 L
231.333 115.115 L
239.781 117.083 L
247.508 118.725 L
255.198 119.27 L
262.81 117.623 L
270.793 116.423 L
278.569 118.407 L
286.538 123.45 L
294.601 129.356 L
302.344 133.965 L
310.099 138.166 L
318.098 141.395 L
325.97 144.531 L
333.931 147.853 L
341.687 151.74 L
349.638 156.141 L
357.5 159.237 L
365.243 161.534 L
373.153 162.938 L
380.997 164.928 L
388.869 167.338 L
396.711 169.229 L
404.587 170.568 L
412.437 172.28 L
420.308 173.626 L
428.142 175.063 L
436.052 176.506 L
443.897 177.79 L
451.769 179.497 L
459.61 181.236 L
463.547 182.371 L
S
GR
GS
0.948 0.749 0.781 RC
N
106.269 85.598 M
114.652 88.489 L
122.325 90.508 L
129.399 91.962 L
138.048 93.603 L
145.944 95.126 L
153.208 96.352 L
161.539 97.572 L
169.169 99.051 L
176.207 100.54 L
183.99 102.238 L
192.299 103.972 L
199.911 105.827 L
207.893 108.305 L
216.107 110.347 L
223.639 112.958 L
231.333 115.417 L
239.781 117.949 L
247.508 119.647 L
255.198 119.966 L
262.81 119.176 L
270.793 118.895 L
278.569 119.917 L
286.538 125.595 L
294.601 130.33 L
302.344 135.797 L
310.099 138.913 L
318.098 142.255 L
325.97 145.881 L
333.931 148.569 L
341.687 151.56 L
349.638 155.586 L
357.5 159.316 L
365.243 161.034 L
373.153 162.49 L
380.997 165.105 L
388.869 166.726 L
396.711 168.763 L
404.587 169.869 L
412.437 171.831 L
420.308 172.867 L
428.142 173.822 L
436.052 174.839 L
443.897 176.372 L
451.769 177.876 L
459.61 180.281 L
463.547 181.115 L
463.547 180.796 L
463.547 180.487 L
459.61 179.663 L
451.769 177.287 L
443.897 175.747 L
436.052 174.263 L
428.142 173.137 L
420.308 172.195 L
412.437 171.21 L
404.587 169.259 L
396.711 168.083 L
388.869 166.138 L
380.997 164.515 L
373.153 161.905 L
365.243 160.442 L
357.5 158.756 L
349.638 155.048 L
341.687 150.981 L
333.931 148.059 L
325.97 145.286 L
318.098 141.691 L
310.099 138.362 L
302.344 135.275 L
294.601 129.694 L
286.538 125.025 L
278.569 119.136 L
270.793 118.14 L
262.81 118.58 L
255.198 119.439 L
247.508 119.247 L
239.781 117.364 L
231.333 114.886 L
223.639 112.434 L
216.107 109.847 L
207.893 107.788 L
199.911 105.332 L
192.299 103.478 L
183.99 101.793 L
176.207 100.004 L
169.169 98.482 L
161.539 97.077 L
153.208 95.828 L
145.944 94.577 L
138.048 93.057 L
129.399 91.383 L
122.325 89.876 L
114.652 87.83 L
106.269 84.943 L
97.033 81.251 L
90.308 78.563 L
83.045 75.841 L
75.149 73.064 L
66.5 69.947 L
66.5 70.667 L
75.149 73.728 L
83.045 76.483 L
90.308 79.202 L
97.033 81.895 L
cp
f
GR
GS
0.906 0.549 0.608 RC
1 LJ
0.5 LW
N
66.5 70.667 M
75.149 73.728 L
83.045 76.483 L
90.308 79.202 L
97.033 81.895 L
106.269 85.598 L
114.652 88.489 L
122.325 90.508 L
129.399 91.962 L
138.048 93.603 L
145.944 95.126 L
153.208 96.352 L
161.539 97.572 L
169.169 99.051 L
176.207 100.54 L
183.99 102.238 L
192.299 103.972 L
199.911 105.827 L
207.893 108.305 L
216.107 110.347 L
223.639 112.958 L
231.333 115.417 L
239.781 117.949 L
247.508 119.647 L
255.198 119.966 L
262.81 119.176 L
270.793 118.895 L
278.569 119.917 L
286.538 125.595 L
294.601 130.33 L
302.344 135.797 L
310.099 138.913 L
318.098 142.255 L
325.97 145.881 L
333.931 148.569 L
341.687 151.56 L
349.638 155.586 L
357.5 159.316 L
365.243 161.034 L
373.153 162.49 L
380.997 165.105 L
388.869 166.726 L
396.711 168.763 L
404.587 169.869 L
412.437 171.831 L
420.308 172.867 L
428.142 173.822 L
436.052 174.839 L
443.897 176.372 L
451.769 177.876 L
459.61 180.281 L
463.547 181.115 L
S
GR
GS
0.906 0.549 0.608 RC
1 LJ
0.5 LW
N
66.5 69.947 M
75.149 73.064 L
83.045 75.841 L
90.308 78.563 L
97.033 81.251 L
106.269 84.943 L
114.652 87.83 L
122.325 89.876 L
129.399 91.383 L
138.048 93.057 L
145.944 94.577 L
153.208 95.828 L
161.539 97.077 L
169.169 98.482 L
176.207 100.004 L
183.99 101.793 L
192.299 103.478 L
199.911 105.332 L
207.893 107.788 L
216.107 109.847 L
223.639 112.434 L
231.333 114.886 L
239.781 117.364 L
247.508 119.247 L
255.198 119.439 L
262.81 118.58 L
270.793 118.14 L
278.569 119.136 L
286.538 125.025 L
294.601 129.694 L
302.344 135.275 L
310.099 138.362 L
318.098 141.691 L
325.97 145.286 L
333.931 148.059 L
341.687 150.981 L
349.638 155.048 L
357.5 158.756 L
365.243 160.442 L
373.153 161.905 L
380.997 164.515 L
388.869 166.138 L
396.711 168.083 L
404.587 169.259 L
412.437 171.21 L
420.308 172.195 L
428.142 173.137 L
436.052 174.263 L
443.897 175.747 L
451.769 177.287 L
459.61 179.663 L
463.547 180.487 L
S
GR
GS
0.792 0 0.125 RC
1 LJ
2 LW
N
66.5 70.307 M
75.149 73.396 L
83.045 76.162 L
90.308 78.883 L
97.033 81.573 L
106.269 85.27 L
114.652 88.16 L
122.325 90.192 L
129.399 91.672 L
138.048 93.33 L
145.944 94.851 L
153.208 96.09 L
161.539 97.324 L
169.169 98.767 L
176.207 100.272 L
183.99 102.016 L
192.299 103.725 L
199.911 105.58 L
207.893 108.046 L
216.107 110.097 L
223.639 112.696 L
231.333 115.151 L
239.781 117.656 L
247.508 119.447 L
255.198 119.703 L
262.81 118.878 L
270.793 118.518 L
278.569 119.526 L
286.538 125.31 L
294.601 130.012 L
302.344 135.536 L
310.099 138.638 L
318.098 141.973 L
325.97 145.583 L
333.931 148.314 L
341.687 151.27 L
349.638 155.317 L
357.5 159.036 L
365.243 160.738 L
373.153 162.197 L
380.997 164.81 L
388.869 166.432 L
396.711 168.423 L
404.587 169.564 L
412.437 171.52 L
420.308 172.531 L
428.142 173.479 L
436.052 174.551 L
443.897 176.059 L
451.769 177.581 L
459.61 179.972 L
463.547 180.801 L
S
GR
GS
[1 0 0 1 375.5 195.75] CT
/Helvetica 18 F
GS
[1 0 0 1 0 0] CT
0 7 moveto 
1 -1 scale
(1 Target) t 
GR
GR
GS
0.02 0.443 0.69 RC
1 LJ
2 LW
N
342.5 195.75 M
372.5 195.75 L
S
GR
GS
[1 0 0 1 375.5 217.75] CT
/Helvetica 18 F
GS
[1 0 0 1 0 0] CT
0 7 moveto 
1 -1 scale
(4 Targets) t 
GR
GR
GS
0.792 0 0.125 RC
1 LJ
2 LW
N
342.5 217.75 M
372.5 217.75 L
S
GR
GS
1 GC
N
112.5 201.5 M
215 201.5 L
215 144 L
112.5 144 L
cp
f
GR
GS
0.149 GC
2 setlinecap
1 LJ
0.5 LW
N
112.5 201.5 M
215 201.5 L
S
GR
GS
0.149 GC
2 setlinecap
1 LJ
0.5 LW
N
112.5 201.5 M
112.5 200.475 L
S
GR
GS
0.149 GC
2 setlinecap
1 LJ
0.5 LW
N
163.75 201.5 M
163.75 200.475 L
S
GR
GS
0.149 GC
2 setlinecap
1 LJ
0.5 LW
N
215 201.5 M
215 200.475 L
S
GR
GS
[1 0 0 1 112.5 206.29999] CT
0.149 GC
/Helvetica 14 F
GS
[1 0 0 1 0 0] CT
-4 14 moveto 
1 -1 scale
(0) t 
GR
GR
GS
[1 0 0 1 163.75 206.29999] CT
0.149 GC
/Helvetica 14 F
GS
[1 0 0 1 0 0] CT
-14 14 moveto 
1 -1 scale
(0.05) t 
GR
GR
GS
[1 0 0 1 215 206.29999] CT
0.149 GC
/Helvetica 14 F
GS
[1 0 0 1 0 0] CT
-10 14 moveto 
1 -1 scale
(0.1) t 
GR
GR
GS
0.149 GC
2 setlinecap
1 LJ
0.5 LW
N
112.5 201.5 M
112.5 144 L
S
GR
GS
0.149 GC
2 setlinecap
1 LJ
0.5 LW
N
112.5 190 M
113.525 190 L
S
GR
GS
0.149 GC
2 setlinecap
1 LJ
0.5 LW
N
112.5 167 M
113.525 167 L
S
GR
GS
0.149 GC
2 setlinecap
1 LJ
0.5 LW
N
112.5 144 M
113.525 144 L
S
GR
GS
[1 0 0 1 107.7 190.00002] CT
0.149 GC
/Helvetica 14 F
GS
[1 0 0 1 0 0] CT
-25 5.5 moveto 
1 -1 scale
(-7.4) t 
GR
GR
GS
[1 0 0 1 107.7 167.00005] CT
0.149 GC
/Helvetica 14 F
GS
[1 0 0 1 0 0] CT
-25 5.5 moveto 
1 -1 scale
(-7.3) t 
GR
GR
GS
[1 0 0 1 107.7 143.99995] CT
0.149 GC
/Helvetica 14 F
GS
[1 0 0 1 0 0] CT
-25 5.5 moveto 
1 -1 scale
(-7.2) t 
GR
GR
GS
0.754 0.86 0.922 RC
N
154.928 171.324 M
193.661 182.382 L
215.012 189.015 L
215.012 187.346 L
215.012 186.168 L
193.661 179.444 L
154.928 168.14 L
112.5 156.086 L
112.5 159.58 L
cp
f
GR
GS
0.561 0.749 0.859 RC
1 LJ
0.5 LW
N
112.5 159.58 M
154.928 171.324 L
193.661 182.382 L
215.012 189.015 L
S
GR
GS
0.561 0.749 0.859 RC
1 LJ
0.5 LW
N
112.5 156.086 M
154.928 168.14 L
193.661 179.444 L
215.012 186.168 L
S
GR
GS
0.02 0.443 0.69 RC
1 LJ
N
112.5 157.833 M
154.928 169.732 L
193.661 180.913 L
215.012 187.592 L
S
GR
GS
0.948 0.749 0.781 RC
N
215.012 192.074 M
215.012 191.117 L
193.661 185.054 L
154.928 174.729 L
112.5 163.137 L
112.5 165.816 L
154.928 177.197 L
193.661 187.441 L
215.012 193.5 L
cp
f
GR
GS
0.906 0.549 0.608 RC
1 LJ
0.5 LW
N
112.5 165.816 M
154.928 177.197 L
193.661 187.441 L
215.012 193.5 L
S
GR
GS
0.906 0.549 0.608 RC
1 LJ
0.5 LW
N
112.5 163.137 M
154.928 174.729 L
193.661 185.054 L
215.012 191.117 L
S
GR
GS
0.792 0 0.125 RC
1 LJ
N
112.5 164.476 M
154.928 175.963 L
193.661 186.248 L
215.012 192.309 L
S
GR
GS
1 GC
N
348 101 M
450.5 101 L
450.5 43 L
348 43 L
cp
f
GR
GS
0.149 GC
2 setlinecap
1 LJ
0.5 LW
N
348 101 M
450.5 101 L
S
GR
GS
0.149 GC
2 setlinecap
1 LJ
0.5 LW
N
348 101 M
348 99.975 L
S
GR
GS
0.149 GC
2 setlinecap
1 LJ
0.5 LW
N
382.167 101 M
382.167 99.975 L
S
GR
GS
0.149 GC
2 setlinecap
1 LJ
0.5 LW
N
416.333 101 M
416.333 99.975 L
S
GR
GS
[1 0 0 1 348 105.79987] CT
0.149 GC
/Helvetica 14 F
GS
[1 0 0 1 0 0] CT
-14 14 moveto 
1 -1 scale
(1.75) t 
GR
GR
GS
[1 0 0 1 382.16663 105.79987] CT
0.149 GC
/Helvetica 14 F
GS
[1 0 0 1 0 0] CT
-10 14 moveto 
1 -1 scale
(1.8) t 
GR
GR
GS
[1 0 0 1 416.33334 105.79987] CT
0.149 GC
/Helvetica 14 F
GS
[1 0 0 1 0 0] CT
-14 14 moveto 
1 -1 scale
(1.85) t 
GR
GR
GS
0.149 GC
2 setlinecap
1 LJ
0.5 LW
N
348 101 M
348 43 L
S
GR
GS
0.149 GC
2 setlinecap
1 LJ
0.5 LW
N
348 90.259 M
349.025 90.259 L
S
GR
GS
0.149 GC
2 setlinecap
1 LJ
0.5 LW
N
348 68.778 M
349.025 68.778 L
S
GR
GS
0.149 GC
2 setlinecap
1 LJ
0.5 LW
N
348 47.296 M
349.025 47.296 L
S
GR
GS
[1 0 0 1 343.19998 90.25934] CT
0.149 GC
/Helvetica 14 F
GS
[1 0 0 1 0 0] CT
-25 5.5 moveto 
1 -1 scale
(-9.1) t 
GR
GR
GS
[1 0 0 1 343.19998 68.77778] CT
0.149 GC
/Helvetica 14 F
GS
[1 0 0 1 0 0] CT
-14 5.5 moveto 
1 -1 scale
(-9) t 
GR
GR
GS
[1 0 0 1 343.19998 47.29622] CT
0.149 GC
/Helvetica 14 F
GS
[1 0 0 1 0 0] CT
-25 5.5 moveto 
1 -1 scale
(-8.9) t 
GR
GR
GS
0.754 0.86 0.922 RC
N
360.736 68.775 M
347.988 66.33 L
347.988 67.526 L
347.988 68.808 L
360.736 71.303 L
386.39 75.881 L
412.135 81.634 L
437.779 87.779 L
450.512 91.683 L
450.512 90.371 L
450.512 89.044 L
437.779 85.154 L
412.135 79.22 L
386.39 73.116 L
cp
f
GR
GS
0.561 0.749 0.859 RC
1 LJ
0.5 LW
N
347.988 68.808 M
360.736 71.303 L
386.39 75.881 L
412.135 81.634 L
437.779 87.779 L
450.512 91.683 L
S
GR
GS
0.561 0.749 0.859 RC
1 LJ
0.5 LW
N
347.988 66.33 M
360.736 68.775 L
386.39 73.116 L
412.135 79.22 L
437.779 85.154 L
450.512 89.044 L
S
GR
GS
0.02 0.443 0.69 RC
1 LJ
N
347.988 67.569 M
360.736 70.039 L
386.39 74.498 L
412.135 80.427 L
437.779 86.466 L
450.512 90.363 L
S
GR
GS
0.948 0.749 0.781 RC
N
412.135 72.752 M
386.39 67.404 L
360.736 62.249 L
347.988 60.322 L
347.988 61.495 L
347.988 62.509 L
360.736 64.25 L
386.39 69.572 L
412.135 74.796 L
437.779 83.147 L
450.512 86.012 L
450.512 84.916 L
450.512 83.832 L
437.779 81.003 L
cp
f
GR
GS
0.906 0.549 0.608 RC
1 LJ
0.5 LW
N
347.988 62.509 M
360.736 64.25 L
386.39 69.572 L
412.135 74.796 L
437.779 83.147 L
450.512 86.012 L
S
GR
GS
0.906 0.549 0.608 RC
1 LJ
0.5 LW
N
347.988 60.322 M
360.736 62.249 L
386.39 67.404 L
412.135 72.752 L
437.779 81.003 L
450.512 83.832 L
S
GR
GS
0.792 0 0.125 RC
1 LJ
N
347.988 61.415 M
360.736 63.25 L
386.39 68.488 L
412.135 73.774 L
437.779 82.075 L
450.512 84.922 L
S
GR
%%Trailer
%%Pages: 1
%%EOF
