%!PS-Adobe-3.0 EPSF-3.0
%%Creator: (MATLAB, The Mathworks, Inc. Version 9.8.0.1323502 \(R2020a\). Operating System: Mac OS X)
%%Title: /Users/kosciessa/Desktop/tardis/LNDG/stateswitch/stsw_eeg_stroop/erp/figures/B_StroopCPP_mismatch.eps
%%CreationDate: 2022-11-03T14:49:31
%%Pages: (atend)
%%BoundingBox:     3     3   232   248
%%LanguageLevel: 3
%%EndComments
%%BeginProlog
%%BeginResource: procset (Apache XML Graphics Std ProcSet) 1.2 0
%%Version: 1.2 0
%%Copyright: (Copyright 2001-2003,2010 The Apache Software Foundation. License terms: http://www.apache.org/licenses/LICENSE-2.0)
/bd{bind def}bind def
/ld{load def}bd
/GR/grestore ld
/GS/gsave ld
/RM/rmoveto ld
/C/curveto ld
/t/show ld
/L/lineto ld
/ML/setmiterlimit ld
/CT/concat ld
/f/fill ld
/N/newpath ld
/S/stroke ld
/CC/setcmykcolor ld
/A/ashow ld
/cp/closepath ld
/RC/setrgbcolor ld
/LJ/setlinejoin ld
/GC/setgray ld
/LW/setlinewidth ld
/M/moveto ld
/re {4 2 roll M
1 index 0 rlineto
0 exch rlineto
neg 0 rlineto
cp } bd
/_ctm matrix def
/_tm matrix def
/BT { _ctm currentmatrix pop matrix _tm copy pop 0 0 moveto } bd
/ET { _ctm setmatrix } bd
/iTm { _ctm setmatrix _tm concat } bd
/Tm { _tm astore pop iTm 0 0 moveto } bd
/ux 0.0 def
/uy 0.0 def
/F {
  /Tp exch def
  /Tf exch def
  Tf findfont Tp scalefont setfont
  /cf Tf def  /cs Tp def
} bd
/ULS {currentpoint /uy exch def /ux exch def} bd
/ULE {
  /Tcx currentpoint pop def
  gsave
  newpath
  cf findfont cs scalefont dup
  /FontMatrix get 0 get /Ts exch def /FontInfo get dup
  /UnderlinePosition get Ts mul /To exch def
  /UnderlineThickness get Ts mul /Tt exch def
  ux uy To add moveto  Tcx uy To add lineto
  Tt setlinewidth stroke
  grestore
} bd
/OLE {
  /Tcx currentpoint pop def
  gsave
  newpath
  cf findfont cs scalefont dup
  /FontMatrix get 0 get /Ts exch def /FontInfo get dup
  /UnderlinePosition get Ts mul /To exch def
  /UnderlineThickness get Ts mul /Tt exch def
  ux uy To add cs add moveto Tcx uy To add cs add lineto
  Tt setlinewidth stroke
  grestore
} bd
/SOE {
  /Tcx currentpoint pop def
  gsave
  newpath
  cf findfont cs scalefont dup
  /FontMatrix get 0 get /Ts exch def /FontInfo get dup
  /UnderlinePosition get Ts mul /To exch def
  /UnderlineThickness get Ts mul /Tt exch def
  ux uy To add cs 10 mul 26 idiv add moveto Tcx uy To add cs 10 mul 26 idiv add lineto
  Tt setlinewidth stroke
  grestore
} bd
/QT {
/Y22 exch store
/X22 exch store
/Y21 exch store
/X21 exch store
currentpoint
/Y21 load 2 mul add 3 div exch
/X21 load 2 mul add 3 div exch
/X21 load 2 mul /X22 load add 3 div
/Y21 load 2 mul /Y22 load add 3 div
/X22 load /Y22 load curveto
} bd
/SSPD {
dup length /d exch dict def
{
/v exch def
/k exch def
currentpagedevice k known {
/cpdv currentpagedevice k get def
v cpdv ne {
/upd false def
/nullv v type /nulltype eq def
/nullcpdv cpdv type /nulltype eq def
nullv nullcpdv or
{
/upd true def
} {
/sametype v type cpdv type eq def
sametype {
v type /arraytype eq {
/vlen v length def
/cpdvlen cpdv length def
vlen cpdvlen eq {
0 1 vlen 1 sub {
/i exch def
/obj v i get def
/cpdobj cpdv i get def
obj cpdobj ne {
/upd true def
exit
} if
} for
} {
/upd true def
} ifelse
} {
v type /dicttype eq {
v {
/dv exch def
/dk exch def
/cpddv cpdv dk get def
dv cpddv ne {
/upd true def
exit
} if
} forall
} {
/upd true def
} ifelse
} ifelse
} if
} ifelse
upd true eq {
d k v put
} if
} if
} if
} forall
d length 0 gt {
d setpagedevice
} if
} bd
/RE { % /NewFontName [NewEncodingArray] /FontName RE -
  findfont dup length dict begin
  {
    1 index /FID ne
    {def} {pop pop} ifelse
  } forall
  /Encoding exch def
  /FontName 1 index def
  currentdict definefont pop
  end
} bind def
%%EndResource
%%BeginResource: procset (Apache XML Graphics EPS ProcSet) 1.0 0
%%Version: 1.0 0
%%Copyright: (Copyright 2002-2003 The Apache Software Foundation. License terms: http://www.apache.org/licenses/LICENSE-2.0)
/BeginEPSF { %def
/b4_Inc_state save def         % Save state for cleanup
/dict_count countdictstack def % Count objects on dict stack
/op_count count 1 sub def      % Count objects on operand stack
userdict begin                 % Push userdict on dict stack
/showpage { } def              % Redefine showpage, { } = null proc
0 setgray 0 setlinecap         % Prepare graphics state
1 setlinewidth 0 setlinejoin
10 setmiterlimit [ ] 0 setdash newpath
/languagelevel where           % If level not equal to 1 then
{pop languagelevel             % set strokeadjust and
1 ne                           % overprint to their defaults.
{false setstrokeadjust false setoverprint
} if
} if
} bd
/EndEPSF { %def
count op_count sub {pop} repeat            % Clean up stacks
countdictstack dict_count sub {end} repeat
b4_Inc_state restore
} bd
%%EndResource
%FOPBeginFontDict
%%IncludeResource: font Courier-Oblique
%%IncludeResource: font Courier-BoldOblique
%%IncludeResource: font Courier-Bold
%%IncludeResource: font ZapfDingbats
%%IncludeResource: font Symbol
%%IncludeResource: font Helvetica
%%IncludeResource: font Helvetica-Oblique
%%IncludeResource: font Helvetica-Bold
%%IncludeResource: font Helvetica-BoldOblique
%%IncludeResource: font Times-Roman
%%IncludeResource: font Times-Italic
%%IncludeResource: font Times-Bold
%%IncludeResource: font Times-BoldItalic
%%IncludeResource: font Courier
%FOPEndFontDict
%%BeginResource: encoding WinAnsiEncoding
/WinAnsiEncoding [
/.notdef /.notdef /.notdef /.notdef /.notdef
/.notdef /.notdef /.notdef /.notdef /.notdef
/.notdef /.notdef /.notdef /.notdef /.notdef
/.notdef /.notdef /.notdef /.notdef /.notdef
/.notdef /.notdef /.notdef /.notdef /.notdef
/.notdef /.notdef /.notdef /.notdef /.notdef
/.notdef /.notdef /space /exclam /quotedbl
/numbersign /dollar /percent /ampersand /quotesingle
/parenleft /parenright /asterisk /plus /comma
/hyphen /period /slash /zero /one
/two /three /four /five /six
/seven /eight /nine /colon /semicolon
/less /equal /greater /question /at
/A /B /C /D /E
/F /G /H /I /J
/K /L /M /N /O
/P /Q /R /S /T
/U /V /W /X /Y
/Z /bracketleft /backslash /bracketright /asciicircum
/underscore /quoteleft /a /b /c
/d /e /f /g /h
/i /j /k /l /m
/n /o /p /q /r
/s /t /u /v /w
/x /y /z /braceleft /bar
/braceright /asciitilde /bullet /Euro /bullet
/quotesinglbase /florin /quotedblbase /ellipsis /dagger
/daggerdbl /circumflex /perthousand /Scaron /guilsinglleft
/OE /bullet /Zcaron /bullet /bullet
/quoteleft /quoteright /quotedblleft /quotedblright /bullet
/endash /emdash /asciitilde /trademark /scaron
/guilsinglright /oe /bullet /zcaron /Ydieresis
/space /exclamdown /cent /sterling /currency
/yen /brokenbar /section /dieresis /copyright
/ordfeminine /guillemotleft /logicalnot /sfthyphen /registered
/macron /degree /plusminus /twosuperior /threesuperior
/acute /mu /paragraph /middot /cedilla
/onesuperior /ordmasculine /guillemotright /onequarter /onehalf
/threequarters /questiondown /Agrave /Aacute /Acircumflex
/Atilde /Adieresis /Aring /AE /Ccedilla
/Egrave /Eacute /Ecircumflex /Edieresis /Igrave
/Iacute /Icircumflex /Idieresis /Eth /Ntilde
/Ograve /Oacute /Ocircumflex /Otilde /Odieresis
/multiply /Oslash /Ugrave /Uacute /Ucircumflex
/Udieresis /Yacute /Thorn /germandbls /agrave
/aacute /acircumflex /atilde /adieresis /aring
/ae /ccedilla /egrave /eacute /ecircumflex
/edieresis /igrave /iacute /icircumflex /idieresis
/eth /ntilde /ograve /oacute /ocircumflex
/otilde /odieresis /divide /oslash /ugrave
/uacute /ucircumflex /udieresis /yacute /thorn
/ydieresis
] def
%%EndResource
%FOPBeginFontReencode
/Courier-Oblique findfont
dup length dict begin
  {1 index /FID ne {def} {pop pop} ifelse} forall
  /Encoding WinAnsiEncoding def
  currentdict
end
/Courier-Oblique exch definefont pop
/Courier-BoldOblique findfont
dup length dict begin
  {1 index /FID ne {def} {pop pop} ifelse} forall
  /Encoding WinAnsiEncoding def
  currentdict
end
/Courier-BoldOblique exch definefont pop
/Courier-Bold findfont
dup length dict begin
  {1 index /FID ne {def} {pop pop} ifelse} forall
  /Encoding WinAnsiEncoding def
  currentdict
end
/Courier-Bold exch definefont pop
/Helvetica findfont
dup length dict begin
  {1 index /FID ne {def} {pop pop} ifelse} forall
  /Encoding WinAnsiEncoding def
  currentdict
end
/Helvetica exch definefont pop
/Helvetica-Oblique findfont
dup length dict begin
  {1 index /FID ne {def} {pop pop} ifelse} forall
  /Encoding WinAnsiEncoding def
  currentdict
end
/Helvetica-Oblique exch definefont pop
/Helvetica-Bold findfont
dup length dict begin
  {1 index /FID ne {def} {pop pop} ifelse} forall
  /Encoding WinAnsiEncoding def
  currentdict
end
/Helvetica-Bold exch definefont pop
/Helvetica-BoldOblique findfont
dup length dict begin
  {1 index /FID ne {def} {pop pop} ifelse} forall
  /Encoding WinAnsiEncoding def
  currentdict
end
/Helvetica-BoldOblique exch definefont pop
/Times-Roman findfont
dup length dict begin
  {1 index /FID ne {def} {pop pop} ifelse} forall
  /Encoding WinAnsiEncoding def
  currentdict
end
/Times-Roman exch definefont pop
/Times-Italic findfont
dup length dict begin
  {1 index /FID ne {def} {pop pop} ifelse} forall
  /Encoding WinAnsiEncoding def
  currentdict
end
/Times-Italic exch definefont pop
/Times-Bold findfont
dup length dict begin
  {1 index /FID ne {def} {pop pop} ifelse} forall
  /Encoding WinAnsiEncoding def
  currentdict
end
/Times-Bold exch definefont pop
/Times-BoldItalic findfont
dup length dict begin
  {1 index /FID ne {def} {pop pop} ifelse} forall
  /Encoding WinAnsiEncoding def
  currentdict
end
/Times-BoldItalic exch definefont pop
/Courier findfont
dup length dict begin
  {1 index /FID ne {def} {pop pop} ifelse} forall
  /Encoding WinAnsiEncoding def
  currentdict
end
/Courier exch definefont pop
%FOPEndFontReencode
%%EndProlog
%%Page: 1 1
%%PageBoundingBox: 0 0 255 255
%%BeginPageSetup
[1 0 0 -1 0 255] CT
%%EndPageSetup
GS
[1.00046 0 0 1 0 0] CT
1 GC
N
0 0 255 255 re
f
GR
GS
[1.00046 0 0 1 0 0] CT
1 GC
N
0 0 255 255 re
f
GR
GS
[1.00046 0 0 1 0 0] CT
1 GC
N
104 225 M
231 225 L
231 29 L
104 29 L
cp
f
GR
GS
[1.00046 0 0 1 0 0] CT
0.149 GC
2 setlinecap
1 LJ
0.5 LW
N
104 225 M
231 225 L
S
GR
GS
[1.00046 0 0 1 0 0] CT
0.149 GC
2 setlinecap
1 LJ
0.5 LW
N
142.1 225 M
142.1 223.04 L
S
GR
GS
[1.00046 0 0 1 0 0] CT
0.149 GC
2 setlinecap
1 LJ
0.5 LW
N
192.9 225 M
192.9 223.04 L
S
GR
GS
[1.00046 0 0 1 142.16582 231] CT
0.149 GC
/Helvetica 20 F
GS
[1 0 0 1 0 0] CT
-13 20 moveto 
1 -1 scale
(YA) t 
GR
GR
GS
[1.00046 0 0 1 192.98934 231] CT
0.149 GC
/Helvetica 20 F
GS
[1 0 0 1 0 0] CT
-14.5 20 moveto 
1 -1 scale
(OA) t 
GR
GR
GS
[1.00046 0 0 1 0 0] CT
0.149 GC
2 setlinecap
1 LJ
0.5 LW
N
104 225 M
104 29 L
S
GR
GS
[1.00046 0 0 1 0 0] CT
0.149 GC
2 setlinecap
1 LJ
0.5 LW
N
104 225 M
105.96 225 L
S
GR
GS
[1.00046 0 0 1 0 0] CT
0.149 GC
2 setlinecap
1 LJ
0.5 LW
N
104 127 M
105.96 127 L
S
GR
GS
[1.00046 0 0 1 0 0] CT
0.149 GC
2 setlinecap
1 LJ
0.5 LW
N
104 29 M
105.96 29 L
S
GR
GS
[1.00046 0 0 1 98.04539 225] CT
0.149 GC
/Helvetica 20 F
GS
[1 0 0 1 0 0] CT
-47 7.5 moveto 
1 -1 scale
(-0.05) t 
GR
GR
GS
[1.00046 0 0 1 98.04539 127] CT
0.149 GC
/Helvetica 20 F
GS
[1 0 0 1 0 0] CT
-12 7.5 moveto 
1 -1 scale
(0) t 
GR
GR
GS
[1.00046 0 0 1 98.04539 29] CT
0.149 GC
/Helvetica 20 F
GS
[1 0 0 1 0 0] CT
-39 7.5 moveto 
1 -1 scale
(0.05) t 
GR
GR
GS
[0 -1 1.00046 0 48.02223 126.99991] CT
0.149 GC
/Helvetica 20 F
GS
[1 0 0 1 0 0] CT
-47.5 -30 moveto 
1 -1 scale
(CPP slope) t 
GR
GR
GS
[0 -1 1.00046 0 48.02223 126.99991] CT
0.149 GC
/Helvetica 20 F
GS
[1 0 0 1 0 0] CT
-76 -5 moveto 
1 -1 scale
(Mismatch-Match) t 
GR
GR
GS
[1.00046 0 0 1 167.57773 26.5] CT
/Helvetica-Bold 20 F
GS
[1 0 0 1 0 0] CT
-37.5 -5 moveto 
1 -1 scale
(p = 0.01) t 
GR
GR
GS
[1.00046 0 0 1 0 0] CT
0.149 GC
1 LJ
0.5 LW
N
104 127 M
231 127 L
S
GR
GS
[1.00046 0 0 1 0 0] CT
0.6 0.8 1 RC
N
121.78 127 M
121.78 139.391 L
162.42 139.391 L
162.42 127 L
cp
f
GR
GS
[1.00046 0 0 1 137.63482 172.04295] CT
0.302 GC
N
2.236 0 M
2.236 -1.235 1.235 -2.236 0 -2.236 C
-1.235 -2.236 -2.236 -1.235 -2.236 0 C
-2.236 1.235 -1.235 2.236 0 2.236 C
1.235 2.236 2.236 1.235 2.236 0 C
cp
f
GR
GS
[1.00046 0 0 1 147.13405 131.86598] CT
0.302 GC
N
/f-1586420743{2.236 0 M
2.236 -1.235 1.235 -2.236 0 -2.236 C
-1.235 -2.236 -2.236 -1.235 -2.236 0 C
-2.236 1.235 -1.235 2.236 0 2.236 C
1.235 2.236 2.236 1.235 2.236 0 C
cp}def
f-1586420743
f
GR
GS
[1.00046 0 0 1 150.71018 141.93298] CT
0.302 GC
N
f-1586420743
f
GR
GS
[1.00046 0 0 1 145.84768 128.86003] CT
0.302 GC
N
f-1586420743
f
GR
GS
[1.00046 0 0 1 133.06282 120.32275] CT
0.302 GC
N
f-1586420743
f
GR
GS
[1.00046 0 0 1 148.53806 187.84758] CT
0.302 GC
N
f-1586420743
f
GR
GS
[1.00046 0 0 1 147.91789 150.20265] CT
0.302 GC
N
f-1586420743
f
GR
GS
[1.00046 0 0 1 143.7916 148.41478] CT
0.302 GC
N
f-1586420743
f
GR
GS
[1.00046 0 0 1 140.69756 151.18069] CT
0.302 GC
N
f-1586420743
f
GR
GS
[1.00046 0 0 1 141.36438 140.78882] CT
0.302 GC
N
f-1586420743
f
GR
GS
[1.00046 0 0 1 134.79371 99.63898] CT
0.302 GC
N
f-1586420743
f
GR
GS
[1.00046 0 0 1 141.10935 151.04285] CT
0.302 GC
N
f-1586420743
f
GR
GS
[1.00046 0 0 1 134.43024 131.01401] CT
0.302 GC
N
f-1586420743
f
GR
GS
[1.00046 0 0 1 149.4907 126.28821] CT
0.302 GC
N
f-1586420743
f
GR
GS
[1.00046 0 0 1 144.02888 158.34126] CT
0.302 GC
N
f-1586420743
f
GR
GS
[1.00046 0 0 1 139.18192 148.2605] CT
0.302 GC
N
f-1586420743
f
GR
GS
[1.00046 0 0 1 150.82296 93.22359] CT
0.302 GC
N
f-1586420743
f
GR
GS
[1.00046 0 0 1 144.88491 187.39873] CT
0.302 GC
N
f-1586420743
f
GR
GS
[1.00046 0 0 1 137.27652 98.4478] CT
0.302 GC
N
f-1586420743
f
GR
GS
[1.00046 0 0 1 145.17093 126.4413] CT
0.302 GC
N
f-1586420743
f
GR
GS
[1.00046 0 0 1 140.77563 159.44051] CT
0.302 GC
N
f-1586420743
f
GR
GS
[1.00046 0 0 1 136.51232 149.14543] CT
0.302 GC
N
f-1586420743
f
GR
GS
[1.00046 0 0 1 148.84152 111.34069] CT
0.302 GC
N
f-1586420743
f
GR
GS
[1.00046 0 0 1 139.41055 177.03087] CT
0.302 GC
N
f-1586420743
f
GR
GS
[1.00046 0 0 1 138.93465 113.7852] CT
0.302 GC
N
f-1586420743
f
GR
GS
[1.00046 0 0 1 143.6134 188.92101] CT
0.302 GC
N
f-1586420743
f
GR
GS
[1.00046 0 0 1 143.8368 160.78445] CT
0.302 GC
N
f-1586420743
f
GR
GS
[1.00046 0 0 1 147.31038 132.23813] CT
0.302 GC
N
f-1586420743
f
GR
GS
[1.00046 0 0 1 151.99221 142.69373] CT
0.302 GC
N
f-1586420743
f
GR
GS
[1.00046 0 0 1 143.9525 114.17168] CT
0.302 GC
N
f-1586420743
f
GR
GS
[1.00046 0 0 1 133.18287 123.90954] CT
0.302 GC
N
f-1586420743
f
GR
GS
[1.00046 0 0 1 137.9287 92.34451] CT
0.302 GC
N
f-1586420743
f
GR
GS
[1.00046 0 0 1 132.5753 178.81535] CT
0.302 GC
N
f-1586420743
f
GR
GS
[1.00046 0 0 1 150.85943 132.97432] CT
0.302 GC
N
f-1586420743
f
GR
GS
[1.00046 0 0 1 137.78827 224.67365] CT
0.302 GC
N
f-1586420743
f
GR
GS
[1.00046 0 0 1 139.77219 65.33654] CT
0.302 GC
N
f-1586420743
f
GR
GS
[1.00046 0 0 1 147.93596 126.94585] CT
0.302 GC
N
f-1586420743
f
GR
GS
[1.00046 0 0 1 134.97284 89.34335] CT
0.302 GC
N
f-1586420743
f
GR
GS
[1.00046 0 0 1 134.85746 154.43228] CT
0.302 GC
N
f-1586420743
f
GR
GS
[1.00046 0 0 1 137.97305 133.93239] CT
0.302 GC
N
f-1586420743
f
GR
GS
[1.00046 0 0 1 145.05726 167.02975] CT
0.302 GC
N
f-1586420743
f
GR
GS
[1.00046 0 0 1 151.87703 139.52313] CT
0.302 GC
N
f-1586420743
f
GR
GS
[1.00046 0 0 1 148.5344 88.2751] CT
0.302 GC
N
f-1586420743
f
GR
GS
[1.00046 0 0 1 141.05105 142.29984] CT
0.302 GC
N
f-1586420743
f
GR
GS
[1.00046 0 0 1 138.17824 174.62119] CT
0.302 GC
N
f-1586420743
f
GR
GS
[1.00046 0 0 1 134.89027 125.26397] CT
0.302 GC
N
f-1586420743
f
GR
GS
[1.00046 0 0 1 151.54406 148.54437] CT
0.302 GC
N
f-1586420743
f
GR
GS
[1.00046 0 0 1 0 0] CT
0.6 0.8 1 RC
N
/f1495268014{172.58 127 M
172.58 154.234 L
213.22 154.234 L
213.22 127 L
cp}def
f1495268014
f
GR
GS
[1.00046 0 0 1 196.45504 163.89439] CT
0.302 GC
N
f-1586420743
f
GR
GS
[1.00046 0 0 1 195.41103 136.61639] CT
0.302 GC
N
f-1586420743
f
GR
GS
[1.00046 0 0 1 187.75599 148.65987] CT
0.302 GC
N
f-1586420743
f
GR
GS
[1.00046 0 0 1 184.80926 150.30817] CT
0.302 GC
N
f-1586420743
f
GR
GS
[1.00046 0 0 1 197.71085 141.10588] CT
0.302 GC
N
f-1586420743
f
GR
GS
[1.00046 0 0 1 186.61157 138.34462] CT
0.302 GC
N
f-1586420743
f
GR
GS
[1.00046 0 0 1 201.16542 186.8333] CT
0.302 GC
N
f-1586420743
f
GR
GS
[1.00046 0 0 1 198.56734 224.53691] CT
0.302 GC
N
f-1586420743
f
GR
GS
[1.00046 0 0 1 185.83534 143.84872] CT
0.302 GC
N
f-1586420743
f
GR
GS
[1.00046 0 0 1 199.80269 108.87126] CT
0.302 GC
N
f-1586420743
f
GR
GS
[1.00046 0 0 1 188.72479 131.32845] CT
0.302 GC
N
f-1586420743
f
GR
GS
[1.00046 0 0 1 183.17069 141.99751] CT
0.302 GC
N
f-1586420743
f
GR
GS
[1.00046 0 0 1 185.39332 155.40582] CT
0.302 GC
N
f-1586420743
f
GR
GS
[1.00046 0 0 1 188.24417 126.56393] CT
0.302 GC
N
f-1586420743
f
GR
GS
[1.00046 0 0 1 190.90701 145.33739] CT
0.302 GC
N
f-1586420743
f
GR
GS
[1.00046 0 0 1 201.53405 132.68011] CT
0.302 GC
N
f-1586420743
f
GR
GS
[1.00046 0 0 1 197.99493 138.19545] CT
0.302 GC
N
f-1586420743
f
GR
GS
[1.00046 0 0 1 202.76333 209.92183] CT
0.302 GC
N
f-1586420743
f
GR
GS
[1.00046 0 0 1 186.31176 130.28432] CT
0.302 GC
N
f-1586420743
f
GR
GS
[1.00046 0 0 1 188.75659 185.40797] CT
0.302 GC
N
f-1586420743
f
GR
GS
[1.00046 0 0 1 185.34717 177.61954] CT
0.302 GC
N
f-1586420743
f
GR
GS
[1.00046 0 0 1 187.42979 101.30755] CT
0.302 GC
N
f-1586420743
f
GR
GS
[1.00046 0 0 1 193.36564 196.05437] CT
0.302 GC
N
f-1586420743
f
GR
GS
[1.00046 0 0 1 192.80062 167.96507] CT
0.302 GC
N
f-1586420743
f
GR
GS
[1.00046 0 0 1 191.74834 182.9045] CT
0.302 GC
N
f-1586420743
f
GR
GS
[1.00046 0 0 1 192.25786 133.25967] CT
0.302 GC
N
f-1586420743
f
GR
GS
[1.00046 0 0 1 187.80159 139.23129] CT
0.302 GC
N
f-1586420743
f
GR
GS
[1.00046 0 0 1 195.46451 169.81242] CT
0.302 GC
N
f-1586420743
f
GR
GS
[1.00046 0 0 1 192.27787 184.25829] CT
0.302 GC
N
f-1586420743
f
GR
GS
[1.00046 0 0 1 195.76262 154.1042] CT
0.302 GC
N
f-1586420743
f
GR
GS
[1.00046 0 0 1 203.00481 208.92915] CT
0.302 GC
N
f-1586420743
f
GR
GS
[1.00046 0 0 1 201.40238 140.8782] CT
0.302 GC
N
f-1586420743
f
GR
GS
[1.00046 0 0 1 200.04677 174.67789] CT
0.302 GC
N
f-1586420743
f
GR
GS
[1.00046 0 0 1 194.42616 145.90201] CT
0.302 GC
N
f-1586420743
f
GR
GS
[1.00046 0 0 1 184.50279 138.97432] CT
0.302 GC
N
f-1586420743
f
GR
GS
[1.00046 0 0 1 193.70436 197.18242] CT
0.302 GC
N
f-1586420743
f
GR
GS
[1.00046 0 0 1 201.70228 134.05348] CT
0.302 GC
N
f-1586420743
f
GR
GS
[1.00046 0 0 1 188.38082 121.82565] CT
0.302 GC
N
f-1586420743
f
GR
GS
[1.00046 0 0 1 199.16071 151.28979] CT
0.302 GC
N
f-1586420743
f
GR
GS
[1.00046 0 0 1 196.87503 166.35728] CT
0.302 GC
N
f-1586420743
f
GR
GS
[1.00046 0 0 1 187.95939 175.29599] CT
0.302 GC
N
f-1586420743
f
GR
GS
[1.00046 0 0 1 192.66251 163.02638] CT
0.302 GC
N
f-1586420743
f
GR
GS
[1.00046 0 0 1 184.24114 160.41905] CT
0.302 GC
N
f-1586420743
f
GR
GS
[1.00046 0 0 1 197.1394 166.70982] CT
0.302 GC
N
f-1586420743
f
GR
GS
[1.00046 0 0 1 200.78387 151.35451] CT
0.302 GC
N
f-1586420743
f
GR
GS
[1.00046 0 0 1 186.36293 142.07135] CT
0.302 GC
N
f-1586420743
f
GR
GS
[1.00046 0 0 1 194.08058 110.45207] CT
0.302 GC
N
f-1586420743
f
GR
GS
[1.00046 0 0 1 190.9073 132.26526] CT
0.302 GC
N
f-1586420743
f
GR
GS
[1.00046 0 0 1 196.5724 122.23733] CT
0.302 GC
N
f-1586420743
f
GR
GS
[1.00046 0 0 1 200.31134 193.86612] CT
0.302 GC
N
f-1586420743
f
GR
GS
[1.00046 0 0 1 191.01758 121.51656] CT
0.302 GC
N
f-1586420743
f
GR
%%Trailer
%%Pages: 1
%%EOF
