%!PS-Adobe-3.0 EPSF-3.0
%%Creator: (MATLAB, The Mathworks, Inc. Version 9.1.0.441655 \(R2016b\). Operating System: Mac OS X)
%%Title: /Volumes/LNDG/Projects/StateSwitch/dynamic/data/eeg/rest/B_analyses/E_permMSE/C_figures/D2_FineScaleAssociation.eps
%%CreationDate: 2019-08-29T16:10:26
%%Pages: (atend)
%%BoundingBox:     4     0   361   354
%%LanguageLevel: 3
%%EndComments
%%BeginProlog
%%BeginResource: procset (Apache XML Graphics Std ProcSet) 1.2 0
%%Version: 1.2 0
%%Copyright: (Copyright 2001-2003,2010 The Apache Software Foundation. License terms: http://www.apache.org/licenses/LICENSE-2.0)
/bd{bind def}bind def
/ld{load def}bd
/GR/grestore ld
/M/moveto ld
/LJ/setlinejoin ld
/C/curveto ld
/f/fill ld
/LW/setlinewidth ld
/GC/setgray ld
/t/show ld
/N/newpath ld
/CT/concat ld
/cp/closepath ld
/S/stroke ld
/L/lineto ld
/CC/setcmykcolor ld
/A/ashow ld
/GS/gsave ld
/RC/setrgbcolor ld
/RM/rmoveto ld
/ML/setmiterlimit ld
/re {4 2 roll M
1 index 0 rlineto
0 exch rlineto
neg 0 rlineto
cp } bd
/_ctm matrix def
/_tm matrix def
/BT { _ctm currentmatrix pop matrix _tm copy pop 0 0 moveto } bd
/ET { _ctm setmatrix } bd
/iTm { _ctm setmatrix _tm concat } bd
/Tm { _tm astore pop iTm 0 0 moveto } bd
/ux 0.0 def
/uy 0.0 def
/F {
  /Tp exch def
  /Tf exch def
  Tf findfont Tp scalefont setfont
  /cf Tf def  /cs Tp def
} bd
/ULS {currentpoint /uy exch def /ux exch def} bd
/ULE {
  /Tcx currentpoint pop def
  gsave
  newpath
  cf findfont cs scalefont dup
  /FontMatrix get 0 get /Ts exch def /FontInfo get dup
  /UnderlinePosition get Ts mul /To exch def
  /UnderlineThickness get Ts mul /Tt exch def
  ux uy To add moveto  Tcx uy To add lineto
  Tt setlinewidth stroke
  grestore
} bd
/OLE {
  /Tcx currentpoint pop def
  gsave
  newpath
  cf findfont cs scalefont dup
  /FontMatrix get 0 get /Ts exch def /FontInfo get dup
  /UnderlinePosition get Ts mul /To exch def
  /UnderlineThickness get Ts mul /Tt exch def
  ux uy To add cs add moveto Tcx uy To add cs add lineto
  Tt setlinewidth stroke
  grestore
} bd
/SOE {
  /Tcx currentpoint pop def
  gsave
  newpath
  cf findfont cs scalefont dup
  /FontMatrix get 0 get /Ts exch def /FontInfo get dup
  /UnderlinePosition get Ts mul /To exch def
  /UnderlineThickness get Ts mul /Tt exch def
  ux uy To add cs 10 mul 26 idiv add moveto Tcx uy To add cs 10 mul 26 idiv add lineto
  Tt setlinewidth stroke
  grestore
} bd
/QT {
/Y22 exch store
/X22 exch store
/Y21 exch store
/X21 exch store
currentpoint
/Y21 load 2 mul add 3 div exch
/X21 load 2 mul add 3 div exch
/X21 load 2 mul /X22 load add 3 div
/Y21 load 2 mul /Y22 load add 3 div
/X22 load /Y22 load curveto
} bd
/SSPD {
dup length /d exch dict def
{
/v exch def
/k exch def
currentpagedevice k known {
/cpdv currentpagedevice k get def
v cpdv ne {
/upd false def
/nullv v type /nulltype eq def
/nullcpdv cpdv type /nulltype eq def
nullv nullcpdv or
{
/upd true def
} {
/sametype v type cpdv type eq def
sametype {
v type /arraytype eq {
/vlen v length def
/cpdvlen cpdv length def
vlen cpdvlen eq {
0 1 vlen 1 sub {
/i exch def
/obj v i get def
/cpdobj cpdv i get def
obj cpdobj ne {
/upd true def
exit
} if
} for
} {
/upd true def
} ifelse
} {
v type /dicttype eq {
v {
/dv exch def
/dk exch def
/cpddv cpdv dk get def
dv cpddv ne {
/upd true def
exit
} if
} forall
} {
/upd true def
} ifelse
} ifelse
} if
} ifelse
upd true eq {
d k v put
} if
} if
} if
} forall
d length 0 gt {
d setpagedevice
} if
} bd
/RE { % /NewFontName [NewEncodingArray] /FontName RE -
  findfont dup length dict begin
  {
    1 index /FID ne
    {def} {pop pop} ifelse
  } forall
  /Encoding exch def
  /FontName 1 index def
  currentdict definefont pop
  end
} bind def
%%EndResource
%%BeginResource: procset (Apache XML Graphics EPS ProcSet) 1.0 0
%%Version: 1.0 0
%%Copyright: (Copyright 2002-2003 The Apache Software Foundation. License terms: http://www.apache.org/licenses/LICENSE-2.0)
/BeginEPSF { %def
/b4_Inc_state save def         % Save state for cleanup
/dict_count countdictstack def % Count objects on dict stack
/op_count count 1 sub def      % Count objects on operand stack
userdict begin                 % Push userdict on dict stack
/showpage { } def              % Redefine showpage, { } = null proc
0 setgray 0 setlinecap         % Prepare graphics state
1 setlinewidth 0 setlinejoin
10 setmiterlimit [ ] 0 setdash newpath
/languagelevel where           % If level not equal to 1 then
{pop languagelevel             % set strokeadjust and
1 ne                           % overprint to their defaults.
{false setstrokeadjust false setoverprint
} if
} if
} bd
/EndEPSF { %def
count op_count sub {pop} repeat            % Clean up stacks
countdictstack dict_count sub {end} repeat
b4_Inc_state restore
} bd
%%EndResource
%FOPBeginFontDict
%%IncludeResource: font Courier-Bold
%%IncludeResource: font Helvetica
%%IncludeResource: font Courier-BoldOblique
%%IncludeResource: font Courier-Oblique
%%IncludeResource: font Times-Roman
%%IncludeResource: font Helvetica-BoldOblique
%%IncludeResource: font Helvetica-Bold
%%IncludeResource: font Helvetica-Oblique
%%IncludeResource: font Times-BoldItalic
%%IncludeResource: font Courier
%%IncludeResource: font Times-Italic
%%IncludeResource: font Times-Bold
%%IncludeResource: font Symbol
%%IncludeResource: font ZapfDingbats
%FOPEndFontDict
%%BeginResource: encoding WinAnsiEncoding
/WinAnsiEncoding [
/.notdef /.notdef /.notdef /.notdef /.notdef
/.notdef /.notdef /.notdef /.notdef /.notdef
/.notdef /.notdef /.notdef /.notdef /.notdef
/.notdef /.notdef /.notdef /.notdef /.notdef
/.notdef /.notdef /.notdef /.notdef /.notdef
/.notdef /.notdef /.notdef /.notdef /.notdef
/.notdef /.notdef /space /exclam /quotedbl
/numbersign /dollar /percent /ampersand /quotesingle
/parenleft /parenright /asterisk /plus /comma
/hyphen /period /slash /zero /one
/two /three /four /five /six
/seven /eight /nine /colon /semicolon
/less /equal /greater /question /at
/A /B /C /D /E
/F /G /H /I /J
/K /L /M /N /O
/P /Q /R /S /T
/U /V /W /X /Y
/Z /bracketleft /backslash /bracketright /asciicircum
/underscore /quoteleft /a /b /c
/d /e /f /g /h
/i /j /k /l /m
/n /o /p /q /r
/s /t /u /v /w
/x /y /z /braceleft /bar
/braceright /asciitilde /bullet /Euro /bullet
/quotesinglbase /florin /quotedblbase /ellipsis /dagger
/daggerdbl /circumflex /perthousand /Scaron /guilsinglleft
/OE /bullet /Zcaron /bullet /bullet
/quoteleft /quoteright /quotedblleft /quotedblright /bullet
/endash /emdash /asciitilde /trademark /scaron
/guilsinglright /oe /bullet /zcaron /Ydieresis
/space /exclamdown /cent /sterling /currency
/yen /brokenbar /section /dieresis /copyright
/ordfeminine /guillemotleft /logicalnot /sfthyphen /registered
/macron /degree /plusminus /twosuperior /threesuperior
/acute /mu /paragraph /middot /cedilla
/onesuperior /ordmasculine /guillemotright /onequarter /onehalf
/threequarters /questiondown /Agrave /Aacute /Acircumflex
/Atilde /Adieresis /Aring /AE /Ccedilla
/Egrave /Eacute /Ecircumflex /Edieresis /Igrave
/Iacute /Icircumflex /Idieresis /Eth /Ntilde
/Ograve /Oacute /Ocircumflex /Otilde /Odieresis
/multiply /Oslash /Ugrave /Uacute /Ucircumflex
/Udieresis /Yacute /Thorn /germandbls /agrave
/aacute /acircumflex /atilde /adieresis /aring
/ae /ccedilla /egrave /eacute /ecircumflex
/edieresis /igrave /iacute /icircumflex /idieresis
/eth /ntilde /ograve /oacute /ocircumflex
/otilde /odieresis /divide /oslash /ugrave
/uacute /ucircumflex /udieresis /yacute /thorn
/ydieresis
] def
%%EndResource
%FOPBeginFontReencode
/Courier-Bold findfont
dup length dict begin
  {1 index /FID ne {def} {pop pop} ifelse} forall
  /Encoding WinAnsiEncoding def
  currentdict
end
/Courier-Bold exch definefont pop
/Helvetica findfont
dup length dict begin
  {1 index /FID ne {def} {pop pop} ifelse} forall
  /Encoding WinAnsiEncoding def
  currentdict
end
/Helvetica exch definefont pop
/Courier-BoldOblique findfont
dup length dict begin
  {1 index /FID ne {def} {pop pop} ifelse} forall
  /Encoding WinAnsiEncoding def
  currentdict
end
/Courier-BoldOblique exch definefont pop
/Courier-Oblique findfont
dup length dict begin
  {1 index /FID ne {def} {pop pop} ifelse} forall
  /Encoding WinAnsiEncoding def
  currentdict
end
/Courier-Oblique exch definefont pop
/Times-Roman findfont
dup length dict begin
  {1 index /FID ne {def} {pop pop} ifelse} forall
  /Encoding WinAnsiEncoding def
  currentdict
end
/Times-Roman exch definefont pop
/Helvetica-BoldOblique findfont
dup length dict begin
  {1 index /FID ne {def} {pop pop} ifelse} forall
  /Encoding WinAnsiEncoding def
  currentdict
end
/Helvetica-BoldOblique exch definefont pop
/Helvetica-Bold findfont
dup length dict begin
  {1 index /FID ne {def} {pop pop} ifelse} forall
  /Encoding WinAnsiEncoding def
  currentdict
end
/Helvetica-Bold exch definefont pop
/Helvetica-Oblique findfont
dup length dict begin
  {1 index /FID ne {def} {pop pop} ifelse} forall
  /Encoding WinAnsiEncoding def
  currentdict
end
/Helvetica-Oblique exch definefont pop
/Times-BoldItalic findfont
dup length dict begin
  {1 index /FID ne {def} {pop pop} ifelse} forall
  /Encoding WinAnsiEncoding def
  currentdict
end
/Times-BoldItalic exch definefont pop
/Courier findfont
dup length dict begin
  {1 index /FID ne {def} {pop pop} ifelse} forall
  /Encoding WinAnsiEncoding def
  currentdict
end
/Courier exch definefont pop
/Times-Italic findfont
dup length dict begin
  {1 index /FID ne {def} {pop pop} ifelse} forall
  /Encoding WinAnsiEncoding def
  currentdict
end
/Times-Italic exch definefont pop
/Times-Bold findfont
dup length dict begin
  {1 index /FID ne {def} {pop pop} ifelse} forall
  /Encoding WinAnsiEncoding def
  currentdict
end
/Times-Bold exch definefont pop
%FOPEndFontReencode
%%EndProlog
%%Page: 1 1
%%PageBoundingBox: 0 0 384 360
%%BeginPageSetup
[1 0 0 -1 0 360] CT
%%EndPageSetup
GS
1 GC
N
0 0 384 360 re
f
GR
GS
1 GC
N
0 0 384 360 re
f
GR
GS
1 GC
N
65 315.5 M
347.5 315.5 L
347.5 51.5 L
65 51.5 L
cp
f
GR
GS
0.149 GC
2 setlinecap
1 LJ
0.5 LW
N
65 315.5 M
347.5 315.5 L
S
GR
GS
0.149 GC
2 setlinecap
1 LJ
0.5 LW
N
65 315.5 M
65 312.675 L
S
GR
GS
0.149 GC
2 setlinecap
1 LJ
0.5 LW
N
159.167 315.5 M
159.167 312.675 L
S
GR
GS
0.149 GC
2 setlinecap
1 LJ
0.5 LW
N
253.333 315.5 M
253.333 312.675 L
S
GR
GS
0.149 GC
2 setlinecap
1 LJ
0.5 LW
N
347.5 315.5 M
347.5 312.675 L
S
GR
GS
[1 0 0 1 65.00002 320.5] CT
0.149 GC
/Helvetica 15 F
GS
[1 0 0 1 0 0] CT
-10.5 15 moveto 
1 -1 scale
(0.8) t 
GR
GR
GS
[1 0 0 1 159.16672 320.5] CT
0.149 GC
/Helvetica 15 F
GS
[1 0 0 1 0 0] CT
-15 15 moveto 
1 -1 scale
(0.85) t 
GR
GR
GS
[1 0 0 1 253.33328 320.5] CT
0.149 GC
/Helvetica 15 F
GS
[1 0 0 1 0 0] CT
-10.5 15 moveto 
1 -1 scale
(0.9) t 
GR
GR
GS
[1 0 0 1 347.49997 320.5] CT
0.149 GC
/Helvetica 15 F
GS
[1 0 0 1 0 0] CT
-15 15 moveto 
1 -1 scale
(0.95) t 
GR
GR
GS
[1 0 0 1 206.25011 339.5] CT
0.149 GC
/Helvetica 17 F
GS
[1 0 0 1 0 0] CT
-96.5 17 moveto 
1 -1 scale
(MPE, Scales 1:3 \(>50 Hz\)) t 
GR
GR
GS
0.149 GC
2 setlinecap
1 LJ
0.5 LW
N
65 315.5 M
65 51.5 L
S
GR
GS
0.149 GC
2 setlinecap
1 LJ
0.5 LW
N
65 315.5 M
67.825 315.5 L
S
GR
GS
0.149 GC
2 setlinecap
1 LJ
0.5 LW
N
65 271.5 M
67.825 271.5 L
S
GR
GS
0.149 GC
2 setlinecap
1 LJ
0.5 LW
N
65 227.5 M
67.825 227.5 L
S
GR
GS
0.149 GC
2 setlinecap
1 LJ
0.5 LW
N
65 183.5 M
67.825 183.5 L
S
GR
GS
0.149 GC
2 setlinecap
1 LJ
0.5 LW
N
65 139.5 M
67.825 139.5 L
S
GR
GS
0.149 GC
2 setlinecap
1 LJ
0.5 LW
N
65 95.5 M
67.825 95.5 L
S
GR
GS
0.149 GC
2 setlinecap
1 LJ
0.5 LW
N
65 51.5 M
67.825 51.5 L
S
GR
GS
[1 0 0 1 60.00005 315.5] CT
0.149 GC
/Helvetica 15 F
GS
[1 0 0 1 0 0] CT
-36 5.5 moveto 
1 -1 scale
(-0.05) t 
GR
GR
GS
[1 0 0 1 60.00005 271.5] CT
0.149 GC
/Helvetica 15 F
GS
[1 0 0 1 0 0] CT
-36 5.5 moveto 
1 -1 scale
(-0.04) t 
GR
GR
GS
[1 0 0 1 60.00005 227.5] CT
0.149 GC
/Helvetica 15 F
GS
[1 0 0 1 0 0] CT
-36 5.5 moveto 
1 -1 scale
(-0.03) t 
GR
GR
GS
[1 0 0 1 60.00005 183.5] CT
0.149 GC
/Helvetica 15 F
GS
[1 0 0 1 0 0] CT
-36 5.5 moveto 
1 -1 scale
(-0.02) t 
GR
GR
GS
[1 0 0 1 60.00005 139.5] CT
0.149 GC
/Helvetica 15 F
GS
[1 0 0 1 0 0] CT
-36 5.5 moveto 
1 -1 scale
(-0.01) t 
GR
GR
GS
[1 0 0 1 60.00005 95.5] CT
0.149 GC
/Helvetica 15 F
GS
[1 0 0 1 0 0] CT
-9 5.5 moveto 
1 -1 scale
(0) t 
GR
GR
GS
[1 0 0 1 60.00005 51.5] CT
0.149 GC
/Helvetica 15 F
GS
[1 0 0 1 0 0] CT
-30 5.5 moveto 
1 -1 scale
(0.01) t 
GR
GR
GS
[0 -1 1 0 21.50004 183.49988] CT
0.149 GC
/Helvetica 18 F
GS
[1 0 0 1 0 0] CT
-138.5 -4 moveto 
1 -1 scale
(PSD Slope 2-64 Hz \(excl. 7-13 Hz\)) t 
GR
GR
GS
[1 0 0 1 206.25023 49.125] CT
/Helvetica-Bold 19 F
GS
[1 0 0 1 0 0] CT
-73.5 -29 moveto 
1 -1 scale
(Fine-scale MPE ) t 
GR
GR
GS
[1 0 0 1 206.25023 49.125] CT
/Helvetica-Bold 19 F
GS
[1 0 0 1 0 0] CT
-143 -5 moveto 
1 -1 scale
(positively relates to PSD slopes) t 
GR
GR
GS
[1 0 0 1 131.53044 206.03557] CT
N
3.036 -0.5 M
3.036 -2.453 1.453 -4.036 -0.5 -4.036 C
-2.453 -4.036 -4.036 -2.453 -4.036 -0.5 C
-4.036 1.453 -2.453 3.036 -0.5 3.036 C
1.453 3.036 3.036 1.453 3.036 -0.5 C
f
GR
GS
[1 0 0 1 257.80173 208.3223] CT
N
/f626426221{3.036 -0.5 M
3.036 -2.453 1.453 -4.036 -0.5 -4.036 C
-2.453 -4.036 -4.036 -2.453 -4.036 -0.5 C
-4.036 1.453 -2.453 3.036 -0.5 3.036 C
1.453 3.036 3.036 1.453 3.036 -0.5 C}def
f626426221
f
GR
GS
[1 0 0 1 239.57695 171.48706] CT
N
f626426221
f
GR
GS
[1 0 0 1 279.19244 173.03139] CT
N
f626426221
f
GR
GS
[1 0 0 1 274.39285 163.647] CT
N
f626426221
f
GR
GS
[1 0 0 1 223.05498 236.37923] CT
N
f626426221
f
GR
GS
[1 0 0 1 87.14307 226.66599] CT
N
f626426221
f
GR
GS
[1 0 0 1 274.32639 168.4454] CT
N
f626426221
f
GR
GS
[1 0 0 1 279.90259 144.98805] CT
N
f626426221
f
GR
GS
[1 0 0 1 182.06445 213.9789] CT
N
f626426221
f
GR
GS
[1 0 0 1 108.18558 273.77594] CT
N
f626426221
f
GR
GS
[1 0 0 1 233.67018 217.91917] CT
N
f626426221
f
GR
GS
[1 0 0 1 206.71182 192.74098] CT
N
f626426221
f
GR
GS
[1 0 0 1 147.81567 257.27042] CT
N
f626426221
f
GR
GS
[1 0 0 1 168.98468 226.50188] CT
N
f626426221
f
GR
GS
[1 0 0 1 194.99493 227.72052] CT
N
f626426221
f
GR
GS
[1 0 0 1 221.9487 205.93456] CT
N
f626426221
f
GR
GS
[1 0 0 1 238.29073 213.76509] CT
N
f626426221
f
GR
GS
[1 0 0 1 220.77283 215.26334] CT
N
f626426221
f
GR
GS
[1 0 0 1 307.3295 165.93832] CT
N
f626426221
f
GR
GS
[1 0 0 1 267.95016 152.23912] CT
N
f626426221
f
GR
GS
[1 0 0 1 212.03127 209.46848] CT
N
f626426221
f
GR
GS
[1 0 0 1 241.27077 167.82864] CT
N
f626426221
f
GR
GS
[1 0 0 1 266.67215 117.35689] CT
N
f626426221
f
GR
GS
[1 0 0 1 162.02463 230.29095] CT
N
f626426221
f
GR
GS
[1 0 0 1 133.77341 215.95107] CT
N
f626426221
f
GR
GS
[1 0 0 1 155.37225 244.85622] CT
N
f626426221
f
GR
GS
[1 0 0 1 253.85403 164.07069] CT
N
f626426221
f
GR
GS
[1 0 0 1 137.59235 236.37694] CT
N
f626426221
f
GR
GS
[1 0 0 1 201.65112 188.09065] CT
N
f626426221
f
GR
GS
[1 0 0 1 182.82622 261.42877] CT
N
f626426221
f
GR
GS
[1 0 0 1 301.70966 144.38657] CT
N
f626426221
f
GR
GS
[1 0 0 1 248.15955 209.13467] CT
N
f626426221
f
GR
GS
[1 0 0 1 83.1039 251.47209] CT
N
f626426221
f
GR
GS
[1 0 0 1 244.71835 156.07758] CT
N
f626426221
f
GR
GS
[1 0 0 1 183.96001 260.54581] CT
N
f626426221
f
GR
GS
[1 0 0 1 152.65242 209.56975] CT
N
f626426221
f
GR
GS
[1 0 0 1 194.15997 242.55438] CT
N
f626426221
f
GR
GS
[1 0 0 1 202.94441 213.61264] CT
N
f626426221
f
GR
GS
[1 0 0 1 74.63176 255.41841] CT
N
f626426221
f
GR
GS
[1 0 0 1 285.85785 106.48844] CT
N
f626426221
f
GR
GS
[1 0 0 1 285.69843 176.98767] CT
N
f626426221
f
GR
GS
[1 0 0 1 260.75427 103.41355] CT
N
f626426221
f
GR
GS
[1 0 0 1 248.65494 213.54985] CT
N
f626426221
f
GR
GS
[1 0 0 1 262.06137 235.9317] CT
N
f626426221
f
GR
GS
[1 0 0 1 89.25336 249.00174] CT
N
f626426221
f
GR
GS
[1 0 0 1 227.62703 121.2037] CT
N
f626426221
f
GR
GS
1 0 0 RC
1 LJ
3 LW
N
131.53 239.959 M
257.802 176.734 L
239.577 185.859 L
279.192 166.023 L
274.393 168.427 L
223.055 194.132 L
87.143 262.184 L
274.326 168.46 L
279.903 165.668 L
182.064 214.656 L
108.186 251.648 L
233.67 188.817 L
206.712 202.315 L
147.816 231.805 L
168.985 221.205 L
194.995 208.182 L
221.949 194.686 L
238.291 186.503 L
220.773 195.275 L
307.329 151.935 L
267.95 171.652 L
212.031 199.652 L
241.271 185.011 L
266.672 172.292 L
162.025 224.69 L
133.773 238.836 L
155.372 228.021 L
253.854 178.711 L
137.592 236.924 L
201.651 204.849 L
182.826 214.275 L
301.71 154.749 L
248.16 181.562 L
83.104 264.206 L
244.718 183.285 L
183.96 213.707 L
152.652 229.383 L
194.16 208.6 L
202.944 204.201 L
74.632 268.448 L
285.858 162.686 L
285.698 162.766 L
260.754 175.256 L
248.655 181.314 L
262.061 174.601 L
89.253 261.127 L
227.627 191.843 L
S
GR
GS
[1 0 0 1 280.7171 161.20863] CT
1 0 0 RC
N
f626426221
f
GR
GS
[1 0 0 1 293.85178 149.42372] CT
1 0 0 RC
N
f626426221
f
GR
GS
[1 0 0 1 206.43332 218.05408] CT
1 0 0 RC
N
f626426221
f
GR
GS
[1 0 0 1 299.15942 101.36217] CT
1 0 0 RC
N
f626426221
f
GR
GS
[1 0 0 1 265.37628 152.29207] CT
1 0 0 RC
N
f626426221
f
GR
GS
[1 0 0 1 235.82054 207.24222] CT
1 0 0 RC
N
f626426221
f
GR
GS
[1 0 0 1 299.45938 53.97174] CT
1 0 0 RC
N
f626426221
f
GR
GS
[1 0 0 1 217.06963 210.38199] CT
1 0 0 RC
N
f626426221
f
GR
GS
[1 0 0 1 260.49518 179.81276] CT
1 0 0 RC
N
f626426221
f
GR
GS
[1 0 0 1 230.25739 205.47321] CT
1 0 0 RC
N
f626426221
f
GR
GS
[1 0 0 1 295.65662 174.61539] CT
1 0 0 RC
N
f626426221
f
GR
GS
[1 0 0 1 245.23563 204.59329] CT
1 0 0 RC
N
f626426221
f
GR
GS
[1 0 0 1 233.59193 211.46611] CT
1 0 0 RC
N
f626426221
f
GR
GS
[1 0 0 1 315.47226 121.8758] CT
1 0 0 RC
N
f626426221
f
GR
GS
[1 0 0 1 300.87378 127.48116] CT
1 0 0 RC
N
f626426221
f
GR
GS
[1 0 0 1 290.37769 159.20804] CT
1 0 0 RC
N
f626426221
f
GR
GS
[1 0 0 1 317.99207 155.5139] CT
1 0 0 RC
N
f626426221
f
GR
GS
[1 0 0 1 275.24329 166.02968] CT
1 0 0 RC
N
f626426221
f
GR
GS
[1 0 0 1 309.06766 114.63255] CT
1 0 0 RC
N
f626426221
f
GR
GS
[1 0 0 1 277.30206 182.75835] CT
1 0 0 RC
N
f626426221
f
GR
GS
[1 0 0 1 221.22971 219.12267] CT
1 0 0 RC
N
f626426221
f
GR
GS
[1 0 0 1 234.1916 194.20654] CT
1 0 0 RC
N
f626426221
f
GR
GS
[1 0 0 1 249.63795 185.30161] CT
1 0 0 RC
N
f626426221
f
GR
GS
[1 0 0 1 255.99408 206.93356] CT
1 0 0 RC
N
f626426221
f
GR
GS
[1 0 0 1 265.0733 215.16455] CT
1 0 0 RC
N
f626426221
f
GR
GS
[1 0 0 1 251.74936 199.56389] CT
1 0 0 RC
N
f626426221
f
GR
GS
[1 0 0 1 290.32504 181.87613] CT
1 0 0 RC
N
f626426221
f
GR
GS
[1 0 0 1 153.85063 228.15042] CT
1 0 0 RC
N
f626426221
f
GR
GS
[1 0 0 1 298.45547 211.2281] CT
1 0 0 RC
N
f626426221
f
GR
GS
[1 0 0 1 291.47803 169.10541] CT
1 0 0 RC
N
f626426221
f
GR
GS
[1 0 0 1 228.02362 170.79207] CT
1 0 0 RC
N
f626426221
f
GR
GS
[1 0 0 1 307.55511 143.16559] CT
1 0 0 RC
N
f626426221
f
GR
GS
[1 0 0 1 285.01447 159.9792] CT
1 0 0 RC
N
f626426221
f
GR
GS
[1 0 0 1 275.81018 184.50719] CT
1 0 0 RC
N
f626426221
f
GR
GS
[1 0 0 1 282.83591 135.15393] CT
1 0 0 RC
N
f626426221
f
GR
GS
[1 0 0 1 267.2113 159.04225] CT
1 0 0 RC
N
f626426221
f
GR
GS
[1 0 0 1 149.9016 201.83521] CT
1 0 0 RC
N
f626426221
f
GR
GS
[1 0 0 1 306.95331 164.76836] CT
1 0 0 RC
N
f626426221
f
GR
GS
[1 0 0 1 188.55461 238.10222] CT
1 0 0 RC
N
f626426221
f
GR
GS
[1 0 0 1 231.2925 228.3017] CT
1 0 0 RC
N
f626426221
f
GR
GS
[1 0 0 1 301.25714 123.7877] CT
1 0 0 RC
N
f626426221
f
GR
GS
[1 0 0 1 310.41214 110.01486] CT
1 0 0 RC
N
f626426221
f
GR
GS
[1 0 0 1 233.40245 201.10818] CT
1 0 0 RC
N
f626426221
f
GR
GS
[1 0 0 1 229.9762 233.73868] CT
1 0 0 RC
N
f626426221
f
GR
GS
[1 0 0 1 303.26898 102.76676] CT
1 0 0 RC
N
f626426221
f
GR
GS
[1 0 0 1 298.96982 176.74049] CT
1 0 0 RC
N
f626426221
f
GR
GS
[1 0 0 1 285.34235 180.3829] CT
1 0 0 RC
N
f626426221
f
GR
GS
[1 0 0 1 237.71811 197.99234] CT
1 0 0 RC
N
f626426221
f
GR
GS
[1 0 0 1 236.44997 148.28549] CT
1 0 0 RC
N
f626426221
f
GR
GS
[1 0 0 1 272.52942 187.27859] CT
1 0 0 RC
N
f626426221
f
GR
GS
[1 0 0 1 238.61122 215.06548] CT
1 0 0 RC
N
f626426221
f
GR
GS
[1 0 0 1 294.13702 168.01418] CT
1 0 0 RC
N
f626426221
f
GR
GS
1 LJ
3 LW
N
280.717 163.173 M
293.852 153.912 L
206.433 215.55 L
299.159 150.17 L
265.376 173.99 L
235.821 194.829 L
299.459 149.958 L
217.07 208.051 L
260.495 177.431 L
230.257 198.752 L
295.657 152.639 L
245.236 188.191 L
233.592 196.401 L
315.472 138.667 L
300.874 148.961 L
290.378 156.361 L
317.992 136.891 L
275.243 167.033 L
309.068 143.183 L
277.302 165.581 L
221.23 205.117 L
234.192 195.978 L
249.638 185.087 L
255.994 180.605 L
265.073 174.203 L
251.749 183.598 L
290.325 156.399 L
153.851 252.626 L
298.455 150.666 L
291.478 155.586 L
228.024 200.327 L
307.555 144.25 L
285.014 160.143 L
275.81 166.633 L
282.836 161.679 L
267.211 172.696 L
149.902 255.41 L
306.953 144.674 L
188.555 228.156 L
231.292 198.022 L
301.257 148.69 L
310.412 142.235 L
233.402 196.534 L
229.976 198.95 L
303.269 147.272 L
298.97 150.303 L
285.342 159.912 L
237.718 193.491 L
236.45 194.386 L
272.529 168.946 L
238.611 192.862 L
294.137 153.711 L
S
GR
GS
[1 0 0 1 112 72.5] CT
/Helvetica 15 F
GS
[1 0 0 1 0 0] CT
0 5.5 moveto 
1 -1 scale
(Younger Adults: r=0.72) t 
GR
GR
GS
1 0 0 RC
1 LJ
3 LW
N
79 72.5 M
109 72.5 L
S
GR
GS
[1 0 0 1 112 91] CT
/Helvetica 15 F
GS
[1 0 0 1 0 0] CT
0 5.5 moveto 
1 -1 scale
(Older Adults: r=0.71) t 
GR
GR
GS
1 LJ
3 LW
N
79 91 M
109 91 L
S
GR
%%Trailer
%%Pages: 1
%%EOF
