{"freq_range": [2.0, 80.0], "freq_res": 1.0, "aperiodic_params_": [0.6707050619466118, 1.1483031137860322], "gaussian_params_": [[6.563396746044744, 0.19636703552669307, 0.5751010107835696], [9.915005955089994, 0.5050196612267585, 0.754713379416314], [12.59771364332112, 0.6055858674299552, 0.3551139856397517], [14.2931277236092, 0.3590512990628916, 0.7647338076844756], [30.982135560399467, 0.18859568754160902, 0.2500000346792536], [34.82364058668013, 0.1989409860349685, 1.3162552711228641], [39.580139368945694, 0.2087734604370307, 1.6699868079622457], [41.40325979713775, 0.2088607744725522, 0.29377410859481456], [43.95725597815745, 0.2062692109639309, 0.5632317312974507], [48.16545376313053, 0.14487894571062584, 3.049044946452918], [51.4076507576811, 0.3207895774354748, 0.26776239209431335], [54.51162132946385, 0.8262991897096346, 0.27701914704348984], [63.23279088830875, 0.14308638289192468, 0.7491639137483922], [70.57574945080918, 0.4767929726964614, 0.2651907557239199]], "peak_params_": [[6.563396746044744, 0.1474937469479762, 1.1502020215671391], [9.915005955089994, 0.5018273337809542, 1.509426758832628], [12.59771364332112, 0.4048635653229912, 0.7102279712795034], [14.2931277236092, 0.3338693738164349, 1.5294676153689513], [30.982135560399467, 0.19104131454323592, 0.5000000693585072], [34.82364058668013, 0.2020324742861439, 2.6325105422457282], [39.580139368945694, 0.2063825572507605, 3.3399736159244915], [41.40325979713775, 0.23601999220500247, 0.5875482171896291], [43.95725597815745, 0.26894645541049744, 1.1264634625949015], [48.16545376313053, 0.14466642821736952, 6.098089892905836], [51.4076507576811, 0.19471841514686372, 0.5355247841886267], [54.51162132946385, 0.18641988563348177, 0.5540382940869797], [63.23279088830875, 0.1363436220314984, 1.4983278274967844], [70.57574945080918, 0.13260995375818507, 0.5303815114478398]], "r_squared_": 0.9848385968201004, "error_": 0.03437420762004229}
{"freq_range": [2.0, 80.0], "freq_res": 1.0, "aperiodic_params_": [0.6749389191788527, 1.144508276689057], "gaussian_params_": [[7.148939960433977, 0.14594700114457382, 0.7467565792890779], [9.988809143346597, 0.4965697108756, 0.6910662563032571], [12.666475486745227, 0.3974869239322407, 0.5575392575977527], [14.224928634130109, 0.3602077988587913, 0.706447975267454], [35.13234883404835, 0.25639840506311734, 1.0452315036167892], [40.25517297044699, 0.2008018054300837, 1.4712107661660636], [45.51097181999053, 0.15259496134844197, 1.6566594226077436], [48.51606812159226, 0.7616249586349256, 0.3169197610023488], [50.731488415908046, 0.19261313588303644, 0.655866468384894], [54.29145038566422, 0.16822462311470412, 0.8133814103553343]], "peak_params_": [[7.148939960433977, 0.1431158740628574, 1.4935131585781558], [9.988809143346597, 0.49660865915432006, 1.3821325126065143], [12.666475486745227, 0.4125154599125781, 1.1150785151955054], [14.224928634130109, 0.3651601951764425, 1.412895950534908], [35.13234883404835, 0.25469171794858103, 2.0904630072335784], [40.25517297044699, 0.19841244676392833, 2.942421532332127], [45.51097181999053, 0.14618751875286606, 3.313318845215487], [48.51606812159226, 0.2598840752450896, 0.6338395220046976], [50.731488415908046, 0.17780652495271454, 1.311732936769788], [54.29145038566422, 0.15776562957831586, 1.6267628207106686]], "r_squared_": 0.9814647207661567, "error_": 0.04051756408528661}
{"freq_range": [2.0, 80.0], "freq_res": 1.0, "aperiodic_params_": [0.7016528493896109, 1.1692408668491314], "gaussian_params_": [[9.88671412107276, 0.45147716506574925, 0.6872093635941195], [13.331056268778678, 0.36631911539963213, 0.8845607557953153], [15.296837871253663, 0.2551208156087227, 0.28456512900037034], [30.975170599951504, 0.1635562879734527, 0.25000489980903523], [34.5268489595578, 0.12487137889522329, 0.6065605628142672], [40.01034775543265, 0.17720273826958546, 5.999999197411776], [40.578274404933985, 0.22187186934468128, 0.27038931832761753], [44.05140839906063, 0.13034779140107944, 0.2505097860982649], [54.50228298034277, 0.5565938021019831, 0.2501736349131939], [56.09593080172811, 0.10502657302182275, 5.999999999999999]], "peak_params_": [[9.88671412107276, 0.44568993575218224, 1.374418727188239], [13.331056268778678, 0.3415643689132225, 1.7691215115906307], [15.296837871253663, 0.20987992946575518, 0.5691302580007407], [30.975170599951504, 0.2201489113401074, 0.5000097996180705], [34.5268489595578, 0.21737246430822021, 1.2131211256285344], [40.01034775543265, 0.20261356795358743, 11.999998394823551], [40.578274404933985, 0.24498595838292447, 0.5407786366552351], [44.05140839906063, 0.2834523958262699, 0.5010195721965298], [54.50228298034277, 0.1880317022475364, 0.5003472698263878], [56.09593080172811, 0.11009836483194935, 11.999999999999998]], "r_squared_": 0.9729824828150067, "error_": 0.046953218867839736}
{"freq_range": [2.0, 80.0], "freq_res": 1.0, "aperiodic_params_": [0.7282627814397753, 1.2122059248993875], "gaussian_params_": [[6.7358146433339705, 0.25625457229788784, 1.0987553680272943], [9.909743160563421, 0.5629979179015442, 0.7897100789497175], [12.688458649621339, 0.19435415885679672, 0.3400210109128861], [13.838879583955096, 0.4341639269819309, 1.307793926041726], [24.93880908762324, 0.13997957276355147, 0.4852071282606941], [30.954461333567863, 0.15027244863566555, 0.2500006205837023], [35.00888631885661, 0.1851810053117454, 1.114034695733207], [39.56404163810386, 0.24740409575956623, 1.4586782918324064], [44.24080943739238, 0.2715143789332855, 0.5925446673780487], [49.49853212618456, 0.10434120766862649, 5.999999999999999], [50.99821629822436, 0.11663031078822411, 0.2500000000070658], [70.61429886181499, 0.40634627556240244, 0.2615761695086509]], "peak_params_": [[6.7358146433339705, 0.2495884557826083, 2.1975107360545887], [9.909743160563421, 0.568281445970379, 1.579420157899435], [12.688458649621339, 0.4814316913307214, 0.6800420218257722], [13.838879583955096, 0.4309965522374157, 2.615587852083452], [24.93880908762324, 0.1388958543098191, 0.9704142565213882], [30.954461333567863, 0.14898580925214655, 0.5000012411674046], [35.00888631885661, 0.19265676880443927, 2.228069391466414], [39.56404163810386, 0.2664078669451233, 2.9173565836648128], [44.24080943739238, 0.32098414032046896, 1.1850893347560973], [49.49853212618456, 0.10398165702473627, 11.999999999999998], [50.99821629822436, 0.21775212031384128, 0.5000000000141316], [70.61429886181499, 0.13718480027489588, 0.5231523390173018]], "r_squared_": 0.9917342350235557, "error_": 0.030529602825005317}
{"freq_range": [2.0, 80.0], "freq_res": 1.0, "aperiodic_params_": [0.7307985396846455, 1.2187759540995273], "gaussian_params_": [[7.144398296376937, 0.21113034672502495, 1.2550385188826032], [9.998254606512285, 0.5346941976865128, 0.6844116125376294], [13.577963266080218, 0.4984434367830296, 1.3185242041915413], [16.652793448395556, 0.174774691577955, 0.2630080054492945], [30.975911089283706, 0.15084326565028838, 0.2500000471155241], [34.91045924568632, 0.1868026231066755, 1.046246308797817], [39.42575672169914, 0.2234910425305848, 1.4849813700511867], [44.490460316934126, 0.2157397044365271, 0.8840100739052382], [50.885384941282375, 0.10383638455818878, 5.999999999999999]], "peak_params_": [[7.144398296376937, 0.20977586649004026, 2.5100770377652064], [9.998254606512285, 0.5631040068826483, 1.3688232250752588], [13.577963266080218, 0.47355300694701224, 2.6370484083830825], [16.652793448395556, 0.09029791770422502, 0.526016010898589], [30.975911089283706, 0.15074534398798856, 0.5000000942310482], [34.91045924568632, 0.19187339311131657, 2.092492617595634], [39.42575672169914, 0.22917879883039471, 2.9699627401023734], [44.490460316934126, 0.24066036752795306, 1.7680201478104765], [50.885384941282375, 0.10381744103312074, 11.999999999999998]], "r_squared_": 0.9894994496189023, "error_": 0.03660883953271011}
{"freq_range": [2.0, 80.0], "freq_res": 1.0, "aperiodic_params_": [0.4785839605027895, 1.0663206858191658], "gaussian_params_": [[9.853547554929676, 0.5230955487125931, 0.6051888556361241], [13.436074860131221, 0.4286260154385317, 1.239908819425504], [31.424171448649325, 0.6568560828050384, 0.25035841946497916], [34.72653001724663, 0.2720974685773588, 0.8910705970281366], [39.78992726247751, 0.22027925420216815, 1.6502497283352178], [44.80155832143285, 0.22907856416255393, 1.0541767275714609], [48.28623040447765, 0.20589985910648442, 0.6284819939279058], [51.26138358579, 0.20658467425338267, 0.806063962872791]], "peak_params_": [[9.853547554929676, 0.5172149921029401, 1.2103777112722482], [13.436074860131221, 0.40292095101962033, 2.479817638851008], [31.424171448649325, 0.15641144672067786, 0.5007168389299583], [34.72653001724663, 0.26284291978072183, 1.7821411940562732], [39.78992726247751, 0.21850885783249985, 3.3004994566704355], [44.80155832143285, 0.2265642979756537, 2.1083534551429217], [48.28623040447765, 0.18797097566869292, 1.2569639878558116], [51.26138358579, 0.19602227559193497, 1.612127925745582]], "r_squared_": 0.9776836928416398, "error_": 0.04657435435917158}
{"freq_range": [2.0, 80.0], "freq_res": 1.0, "aperiodic_params_": [0.4452386335345727, 1.0488822407196958], "gaussian_params_": [[6.893243846176139, 0.16311005617862712, 0.8862011101971494], [9.835484816058997, 0.5622807397902637, 0.7253419012270238], [13.314169757564574, 0.4471995241787009, 0.9718105800679055], [15.431187453367684, 0.41856309531781394, 0.2921447100545313], [30.701171648994336, 0.28409756550843485, 0.25005939930396814], [35.31000818931583, 0.1808981240274242, 1.5143538782811703], [39.72802210369996, 0.2566497013498105, 1.2796573595151393], [44.790772351091405, 0.2067783146017964, 2.1373776434163023], [50.8204229181597, 0.2217109309538252, 0.706868213467949]], "peak_params_": [[6.893243846176139, 0.16220097263734257, 1.7724022203942988], [9.835484816058997, 0.5496858415836917, 1.4506838024540476], [13.314169757564574, 0.42447216201352905, 1.943621160135811], [15.431187453367684, 0.24016210192145226, 0.5842894201090626], [30.701171648994336, 0.14226189040928072, 0.5001187986079363], [35.31000818931583, 0.17743143182779875, 3.0287077565623406], [39.72802210369996, 0.26918392433629723, 2.5593147190302785], [44.790772351091405, 0.205842893784844, 4.274755286832605], [50.8204229181597, 0.21771083293281612, 1.413736426935898]], "r_squared_": 0.9838191148189064, "error_": 0.03966370667204977}
{"freq_range": [2.0, 80.0], "freq_res": 1.0, "aperiodic_params_": [0.45508024410761955, 1.054277938784374], "gaussian_params_": [[6.8448625516253205, 0.15591675171934663, 0.8691659283809671], [9.850531711171872, 0.5626078575459571, 0.7214675141490162], [13.32896195180517, 0.44030372702985165, 0.9893729529083406], [15.380460931980291, 0.2474448603768783, 0.3253848409456232], [31.01386076403423, 0.17015633992755014, 0.2500190692326486], [35.190325759372406, 0.1921035665348018, 1.4924642449027505], [39.9369913655208, 0.2683572418731593, 1.654359766880853], [44.215505508623544, 0.2185358344032063, 0.4924886923265689], [46.17860655699372, 0.16026384988035083, 1.8286361728386844], [50.6643740281418, 0.3065859249811269, 0.4416462706347587]], "peak_params_": [[6.8448625516253205, 0.15368208486724627, 1.7383318567619341], [9.850531711171872, 0.5524096412487497, 1.4429350282980324], [13.32896195180517, 0.41666662724019204, 1.9787459058166812], [15.380460931980291, 0.23066569587849217, 0.6507696818912464], [31.01386076403423, 0.17362578060752587, 0.5000381384652972], [35.190325759372406, 0.19367307202336337, 2.984928489805501], [39.9369913655208, 0.2697620666530026, 3.308719533761706], [44.215505508623544, 0.29055120434157067, 0.9849773846531378], [46.17860655699372, 0.16013443222475576, 3.657272345677369], [50.6643740281418, 0.23465035549763003, 0.8832925412695174]], "r_squared_": 0.9851747447016708, "error_": 0.03689528867881287}
{"freq_range": [2.0, 80.0], "freq_res": 1.0, "aperiodic_params_": [0.7897468793099511, 1.2313011117862505], "gaussian_params_": [[6.710421988548187, 0.23206662451191404, 1.213707318282766], [9.935876426902496, 0.5396658410502422, 0.7783210511612512], [12.823288785237699, 0.17424154599295863, 0.6739536942304588], [14.014740062471327, 0.39513204052872597, 1.2717970011652093], [30.62098010107115, 0.40576025705472624, 0.2523472646588234], [35.27284459745844, 0.16694292359578922, 1.1399195979800654], [39.828227053224076, 0.24179683933171126, 1.5188340459513399], [44.37395589082594, 0.5934684290995473, 0.27790371470856495], [46.449494394928806, 0.15406976932751387, 1.913299571978499], [50.730243734622995, 0.2476416030736741, 0.3988728631350523]], "peak_params_": [[6.710421988548187, 0.22599362687631444, 2.427414636565532], [9.935876426902496, 0.5464681359961613, 1.5566421023225023], [12.823288785237699, 0.45599816324488107, 1.3479073884609176], [14.014740062471327, 0.43305410302735126, 2.5435940023304187], [30.62098010107115, 0.13148911713765887, 0.5046945293176468], [35.27284459745844, 0.1637742072200281, 2.2798391959601307], [39.828227053224076, 0.24081138972221572, 3.0376680919026797], [44.37395589082594, 0.31344802222423984, 0.5558074294171299], [46.449494394928806, 0.1499389433763756, 3.826599143956998], [50.730243734622995, 0.20612550915870154, 0.7977457262701046]], "r_squared_": 0.9916479754816317, "error_": 0.031677777345758114}
{"freq_range": [2.0, 80.0], "freq_res": 1.0, "aperiodic_params_": [0.8820799453592322, 1.2878300611234599], "gaussian_params_": [[6.842643774218052, 0.24474463439215596, 1.2798817608889261], [9.969210319027434, 0.525935649411307, 0.7840387694692195], [12.6133218094301, 0.2722295835239519, 0.3111328325173957], [13.903389731901314, 0.45219572384789775, 1.3655103367901469], [25.403903369606297, 0.38082736242869325, 0.2754027704592608], [35.18811778313998, 0.15914303495789045, 1.2366648068719954], [39.6825010721831, 0.24613117525568762, 1.4995683238712196], [44.36786862295104, 0.4887357649803538, 0.28229737225461055], [46.21215703142427, 0.16762458394645532, 2.110665074027314], [50.98623177049659, 0.19510475514973777, 0.2500007632630445], [71.0305350576695, 0.1559397676752893, 0.5690376453098379]], "peak_params_": [[6.842643774218052, 0.24330736767483727, 2.5597635217778523], [9.969210319027434, 0.5448067432891079, 1.568077538938439], [12.6133218094301, 0.48937587162697804, 0.6222656650347914], [13.903389731901314, 0.45107961150359877, 2.7310206735802938], [25.403903369606297, 0.12991765182552306, 0.5508055409185216], [35.18811778313998, 0.15919135948555696, 2.473329613743991], [39.6825010721831, 0.24296217659951913, 2.9991366477424393], [44.36786862295104, 0.30977277591996066, 0.5645947445092211], [46.21215703142427, 0.16681438813291116, 4.221330148054628], [50.98623177049659, 0.2076020811281687, 0.500001526526089], [71.0305350576695, 0.15571541576071257, 1.1380752906196758]], "r_squared_": 0.9921195383870411, "error_": 0.03482485118366421}
{"freq_range": [2.0, 80.0], "freq_res": 1.0, "aperiodic_params_": [0.8867005161618751, 1.2862905185785602], "gaussian_params_": [[9.595009478338026, 0.3823513627511844, 2.478369936408679], [14.040883308783185, 0.4258037728243762, 1.1952424890743112], [38.90899399736304, 0.18484725200003643, 3.375451667501477], [46.080229502819364, 0.16150427186335098, 2.0004546905748697], [50.65040020710367, 0.512102200729792, 0.25496501072511885]], "peak_params_": [[9.595009478338026, 0.37868397484901095, 4.956739872817358], [14.040883308783185, 0.5043466891032212, 2.3904849781486224], [38.90899399736304, 0.1850877207895385, 6.750903335002954], [46.080229502819364, 0.18172153766644827, 4.000909381149739], [50.65040020710367, 0.20818271113163833, 0.5099300214502377]], "r_squared_": 0.9874008393142498, "error_": 0.04682601596419755}
{"freq_range": [2.0, 80.0], "freq_res": 1.0, "aperiodic_params_": [0.8726297718202553, 1.3060269171099907], "gaussian_params_": [[7.20896142760156, 0.22184865423827174, 1.376663068991622], [9.968382982880325, 0.5127781181904382, 0.6899324365720674], [13.594994541076234, 0.5482677520138938, 1.4152837671329044], [16.564754009853758, 0.3278836332208393, 0.2759761836998366], [30.9674266802015, 0.13849023135652744, 0.25000169901960023], [35.56228509304702, 0.15832456432125167, 1.533300629655175], [39.783087485139845, 0.21067145597667075, 1.2472714294197178], [44.46211872530357, 0.677396412707488, 0.30344405160275323], [48.31359159436533, 0.11408125482966867, 5.999999999999999], [50.99822303729247, 0.13070584926578366, 0.25000000094824576], [71.29397590772435, 0.1258264505527383, 1.1105394410186589]], "peak_params_": [[7.20896142760156, 0.21936723554943632, 2.753326137983244], [9.968382982880325, 0.5624251435549045, 1.3798648731441348], [13.594994541076234, 0.5262732955264867, 2.8305675342658088], [16.564754009853758, 0.1248842353623002, 0.5519523673996732], [30.9674266802015, 0.14098687621821715, 0.5000033980392005], [35.56228509304702, 0.16800881598596007, 3.06660125931035], [39.783087485139845, 0.2535952293378252, 2.4945428588394356], [44.46211872530357, 0.30122761066491854, 0.6068881032055065], [48.31359159436533, 0.11392554578290692, 11.999999999999998], [50.99822303729247, 0.2339034667813027, 0.5000000018964915], [71.29397590772435, 0.12158391674352886, 2.2210788820373177]], "r_squared_": 0.9920955352740527, "error_": 0.03364249787874887}
{"freq_range": [2.0, 80.0], "freq_res": 1.0, "aperiodic_params_": [0.6646189910331167, 1.1702577862520709], "gaussian_params_": [[7.32272438475803, 0.17144414739249048, 1.3685009759118105], [9.918620510887305, 0.4913454496123286, 0.6312110368495762], [13.522454065463808, 0.4927581397495789, 1.479785673319053], [38.75161435629893, 0.18804009330699578, 2.907099396878686], [44.85958236693543, 0.23951768175921212, 0.8358243292884164], [50.32453923525341, 0.11647323507475449, 2.5351719875691594]], "peak_params_": [[7.32272438475803, 0.16678355757942032, 2.737001951823621], [9.918620510887305, 0.5415623034150147, 1.2624220736991525], [13.522454065463808, 0.4677570961828604, 2.959571346638106], [38.75161435629893, 0.18736039309140473, 5.814198793757372], [44.85958236693543, 0.26766309605896565, 1.6716486585768329], [50.32453923525341, 0.11562827141958909, 5.070343975138319]], "r_squared_": 0.987215415574189, "error_": 0.039714436350092606}
{"freq_range": [2.0, 80.0], "freq_res": 1.0, "aperiodic_params_": [0.6521292014946162, 1.1685398385501014], "gaussian_params_": [[7.307337973799838, 0.1612135788713917, 1.43782418158016], [9.903088804002708, 0.4918284449217827, 0.6111494387413514], [13.547636335054781, 0.48683661518798454, 1.5023747464416293], [35.10451809250409, 0.161618369973211, 1.2223021835681784], [39.69899500074217, 0.24471136856087788, 1.4270472094416906], [44.713178472950105, 0.24294377156142452, 0.8823940747985238], [50.46905628487557, 0.10975903434887925, 3.2952748966647714]], "peak_params_": [[7.307337973799838, 0.15761515415620803, 2.87564836316032], [9.903088804002708, 0.5435607922661689, 1.2222988774827028], [13.547636335054781, 0.4652640445021343, 3.0047494928832585], [35.10451809250409, 0.16211235375344824, 2.444604367136357], [39.69899500074217, 0.2400868860544081, 2.8540944188833812], [44.713178472950105, 0.2583784767541397, 1.7647881495970477], [50.46905628487557, 0.10865272294415873, 6.590549793329543]], "r_squared_": 0.9877494622158309, "error_": 0.03785371647090018}
{"freq_range": [2.0, 80.0], "freq_res": 1.0, "aperiodic_params_": [0.3571780462764532, 0.9524095983602681], "gaussian_params_": [[9.98189311862317, 0.42672178810711114, 0.6007487815816368], [11.88094793975337, 0.08766475714674907, 0.25018578151143034], [13.526840827014462, 0.42134518616264277, 1.0586402171640186], [27.838000650197813, 0.16351161240801673, 0.6592856390909759], [34.92393414470361, 0.21572252826408678, 1.0243222619107362], [39.547884165175894, 0.16673396685295794, 1.2450086430377143], [44.60172881988886, 0.18303947568827195, 0.7758226376014511], [51.93080335419932, 0.10545626211915117, 5.999915781089288], [66.28607303043506, 0.24863086227910466, 0.2500000175736129]], "peak_params_": [[9.98189311862317, 0.42816697136138304, 1.2014975631632736], [11.88094793975337, 0.2287096383539423, 0.5003715630228607], [13.526840827014462, 0.38129383460819133, 2.117280434328037], [27.838000650197813, 0.15868615605567737, 1.3185712781819519], [34.92393414470361, 0.2173074264910706, 2.0486445238214723], [39.547884165175894, 0.1706989471277498, 2.4900172860754286], [44.60172881988886, 0.21456892699305707, 1.5516452752029022], [51.93080335419932, 0.10544924905656505, 11.999831562178576], [66.28607303043506, 0.13593428026319798, 0.5000000351472258]], "r_squared_": 0.9744795495931887, "error_": 0.03917058490902554}
{"freq_range": [2.0, 80.0], "freq_res": 1.0, "aperiodic_params_": [0.272470098702242, 0.9597937466375371], "gaussian_params_": [[9.80301234844257, 0.5238197468962207, 0.7556524456646777], [13.37522022497107, 0.4362639029197716, 0.9599486512422368], [15.255486289743702, 0.21928192785036893, 0.4104243351357453], [26.15675186350627, 0.13459968185452273, 1.6678982561749183], [31.26371270465612, 0.1995724482505449, 0.6282048168374158], [34.0651861014394, 0.13632210799333508, 0.5331009471408882], [35.96818561306642, 0.20242333537352358, 1.7460758668697207], [40.058256319978604, 0.1840566176249378, 1.1677345713410399], [44.396089893404536, 0.6344343130967892, 0.27712197676048345], [47.39113707989714, 0.14725885803532185, 5.999999999999999], [50.88651010198204, 0.130824575777285, 0.25053515298401874], [70.87757679527795, 0.17181606291349363, 0.43297353331394495]], "peak_params_": [[9.80301234844257, 0.5072222421172614, 1.5113048913293554], [13.37522022497107, 0.4042461382489055, 1.9198973024844737], [15.255486289743702, 0.2848107686742425, 0.8208486702714906], [26.15675186350627, 0.13426244729861403, 3.3357965123498365], [31.26371270465612, 0.1917882606871637, 1.2564096336748316], [34.0651861014394, 0.2547659279669633, 1.0662018942817764], [35.96818561306642, 0.22730495450451627, 3.4921517337394414], [40.058256319978604, 0.26685869891575564, 2.3354691426820797], [44.396089893404536, 0.3545867982037503, 0.5542439535209669], [47.39113707989714, 0.14694629359784606, 11.999999999999998], [50.88651010198204, 0.24095944115838952, 0.5010703059680375], [70.87757679527795, 0.16514737424805626, 0.8659470666278899]], "r_squared_": 0.9846019483782703, "error_": 0.030845333507955618}
{"freq_range": [2.0, 80.0], "freq_res": 1.0, "aperiodic_params_": [0.6121316527062363, 1.1650203942188395], "gaussian_params_": [[9.85980036631682, 0.5227479544103547, 0.8614806958178717], [12.582535054120543, 0.3694765019164371, 0.35577873997697296], [14.193686091656046, 0.3871894391954017, 1.1384858713051933], [30.986992480970592, 0.15940417349290015, 0.6679468982692893], [35.07747479943236, 0.18628995260483033, 1.3825828412203556], [39.70195012316429, 0.18871924725919048, 1.1847882765194555], [44.38652002354833, 0.5180157376311095, 0.2795499519136751], [46.89272872112761, 0.1413078320417298, 5.999999999999999], [50.94056113316335, 0.1412371087395086, 0.2500010437566868], [70.66129032731202, 0.31752962195976697, 0.27155008959704213]], "peak_params_": [[9.85980036631682, 0.5163091127968065, 1.7229613916357434], [12.582535054120543, 0.40976013002871714, 0.7115574799539459], [14.193686091656046, 0.3817637459094573, 2.2769717426103866], [30.986992480970592, 0.16601418744644003, 1.3358937965385786], [35.07747479943236, 0.20588640569028605, 2.765165682440711], [39.70195012316429, 0.2562161019442416, 2.369576553038911], [44.38652002354833, 0.32523227584417636, 0.5590999038273502], [46.89272872112761, 0.1412852509452387, 11.999999999999998], [50.94056113316335, 0.2490930846196464, 0.5000020875133736], [70.66129032731202, 0.14590720434802473, 0.5431001791940843]], "r_squared_": 0.9839448504863298, "error_": 0.03940908830347041}
{"freq_range": [2.0, 80.0], "freq_res": 1.0, "aperiodic_params_": [0.8518225811312636, 1.2691210976205007], "gaussian_params_": [[9.83783003146349, 0.5074965559190971, 0.974870467499463], [12.852211356314825, 0.2738411925455485, 0.6733496418145059], [14.475002346325583, 0.3767362548032142, 1.2153301111445758], [35.1838144566806, 0.17870325252846736, 1.185766393875788], [39.486360845655035, 0.21159491370797506, 1.3058798949240915], [45.45223173553461, 0.1903115071648247, 2.7390772427410184], [50.97830981112594, 0.21749555434748352, 0.2500752992233476]], "peak_params_": [[9.83783003146349, 0.5009863523670942, 1.949740934998926], [12.852211356314825, 0.4503369270546174, 1.3466992836290117], [14.475002346325583, 0.4131428456678121, 2.4306602222891516], [35.1838144566806, 0.1772788650094239, 2.371532787751576], [39.486360845655035, 0.21029593419196435, 2.611759789848183], [45.45223173553461, 0.18776370864995817, 5.478154485482037], [50.97830981112594, 0.24115049298665614, 0.5001505984466952]], "r_squared_": 0.9851932080308627, "error_": 0.04605595149163774}
{"freq_range": [2.0, 80.0], "freq_res": 1.0, "aperiodic_params_": [0.8886905060373613, 1.2854492581956865], "gaussian_params_": [[9.717110976896622, 0.3875913742954147, 2.2172162960706765], [14.216992858892475, 0.4464494369225549, 1.3456331634486174], [38.75165674813904, 0.1794075886658559, 3.708638320852863], [44.41098791274464, 0.4715258720690125, 0.2844287626373264], [47.25815712582561, 0.14347165061981582, 1.9216887827626556], [50.674278602238154, 0.41417978594131927, 0.2662276532603802]], "peak_params_": [[9.717110976896622, 0.38773938509517236, 4.434432592141353], [14.216992858892475, 0.5006804164754151, 2.6912663268972348], [38.75165674813904, 0.1790198155964211, 7.417276641705726], [44.41098791274464, 0.26600110125761245, 0.5688575252746528], [47.25815712582561, 0.15730823480369183, 3.8433775655253113], [50.674278602238154, 0.21826909169224074, 0.5324553065207605]], "r_squared_": 0.9855955371050407, "error_": 0.05272760771432143}
{"freq_range": [2.0, 80.0], "freq_res": 1.0, "aperiodic_params_": [0.944759684580344, 1.3204328663802685], "gaussian_params_": [[9.848990064496808, 0.3902065132499019, 2.095838855900893], [14.163390386908329, 0.45589791155441195, 1.3277603435829246], [36.45203459913595, 0.10332637055807455, 2.4740256863148855], [40.08739740753312, 0.15709390237300558, 1.0971753088558889], [44.43091688849403, 0.6100991607362652, 0.2816506954650428], [47.11905934452724, 0.11693822328083683, 5.99998944842483], [50.968562222719775, 0.12195032442006415, 0.25000003539421833]], "peak_params_": [[9.848990064496808, 0.3925354467856071, 4.191677711801786], [14.163390386908329, 0.5073471978052614, 2.655520687165849], [36.45203459913595, 0.12276789873697058, 4.948051372629771], [40.08739740753312, 0.25139071165981086, 2.1943506177117778], [44.43091688849403, 0.29269314828398585, 0.5633013909300856], [47.11905934452724, 0.11692687324403872, 11.99997889684966], [50.968562222719775, 0.2158549032143222, 0.5000000707884367]], "r_squared_": 0.9877750768128318, "error_": 0.04661298842621261}
{"freq_range": [2.0, 80.0], "freq_res": 1.0, "aperiodic_params_": [0.8560923540548941, 1.2807867221933869], "gaussian_params_": [[9.905173112327724, 0.39579242062002185, 2.007279329038631], [14.208746525061036, 0.48652281997979724, 1.473919465015226], [35.241124327470864, 0.18590309886718517, 1.0887566194024765], [39.869513541774005, 0.27055681131862447, 1.3520823079838888], [44.46258952163686, 0.21155990711566372, 0.6915610494920437], [48.45203459913595, 0.1497024784174371, 3.414831471057904]], "peak_params_": [[9.905173112327724, 0.4036025744448194, 4.014558658077262], [14.208746525061036, 0.5310758727669741, 2.947838930030452], [35.241124327470864, 0.18187613258104252, 2.177513238804953], [39.869513541774005, 0.27631082789824757, 2.7041646159677777], [44.46258952163686, 0.23568996441037404, 1.3831220989840873], [48.45203459913595, 0.14839704450325963, 6.829662942115808]], "r_squared_": 0.987632747003614, "error_": 0.045490812960527004}
{"freq_range": [2.0, 80.0], "freq_res": 1.0, "aperiodic_params_": [0.7586741719439218, 1.2265544978124066], "gaussian_params_": [[9.681046715933837, 0.407915788976055, 1.3151512551731215], [13.83421591338106, 0.5270399337039623, 1.576391201170681], [38.36310783826639, 0.1638673711570763, 4.2694404547708835], [44.49353691932034, 1.1979414365526329, 0.2500026374010508], [49.22200075006364, 0.13192270339766407, 3.152261515953916]], "peak_params_": [[9.681046715933837, 0.42346016025890926, 2.630302510346243], [13.83421591338106, 0.5259900333604977, 3.152782402341362], [38.36310783826639, 0.163509311136798, 8.538880909541767], [44.49353691932034, 0.27267154057104126, 0.5000052748021016], [49.22200075006364, 0.1389519483432966, 6.304523031907832]], "r_squared_": 0.9832470390300183, "error_": 0.05187175656522595}
{"freq_range": [2.0, 80.0], "freq_res": 1.0, "aperiodic_params_": [0.4188135061131934, 0.9130196473246696], "gaussian_params_": [[9.799921410915623, 0.33950917924495244, 0.5807751944403658], [13.462197809338614, 0.3747418202792988, 1.4426281505406637], [26.45864889117264, 0.11014723911518594, 2.092327178028032], [35.12178336734122, 0.1682191858022648, 0.7838621500859811], [37.54547350334956, 0.6127427272717051, 0.2500073353653474], [40.322656669720665, 0.20645433321233525, 1.2217097131510595], [44.70335090591984, 0.2308447274314884, 0.8196582856851187], [49.83584299934159, 0.12226904865302574, 2.557164197798614], [51.59768188297563, 0.26330246147903824, 0.25000000000000006], [68.29275264714275, 0.24031978548111418, 0.25000000000000006], [75.80801130547687, 0.1454255920440468, 0.42824862260370067]], "peak_params_": [[9.799921410915623, 0.3409883535362677, 1.1615503888807317], [13.462197809338614, 0.3559940335122952, 2.8852563010813275], [26.45864889117264, 0.10753243892062014, 4.184654356056064], [35.12178336734122, 0.1662432828309055, 1.5677243001719623], [37.54547350334956, 0.1514484618976597, 0.5000146707306948], [40.322656669720665, 0.19945327960366133, 2.443419426302119], [44.70335090591984, 0.23679855483934031, 1.6393165713702373], [49.83584299934159, 0.12201737380577193, 5.114328395597228], [51.59768188297563, 0.15759133495904953, 0.5000000000000001], [68.29275264714275, 0.12106620886801367, 0.5000000000000001], [75.80801130547687, 0.13152185721481624, 0.8564972452074013]], "r_squared_": 0.983664328741872, "error_": 0.02972595611424464}
{"freq_range": [2.0, 80.0], "freq_res": 1.0, "aperiodic_params_": [-0.08488025591804346, 0.2942089506365149], "gaussian_params_": [[9.988360448321949, 0.17822496891237555, 0.25000000764221203], [13.780309607364952, 0.1971329749857872, 0.9025398742789664], [22.957839269910327, 0.3130153627148377, 2.750232406745275], [41.4243264630557, 0.15195773585727984, 5.037518530169606], [48.48993246256977, 0.5592816658976903, 0.28909811920309275], [51.50893456778783, 0.5132943125101573, 0.35492812697681586]], "peak_params_": [[9.988360448321949, 0.17806720389544184, 0.5000000152844241], [13.780309607364952, 0.19293416936479635, 1.8050797485579329], [22.957839269910327, 0.3131678204394297, 5.50046481349055], [41.4243264630557, 0.15141960301518054, 10.075037060339213], [48.48993246256977, 0.1978636533817516, 0.5781962384061855], [51.50893456778783, 0.21387811718495886, 0.7098562539536317]], "r_squared_": 0.7630232277172814, "error_": 0.055468400359228606}
{"freq_range": [2.0, 80.0], "freq_res": 1.0, "aperiodic_params_": [0.1489051142201918, 0.7886013280678725], "gaussian_params_": [[9.71666460159925, 0.4568501740372978, 0.6053683413218565], [13.366856497953908, 0.319987840052207, 1.0649337550800893], [15.214054232760612, 0.21687158643525167, 0.252144353841145], [27.549464037311857, 0.7361914721019711, 0.2723516658233892], [35.22576157841477, 0.17207840139970565, 2.485419365747736], [39.468737022199, 0.4042762667063998, 0.2900142684152408], [40.6367754047393, 0.5009332605094898, 0.2500019260473565], [43.73134197741026, 0.47588567324603187, 0.25092267605322693], [46.22395835837233, 0.05564146781107601, 0.959615535378693], [50.64527057613334, 0.153066357798512, 5.999999999999999], [66.64178015584278, 0.38242360607177894, 0.25102989318100777], [71.75340152068145, 0.13936021407221788, 1.5869250851375505]], "peak_params_": [[9.71666460159925, 0.4116153938107309, 1.210736682643713], [13.366856497953908, 0.301553593292716, 2.1298675101601785], [15.214054232760612, 0.24998248901775733, 0.50428870768229], [27.549464037311857, 0.19003451887651712, 0.5447033316467784], [35.22576157841477, 0.17648009888627147, 4.970838731495472], [39.468737022199, 0.18710153196900692, 0.5800285368304816], [40.6367754047393, 0.22797026233185091, 0.500003852094713], [43.73134197741026, 0.35529618506341343, 0.5018453521064539], [46.22395835837233, 0.1675890247446541, 1.919231070757386], [50.64527057613334, 0.1527993132352392, 11.999999999999998], [66.64178015584278, 0.1434512307270046, 0.5020597863620155], [71.75340152068145, 0.13795951612289215, 3.173850170275101]], "r_squared_": 0.9690507431928956, "error_": 0.03670459171822092}
{"freq_range": [2.0, 80.0], "freq_res": 1.0, "aperiodic_params_": [0.5074525385878018, 1.0788762372779792], "gaussian_params_": [[9.646361296802079, 0.5305885731298368, 0.7714821006469885], [13.774393230643303, 0.4256815111696778, 1.6620822907332642], [33.88355064397037, 0.11781544298296867, 5.335461179039981], [39.47068269615081, 0.3869832224997422, 0.2715995150489163], [40.66255853974337, 0.2228814597282677, 0.258028096191004], [46.13995027865102, 0.15445333010924278, 5.999999999999706], [50.973449378546924, 0.16925488376014733, 0.2500000083934021], [71.21965760925725, 0.18538740527456662, 0.511094625441243]], "peak_params_": [[9.646361296802079, 0.5099839624222704, 1.542964201293977], [13.774393230643303, 0.42189177216839563, 3.3241645814665284], [33.88355064397037, 0.13773221330420182, 10.670922358079961], [39.47068269615081, 0.23668066964559153, 0.5431990300978325], [40.66255853974337, 0.2501944907047142, 0.516056192382008], [46.13995027865102, 0.16335155499286147, 11.999999999999412], [50.973449378546924, 0.28024534836900394, 0.5000000167868042], [71.21965760925725, 0.16906171361815603, 1.022189250882486]], "r_squared_": 0.9814139393623338, "error_": 0.042789603528062284}
{"freq_range": [2.0, 80.0], "freq_res": 1.0, "aperiodic_params_": [0.8528659210258078, 1.2569332032201466], "gaussian_params_": [[9.725703662742148, 0.5287934230211788, 0.8371953161554544], [13.997351009381823, 0.4415144180500724, 1.8403286542563753], [35.578388085476135, 0.1830161038699497, 1.3630737213982236], [39.86072788188757, 0.2515473171197372, 1.160216523502469], [45.629817655721546, 0.21111116033050914, 2.2661823622250603], [50.63562098542676, 0.5340701611265563, 0.27764322546543857]], "peak_params_": [[9.725703662742148, 0.5428902212289444, 1.6743906323109088], [13.997351009381823, 0.4415151170653419, 3.6806573085127505], [35.578388085476135, 0.17548395440291142, 2.726147442796447], [39.86072788188757, 0.260337403680299, 2.320433047004938], [45.629817655721546, 0.20831349009487532, 4.532364724450121], [50.63562098542676, 0.238466443716282, 0.5552864509308771]], "r_squared_": 0.9837316476783114, "error_": 0.04881237689721747}
{"freq_range": [2.0, 80.0], "freq_res": 1.0, "aperiodic_params_": [0.9068205007396583, 1.298805122045447], "gaussian_params_": [[9.865843623890305, 0.5282584747311716, 1.0389712846319203], [12.874682345525475, 0.3748145597342905, 0.7852546249901786], [14.973916650988158, 0.4228570927075653, 1.2564190140984006], [35.358193586248014, 0.16782358161791372, 1.2029326928517334], [38.93392958334171, 0.20882344236338551, 0.724302262392564], [40.7153680536977, 0.2242289184426251, 0.6627586673912055], [44.384277026745345, 0.3871796770914655, 0.3039928107512583], [46.39180754974674, 0.16035939762559973, 2.6110043210658445], [50.99076124533647, 0.18691662826214087, 0.2500019909771387], [71.04675858673538, 0.15538472017336546, 0.467364624142175]], "peak_params_": [[9.865843623890305, 0.5245010374278966, 2.0779425692638407], [12.874682345525475, 0.4987438530561353, 1.5705092499803572], [14.973916650988158, 0.4323879044751814, 2.5128380281968012], [35.358193586248014, 0.16055791065553704, 2.405865385703467], [38.93392958334171, 0.2204596624420747, 1.448604524785128], [40.7153680536977, 0.22706528851487695, 1.325517334782411], [44.384277026745345, 0.2795594625364102, 0.6079856215025166], [46.39180754974674, 0.158564318855815, 5.222008642131689], [50.99076124533647, 0.22057213849786694, 0.5000039819542774], [71.04675858673538, 0.15460900357819463, 0.93472924828435]], "r_squared_": 0.9887136534571527, "error_": 0.03961116456226917}
{"freq_range": [2.0, 80.0], "freq_res": 1.0, "aperiodic_params_": [0.9287610194191624, 1.30638984934305], "gaussian_params_": [[9.903313777928853, 0.5331764059373147, 1.0227584022612897], [12.863118612946156, 0.39166345734400687, 0.7791769869513299], [14.938873738642263, 0.43480452618269055, 1.2709995737415514], [38.81091807065852, 0.17196373342137364, 3.4488654938823893], [44.44922939140253, 0.6314966292625055, 0.2890996292360903], [47.12216497860824, 0.15622582259969903, 1.5835060126935858], [50.64093685022232, 0.5085626619677408, 0.2731417182938911]], "peak_params_": [[9.903313777928853, 0.5314861452163695, 2.0455168045225793], [12.863118612946156, 0.5269382064591165, 1.5583539739026597], [14.938873738642263, 0.44341794282481367, 2.5419991474831027], [38.81091807065852, 0.17170579326239976, 6.8977309877647786], [44.44922939140253, 0.2666337561321741, 0.5781992584721806], [47.12216497860824, 0.16602238725328888, 3.1670120253871716], [50.64093685022232, 0.2224589404800168, 0.5462834365877822]], "r_squared_": 0.9880897810055321, "error_": 0.045851700400447636}
{"freq_range": [2.0, 80.0], "freq_res": 1.0, "aperiodic_params_": [0.8800531781986192, 1.2946323935983008], "gaussian_params_": [[9.898454858191117, 0.4880399565810855, 1.2852514273204103], [12.898292976471955, 0.3690500023131471, 0.7618927721569821], [14.935064953521087, 0.45606935440642193, 1.3337374780195197], [35.22509324562552, 0.16654192048589989, 1.0912556429740927], [38.594422923840604, 0.3851135429746201, 0.3422915128856721], [40.499910990972445, 0.3624328472820138, 0.40429421535967464], [44.46521655262511, 0.5068630653076027, 0.30138331112289707], [47.02790695027675, 0.1220772586582551, 4.328923274524331], [50.98315680466716, 0.14323216568402436, 0.25000000591830535], [70.83001606901095, 0.16751349705719923, 0.34531102383386364]], "peak_params_": [[9.898454858191117, 0.48727030850449343, 2.5705028546408206], [12.898292976471955, 0.5515149468297635, 1.5237855443139643], [14.935064953521087, 0.46393094444139527, 2.6674749560390394], [35.22509324562552, 0.16560824068232982, 2.1825112859481854], [38.594422923840604, 0.21352501285035874, 0.6845830257713442], [40.499910990972445, 0.20151898695726345, 0.8085884307193493], [44.46521655262511, 0.24957597843989743, 0.6027666222457941], [47.02790695027675, 0.12207472198084979, 8.657846549048662], [50.98315680466716, 0.22304033302099913, 0.5000000118366107], [70.83001606901095, 0.14839869669585815, 0.6906220476677273]], "r_squared_": 0.9902872851801853, "error_": 0.03860362448334489}
{"freq_range": [2.0, 80.0], "freq_res": 1.0, "aperiodic_params_": [0.7457203237797535, 1.232872471325822], "gaussian_params_": [[12.432048594578855, 0.5144647432051723, 3.0023094025940247], [39.20206622246292, 0.17838524270007722, 3.3154953250054766], [44.503408296944116, 0.974549000501208, 0.2745887355300844], [46.48403154515326, 0.5435510014750152, 0.27816491465625104], [50.07686653145763, 0.12719713144484165, 2.41591985319429]], "peak_params_": [[12.432048594578855, 0.5091652610203903, 6.004618805188049], [39.20206622246292, 0.1780577162852548, 6.630990650010953], [44.503408296944116, 0.24257516516114386, 0.5491774710601688], [46.48403154515326, 0.1720315555086953, 0.5563298293125021], [50.07686653145763, 0.12802017016566847, 4.83183970638858]], "r_squared_": 0.983487687408927, "error_": 0.05136324249522395}
{"freq_range": [2.0, 80.0], "freq_res": 1.0, "aperiodic_params_": [0.5416154067368626, 1.1344195301963698], "gaussian_params_": [[9.546909202948076, 0.3451383402287194, 0.8405295241463613], [13.512524302337903, 0.4962122595331605, 1.734868661286126], [35.09605082564645, 0.17582225908077675, 0.7116929913535927], [40.26742317440213, 0.23429399857345518, 1.3005905913778368], [44.66361340022641, 0.2618434340220152, 0.7546870010067092], [49.591334510574036, 0.12780019925852235, 3.040610883551769], [63.014541236548354, 0.18568092999980773, 0.679976363747773], [76.0593544440579, 0.1644056980474963, 0.2500435854614252]], "peak_params_": [[9.546909202948076, 0.36236938429976007, 1.6810590482927226], [13.512524302337903, 0.4770052450271155, 3.469737322572252], [35.09605082564645, 0.1742938120690618, 1.4233859827071853], [40.26742317440213, 0.230275988585793, 2.6011811827556737], [44.66361340022641, 0.2782656660648968, 1.5093740020134183], [49.591334510574036, 0.1266511041599936, 6.081221767103538], [63.014541236548354, 0.18564612823802262, 1.359952727495546], [76.0593544440579, 0.15983840978125885, 0.5000871709228504]], "r_squared_": 0.9820846618087735, "error_": 0.04038260797685723}
{"freq_range": [2.0, 80.0], "freq_res": 1.0, "aperiodic_params_": [0.09546469159842016, 0.6939896566417132], "gaussian_params_": [[9.524491051094223, 0.9955228300870769, 0.2501277470312078], [13.647347683398891, 0.2569676970245044, 1.2124284784819592], [22.762359909690584, 0.16731281315713742, 1.2733754917003903], [42.51708914973941, 0.12069363623088204, 3.340495729964284], [48.44704938410208, 0.8539064914089809, 0.25104855136785553], [51.71473032707174, 0.24392651975144006, 0.6942481373119544], [64.45203459913596, 0.08062133928575059, 5.999999999999979]], "peak_params_": [[9.524491051094223, 0.16619154959782373, 0.5002554940624157], [13.647347683398891, 0.24632439019876895, 2.4248569569639185], [22.762359909690584, 0.16442446826399892, 2.5467509834007807], [42.51708914973941, 0.11957415025259321, 6.680991459928568], [48.44704938410208, 0.2081802074738388, 0.5020971027357111], [51.71473032707174, 0.23568407044810047, 1.388496274623909], [64.45203459913596, 0.08039286122128231, 11.999999999999957]], "r_squared_": 0.955748430136508, "error_": 0.04167830745366723}
{"freq_range": [2.0, 80.0], "freq_res": 1.0, "aperiodic_params_": [0.2590456442144875, 0.8066355239640428], "gaussian_params_": [[9.50469947124663, 0.27252157925461346, 0.6708130623607744], [12.598824318503025, 0.5861252492825042, 0.3090181574916024], [14.583868585572036, 0.2273201877625434, 0.8032491549001128], [25.406748674922703, 0.22163164603165542, 1.072437464287059], [27.61837181121715, 0.865940288472972, 0.2500017119639842], [32.147231846656666, 0.2073777860186749, 3.2646741811206907], [40.32318188104605, 0.19111762120221387, 1.1225712543084099], [44.46499918580215, 0.6989196528617034, 0.28080768962199865], [47.361376301588315, 0.17431965486774875, 0.25002450629005085], [50.770552860815464, 0.15211532278626919, 5.961059635919605], [62.44564083274346, 0.5904383177107972, 0.278050535068087]], "peak_params_": [[9.50469947124663, 0.20749998226675992, 1.3416261247215489], [12.598824318503025, 0.28489012201246044, 0.6180363149832048], [14.583868585572036, 0.19877378854759248, 1.6064983098002257], [25.406748674922703, 0.22514394616008837, 2.144874928574118], [27.61837181121715, 0.37463431387979507, 0.5000034239279684], [32.147231846656666, 0.20823627188180582, 6.5293483622413815], [40.32318188104605, 0.22458650920142997, 2.2451425086168197], [44.46499918580215, 0.2583996795557343, 0.5616153792439973], [47.361376301588315, 0.18587735628116575, 0.5000490125801017], [50.770552860815464, 0.15200269264701904, 11.92211927183921], [62.44564083274346, 0.1892446530095866, 0.556101070136174]], "r_squared_": 0.9676006633250462, "error_": 0.03971987826859311}
{"freq_range": [2.0, 80.0], "freq_res": 1.0, "aperiodic_params_": [0.5310638184995546, 1.080884758512664], "gaussian_params_": [[9.483014036702013, 0.4644068082004617, 0.7411783965357848], [13.775386176294607, 0.38292604556343757, 2.000875267205874], [34.79442873321525, 0.15841904810893595, 5.9999999999532285], [40.536178354998086, 0.6789812665223475, 0.25108486624551674], [44.446509068161724, 0.6987761747263823, 0.27742545197665125], [50.28440106796351, 0.13768735444936983, 5.999999999970145]], "peak_params_": [[9.483014036702013, 0.3977675508788614, 1.4823567930715695], [13.775386176294607, 0.3809113171104032, 4.001750534411748], [34.79442873321525, 0.16369359043655907, 11.999999999906457], [40.536178354998086, 0.25765266809283405, 0.5021697324910335], [44.446509068161724, 0.319736496749192, 0.5548509039533025], [50.28440106796351, 0.14391808802538186, 11.99999999994029]], "r_squared_": 0.977191019049126, "error_": 0.04802413066712154}
{"freq_range": [2.0, 80.0], "freq_res": 1.0, "aperiodic_params_": [0.8067531876789289, 1.238867072205595], "gaussian_params_": [[9.7606429840055, 0.54229904480598, 0.9338651650663377], [12.611894288127544, 0.36113437554083877, 0.6728039975035229], [15.10636469556882, 0.4604885601862609, 1.2856840350837813], [34.8145575869354, 0.1164615867307038, 4.101954173788808], [39.437523241943914, 0.3201452174678781, 0.2893100422032017], [40.58543109152605, 0.4170084961851479, 0.27943290247644836], [44.4429576201735, 0.5592366356298255, 0.29859884379147406], [48.0738604836214, 0.11264159777655913, 5.99999999982969], [50.94659881983801, 0.16190570430940351, 0.2500010207106577]], "peak_params_": [[9.7606429840055, 0.5251413049844778, 1.8677303301326753], [12.611894288127544, 0.4274350460522184, 1.3456079950070459], [15.10636469556882, 0.45958005106798383, 2.5713680701675625], [34.8145575869354, 0.1268307355488083, 8.203908347577617], [39.437523241943914, 0.20712600737229536, 0.5786200844064034], [40.58543109152605, 0.23231284328434698, 0.5588658049528967], [44.4429576201735, 0.2850381306524157, 0.5971976875829481], [48.0738604836214, 0.11329756565158888, 11.99999999965938], [50.94659881983801, 0.2583143884691719, 0.5000020414213154]], "r_squared_": 0.9854079804026527, "error_": 0.041678080509595046}
{"freq_range": [2.0, 80.0], "freq_res": 1.0, "aperiodic_params_": [0.8689019560788849, 1.2682702182903876], "gaussian_params_": [[9.809305586558652, 0.5690823711945261, 0.9676328255146777], [12.595283323246207, 0.35244094139976956, 0.646866715424335], [15.011597489277362, 0.501526866663742, 1.3647112085940862], [35.80997539815232, 0.11702814040088665, 3.462710259453486], [38.62341594578404, 0.29284883625339686, 0.2692338527035382], [40.58477157564198, 0.23870491121556534, 0.48679806920277524], [44.42029631955528, 0.4455384386016202, 0.3151100634103348], [46.60164516065991, 0.1706985080073595, 1.9605029942493761], [50.714181607364004, 0.38377677762406726, 0.25001641344136083]], "peak_params_": [[9.809305586558652, 0.5588421311419377, 1.9352656510293553], [12.595283323246207, 0.4615069399230125, 1.29373343084867], [15.011597489277362, 0.5018607856941419, 2.7294224171881725], [35.80997539815232, 0.11685213233027403, 6.925420518906972], [38.62341594578404, 0.18795017324567098, 0.5384677054070764], [40.58477157564198, 0.20684988393137915, 0.9735961384055505], [44.42029631955528, 0.2609547547115778, 0.6302201268206696], [46.60164516065991, 0.16784270809463564, 3.9210059884987523], [50.714181607364004, 0.2134475099337525, 0.5000328268827217]], "r_squared_": 0.9872144703906113, "error_": 0.041415087439790874}
{"freq_range": [2.0, 80.0], "freq_res": 1.0, "aperiodic_params_": [0.9201517552376993, 1.3052768518789541], "gaussian_params_": [[9.819307972729632, 0.6080397681505632, 0.985879713638042], [12.520740172400943, 0.7855678592325943, 0.32211116226937625], [14.85830406713084, 0.5391998621792804, 1.464310053727276], [35.26858021052222, 0.1775756329415504, 1.0613073697892037], [38.694700803515964, 0.23156803316002658, 0.48987137546081144], [40.59152481061369, 0.2801236118296737, 0.6408527868349423], [44.42842169513644, 0.4957247319452869, 0.2895919027787032], [46.80529397276413, 0.15412097606339992, 2.516926511052852], [50.934061938239395, 0.19066611837216996, 0.2500000117698591]], "peak_params_": [[9.819307972729632, 0.6001074849052204, 1.971759427276084], [12.520740172400943, 0.5040462027535018, 0.6442223245387525], [14.85830406713084, 0.5366819160305054, 2.928620107454552], [35.26858021052222, 0.1719821226472259, 2.1226147395784074], [38.694700803515964, 0.20514508234136397, 0.9797427509216229], [40.59152481061369, 0.23941238467384585, 1.2817055736698846], [44.42842169513644, 0.24876885616749533, 0.5791838055574065], [46.80529397276413, 0.1536605075972992, 5.033853022105704], [50.934061938239395, 0.22258303234064147, 0.5000000235397182]], "r_squared_": 0.9895791146449977, "error_": 0.03958353050050524}
{"freq_range": [2.0, 80.0], "freq_res": 1.0, "aperiodic_params_": [0.8705685192961533, 1.2930616486484936], "gaussian_params_": [[9.641100435371571, 0.5136204390323492, 1.0189531541075678], [14.076525433896489, 0.5476655398600029, 2.004023880682271], [38.4701670270708, 0.1422546372791867, 4.77193240538417], [44.48717141254416, 0.6182107777285974, 0.2792084343930632], [49.05374599368375, 0.1262002239879372, 3.140378630007508]], "peak_params_": [[9.641100435371571, 0.551910197844565, 2.0379063082151356], [14.076525433896489, 0.5473212334813518, 4.008047761364542], [38.4701670270708, 0.14182328705933145, 9.54386481076834], [44.48717141254416, 0.24216878572935618, 0.5584168687861264], [49.05374599368375, 0.13864813883595062, 6.280757260015016]], "r_squared_": 0.9870376667206774, "error_": 0.0480870653186498}
{"freq_range": [2.0, 80.0], "freq_res": 1.0, "aperiodic_params_": [0.7807318202491911, 1.2560141319932032], "gaussian_params_": [[9.754331519283582, 0.5174521726132454, 1.3164884103162642], [12.508644203286524, 0.6955908047435136, 0.3109663190753038], [14.649954220377204, 0.49553383817581176, 1.585709898503397], [35.184169274025194, 0.18167193701462914, 0.9787693326259547], [39.640129535821046, 0.1544116663774959, 1.0693305530701762], [45.74934220702994, 0.17399449188662283, 4.346605252844095], [50.96340772570122, 0.13530393998409793, 0.2500004898235713]], "peak_params_": [[9.754331519283582, 0.5152474787455247, 2.6329768206325284], [12.508644203286524, 0.5127805523664598, 0.6219326381506076], [14.649954220377204, 0.48379049831304066, 3.171419797006794], [35.184169274025194, 0.1866714791841414, 1.9575386652519093], [39.640129535821046, 0.21845810057130244, 2.1386611061403524], [45.74934220702994, 0.1737054227824475, 8.69321050568819], [50.96340772570122, 0.21774364702838134, 0.5000009796471426]], "r_squared_": 0.9896042324148319, "error_": 0.04068965341281204}
{"freq_range": [2.0, 80.0], "freq_res": 1.0, "aperiodic_params_": [0.611333287915328, 1.18166514615974], "gaussian_params_": [[7.13278476697586, 0.20397031518215744, 0.7197438775285995], [9.500767698628902, 0.42835674159606435, 0.8360062166359518], [11.909092250627925, 0.056529103711287436, 0.291203563321181], [13.491630694425524, 0.4937574905262774, 1.9835657753285665], [35.00668971354205, 0.16230006145710074, 0.8353598033040254], [39.87234918719141, 0.25953008272922545, 1.2795336653940155], [45.17516501580713, 0.21582232182227545, 1.6872735139579043], [49.377302923701315, 0.15159885536040132, 0.6929161071028729], [50.81556368397688, 0.25683795172898355, 0.25001359636296155], [54.01404038104752, 0.13500482038440975, 1.1591491794647892], [62.17296671838048, 0.10783815657614763, 2.568746136877558], [76.0326581711072, 0.11215103124562276, 0.2500000000000001]], "peak_params_": [[7.13278476697586, 0.2077444007476689, 1.439487755057199], [9.500767698628902, 0.4633478992432728, 1.6720124332719035], [11.909092250627925, 0.430901200008642, 0.582407126642362], [13.491630694425524, 0.47894001782245577, 3.967131550657133], [35.00668971354205, 0.16247915512640687, 1.6707196066080507], [39.87234918719141, 0.2601973215990889, 2.559067330788031], [45.17516501580713, 0.21474693077055984, 3.3745470279158085], [49.377302923701315, 0.1472517329770182, 1.3858322142057458], [50.81556368397688, 0.21058067754955623, 0.5000271927259231], [54.01404038104752, 0.13567837002464023, 2.3182983589295785], [62.17296671838048, 0.10759396370226426, 5.137492273755116], [76.0326581711072, 0.11119823422597341, 0.5000000000000002]], "r_squared_": 0.9939184515241767, "error_": 0.02774389505123287}
{"freq_range": [2.0, 80.0], "freq_res": 1.0, "aperiodic_params_": [0.2601112146476393, 0.9217474967686514], "gaussian_params_": [[9.265764201611924, 0.3747747942822522, 1.0016651275755877], [13.499136952258386, 0.42942239321452536, 1.270457046834298], [38.51740001857607, 0.5676638091315442, 0.28649850606934424], [40.633174839721505, 0.17071040687108888, 0.7536036586519246], [44.39589859640513, 0.16512508628062825, 0.6238274601789057], [46.570635469840695, 0.12214964582216839, 2.7950883553282724], [51.300499250582725, 0.24751360820112603, 0.2636920967365639], [54.15776698808557, 0.1919539307657138, 1.0749437399244102], [58.369285459198665, 0.17106147622002343, 1.405310548411077], [62.38074077656185, 0.21729389759699344, 0.9123092656009489], [66.92927149699679, 0.17499985856839007, 1.2268325791917996], [70.41995759009887, 0.5237977333104763, 0.3161982631027736], [72.61438365676, 0.379781140431658, 0.2728067243346315]], "peak_params_": [[9.265764201611924, 0.36262501440735634, 2.0033302551511754], [13.499136952258386, 0.3978869531510227, 2.540914093668596], [38.51740001857607, 0.1568129876103197, 0.5729970121386885], [40.633174839721505, 0.16840221159498459, 1.5072073173038492], [44.39589859640513, 0.21503881159429206, 1.2476549203578113], [46.570635469840695, 0.12074407537310305, 5.590176710656545], [51.300499250582725, 0.1666670797706613, 0.5273841934731278], [54.15776698808557, 0.19482990092935504, 2.1498874798488203], [58.369285459198665, 0.16560966033660285, 2.810621096822154], [62.38074077656185, 0.20530364923153188, 1.8246185312018979], [66.92927149699679, 0.1747098690256732, 2.453665158383599], [70.41995759009887, 0.22446318816143762, 0.6323965262055472], [72.61438365676, 0.13985261557219086, 0.545613448669263]], "r_squared_": 0.9783300877889706, "error_": 0.03473560256209667}
{"freq_range": [2.0, 80.0], "freq_res": 1.0, "aperiodic_params_": [0.37981999822837464, 0.9537996048953304], "gaussian_params_": [[9.60893755304577, 0.636419981788666, 0.8573084138326209], [12.529964066380469, 0.9946851723988732, 0.32535713534878535], [15.17754068624438, 0.28359777455618795, 1.2195767042879424], [26.65890213843847, 0.1630151880511625, 1.8054031117162692], [36.049741208260784, 0.20915168929564945, 3.9387851452709857], [40.572818460451536, 0.5068720153210015, 0.28520638433011836], [44.12037760215322, 0.30604119831745247, 0.7571465308483336], [46.83971874457584, 0.2275616709882716, 0.9231603501847749], [49.07045583728861, 0.18471023902176215, 0.29773458001440883], [50.76175606779082, 0.35086983574329705, 0.6592959036275168], [53.836082657340235, 0.16637841750960897, 0.8980129240482142], [61.21290381002829, 0.11934106329888301, 2.1947668951361523], [71.0049974434596, 0.13896257919525548, 0.25000000000000006]], "peak_params_": [[9.60893755304577, 0.5735711307317919, 1.7146168276652418], [12.529964066380469, 0.40818946552035473, 0.6507142706975707], [15.17754068624438, 0.28060873178335655, 2.439153408575885], [26.65890213843847, 0.1750647196884062, 3.6108062234325384], [36.049741208260784, 0.20913526286504247, 7.877570290541971], [40.572818460451536, 0.26010818208517583, 0.5704127686602367], [44.12037760215322, 0.33147911812185593, 1.5142930616966672], [46.83971874457584, 0.22876532442797304, 1.8463207003695499], [49.07045583728861, 0.20514948260943466, 0.5954691600288177], [50.76175606779082, 0.32999556592815815, 1.3185918072550336], [53.836082657340235, 0.16417701412951313, 1.7960258480964284], [61.21290381002829, 0.11878088229126793, 4.389533790272305], [71.0049974434596, 0.13894055591437526, 0.5000000000000001]], "r_squared_": 0.9864337948483045, "error_": 0.033223817027933}
{"freq_range": [2.0, 80.0], "freq_res": 1.0, "aperiodic_params_": [0.47551090089799297, 1.0335116548450674], "gaussian_params_": [[9.639296614289533, 0.6631971359542804, 0.842417516135321], [12.537107406511124, 0.8183452857408832, 0.3657425493064315], [15.151097328087705, 0.3133178509166485, 1.1396339616939075], [26.732385101265063, 0.16849560206107367, 1.8531827041742461], [34.43115199369556, 0.18532068669626048, 3.0383844954012225], [36.54263203583637, 0.3939984161332569, 0.27120940102324415], [40.17014451778642, 0.16945166045956978, 1.0016848490166739], [44.114838160013875, 0.23471451170002058, 0.6251202492359922], [49.31075524584927, 0.1656219211767329, 5.999999999999993], [50.68926017449874, 0.3710765373307913, 0.25031918055870056]], "peak_params_": [[9.639296614289533, 0.6051181246480277, 1.684835032270642], [12.537107406511124, 0.42037065694377895, 0.731485098612863], [15.151097328087705, 0.3105760973309223, 2.279267923387815], [26.732385101265063, 0.1762237689292393, 3.7063654083484923], [34.43115199369556, 0.1899258850756098, 6.076768990802445], [36.54263203583637, 0.24599122820895558, 0.5424188020464883], [40.17014451778642, 0.2512599580446143, 2.0033696980333477], [44.114838160013875, 0.3441437211944085, 1.2502404984719844], [49.31075524584927, 0.16540181786187058, 11.999999999999986], [50.68926017449874, 0.3309128356913016, 0.5006383611174011]], "r_squared_": 0.9813535039598058, "error_": 0.03945409543283745}
{"freq_range": [2.0, 80.0], "freq_res": 1.0, "aperiodic_params_": [0.7915728754237439, 1.227953096638398], "gaussian_params_": [[9.744378603770349, 0.7268861381568081, 0.8587776235385014], [12.488621768407482, 1.5185542720066725, 0.27487545888332504], [15.056272043841307, 0.4112680809667274, 1.4315241062509434], [35.95010746399987, 0.14450025737020336, 5.076369193349282], [40.54736846197271, 0.6676516869026904, 0.2500086452174849], [44.4635504864631, 0.7219938320776208, 0.26364128015395405], [49.25646265383102, 0.14449469637203757, 4.249447053333212]], "peak_params_": [[9.744378603770349, 0.6961919336248783, 1.7175552470770028], [12.488621768407482, 0.37799709886835575, 0.5497509177666501], [15.056272043841307, 0.41097939516045734, 2.863048212501887], [35.95010746399987, 0.14560662807519198, 10.152738386698564], [40.54736846197271, 0.23963912926956898, 0.5000172904349698], [44.4635504864631, 0.2622284283398021, 0.5272825603079081], [49.25646265383102, 0.14953862420691744, 8.498894106666423]], "r_squared_": 0.9838995092773426, "error_": 0.046839168388737765}
{"freq_range": [2.0, 80.0], "freq_res": 1.0, "aperiodic_params_": [0.9604043980591641, 1.3250300419400198], "gaussian_params_": [[9.631128654280351, 0.7411071553383878, 0.78488125998959], [14.156353279635363, 0.5275420066019344, 2.23543781344342], [35.298271413819734, 0.1841003655138818, 1.0163482100004166], [40.08991119403884, 0.1998316506056964, 1.4806115143111271], [44.379829121392454, 0.2592831209370014, 0.7134864498943269], [47.28545469908488, 0.1720488097252725, 1.429613336564301], [50.774902333407695, 0.2566408257149088, 0.4427120925018611]], "peak_params_": [[9.631128654280351, 0.7572847124217816, 1.56976251997918], [14.156353279635363, 0.5262533473462075, 4.47087562688684], [35.298271413819734, 0.17688322442250137, 2.0326964200008333], [40.08991119403884, 0.19946808450427822, 2.9612230286222543], [44.379829121392454, 0.24340824799440053, 1.4269728997886537], [47.28545469908488, 0.16896247005184817, 2.859226673128602], [50.774902333407695, 0.23140558865968974, 0.8854241850037222]], "r_squared_": 0.9889420543458849, "error_": 0.046029073517657886}
{"freq_range": [2.0, 80.0], "freq_res": 1.0, "aperiodic_params_": [0.8831356426441908, 1.2888886563235298], "gaussian_params_": [[7.263318779759279, 0.2103298282536093, 0.7599656276657019], [9.790351064731249, 0.7908292717634829, 0.8388316778712331], [12.468004295983016, 0.5442693918086403, 0.36775936481684], [14.764897524338787, 0.5152168929443188, 1.701598096984308], [35.17811768922798, 0.17562591785944412, 1.0443793527288114], [38.635782172259894, 0.2184766053959191, 0.3261039729459143], [40.512444833400295, 0.5111856670883667, 0.31142884490936357], [44.49945525330588, 0.3464543278654231, 0.33468839473347095], [46.7638588394731, 0.1121911829654638, 5.999999999999999], [50.99208717840272, 0.11946884198615697, 0.25000000001070016], [76.39125375076334, 0.43372866222757384, 0.25301972258397587]], "peak_params_": [[7.263318779759279, 0.2012192693163919, 1.5199312553314037], [9.790351064731249, 0.7770482211828065, 1.6776633557424663], [12.468004295983016, 0.40442350439862257, 0.73551872963368], [14.764897524338787, 0.5103227003345299, 3.403196193968616], [35.17811768922798, 0.18950434222736856, 2.088758705457623], [38.635782172259894, 0.16588493004097904, 0.6522079458918286], [40.512444833400295, 0.2208195202921054, 0.6228576898187271], [44.49945525330588, 0.21467846715805594, 0.6693767894669419], [46.7638588394731, 0.11210432664033343, 11.999999999999998], [50.99208717840272, 0.20685049715639026, 0.5000000000214003], [76.39125375076334, 0.1312161678968904, 0.5060394451679517]], "r_squared_": 0.9936849590199119, "error_": 0.029997767090078717}
{"freq_range": [2.0, 80.0], "freq_res": 1.0, "aperiodic_params_": [0.7988212114170297, 1.2592626737747998], "gaussian_params_": [[7.501869830578217, 0.22387241427332014, 0.7440609418513207], [9.655048206384498, 0.7401315521219202, 0.673136086255875], [12.843987706100013, 0.50100039126066, 1.6627952896323697], [15.673770860354967, 0.27199438178462826, 1.2210583950237148], [35.25168924851948, 0.16112310938878935, 0.8201752332023285], [38.53936728006675, 0.29308098700791174, 0.3024575622423245], [40.499574534339956, 0.4628264244592057, 0.29806521593113694], [46.510033541627095, 0.15300301115610793, 5.999999999999999], [50.99226964113196, 0.10784527641362855, 0.2500035932524538]], "peak_params_": [[7.501869830578217, 0.22214611690631383, 1.4881218837026413], [9.655048206384498, 0.7659022576010962, 1.34627217251175], [12.843987706100013, 0.5235416058047915, 3.3255905792647393], [15.673770860354967, 0.3451713359556686, 2.4421167900474297], [35.25168924851948, 0.17801165449857148, 1.640350466404657], [38.53936728006675, 0.1618128589046186, 0.604915124484649], [40.499574534339956, 0.19854303322431943, 0.5961304318622739], [46.510033541627095, 0.15249370801200368, 11.999999999999998], [50.99226964113196, 0.2234312442580182, 0.5000071865049076]], "r_squared_": 0.991250210931521, "error_": 0.0367266352114839}
{"freq_range": [2.0, 80.0], "freq_res": 1.0, "aperiodic_params_": [0.7483230166437612, 1.2170574081669012], "gaussian_params_": [[9.541652850215218, 0.6837032410327765, 1.1181999979441748], [13.499373576750985, 0.5914654907158793, 1.7685823759897212], [35.13299009735562, 0.17768053995743918, 0.7481228892791646], [39.88134058472339, 0.19641144308348576, 1.3132076715978345], [44.74187244756501, 0.19361088477724012, 1.0321730943834004], [53.54796540086405, 0.10950560175588751, 5.999999999999999]], "peak_params_": [[9.541652850215218, 0.7121352584136799, 2.2363999958883496], [13.499373576750985, 0.5740768318941654, 3.5371647519794425], [35.13299009735562, 0.1760125944462143, 1.4962457785583292], [39.88134058472339, 0.20417295238829902, 2.626415343195669], [44.74187244756501, 0.22744077769157411, 2.064346188766801], [53.54796540086405, 0.10919526652738765, 11.999999999999998]], "r_squared_": 0.9901355804407463, "error_": 0.03994206948513435}
{"freq_range": [2.0, 80.0], "freq_res": 1.0, "aperiodic_params_": [0.4160080970410768, 0.9675809853714148], "gaussian_params_": [[9.615759822284103, 0.7423838642239643, 1.176931731421886], [12.50018677427615, 0.9208004659720299, 0.3116075431526317], [14.002253276842433, 0.5447981666624994, 1.3210917647378315]], "peak_params_": [[9.615759822284103, 0.7093925916405751, 2.353863462843772], [12.50018677427615, 0.674837335598115, 0.6232150863052635], [14.002253276842433, 0.5455259729299738, 2.642183529475663]], "r_squared_": 0.9744810116640638, "error_": 0.0573645769308447}
{"freq_range": [2.0, 80.0], "freq_res": 1.0, "aperiodic_params_": [-0.309677676265762, 0.5725436428939045], "gaussian_params_": [[9.60957803800273, 0.7859225882931671, 0.5615210634003037], [13.762228014491093, 0.26953343767154164, 2.381580633612156], [32.88537245046058, 0.3318340206516872, 5.999999999999999], [48.45203459913595, 0.22954262759879487, 5.999999999999999]], "peak_params_": [[9.60957803800273, 0.6947944383069831, 1.1230421268006074], [13.762228014491093, 0.2705356255320601, 4.763161267224312], [32.88537245046058, 0.3401037984088233, 11.999999999999998], [48.45203459913595, 0.24278936081946179, 11.999999999999998]], "r_squared_": 0.914541144347414, "error_": 0.06439305680192003}
{"freq_range": [2.0, 80.0], "freq_res": 1.0, "aperiodic_params_": [0.6244245282269392, 1.0938991250905252], "gaussian_params_": [[9.522206782751779, 2.710090547930913, 0.2818211616580453], [12.901019658769597, 0.39229747140073173, 2.5215900174192685], [35.974619679512735, 0.2399818833869896, 5.999999999999999], [44.4359789425774, 0.5151412875113497, 0.26973900560034786], [53.54796540086405, 0.15070389153888614, 5.999999999999999]], "peak_params_": [[9.522206782751779, 0.8463434723447273, 0.5636423233160907], [12.901019658769597, 0.39215252600546896, 5.043180034838537], [35.974619679512735, 0.24207252245127986, 11.999999999999998], [44.4359789425774, 0.28011194370537273, 0.5394780112006957], [53.54796540086405, 0.15290911841525645, 11.999999999999998]], "r_squared_": 0.9750548684350719, "error_": 0.05488863740482542}
{"freq_range": [2.0, 80.0], "freq_res": 1.0, "aperiodic_params_": [0.940990898747762, 1.2944655954582844], "gaussian_params_": [[9.736269323744857, 1.059552223694674, 0.8473931824339479], [12.44213214629123, 1.192421232208845, 0.2889057255288524], [14.568434468344758, 0.40485885156810386, 1.7165831592146639], [35.16168591730388, 0.17229229466673154, 1.2689718658602593], [40.141750171540366, 0.15000445061333229, 0.8191499720702556], [46.11068643085708, 0.14667512918315126, 5.999999999999997], [50.94866190125975, 0.18451436442000377, 0.250001234627676]], "peak_params_": [[9.736269323744857, 1.0211899442011547, 1.6947863648678958], [12.44213214629123, 0.5317787828455297, 0.5778114510577048], [14.568434468344758, 0.3922642208882083, 3.4331663184293277], [35.16168591730388, 0.197307585087109, 2.5379437317205187], [40.141750171540366, 0.23521733799472255, 1.6382999441405113], [46.11068643085708, 0.14665017313697137, 11.999999999999995], [50.94866190125975, 0.2859001991784944, 0.500002469255352]], "r_squared_": 0.9874638324405689, "error_": 0.048704240771288786}
{"freq_range": [2.0, 80.0], "freq_res": 1.0, "aperiodic_params_": [0.9588443056373298, 1.3211299025623553], "gaussian_params_": [[7.647622633545227, 0.4263609431889977, 0.3305200908951726], [9.548803927172536, 1.5676149079769586, 0.4182652705313624], [11.681905625209458, 0.4413991044055005, 1.0255495417297387], [14.823373036330452, 0.4822688357952907, 1.671259583045348], [35.309575645789224, 0.19378255845547368, 1.044669393074725], [40.03664052791314, 0.1388501638871112, 0.8665570776666165], [46.25422899678546, 0.13349309555175837, 5.999999939126571], [50.98468986471268, 0.1335492133218263, 0.2500049003088072]], "peak_params_": [[7.647622633545227, 0.24399254152597233, 0.6610401817903452], [9.548803927172536, 0.9986151592413688, 0.8365305410627248], [11.681905625209458, 0.5364292875115935, 2.0510990834594773], [14.823373036330452, 0.48193680427365576, 3.342519166090696], [35.309575645789224, 0.20844470441775942, 2.08933878614945], [40.03664052791314, 0.21627318843099563, 1.733114155333233], [46.25422899678546, 0.13337331631397809, 11.999999878253142], [50.98468986471268, 0.2309343584272887, 0.5000098006176144]], "r_squared_": 0.9894661326220308, "error_": 0.04278907313443609}
{"freq_range": [2.0, 80.0], "freq_res": 1.0, "aperiodic_params_": [0.8122185607859738, 1.228331392511622], "gaussian_params_": [[7.548968545420625, 0.618204863706563, 0.3035351316887778], [9.63377120986299, 0.8764945363627269, 0.6536962616450113], [12.92041788549919, 0.5173874802662163, 1.7564978204666508], [15.808129294601562, 0.22916637890010857, 1.0653179449823176], [35.479431043164446, 0.416233880526436, 0.2923881499058049], [41.15446907626615, 0.125440805385176, 5.999999999999992], [52.160947526665055, 0.06879236375284643, 5.999999999995851]], "peak_params_": [[7.548968545420625, 0.25377167574586806, 0.6070702633775557], [9.63377120986299, 0.879071611955122, 1.3073925232900225], [12.92041788549919, 0.5239619311946575, 3.5129956409333016], [15.808129294601562, 0.33675606382715906, 2.130635889964635], [35.479431043164446, 0.18379578695311205, 0.5847762998116098], [41.15446907626615, 0.13759391173819835, 11.999999999999984], [52.160947526665055, 0.09325470489417365, 11.999999999991703]], "r_squared_": 0.9897370974480284, "error_": 0.03993999838087721}
{"freq_range": [2.0, 80.0], "freq_res": 1.0, "aperiodic_params_": [0.4259625018449978, 0.8729950397722629], "gaussian_params_": [[9.643337282378882, 0.8109492420993027, 0.862747384705309], [13.308024061358594, 0.6751976402582655, 1.5998625982798922]], "peak_params_": [[9.643337282378882, 0.8241559162824442, 1.725494769410618], [13.308024061358594, 0.6632174153124144, 3.1997251965597844]], "r_squared_": 0.9586643068790535, "error_": 0.06978027590131777}
{"freq_range": [2.0, 80.0], "freq_res": 1.0, "aperiodic_params_": [0.1771176242422106, 0.7860256942551648], "gaussian_params_": [[8.55893755877537, 1.6566828018624011, 0.28238608698533374], [10.273844238702107, 0.8918499473177667, 0.32325409106110276], [13.227473051680079, 0.7133004415835293, 1.6194090042506375], [35.45203459913595, 0.08650648695062012, 4.969231703872187], [47.54796540086405, 0.1453559117962512, 5.999999999999999]], "peak_params_": [[8.55893755877537, 0.5132167043636976, 0.5647721739706675], [10.273844238702107, 0.7208490528713427, 0.6465081821222055], [13.227473051680079, 0.7063012128706659, 3.238818008501275], [35.45203459913595, 0.10246879353931104, 9.938463407744374], [47.54796540086405, 0.14851222304579825, 11.999999999999998]], "r_squared_": 0.9657296908570296, "error_": 0.05436111023860824}
{"freq_range": [2.0, 80.0], "freq_res": 1.0, "aperiodic_params_": [0.5808562896990276, 1.0621353775209907], "gaussian_params_": [[9.632941130501035, 1.0317649867835714, 0.5841299525966276], [12.970842979550355, 0.5093568241514683, 2.240991332068068], [34.26045811888246, 0.19779653848992104, 5.999999999999999], [40.450842665214054, 0.17061225444825473, 0.8104874992869165], [44.94676662341591, 0.13373196036964688, 1.2911411709687395], [49.459164703512165, 0.483709783276376, 0.26640592838210847], [52.83947537415933, 0.1313798555892079, 5.999999999999973]], "peak_params_": [[9.632941130501035, 1.0585073514132335, 1.1682599051932552], [12.970842979550355, 0.5096851169141521, 4.481982664136136], [34.26045811888246, 0.19856012988345162, 11.999999999999998], [40.450842665214054, 0.2847274083500786, 1.620974998573833], [44.94676662341591, 0.2294298072023493, 2.582282341937479], [49.459164703512165, 0.22722880037808624, 0.5328118567642169], [52.83947537415933, 0.1328394694836703, 11.999999999999947]], "r_squared_": 0.9792890064898455, "error_": 0.052398818146213534}
{"freq_range": [2.0, 80.0], "freq_res": 1.0, "aperiodic_params_": [0.5416394176183763, 1.088119642516339], "gaussian_params_": [[9.685563864566637, 0.8534464044672748, 0.6379493613737195], [13.568904014678568, 0.5386422359417542, 2.380087005632289], [34.126193580008675, 0.23311855449826058, 5.999999999999822], [40.54474760653209, 0.24167809217605185, 0.6414669995444807], [45.36503577360796, 0.2170026536286107, 1.5866284581568069], [49.28625455602342, 0.1800430968345444, 0.6798849291208254], [50.68123304343056, 0.47592782612399037, 0.2500078597988623], [56.658681289382685, 0.12463221305212256, 5.474398558274188], [76.26092113927139, 0.3897373793207221, 0.25009416633494364]], "peak_params_": [[9.685563864566637, 0.9309071650502493, 1.275898722747439], [13.568904014678568, 0.53071878930813, 4.760174011264578], [34.126193580008675, 0.23309074401380925, 11.999999999999645], [40.54474760653209, 0.31583010703326375, 1.2829339990889614], [45.36503577360796, 0.2693599180835706, 3.1732569163136137], [49.28625455602342, 0.2381363133938983, 1.3597698582416509], [50.68123304343056, 0.29654309768579745, 0.5000157195977246], [56.658681289382685, 0.12455300082777243, 10.948797116548375], [76.26092113927139, 0.2264031140442726, 0.5001883326698873]], "r_squared_": 0.9828729413364135, "error_": 0.045889011997053177}
{"freq_range": [2.0, 80.0], "freq_res": 1.0, "aperiodic_params_": [0.4119101857304613, 0.9584728997496103], "gaussian_params_": [[9.69661255142366, 0.719791687967766, 0.6703695043813236], [13.515906054285194, 0.5157169340294707, 1.8489789489058381], [34.91614467312085, 0.1911831793836324, 5.999999999999999], [40.52364751985204, 0.6367451933355904, 0.28071623205697654], [44.92810869120394, 0.14578550538559687, 0.7821143815351167], [53.54796540086405, 0.14894888098379017, 5.999999999999999]], "peak_params_": [[9.69661255142366, 0.7343364593519853, 1.3407390087626472], [13.515906054285194, 0.49877984111760454, 3.6979578978116763], [34.91614467312085, 0.19241739534426894, 11.999999999999998], [40.52364751985204, 0.28195927257957554, 0.5614324641139531], [44.92810869120394, 0.24572937598493771, 1.5642287630702334], [53.54796540086405, 0.14974206181768457, 11.999999999999998]], "r_squared_": 0.9763423418316022, "error_": 0.04533015704025089}
{"freq_range": [2.0, 80.0], "freq_res": 1.0, "aperiodic_params_": [-0.5651337134582908, 0.48970325460126507], "gaussian_params_": [[9.471400339690453, 0.9799547198767037, 0.26062579693266125], [13.77004842570981, 0.3126101115592397, 2.080038435428263], [24.25914227091178, 0.1563597146871782, 2.9858869377832664], [27.520783677625378, 0.698867397990247, 0.26319998970441527], [35.48936955962999, 0.33049032233037745, 5.999999999999999], [44.41553933129556, 0.5781256501646285, 0.25444131523163693], [49.38797046234112, 0.16192763868355706, 5.999999999999999], [50.605858013740345, 0.42681432088603627, 0.25009999625741586]], "peak_params_": [[9.471400339690453, 0.21346611520060677, 0.5212515938653225], [13.77004842570981, 0.3116744562699445, 4.160076870856526], [24.25914227091178, 0.2086292477266709, 5.971773875566533], [27.520783677625378, 0.35646928619836893, 0.5263999794088305], [35.48936955962999, 0.33876873162749566, 11.999999999999998], [44.41553933129556, 0.3814067886945348, 0.5088826304632739], [49.38797046234112, 0.1877784694382829, 11.999999999999998], [50.605858013740345, 0.29117537509127267, 0.5001999925148317]], "r_squared_": 0.9284426638291883, "error_": 0.04682874429255889}
{"freq_range": [2.0, 80.0], "freq_res": 1.0, "aperiodic_params_": [-0.2852381975283968, 0.7543443793211668], "gaussian_params_": [[9.857406806681295, 0.4715487069030304, 0.571466624245433], [13.428746389134238, 0.3590215711776792, 1.3142367486734712], [35.442410300539194, 0.286101586394167, 5.999999999999999], [44.461745711028385, 0.20781162485027058, 0.5647533736939145], [50.58089901597071, 0.5883113732826547, 0.2500017259558686], [51.02284126760896, 0.14132451403524735, 5.999999999999999]], "peak_params_": [[9.857406806681295, 0.4690738285340603, 1.142933248490866], [13.428746389134238, 0.3406783630154272, 2.6284734973469424], [35.442410300539194, 0.28932109727878075, 11.999999999999998], [44.461745711028385, 0.3234734032726889, 1.129506747387829], [50.58089901597071, 0.2955761494502991, 0.5000034519117372], [51.02284126760896, 0.2955761494502991, 11.999999999999998]], "r_squared_": 0.9583329768488503, "error_": 0.048272488734003534}
{"freq_range": [2.0, 80.0], "freq_res": 1.0, "aperiodic_params_": [-0.3372685889864915, 0.7088418283361138], "gaussian_params_": [[9.79634785745161, 0.546946201961583, 0.6912388306536873], [13.30539938127113, 0.40298312959825555, 1.0647436762812588], [15.379201520669602, 0.30610509181746026, 0.35276853513922546], [25.268695183016955, 0.21604668408330766, 1.4380482650039172], [27.8529276379842, 0.26531454518376446, 0.7053530394567081], [31.113344109155417, 0.20820904503610624, 0.6677447454228156], [35.287081453798216, 0.3266787543179644, 2.701153847835294], [40.76070695505762, 0.2919781214011494, 1.4494526658015352], [44.34159169601142, 0.38262689037132086, 0.788384821129504], [46.51472631577979, 0.38619406234214665, 0.4169991066350728], [48.53484125712317, 0.5562983355317072, 0.3213199961276034], [50.824453619176246, 0.3080182748963974, 0.7613044901858906], [71.01486686208123, 0.1533935638843973, 0.25000000013079865]], "peak_params_": [[9.79634785745161, 0.5269714492700451, 1.3824776613073746], [13.30539938127113, 0.3867544091756552, 2.1294873525625175], [15.379201520669602, 0.28534005216918024, 0.7055370702784509], [25.268695183016955, 0.21261402047103584, 2.8760965300078345], [27.8529276379842, 0.3037787687872153, 1.4107060789134163], [31.113344109155417, 0.2980314716992236, 1.3354894908456312], [35.287081453798216, 0.32494741062863386, 5.402307695670588], [40.76070695505762, 0.3229705132621157, 2.8989053316030704], [44.34159169601142, 0.3741762623796876, 1.576769642259008], [46.51472631577979, 0.19757576811185484, 0.8339982132701456], [48.53484125712317, 0.21252767575588072, 0.6426399922552068], [50.824453619176246, 0.29993750753618054, 1.5226089803717813], [71.01486686208123, 0.1531225747681304, 0.5000000002615973]], "r_squared_": 0.9636162326923181, "error_": 0.038815094544517224}
{"freq_range": [2.0, 80.0], "freq_res": 1.0, "aperiodic_params_": [-0.24359902916045353, 0.8137238079244348], "gaussian_params_": [[9.90295443568115, 0.5622685479022865, 0.6162433743321885], [13.151974449129701, 0.41674594423927047, 1.0612492905367252], [14.98426123727831, 0.12799287392933853, 0.7576423503723043], [27.051604964811407, 0.21207278088588027, 1.7286315498971343], [31.420632440945823, 0.9302097373210803, 0.25004002350524435], [35.05752457344625, 0.2963027209215218, 1.8957944939718343], [40.26092975447015, 0.2763214245609744, 1.3430683118874738], [44.586040177664366, 0.24899047804402313, 0.854806234033846], [49.93028176601109, 0.13072610831287187, 5.999999999999999], [50.61407190347221, 0.47759155723683683, 0.2550933192891419]], "peak_params_": [[9.90295443568115, 0.5604019782502323, 1.232486748664377], [13.151974449129701, 0.4166435696813382, 2.1224985810734505], [14.98426123727831, 0.21946129217257793, 1.5152847007446086], [27.051604964811407, 0.2121017799385423, 3.4572630997942686], [31.420632440945823, 0.272483325044627, 0.5000800470104887], [35.05752457344625, 0.30221308963899585, 3.7915889879436686], [40.26092975447015, 0.3142919849985968, 2.6861366237749476], [44.586040177664366, 0.31525760077386256, 1.709612468067692], [49.93028176601109, 0.1570640004870969, 11.999999999999998], [50.61407190347221, 0.28073445450849266, 0.5101866385782838]], "r_squared_": 0.9715850522633427, "error_": 0.037983693219256896}
