{"freq_range": [2.0, 80.0], "freq_res": 1.0, "aperiodic_params_": [1.1615496091420288, 1.6786285147156412], "gaussian_params_": [[7.299279631650578, 0.3419141798935365, 1.5226573750843329], [10.193707407734719, 1.1497873600765143, 0.7538126274813988], [18.240438651083323, 0.2990108760806277, 5.500369928982849], [19.61618941563394, 0.807571905116552, 0.30040993133638877], [21.349049716696037, 0.2068583165060024, 2.249487681041306], [27.470519830727344, 0.6424139719535146, 0.28391065259395276], [67.65631194225614, 0.3809962479958463, 0.3161602918948104], [72.3598909630176, 0.3472078115678817, 1.1444479174022335], [77.86432245072861, 0.2535290761342578, 1.304872409534792]], "peak_params_": [[7.299279631650578, 0.3725724715263616, 3.0453147501686657], [10.193707407734719, 1.2807096154635396, 1.5076252549627975], [18.240438651083323, 0.3670157358087538, 11.000739857965698], [19.61618941563394, 0.8139569076926273, 0.6008198626727775], [21.349049716696037, 0.46805385755533657, 4.498975362082612], [27.470519830727344, 0.2556547345133513, 0.5678213051879055], [67.65631194225614, 0.21126013746419425, 0.6323205837896207], [72.3598909630176, 0.33046816361913, 2.288895834804467], [77.86432245072861, 0.2521641257132474, 2.609744819069584]], "r_squared_": 0.9898076050867896, "error_": 0.05528945548707197}
{"freq_range": [2.0, 80.0], "freq_res": 1.0, "aperiodic_params_": [1.211295415055017, 1.7650220593031554], "gaussian_params_": [[5.92986107496622, 0.17506775103034547, 0.9609877573036342], [8.134758978430302, 0.40655006137184274, 1.2632048550278567], [10.255047836731789, 1.1452736859044022, 0.6855568898581799], [13.509977817709254, 0.2880720167994359, 2.569832808661439], [19.740493285150432, 0.6488916180125622, 1.912082944062555], [25.45843663374077, 0.2688585120800064, 2.5771717459742707], [60.470436998760775, 0.7938967219611769, 0.2994676854067689], [71.32721036785277, 0.23168068753695, 2.7290077675108377], [78.26020294477641, 0.1649364003129353, 1.4465838767803525]], "peak_params_": [[5.92986107496622, 0.27611788321670605, 1.9219755146072683], [8.134758978430302, 0.45548778514253646, 2.5264097100557135], [10.255047836731789, 1.3187341546086928, 1.3711137797163597], [13.509977817709254, 0.2900654358610606, 5.139665617322878], [19.740493285150432, 0.6833532672491902, 3.82416588812511], [25.45843663374077, 0.27941520922315877, 5.154343491948541], [60.470436998760775, 0.23119351030553736, 0.5989353708135378], [71.32721036785277, 0.23002187208566216, 5.4580155350216755], [78.26020294477641, 0.17394795296183196, 2.893167753560705]], "r_squared_": 0.9911823723553266, "error_": 0.05556109590169847}
{"freq_range": [2.0, 80.0], "freq_res": 1.0, "aperiodic_params_": [1.2340986594215602, 1.7078051770318603], "gaussian_params_": [[7.333438800833102, 0.3158754050267348, 1.2419690932245397], [10.201504545002098, 1.1052890993544462, 0.7913453654033382], [20.510648328251477, 0.5066214410492236, 4.526306025190876], [74.54796540086404, 0.15120622747774473, 5.999999999999979]], "peak_params_": [[7.333438800833102, 0.31089053728305005, 2.4839381864490795], [10.201504545002098, 1.1357249875562134, 1.5826907308066764], [20.510648328251477, 0.5036692839529986, 9.052612050381752], [74.54796540086404, 0.1507777140647093, 11.999999999999957]], "r_squared_": 0.9846299359978392, "error_": 0.06837792672208194}
{"freq_range": [2.0, 80.0], "freq_res": 1.0, "aperiodic_params_": [1.3771996567084108, 1.71766458934666], "gaussian_params_": [[6.533960622040938, 0.288706791241894, 1.0707372294744], [7.674939058822662, 0.3610757684415374, 0.2957074738466051], [10.156367054831943, 1.1210928559487858, 0.8819294200278834], [13.736329250567294, 0.23202753145238256, 0.7214593612217507], [19.79139155959658, 0.3345735967171702, 0.4881907295249119], [20.433300607215575, 0.447337382821524, 3.4627584617550142], [27.485752604089317, 1.1802208344692762, 0.25134900625315537], [55.85402543625425, 0.1943430951594018, 0.5598082513872382], [72.3417608065058, 0.31360734000260143, 0.9578576439044513], [77.8156260354154, 0.16737616932546703, 1.4429655119796538]], "peak_params_": [[6.533960622040938, 0.29140115087832924, 2.1414744589488], [7.674939058822662, 0.36754592433462585, 0.5914149476932102], [10.156367054831943, 1.1099200847973625, 1.7638588400557669], [13.736329250567294, 0.29676098645362625, 1.4429187224435014], [19.79139155959658, 0.7492298926318433, 0.9763814590498238], [20.433300607215575, 0.7492298926318433, 6.9255169235100285], [27.485752604089317, 0.25644993225041457, 0.5026980125063107], [55.85402543625425, 0.18784698512531017, 1.1196165027744764], [72.3417608065058, 0.2943173283712932, 1.9157152878089025], [77.8156260354154, 0.16601542394671842, 2.8859310239593077]], "r_squared_": 0.9905308265137074, "error_": 0.05474337686496848}
{"freq_range": [2.0, 80.0], "freq_res": 1.0, "aperiodic_params_": [1.3186632352387242, 1.734570331652192], "gaussian_params_": [[7.69643493310436, 0.3767279386413362, 1.6267895194159354], [10.254209298141213, 1.0401736143092035, 0.6873727884617955], [13.514835097831918, 0.21987781284074293, 2.779730492568852], [19.79728143058937, 0.6051481083976443, 1.9233900610079295], [25.773734701575112, 0.2957681951530767, 2.332464449582126], [69.61065074354408, 0.15142387999172652, 5.999999999999999], [77.03950255914091, 0.21201765353132965, 0.25009051808705546], [79.23776372044145, 0.27589051652961094, 0.25519946254287235]], "peak_params_": [[7.69643493310436, 0.40575523798604834, 3.253579038831871], [10.254209298141213, 1.208510988979435, 1.374745576923591], [13.514835097831918, 0.2232058129136113, 5.559460985137704], [19.79728143058937, 0.6300750994355819, 3.846780122015859], [25.773734701575112, 0.29772747046341297, 4.664928899164252], [69.61065074354408, 0.1511053990423521, 11.999999999999998], [77.03950255914091, 0.28032079418042355, 0.5001810361741109], [79.23776372044145, 0.22325743834089407, 0.5103989250857447]], "r_squared_": 0.9884240777146528, "error_": 0.060659324735136785}
{"freq_range": [2.0, 80.0], "freq_res": 1.0, "aperiodic_params_": [1.1179200590092544, 1.6510426417100676], "gaussian_params_": [[7.500483690660738, 0.35320266264749584, 1.3156054735563463], [10.210407226918516, 1.1464952584255539, 0.7603234742690559], [19.101922043642613, 0.36116711189234957, 4.911738738240599], [19.922145762991953, 0.32869402378207807, 0.5620377168621321], [26.44482475094249, 0.13173367295418956, 2.0422346084826977], [72.57101149011042, 0.16258936007151692, 5.999999989817783]], "peak_params_": [[7.500483690660738, 0.37346812255926, 2.6312109471126925], [10.210407226918516, 1.2263972478545704, 1.5206469485381118], [19.101922043642613, 0.4468148148581109, 9.823477476481198], [19.922145762991953, 0.6816417200355509, 1.1240754337242642], [26.44482475094249, 0.2633606284742268, 4.084469216965395], [72.57101149011042, 0.16217431425619133, 11.999999979635566]], "r_squared_": 0.9902060053218067, "error_": 0.05584582609682033}
{"freq_range": [2.0, 80.0], "freq_res": 1.0, "aperiodic_params_": [1.2181621423941724, 1.6543337517918553], "gaussian_params_": [[7.136732078467212, 0.29210524952173555, 1.1862777518395373], [10.202626233919272, 1.0114002846888273, 0.8530266957664223], [13.906431697478784, 0.2820154807089976, 1.1132754160209903], [17.89923281238433, 0.36582726522702624, 1.1832054623715371], [20.24537071790262, 0.741886209222367, 0.681417683002604], [22.381603954471114, 0.544020020104379, 0.6463128985082578], [24.47817665805951, 0.9015293667352727, 0.3109975521024682], [27.339724434068224, 0.20433530185354185, 1.6657960288914029], [33.969111616856964, 0.16131656214053422, 0.2500000000000003], [56.22157300931478, 0.19713540300272903, 0.4198034826839409], [60.603829672352525, 0.5009047760403224, 0.302779602918498], [67.6252272170919, 0.3554002956548487, 0.2954522313910542], [71.63416587556328, 0.5971069459162974, 0.3175183047389326], [73.60960115070115, 0.3310986219816209, 0.4329560679091775], [79.54737240102818, 0.1714853297281867, 2.3546254424930195]], "peak_params_": [[7.136732078467212, 0.29105051983250285, 2.3725555036790746], [10.202626233919272, 0.9997301358786677, 1.7060533915328446], [13.906431697478784, 0.2826747763407728, 2.2265508320419807], [17.89923281238433, 0.36808486608365604, 2.3664109247430742], [20.24537071790262, 0.7715790592216495, 1.362835366005208], [22.381603954471114, 0.4860495493213475, 1.2926257970165156], [24.47817665805951, 0.32750327292854275, 0.6219951042049364], [27.339724434068224, 0.2001298238961885, 3.3315920577828058], [33.969111616856964, 0.16015898941734608, 0.5000000000000006], [56.22157300931478, 0.17150346633654356, 0.8396069653678818], [60.603829672352525, 0.21281056792786712, 0.605559205836996], [67.6252272170919, 0.15897405807028053, 0.5909044627821084], [71.63416587556328, 0.30879965830400913, 0.6350366094778652], [73.60960115070115, 0.23118550491264367, 0.865912135818355], [79.54737240102818, 0.16834605346663523, 4.709250884986039]], "r_squared_": 0.9921602850715632, "error_": 0.038478744544783124}
{"freq_range": [2.0, 80.0], "freq_res": 1.0, "aperiodic_params_": [1.3941606576682473, 1.7745786543257454], "gaussian_params_": [[7.223279541797737, 0.32057798021256945, 1.1867258701572596], [10.257557697060149, 1.0249746489060576, 0.8580801815145224], [13.887245454578462, 0.2746215618982497, 0.81683933915765], [20.15781617132578, 0.6377305921894891, 2.5099339423934803], [26.560258379022798, 0.2385108535238034, 2.766007423383012], [72.08573167556254, 0.2808712487724401, 0.4993311654194906], [76.62127268334524, 0.14737475615499254, 4.822807652164609]], "peak_params_": [[7.223279541797737, 0.3157150393292755, 2.373451740314519], [10.257557697060149, 1.000762096790677, 1.7161603630290447], [13.887245454578462, 0.303551016236875, 1.6336786783153], [20.15781617132578, 0.650793726964446, 5.019867884786961], [26.560258379022798, 0.2510377610845752, 5.532014846766024], [72.08573167556254, 0.36988219680487067, 0.9986623308389811], [76.62127268334524, 0.14692104744868972, 9.645615304329217]], "r_squared_": 0.9895351391199834, "error_": 0.05884987779149019}
{"freq_range": [2.0, 80.0], "freq_res": 1.0, "aperiodic_params_": [1.5157128285178172, 1.808677930527326], "gaussian_params_": [[7.320672082394089, 0.31742775722592576, 1.319966723548408], [10.290381604221261, 0.9931009624915869, 0.8473020627585294], [13.843241250521027, 0.28540551682413984, 0.7394099815329606], [19.911361353711563, 0.6648506041217491, 2.260048322025241], [26.28157356670692, 0.2528277075913287, 2.830594624332054], [72.11483784587476, 0.35565961182157557, 0.6173382760544308]], "peak_params_": [[7.320672082394089, 0.3087250405027303, 2.639933447096816], [10.290381604221261, 0.9769560560887515, 1.6946041255170587], [13.843241250521027, 0.3008875542320399, 1.4788199630659211], [19.911361353711563, 0.6858888723448304, 4.520096644050482], [26.28157356670692, 0.26922860654162717, 5.661189248664108], [72.11483784587476, 0.34955895524582403, 1.2346765521088616]], "r_squared_": 0.989328071004113, "error_": 0.06469250016918018}
{"freq_range": [2.0, 80.0], "freq_res": 1.0, "aperiodic_params_": [1.564775922568095, 1.8260497345771096], "gaussian_params_": [[5.886357252061158, 0.2712396125833863, 0.8860250977201601], [7.542568234723051, 0.7230093669220893, 0.3323246955841729], [10.184741299722239, 1.05731703858886, 0.9781519755068971], [13.893732644332713, 0.23636406763010234, 0.9001419759425765], [19.856706165797252, 0.6773704802803922, 2.2748222200749226], [26.34812691414071, 0.2797961817727621, 2.5376325361499816], [72.2323843231053, 0.3170515049865904, 1.1164888757947802]], "peak_params_": [[5.886357252061158, 0.2691449805749547, 1.7720501954403203], [7.542568234723051, 0.38341205227270947, 0.6646493911683458], [10.184741299722239, 1.0387092806727691, 1.9563039510137943], [13.893732644332713, 0.25988089755142557, 1.800283951885153], [19.856706165797252, 0.6882724172605584, 4.549644440149845], [26.34812691414071, 0.29484279749154085, 5.075265072299963], [72.2323843231053, 0.3102577547024996, 2.2329777515895604]], "r_squared_": 0.9906082643310716, "error_": 0.06161779446537374}
{"freq_range": [2.0, 80.0], "freq_res": 1.0, "aperiodic_params_": [1.5451319269998196, 1.8223006909771067], "gaussian_params_": [[5.931235927260969, 0.31555189841893294, 0.927704069499251], [7.5502278743041416, 0.8448863321516211, 0.3151861696950774], [10.155424392992, 1.087320778837485, 0.9957554445099683], [20.259084458437112, 0.6101083173616937, 3.891023819848021], [27.215768927921197, 0.2315184974907367, 0.7097437701714592], [72.19961005330006, 0.31864243440347817, 1.0751879449016328], [77.41773270129717, 0.5978832035699179, 0.30503349807930685]], "peak_params_": [[5.931235927260969, 0.31561076909043567, 1.855408138998502], [7.5502278743041416, 0.44019003363510234, 0.6303723393901548], [10.155424392992, 1.0930511181962628, 1.9915108890199367], [20.259084458437112, 0.6087573320924395, 7.782047639696042], [27.215768927921197, 0.3571080818559469, 1.4194875403429184], [72.19961005330006, 0.3131982491438676, 2.1503758898032657], [77.41773270129717, 0.23409853300175132, 0.6100669961586137]], "r_squared_": 0.9912345696806266, "error_": 0.06080487696245843}
{"freq_range": [2.0, 80.0], "freq_res": 1.0, "aperiodic_params_": [1.5514582028911261, 1.8564559443230957], "gaussian_params_": [[7.17297191157725, 0.3974768438533, 1.3465361500916686], [10.26512943137456, 1.073031399594405, 0.9289316857984407], [19.82667947785834, 0.6437097010976611, 3.3398895135729387], [27.091943022731105, 0.25700433468511885, 1.8835413134997778], [72.22604313335351, 0.3669143645867991, 1.0528147012134292], [77.17058823834546, 0.18612973954374898, 1.265701284258255]], "peak_params_": [[7.17297191157725, 0.39684203204778556, 2.693072300183337], [10.26512943137456, 1.0825646038664725, 1.8578633715968813], [19.82667947785834, 0.6430580532533519, 6.6797790271458775], [27.091943022731105, 0.3208202243262551, 3.7670826269995557], [72.22604313335351, 0.35859839102132285, 2.1056294024268585], [77.17058823834546, 0.1844594496561316, 2.53140256851651]], "r_squared_": 0.9897775292204363, "error_": 0.06379964755628847}
{"freq_range": [2.0, 80.0], "freq_res": 1.0, "aperiodic_params_": [1.4008813432824536, 1.6991260701739193], "gaussian_params_": [[7.193622179517373, 0.3587556962550898, 1.2141910613718174], [10.241352143272605, 1.063922525891506, 0.8686433599814366], [19.829150165982117, 0.5399749264801429, 2.814028813797087], [26.556998037707228, 0.22547025250659508, 1.951022243003313], [72.21172859134114, 0.2693749202873554, 1.2195667657791658]], "peak_params_": [[7.193622179517373, 0.35524732253631797, 2.428382122743635], [10.241352143272605, 1.0496658810306265, 1.7372867199628732], [19.829150165982117, 0.5397757174556501, 5.628057627594174], [26.556998037707228, 0.2407366733095867, 3.902044486006626], [72.21172859134114, 0.26534583293058933, 2.4391335315583316]], "r_squared_": 0.9903848405467711, "error_": 0.05641566246881034}
{"freq_range": [2.0, 80.0], "freq_res": 1.0, "aperiodic_params_": [1.236421928388954, 1.6777436061828996], "gaussian_params_": [[7.597814685693781, 0.3147019244633075, 1.4523324643035553], [10.214198230178408, 0.9598829238446017, 0.7059438086582663], [12.527875462913427, 0.2013000008385756, 2.271558381368081], [19.091806313547483, 0.4863125351243561, 1.8871899868647073], [24.9756967335409, 0.31336596723018195, 3.2426691352577577], [67.9616526732607, 0.07170943893948953, 0.25005550850445685], [71.76558688820779, 0.17644332118024436, 5.999999999999999]], "peak_params_": [[7.597814685693781, 0.3374888231118582, 2.9046649286071107], [10.214198230178408, 1.105222133613275, 1.4118876173165327], [12.527875462913427, 0.20070746873433293, 4.543116762736162], [19.091806313547483, 0.5465737181213718, 3.7743799737294146], [24.9756967335409, 0.31697646071810004, 6.485338270515515], [67.9616526732607, 0.21577351966208758, 0.5001110170089137], [71.76558688820779, 0.17630871319806052, 11.999999999999998]], "r_squared_": 0.9891047476438393, "error_": 0.05933523321705065}
{"freq_range": [2.0, 80.0], "freq_res": 1.0, "aperiodic_params_": [1.0578478753082121, 1.5626509838581149], "gaussian_params_": [[7.42027592365434, 0.2815917700035971, 1.1178414096912084], [10.206187350321404, 1.0993626440005697, 0.8269420318481903], [19.550489623291956, 0.4384238285508218, 2.192625128212907], [23.52585019056983, 0.6178046333951173, 0.2975542597550665], [26.3223546812925, 0.19372107747466175, 0.9359483578711506], [72.79617841770865, 0.1298630689466766, 5.9999959593008905], [77.02596309329515, 0.11227976161392635, 0.732945325348738]], "peak_params_": [[7.42027592365434, 0.2629750241149731, 2.2356828193824168], [10.206187350321404, 1.0853880958948319, 1.6538840636963805], [19.550489623291956, 0.4293066689720738, 4.385250256425814], [23.52585019056983, 0.23841745477985965, 0.595108519510133], [26.3223546812925, 0.18836104151915345, 1.8718967157423012], [72.79617841770865, 0.12978819236780859, 11.999991918601781], [77.02596309329515, 0.2138083911924451, 1.465890650697476]], "r_squared_": 0.9884397448837691, "error_": 0.05517407651386704}
{"freq_range": [2.0, 80.0], "freq_res": 1.0, "aperiodic_params_": [1.1049113152192926, 1.6589909263800768], "gaussian_params_": [[7.123517781847662, 0.2851278271526367, 1.4693017482948754], [10.28396049408301, 0.9957252948659032, 0.8741338508524337], [13.694876507323194, 0.2893783969326024, 0.6329390152530452], [20.458891444157107, 0.5281767643956281, 3.7060311143953015], [72.0358737745136, 0.11410113960506851, 0.2500359344422682], [74.28420000373747, 0.16602649096826727, 5.999999999999999]], "peak_params_": [[7.123517781847662, 0.28570252181665706, 2.9386034965897507], [10.28396049408301, 0.996352589614062, 1.7482677017048673], [13.694876507323194, 0.373427373110081, 1.2658780305060904], [20.458891444157107, 0.5241432139198074, 7.412062228790603], [72.0358737745136, 0.2673535454945868, 0.5000718688845364], [74.28420000373747, 0.1658403467814178, 11.999999999999998]], "r_squared_": 0.9893568646659264, "error_": 0.054719020690244306}
{"freq_range": [2.0, 80.0], "freq_res": 1.0, "aperiodic_params_": [1.3416538276488044, 1.7606646795526386], "gaussian_params_": [[7.381443090520046, 0.3422604589535821, 1.4002835991213638], [10.368382305627943, 0.9280566290348223, 0.8646572047264531], [13.623108356049535, 0.34701762340178444, 0.6033058400391136], [20.159470678951585, 0.6419046302616601, 2.761805071853093], [27.125364935147118, 0.24535600748751524, 2.057343792100286], [60.551455252116625, 0.9568011830208033, 0.25555649472632835], [72.42580233443726, 0.9090613886648334, 0.2550328584327069], [75.24272249121351, 0.16246162190994612, 5.999999999999999]], "peak_params_": [[7.381443090520046, 0.33027220718191985, 2.8005671982427276], [10.368382305627943, 0.9078439907152007, 1.7293144094529063], [13.623108356049535, 0.3390241428413222, 1.2066116800782272], [20.159470678951585, 0.6414451390635738, 5.523610143706186], [27.125364935147118, 0.2747779271433479, 4.114687584200572], [60.551455252116625, 0.2147653950373325, 0.5111129894526567], [72.42580233443726, 0.36595690661967617, 0.5100657168654138], [75.24272249121351, 0.16232874159133548, 11.999999999999998]], "r_squared_": 0.9897708772009951, "error_": 0.05617576221633415}
{"freq_range": [2.0, 80.0], "freq_res": 1.0, "aperiodic_params_": [1.472681049463929, 1.8056100678766727], "gaussian_params_": [[9.923920566779572, 0.7707874701203304, 1.8183157106740522], [14.243700930328096, 0.30537263282319393, 0.4311557756674208], [20.04827545945276, 0.6964159488410603, 2.411394919026416], [26.652386334579386, 0.294499230422226, 2.489980676743335], [72.48962633195589, 0.28711934830629743, 1.3510870943638136]], "peak_params_": [[9.923920566779572, 0.7702312092477733, 3.6366314213481044], [14.243700930328096, 0.3527458945829442, 0.8623115513348416], [20.04827545945276, 0.7045776693493592, 4.822789838052832], [26.652386334579386, 0.30256222163733404, 4.97996135348667], [72.48962633195589, 0.26887138535877875, 2.702174188727627]], "r_squared_": 0.986420942568856, "error_": 0.0712764900051595}
{"freq_range": [2.0, 80.0], "freq_res": 1.0, "aperiodic_params_": [1.5856708592692446, 1.842535595458404], "gaussian_params_": [[6.973252585311466, 0.3773411591189452, 1.4025648998838973], [10.308144587717486, 0.954051627847415, 1.0472444507753063], [20.06644431603508, 0.6560262252551925, 3.0635404208319543], [26.89079101465442, 0.2966027789038865, 1.8359035294690058], [72.25661322740177, 0.45038344641183914, 0.5577578625212032]], "peak_params_": [[6.973252585311466, 0.3838433808713809, 2.8051297997677946], [10.308144587717486, 0.9533684900461334, 2.0944889015506125], [20.06644431603508, 0.6561308155904363, 6.127080841663909], [26.89079101465442, 0.34673419765239244, 3.6718070589380116], [72.25661322740177, 0.4051520902549788, 1.1155157250424064]], "r_squared_": 0.9895943417489524, "error_": 0.06202974372816385}
{"freq_range": [2.0, 80.0], "freq_res": 1.0, "aperiodic_params_": [1.656985985458631, 1.8696605142252078], "gaussian_params_": [[7.069824582259738, 0.3962089303667998, 1.3871324131146592], [10.306499526374544, 0.9796941328699608, 1.0288192544495387], [19.894712555911912, 0.6210360296410325, 3.0955028167160603], [26.646389498698547, 0.34270473050785794, 2.1870774328496787], [72.13731027560203, 0.37380981939131674, 0.5794418480491432]], "peak_params_": [[7.069824582259738, 0.4014130469942831, 2.7742648262293184], [10.306499526374544, 0.9834791315481348, 2.0576385088990774], [19.894712555911912, 0.6240617224438142, 6.191005633432121], [26.646389498698547, 0.3828242770519903, 4.374154865699357], [72.13731027560203, 0.36346019912524485, 1.1588836960982865]], "r_squared_": 0.9902740706700712, "error_": 0.06250816364153801}
{"freq_range": [2.0, 80.0], "freq_res": 1.0, "aperiodic_params_": [1.4898268171035445, 1.7872137049461538], "gaussian_params_": [[9.768521856342574, 0.8344157427998645, 1.9925362259485493], [19.21659298100646, 0.5904580990392, 2.464630294853779], [25.497191541697344, 0.33403475111728753, 3.0580457253433577], [72.2473851965719, 0.36014839544243465, 0.819018203246013]], "peak_params_": [[9.768521856342574, 0.8293476160129658, 3.9850724518970986], [19.21659298100646, 0.6231617384280983, 4.929260589707558], [25.497191541697344, 0.36727593043396956, 6.1160914506867154], [72.2473851965719, 0.34408846116505587, 1.638036406492026]], "r_squared_": 0.9877393192358521, "error_": 0.06699803103275773}
{"freq_range": [2.0, 80.0], "freq_res": 1.0, "aperiodic_params_": [1.3383414918910945, 1.7361948154095355], "gaussian_params_": [[9.781538972236916, 0.8357098884817101, 1.6928775624616843], [20.36508128111108, 0.562080550750193, 4.457110906153221], [72.29308561337274, 0.36838350210397386, 0.9637094818360801], [77.13518681631926, 0.2621261221797575, 0.44724177827340883]], "peak_params_": [[9.781538972236916, 0.8664038487367048, 3.3857551249233686], [20.36508128111108, 0.560198158140592, 8.914221812306442], [72.29308561337274, 0.3517354435837048, 1.9274189636721601], [77.13518681631926, 0.250423267890004, 0.8944835565468177]], "r_squared_": 0.9861808137725294, "error_": 0.07008476064035087}
{"freq_range": [2.0, 80.0], "freq_res": 1.0, "aperiodic_params_": [1.0292251475376748, 1.5106255907238084], "gaussian_params_": [[9.128928820651765, 0.44202819037106067, 2.080662074954379], [10.440071577120902, 1.5268864750403353, 0.31878432498878956], [16.03359953736239, 0.1757368155999951, 3.11943010798678], [19.59578481971906, 0.45127743695048306, 1.3266944512369816], [24.628015934304276, 0.23673403799178142, 2.5720986514996182], [70.43004699833608, 0.12288129107169654, 5.999999999999999]], "peak_params_": [[9.128928820651765, 0.45506904454108454, 4.161324149908758], [10.440071577120902, 1.020841565362467, 0.6375686499775791], [16.03359953736239, 0.18993628184086864, 6.23886021597356], [19.59578481971906, 0.5560230762251452, 2.653388902473963], [24.628015934304276, 0.23720726405087922, 5.1441973029992365], [70.43004699833608, 0.12256606112977231, 11.999999999999998]], "r_squared_": 0.992635968119197, "error_": 0.04340462961736975}
{"freq_range": [2.0, 80.0], "freq_res": 1.0, "aperiodic_params_": [0.9442769667118799, 1.630552838532418], "gaussian_params_": [[9.736799722104921, 0.46558545231660814, 2.5111101526619257], [10.253318991602182, 0.7187456040985389, 0.5367553410943676], [19.214457082497205, 0.42954898096123784, 2.659299414022967], [20.310689487482385, 0.37391987113468406, 0.32731267759147237], [26.24529389310487, 0.15322031837236322, 2.4335088283618753], [67.58859854377295, 0.2596225561957474, 0.2538577664888841], [73.42979389632683, 0.1541318551097738, 5.999999999999999]], "peak_params_": [[9.736799722104921, 1.10709434057316, 5.022220305323851], [10.253318991602182, 1.10709434057316, 1.0735106821887352], [19.214457082497205, 0.43061582181204283, 5.318598828045934], [20.310689487482385, 0.6553130962841104, 0.6546253551829447], [26.24529389310487, 0.16900958669077415, 4.867017656723751], [67.58859854377295, 0.17217240948390966, 0.5077155329777682], [73.42979389632683, 0.15373692212843548, 11.999999999999998]], "r_squared_": 0.9900221743333718, "error_": 0.0572654682569877}
{"freq_range": [2.0, 80.0], "freq_res": 1.0, "aperiodic_params_": [0.9632669993384088, 1.6853747346546326], "gaussian_params_": [[7.439247872678796, 0.30769811098775296, 1.740496172561278], [10.38127429793949, 0.956119429874538, 0.8417351231206746], [13.754852245707745, 0.4146369232829061, 1.1303282820605765], [19.717746425311496, 0.5557972050007017, 2.489296390039773], [26.950092329222606, 0.14551655367836278, 2.4241357963173025], [67.43384214921313, 0.8128525251321871, 0.2500031264454969], [74.80661643648352, 0.19165774015050693, 5.999999936100017]], "peak_params_": [[7.439247872678796, 0.29835457834493734, 3.480992345122556], [10.38127429793949, 0.9690846859574349, 1.683470246241349], [13.754852245707745, 0.44508824030018945, 2.260656564121153], [19.717746425311496, 0.5546236398432358, 4.978592780079546], [26.950092329222606, 0.15318666579830964, 4.848271592634605], [67.43384214921313, 0.2625484373717921, 0.5000062528909938], [74.80661643648352, 0.1915582178948103, 11.999999872200034]], "r_squared_": 0.9892296234131306, "error_": 0.0537330099953949}
{"freq_range": [2.0, 80.0], "freq_res": 1.0, "aperiodic_params_": [1.1901487197408547, 1.7161609646241176], "gaussian_params_": [[9.870992727437457, 0.7884501030063374, 1.906564361236196], [14.385798391800073, 0.31932132495606386, 0.7758377360143005], [17.51913333812799, 0.3223243457778324, 0.8108025975593021], [20.353629490971045, 0.5838632230819226, 0.4856702653146744], [21.908962912249255, 0.36790631721409406, 4.227075680596397], [73.2943564190894, 0.14325913638246973, 5.999989782511066]], "peak_params_": [[9.870992727437457, 0.793600586009682, 3.813128722472392], [14.385798391800073, 0.4216840487315141, 1.551675472028601], [17.51913333812799, 0.5103495288999286, 1.6216051951186041], [20.353629490971045, 0.7831330605677171, 0.9713405306293488], [21.908962912249255, 0.36968741776127856, 8.454151361192794], [73.2943564190894, 0.1430868396501077, 11.999979565022132]], "r_squared_": 0.9892353433493916, "error_": 0.05766570027575251}
{"freq_range": [2.0, 80.0], "freq_res": 1.0, "aperiodic_params_": [1.38512375730331, 1.7506780103838497], "gaussian_params_": [[9.882637131945122, 0.8027253245860223, 1.9462639920425162], [20.72389311787221, 0.6053488842738058, 4.058613280530838], [27.117167467973005, 0.19740703355482514, 0.6193567599735283], [72.34036474579965, 0.2885442630668371, 1.3168713709907842]], "peak_params_": [[9.882637131945122, 0.8197168792518738, 3.8925279840850324], [20.72389311787221, 0.6039497738082148, 8.117226561061676], [27.117167467973005, 0.3770329316073463, 1.2387135199470567], [72.34036474579965, 0.2790654946130886, 2.6337427419815684]], "r_squared_": 0.9856765882296278, "error_": 0.07278735058331472}
{"freq_range": [2.0, 80.0], "freq_res": 1.0, "aperiodic_params_": [1.5441867328217764, 1.8330295853565863], "gaussian_params_": [[9.818060243653106, 0.910648848192627, 2.0283311230054992], [19.48349400259772, 0.6107225126901002, 2.6189152375321614], [25.991222632843424, 0.3771615099295601, 3.0091141856976593], [72.0204742611501, 0.38558705811456734, 0.7181293871503701]], "peak_params_": [[9.818060243653106, 0.9078608188356041, 4.0566622460109985], [19.48349400259772, 0.625808667146393, 5.237830475064323], [25.991222632843424, 0.40479144953015145, 6.018228371395319], [72.0204742611501, 0.385430377494957, 1.4362587743007402]], "r_squared_": 0.9871667391348934, "error_": 0.07256617243997256}
{"freq_range": [2.0, 80.0], "freq_res": 1.0, "aperiodic_params_": [1.5960581490773311, 1.8603908335234705], "gaussian_params_": [[9.76008661089756, 0.9775723708934181, 2.018313333352413], [18.84508457747453, 0.537039829029901, 2.414102576013463], [25.13403109701507, 0.41578907253161607, 3.877863758788461], [72.22435885851857, 0.38466480866735114, 0.6136972147744905]], "peak_params_": [[9.76008661089756, 0.9715482795842924, 4.036626666704826], [18.84508457747453, 0.654962504316339, 4.828205152026926], [25.13403109701507, 0.43636106745599423, 7.755727517576922], [72.22435885851857, 0.3597991346123224, 1.227394429548981]], "r_squared_": 0.9866269756881063, "error_": 0.07002147757739122}
{"freq_range": [2.0, 80.0], "freq_res": 1.0, "aperiodic_params_": [1.4686228070997749, 1.800192450047527], "gaussian_params_": [[9.651739550141206, 0.935094307006844, 1.796551410585134], [20.42808777423881, 0.5894133725010179, 5.017370699596572], [72.40497561937083, 0.3002804894464788, 1.2389522528130144]], "peak_params_": [[9.651739550141206, 0.9856722511529016, 3.593102821170268], [20.42808777423881, 0.5872719553448829, 10.034741399193145], [72.40497561937083, 0.28465991579253136, 2.4779045056260287]], "r_squared_": 0.9846896590491345, "error_": 0.0784981870126484}
{"freq_range": [2.0, 80.0], "freq_res": 1.0, "aperiodic_params_": [1.274490083701068, 1.7104889762105044], "gaussian_params_": [[9.666630247635446, 0.7794422454879575, 1.8449715277240044], [19.663277034118774, 0.5804494345928626, 5.009761394838263], [55.74640822202787, 0.2334291336232493, 0.49592207045383907], [72.14514853969919, 0.2775070034017454, 1.238819932169366], [76.93841754479742, 0.2565845718707727, 0.5581345246449744]], "peak_params_": [[9.666630247635446, 0.8571537345651923, 3.689943055448009], [19.663277034118774, 0.5791399044110154, 10.019522789676525], [55.74640822202787, 0.2048211241734612, 0.9918441409076781], [72.14514853969919, 0.27560871028406453, 2.477639864338732], [76.93841754479742, 0.25515580250192404, 1.1162690492899487]], "r_squared_": 0.9887925162265138, "error_": 0.0642993811621804}
{"freq_range": [2.0, 80.0], "freq_res": 1.0, "aperiodic_params_": [1.0488656740352107, 1.6462795898719331], "gaussian_params_": [[9.974740242858838, 0.8150777123331645, 1.9610875492555966], [15.155782511993461, 0.29906189805959416, 1.108714690318881], [19.285133521584488, 0.5151695083219606, 1.9202238541617944], [24.11412040918959, 0.24311374336320457, 4.675431835791276], [71.23238263850563, 0.12593836026661176, 5.999999999999999], [77.95028951907113, 0.08232968066740128, 1.790658241562604]], "peak_params_": [[9.974740242858838, 0.8175727528546554, 3.922175098511193], [15.155782511993461, 0.40577283370165457, 2.217429380637762], [19.285133521584488, 0.6439348443799795, 3.840447708323589], [24.11412040918959, 0.2683226802751939, 9.350863671582552], [71.23238263850563, 0.12588800951088452, 11.999999999999998], [77.95028951907113, 0.14896245809896547, 3.581316483125208]], "r_squared_": 0.9882994606914002, "error_": 0.056893530496233954}
{"freq_range": [2.0, 80.0], "freq_res": 1.0, "aperiodic_params_": [0.7432009030126314, 1.5415428849465511], "gaussian_params_": [[9.933972161491107, 0.7484503529529251, 1.217560241062193], [18.348558491908495, 0.3068764090983272, 5.999999999999999], [20.143440556102412, 0.35815510765059877, 0.8983129894112319], [26.4908940590329, 0.39702353545626795, 0.2805431999762102]], "peak_params_": [[9.933972161491107, 0.8639112260277992, 2.435120482124386], [18.348558491908495, 0.32714530850545087, 11.999999999999998], [20.143440556102412, 0.6490879125847361, 1.7966259788224639], [26.4908940590329, 0.22198398326549107, 0.5610863999524204]], "r_squared_": 0.988024989323744, "error_": 0.055717064327871525}
{"freq_range": [2.0, 80.0], "freq_res": 1.0, "aperiodic_params_": [0.8386498369156195, 1.5756082382285355], "gaussian_params_": [[4.464579484494729, 1.2115501367492356, 0.25026129153638904], [10.048115881306959, 0.7885462866979583, 1.381484255142851], [13.50817237620441, 0.7554834969484046, 0.30732712322847694], [19.060489249383682, 0.4287152310562936, 4.23868454782478], [67.40624765274814, 0.5839670636202902, 0.2785244908984654], [72.45203459913604, 0.12756349466011815, 5.999999999999999], [74.9403659851851, 0.08867388239681662, 1.6383303825264166]], "peak_params_": [[4.464579484494729, 0.21711475002446232, 0.5005225830727781], [10.048115881306959, 0.8317174833626095, 2.762968510285702], [13.50817237620441, 0.43332985091848975, 0.6146542464569539], [19.060489249383682, 0.4286715789682518, 8.47736909564956], [67.40624765274814, 0.28598665024480185, 0.5570489817969309], [72.45203459913604, 0.14491733771804682, 11.999999999999998], [74.9403659851851, 0.20517977962923828, 3.276660765052833]], "r_squared_": 0.9878818106651924, "error_": 0.058301400283508824}
{"freq_range": [2.0, 80.0], "freq_res": 1.0, "aperiodic_params_": [1.1992440681759255, 1.6982372853340988], "gaussian_params_": [[9.929562723995648, 0.9778071254506593, 1.704741232294135], [14.417704944285894, 0.32006197730548624, 0.7683580157859728], [17.4810462003249, 0.43925554328316657, 0.6274721105709692], [20.248610287329992, 0.5037741745312395, 0.7820279914964625], [21.452034599135946, 0.3008299993377201, 5.077568752455452], [71.8924046620646, 0.1742261668798344, 2.7180130372497273], [78.5321095640392, 1.104671580979153, 0.2625736228986209]], "peak_params_": [[9.929562723995648, 1.0006164407742335, 3.40948246458827], [14.417704944285894, 0.43509185238866876, 1.5367160315719457], [17.4810462003249, 0.5336324547672961, 1.2549442211419384], [20.248610287329992, 0.767866491768453, 1.564055982992925], [21.452034599135946, 0.6171596032079658, 10.155137504910904], [71.8924046620646, 0.17408970947943936, 5.436026074499455], [78.5321095640392, 0.23150416865451318, 0.5251472457972418]], "r_squared_": 0.9899725620186043, "error_": 0.05416461500056262}
{"freq_range": [2.0, 80.0], "freq_res": 1.0, "aperiodic_params_": [1.317849113825346, 1.719108498223196], "gaussian_params_": [[9.936629278840437, 1.0971721516250654, 1.857725731240205], [17.116402831278524, 0.49150552002637127, 2.2848706051569163], [20.47118357037124, 1.934343562508281, 0.27996739455004754], [22.983585351313025, 0.16711405201523116, 0.963342989920482], [24.865637098002438, 0.31575124962240103, 3.5914087236701238], [72.44471695961457, 0.2889564619748312, 1.1374034805235276]], "peak_params_": [[9.936629278840437, 1.1004406643185107, 3.71545146248041], [17.116402831278524, 0.5203567644565948, 4.569741210313833], [20.47118357037124, 0.8184706737645479, 0.5599347891000951], [22.983585351313025, 0.4608388755974402, 1.926685979840964], [24.865637098002438, 0.33549920193167493, 7.1828174473402475], [72.44471695961457, 0.2676923057204512, 2.274806961047055]], "r_squared_": 0.9892819333439853, "error_": 0.06323731881839305}
{"freq_range": [2.0, 80.0], "freq_res": 1.0, "aperiodic_params_": [1.468307720834304, 1.7922342433350977], "gaussian_params_": [[9.753599859707654, 1.1249435050789458, 1.801461638282629], [20.49265692434274, 0.5890902088448308, 5.077603483419037], [72.25672220362256, 0.3296249998475047, 0.6092963283311038]], "peak_params_": [[9.753599859707654, 1.1841177341819933, 3.602923276565258], [20.49265692434274, 0.5863239994834119, 10.155206966838074], [72.25672220362256, 0.3016269700224261, 1.2185926566622076]], "r_squared_": 0.987517390123264, "error_": 0.06880726308341147}
{"freq_range": [2.0, 80.0], "freq_res": 1.0, "aperiodic_params_": [1.5511066226369874, 1.841582913640631], "gaussian_params_": [[9.729176262610405, 1.1942308847682033, 1.685340760847721], [20.015885918103628, 0.5773951702671986, 5.525077508711151], [72.06833078853617, 0.3566650686452294, 0.6954889093303871]], "peak_params_": [[9.729176262610405, 1.2905640825307316, 3.370681521695442], [20.015885918103628, 0.5773927938982928, 11.050155017422302], [72.06833078853617, 0.354947811180492, 1.3909778186607742]], "r_squared_": 0.9860664135138005, "error_": 0.07313369265429834}
{"freq_range": [2.0, 80.0], "freq_res": 1.0, "aperiodic_params_": [1.4397898542985372, 1.7800684148288195], "gaussian_params_": [[9.746860972689863, 1.1219126622716822, 1.7787338302990694], [19.520681879936888, 0.5973680660390529, 4.903367985123788], [72.27182532392449, 0.4313797746329745, 0.44133907938871914]], "peak_params_": [[9.746860972689863, 1.2013043194331001, 3.557467660598139], [19.520681879936888, 0.5945208316173616, 9.806735970247576], [72.27182532392449, 0.356850185884785, 0.8826781587774383]], "r_squared_": 0.9867909572656477, "error_": 0.07063659380704962}
{"freq_range": [2.0, 80.0], "freq_res": 1.0, "aperiodic_params_": [1.3691722438404916, 1.7639127909118566], "gaussian_params_": [[10.065300374986295, 1.1053647806801918, 1.797755614402235], [15.44690790261994, 0.39643381244902764, 1.4060515898331267], [19.530301475897378, 0.5592601882566494, 1.8116473212521043], [24.452034599135946, 0.2601577693019602, 3.814728641458827], [72.58065027955124, 0.11526772171018322, 5.996474270322217]], "peak_params_": [[10.065300374986295, 1.1050537396965785, 3.59551122880447], [15.44690790261994, 0.43906868924783354, 2.8121031796662534], [19.530301475897378, 0.6745372860019297, 3.6232946425042085], [24.452034599135946, 0.28499524415139155, 7.629457282917654], [72.58065027955124, 0.11498620278224414, 11.992948540644434]], "r_squared_": 0.9873032911897222, "error_": 0.06320627527290439}
{"freq_range": [2.0, 80.0], "freq_res": 1.0, "aperiodic_params_": [1.1309710385313778, 1.6834801890228865], "gaussian_params_": [[9.952023407230396, 0.9683444535629311, 1.3900838702591645], [14.94005274557541, 0.054067458345597084, 0.2500002498647452], [19.07496513265309, 0.5442180337625724, 5.129034551693041], [72.62392350952179, 0.14265452335823584, 5.9999999999999405]], "peak_params_": [[9.952023407230396, 1.0815268745717557, 2.780167740518329], [14.94005274557541, 0.4507842311290303, 0.5000004997294905], [19.07496513265309, 0.5441599088182314, 10.258069103386083], [72.62392350952179, 0.1423745743475755, 11.999999999999881]], "r_squared_": 0.9859472583947757, "error_": 0.06708949627411655}
{"freq_range": [2.0, 80.0], "freq_res": 1.0, "aperiodic_params_": [0.812766416125372, 1.5137180424558783], "gaussian_params_": [[9.97653398373245, 0.9676883484992539, 1.245320300736627], [14.10210182153587, 0.27556733077612383, 1.3001000226034014], [19.66837793505146, 0.5000773919146457, 2.649789363649024], [71.33967776121762, 0.11347388488424938, 5.999999999999453]], "peak_params_": [[9.97653398373245, 0.9700580133077839, 2.490640601473254], [14.10210182153587, 0.3306954365825301, 2.600200045206803], [19.66837793505146, 0.49618579039229616, 5.299578727298048], [71.33967776121762, 0.11329218706240884, 11.999999999998906]], "r_squared_": 0.9871495853248443, "error_": 0.056690762628929796}
{"freq_range": [2.0, 80.0], "freq_res": 1.0, "aperiodic_params_": [0.8892197374406856, 1.5197140942788194], "gaussian_params_": [[9.859088451919092, 1.1216892413174109, 1.5369692850559131], [13.987607197943523, 0.26535372299638504, 1.085769493717793], [19.313186934247252, 0.5902393424218163, 3.068379990404429]], "peak_params_": [[9.859088451919092, 1.123193490072335, 3.0739385701118263], [13.987607197943523, 0.42690256675226834, 2.171538987435586], [19.313186934247252, 0.5871790231521167, 6.136759980808858]], "r_squared_": 0.9859058347180754, "error_": 0.06406004675320445}
{"freq_range": [2.0, 80.0], "freq_res": 1.0, "aperiodic_params_": [1.1259530304439298, 1.6159464572113793], "gaussian_params_": [[9.891219675420768, 1.3331570311295007, 1.5844185032485705], [14.511841825463224, 1.2925653646689934, 0.2607959874049989], [19.64424630124928, 0.6799055551440771, 3.6888636611054455]], "peak_params_": [[9.891219675420768, 1.352313470400481, 3.168837006497141], [14.511841825463224, 0.5393646992154958, 0.5215919748099977], [19.64424630124928, 0.6767511130951362, 7.377727322210891]], "r_squared_": 0.9845427213316398, "error_": 0.07440081327661983}
{"freq_range": [2.0, 80.0], "freq_res": 1.0, "aperiodic_params_": [1.3202090697704068, 1.7311666498949643], "gaussian_params_": [[9.910361679382877, 1.259242585778461, 1.4935998839725195], [17.498609943310615, 0.5325143536533906, 0.27719898478143], [18.90406919827191, 0.5428340808693263, 5.999999999999999], [20.28549153105717, 0.4076386211314352, 0.5446810092452807]], "peak_params_": [[9.910361679382877, 1.437463832340978, 2.987199767945039], [17.498609943310615, 0.6218155672290915, 0.55439796956286], [18.90406919827191, 0.5679282991254496, 11.999999999999998], [20.28549153105717, 0.889173416843963, 1.0893620184905615]], "r_squared_": 0.986200086053694, "error_": 0.07301795052864452}
{"freq_range": [2.0, 80.0], "freq_res": 1.0, "aperiodic_params_": [1.6069642628630025, 1.8685764135871297], "gaussian_params_": [[9.838007247718137, 1.3520203078464186, 1.6170835185231576], [19.222310470845237, 0.5962478516289714, 5.30492333206382], [72.39096142825846, 0.2907835078417488, 1.1933187144919044]], "peak_params_": [[9.838007247718137, 1.4768265801935303, 3.234167037046315], [19.222310470845237, 0.5957246757572533, 10.60984666412764], [72.39096142825846, 0.27558878771617623, 2.386637428983809]], "r_squared_": 0.987481995006784, "error_": 0.0743248212721772}
{"freq_range": [2.0, 80.0], "freq_res": 1.0, "aperiodic_params_": [1.4448984629216073, 1.8086833361378996], "gaussian_params_": [[8.8783583529477, 0.7956556399142174, 1.904483456610446], [10.469363601311874, 4.115400854253789, 0.27317743696958224], [12.404723956232523, 0.7408601692429025, 0.2916536729445981], [15.502462860239556, 0.39935424076059534, 0.25130161980723303], [19.01000406288743, 0.6356150702153005, 4.960021407984201], [72.60649080748962, 0.26508521243666444, 1.5080173552901024]], "peak_params_": [[8.8783583529477, 0.8769795328218056, 3.808966913220892], [10.469363601311874, 1.7315866698490434, 0.5463548739391645], [12.404723956232523, 0.7246455409639456, 0.5833073458891962], [15.502462860239556, 0.5857099793523809, 0.5026032396144661], [19.01000406288743, 0.6356143625792703, 9.920042815968403], [72.60649080748962, 0.2562120066477458, 3.016034710580205]], "r_squared_": 0.9921133918010421, "error_": 0.05945416971849447}
{"freq_range": [2.0, 80.0], "freq_res": 1.0, "aperiodic_params_": [1.4455126494380328, 1.81334514810358], "gaussian_params_": [[8.84320902560015, 0.7853823970072364, 1.8633047407397019], [10.470038507991989, 4.111044828634502, 0.2747707594431558], [12.419416671907419, 0.8773312909660889, 0.2814490618534102], [15.501912523348702, 0.3921776647838376, 0.25030515514337964], [18.998437449074743, 0.6342719163191345, 5.092344133279612], [72.48961203230536, 0.2949537602209127, 1.016836596576219]], "peak_params_": [[8.84320902560015, 0.8749013718486941, 3.7266094814794037], [10.470038507991989, 1.7325465096011432, 0.5495415188863116], [12.419416671907419, 0.7227031085735056, 0.5628981237068204], [15.501912523348702, 0.5879681893519122, 0.5006103102867593], [18.998437449074743, 0.6342721637943469, 10.184688266559224], [72.48961203230536, 0.2626690845928654, 2.033673193152438]], "r_squared_": 0.9919845635753392, "error_": 0.060721737935569405}
{"freq_range": [2.0, 80.0], "freq_res": 1.0, "aperiodic_params_": [1.321676135920795, 1.6847629570221165], "gaussian_params_": [[9.284351018568124, 0.6829824213158113, 1.8266872385564845], [10.426832341002985, 2.0906139701771562, 0.3198855651654433], [12.698352564514314, 0.1437703262632655, 1.3861138614766626], [18.64848701617507, 0.5745024344947233, 5.0783367843428255]], "peak_params_": [[9.284351018568124, 0.7734516488224364, 3.653374477112969], [10.426832341002985, 1.6472245891474397, 0.6397711303308866], [12.698352564514314, 0.5361867440772659, 2.772227722953325], [18.64848701617507, 0.5731329820736819, 10.156673568685651]], "r_squared_": 0.9882935729378515, "error_": 0.06520327947270198}
{"freq_range": [2.0, 80.0], "freq_res": 1.0, "aperiodic_params_": [1.0281360834175952, 1.601612673247756], "gaussian_params_": [[10.044374148511961, 1.2302971839303467, 0.8898711592820037], [14.986481446480012, 0.0571190246251285, 0.2500640314055338], [16.975955960250516, 0.5205744703686456, 5.99999999999997], [72.36054117594871, 0.15245094296770084, 5.999999999999999]], "peak_params_": [[10.044374148511961, 1.4935869830410131, 1.7797423185640073], [14.986481446480012, 0.5501324709354555, 0.5001280628110676], [16.975955960250516, 0.5205702904917282, 11.99999999999994], [72.36054117594871, 0.152175953931877, 11.999999999999998]], "r_squared_": 0.9842245620239786, "error_": 0.06678038237647567}
{"freq_range": [2.0, 80.0], "freq_res": 1.0, "aperiodic_params_": [0.17881955434619773, 1.4896947098550706], "gaussian_params_": [[9.833162724944199, 1.3767778324352349, 1.5757891630524696], [14.209946382768855, 0.24252907274057134, 1.0103895985465898], [19.779416805792167, 0.7428363155531965, 2.967671966905353]], "peak_params_": [[9.833162724944199, 1.3723814286751437, 3.1515783261049393], [14.209946382768855, 0.39060327697926267, 2.0207791970931797], [19.779416805792167, 0.7407871718704855, 5.935343933810706]], "r_squared_": 0.9830360875477903, "error_": 0.06897250051778298}
{"freq_range": [2.0, 80.0], "freq_res": 1.0, "aperiodic_params_": [1.0055144075949025, 1.57702531236566], "gaussian_params_": [[9.832148929902312, 1.4677516675940696, 1.6664350209323586], [14.507622861863103, 1.2971459581974611, 0.2827129281233904], [19.51462823535295, 0.7702260575560436, 3.3426275585661624]], "peak_params_": [[9.832148929902312, 1.473728842261755, 3.3328700418647172], [14.507622861863103, 0.6060277649457493, 0.5654258562467808], [19.51462823535295, 0.7621486250219388, 6.685255117132325]], "r_squared_": 0.9841359283522143, "error_": 0.07680045119477491}
{"freq_range": [2.0, 80.0], "freq_res": 1.0, "aperiodic_params_": [1.3653189301178787, 1.7150041002852188], "gaussian_params_": [[10.028824399355258, 1.6096661779307917, 1.6595897516657512], [14.675549939857072, 0.3859005463419708, 0.7669769670918443], [19.668035719597807, 0.850991364542741, 2.7986843163735746], [29.232689335478376, 0.22884951312764482, 2.6326099239828293]], "peak_params_": [[10.028824399355258, 1.6116041012671842, 3.3191795033315024], [14.675549939857072, 0.5827474218042602, 1.5339539341836885], [19.668035719597807, 0.8455143319290042, 5.597368632747149], [29.232689335478376, 0.23123539817104755, 5.265219847965659]], "r_squared_": 0.9879520621647003, "error_": 0.06905470264340151}
{"freq_range": [2.0, 80.0], "freq_res": 1.0, "aperiodic_params_": [1.5387038459895501, 1.8207962473456238], "gaussian_params_": [[10.020298406670799, 1.5937059313947328, 1.6439859344531331], [15.244084005542472, 0.2752260774438069, 0.3885191662947874], [16.447009465615718, 0.4817385244784881, 0.25059242515913377], [19.65051271075063, 0.646160827815719, 3.656694470703306], [72.37010615833742, 0.2110154913492144, 1.2352107452368473]], "peak_params_": [[10.020298406670799, 1.6134409269906975, 3.2879718689062662], [15.244084005542472, 0.5299759070503597, 0.7770383325895748], [16.447009465615718, 0.5343210362681909, 0.5011848503182675], [19.65051271075063, 0.6432163904476248, 7.313388941406612], [72.37010615833742, 0.20175265967475586, 2.4704214904736945]], "r_squared_": 0.985875511997412, "error_": 0.0749337362299923}
{"freq_range": [2.0, 80.0], "freq_res": 1.0, "aperiodic_params_": [1.4183581455648897, 1.7451196887020397], "gaussian_params_": [[8.947348255729409, 0.8908908539749129, 1.78657628989354], [10.473787496558627, 3.5922106029982803, 0.30953294512008356], [12.442696972188088, 1.445160264513933, 0.2801598240207787], [16.090723344566314, 0.5474508496313871, 2.13604648579914], [19.772112100142195, 0.631366023493263, 0.8588194049626459], [22.460179098375523, 1.054144394801803, 0.2619508235937335], [24.925965598253327, 0.24195292717544398, 3.435976307628707], [72.405280980495, 0.13699809428524215, 5.999999999999999]], "peak_params_": [[8.947348255729409, 0.8927678616149576, 3.57315257978708], [10.473787496558627, 1.8716302069065889, 0.6190658902401671], [12.442696972188088, 0.709344180120421, 0.5603196480415574], [16.090723344566314, 0.5556514210785269, 4.27209297159828], [19.772112100142195, 0.7986769510400631, 1.7176388099252917], [22.460179098375523, 0.4274179904194226, 0.523901647187467], [24.925965598253327, 0.2419881284509925, 6.871952615257414], [72.405280980495, 0.13668591851298495, 11.999999999999998]], "r_squared_": 0.9934754747619061, "error_": 0.05338220493676016}
{"freq_range": [2.0, 80.0], "freq_res": 1.0, "aperiodic_params_": [0.9041695311390084, 1.4465587719935258], "gaussian_params_": [[9.683192278605805, 0.5074952186959907, 2.154798157542095], [10.273538444825745, 1.1502782259065687, 0.5885967444738236], [17.186113751668127, 0.3155205580706784, 4.934983829664993], [19.804833115524772, 0.3772319222950267, 0.5823876073282077], [60.75027813204406, 0.13183821415657918, 4.257662937514346], [65.01106535667799, 0.22623946915014506, 0.25078448356814004], [67.39546201049144, 0.45074948385409863, 0.326249530712529], [72.4729436513554, 1.3033279026623286, 0.2531382936449142], [77.94667081735372, 0.21818846915623671, 5.414223044969812]], "peak_params_": [[9.683192278605805, 1.6438670819052912, 4.30959631508419], [10.273538444825745, 1.6438670819052912, 1.1771934889476472], [17.186113751668127, 0.31689090672694975, 9.869967659329985], [19.804833115524772, 0.6248206767035853, 1.1647752146564154], [60.75027813204406, 0.13323877625314728, 8.515325875028692], [65.01106535667799, 0.3186403154656783, 0.5015689671362801], [67.39546201049144, 0.28936416880145965, 0.652499061425058], [72.4729436513554, 0.35093148944522157, 0.5062765872898284], [77.94667081735372, 0.21821383753357448, 10.828446089939623]], "r_squared_": 0.9881976145427871, "error_": 0.05490860707001972}
{"freq_range": [2.0, 80.0], "freq_res": 1.0, "aperiodic_params_": [0.4092436706649876, 1.3109061169901661], "gaussian_params_": [[7.203133841852567, 0.224534560375285, 0.9074807185409614], [10.217431371464993, 1.4251051473937137, 0.7881497351047217], [13.347263208001355, 0.5164621153372632, 0.26569375846916515], [14.705224667161975, 0.22858470958002572, 0.5651238004981591], [17.567962513102202, 0.5629833635635287, 0.2915281121613683], [19.984794103600024, 0.45219059383609295, 0.8751851956313799], [56.09074869681202, 0.14879848329403464, 0.25007718972200405], [59.98028099652046, 0.11690488471877052, 1.5599173006410911], [65.90292911043106, 0.20963911508276376, 1.5091322226082904], [72.05811610972061, 0.30207510449539354, 1.0471836759271553], [77.05210086202607, 0.1631972849107481, 0.25000000004154865]], "peak_params_": [[7.203133841852567, 0.21932204088919915, 1.8149614370819227], [10.217431371464993, 1.3738372625211053, 1.5762994702094435], [13.347263208001355, 0.22504341328449584, 0.5313875169383303], [14.705224667161975, 0.1995106524836282, 1.1302476009963183], [17.567962513102202, 0.2223063181790006, 0.5830562243227366], [19.984794103600024, 0.45212234694338016, 1.7503703912627597], [56.09074869681202, 0.14382569302265247, 0.5001543794440081], [59.98028099652046, 0.11699536120368603, 3.1198346012821823], [65.90292911043106, 0.20927415346887202, 3.0182644452165808], [72.05811610972061, 0.30167012215518785, 2.0943673518543107], [77.05210086202607, 0.15969590240480858, 0.5000000000830973]], "r_squared_": 0.9911764839378865, "error_": 0.038171485526114025}
{"freq_range": [2.0, 80.0], "freq_res": 1.0, "aperiodic_params_": [0.9062970900607833, 1.461235648165446], "gaussian_params_": [[10.05126963655663, 1.622201340864194, 1.4330392794185192], [14.922488560447713, 0.40566868492711156, 1.1319410704687696], [19.88780259070281, 0.7551045067578674, 1.989141148748459]], "peak_params_": [[10.05126963655663, 1.6211984730070488, 2.8660785588370383], [14.922488560447713, 0.4457787605200246, 2.263882140937539], [19.88780259070281, 0.7539216064857466, 3.978282297496918]], "r_squared_": 0.9821609024468279, "error_": 0.0764838711585137}
{"freq_range": [2.0, 80.0], "freq_res": 1.0, "aperiodic_params_": [0.9409914925940832, 1.457619662517701], "gaussian_params_": [[8.491100848875577, 0.5663019161462903, 1.6381493221323393], [10.340622221191271, 1.6211649809627264, 0.7225298438605198], [12.429775984897105, 0.902120965680658, 0.3077337193327671], [15.264793416065048, 0.30912080750952226, 1.1349197621620055], [19.857800933866375, 0.6369705099234667, 1.6990325257140506], [71.61560497848019, 0.21394625084393984, 5.999999999999999]], "peak_params_": [[8.491100848875577, 0.5499489172533331, 3.2762986442646787], [10.340622221191271, 1.8211941118384651, 1.4450596877210395], [12.429775984897105, 0.5182689842606716, 0.6154674386655342], [15.264793416065048, 0.3117222248914206, 2.269839524324011], [19.857800933866375, 0.6347948064582591, 3.3980650514281012], [71.61560497848019, 0.21350763720140264, 11.999999999999998]], "r_squared_": 0.9870989620951726, "error_": 0.06272032026254107}
{"freq_range": [2.0, 80.0], "freq_res": 1.0, "aperiodic_params_": [0.8869529673635118, 1.4105740051279223], "gaussian_params_": [[7.817321011616523, 0.27760641836900246, 1.5358882585641793], [10.364493012228735, 0.7707460112566705, 1.4661494874797631], [10.419932530643262, 1.9047674847210634, 0.3386070442910426], [15.641515711263649, 0.29064951208896145, 1.7307644479926487], [19.830941605341504, 0.61852892397318, 0.9904645134050434], [64.45203459913596, 0.18134073933417344, 5.999999999999999], [72.04793451622275, 0.1766357885390502, 0.25000000000000006], [77.38423933332216, 0.22123366323531252, 4.3046458612368115]], "peak_params_": [[7.817321011616523, 0.48562758947829116, 3.0717765171283586], [10.364493012228735, 1.732654133776153, 2.9322989749595263], [10.419932530643262, 1.732654133776153, 0.6772140885820852], [15.641515711263649, 0.28530775305505474, 3.4615288959852974], [19.830941605341504, 0.6217831141395527, 1.9809290268100868], [64.45203459913596, 0.1825871319705612, 11.999999999999998], [72.04793451622275, 0.3568015059480294, 0.5000000000000001], [77.38423933332216, 0.24071365833192981, 8.609291722473623]], "r_squared_": 0.9824589215759484, "error_": 0.06184683243726049}
{"freq_range": [2.0, 80.0], "freq_res": 1.0, "aperiodic_params_": [-0.16800849435034404, 1.437931632748367], "gaussian_params_": [[9.953981426893636, 0.8536919380714189, 1.156794127722828], [13.553271748409909, 0.2994745739647181, 1.0053062245961175], [19.755998497641496, 0.5460400726647504, 2.2011809272838674], [25.41073711793599, 0.5728903643297464, 0.2795682577518638], [71.49889586296246, 0.2587000000673787, 0.6835073573999791], [75.05784467801887, 0.24015387146337097, 0.5900779173341021]], "peak_params_": [[9.953981426893636, 0.8536265281443068, 2.313588255445656], [13.553271748409909, 0.29108264877010237, 2.010612449192235], [19.755998497641496, 0.5426955468919183, 4.402361854567735], [25.41073711793599, 0.2266694362389301, 0.5591365155037276], [71.49889586296246, 0.19820225136308256, 1.3670147147999583], [75.05784467801887, 0.2390032597159184, 1.1801558346682042]], "r_squared_": 0.9852269573514832, "error_": 0.05787206409666352}
{"freq_range": [2.0, 80.0], "freq_res": 1.0, "aperiodic_params_": [0.7011558050589239, 1.4143523016812196], "gaussian_params_": [[7.166385985214276, 0.24984596145794374, 1.115142286990461], [10.098917092432666, 1.172519396181582, 0.7557929592254853], [15.270963297336458, 0.2454440916141144, 0.5556513049557494], [19.765125985565653, 0.47938842540085136, 0.7305309823304215], [57.51261782052256, 0.16083051281413455, 2.254106880048949], [60.35306748750254, 0.42489301875533236, 0.26505415129221854], [65.72154853063434, 0.12393250207012987, 2.3041116531666574], [70.44193614719023, 0.3467182115042024, 0.2859792006549625], [71.62848343839572, 0.32438256185156444, 0.25004363718044836], [76.82104724580634, 0.16469155789458043, 5.998093935610971]], "peak_params_": [[7.166385985214276, 0.24734240150989448, 2.230284573980922], [10.098917092432666, 1.1724189705900725, 1.5115859184509706], [15.270963297336458, 0.21792870904578843, 1.1113026099114989], [19.765125985565653, 0.45524074930624814, 1.461061964660843], [57.51261782052256, 0.15876444595521022, 4.508213760097898], [60.35306748750254, 0.2713701185487791, 0.5301083025844371], [65.72154853063434, 0.1555184443935691, 4.608223306333315], [70.44193614719023, 0.21342513967303245, 0.571958401309925], [71.62848343839572, 0.2298231948700462, 0.5000872743608967], [76.82104724580634, 0.16461905303454838, 11.996187871221942]], "r_squared_": 0.9884298849312402, "error_": 0.04584840607481142}
{"freq_range": [2.0, 80.0], "freq_res": 1.0, "aperiodic_params_": [0.5314945322289064, 1.5344530732847301], "gaussian_params_": [[6.5782024375235295, 0.38853999180416415, 1.2772283648519478], [7.959182114112804, 0.18524246359913416, 0.25074024432551906], [10.116666824260383, 1.3545514225134403, 0.8584632128803756], [13.276754928785438, 0.24431730455835493, 1.2211906178779004], [19.86270068808123, 0.541591883706066, 3.985314153656559]], "peak_params_": [[6.5782024375235295, 0.3728666027511606, 2.5544567297038956], [7.959182114112804, 0.4631892396996147, 0.5014804886510381], [10.116666824260383, 1.3848507257046672, 1.7169264257607513], [13.276754928785438, 0.36589658282098925, 2.442381235755801], [19.86270068808123, 0.5412706372207285, 7.970628307313118]], "r_squared_": 0.9854003574732821, "error_": 0.06808086738510921}
{"freq_range": [2.0, 80.0], "freq_res": 1.0, "aperiodic_params_": [0.6767869802247954, 1.6803610498503319], "gaussian_params_": [[6.593003223512183, 0.3714266399555793, 0.8119011486854801], [8.419107072488663, 0.84015827269116, 0.3371086194301583], [10.092458752672973, 1.470414900546458, 0.7312342839073018], [12.346971629087582, 0.33702950936191256, 1.2434561667443607], [15.627039067295511, 0.23125754691774242, 1.221294980307454], [17.780397867384593, 0.21986024889884564, 0.5790766340869485], [19.71778064523591, 0.6594512577364494, 0.5708545199117313], [21.517557916645128, 0.2738441686955555, 4.342422503771249], [21.519064013394726, 0.39603122943725483, 0.27479501573082477], [72.14331083158343, 0.16297072205773283, 5.999999999999999], [77.3934439983802, 0.3523087882975556, 0.2533437217370598]], "peak_params_": [[6.593003223512183, 0.3289397708969453, 1.6238022973709603], [8.419107072488663, 0.4980650502293864, 0.6742172388603166], [10.092458752672973, 1.523674541904516, 1.4624685678146037], [12.346971629087582, 0.4007144489404746, 2.4869123334887213], [15.627039067295511, 0.3493319037159295, 2.442589960614908], [17.780397867384593, 0.44401474307910016, 1.158153268173897], [19.71778064523591, 0.8417362569507043, 1.1417090398234626], [21.517557916645128, 0.35800606810553504, 8.684845007542497], [21.519064013394726, 0.35800606810553504, 0.5495900314616495], [72.14331083158343, 0.16292424130146133, 11.999999999999998], [77.3934439983802, 0.2229325679717835, 0.5066874434741196]], "r_squared_": 0.9895805097852177, "error_": 0.053909919220532225}
