{"freq_range": [2.0, 80.0], "freq_res": 1.0, "aperiodic_params_": [-0.2559038947364608, 0.28336803587883547], "gaussian_params_": [[13.99889416573232, 0.16832698659549103, 2.7005358865389213], [22.014302092947275, 0.46837674897668535, 3.53680940921026], [37.144917806556315, 0.14312114578008175, 0.5309513725939563], [43.01973808351841, 0.15545866359015828, 5.999999999999999], [52.67682095290188, 0.28849413372828453, 0.3331064182707248], [55.06473884424378, 0.22378720547764777, 0.507495064732327], [58.05065678217424, 0.21782005545409241, 0.48034068693546783]], "peak_params_": [[13.99889416573232, 0.2042723394283873, 5.401071773077843], [22.014302092947275, 0.4707984588895057, 7.07361881842052], [37.144917806556315, 0.23192766566839412, 1.0619027451879126], [43.01973808351841, 0.15545783301265192, 11.999999999999998], [52.67682095290188, 0.21922763955768532, 0.6662128365414496], [55.06473884424378, 0.24315156213969447, 1.014990129464654], [58.05065678217424, 0.22349889569820047, 0.9606813738709357]], "r_squared_": 0.8566944654878541, "error_": 0.05653189907173363}
{"freq_range": [2.0, 80.0], "freq_res": 1.0, "aperiodic_params_": [0.023602988362920452, 0.5633386947445027], "gaussian_params_": [[8.227665647098238, 0.31161581607476985, 0.513773894090157], [12.758838689706645, 0.2520343328519119, 2.2061213246657285], [19.943439394617847, 0.4883640956906421, 3.743117776787255], [31.16604315420421, 0.2361265468651587, 0.6123592674972108], [37.645729691469334, 0.2203056277511503, 0.6584701285493235], [43.30416693390973, 0.19618451770760745, 4.28848834795265], [54.54727340978026, 0.9384538309396799, 0.27582749443403115], [57.802705783375835, 0.17496812876730283, 1.0069234382832222]], "peak_params_": [[8.227665647098238, 0.31008773437760395, 1.027547788180314], [12.758838689706645, 0.33793953747150646, 4.412242649331457], [19.943439394617847, 0.48946192563175617, 7.48623555357451], [31.16604315420421, 0.23702810107885852, 1.2247185349944216], [37.645729691469334, 0.28192635342914585, 1.316940257098647], [43.30416693390973, 0.19569168251325764, 8.5769766959053], [54.54727340978026, 0.2524115451570511, 0.5516549888680623], [57.802705783375835, 0.1721944766583221, 2.0138468765664443]], "r_squared_": 0.9602947571645134, "error_": 0.04102552262379108}
{"freq_range": [2.0, 80.0], "freq_res": 1.0, "aperiodic_params_": [-0.20259443157537618, 0.36813083614983194], "gaussian_params_": [[8.921922082756517, 0.3423409532756713, 1.2219192061688129], [17.823520015516994, 0.374731523474966, 4.850755983241809], [51.5016866613091, 0.9988738334878193, 0.30291140722255233], [68.67502897717443, 0.37348002357765214, 1.1372845200891435]], "peak_params_": [[8.921922082756517, 0.4132955195579889, 2.4438384123376258], [17.823520015516994, 0.37448359946651405, 9.701511966483618], [51.5016866613091, 0.25813565434141317, 0.6058228144451047], [68.67502897717443, 0.35853991930286755, 2.274569040178287]], "r_squared_": 0.8486226054770482, "error_": 0.06772593366266036}
{"freq_range": [2.0, 80.0], "freq_res": 1.0, "aperiodic_params_": [0.04886390589586947, 0.6080128040680274], "gaussian_params_": [[8.192105103617656, 0.32199458490202354, 0.776780062373346], [18.752611944272566, 0.4116620639287349, 5.999999999999999], [41.91122083048565, 0.16566285183277252, 0.6971387343328859]], "peak_params_": [[8.192105103617656, 0.3949279655990644, 1.553560124746692], [18.752611944272566, 0.41131229498875344, 11.999999999999998], [41.91122083048565, 0.16455125874472842, 1.3942774686657717]], "r_squared_": 0.9463659493977365, "error_": 0.05674953788603326}
{"freq_range": [2.0, 80.0], "freq_res": 1.0, "aperiodic_params_": [0.2874297364860478, 0.7948803248702971], "gaussian_params_": [[8.15753943635319, 0.3840747631366823, 0.6825843364798573], [11.068472320130784, 0.2664139854488219, 0.8259734388508164], [13.463859986439875, 0.658345704740371, 0.30494849605319974], [18.461392178430426, 0.5037845148578182, 4.615337475963458], [29.005097245967214, 0.2790073107049572, 0.8386217781503643], [31.44752764275697, 0.7403068931467992, 0.2958225410525918], [45.021032662069494, 0.13318847579982335, 3.219579144788147]], "peak_params_": [[8.15753943635319, 0.41284973266999403, 1.3651686729597146], [11.068472320130784, 0.40193545328760655, 1.6519468777016328], [13.463859986439875, 0.47447033508934205, 0.6098969921063995], [18.461392178430426, 0.5012734164570455, 9.230674951926916], [29.005097245967214, 0.31616214145067423, 1.6772435563007286], [31.44752764275697, 0.2648069692381676, 0.5916450821051836], [45.021032662069494, 0.13318566712250268, 6.439158289576294]], "r_squared_": 0.9805010831506237, "error_": 0.04135877808394583}
{"freq_range": [2.0, 80.0], "freq_res": 1.0, "aperiodic_params_": [0.12399848474869464, 0.4907372257065605], "gaussian_params_": [[8.422424781733483, 0.8551088058244726, 0.30653993763857956], [13.158395547846231, 0.2331989120785014, 2.2841342656973924], [19.975563068386336, 0.5170441790313345, 3.2707941011623882], [30.945988703697626, 0.2087908054935282, 0.6223811034634406], [37.71302606783974, 0.22556226388305697, 0.9992972709026484], [43.70492291515335, 0.21663071372173157, 4.824189134848171], [56.92318832901358, 0.179713743613268, 2.1758935735035716]], "peak_params_": [[8.422424781733483, 0.3497128078045591, 0.6130798752771591], [13.158395547846231, 0.2858337724252561, 4.568268531394785], [19.975563068386336, 0.519658566460116, 6.5415882023247764], [30.945988703697626, 0.2165255246108142, 1.244762206926881], [37.71302606783974, 0.32410884638843884, 1.9985945418052968], [43.70492291515335, 0.21622585698249863, 9.648378269696343], [56.92318832901358, 0.1844599033290537, 4.351787147007143]], "r_squared_": 0.936433692437873, "error_": 0.04977872368531502}
{"freq_range": [2.0, 80.0], "freq_res": 1.0, "aperiodic_params_": [-0.06158209346273553, 0.4468594536461045], "gaussian_params_": [[2.644742645168199, 0.4363707179210832, 0.6786266312006313], [8.760931723021416, 0.6452645521875443, 1.137920996996257], [13.285556827009398, 0.38925287145137716, 2.0637093687934724], [18.704722639234483, 0.4208414708432714, 1.6922532437485869], [23.01670008316992, 0.22334785928120474, 0.6748889720899217], [39.406160258669324, 0.750584457379232, 0.2501410196752897], [48.41788363039565, 0.27382334288349, 0.6072128165417613], [51.64850707578146, 0.37325202439901795, 0.5165300805185663], [54.51474958914646, 1.369651451361498, 0.2732566074280913], [63.282505495728685, 0.20193280476388548, 2.2886462310386735], [65.55931955502639, 0.8038801049683274, 0.2630108626227527], [68.94611738478636, 0.5107153118984505, 1.289468615431228], [72.1784893978459, 0.2873607099208651, 0.7930032049521645], [75.09396999540972, 0.258978968921905, 1.7902749390980714]], "peak_params_": [[2.644742645168199, 0.38049674053131055, 1.3572532624012625], [8.760931723021416, 0.6762418988518978, 2.275841993992514], [13.285556827009398, 0.38760332904340533, 4.127418737586945], [18.704722639234483, 0.42290265599880916, 3.3845064874971738], [23.01670008316992, 0.24007957455968693, 1.3497779441798434], [39.406160258669324, 0.2008604799204048, 0.5002820393505794], [48.41788363039565, 0.21608542277038845, 1.2144256330835226], [51.64850707578146, 0.29610822061736775, 1.0330601610371326], [54.51474958914646, 0.2833241214069142, 0.5465132148561826], [63.282505495728685, 0.20041255975866923, 4.577292462077347], [65.55931955502639, 0.3348420158139537, 0.5260217252455054], [68.94611738478636, 0.5200645305888397, 2.578937230862456], [72.1784893978459, 0.3694049090738698, 1.586006409904329], [75.09396999540972, 0.2591434580709989, 3.580549878196143]], "r_squared_": 0.9508038448705726, "error_": 0.04026297932046043}
{"freq_range": [2.0, 80.0], "freq_res": 1.0, "aperiodic_params_": [0.02820031140981874, 0.5564292792624081], "gaussian_params_": [[15.262858261834996, 0.4706721189587702, 5.972810305551906], [51.56533859169325, 0.7879290024864096, 0.2729221152777127], [62.00860423049647, 0.23131330837541736, 1.2695583859950779], [70.06514119151065, 0.2657818400202026, 2.288959065590217]], "peak_params_": [[15.262858261834996, 0.470216539611487, 11.945620611103813], [51.56533859169325, 0.2216695290360069, 0.5458442305554254], [62.00860423049647, 0.2318433426226354, 2.5391167719901557], [70.06514119151065, 0.2656742330517864, 4.577918131180434]], "r_squared_": 0.9078820561134646, "error_": 0.06380277955093273}
{"freq_range": [2.0, 80.0], "freq_res": 1.0, "aperiodic_params_": [0.2667935784516327, 0.8621465901464178], "gaussian_params_": [[8.087548789174285, 0.4029486255436166, 0.9386317890469891], [16.52730549553852, 0.5559621749402139, 5.304634594452086], [30.73286286238956, 0.22980381028317007, 1.7014514925352604], [70.82164254426334, 0.21234022510506756, 2.9603430130010415]], "peak_params_": [[8.087548789174285, 0.5539248397920572, 1.8772635780939781], [16.52730549553852, 0.5537592304122728, 10.609269188904172], [30.73286286238956, 0.24043716526014514, 3.402902985070521], [70.82164254426334, 0.2119551843602192, 5.920686026002083]], "r_squared_": 0.9746727465967117, "error_": 0.05332457644391095}
{"freq_range": [2.0, 80.0], "freq_res": 1.0, "aperiodic_params_": [0.4532413762731155, 1.067674267039595], "gaussian_params_": [[8.05511978494352, 0.4365794977553032, 0.7618050567794575], [16.390335032232095, 0.6075522262053101, 5.73028451724554], [30.58511774180886, 0.32731538283070444, 2.1233303527446075], [70.8971559055903, 0.16992505900665206, 2.995163108517173]], "peak_params_": [[8.05511978494352, 0.6434269524640468, 1.523610113558915], [16.390335032232095, 0.6061443235924784, 11.46056903449108], [30.58511774180886, 0.3446812469950753, 4.246660705489215], [70.8971559055903, 0.16982491679201916, 5.990326217034346]], "r_squared_": 0.9864914278664823, "error_": 0.048210824184960116}
{"freq_range": [2.0, 80.0], "freq_res": 1.0, "aperiodic_params_": [0.5465508109819082, 1.1210012782348502], "gaussian_params_": [[8.10388798575366, 0.4338445763310921, 0.6674606383103], [16.455143627201682, 0.5882459718010264, 5.513506732486977], [30.235550563901697, 0.3318844159908908, 2.3847135902149543], [70.29457735425393, 0.19291525025087028, 1.1689062491023468]], "peak_params_": [[8.10388798575366, 0.6101262351252243, 1.3349212766206], [16.455143627201682, 0.5862450547436707, 11.027013464973955], [30.235550563901697, 0.3590451721230039, 4.769427180429909], [70.29457735425393, 0.18688550868605747, 2.3378124982046935]], "r_squared_": 0.987882750968306, "error_": 0.04620760626361545}
{"freq_range": [2.0, 80.0], "freq_res": 1.0, "aperiodic_params_": [0.6251387585791849, 1.182457698169758], "gaussian_params_": [[8.137283556505942, 0.42180060884101817, 0.6495364772994323], [16.49970221390914, 0.6432838002395109, 5.441997035989338], [28.484953191129957, 0.3562078273931674, 0.27122197841167206], [30.347773690964072, 0.3400738162666546, 2.60835169524212], [70.16853223550203, 0.1520893209780785, 1.196127267188556]], "peak_params_": [[8.137283556505942, 0.6024534303035385, 1.2990729545988646], [16.49970221390914, 0.6405776695343537, 10.883994071978677], [28.484953191129957, 0.3677945529579685, 0.5424439568233441], [30.347773690964072, 0.36671553077789243, 5.21670339048424], [70.16853223550203, 0.15058712618632963, 2.392254534377112]], "r_squared_": 0.9902167245886002, "error_": 0.04502511314837207}
{"freq_range": [2.0, 80.0], "freq_res": 1.0, "aperiodic_params_": [0.5653038216216665, 1.0558110685824746], "gaussian_params_": [[8.1689637553585, 0.4014733915882467, 0.6034686935226099], [16.624237662941958, 0.6311041560257429, 5.174224131781022], [30.26048863117345, 0.27115527817165275, 2.787298544599006]], "peak_params_": [[8.1689637553585, 0.5433817548334927, 1.2069373870452198], [16.624237662941958, 0.6294454416214874, 10.348448263562045], [30.26048863117345, 0.2923088914118589, 5.574597089198012]], "r_squared_": 0.9849346816900243, "error_": 0.051467614165019646}
{"freq_range": [2.0, 80.0], "freq_res": 1.0, "aperiodic_params_": [0.3180531697496766, 0.6979864765147116], "gaussian_params_": [[8.264009394516425, 0.4785213323881915, 0.7097440823315057], [10.929486101685054, 0.3228967853895116, 0.7197283971902542], [13.428623166794962, 0.31310660060032125, 0.7393707264723449], [18.251627102251753, 0.5975983510116626, 3.5966561751382375]], "peak_params_": [[8.264009394516425, 0.45690184060901395, 1.4194881646630113], [10.929486101685054, 0.40134166749212846, 1.4394567943805083], [13.428623166794962, 0.4756302281188799, 1.4787414529446898], [18.251627102251753, 0.596137639002936, 7.193312350276475]], "r_squared_": 0.9788100106211758, "error_": 0.04033450665529239}
{"freq_range": [2.0, 80.0], "freq_res": 1.0, "aperiodic_params_": [0.431704932261261, 0.8673483939851471], "gaussian_params_": [[3.0049349483036005, 0.1735392296728839, 0.2500000000030095], [8.322226553252285, 0.5882705270098797, 0.7838687566546805], [10.558360531088029, 0.8067557535387317, 0.34110011199239665], [13.461569482690889, 0.35540906108480297, 0.9483045911012477], [18.181613021374233, 0.5872945910450527, 4.219548454772525], [24.484023773980727, 0.36432999936326893, 0.2944747844185232], [30.615644785798896, 0.4943562962529184, 0.2918075224387926], [50.439511334575805, 0.6175064749304942, 0.2773226904126777]], "peak_params_": [[3.0049349483036005, 0.17441297787739302, 0.500000000006019], [8.322226553252285, 0.5725644100812632, 1.567737513309361], [10.558360531088029, 0.5008564919224585, 0.6822002239847933], [13.461569482690889, 0.592019855647832, 1.8966091822024953], [18.181613021374233, 0.5867546334616728, 8.43909690954505], [24.484023773980727, 0.32134083994096097, 0.5889495688370464], [30.615644785798896, 0.2134605494198356, 0.5836150448775852], [50.439511334575805, 0.1758858093098017, 0.5546453808253554]], "r_squared_": 0.9844565594980709, "error_": 0.04379683736874444}
{"freq_range": [2.0, 80.0], "freq_res": 1.0, "aperiodic_params_": [0.25521177203913487, 0.7860712868486129], "gaussian_params_": [[3.3382085171007048, 0.6130291004142124, 0.2946182295333141], [8.509845577495982, 0.7393139646669353, 0.7756163183674855], [11.077114089014174, 0.4527373187153664, 2.018362449152129], [17.267771223445358, 0.38962518507613303, 2.927345249971151], [52.013416777172516, 0.23097208537845923, 1.9397176592303962], [55.484235774683555, 0.2988885150387477, 0.33512292239426905], [57.59804724683186, 0.2663359142609303, 0.505609347514411], [59.60812319223717, 0.374249238460176, 0.3323651010337301], [62.20443686472332, 0.22381775482740923, 0.9930056585299302], [66.0431726029486, 0.2562849948377703, 0.9634229069326902], [69.7107194830889, 0.35285627732078945, 1.245784926865272], [76.6537172882349, 0.2500638414769469, 2.3124658624582883]], "peak_params_": [[3.3382085171007048, 0.31734694553837967, 0.5892364590666282], [8.509845577495982, 0.8793183385091117, 1.551232636734971], [11.077114089014174, 0.49604837965189397, 4.036724898304258], [17.267771223445358, 0.3941069561726654, 5.854690499942302], [52.013416777172516, 0.23096656023345785, 3.8794353184607924], [55.484235774683555, 0.17582360323189827, 0.6702458447885381], [57.59804724683186, 0.19617919027469488, 1.011218695028822], [59.60812319223717, 0.2058569415728615, 0.6647302020674603], [62.20443686472332, 0.21916318020221615, 1.9860113170598603], [66.0431726029486, 0.2603629893469597, 1.9268458138653803], [69.7107194830889, 0.3475097352590488, 2.491569853730544], [76.6537172882349, 0.2472758112901513, 4.624931724916577]], "r_squared_": 0.9773843541975454, "error_": 0.04295861055912952}
{"freq_range": [2.0, 80.0], "freq_res": 1.0, "aperiodic_params_": [0.13416816770247822, 0.7533015590978492], "gaussian_params_": [[8.528864669786163, 0.5406824238138409, 1.2080376375415027], [15.994130445688834, 0.5345835052215024, 5.066528473669975], [43.918354996609835, 0.1902339969623398, 0.36459774254575655], [59.91862169905557, 0.3096786405385651, 1.9064069329375837], [62.6060768565296, 0.3280901152790238, 0.5583625280930901], [68.17483137087473, 0.3488013738255734, 0.7742551915081545], [72.63166354196682, 0.23189394383083492, 3.402789571878859]], "peak_params_": [[8.528864669786163, 0.7072487017029009, 2.4160752750830055], [15.994130445688834, 0.5345831491613623, 10.13305694733995], [43.918354996609835, 0.18552373686608092, 0.7291954850915131], [59.91862169905557, 0.30963877298880904, 3.8128138658751674], [62.6060768565296, 0.3439005174509506, 1.1167250561861801], [68.17483137087473, 0.4318896094745053, 1.548510383016309], [72.63166354196682, 0.23053935753528876, 6.805579143757718]], "r_squared_": 0.9653056238790427, "error_": 0.0543510311668582}
{"freq_range": [2.0, 80.0], "freq_res": 1.0, "aperiodic_params_": [0.4625094997593184, 1.0734828231017755], "gaussian_params_": [[7.948343793470018, 0.5503235153314635, 0.9595895970286502], [12.17228875158914, 0.43945049405899755, 2.57013560489711], [19.062145421227466, 0.547680476504599, 3.9230433399280247], [30.703649902960237, 0.2613443216631636, 2.056719819585631], [70.54796540086343, 0.18010926749470094, 5.554884628878348]], "peak_params_": [[7.948343793470018, 0.677472211886682, 1.9191791940573004], [12.17228875158914, 0.5468903228070746, 5.14027120979422], [19.062145421227466, 0.5605072822662877, 7.846086679856049], [30.703649902960237, 0.2639881519403179, 4.113439639171262], [70.54796540086343, 0.1795139062654365, 11.109769257756696]], "r_squared_": 0.9824735843293562, "error_": 0.05558409704413604}
{"freq_range": [2.0, 80.0], "freq_res": 1.0, "aperiodic_params_": [0.5460195859433559, 1.16353704126955], "gaussian_params_": [[8.058853940687541, 0.49675788241105706, 0.7571300373494382], [16.2495480885935, 0.6504376569983975, 5.812263841198679], [30.705199302316604, 0.33598264623121676, 2.202689998720811]], "peak_params_": [[8.058853940687541, 0.7328121313578645, 1.5142600746988764], [16.2495480885935, 0.6498384272627747, 11.624527682397359], [30.705199302316604, 0.358968673701037, 4.405379997441622]], "r_squared_": 0.9839865909188961, "error_": 0.05851331204738555}
{"freq_range": [2.0, 80.0], "freq_res": 1.0, "aperiodic_params_": [0.732741360788744, 1.2938335242905787], "gaussian_params_": [[8.138352466537638, 0.5049043772336456, 0.6768016131375405], [16.313335243385584, 0.6455098514435993, 5.4664902851133546], [24.61068582243902, 0.5290316024010168, 0.2500000000272755], [30.405448050161894, 0.3799581485598684, 2.492761798121841], [70.31347821980589, 0.19798224277334522, 1.461315420091607]], "peak_params_": [[8.138352466537638, 0.6975551014547052, 1.353603226275081], [16.313335243385584, 0.64445033227333, 10.932980570226709], [24.61068582243902, 0.3761840263337346, 0.500000000054551], [30.405448050161894, 0.4030629866621728, 4.985523596243682], [70.31347821980589, 0.19347888653393497, 2.922630840183214]], "r_squared_": 0.990185528929861, "error_": 0.04691376667811187}
{"freq_range": [2.0, 80.0], "freq_res": 1.0, "aperiodic_params_": [0.7343327508732995, 1.2797398954537393], "gaussian_params_": [[8.171050353369475, 0.4821612099572079, 0.6502159981883945], [16.17468640506312, 0.6564244256661054, 5.338336790291149], [24.59835941848416, 0.6630992035456936, 0.2505814850941106], [30.114117976000244, 0.3558969575886437, 2.756903986223719], [70.69932223143046, 0.21944970490429083, 0.851475353325395]], "peak_params_": [[8.171050353369475, 0.6689934088496626, 1.300431996376789], [16.17468640506312, 0.6560737961051976, 10.676673580582298], [24.59835941848416, 0.4146074877503152, 0.5011629701882212], [30.114117976000244, 0.37854022364729767, 5.513807972447438], [70.69932223143046, 0.2061850810199377, 1.70295070665079]], "r_squared_": 0.9902967172791641, "error_": 0.04570024304380497}
{"freq_range": [2.0, 80.0], "freq_res": 1.0, "aperiodic_params_": [0.6760820557079185, 1.2123533108942952], "gaussian_params_": [[8.09791432956355, 0.5257446601037433, 0.761635502329749], [12.301062788820753, 0.4146752495329787, 2.368460216185257], [18.513239412441592, 0.5727384337643112, 4.3202770325623066], [24.802510128125554, 0.20404795295173703, 0.558044363973335], [28.012192229459117, 0.1860204950487282, 0.8139753297289736], [30.974907937249302, 0.25050710974837603, 1.847192719617814], [70.63925965776573, 0.1704126941989857, 0.7735629005435738], [77.61990220892046, 0.29543089953469137, 0.30840208635485616]], "peak_params_": [[8.09791432956355, 0.63079827648052, 1.523271004659498], [12.301062788820753, 0.5951682810867502, 4.736920432370514], [18.513239412441592, 0.5767104659754385, 8.640554065124613], [24.802510128125554, 0.3787308783830612, 1.11608872794667], [28.012192229459117, 0.3058789931505155, 1.6279506594579471], [30.974907937249302, 0.25949460167982386, 3.694385439235628], [70.63925965776573, 0.15285479328582507, 1.5471258010871476], [77.61990220892046, 0.1382326223356194, 0.6168041727097123]], "r_squared_": 0.9927785294950505, "error_": 0.03794306235047649}
{"freq_range": [2.0, 80.0], "freq_res": 1.0, "aperiodic_params_": [0.4578093141772565, 0.9770173042031822], "gaussian_params_": [[8.154046651798229, 0.45753120642571266, 0.7481865597504304], [12.900015768643264, 0.4228195255415534, 2.761814706565446], [19.50534988140518, 0.4426211638837178, 5.092619124337807]], "peak_params_": [[8.154046651798229, 0.5700491853569056, 1.4963731195008607], [12.900015768643264, 0.6182907678899039, 5.523629413130892], [19.50534988140518, 0.45606424247242283, 10.185238248675613]], "r_squared_": 0.9844490242442413, "error_": 0.0495787438628985}
{"freq_range": [2.0, 80.0], "freq_res": 1.0, "aperiodic_params_": [0.3932035605990216, 0.9161483132948514], "gaussian_params_": [[14.713567173858184, 0.6474171874942547, 5.6439200278363595]], "peak_params_": [[14.713567173858184, 0.6465839697947063, 11.287840055672719]], "r_squared_": 0.9636385106764714, "error_": 0.0761425259009036}
{"freq_range": [2.0, 80.0], "freq_res": 1.0, "aperiodic_params_": [0.3901357848138012, 1.1050739843182236], "gaussian_params_": [[8.411745764170199, 0.797065410465347, 0.8481376159333828], [11.210635768632178, 0.45348675472778766, 1.9117664659232871], [16.083508283028262, 0.46300877972492005, 4.340804508032422], [66.21906045254198, 0.19165390078525651, 5.999999999999999], [76.23646832790881, 0.17800465356040426, 1.5260789392876584]], "peak_params_": [[8.411745764170199, 0.9009176766662513, 1.6962752318667655], [11.210635768632178, 0.6915417107455054, 3.8235329318465743], [16.083508283028262, 0.48259013591393807, 8.681609016064844], [66.21906045254198, 0.19152620742788695, 11.999999999999998], [76.23646832790881, 0.22663425390752745, 3.0521578785753167]], "r_squared_": 0.9787972100197292, "error_": 0.0607114952387641}
{"freq_range": [2.0, 80.0], "freq_res": 1.0, "aperiodic_params_": [0.2729933809281359, 1.0152602942093092], "gaussian_params_": [[8.09953959413426, 0.6764372521563273, 1.0901522396033012], [11.701775946842462, 0.40241948584779597, 2.2891500955044206], [17.273902586029745, 0.5374413601977431, 3.900273627281471], [23.40875122362687, 0.22792345259114072, 0.9550669160277874], [68.29695591488856, 0.2665037881903905, 0.3162750014058913], [70.70042166030906, 0.21025633615380257, 1.6485592228314372], [75.3747869041469, 0.24352460579132712, 0.8017826492716068]], "peak_params_": [[8.09953959413426, 0.8142915411074743, 2.1803044792066024], [11.701775946842462, 0.6155673102692714, 4.578300191008841], [17.273902586029745, 0.563751920253658, 7.800547254562942], [23.40875122362687, 0.39091188104481356, 1.9101338320555747], [68.29695591488856, 0.2264704327758995, 0.6325500028117826], [70.70042166030906, 0.2068133139656514, 3.2971184456628744], [75.3747869041469, 0.22533070972996772, 1.6035652985432136]], "r_squared_": 0.9869694809380388, "error_": 0.04674541539468824}
{"freq_range": [2.0, 80.0], "freq_res": 1.0, "aperiodic_params_": [0.487285324404893, 1.1333520244617497], "gaussian_params_": [[7.92957488527111, 0.5961004234356332, 0.9036528329157871], [12.409202407936315, 0.38942833210740474, 2.8147171377121034], [18.871578603342197, 0.5158159333719656, 5.197296589579954]], "peak_params_": [[7.92957488527111, 0.7663273943990103, 1.8073056658315743], [12.409202407936315, 0.6005900958864714, 5.629434275424207], [18.871578603342197, 0.5407681968722456, 10.394593179159909]], "r_squared_": 0.981526623452047, "error_": 0.06410428721864762}
{"freq_range": [2.0, 80.0], "freq_res": 1.0, "aperiodic_params_": [0.6566761922435467, 1.2867672124448646], "gaussian_params_": [[7.995199622073276, 0.6410486105354346, 0.82561118467112], [12.90708437794519, 0.4712476789088365, 2.9815451452869297], [18.905021926455053, 0.4482421242373518, 5.105051798934103], [24.964923095105874, 0.10516099118669127, 0.2500765005107428]], "peak_params_": [[7.995199622073276, 0.8084514137777207, 1.65122236934224], [12.90708437794519, 0.7006224705362522, 5.963090290573859], [18.905021926455053, 0.5065665395769087, 10.210103597868207], [24.964923095105874, 0.32403660494488684, 0.5001530010214856]], "r_squared_": 0.9864310309044801, "error_": 0.056798598083615925}
{"freq_range": [2.0, 80.0], "freq_res": 1.0, "aperiodic_params_": [0.8182744344533996, 1.3570972934572942], "gaussian_params_": [[8.101900703382574, 0.6138291348031363, 0.7605947634046457], [12.913373178491646, 0.5092093961533193, 2.74418483695492], [20.11669923111939, 0.4403410902141223, 4.527490654441654], [28.479727257120807, 0.21301760164609698, 0.8702985792873306], [31.443764092145155, 0.2424814460509746, 1.321497939670676], [70.67071841337409, 0.19715147656593512, 1.3030178311731337], [75.39758986860473, 0.19015734309536744, 0.5971932285962394], [77.76600957695501, 0.16893966134136532, 0.6465645642175445]], "peak_params_": [[8.101900703382574, 0.7231167537720654, 1.5211895268092914], [12.913373178491646, 0.6369693850291178, 5.48836967390984], [20.11669923111939, 0.458340345811939, 9.054981308883308], [28.479727257120807, 0.28782615476026985, 1.7405971585746611], [31.443764092145155, 0.2568970656378191, 2.642995879341352], [70.67071841337409, 0.1909557953236829, 2.6060356623462675], [75.39758986860473, 0.1531657472717609, 1.1943864571924787], [77.76600957695501, 0.15824541889651744, 1.293129128435089]], "r_squared_": 0.9934979307287028, "error_": 0.0374742261874813}
{"freq_range": [2.0, 80.0], "freq_res": 1.0, "aperiodic_params_": [0.8248141052569793, 1.363231508780078], "gaussian_params_": [[8.075750920261521, 0.5906764204322047, 0.7765074757596626], [12.886444393595303, 0.5296120430301273, 2.7370125443097937], [19.864676601159314, 0.43377701671563423, 4.47171921333444], [24.994795313779782, 0.16180120886714305, 0.25009128076187886], [30.465982193135346, 0.2246628759303794, 2.395257663238492], [59.263305195404044, 0.0769719594119194, 1.656472571962747], [70.80702057150556, 0.2225821973049414, 0.8130531350203057], [75.57510789095737, 0.1841771726394465, 0.7210488469019684], [77.65205461107408, 0.42722231622395374, 0.2722328387524846]], "peak_params_": [[8.075750920261521, 0.7083173085010693, 1.5530149515193252], [12.886444393595303, 0.6626717651817609, 5.474025088619587], [19.864676601159314, 0.4516723434206198, 8.94343842666888], [24.994795313779782, 0.40274970954233635, 0.5001825615237577], [30.465982193135346, 0.2536973488814951, 4.790515326476984], [59.263305195404044, 0.07600565828839079, 3.312945143925494], [70.80702057150556, 0.2164000071321266, 1.6261062700406115], [75.57510789095737, 0.15482244347899043, 1.4420976938039367], [77.65205461107408, 0.18941161531144823, 0.5444656775049692]], "r_squared_": 0.9945151839006388, "error_": 0.03354414725332837}
{"freq_range": [2.0, 80.0], "freq_res": 1.0, "aperiodic_params_": [0.7318120675864963, 1.2887503253688042], "gaussian_params_": [[8.08620152476584, 0.6040906435499781, 0.8852754685500377], [12.600281175734173, 0.5352711164461453, 1.9815207966112864], [16.4410438198564, 0.26902376689104646, 0.9415827254589971], [20.38589129552642, 0.4210424925156283, 5.999999999999999], [70.96215268595242, 0.21662693809637473, 0.8484744483109986]], "peak_params_": [[8.08620152476584, 0.6873915728976626, 1.7705509371000754], [12.600281175734173, 0.7221982599171697, 3.963041593222573], [16.4410438198564, 0.6862463680701554, 1.8831654509179943], [20.38589129552642, 0.4208867461844936, 11.999999999999998], [70.96215268595242, 0.21641153147766823, 1.6969488966219972]], "r_squared_": 0.9914644947362928, "error_": 0.04375842149949741}
{"freq_range": [2.0, 80.0], "freq_res": 1.0, "aperiodic_params_": [0.5789828519244731, 1.1986910034449145], "gaussian_params_": [[12.953815267964655, 0.7225090396743824, 4.329711683147034], [21.933310705855998, 0.10361930570471758, 0.25028673209873453], [22.452034600017733, 0.28341072054844924, 3.967245273792245], [70.54060373852056, 0.5027084368636485, 0.2644372062952862], [75.62414049641193, 0.11037562294755461, 5.999999999999999]], "peak_params_": [[12.953815267964655, 0.7390562812221343, 8.659423366294067], [21.933310705855998, 0.463040333739424, 0.5005734641974691], [22.452034600017733, 0.463040333739424, 7.93449054758449], [70.54060373852056, 0.1931757955159077, 0.5288744125905724], [75.62414049641193, 0.11015926853826707, 11.999999999999998]], "r_squared_": 0.9853563348814722, "error_": 0.051686172318929295}
{"freq_range": [2.0, 80.0], "freq_res": 1.0, "aperiodic_params_": [0.47990619676273594, 1.117055418481914], "gaussian_params_": [[8.44636974294402, 0.6867836674509308, 0.37423155886496096], [14.211216819265378, 0.7803740145458391, 4.740474771084072], [67.4845624162303, 0.5651603863682919, 0.27557354653068244], [70.62900192303547, 0.145555180592627, 5.999999999999999], [78.32885270459802, 0.40001011264261044, 0.250037057033528]], "peak_params_": [[8.44636974294402, 0.6679602658238641, 0.7484631177299219], [14.211216819265378, 0.7795997834784699, 9.480949542168144], [67.4845624162303, 0.24166579301084679, 0.5511470930613649], [70.62900192303547, 0.14527719426116037, 11.999999999999998], [78.32885270459802, 0.23688178893055856, 0.500074114067056]], "r_squared_": 0.9826743250168878, "error_": 0.057134696482428256}
{"freq_range": [2.0, 80.0], "freq_res": 1.0, "aperiodic_params_": [0.1565370064557223, 1.0834009947716001], "gaussian_params_": [[8.328604419763245, 0.6095676392846152, 1.005159623583482], [11.884449570018848, 0.5535734065842646, 2.944093245399297], [17.69869912882212, 0.41395169249162256, 4.5992294794715844], [68.43386574075207, 0.5469681648483543, 0.2912482806777682], [70.56198059284817, 0.2159862053241235, 0.6752157404587011], [75.46986468883522, 0.20987073637911147, 0.5972544647990018]], "peak_params_": [[8.328604419763245, 0.8544775131335351, 2.010319247166964], [11.884449570018848, 0.7460399884552709, 5.888186490798594], [17.69869912882212, 0.4770691616879422, 9.198458958943169], [68.43386574075207, 0.180497630987978, 0.5824965613555364], [70.56198059284817, 0.17500280689778602, 1.3504314809174023], [75.46986468883522, 0.1540130431780944, 1.1945089295980036]], "r_squared_": 0.9905579546257741, "error_": 0.04396200734096627}
{"freq_range": [2.0, 80.0], "freq_res": 1.0, "aperiodic_params_": [0.40483552168836184, 1.1544325736473557], "gaussian_params_": [[8.10154021250068, 0.5465931347392686, 0.992131825965384], [15.152460861053349, 0.7445298397203809, 5.116373479087761], [72.45203459913596, 0.11895372912447158, 5.999999999999999]], "peak_params_": [[8.10154021250068, 0.823968753279245, 1.984263651930768], [15.152460861053349, 0.7441993576194088, 10.232746958175522], [72.45203459913596, 0.11861661821766112, 11.999999999999998]], "r_squared_": 0.9859679002628406, "error_": 0.059450486647316676}
{"freq_range": [2.0, 80.0], "freq_res": 1.0, "aperiodic_params_": [0.5944342119671691, 1.2772580652571213], "gaussian_params_": [[7.99016772870727, 0.552917787576112, 0.847918274831195], [15.677548883486576, 0.7676877271951711, 5.446037722798596], [71.94250465829872, 0.1444602467055521, 4.448402904598294]], "peak_params_": [[7.99016772870727, 0.8370828955040877, 1.69583654966239], [15.677548883486576, 0.7663432900034534, 10.892075445597191], [71.94250465829872, 0.14444818087265254, 8.896805809196588]], "r_squared_": 0.9868998178485445, "error_": 0.0588123977153002}
{"freq_range": [2.0, 80.0], "freq_res": 1.0, "aperiodic_params_": [0.6554018553112683, 1.291476044294881], "gaussian_params_": [[8.001737741797324, 0.6420253207648996, 0.8278639375839142], [12.989074935933264, 0.47467299092559495, 3.030269069751157], [18.984063827391598, 0.4440068113597434, 5.191104720714336], [24.963182223262418, 0.10283913592583538, 0.2500493625357141]], "peak_params_": [[8.001737741797324, 0.8117576381697226, 1.6557278751678284], [12.989074935933264, 0.7031432826108578, 6.060538139502314], [18.984063827391598, 0.5103741846685448, 10.382209441428673], [24.963182223262418, 0.32877214474277583, 0.5000987250714282]], "r_squared_": 0.9864119891020221, "error_": 0.05714321193250654}
{"freq_range": [2.0, 80.0], "freq_res": 1.0, "aperiodic_params_": [0.7822563841388884, 1.3844772020678968], "gaussian_params_": [[8.059188557485028, 0.6417700382496857, 0.7958737849817829], [13.233425329950387, 0.5339083041703249, 3.03295874636442], [20.239578732979915, 0.37856203391344584, 5.658413613277278], [70.38650070807063, 0.17327744975555012, 2.070517734744267], [75.37119377975826, 0.22805774356150674, 0.47306975266779183], [77.51594445239917, 0.5632891065917955, 0.30605321904297755]], "peak_params_": [[8.059188557485028, 0.7969679177688267, 1.5917475699635657], [13.233425329950387, 0.6993139951249425, 6.06591749272884], [20.239578732979915, 0.4225462048170656, 11.316827226554556], [70.38650070807063, 0.1702846548499879, 4.141035469488534], [75.37119377975826, 0.1821063513979977, 0.9461395053355837], [77.51594445239917, 0.161466705567904, 0.6121064380859551]], "r_squared_": 0.9921765462890727, "error_": 0.04424462784492701}
{"freq_range": [2.0, 80.0], "freq_res": 1.0, "aperiodic_params_": [0.8175946618386165, 1.3801956595952007], "gaussian_params_": [[8.081204603049208, 0.6518892107726022, 0.8451405396652296], [12.675948707540176, 0.5471318050487314, 2.1801917886717552], [16.455365172668987, 0.2311894743201017, 0.9294480277510037], [20.025324347638403, 0.36823178556342073, 5.701878598657463], [70.25959213668484, 0.15669581971552798, 2.6321679166658742], [76.77472154838938, 0.130829542035981, 1.4464843431881764]], "peak_params_": [[8.081204603049208, 0.7435791499148503, 1.6902810793304592], [12.675948707540176, 0.7137263830574075, 4.3603835773435105], [16.455365172668987, 0.6631793309700683, 1.8588960555020073], [20.025324347638403, 0.3703274785589472, 11.403757197314926], [70.25959213668484, 0.1559378762711534, 5.2643358333317485], [76.77472154838938, 0.13515571000591553, 2.892968686376353]], "r_squared_": 0.9914976491723594, "error_": 0.04476152187346668}
{"freq_range": [2.0, 80.0], "freq_res": 1.0, "aperiodic_params_": [0.7719990770911059, 1.353774840996571], "gaussian_params_": [[14.055422929042559, 0.76084235175895, 5.3084237861183015], [24.838614779782354, 0.24695578079853303, 0.8562443727713783], [72.56679115153749, 0.13328078002944482, 5.972474712620134]], "peak_params_": [[14.055422929042559, 0.7608008849492486, 10.616847572236603], [24.838614779782354, 0.33344302067905274, 1.7124887455427567], [72.56679115153749, 0.13293063140516503, 11.944949425240267]], "r_squared_": 0.9843412634524412, "error_": 0.05778418492591422}
{"freq_range": [2.0, 80.0], "freq_res": 1.0, "aperiodic_params_": [0.6730355242898285, 1.2955144466504978], "gaussian_params_": [[8.103055527570232, 0.46481909661777415, 0.842678294322356], [14.29942697133197, 0.8149667670514166, 4.269117041371934], [21.61365824929151, 0.7988352690709597, 0.2612505120755513], [24.71633882557715, 0.25120590943935345, 0.8510311763703183], [67.18105908818593, 0.2122718595224965, 0.9115770461020622], [70.83618352205285, 0.24066921674176125, 0.887183775999827], [76.6837242539022, 0.16961935800498998, 2.642326956702847]], "peak_params_": [[8.103055527570232, 0.7357262486377845, 1.685356588644712], [14.29942697133197, 0.8129646861922766, 8.538234082743868], [21.61365824929151, 0.4293819042412049, 0.5225010241511026], [24.71633882557715, 0.2728606751343914, 1.7020623527406367], [67.18105908818593, 0.20835228271989292, 1.8231540922041245], [70.83618352205285, 0.25341239404480764, 1.774367551999654], [76.6837242539022, 0.16840862197755446, 5.284653913405694]], "r_squared_": 0.9919591038472203, "error_": 0.04132700636543974}
{"freq_range": [2.0, 80.0], "freq_res": 1.0, "aperiodic_params_": [0.47903786478925897, 1.1738857227751553], "gaussian_params_": [[8.365121919975824, 0.4538469542498783, 0.6583563834825178], [13.759682549968765, 0.7530240982681137, 4.068638234565682], [21.595588312801418, 0.7173785450023725, 0.2613292261342602], [57.41588213154454, 0.7636832382728915, 0.26002070394015864], [67.45118310895427, 0.4875547403347523, 0.2639162598947261], [71.33916354025993, 0.13634117859716893, 4.843900489922198], [77.61448262960356, 0.5668130668359116, 0.25001239600126446]], "peak_params_": [[8.365121919975824, 0.6656204248320174, 1.3167127669650356], [13.759682549968765, 0.7517116789696912, 8.137276469131365], [21.595588312801418, 0.3134777775253983, 0.5226584522685204], [57.41588213154454, 0.21423485190306968, 0.5200414078803173], [67.45118310895427, 0.20435931017478826, 0.5278325197894522], [71.33916354025993, 0.1360073736594467, 9.687800979844395], [77.61448262960356, 0.22560069273452155, 0.5000247920025289]], "r_squared_": 0.9904408545392016, "error_": 0.038753167328293654}
{"freq_range": [2.0, 80.0], "freq_res": 1.0, "aperiodic_params_": [0.14073448489400758, 1.07174192911023], "gaussian_params_": [[8.573178838617904, 0.4269691740136885, 1.4040527744967546], [14.672416633029366, 0.7625915104979154, 4.678239470843578], [70.73409435433832, 0.19239425292903622, 0.7265751553068377]], "peak_params_": [[8.573178838617904, 0.7733229968298103, 2.808105548993509], [14.672416633029366, 0.760736277302001, 9.356478941687156], [70.73409435433832, 0.17993203124953605, 1.4531503106136754]], "r_squared_": 0.9890559855619767, "error_": 0.04589636179485323}
{"freq_range": [2.0, 80.0], "freq_res": 1.0, "aperiodic_params_": [0.4255416747425329, 1.2162383750369015], "gaussian_params_": [[8.087342941149405, 0.47713922996668867, 0.9654297510655367], [14.736522957319579, 0.8353141962518152, 4.878875784234454]], "peak_params_": [[8.087342941149405, 0.7971959584205579, 1.9308595021310735], [14.736522957319579, 0.834097031691656, 9.757751568468908]], "r_squared_": 0.9876515212163997, "error_": 0.055053375545358274}
{"freq_range": [2.0, 80.0], "freq_res": 1.0, "aperiodic_params_": [0.540218785976357, 1.2675145454197534], "gaussian_params_": [[7.995700490883513, 0.5344363596522608, 0.7981539768756706], [14.959407303896402, 0.8396418202392147, 5.063425336334104]], "peak_params_": [[7.995700490883513, 0.8609265935387702, 1.5963079537513412], [14.959407303896402, 0.8396148388652163, 10.126850672668208]], "r_squared_": 0.9842138726881164, "error_": 0.06675389654052165}
{"freq_range": [2.0, 80.0], "freq_res": 1.0, "aperiodic_params_": [0.7359727044537091, 1.3770944297484253], "gaussian_params_": [[8.063208871208763, 0.6457251538925416, 0.7955462713428236], [12.953770041486582, 0.5469182467553029, 3.091526483590263], [18.859995550989158, 0.3830503981478156, 4.511130295829615], [24.716324947503182, 0.2985113713972513, 0.2500532006795258], [70.54030291698403, 0.18750603736502763, 2.2983045150621932], [75.244677501159, 0.2266866802979286, 0.45742510456191776], [77.51198010684445, 0.235530560278039, 0.7049401819938784]], "peak_params_": [[8.063208871208763, 0.8163023150993762, 1.5910925426856473], [12.953770041486582, 0.7116114125254105, 6.183052967180526], [18.859995550989158, 0.4636544831376268, 9.02226059165923], [24.716324947503182, 0.30882819095234815, 0.5001064013590516], [70.54030291698403, 0.1837925903844304, 4.5966090301243865], [75.244677501159, 0.2254180325629187, 0.9148502091238355], [77.51198010684445, 0.1863104940072109, 1.4098803639877568]], "r_squared_": 0.9918965935417402, "error_": 0.04196751118787585}
{"freq_range": [2.0, 80.0], "freq_res": 1.0, "aperiodic_params_": [0.7671552336258443, 1.363627627063932], "gaussian_params_": [[8.058932363590532, 0.6288444527224201, 0.8555441246130688], [13.030164133707526, 0.7277789722829944, 2.77815896496392], [17.43784143178243, 0.3705236805098368, 1.4932700749824768], [20.327901967413347, 0.2904563181646371, 0.8329879091787044], [22.429650909070233, 1.086218634190804, 0.27795450396712285], [24.826052959567722, 0.28553972501012886, 0.8092509489497125], [71.30711067522627, 0.1350595730115716, 5.999999999999997], [75.3522167436056, 0.2040857535203519, 0.2552568988945524], [77.51999393630416, 0.3090153321195301, 0.33371178675107044]], "peak_params_": [[8.058932363590532, 0.7686482144379123, 1.7110882492261377], [13.030164133707526, 0.7322125971356851, 5.55631792992784], [17.43784143178243, 0.6172195843083441, 2.9865401499649535], [20.327901967413347, 0.38510491619781195, 1.6659758183574087], [22.429650909070233, 0.37573116218833813, 0.5559090079342457], [24.826052959567722, 0.279087777787868, 1.618501897899425], [71.30711067522627, 0.13488276649044528, 11.999999999999995], [75.3522167436056, 0.19052576750603034, 0.5105137977891048], [77.51999393630416, 0.18232648790728034, 0.6674235735021409]], "r_squared_": 0.9910345634567386, "error_": 0.039513680397142155}
{"freq_range": [2.0, 80.0], "freq_res": 1.0, "aperiodic_params_": [0.6899954253722942, 1.3060698102764101], "gaussian_params_": [[8.031378293706064, 0.46828632894114414, 0.6980167104415754], [14.328923292457494, 0.740280484862603, 4.749606112010416], [72.05945531408136, 0.1837606227518855, 5.999999999999592]], "peak_params_": [[8.031378293706064, 0.7724837966150115, 1.3960334208831509], [14.328923292457494, 0.7385074398378885, 9.499212224020832], [72.05945531408136, 0.1837516010047202, 11.999999999999185]], "r_squared_": 0.9869479417299902, "error_": 0.05558429600908595}
{"freq_range": [2.0, 80.0], "freq_res": 1.0, "aperiodic_params_": [0.5944284313116706, 1.2491511995103497], "gaussian_params_": [[8.158833893164479, 0.4435927996455007, 0.7043835329892816], [14.036236025662921, 0.7576019971062617, 4.554778511174029], [72.58769480506658, 0.19575078116020372, 5.999999999999999]], "peak_params_": [[8.158833893164479, 0.7472799583386944, 1.4087670659785632], [14.036236025662921, 0.7575780225358276, 9.109557022348058], [72.58769480506658, 0.1952891490322941, 11.999999999999998]], "r_squared_": 0.9833092451610446, "error_": 0.05980765733306578}
{"freq_range": [2.0, 80.0], "freq_res": 1.0, "aperiodic_params_": [0.415001375971445, 1.117506303765404], "gaussian_params_": [[8.272691183370542, 0.45256861924827096, 0.6242337486790702], [13.749232882525874, 0.6912756966525858, 4.118194273179264], [50.631520516750406, 0.29856836851548607, 0.4504924322730906], [67.17925076501972, 0.229435588245082, 0.7750686979647954], [70.71657354589419, 0.21279121480165303, 0.8521257886853142], [76.47214388496558, 0.19798876815262942, 3.6286856578872664]], "peak_params_": [[8.272691183370542, 0.6722604458033357, 1.2484674973581404], [13.749232882525874, 0.6899952948100442, 8.236388546358528], [50.631520516750406, 0.21367994284203262, 0.9009848645461812], [67.17925076501972, 0.2299584959958536, 1.5501373959295908], [70.71657354589419, 0.2648480153726356, 1.7042515773706284], [76.47214388496558, 0.19631989424013407, 7.257371315774533]], "r_squared_": 0.9828651824086281, "error_": 0.05111307434924761}
{"freq_range": [2.0, 80.0], "freq_res": 1.0, "aperiodic_params_": [-0.3936163627857398, 0.8417364124175223], "gaussian_params_": [[7.727218967124558, 0.5326072009169183, 0.31939646192241755], [9.632006463915914, 0.3661411327075271, 0.6176395570516104], [14.579458913346388, 0.602135291124816, 3.6959886055364315]], "peak_params_": [[7.727218967124558, 0.5044707870754787, 0.6387929238448351], [9.632006463915914, 0.586059956963296, 1.2352791141032209], [14.579458913346388, 0.5982500783908459, 7.391977211072863]], "r_squared_": 0.9808513408948751, "error_": 0.04798823175235336}
{"freq_range": [2.0, 80.0], "freq_res": 1.0, "aperiodic_params_": [0.31441635033782633, 1.1829526578195633], "gaussian_params_": [[8.419129297661408, 0.4259001904279965, 1.145639903077139], [14.635903421073403, 0.8031845492966333, 4.256354772047415], [75.10314911794055, 0.2549306933278063, 0.5900393477156723]], "peak_params_": [[8.419129297661408, 0.6365649252806066, 2.291279806154278], [14.635903421073403, 0.800251331172109, 8.51270954409483], [75.10314911794055, 0.2510648227085368, 1.1800786954313447]], "r_squared_": 0.9851931568840145, "error_": 0.05700425343916719}
{"freq_range": [2.0, 80.0], "freq_res": 1.0, "aperiodic_params_": [0.5763073200231527, 1.3169120212647667], "gaussian_params_": [[8.085964145807827, 0.5269345243261097, 0.7193399838050614], [14.542251193376769, 0.8213606714211557, 4.615620214215663], [24.562768309603673, 0.7172069907015867, 0.25006292597919316], [70.31343099013581, 0.11939997816261298, 5.99999916467422], [76.50435042218776, 0.09909974061097994, 1.392306565749241]], "peak_params_": [[8.085964145807827, 0.8239803246666322, 1.4386799676101227], [14.542251193376769, 0.8173313604762296, 9.231240428431326], [24.562768309603673, 0.21858494630381875, 0.5001258519583863], [70.31343099013581, 0.11923898346972317, 11.99999832934844], [76.50435042218776, 0.15718303802763822, 2.784613131498482]], "r_squared_": 0.9877073359608625, "error_": 0.055409988175881206}
{"freq_range": [2.0, 80.0], "freq_res": 1.0, "aperiodic_params_": [0.6799879224117134, 1.3616648261340851], "gaussian_params_": [[8.180453104026885, 0.7152619043022901, 0.7712285202624731], [10.43475435284184, 0.36567770233977814, 0.3199227596801586], [13.337866410210603, 0.5331803505922732, 2.68828645990611], [18.394194168829696, 0.35347739550836754, 3.8693933101025895], [71.59918666389322, 0.16553399199987404, 5.999999999999999], [75.00246023666871, 0.10578510026670496, 0.25004532328369056], [77.47795728803659, 0.4655627145891599, 0.29848855213225284]], "peak_params_": [[8.180453104026885, 0.7797880607553079, 1.5424570405249463], [10.43475435284184, 0.4697493575572788, 0.6398455193603172], [13.337866410210603, 0.6627540860412311, 5.37657291981222], [18.394194168829696, 0.4701659711504069, 7.738786620205179], [71.59918666389322, 0.16516505297559458, 11.999999999999998], [75.00246023666871, 0.24674956853832652, 0.5000906465673811], [77.47795728803659, 0.23957720635216995, 0.5969771042645057]], "r_squared_": 0.9871858921316405, "error_": 0.051594969205344975}
{"freq_range": [2.0, 80.0], "freq_res": 1.0, "aperiodic_params_": [0.6285317147376233, 1.2824480216740175], "gaussian_params_": [[8.093176534245961, 0.5632553771348764, 0.7101274736925403], [11.078607476283914, 0.2453756584252196, 2.125993676370446], [15.192938612131464, 0.5881838607200475, 4.151525583472096], [21.658016530828025, 0.3275785336060515, 0.2660069430032765], [71.64269101256538, 0.17118938283281485, 5.999999999999999], [77.43000806712645, 0.5982122625070153, 0.25000799571540394]], "peak_params_": [[8.093176534245961, 0.7755420068059207, 1.4202549473850805], [11.078607476283914, 0.5985304091117731, 4.251987352740892], [15.192938612131464, 0.6323263700224726, 8.303051166944192], [21.658016530828025, 0.2967180536461014, 0.532013886006553], [71.64269101256538, 0.17088610042199548, 11.999999999999998], [77.43000806712645, 0.25119992231032895, 0.5000159914308079]], "r_squared_": 0.9867301151940463, "error_": 0.05039774603683247}
{"freq_range": [2.0, 80.0], "freq_res": 1.0, "aperiodic_params_": [0.37475984189074535, 1.0374084838847748], "gaussian_params_": [[8.194932529326271, 0.510373247826749, 0.6105151908104952], [12.030027060261224, 0.6026598420692423, 2.598921868776666], [17.406940203865087, 0.3511373835346404, 1.8475137767239402], [21.593721097460914, 0.7612839221763267, 0.25000000000028616], [67.43878208224038, 0.5238349654721183, 0.2663230619389485], [70.51432732509194, 0.47226351609977535, 0.27174823102868323], [74.52518407653224, 0.1924176788848764, 5.999999999999999]], "peak_params_": [[8.194932529326271, 0.6661177636849318, 1.2210303816209904], [12.030027060261224, 0.6074681423910215, 5.197843737553332], [17.406940203865087, 0.43954326577446107, 3.6950275534478805], [21.593721097460914, 0.21962102997829724, 0.5000000000005723], [67.43878208224038, 0.22245564949964858, 0.532646123877897], [70.51432732509194, 0.2575432844807881, 0.5434964620573665], [74.52518407653224, 0.1918161129160334, 11.999999999999998]], "r_squared_": 0.9765826419524742, "error_": 0.05452381662244744}
{"freq_range": [2.0, 80.0], "freq_res": 1.0, "aperiodic_params_": [-0.17322770425158895, 0.5665050940846051], "gaussian_params_": [[8.469002363174468, 1.8641064962892417, 0.27573602907916694], [10.570862850970826, 0.40011571284726555, 0.6276649423842879], [12.507018790991058, 1.034855739437329, 0.2872876823502217], [14.760277077570882, 0.19807264927241452, 2.201374443449767], [21.577613216220893, 0.6500962921980337, 0.25000452983624694], [46.92623310694637, 0.18553599202776183, 0.9598365965160494], [50.5423090065966, 0.8126150797766365, 0.2568706852524613], [59.60354324190509, 0.10380057500139474, 4.463906829554556], [67.46577843129067, 0.718078260304611, 0.27073038224443435], [71.78373460332392, 0.1413909703964784, 2.3434206340601746], [76.95405386427792, 0.25316825446319297, 0.6361254702366171]], "peak_params_": [[8.469002363174468, 0.44064094560660744, 0.5514720581583339], [10.570862850970826, 0.3627751041969183, 1.2553298847685759], [12.507018790991058, 0.3814897608898496, 0.5745753647004433], [14.760277077570882, 0.19690169776445088, 4.402748886899534], [21.577613216220893, 0.15689250611335137, 0.5000090596724939], [46.92623310694637, 0.18691706220186877, 1.9196731930320987], [50.5423090065966, 0.18236936437668083, 0.5137413705049226], [59.60354324190509, 0.10339245384965201, 8.927813659109113], [67.46577843129067, 0.20737134658114398, 0.5414607644888687], [71.78373460332392, 0.14298583210485494, 4.686841268120349], [76.95405386427792, 0.2644328602431253, 1.2722509404732343]], "r_squared_": 0.9396147181781498, "error_": 0.04209684961358729}
{"freq_range": [2.0, 80.0], "freq_res": 1.0, "aperiodic_params_": [0.44065225332050123, 1.2485800544439754], "gaussian_params_": [[8.252723618245108, 0.49921957376170345, 0.6222040933042354], [14.418101728994433, 0.7173229694930071, 4.285691256398088], [73.47370147636519, 0.17522277146229684, 5.999999999999996], [74.99142919148115, 0.11691272339236286, 0.2500560917076825]], "peak_params_": [[8.252723618245108, 0.6934242488131135, 1.2444081866084709], [14.418101728994433, 0.7139175237206429, 8.571382512796175], [73.47370147636519, 0.17467752739805942, 11.999999999999991], [74.99142919148115, 0.2864881773413235, 0.500112183415365]], "r_squared_": 0.9858227741424873, "error_": 0.053849798984819244}
{"freq_range": [2.0, 80.0], "freq_res": 1.0, "aperiodic_params_": [0.3401925943539366, 1.11079037629158], "gaussian_params_": [[8.335450285407003, 0.6168373841496353, 0.5050948349283699], [14.171687095234144, 0.5954336306667612, 4.121718538554823], [17.98386033374645, 0.10126180990582247, 0.2501205754643555]], "peak_params_": [[8.335450285407003, 0.6888340897764411, 1.0101896698567399], [14.171687095234144, 0.5949172932028313, 8.243437077109647], [17.98386033374645, 0.48786427189203097, 0.500241150928711]], "r_squared_": 0.9697143906120835, "error_": 0.07193391687896271}
{"freq_range": [2.0, 80.0], "freq_res": 1.0, "aperiodic_params_": [0.4493375424123146, 1.1063966126275557], "gaussian_params_": [[8.43197302343716, 1.3145719038408714, 0.3011746812962927], [13.576747334179212, 0.5112409094864451, 3.929088072615592], [17.557577227728263, 0.6299352007091398, 0.2500006093221474], [65.9040691982759, 0.12294840944003194, 5.999999999999519], [76.74465354802996, 0.17289281076841445, 5.101057744438453]], "peak_params_": [[8.43197302343716, 0.6566806028881518, 0.6023493625925854], [13.576747334179212, 0.5082832227285646, 7.858176145231184], [17.557577227728263, 0.4028765543765256, 0.5000012186442948], [65.9040691982759, 0.1417410265157808, 11.999999999999037], [76.74465354802996, 0.19491359285656795, 10.202115488876906]], "r_squared_": 0.9794658811027408, "error_": 0.05447865629830667}
{"freq_range": [2.0, 80.0], "freq_res": 1.0, "aperiodic_params_": [-0.44996652218914374, 1.033577526165973], "gaussian_params_": [[8.449466337311378, 0.46049818983150537, 0.5806175430693271], [10.79111175744904, 0.3338870913080558, 2.0807423836658185], [15.490395991388407, 0.48138415277244706, 3.365119620946742], [20.17156710069616, 0.15872552587253774, 0.6178912761507541], [21.78282499358008, 0.36775736255234964, 0.25001863567601945], [57.44411508201123, 0.5642597598938205, 0.3107328078009984], [64.40237256072909, 0.10457537532309714, 2.436047161607454], [74.5661188513704, 0.17847550841404478, 4.702316416866307]], "peak_params_": [[8.449466337311378, 0.5174855324045087, 1.1612350861386542], [10.79111175744904, 0.529861623879919, 4.161484767331637], [15.490395991388407, 0.5194624377235353, 6.730239241893484], [20.17156710069616, 0.34886226541145593, 1.2357825523015082], [21.78282499358008, 0.3282930175483054, 0.5000372713520389], [57.44411508201123, 0.2043889945219246, 0.6214656156019968], [64.40237256072909, 0.11745395356095845, 4.872094323214908], [74.5661188513704, 0.1777255055390623, 9.404632833732615]], "r_squared_": 0.9864712494244384, "error_": 0.04029121351127682}
{"freq_range": [2.0, 80.0], "freq_res": 1.0, "aperiodic_params_": [-0.23906089690202834, 0.859429633505358], "gaussian_params_": [[3.034195369187559, 0.1875515083029902, 0.2500000000000012], [8.13206691034837, 0.6513230283629624, 0.8496214387737631], [12.5395614026425, 0.47801290967249627, 2.6290027652574133], [18.861495396924198, 0.43362189003899415, 3.0292098503128546], [21.990360869672813, 0.10218512381205398, 0.2500000011956232], [24.785849923002807, 0.11465269630357043, 1.2639229029265826]], "peak_params_": [[3.034195369187559, 0.1864669257413779, 0.5000000000000024], [8.13206691034837, 0.7518483473285797, 1.6992428775475261], [12.5395614026425, 0.5374292128099435, 5.2580055305148266], [18.861495396924198, 0.4565151209745355, 6.058419700625709], [21.990360869672813, 0.36646894474876723, 0.5000000023912464], [24.785849923002807, 0.16866764467062656, 2.527845805853165]], "r_squared_": 0.9819796721930404, "error_": 0.049395794008787734}
{"freq_range": [2.0, 80.0], "freq_res": 1.0, "aperiodic_params_": [0.22847340100482502, 1.1884359262263235], "gaussian_params_": [[8.799002464453327, 0.685744616367694, 0.9945698854216575], [14.410185628404575, 0.5812338966682431, 4.075422388585337], [62.356103818693455, 0.1982351239089821, 5.999999999999999], [75.98587561885466, 0.22272723766973, 5.132556950240512]], "peak_params_": [[8.799002464453327, 0.9126920901923791, 1.989139770843315], [14.410185628404575, 0.5782981388324843, 8.150844777170674], [62.356103818693455, 0.20332377665917734, 11.999999999999998], [75.98587561885466, 0.23766509440692496, 10.265113900481024]], "r_squared_": 0.9719642636227681, "error_": 0.07043508965127857}
{"freq_range": [2.0, 80.0], "freq_res": 1.0, "aperiodic_params_": [0.08936253106414838, 0.9607199057237822], "gaussian_params_": [[8.231494667385014, 0.6103531165490743, 0.7820021920482659], [13.538943123756212, 0.5478655151327494, 3.1884023762474953], [19.545410893561574, 0.18432248197892465, 1.3670189818348557], [21.452034599147503, 0.28630247475544873, 3.9885685447273485]], "peak_params_": [[8.231494667385014, 0.7063122066749703, 1.5640043840965319], [13.538943123756212, 0.5921997150640047, 6.376804752494991], [19.545410893561574, 0.5126571742604776, 2.7340379636697114], [21.452034599147503, 0.4245636209355619, 7.977137089454697]], "r_squared_": 0.9748870141344456, "error_": 0.06179085227949728}
