{"freq_range": [2.0, 80.0], "freq_res": 1.0, "aperiodic_params_": [0.2377479236921137, 0.9712964558447668], "gaussian_params_": [[10.255426264675343, 0.48704303629657586, 2.546029061260261], [14.756138742243683, 0.29499810966181444, 0.3808201531299842], [42.70664726381805, 0.24816421048053572, 0.2691304453070821], [49.681797587922986, 0.11428119497952606, 2.4514356504380217], [52.9013812837576, 0.15498907517868749, 0.503880510502147], [56.26805929964064, 0.23433761758804605, 0.7652253270497231], [59.44073116135324, 0.1860034963885427, 1.242760583663316], [63.9732512455808, 0.2306956089389561, 1.2168706344037639], [69.09082876682476, 0.1673708600741493, 1.2661456612008268], [70.5927063560658, 0.4332055352418154, 0.2861449761948749], [75.19738194493563, 0.21830113824316, 2.5421494031330716]], "peak_params_": [[10.255426264675343, 0.4845982020377637, 5.092058122520522], [14.756138742243683, 0.3261108329689164, 0.7616403062599684], [42.70664726381805, 0.1397922761182322, 0.5382608906141642], [49.681797587922986, 0.11332250487507456, 4.902871300876043], [52.9013812837576, 0.19779675528597895, 1.007761021004294], [56.26805929964064, 0.22854536745666754, 1.5304506540994463], [59.44073116135324, 0.17520478114962268, 2.485521167326632], [63.9732512455808, 0.23092721184172538, 2.4337412688075277], [69.09082876682476, 0.17816841888607082, 2.5322913224016537], [70.5927063560658, 0.26686294069365246, 0.5722899523897498], [75.19738194493563, 0.21764722778671675, 5.084298806266143]], "r_squared_": 0.985178179119916, "error_": 0.033810935844854936}
{"freq_range": [2.0, 80.0], "freq_res": 1.0, "aperiodic_params_": [0.21607204840019914, 0.9305177943491622], "gaussian_params_": [[7.924767057903268, 0.2444989257322347, 0.9375213119793486], [10.875203126459516, 0.44081376515832105, 2.164100875414792], [14.62033262013208, 0.5837052469558299, 0.28720500825687745], [50.47979438942751, 0.18196581767760148, 5.999999999999999], [62.97488079891074, 0.1126759077143123, 0.25008059223999607], [66.48705802271895, 0.1687788782063454, 5.999999999642958], [71.38704450934331, 0.3287805794916446, 0.3203664437591918], [73.4722815678939, 0.12222292124934736, 0.7493863949145183], [76.76776467938491, 0.16138798637872592, 0.583682086373414], [79.3543025130488, 0.17520667079389998, 0.7081036804291871]], "peak_params_": [[7.924767057903268, 0.42608460267183285, 1.8750426239586973], [10.875203126459516, 0.44120828501374215, 4.328201750829584], [14.62033262013208, 0.3153044444791764, 0.5744100165137549], [50.47979438942751, 0.1852550104268269, 11.999999999999998], [62.97488079891074, 0.2752890756425259, 0.5001611844799921], [66.48705802271895, 0.17463657779178132, 11.999999999285915], [71.38704450934331, 0.28672465428752236, 0.6407328875183836], [73.4722815678939, 0.19400735684251358, 1.4987727898290366], [76.76776467938491, 0.18617849171989365, 1.167364172746828], [79.3543025130488, 0.1738834968762628, 1.4162073608583743]], "r_squared_": 0.9829450309639091, "error_": 0.03529303106920209}
{"freq_range": [2.0, 80.0], "freq_res": 1.0, "aperiodic_params_": [0.35282397951896965, 0.9091303526004786], "gaussian_params_": [[9.497748449529292, 0.3508072945988766, 2.631530404050163], [15.13489782979938, 0.15045517372139824, 0.2500632649672236], [21.065739354281906, 0.19186390794705907, 0.6999410415047382], [41.70703972358343, 0.20924176894549112, 1.5729998312826432], [45.30127406939191, 0.15968914961841502, 0.5904155006350822], [48.05894638698183, 0.1300060373758694, 0.9162583024656028], [50.427105785726255, 0.3705477919825816, 0.318397175558543], [52.73727368863811, 0.22042695796178552, 1.0360162445077297], [56.576580836319536, 0.7832099814432404, 0.2815320948456739], [59.03888004768452, 0.22314270664660693, 1.6352044263080374], [63.41852509709756, 0.24951205534845525, 1.8178572549932936], [68.79422903250736, 0.16604807654469758, 0.3410843096034859], [70.48748831767371, 0.38470072991302195, 0.2804218947521901], [75.3622533632376, 0.2721879901832791, 3.9622329202701225]], "peak_params_": [[9.497748449529292, 0.3445876864026538, 5.263060808100326], [15.13489782979938, 0.16950303165915348, 0.5001265299344472], [21.065739354281906, 0.19104445042864782, 1.3998820830094765], [41.70703972358343, 0.20564415318824036, 3.1459996625652864], [45.30127406939191, 0.16407877640601387, 1.1808310012701644], [48.05894638698183, 0.1298182926010003, 1.8325166049312056], [50.427105785726255, 0.17120404127123612, 0.636794351117086], [52.73727368863811, 0.21369584188113322, 2.0720324890154593], [56.576580836319536, 0.3558597328895339, 0.5630641896913477], [59.03888004768452, 0.23614130123264054, 3.270408852616075], [63.41852509709756, 0.2569478845350852, 3.6357145099865873], [68.79422903250736, 0.21564754850775292, 0.6821686192069718], [70.48748831767371, 0.1945050901206844, 0.5608437895043802], [75.3622533632376, 0.2710527795927149, 7.924465840540245]], "r_squared_": 0.9782622899969291, "error_": 0.033064270636718546}
{"freq_range": [2.0, 80.0], "freq_res": 1.0, "aperiodic_params_": [0.056714534038618494, 0.6319862413981685], "gaussian_params_": [[9.625783210379666, 0.4197877410185541, 3.176319506146313], [43.40787460517586, 0.4029006054347912, 0.2672778022841717], [46.71781331021936, 0.17330092964402163, 2.180001247501437], [52.53084718051518, 0.5594613171826959, 0.2933347083688021], [56.489132898886616, 0.1204435332424355, 4.204929052612108], [62.82758176805208, 0.22179226901251106, 0.5399532109008446], [65.56384562777187, 0.4175777415782459, 0.2629941657494979], [75.35514540229505, 0.15649993363781575, 5.999998317543282]], "peak_params_": [[9.625783210379666, 0.41688444198396984, 6.352639012292626], [43.40787460517586, 0.16693245601342532, 0.5345556045683434], [46.71781331021936, 0.18129683323311396, 4.360002495002874], [52.53084718051518, 0.2439471850225945, 0.5866694167376042], [56.489132898886616, 0.12051214194177196, 8.409858105224217], [62.82758176805208, 0.26587258631578226, 1.0799064218016892], [65.56384562777187, 0.16130163138808262, 0.5259883314989958], [75.35514540229505, 0.15623347811859933, 11.999996635086564]], "r_squared_": 0.9366453782740443, "error_": 0.048366483187360046}
{"freq_range": [2.0, 80.0], "freq_res": 1.0, "aperiodic_params_": [0.12862324755005938, 0.7396577136915338], "gaussian_params_": [[8.096638201737662, 0.18082657923452547, 0.8587726987539135], [10.73883470363536, 0.36577826188489343, 2.9409507445808334], [15.002874657161462, 0.1734805639666965, 0.2500901609444807], [54.38807531201892, 0.18324580083765887, 2.6056076153130157], [59.868766572481285, 0.18775139508098573, 1.0769178843590212], [73.20832540172712, 0.1868801384216313, 5.999999999999997]], "peak_params_": [[8.096638201737662, 0.4167635866243685, 1.717545397507827], [10.73883470363536, 0.3649348768660716, 5.881901489161667], [15.002874657161462, 0.30151144277391073, 0.5001803218889614], [54.38807531201892, 0.1823365069817362, 5.211215230626031], [59.868766572481285, 0.22094856085115677, 2.1538357687180425], [73.20832540172712, 0.1867675265394233, 11.999999999999995]], "r_squared_": 0.9487901687370957, "error_": 0.0531341849299683}
{"freq_range": [2.0, 80.0], "freq_res": 1.0, "aperiodic_params_": [0.2922430270200862, 0.8875746946607519], "gaussian_params_": [[7.453134674000133, 0.7219178587254184, 0.26449942798114245], [10.350482583383236, 0.35252134358936654, 2.428431768722893], [14.95639125897858, 0.17853617893192342, 0.2500000000000217], [44.54796540086405, 0.10565538875833742, 3.416652693163744], [53.777182153439334, 0.19855335665093496, 1.6191637307611655], [58.92599620027677, 0.17259760414180414, 1.3570002539510093], [67.52023752056654, 0.10236455938808586, 5.999999999999541], [73.45412822981727, 0.3410227169669709, 0.2737868951601456], [76.55988704923855, 0.12089330592141206, 5.999858848839707]], "peak_params_": [[7.453134674000133, 0.3024975766214363, 0.5289988559622849], [10.350482583383236, 0.3488689555715563, 4.856863537445786], [14.95639125897858, 0.23222712503861254, 0.5000000000000434], [44.54796540086405, 0.10482425432480658, 6.833305386327488], [53.777182153439334, 0.20740643604758202, 3.238327461522331], [58.92599620027677, 0.21246461288602525, 2.7140005079020186], [67.52023752056654, 0.14573130112437593, 11.999999999999082], [73.45412822981727, 0.25500789675094326, 0.5475737903202912], [76.55988704923855, 0.1499511050066622, 11.999717697679413]], "r_squared_": 0.9823901957478175, "error_": 0.03280390728997008}
{"freq_range": [2.0, 80.0], "freq_res": 1.0, "aperiodic_params_": [0.17226928318637852, 0.8203608949730582], "gaussian_params_": [[9.528877706079792, 0.4423932420243137, 3.1354088431270717], [15.04516557133965, 0.10959667902779122, 0.25005416370628186], [52.63632708576454, 0.19367178452060527, 1.1861308524992142], [56.74560529290198, 0.3881380287753583, 0.7794370665616364], [59.74168018799439, 0.2197166740365032, 0.7639869284440202], [62.74697202732762, 0.1834896907325791, 1.5279819228242018], [68.7694440663387, 0.20719352402973962, 0.8776145578288266], [73.29102287104834, 0.18696231223703946, 1.807354172769928], [79.5479637947579, 0.14242113705549192, 4.231945316566361]], "peak_params_": [[9.528877706079792, 0.4374272226438826, 6.270817686254143], [15.04516557133965, 0.20434618988446995, 0.5001083274125637], [52.63632708576454, 0.1847829855938039, 2.3722617049984285], [56.74560529290198, 0.3687351783460562, 1.5588741331232727], [59.74168018799439, 0.24403400510862805, 1.5279738568880403], [62.74697202732762, 0.18108384417398127, 3.0559638456484035], [68.7694440663387, 0.21774621941292138, 1.7552291156576532], [73.29102287104834, 0.22758036788866987, 3.614708345539856], [79.5479637947579, 0.14180135502076285, 8.463890633132722]], "r_squared_": 0.9692571334026546, "error_": 0.041371773877415675}
{"freq_range": [2.0, 80.0], "freq_res": 1.0, "aperiodic_params_": [0.3243415980893961, 0.8273089137110108], "gaussian_params_": [[7.9806357697101715, 0.17524867619972703, 0.7542451246543991], [10.270658040000775, 0.36199614876511854, 2.498414863773238], [14.921820798607214, 0.14461776007639537, 0.2501775736719135], [50.75929352332174, 0.09572637332452863, 5.556022388478035], [59.59444925242896, 0.1810172097669298, 1.710715550268752], [63.539355542769876, 0.2136835287598147, 0.7376934272255178], [74.09622693368044, 0.21827554873520105, 4.009052320812947]], "peak_params_": [[7.9806357697101715, 0.41471142306126707, 1.5084902493087982], [10.270658040000775, 0.3647436359216834, 4.996829727546476], [14.921820798607214, 0.1980681898779003, 0.500355147343827], [50.75929352332174, 0.09563719173027807, 11.11204477695607], [59.59444925242896, 0.2004630985725424, 3.421431100537504], [63.539355542769876, 0.1971568787982375, 1.4753868544510356], [74.09622693368044, 0.21822787131570998, 8.018104641625895]], "r_squared_": 0.9574507573757554, "error_": 0.04729040597867027}
{"freq_range": [2.0, 80.0], "freq_res": 1.0, "aperiodic_params_": [0.3570181010491794, 0.956610711466555], "gaussian_params_": [[8.09268124269245, 0.3644423310595184, 0.9559122122747676], [10.724274784705205, 0.41678089382868083, 1.4561718001759778], [12.598770922910935, 0.3610041684954614, 0.3397224519467881], [14.882330762240926, 0.3102056416464476, 0.7523201726418266], [45.3821796780085, 0.3112479517357403, 0.28078487953508463], [53.214765161322205, 0.18324872102003742, 0.9927298588975144], [56.51646550615795, 0.4604814022235862, 0.35680081412738096], [59.15698211673806, 0.2521249938984587, 0.9293852770877239]], "peak_params_": [[8.09268124269245, 0.4351565591782789, 1.9118244245495353], [10.724274784705205, 0.41295469532170803, 2.9123436003519556], [12.598770922910935, 0.31618960106012994, 0.6794449038935761], [14.882330762240926, 0.31202838928835963, 1.5046403452836532], [45.3821796780085, 0.12325765059919913, 0.5615697590701693], [53.214765161322205, 0.17901029234846666, 1.9854597177950288], [56.51646550615795, 0.20101438843389752, 0.7136016282547619], [59.15698211673806, 0.24855391229444557, 1.8587705541754478]], "r_squared_": 0.9653758467126622, "error_": 0.05980284477691282}
{"freq_range": [2.0, 80.0], "freq_res": 1.0, "aperiodic_params_": [0.4216348683191287, 1.0693190594637816], "gaussian_params_": [[10.975719671928855, 0.5081234546479924, 3.248685552070087], [57.04356204843514, 0.12797571008260686, 5.999999998882571], [70.57500686731578, 0.3905123381176053, 0.25811986075408666], [74.78530842523942, 0.16705921634236517, 4.547913422911936]], "peak_params_": [[10.975719671928855, 0.5081092631928716, 6.497371104140174], [57.04356204843514, 0.1280521354971167, 11.999999997765142], [70.57500686731578, 0.22739108672390618, 0.5162397215081733], [74.78530842523942, 0.16832612608175834, 9.095826845823872]], "r_squared_": 0.9813249971824649, "error_": 0.04638583858474878}
{"freq_range": [2.0, 80.0], "freq_res": 1.0, "aperiodic_params_": [0.33070790471702854, 1.0206862130852044], "gaussian_params_": [[10.938078570309358, 0.5593322229796045, 3.2167132597642465], [59.214088855195044, 0.12133538755656242, 5.999999999999999], [70.53589068291987, 0.7863227556940114, 0.26868622614249127], [73.79381619960819, 0.19810977790685902, 1.0173715407770023], [77.03991934250388, 0.2144929019106245, 0.6229921075537934]], "peak_params_": [[10.938078570309358, 0.5592285998121315, 6.433426519528493], [59.214088855195044, 0.12125817198689948, 11.999999999999998], [70.53589068291987, 0.19908004215005426, 0.5373724522849825], [73.79381619960819, 0.19990910268820206, 2.0347430815540046], [77.03991934250388, 0.21693358863404422, 1.2459842151075868]], "r_squared_": 0.9813685878832424, "error_": 0.04349193445736443}
{"freq_range": [2.0, 80.0], "freq_res": 1.0, "aperiodic_params_": [0.32906038190619546, 0.9953508561745233], "gaussian_params_": [[10.94742905519982, 0.5443175056962336, 3.193266436541031], [68.45203459913596, 0.14755586940560877, 5.999999999999999], [77.37798141073998, 0.30437775652535926, 0.3181224153266811]], "peak_params_": [[10.94742905519982, 0.5442437468471729, 6.386532873082062], [68.45203459913596, 0.1471377009857815, 11.999999999999998], [77.37798141073998, 0.20374918541259968, 0.6362448306533622]], "r_squared_": 0.9743299553937119, "error_": 0.05613451546820607}
{"freq_range": [2.0, 80.0], "freq_res": 1.0, "aperiodic_params_": [0.3471970484665009, 0.953933970065314], "gaussian_params_": [[8.203566177913814, 0.4004393345341872, 1.1787458984559498], [11.828113886322473, 0.43192926883075394, 1.848548601188055], [14.613619541427507, 0.7520450200536275, 0.26286843346287786], [50.45203459913644, 0.1123672368527411, 5.196382672778859], [61.44043394937109, 0.09902414247043183, 3.7212951775826233], [72.71656494960159, 0.1614988471109026, 5.536883826748897], [77.01511637308727, 0.0835691826710958, 0.2500091085680889]], "peak_params_": [[8.203566177913814, 0.44511463342519964, 2.3574917969118996], [11.828113886322473, 0.43230493833477146, 3.69709720237611], [14.613619541427507, 0.354428996885882, 0.5257368669257557], [50.45203459913644, 0.11285640241869754, 10.392765345557718], [61.44043394937109, 0.12986347557504585, 7.442590355165247], [72.71656494960159, 0.16209165981916684, 11.073767653497795], [77.01511637308727, 0.20316456365786228, 0.5000182171361778]], "r_squared_": 0.9782493855454882, "error_": 0.04335049921203733}
{"freq_range": [2.0, 80.0], "freq_res": 1.0, "aperiodic_params_": [0.028770800291824203, 0.5138720260697679], "gaussian_params_": [[9.752447884950902, 0.32320533297626136, 2.5706799197225836], [21.26189204218242, 0.4327973571431858, 0.8844362248023941], [35.13047664374942, 0.20390987781078782, 1.0023838067294089], [41.56439918498025, 0.24132859415576485, 4.3628889639871025], [62.63134873304175, 0.48953379619848814, 0.25003225203342444], [65.4791306915097, 0.5176872852324765, 0.27979396530959155], [66.85908905370071, 0.13243370198168095, 5.999999999998303]], "peak_params_": [[9.752447884950902, 0.3217102016510103, 5.141359839445167], [21.26189204218242, 0.414259089469951, 1.7688724496047883], [35.13047664374942, 0.2799982789791843, 2.0047676134588177], [41.56439918498025, 0.2401535473225478, 8.725777927974205], [62.63134873304175, 0.272781850718818, 0.5000645040668489], [65.4791306915097, 0.2457062064633292, 0.5595879306191831], [66.85908905370071, 0.13239739364587988, 11.999999999996605]], "r_squared_": 0.9193332513216925, "error_": 0.04462843495125228}
{"freq_range": [2.0, 80.0], "freq_res": 1.0, "aperiodic_params_": [0.20428361753831914, 0.7994948984573774], "gaussian_params_": [[9.94049980568669, 0.34627651031551643, 2.8458123831060527], [21.455848625453946, 0.5339614538989064, 0.3055469411254205], [23.51670993570751, 0.6018877236412428, 0.32968329114084893], [26.0738989851236, 0.2139385927656151, 0.9179438638419456], [50.191294399980244, 0.19953044758101465, 5.932568431868774], [63.01608491835832, 0.1802282896288393, 0.25000249050770607], [68.11621102276763, 0.11298289165023875, 3.0444872645940704], [74.54796540086403, 0.11718932485783107, 2.8830055949633078], [78.63620255420206, 0.34520320268402815, 0.26272922550448297]], "peak_params_": [[9.94049980568669, 0.34620083230790577, 5.691624766212105], [21.455848625453946, 0.17564560071410762, 0.611093882250841], [23.51670993570751, 0.22221463158109211, 0.6593665822816979], [26.0738989851236, 0.2132953887837652, 1.8358877276838912], [50.191294399980244, 0.19942674833171126, 11.865136863737549], [63.01608491835832, 0.2268216362865021, 0.5000049810154121], [68.11621102276763, 0.12399154974066251, 6.088974529188141], [74.54796540086403, 0.12455673600159933, 5.7660111899266155], [78.63620255420206, 0.16811044472286163, 0.5254584510089659]], "r_squared_": 0.970914484175897, "error_": 0.03926566227531528}
{"freq_range": [2.0, 80.0], "freq_res": 1.0, "aperiodic_params_": [-0.08427793930417675, 0.6169537537500056], "gaussian_params_": [[8.357551332512646, 0.32102055277926345, 1.0573369736028244], [10.860550979626947, 0.37499002444576623, 2.2228484587467245], [15.464013248658546, 0.6947797199998315, 0.252027730366555], [52.45203459913595, 0.08018017739206057, 5.99999999999997], [56.65361157925583, 0.5849426182934444, 0.2603352656304385], [59.042056916725606, 0.039981942685932054, 0.2505026102590225], [59.93690559409245, 0.15006995498601383, 3.5043713960054528], [68.73380606117385, 0.230083531696471, 1.6509925162400991], [73.31194216488036, 0.32725460162205006, 1.123823892142412], [77.52236997767909, 0.23765465940032718, 1.9777894997929375]], "peak_params_": [[8.357551332512646, 0.4670159452714109, 2.114673947205649], [10.860550979626947, 0.38838733600967895, 4.445696917493449], [15.464013248658546, 0.19379686802971818, 0.50405546073311], [52.45203459913595, 0.09149860676842891, 11.99999999999994], [56.65361157925583, 0.40715834178784993, 0.520670531260877], [59.042056916725606, 0.2284261085130893, 0.501005220518045], [59.93690559409245, 0.18641551713468385, 7.0087427920109056], [68.73380606117385, 0.23442554187921427, 3.3019850324801983], [73.31194216488036, 0.3408266654932892, 2.247647784284824], [77.52236997767909, 0.2308886581220153, 3.955578999585875]], "r_squared_": 0.9456881081147007, "error_": 0.04513059041505226}
{"freq_range": [2.0, 80.0], "freq_res": 1.0, "aperiodic_params_": [0.15921532010319833, 0.7850878015004417], "gaussian_params_": [[10.224833285245142, 0.44605597439884714, 2.737354700480186], [18.327317614907543, 0.2244221686968413, 0.6361582881369491], [56.22727423317056, 0.4284143762387628, 2.5727756747149497], [74.03089297220124, 0.3804044046334255, 4.189635614914824]], "peak_params_": [[10.224833285245142, 0.44455391823245555, 5.474709400960372], [18.327317614907543, 0.20449559091061786, 1.2723165762738982], [56.22727423317056, 0.42678220579145754, 5.1455513494298994], [74.03089297220124, 0.38039406331910175, 8.379271229829648]], "r_squared_": 0.9386817753874915, "error_": 0.060302476439960374}
{"freq_range": [2.0, 80.0], "freq_res": 1.0, "aperiodic_params_": [0.40742606081810157, 1.0542007790180574], "gaussian_params_": [[10.616611811324248, 0.5524320620790095, 2.6307402930139445], [15.310148544384552, 0.2536127771537396, 0.5382819510556288], [18.450071447365772, 0.1424646201082515, 1.6578224555812715], [56.008239113207054, 0.22017308515856718, 1.5492199502485218], [59.45761603046857, 0.7973913289336554, 0.26207569136149067], [74.2559452621666, 0.21976951080975463, 4.006940894075868]], "peak_params_": [[10.616611811324248, 0.5466025845141854, 5.261480586027889], [15.310148544384552, 0.3690166008184864, 1.0765639021112576], [18.450071447365772, 0.148071553924641, 3.315644911162543], [56.008239113207054, 0.2201768020496515, 3.0984399004970435], [59.45761603046857, 0.20789332763723944, 0.5241513827229813], [74.2559452621666, 0.21932162959308998, 8.013881788151735]], "r_squared_": 0.9831197166686804, "error_": 0.04267774062345156}
{"freq_range": [2.0, 80.0], "freq_res": 1.0, "aperiodic_params_": [0.32219464631658984, 1.0183522611469251], "gaussian_params_": [[11.315329961343032, 0.5824378509877168, 3.5236368513869065], [56.574773981212445, 0.5102424316352142, 0.26645009258232555], [59.54504396042823, 0.13386756148216797, 1.0437308488815644], [70.85131576137834, 0.1691072613635091, 0.6113230883919479], [73.83703561284644, 0.25704502591099865, 0.874037752665174], [77.29534531821122, 0.19183480440025466, 0.6815777281225095]], "peak_params_": [[11.315329961343032, 0.5801103034064604, 7.047273702773813], [56.574773981212445, 0.14964818053964257, 0.5329001851646511], [59.54504396042823, 0.12173531808781157, 2.087461697763129], [70.85131576137834, 0.16550366503101444, 1.2226461767838959], [73.83703561284644, 0.2526176275334666, 1.748075505330348], [77.29534531821122, 0.175012276010041, 1.363155456245019]], "r_squared_": 0.9857228117712319, "error_": 0.04221490352668779}
{"freq_range": [2.0, 80.0], "freq_res": 1.0, "aperiodic_params_": [0.40687247783955427, 1.0636226696281361], "gaussian_params_": [[11.198778482704592, 0.5748179128564107, 3.368073699276904], [57.01058983662211, 0.08879539971268466, 5.9999999999507505], [74.15444748534284, 0.11552683863204169, 3.721989337025842]], "peak_params_": [[11.198778482704592, 0.5738176877719455, 6.736147398553808], [57.01058983662211, 0.08879807951981533, 11.999999999901501], [74.15444748534284, 0.11703936865113196, 7.443978674051684]], "r_squared_": 0.9859512780255585, "error_": 0.04162514825316097}
{"freq_range": [2.0, 80.0], "freq_res": 1.0, "aperiodic_params_": [0.39374049862940574, 1.0537787545340664], "gaussian_params_": [[7.852108008389214, 0.2546368813022277, 0.8590765643741213], [11.82423794016452, 0.5603379113748441, 3.143667501621709], [59.656298931180764, 0.09410078258461452, 5.9999851968929985], [70.56067795769788, 0.35438570299670386, 0.2617182938909064], [74.0415053766101, 0.11375329357108496, 3.3125963057243943]], "peak_params_": [[7.852108008389214, 0.5182570047680464, 1.7181531287482426], [11.82423794016452, 0.5594650175259854, 6.287335003243418], [59.656298931180764, 0.09396078469505631, 11.999970393785997], [70.56067795769788, 0.17700262623809038, 0.5234365877818128], [74.0415053766101, 0.11914668120377736, 6.625192611448789]], "r_squared_": 0.9884076606692215, "error_": 0.038078313995099415}
{"freq_range": [2.0, 80.0], "freq_res": 1.0, "aperiodic_params_": [0.4239814120137969, 1.0296065710111604], "gaussian_params_": [[8.053831641365829, 0.2812090756602647, 1.0646037994871587], [12.175364474986427, 0.4790920992905557, 2.6303100063634144], [42.54706203105128, 0.7094430539913751, 0.25000000000000006], [68.45203459914659, 0.1214355703859084, 5.999999999999999]], "peak_params_": [[8.053831641365829, 0.41675631444907635, 2.1292075989743173], [12.175364474986427, 0.47832058780851955, 5.260620012726829], [42.54706203105128, 0.13746469507714432, 0.5000000000000001], [68.45203459914659, 0.12109142602359979, 11.999999999999998]], "r_squared_": 0.9865671052275682, "error_": 0.039317270388746585}
{"freq_range": [2.0, 80.0], "freq_res": 1.0, "aperiodic_params_": [0.2571575569279253, 0.8660792183568875], "gaussian_params_": [[8.376478213868713, 0.33683837613534046, 1.3631927385647122], [12.377082099817821, 0.36325390056014567, 1.9328979210901815], [21.391223837844763, 0.6276791770050953, 0.2689623194156693], [41.57966898346699, 0.12063532224964707, 1.3493587943051377], [48.946307243870315, 0.16128282787426493, 0.8258508698615753], [52.411055991595504, 0.16574590050182664, 1.0030380196349704], [62.21400761625249, 0.10799472202083366, 2.9911417459139438], [70.61254752585263, 0.14451525746313187, 3.756380384389478], [77.92319920103151, 0.15949147225191854, 0.675810172102484]], "peak_params_": [[8.376478213868713, 0.35220312859327835, 2.7263854771294245], [12.377082099817821, 0.36625033502367993, 3.865795842180363], [21.391223837844763, 0.21794122316643327, 0.5379246388313386], [41.57966898346699, 0.11492211939369779, 2.6987175886102754], [48.946307243870315, 0.16145928886233651, 1.6517017397231506], [52.411055991595504, 0.1528872750606407, 2.006076039269941], [62.21400761625249, 0.11815161128954688, 5.9822834918278875], [70.61254752585263, 0.14519355162563108, 7.512760768778956], [77.92319920103151, 0.1793607599488245, 1.351620344204968]], "r_squared_": 0.9839867971184663, "error_": 0.032694701671113324}
{"freq_range": [2.0, 80.0], "freq_res": 1.0, "aperiodic_params_": [0.09244479560260983, 0.7922149239685268], "gaussian_params_": [[10.27969393115886, 0.3886235015017063, 2.9902388197936256], [12.402772636071694, 0.20402993193339183, 0.25000000000000006], [67.7372707125878, 0.19651696259889226, 5.999999999999999]], "peak_params_": [[10.27969393115886, 0.3869271968813372, 5.980477639587251], [12.402772636071694, 0.38507701060866517, 0.5000000000000001], [67.7372707125878, 0.19632865130861243, 11.999999999999998]], "r_squared_": 0.9376893760932554, "error_": 0.06740070485776788}
{"freq_range": [2.0, 80.0], "freq_res": 1.0, "aperiodic_params_": [-0.37296222571192655, 0.3964378512963042], "gaussian_params_": [[9.892659923508933, 0.45911555120952935, 2.513500355422129], [17.120730544787882, 0.30133276113724927, 1.3851481176310425], [32.56914809763138, 0.86496760895658, 0.2621899408279575], [35.35404104668346, 0.23131385678742325, 0.7645450070577157], [51.08330424317678, 0.14630219633990815, 4.566412541361933], [70.54796528598179, 0.13689462592515703, 5.999999999999999]], "peak_params_": [[9.892659923508933, 0.45869763548885584, 5.027000710844258], [17.120730544787882, 0.30861742938911085, 2.770296235262085], [32.56914809763138, 0.22627106127956986, 0.524379881655915], [35.35404104668346, 0.20809211609606826, 1.5290900141154313], [51.08330424317678, 0.14695623093163213, 9.132825082723866], [70.54796528598179, 0.1365174954372036, 11.999999999999998]], "r_squared_": 0.853445453105229, "error_": 0.05911708105302012}
{"freq_range": [2.0, 80.0], "freq_res": 1.0, "aperiodic_params_": [0.27024131018418024, 0.9673489883193999], "gaussian_params_": [[7.972051348722506, 0.21523270760232316, 0.4492089207724875], [10.736843905334922, 0.4976158571050229, 1.969064504549462], [15.977762930977628, 0.28093781254334893, 1.926567458337111], [28.227435722594514, 0.17235281095566687, 1.0064813205853003], [52.18514934223829, 0.16206902811204482, 0.6019541407734922], [54.45823698017575, 0.5074777794207918, 0.33169011098969914], [56.86175695762596, 0.41185157632273933, 0.7871791366595822], [59.45530143412077, 0.2620689860925112, 0.5750760867286743], [73.88511880326863, 0.394976452910584, 2.235120143774771]], "peak_params_": [[7.972051348722506, 0.4042747782453459, 0.898417841544975], [10.736843905334922, 0.5031684370523054, 3.938129009098924], [15.977762930977628, 0.29489832060308974, 3.853134916674222], [28.227435722594514, 0.16800808986160565, 2.0129626411706005], [52.18514934223829, 0.15458119351337718, 1.2039082815469844], [54.45823698017575, 0.19769724157279955, 0.6633802219793983], [56.86175695762596, 0.4055780231303554, 1.5743582733191643], [59.45530143412077, 0.2018513062773064, 1.1501521734573485], [73.88511880326863, 0.39445507746891306, 4.470240287549542]], "r_squared_": 0.9740517399829522, "error_": 0.044988176930000026}
{"freq_range": [2.0, 80.0], "freq_res": 1.0, "aperiodic_params_": [0.3416507470126916, 1.0946369108183593], "gaussian_params_": [[9.61174240789823, 0.41634064579116614, 1.917759694374687], [14.495609492388894, 0.4202393283768932, 3.420521494292103], [24.617571543145363, 0.26389135718507517, 0.3554104482650286], [56.68082804147013, 0.16136253868182598, 4.301328084847927], [59.39547963956457, 0.19042246263079665, 0.28834568532858695], [74.17206707446564, 0.2395000702700004, 3.4644625346678803]], "peak_params_": [[9.61174240789823, 0.5850678373045988, 3.835519388749374], [14.495609492388894, 0.4462233202100671, 6.841042988584206], [24.617571543145363, 0.15167711370375314, 0.7108208965300572], [56.68082804147013, 0.16092001787526478, 8.602656169695853], [59.39547963956457, 0.21389089949079643, 0.5766913706571739], [74.17206707446564, 0.2392535353379981, 6.928925069335761]], "r_squared_": 0.988472635453859, "error_": 0.03863382155316577}
{"freq_range": [2.0, 80.0], "freq_res": 1.0, "aperiodic_params_": [0.4653381839580226, 1.126826108511476], "gaussian_params_": [[9.045298649960523, 0.30013418716799684, 1.639509597899454], [13.247748559934346, 0.4654706131978334, 3.4243658819399827], [25.08644894627489, 0.1549699219719227, 0.44466281449144246], [57.90998866742683, 0.11334265967724723, 1.8315928250522706], [71.61185279938564, 0.09617471535434277, 5.999999812319103], [74.1152995968488, 0.17195388636385728, 0.4045073583238579], [77.39039542002152, 0.28666403012577263, 0.25082461463599903]], "peak_params_": [[9.045298649960523, 0.5156774893314339, 3.279019195798908], [13.247748559934346, 0.48061755559822206, 6.848731763879965], [25.08644894627489, 0.15335777569329556, 0.8893256289828849], [57.90998866742683, 0.12054190446679436, 3.6631856501045412], [71.61185279938564, 0.09597388079918101, 11.999999624638207], [74.1152995968488, 0.25395903086103866, 0.8090147166477158], [77.39039542002152, 0.14963470363488285, 0.5016492292719981]], "r_squared_": 0.9889650381818572, "error_": 0.03929313752601277}
{"freq_range": [2.0, 80.0], "freq_res": 1.0, "aperiodic_params_": [0.5247800204442202, 1.149430484520255], "gaussian_params_": [[8.82560568827494, 0.28442767529927404, 1.4589640996743283], [13.113222502838559, 0.5101318052773677, 3.353897225494882], [59.51223290666437, 0.0750466846982862, 5.999999999999999], [70.90904934925139, 0.16899288170208426, 0.5152751275576647], [73.8817260215843, 0.20799802773006829, 0.7348527749457203]], "peak_params_": [[8.82560568827494, 0.5228835838926691, 2.9179281993486565], [13.113222502838559, 0.5145868827521629, 6.707794450989764], [59.51223290666437, 0.07479910976714654, 11.999999999999998], [70.90904934925139, 0.1784796272727971, 1.0305502551153294], [73.8817260215843, 0.209388307430028, 1.4697055498914406]], "r_squared_": 0.988613084830764, "error_": 0.0398933120785003}
{"freq_range": [2.0, 80.0], "freq_res": 1.0, "aperiodic_params_": [0.5414591654696231, 1.1351843146131844], "gaussian_params_": [[8.503377309626993, 0.33872720167842363, 1.4131552667755896], [13.010133137513256, 0.5256410931608153, 2.528254004675585], [17.489778759383114, 0.7303291987613406, 0.2683509683121474], [59.10843755630863, 0.15049972372872408, 1.4299297863007796], [64.12714067581251, 0.1445570659930695, 0.7307387083675665], [67.11078218236206, 0.13515890139200432, 0.5938945976726054], [70.65269181443776, 0.2180769820447069, 0.5026399206258567], [73.89744828208829, 0.199442099503182, 0.6863536918669877], [77.41921179034452, 0.6680872915018542, 0.25399464849899916]], "peak_params_": [[8.503377309626993, 0.4678568363555392, 2.826310533551179], [13.010133137513256, 0.5277809655675649, 5.05650800935117], [17.489778759383114, 0.28941294964528774, 0.5367019366242948], [59.10843755630863, 0.15006759664749691, 2.859859572601559], [64.12714067581251, 0.1428186142699508, 1.461477416735133], [67.11078218236206, 0.13289146838958676, 1.1877891953452109], [70.65269181443776, 0.17179232120452825, 1.0052798412517134], [73.89744828208829, 0.19722821418332215, 1.3727073837339754], [77.41921179034452, 0.1711307280745724, 0.5079892969979983]], "r_squared_": 0.9903062291465857, "error_": 0.03650470397557584}
{"freq_range": [2.0, 80.0], "freq_res": 1.0, "aperiodic_params_": [0.8882387031278118, 1.3655879661375208], "gaussian_params_": [[7.45876952169334, 0.504646907287852, 0.2901616660258263], [12.472270828736221, 0.39632595728468006, 3.2586487874699515], [17.2618247461218, 0.2088123062946411, 0.26028940495311065], [20.957833023689343, 0.12086692680268699, 0.25000000008916545], [42.53789868720772, 0.5320246959767575, 0.27940561228837824], [58.211604589610296, 0.12023467186165242, 5.999999999999999], [63.8968826116046, 0.07217729005278219, 0.6319272661336417], [68.11245201669693, 0.11930913619514961, 1.1643345048378393], [70.66311920208946, 0.2345020947020565, 0.6331194187704422], [73.44974594728733, 0.18586993143247904, 1.046376552852204], [77.89652982001067, 0.1642601828832428, 1.93737609908278]], "peak_params_": [[7.45876952169334, 0.2413535273274924, 0.5803233320516527], [12.472270828736221, 0.392185472993406, 6.517297574939903], [17.2618247461218, 0.276854442396429, 0.5205788099062213], [20.957833023689343, 0.1320700216984596, 0.5000000001783309], [42.53789868720772, 0.14034350364392956, 0.5588112245767565], [58.211604589610296, 0.12015992166211409, 11.999999999999998], [63.8968826116046, 0.1469527616994688, 1.2638545322672834], [68.11245201669693, 0.15056439191683957, 2.3286690096756786], [70.66311920208946, 0.2337477606649092, 1.2662388375408844], [73.44974594728733, 0.18224893999622815, 2.092753105704408], [77.89652982001067, 0.1645631153335234, 3.87475219816556]], "r_squared_": 0.9921631903955439, "error_": 0.03620162949292128}
{"freq_range": [2.0, 80.0], "freq_res": 1.0, "aperiodic_params_": [0.12220694983024107, 0.8586478131426619], "gaussian_params_": [[8.153197819519287, 0.17833506192514417, 1.2174052813273335], [12.435334005031281, 0.40333848292163516, 3.1737835470986457], [49.09118074524873, 0.1623159496652544, 0.5735228954259074], [52.47466543484481, 0.26127398391785783, 0.4514284618455476], [57.756461191231715, 0.15958269031424424, 3.056774503415548], [67.24089200522054, 0.14691495662534226, 2.3589404234843014], [70.46804032209543, 0.7799319443507928, 0.2817697319081324], [74.49721860115913, 0.16587928307632932, 1.6943820352132533], [77.61805521232101, 0.2765637942292849, 0.4094618396421867]], "peak_params_": [[8.153197819519287, 0.32883820518992624, 2.434810562654667], [12.435334005031281, 0.4007729051530809, 6.3475670941972915], [49.09118074524873, 0.16291434183614517, 1.1470457908518148], [52.47466543484481, 0.1774167659673187, 0.9028569236910952], [57.756461191231715, 0.15914535907779093, 6.113549006831096], [67.24089200522054, 0.14780963018758286, 4.717880846968603], [70.46804032209543, 0.275377121957014, 0.5635394638162649], [74.49721860115913, 0.16131133457291003, 3.3887640704265065], [77.61805521232101, 0.19858270189245042, 0.8189236792843734]], "r_squared_": 0.9807994277522992, "error_": 0.03384925014149456}
{"freq_range": [2.0, 80.0], "freq_res": 1.0, "aperiodic_params_": [-0.5669360421709799, -0.005418527706901877], "gaussian_params_": [[9.097846876415556, 0.30534015309391677, 0.824851625637852], [12.189490476864082, 0.17985343920239713, 1.2875617531563301], [18.449108515203907, 0.381886720628668, 1.4507070561905022], [38.97790949194416, 0.23437653012444226, 3.6334662499712067], [55.16761363117054, 0.14467264898791826, 4.119673029820934], [68.39087987144116, 0.10762979941834575, 3.002689154974736]], "peak_params_": [[9.097846876415556, 0.3115638570981895, 1.649703251275704], [12.189490476864082, 0.1785619253269256, 2.5751235063126603], [18.449108515203907, 0.3640252196042743, 2.9014141123810044], [38.97790949194416, 0.2344376572461241, 7.266932499942413], [55.16761363117054, 0.14457217031967418, 8.239346059641868], [68.39087987144116, 0.10785277270315752, 6.005378309949472]], "r_squared_": 0.6410218346596743, "error_": 0.04636835285142569}
{"freq_range": [2.0, 80.0], "freq_res": 1.0, "aperiodic_params_": [0.4085644922317497, 1.1761799834507163], "gaussian_params_": [[10.865641767880495, 0.5081159095003889, 2.251369072781385], [18.245045962219724, 0.2109959803792663, 0.5591909951807084], [49.58583135054317, 0.1534264146079607, 1.703010574329673], [51.973029974476965, 0.13695844269591606, 0.2502264495180485], [57.9710261528266, 0.2752783874599119, 2.5688183778398495], [66.68977162234488, 0.2022780400387304, 2.2708655567890785], [76.66794060857018, 0.34791254968679014, 4.492123232094184]], "peak_params_": [[10.865641767880495, 0.5072118826328235, 4.50273814556277], [18.245045962219724, 0.1950317973159149, 1.1183819903614167], [49.58583135054317, 0.1511889763571772, 3.406021148659346], [51.973029974476965, 0.21081158636491204, 0.500452899036097], [57.9710261528266, 0.2754572301312861, 5.137636755679699], [66.68977162234488, 0.23529927333038025, 4.541731113578157], [76.66794060857018, 0.3469700687066899, 8.984246464188368]], "r_squared_": 0.9648677337928269, "error_": 0.05627621616762493}
{"freq_range": [2.0, 80.0], "freq_res": 1.0, "aperiodic_params_": [0.2672967163918153, 1.114361126950892], "gaussian_params_": [[10.520048798439445, 0.6034869575144517, 2.403768821787791], [16.590085885928225, 0.4208242825631127, 2.1969061595189285], [20.485917946446207, 0.4422618694553855, 0.2704270241084872], [55.175064803856394, 0.1496692772609344, 4.528818138563861], [56.74168654029047, 0.36568451568612886, 0.2948143481066456], [58.89916723785336, 0.1778960757666173, 0.9262797396308562], [74.6494151851787, 0.30278704650630256, 3.5089790865125314]], "peak_params_": [[10.520048798439445, 0.6081021369831157, 4.807537643575582], [16.590085885928225, 0.4295081084999832, 4.393812319037857], [20.485917946446207, 0.21444397044046437, 0.5408540482169744], [55.175064803856394, 0.1495828082776509, 9.057636277127722], [56.74168654029047, 0.4088575800862393, 0.5896286962132912], [58.89916723785336, 0.28163025618900095, 1.8525594792617124], [74.6494151851787, 0.3012899052133331, 7.017958173025063]], "r_squared_": 0.9790463288030252, "error_": 0.05223704185369522}
{"freq_range": [2.0, 80.0], "freq_res": 1.0, "aperiodic_params_": [0.5226365046224581, 1.251455565838829], "gaussian_params_": [[9.981975113959596, 0.5102552083289008, 2.0811145654445706], [15.908633539749445, 0.5125560998425912, 2.9693538803406385], [24.60235078261163, 0.5850669844983916, 0.25000000000000006], [56.612242009603676, 0.27378237413605705, 0.4299921234863458], [59.361707522688235, 0.21548927341390473, 0.6045091751444494], [74.75221750836057, 0.20710644616138796, 4.8097139378181915], [77.43854167046898, 0.36565254259772834, 0.2500000002469455]], "peak_params_": [[9.981975113959596, 0.5810188171209962, 4.162229130889141], [15.908633539749445, 0.5201114221509352, 5.938707760681277], [24.60235078261163, 0.1698513829942434, 0.5000000000000001], [56.612242009603676, 0.18264656173830773, 0.8599842469726916], [59.361707522688235, 0.18114054394215695, 1.2090183502888987], [74.75221750836057, 0.20683179702706211, 9.619427875636383], [77.43854167046898, 0.26418340785670136, 0.500000000493891]], "r_squared_": 0.9896981637786559, "error_": 0.04304436994950041}
{"freq_range": [2.0, 80.0], "freq_res": 1.0, "aperiodic_params_": [0.5427228202142638, 1.1959404940730285], "gaussian_params_": [[9.877770778884946, 0.5124497926542075, 1.931226687043623], [14.764236443366169, 0.5108711527952844, 2.0405025215086847], [17.490568648997126, 0.7545398563854739, 0.2500000000000087], [20.621787097834197, 0.1606544230194918, 1.1378017360526593], [24.772991401928458, 0.19587324569290754, 0.5837734898522605], [59.415200419844325, 0.2539738938527566, 0.46236881192337126], [73.94135957490889, 0.22490881493455622, 0.783823562502484], [77.48898873113353, 0.1895163554143298, 0.7605606474269792]], "peak_params_": [[9.877770778884946, 0.5448857784927672, 3.862453374087246], [14.764236443366169, 0.5226810070161012, 4.081005043017369], [17.490568648997126, 0.3919200433193515, 0.5000000000000174], [20.621787097834197, 0.15680966691583598, 2.2756034721053187], [24.772991401928458, 0.1817093575782447, 1.167546979704521], [59.415200419844325, 0.16970177577156753, 0.9247376238467425], [73.94135957490889, 0.22428538885651772, 1.567647125004968], [77.48898873113353, 0.15424075598499298, 1.5211212948539583]], "r_squared_": 0.9906285236079239, "error_": 0.039001963925384596}
{"freq_range": [2.0, 80.0], "freq_res": 1.0, "aperiodic_params_": [0.7236747873014444, 1.2662804626020387], "gaussian_params_": [[9.346996385682019, 0.3221572345596155, 1.389915107269717], [14.29498595438491, 0.4866964373985426, 3.5032967817461675], [59.42816125616106, 0.4559530807998062, 0.29110252744336845], [70.64156665050606, 0.3172305193887558, 0.36730823119241374], [73.81593966005161, 0.19926376831509668, 0.7961222061264464]], "peak_params_": [[9.346996385682019, 0.46758381178331443, 2.779830214539434], [14.29498595438491, 0.4861612610488245, 7.006593563492335], [59.42816125616106, 0.15458203011576788, 0.5822050548867369], [70.64156665050606, 0.19744071325728285, 0.7346164623848275], [73.81593966005161, 0.19400881580784413, 1.5922444122528927]], "r_squared_": 0.9903972118469264, "error_": 0.04208168265789925}
{"freq_range": [2.0, 80.0], "freq_res": 1.0, "aperiodic_params_": [0.5836290813673292, 1.2141452082862405], "gaussian_params_": [[12.683343670860005, 0.5787226689731427, 3.7854473775976984], [59.12527501356999, 0.1078054828065017, 4.249191997506007], [70.59604413280236, 0.4937271190282011, 0.2500020599254482], [75.51071175389333, 0.12381116387594386, 5.999999999999999]], "peak_params_": [[12.683343670860005, 0.5767014056430576, 7.570894755195397], [59.12527501356999, 0.11056698903232309, 8.498383995012015], [70.59604413280236, 0.22933284782148045, 0.5000041198508964], [75.51071175389333, 0.12344072115011473, 11.999999999999998]], "r_squared_": 0.9893424722410309, "error_": 0.04043084714592939}
{"freq_range": [2.0, 80.0], "freq_res": 1.0, "aperiodic_params_": [0.47343362301913244, 1.133522143545008], "gaussian_params_": [[12.825599839563996, 0.5526413839080849, 3.8604992738942805], [70.47336187657727, 0.3016984638495614, 0.26165748498818997], [71.16348477157806, 0.1139015401530983, 5.999999999999999]], "peak_params_": [[12.825599839563996, 0.5520777479960829, 7.720998547788561], [70.47336187657727, 0.17051441993118988, 0.5233149699763799], [71.16348477157806, 0.1536624386349299, 11.999999999999998]], "r_squared_": 0.9871703745684518, "error_": 0.04521850431302786}
{"freq_range": [2.0, 80.0], "freq_res": 1.0, "aperiodic_params_": [0.17601580933859165, 1.0130887221643734], "gaussian_params_": [[9.81770155159518, 0.5859371861963688, 1.6511124201550775], [13.455272781039893, 0.49372641011415014, 1.1343620912977024], [16.47341928309935, 0.40033553621234985, 1.137244181414746], [19.225251078910365, 0.3309429993571592, 0.270714722791927], [20.64887399482776, 0.23820755403808683, 0.5450211753772671], [67.01897908367863, 0.04356967589049838, 0.25000000116531995], [69.87579386034982, 0.1367282108426444, 5.999999999999999]], "peak_params_": [[9.81770155159518, 0.5871494033900471, 3.302224840310155], [13.455272781039893, 0.5507494495205307, 2.2687241825954048], [16.47341928309935, 0.40751228912775805, 2.274488362829492], [19.225251078910365, 0.2704965767279297, 0.541429445583854], [20.64887399482776, 0.19371115918949744, 1.0900423507545343], [67.01897908367863, 0.165335808374939, 0.5000000023306399], [69.87579386034982, 0.1366989177492639, 11.999999999999998]], "r_squared_": 0.9809333356244835, "error_": 0.045368611164734125}
{"freq_range": [2.0, 80.0], "freq_res": 1.0, "aperiodic_params_": [-0.34115089975011553, 0.6155235971874149], "gaussian_params_": [[9.312049167526892, 0.6256273812508787, 1.391999699596864], [11.777557140320239, 0.2895710096651708, 0.5972566363320757], [14.239670794679915, 0.3194902335814143, 1.8080585746329316], [19.642412946954806, 0.16161455694982818, 1.4858065508359048], [71.95214007861497, 0.2749895071321892, 0.6398445217385896]], "peak_params_": [[9.312049167526892, 0.6149044285419153, 2.783999399193728], [11.777557140320239, 0.5154775210805757, 1.1945132726641514], [14.239670794679915, 0.31925506596449704, 3.6161171492658633], [19.642412946954806, 0.15899828936037952, 2.9716131016718097], [71.95214007861497, 0.2742213079222704, 1.2796890434771793]], "r_squared_": 0.9520458943743549, "error_": 0.0530765154565292}
{"freq_range": [2.0, 80.0], "freq_res": 1.0, "aperiodic_params_": [-0.1500177024304807, 0.7139238033921078], "gaussian_params_": [[10.720614200538556, 0.6457397065343692, 2.2080065964221993], [15.315217760812082, 0.33579440947135625, 0.5836019022531063], [65.68322113298244, 0.1501997881398248, 5.999999987600466], [74.48348460087192, 0.30813246846097647, 0.29460226089057195], [77.65044650903148, 0.24810804560750377, 1.273936964626655]], "peak_params_": [[10.720614200538556, 0.6405909986900127, 4.416013192844399], [15.315217760812082, 0.3889329764485422, 1.1672038045062125], [65.68322113298244, 0.14999059539542303, 11.999999975200932], [74.48348460087192, 0.1417070139937444, 0.5892045217811439], [77.65044650903148, 0.25720662902620517, 2.54787392925331]], "r_squared_": 0.9634384360083819, "error_": 0.05162055911065801}
{"freq_range": [2.0, 80.0], "freq_res": 1.0, "aperiodic_params_": [0.1480695472724158, 1.0493439097133235], "gaussian_params_": [[10.235317452204834, 0.6022398533566511, 2.0924443541582054], [15.426017275328048, 0.4340522579910985, 0.25001479946837696], [16.232401120294426, 0.3874077096427146, 3.629925865829533], [59.547965399643935, 0.12692595239982754, 5.999999999999906]], "peak_params_": [[10.235317452204834, 0.6871664826127358, 4.184888708316411], [15.426017275328048, 0.5124126407214415, 0.5000295989367539], [16.232401120294426, 0.4312737687441308, 7.259851731659066], [59.547965399643935, 0.1265662484758152, 11.999999999999812]], "r_squared_": 0.9653767659929167, "error_": 0.07239778778430937}
{"freq_range": [2.0, 80.0], "freq_res": 1.0, "aperiodic_params_": [0.5816901675973405, 1.361158665500191], "gaussian_params_": [[10.468502338916023, 0.6511723588852528, 2.1188029637925188], [14.997320449087786, 0.07057488834533084, 0.250079909621012], [16.258710583437683, 0.5059479228396955, 2.3931714294195467], [20.428129572283034, 0.6986696539376984, 0.25153830994467374], [59.3926144517401, 0.42844499817511533, 0.27364043514902514], [68.9040691982719, 0.11451142950975876, 5.999999999999999], [79.0979570151478, 0.19495030600748267, 5.1296093706257295]], "peak_params_": [[10.468502338916023, 0.6520018502296789, 4.2376059275850375], [14.997320449087786, 0.5772997974605871, 0.500159819242024], [16.258710583437683, 0.5245858494598752, 4.7863428588390935], [20.428129572283034, 0.31323812946595964, 0.5030766198893475], [59.3926144517401, 0.18247644806526586, 0.5472808702980503], [68.9040691982719, 0.14257869817135438, 11.999999999999998], [79.0979570151478, 0.2227140530300371, 10.259218741251459]], "r_squared_": 0.9872096094317385, "error_": 0.050752483980442666}
{"freq_range": [2.0, 80.0], "freq_res": 1.0, "aperiodic_params_": [0.7189728664790654, 1.383033162205017], "gaussian_params_": [[9.67323324042682, 0.6174381189812735, 1.4185184300380562], [15.037638197614132, 0.6264905051261089, 2.896987737109569], [20.411910224405727, 0.59115097296035, 0.25008068184297083], [58.59605534285156, 0.0816448132238265, 5.999994674700474], [67.05888809605736, 0.08256768295682707, 0.2500395464041423], [75.9157388720445, 0.1695325316083137, 5.999999999999999]], "peak_params_": [[9.67323324042682, 0.7394031072629665, 2.8370368600761124], [15.037638197614132, 0.6269728711496201, 5.793975474219138], [20.411910224405727, 0.29672707330243153, 0.5001613636859417], [58.59605534285156, 0.08464625178491003, 11.999989349400948], [67.05888809605736, 0.1671285179776838, 0.5000790928082846], [75.9157388720445, 0.17073168983975284, 11.999999999999998]], "r_squared_": 0.9902120771019083, "error_": 0.0459351518596587}
{"freq_range": [2.0, 80.0], "freq_res": 1.0, "aperiodic_params_": [0.5160966377588706, 1.227238896510383], "gaussian_params_": [[9.564773113583973, 0.4103992733272269, 1.1145280699588611], [13.976968500269598, 0.5841099631151369, 3.929096479296749], [67.01399565410073, 0.07859426625859546, 0.25003004321400635], [72.72289037920056, 0.11316406470912901, 5.999999999999999], [74.38348223778334, 0.3207986148381127, 0.2818192842937325]], "peak_params_": [[9.564773113583973, 0.7302352500811369, 2.2290561399177222], [13.976968500269598, 0.5842493553303564, 7.858192958593498], [67.01399565410073, 0.1502764459815069, 0.5000600864280127], [72.72289037920056, 0.11304531234633153, 11.999999999999998], [74.38348223778334, 0.2377338728998004, 0.563638568587465]], "r_squared_": 0.9902510337334935, "error_": 0.04127167086306237}
{"freq_range": [2.0, 80.0], "freq_res": 1.0, "aperiodic_params_": [0.3276562663634564, 1.144750240751261], "gaussian_params_": [[9.967587162840918, 0.8311190458277287, 1.6257635612208972], [13.231170650687488, 0.45918657240784255, 0.8025644192103366], [15.527646513243756, 0.4126822742149445, 1.3492309493547423], [18.55456970852546, 0.2825531551752124, 2.3960370197005623], [72.9192244187281, 0.13901439039685382, 5.999999999999999]], "peak_params_": [[9.967587162840918, 0.8316682277403039, 3.2515271224417943], [13.231170650687488, 0.6770795364130603, 1.6051288384206732], [15.527646513243756, 0.5502523031860491, 2.6984618987094846], [18.55456970852546, 0.29275739519996535, 4.7920740394011245], [72.9192244187281, 0.13900179337829655, 11.999999999999998]], "r_squared_": 0.9880872457743103, "error_": 0.042155460982784235}
{"freq_range": [2.0, 80.0], "freq_res": 1.0, "aperiodic_params_": [0.15453408720959338, 1.0523516323001252], "gaussian_params_": [[9.783260786595593, 0.6393649281824054, 1.2033879516889021], [14.482451518079019, 0.49756131901223627, 4.081327695021191], [71.86721494450474, 0.1379848981223645, 5.999999999999999]], "peak_params_": [[9.783260786595593, 0.9012973460684592, 2.4067759033778042], [14.482451518079019, 0.49547598221235933, 8.162655390042381], [71.86721494450474, 0.137951111538392, 11.999999999999998]], "r_squared_": 0.9845023796728335, "error_": 0.04960569097853505}
{"freq_range": [2.0, 80.0], "freq_res": 1.0, "aperiodic_params_": [-0.14954048520134325, 0.8832470450883034], "gaussian_params_": [[9.874571086288057, 0.7780820928822767, 1.625574632414087], [15.106881024619934, 0.3631019326245671, 3.8035958348042733], [58.14848138645088, 0.11433295017827673, 1.5556676779893666], [69.5475548382671, 0.3167075992671515, 0.25060245760110034], [74.46754783120649, 0.11793510792715593, 5.99999992538505]], "peak_params_": [[9.874571086288057, 0.9231966161760106, 3.251149264828174], [15.106881024619934, 0.3683572238028543, 7.607191669608547], [58.14848138645088, 0.11654183485484215, 3.111335355978733], [69.5475548382671, 0.1514481456803647, 0.5012049152022007], [74.46754783120649, 0.11757758524688189, 11.9999998507701]], "r_squared_": 0.982005108923362, "error_": 0.044526287382864314}
{"freq_range": [2.0, 80.0], "freq_res": 1.0, "aperiodic_params_": [0.17572233413382057, 0.9007257474090034], "gaussian_params_": [[9.794652041328527, 0.5314244918778416, 1.6650109388583745], [13.207735368034196, 0.416726984292593, 2.400885387233345], [43.78946919636788, 0.11868715487897856, 0.6443155203119606], [50.360646059291284, 0.15979348584726852, 2.966178063424509], [60.701121891182794, 0.18307376198215888, 2.614768023307664], [66.3988654772005, 0.21860133352363512, 1.4061858787417545], [70.97754031886248, 0.1492698762238026, 1.546548573832228], [74.65532169309128, 0.2690796894950913, 0.250286868574077], [78.74694209301317, 0.15897600868572132, 2.9596341955702106]], "peak_params_": [[9.794652041328527, 0.6980966075954581, 3.330021877716749], [13.207735368034196, 0.49847554085367923, 4.80177077446669], [43.78946919636788, 0.12855083104590848, 1.2886310406239212], [50.360646059291284, 0.1586589399674181, 5.932356126849018], [60.701121891182794, 0.18227625306981743, 5.229536046615328], [66.3988654772005, 0.23432572704919807, 2.812371757483509], [70.97754031886248, 0.15553780332269707, 3.093097147664456], [74.65532169309128, 0.18064953588947907, 0.500573737148154], [78.74694209301317, 0.1583961643793037, 5.919268391140421]], "r_squared_": 0.9867981280317071, "error_": 0.035230223993762536}
{"freq_range": [2.0, 80.0], "freq_res": 1.0, "aperiodic_params_": [0.1907187690075296, 0.9989368869613284], "gaussian_params_": [[10.220934912347195, 0.6685411995794247, 1.9842857443704691], [14.704301282615024, 0.3988800504496916, 3.75561419722454], [52.54796540068312, 0.12406499993601403, 5.999986101414408], [74.04360229884193, 0.18617525631133142, 5.999999999999999]], "peak_params_": [[10.220934912347195, 0.8464363046433732, 3.9685714887409382], [14.704301282615024, 0.4344187314560738, 7.51122839444908], [52.54796540068312, 0.12411042064725053, 11.999972202828816], [74.04360229884193, 0.18637822986770436, 11.999999999999998]], "r_squared_": 0.981868778594834, "error_": 0.050112091331786686}
{"freq_range": [2.0, 80.0], "freq_res": 1.0, "aperiodic_params_": [0.4847452449742112, 1.3409179723996376], "gaussian_params_": [[10.390650543347379, 0.9365474091592982, 1.962166733257306], [15.185652294313824, 0.5986570411149121, 1.504804838202622], [17.55686564998808, 0.9868475228283291, 0.2946583417215294], [19.800098945701453, 0.41595611629008294, 0.9963007872783904], [24.53225512808824, 0.11965074050267563, 1.2903886771690893], [49.86488652437156, 0.1939090737816185, 0.8031818089587733], [57.95046808345277, 0.10253403442090106, 1.4744871096637806], [68.90407436663519, 0.08052126462161133, 5.9999999999830385], [79.99999999999999, 0.17573818658209553, 5.622979720088723]], "peak_params_": [[10.390650543347379, 0.91974833211355, 3.924333466514612], [15.185652294313824, 0.6534474125518133, 3.009609676405244], [17.55686564998808, 0.5044852038279257, 0.5893166834430588], [19.800098945701453, 0.41150898525096413, 1.9926015745567809], [24.53225512808824, 0.11204317645090422, 2.5807773543381787], [49.86488652437156, 0.191747631298802, 1.6063636179175467], [57.95046808345277, 0.11800241961267677, 2.948974219327561], [68.90407436663519, 0.10644413049195545, 11.999999999966077], [79.99999999999999, 0.19030181678487468, 11.245959440177446]], "r_squared_": 0.9913675646719037, "error_": 0.04384749710453915}
{"freq_range": [2.0, 80.0], "freq_res": 1.0, "aperiodic_params_": [0.5087621387998448, 1.2617184508313544], "gaussian_params_": [[9.801195218824267, 0.7927252176159202, 1.1965865871197947], [14.461587079066476, 0.617348772318188, 3.8851091963252853], [20.40859867069377, 0.45029691255515086, 0.2682141695385731]], "peak_params_": [[9.801195218824267, 1.1011316125182629, 2.3931731742395894], [14.461587079066476, 0.6146872987836157, 7.770218392650571], [20.40859867069377, 0.36459204178784665, 0.5364283390771462]], "r_squared_": 0.9888220133505919, "error_": 0.051242119575049934}
{"freq_range": [2.0, 80.0], "freq_res": 1.0, "aperiodic_params_": [0.24988207208914895, 1.080744193313697], "gaussian_params_": [[9.86763862359131, 0.8186789475410811, 1.114712697127698], [14.447143237137189, 0.5411243309363999, 4.146566931559456]], "peak_params_": [[9.86763862359131, 1.117386061081792, 2.229425394255396], [14.447143237137189, 0.5388363340227346, 8.293133863118912]], "r_squared_": 0.9861932415617072, "error_": 0.052238728383360834}
{"freq_range": [2.0, 80.0], "freq_res": 1.0, "aperiodic_params_": [0.036277274915488156, 0.8698402514520742], "gaussian_params_": [[10.060539822894642, 1.0405822668899196, 1.6683425684500914], [15.120191528484607, 0.3937870699510221, 1.8496672352226637], [19.97853326017893, 0.23785091816866838, 1.0476912560898661], [74.45203459913596, 0.16065600984169295, 5.999999999999999]], "peak_params_": [[10.060539822894642, 1.048434563403182, 3.336685136900183], [15.120191528484607, 0.4059558753343916, 3.6993344704453275], [19.97853326017893, 0.2499316911581766, 2.0953825121797323], [74.45203459913596, 0.16020071606014508, 11.999999999999998]], "r_squared_": 0.9742798655684983, "error_": 0.05896728571975703}
{"freq_range": [2.0, 80.0], "freq_res": 1.0, "aperiodic_params_": [0.02566398664044519, 0.8021854344302443], "gaussian_params_": [[10.407539654201656, 0.8154022836392592, 2.454734118752963], [74.45203459913596, 0.17685215607999658, 5.999999999999999]], "peak_params_": [[10.407539654201656, 0.8042417863232219, 4.909468237505926], [74.45203459913596, 0.17635096295939134, 11.999999999999998]], "r_squared_": 0.955847035119665, "error_": 0.06813827527146323}
{"freq_range": [2.0, 80.0], "freq_res": 1.0, "aperiodic_params_": [0.17740168255585162, 0.9729020872786113], "gaussian_params_": [[10.011345904365838, 0.7994618312886675, 1.808765102647594], [15.354044874121962, 0.4018812692417674, 2.7491447913831246], [43.70592269316633, 0.34405942725028776, 0.2500074912602522], [46.402997239396704, 0.38768964433158554, 0.2761577168806914], [48.17177957366107, 0.14690846210132677, 0.6282053896351283], [49.713607501793604, 0.19943323325930906, 0.48702951051403875], [52.337970146321624, 0.19071197981677132, 0.9069802563494812], [59.521768799322224, 0.15304505877012145, 2.1352735062062056], [67.61955984122295, 0.1337647229976763, 3.272386962868819], [70.56411952686221, 0.3824197218620649, 0.27608665969972673], [74.98957619906955, 0.08783565924636025, 0.2500000255492318], [79.54796540086376, 0.15483601338994998, 2.5652959961808386]], "peak_params_": [[10.011345904365838, 0.859769381820134, 3.617530205295188], [15.354044874121962, 0.4163862079163464, 5.498289582766249], [43.70592269316633, 0.17225986127372384, 0.5000149825205044], [46.402997239396704, 0.1340499187013242, 0.5523154337613828], [48.17177957366107, 0.1419285386608653, 1.2564107792702566], [49.713607501793604, 0.1767818696673844, 0.9740590210280775], [52.337970146321624, 0.1782345113276802, 1.8139605126989624], [59.521768799322224, 0.15814731916554825, 4.270547012412411], [67.61955984122295, 0.13292768949271827, 6.544773925737638], [70.56411952686221, 0.18902936653826563, 0.5521733193994535], [74.98957619906955, 0.13043652058100452, 0.5000000510984636], [79.54796540086376, 0.15255499681535656, 5.130591992361677]], "r_squared_": 0.9911652838103784, "error_": 0.03142201915852399}
{"freq_range": [2.0, 80.0], "freq_res": 1.0, "aperiodic_params_": [0.06256027493343054, 0.8691633053640789], "gaussian_params_": [[10.07622492124406, 0.9397609503953539, 1.564501869634844], [14.502137785416352, 0.3465554502787825, 1.2089241411695597], [16.29961987664159, 0.33927728877643604, 0.2750426343428156], [18.15798073319347, 0.19332092242685803, 1.125754941924018], [46.47201726909152, 0.6358838423461726, 0.2787229489122269], [48.24641712756671, 0.23650683983584647, 0.5347178752342601], [49.55804030676809, 0.6903434544793344, 0.28225191340882644], [52.43027961649728, 0.14177762976992067, 1.0244855870954477], [59.72723686448901, 0.17570206664679702, 2.8830188526647946], [63.52105429806028, 0.3260365842180446, 0.2886945431055969], [67.84305606086406, 0.15178233575790187, 1.5541915121540621], [70.73597943927176, 0.230176659032085, 0.3294291736096517], [72.68878217720263, 0.35230692603998426, 0.26761858783710707], [76.43899943577762, 0.11393700417244258, 1.5614352151808326], [79.50801150094465, 0.6827568330452002, 0.29075741806874034]], "peak_params_": [[10.07622492124406, 0.9389836561643996, 3.129003739269688], [14.502137785416352, 0.32880521625543413, 2.4178482823391194], [16.29961987664159, 0.37980268507414316, 0.5500852686856312], [18.15798073319347, 0.1967004010715181, 2.251509883848036], [46.47201726909152, 0.1516064969969122, 0.5574458978244538], [48.24641712756671, 0.21273831340151506, 1.0694357504685201], [49.55804030676809, 0.21279744751348328, 0.5645038268176529], [52.43027961649728, 0.1346485817955978, 2.0489711741908954], [59.72723686448901, 0.174917908453176, 5.766037705329589], [63.52105429806028, 0.14806730322905626, 0.5773890862111938], [67.84305606086406, 0.15387337750631547, 3.1083830243081243], [70.73597943927176, 0.18658481740791144, 0.6588583472193034], [72.68878217720263, 0.18986508251759537, 0.5352371756742141], [76.43899943577762, 0.10952187852658746, 3.1228704303616652], [79.50801150094465, 0.17158821913349787, 0.5815148361374807]], "r_squared_": 0.9884530319286946, "error_": 0.031113174004017308}
{"freq_range": [2.0, 80.0], "freq_res": 1.0, "aperiodic_params_": [0.21968047991406858, 0.9445373678241078], "gaussian_params_": [[9.889004699024007, 0.8191992306170832, 1.2539513149170143], [13.657180119692619, 0.33602112870641865, 3.883821208565942], [13.749815153269173, 0.03596523369115616, 0.25004898150314947], [48.38792662225606, 0.10843763641968109, 1.685709927170466], [58.547957390234586, 0.105453070108016, 5.999999982305569], [75.43795017183669, 0.11634087868370242, 5.999999999996866]], "peak_params_": [[9.889004699024007, 1.0316828585144153, 2.5079026298340286], [13.657180119692619, 0.36031401565012144, 7.767642417131884], [13.749815153269173, 0.36031401565012144, 0.5000979630062989], [48.38792662225606, 0.1280956625307157, 3.371419854340932], [58.547957390234586, 0.10788245969931931, 11.999999964611138], [75.43795017183669, 0.11848842894377953, 11.999999999993731]], "r_squared_": 0.983536127809616, "error_": 0.045953724381310346}
{"freq_range": [2.0, 80.0], "freq_res": 1.0, "aperiodic_params_": [-0.8107560203749664, 0.6583098144134332], "gaussian_params_": [[9.24674694705275, 0.6004520366505265, 1.3139265360034118], [11.953194787692418, 0.4450613859900943, 0.8280842112914285], [14.811120038463585, 0.2904908998495343, 1.0425827664257292], [18.833224231266264, 0.16060143574078314, 1.0786725618083801], [52.2510852569748, 0.17719461307525455, 1.145131283389349], [70.32568261356076, 0.07371409441688888, 5.999999999999999]], "peak_params_": [[9.24674694705275, 0.590727254052893, 2.6278530720068236], [11.953194787692418, 0.5188516613514418, 1.656168422582857], [14.811120038463585, 0.2866061083131366, 2.0851655328514584], [18.833224231266264, 0.15878402319211848, 2.1573451236167602], [52.2510852569748, 0.17368076858201675, 2.290262566778698], [70.32568261356076, 0.07360558002801842, 11.999999999999998]], "r_squared_": 0.965870216550337, "error_": 0.04657554255201689}
{"freq_range": [2.0, 80.0], "freq_res": 1.0, "aperiodic_params_": [-0.33299150153907914, 0.7822632961845402], "gaussian_params_": [[10.012120208750025, 0.4510368125690237, 2.3155307325412378], [14.531178443054136, 1.1113217178904808, 0.25008015433437186], [48.95969654731833, 0.09825428447013404, 0.25003105136164283], [52.443059291414315, 0.1114330503684699, 5.9999999999956835], [70.35169314089106, 0.15695547713062724, 4.42327341567619]], "peak_params_": [[10.012120208750025, 0.45103063385616016, 4.6310614650824755], [14.531178443054136, 0.23605098692190674, 0.5001603086687437], [48.95969654731833, 0.19150406042646995, 0.5000621027232857], [52.443059291414315, 0.11115835650879213, 11.999999999991367], [70.35169314089106, 0.15800082555066242, 8.84654683135238]], "r_squared_": 0.9705280203643717, "error_": 0.0427046150213902}
{"freq_range": [2.0, 80.0], "freq_res": 1.0, "aperiodic_params_": [-0.20245088558819738, 0.8827982630181098], "gaussian_params_": [[10.436071312123028, 0.5046761531758114, 2.9253073359042063], [42.84151337838373, 0.16200271405587818, 0.4014362389042608], [52.5734008331967, 0.6531760296360266, 0.26104949883183776], [57.70581205389708, 0.10978345744234816, 2.0623337728868414], [65.26811015872623, 0.118502401488519, 2.385583368831877], [70.51995320311015, 0.56497899055852, 0.26814918054423476], [74.04217443104103, 0.17157777789484135, 2.595021794098127]], "peak_params_": [[10.436071312123028, 0.49909987547420875, 5.850614671808413], [42.84151337838373, 0.14985676941184378, 0.8028724778085216], [52.5734008331967, 0.17997225450756704, 0.5220989976636755], [57.70581205389708, 0.10981532522493964, 4.124667545773683], [65.26811015872623, 0.11836359452813494, 4.771166737663754], [70.51995320311015, 0.20670136531541639, 0.5362983610884695], [74.04217443104103, 0.17170116054155193, 5.190043588196254]], "r_squared_": 0.9742144143128658, "error_": 0.04537811404424829}
{"freq_range": [2.0, 80.0], "freq_res": 1.0, "aperiodic_params_": [-0.08928837763132075, 0.8731485676994164], "gaussian_params_": [[7.437403679010157, 1.0423616030120886, 0.250068122795483], [10.537296831592778, 0.4480418783662885, 2.1274330301859528], [14.551787018860319, 1.0779086108125409, 0.25033118168306], [49.22030991391227, 0.11424167049945527, 3.934890478138683], [58.09593080172811, 0.10646203263683478, 5.999999999999999], [72.04501786949538, 0.14053579680632824, 4.849678593022668]], "peak_params_": [[7.437403679010157, 0.3382258629344783, 0.500136245590966], [10.537296831592778, 0.43756924313950396, 4.2548660603719055], [14.551787018860319, 0.26663028810748923, 0.50066236336612], [49.22030991391227, 0.14780429912591586, 7.869780956277366], [58.09593080172811, 0.11804851266055971, 11.999999999999998], [72.04501786949538, 0.14779239836596547, 9.699357186045336]], "r_squared_": 0.9768719222821404, "error_": 0.041272387727004714}
