{"freq_range": [2.0, 80.0], "freq_res": 1.0, "aperiodic_params_": [0.8036490383520292, 1.1985965487781756], "gaussian_params_": [[6.283765055169916, 0.27889595906415654, 0.7744490345238452], [8.663398356730834, 0.8314433983671505, 1.1723415833770472], [18.34304391483913, 0.2895258547225996, 0.5761724214860766], [60.367931942677274, 0.1220611299994924, 5.819114561221745], [73.0959308017281, 0.1863159880778169, 5.999999999999999]], "peak_params_": [[6.283765055169916, 0.32374789979363666, 1.5488980690476903], [8.663398356730834, 0.7984637427897606, 2.3446831667540944], [18.34304391483913, 0.24250042699669672, 1.1523448429721532], [60.367931942677274, 0.13902672765164126, 11.63822912244349], [73.0959308017281, 0.19786153550990426, 11.999999999999998]], "r_squared_": 0.9830427056716483, "error_": 0.048343748575783566}
{"freq_range": [2.0, 80.0], "freq_res": 1.0, "aperiodic_params_": [0.9801076150862419, 1.4769067918916159], "gaussian_params_": [[8.391230620116245, 0.9896602233929969, 1.6613427117665227], [17.884223459390334, 0.2545610991158521, 3.755941200874527], [67.45203459913596, 0.1603454160233403, 5.999999999999999], [77.55844398766847, 0.2224972694641177, 2.705841433570802], [79.25521948781132, 0.47068970518858205, 0.2500325704046538]], "peak_params_": [[8.391230620116245, 0.9705750116553724, 3.3226854235330454], [17.884223459390334, 0.25444024294865575, 7.511882401749054], [67.45203459913596, 0.1600008953876535, 11.999999999999998], [77.55844398766847, 0.25375025124376505, 5.411682867141604], [79.25521948781132, 0.49778377930571027, 0.5000651408093076]], "r_squared_": 0.9812774376335877, "error_": 0.066626009827141}
{"freq_range": [2.0, 80.0], "freq_res": 1.0, "aperiodic_params_": [0.8245090312295642, 1.200532469197094], "gaussian_params_": [[8.543938764497305, 0.844575596721383, 1.4859557756681994], [72.904069198272, 0.2410209396845036, 5.99999999999997]], "peak_params_": [[8.543938764497305, 0.8057197861679886, 2.9719115513363987], [72.904069198272, 0.24099013543215442, 11.99999999999994]], "r_squared_": 0.9676371712503402, "error_": 0.07014988762353755}
{"freq_range": [2.0, 80.0], "freq_res": 1.0, "aperiodic_params_": [0.971750955180211, 1.0561153554330938], "gaussian_params_": [[6.3098070939648006, 0.2181756394779838, 0.9033280275931558], [8.740258147587149, 0.9044925994594646, 1.1084830978889133], [18.46293017185008, 0.7400763218941047, 0.27843281561294947], [23.033221589889344, 0.13332099254008262, 2.799877654498885], [41.56827906369709, 0.7868965082951449, 0.25092059826296337], [49.45203460021369, 0.1044964075498888, 5.999999999999941]], "peak_params_": [[6.3098070939648006, 0.24831153484834223, 1.8066560551863116], [8.740258147587149, 0.8825871963695789, 2.2169661957778266], [18.46293017185008, 0.21228008873360432, 0.5568656312258989], [23.033221589889344, 0.1333178963670148, 5.59975530899777], [41.56827906369709, 0.2274226059339094, 0.5018411965259267], [49.45203460021369, 0.10420026820953687, 11.999999999999883]], "r_squared_": 0.9707563281852828, "error_": 0.05879195424011284}
{"freq_range": [2.0, 80.0], "freq_res": 1.0, "aperiodic_params_": [1.1191821873712648, 1.4207608983629738], "gaussian_params_": [[8.409913543989033, 1.0031782198349206, 1.6320136861327963], [18.315176839930455, 0.23723563622903812, 4.239113313543828], [69.998592114162, 0.22481247290834497, 0.25001029454424467], [77.2753681373201, 0.3917279339963389, 0.6084816583542253], [79.18108862583142, 0.638284812539682, 0.3048910542484129]], "peak_params_": [[8.409913543989033, 0.984315003847244, 3.2640273722655926], [18.315176839930455, 0.23658086845364462, 8.478226627087656], [69.998592114162, 0.22480890834726153, 0.5000205890884893], [77.2753681373201, 0.35360022888263765, 1.2169633167084506], [79.18108862583142, 0.5421268157915731, 0.6097821084968258]], "r_squared_": 0.983142932239816, "error_": 0.06351035572058161}
{"freq_range": [2.0, 80.0], "freq_res": 1.0, "aperiodic_params_": [0.8962742648429073, 1.3870277485315579], "gaussian_params_": [[8.452939913045324, 0.9773029274089654, 1.6642083478748835], [17.689553240841228, 0.2536287199663202, 2.5753300725258974], [64.45203459913596, 0.11488136755500675, 5.999999999999999], [69.99279939635262, 0.034090668578936265, 0.2501272749767469], [74.54796540086404, 0.24794965013919168, 5.999999999999999]], "peak_params_": [[8.452939913045324, 0.9419825836922935, 3.328416695749767], [17.689553240841228, 0.25179267372603464, 5.150660145051795], [64.45203459913596, 0.16743202440970517, 11.999999999999998], [69.99279939635262, 0.29503252919070566, 0.5002545499534938], [74.54796540086404, 0.2717458673335824, 11.999999999999998]], "r_squared_": 0.9768569433941355, "error_": 0.06696052777075515}
{"freq_range": [2.0, 80.0], "freq_res": 1.0, "aperiodic_params_": [0.8199876440931815, 1.16997138130378], "gaussian_params_": [[8.721784392529562, 0.7834181205375115, 1.4655975264864174], [18.176076710663686, 0.1822132044254788, 0.6372022981743639], [53.13260053917833, 0.1893233430967522, 1.708466874914924], [55.463697066759266, 0.23951645318089276, 0.2973956005787514], [58.77146408991036, 0.27438139850542914, 0.25001072085638865], [59.99803762543041, 0.2050240948610984, 1.6182694535061066], [65.46323909456255, 0.47411398178256264, 0.284723516413576], [70.30393037938939, 0.1591136082050867, 3.4884516756358184], [76.00957328334574, 0.22486380067346204, 0.9342046187903599], [79.22474752903292, 0.26243793943200555, 0.8852736019757763]], "peak_params_": [[8.721784392529562, 0.7694289974173807, 2.931195052972835], [18.176076710663686, 0.17538769719329017, 1.2744045963487278], [53.13260053917833, 0.1887725178102666, 3.416933749829848], [55.463697066759266, 0.176956887033489, 0.5947912011575028], [58.77146408991036, 0.35155088094205844, 0.5000214417127773], [59.99803762543041, 0.20711286350728986, 3.2365389070122133], [65.46323909456255, 0.17802049440122536, 0.569447032827152], [70.30393037938939, 0.15851086083588406, 6.976903351271637], [76.00957328334574, 0.2671495630394314, 1.8684092375807198], [79.22474752903292, 0.2625722538892854, 1.7705472039515526]], "r_squared_": 0.9781029342726979, "error_": 0.045508036968711675}
{"freq_range": [2.0, 80.0], "freq_res": 1.0, "aperiodic_params_": [0.9304042699006935, 1.3030313186593747], "gaussian_params_": [[8.723810204158594, 0.9710809596557928, 1.5642823114618196], [18.050936631426808, 0.3014279232344355, 0.8836629514004839], [23.405388128268708, 0.22752407081935538, 0.6392052431892333], [58.59034155647968, 0.09391630476428454, 5.999999999999968]], "peak_params_": [[8.723810204158594, 0.9560623332798274, 3.1285646229236392], [18.050936631426808, 0.3009275887591379, 1.7673259028009678], [23.405388128268708, 0.18607454069540763, 1.2784104863784667], [58.59034155647968, 0.09369765637349659, 11.999999999999936]], "r_squared_": 0.9832200938707332, "error_": 0.058792409956922254}
{"freq_range": [2.0, 80.0], "freq_res": 1.0, "aperiodic_params_": [1.2805988293904258, 1.5226757225773213], "gaussian_params_": [[8.590908357365503, 1.0404854610594982, 1.587247013630977], [18.08328219755584, 0.31158633525719265, 0.6666032598218203], [22.135524711700516, 0.1676036110307233, 5.999999999999999], [61.48544487550942, 1.3765942867179306, 0.25000000000000006], [77.60845583917596, 0.31327565186529355, 1.6225419687940834]], "peak_params_": [[8.590908357365503, 1.0217535500482469, 3.174494027261954], [18.08328219755584, 0.44133105859969146, 1.3332065196436407], [22.135524711700516, 0.1675608713210378, 11.999999999999998], [61.48544487550942, 0.20895397304055052, 0.5000000000000001], [77.60845583917596, 0.30428566539334767, 3.245083937588167]], "r_squared_": 0.9865094570648966, "error_": 0.05848677586243371}
{"freq_range": [2.0, 80.0], "freq_res": 1.0, "aperiodic_params_": [1.2688295617514445, 1.5131742796005148], "gaussian_params_": [[8.594155972410881, 1.0399483600216226, 1.6012568124200262], [18.093485292957048, 0.3063729136561408, 0.6277743313562582], [21.8336432572482, 0.17372105186055126, 5.999999999999999], [61.4684310487599, 1.1697633011122972, 0.25000079593561325], [77.18474212529257, 0.2798868430694911, 1.5612621128274735], [78.64910292265054, 0.3657567577635684, 0.28404685383686845]], "peak_params_": [[8.594155972410881, 1.0247122240679913, 3.2025136248400523], [18.093485292957048, 0.44464030403349253, 1.2555486627125163], [21.8336432572482, 0.17365429290546963, 11.999999999999998], [61.4684310487599, 0.20217763640093311, 0.5000015918712265], [77.18474212529257, 0.2779342601278054, 3.122524225654947], [78.64910292265054, 0.31290747642820205, 0.5680937076737369]], "r_squared_": 0.9869188754963966, "error_": 0.05778829771204019}
{"freq_range": [2.0, 80.0], "freq_res": 1.0, "aperiodic_params_": [1.3268571155287783, 1.6095743829681333], "gaussian_params_": [[5.536103603164668, 0.6521090522863513, 0.31868306451746986], [8.52403387806123, 1.061482257243838, 1.4540889751606798], [14.982805335138448, 0.24359903868068253, 3.519670431234525], [18.336520312746888, 0.41424192422675654, 0.6315900153462094], [23.659356941438023, 0.2266075810711897, 2.5944430451856135], [30.436761330060325, 0.20903469204691374, 1.6058911291786442], [54.89486520748939, 0.24581608629285237, 0.5481686767600904], [77.3145832844053, 0.2558638848913648, 1.2174278772665348], [78.66517767886339, 0.5098602768166254, 0.27973433268645215]], "peak_params_": [[5.536103603164668, 0.4707318289481699, 0.6373661290349397], [8.52403387806123, 1.0635577565750776, 2.9081779503213596], [14.982805335138448, 0.24451234222910778, 7.03934086246905], [18.336520312746888, 0.5491113022161026, 1.2631800306924188], [23.659356941438023, 0.2338805351447968, 5.188886090371227], [30.436761330060325, 0.2129084841577935, 3.2117822583572884], [54.89486520748939, 0.24133630207834744, 1.0963373535201808], [77.3145832844053, 0.24746282825146282, 2.4348557545330696], [78.66517767886339, 0.3472264112830079, 0.5594686653729043]], "r_squared_": 0.9917387328539883, "error_": 0.05283223492480741}
{"freq_range": [2.0, 80.0], "freq_res": 1.0, "aperiodic_params_": [1.3019953735584493, 1.584599596170486], "gaussian_params_": [[8.34097253712178, 1.014702344952047, 1.668748333369327], [14.095930201230551, 0.20035758411520055, 3.3313498952490086], [18.370349977463913, 0.47121952759823754, 0.5347721831132476], [24.607398278079973, 0.1850557911404892, 5.587204888228572], [55.36510068256478, 0.6294055581190554, 0.2693117375628937], [77.38163730718843, 0.8789783508607135, 0.2508541795533222], [78.72192987704335, 0.4838135199025678, 0.530594119557449]], "peak_params_": [[8.34097253712178, 1.0335307082231062, 3.337496666738654], [14.095930201230551, 0.23402678601224314, 6.662699790498017], [18.370349977463913, 0.5635376849236143, 1.0695443662264952], [24.607398278079973, 0.18554435523361346, 11.174409776457145], [55.36510068256478, 0.2510974786915332, 0.5386234751257875], [77.38163730718843, 0.27880372363266903, 0.5017083591066444], [78.72192987704335, 0.42173334068524904, 1.061188239114898]], "r_squared_": 0.9890740947927109, "error_": 0.05941173262523916}
{"freq_range": [2.0, 80.0], "freq_res": 1.0, "aperiodic_params_": [1.2087056722765477, 1.4648114182904874], "gaussian_params_": [[8.355962152510468, 1.0029455145915602, 1.6081140110402155], [17.95980764441294, 0.2515952061623699, 5.155907180069705], [55.44101016177215, 1.1260455180189972, 0.2642128111035025], [69.60146524353245, 0.708718920479763, 0.29481527174324673], [72.199434686844, 0.30623430123384693, 0.4447228647696434], [74.92164369025618, 0.2592098296443208, 0.5357966096885274], [77.18095048654999, 0.39210538701483344, 0.5578997082961872], [79.01516256357849, 0.5720313233658473, 0.5582835697167892]], "peak_params_": [[8.355962152510468, 1.0176136775913696, 3.216228022080431], [17.95980764441294, 0.25158757732002035, 10.31181436013941], [55.44101016177215, 0.27962250284176404, 0.528425622207005], [69.60146524353245, 0.2842251552041779, 0.5896305434864935], [72.199434686844, 0.2769393191232672, 0.8894457295392868], [74.92164369025618, 0.25664109928886303, 1.0715932193770548], [77.18095048654999, 0.37300177117499067, 1.1157994165923744], [79.01516256357849, 0.5737474550716423, 1.1165671394335783]], "r_squared_": 0.984779043301764, "error_": 0.05901982837327529}
{"freq_range": [2.0, 80.0], "freq_res": 1.0, "aperiodic_params_": [0.8799527569840819, 1.2162066306018902], "gaussian_params_": [[8.445088943842945, 0.9758489114003052, 1.7855063471041193], [18.11382416626661, 0.39835933967584575, 1.0706750642640757], [55.46524325188839, 1.2786192005029235, 0.2759919166773356], [69.86585904921053, 0.4320615698127965, 0.8251749886743339], [72.39554685476344, 0.82196490792529, 0.271900715322977], [74.64356972014409, 0.38002025695569946, 0.6866204609359638], [77.06781086511543, 0.4915305354649695, 0.6158597255237069], [79.09816336591982, 0.7151042162980316, 0.5847351321880842]], "peak_params_": [[8.445088943842945, 0.9459954899090979, 3.5710126942082385], [18.11382416626661, 0.3961151585880749, 2.1413501285281513], [55.46524325188839, 0.30880849140303734, 0.5519838333546712], [69.86585904921053, 0.4263903002963727, 1.6503499773486678], [72.39554685476344, 0.30077589471032473, 0.543801430645954], [74.64356972014409, 0.3338692478622838, 1.3732409218719277], [77.06781086511543, 0.49075669958376633, 1.2317194510474139], [79.09816336591982, 0.7086801825782278, 1.1694702643761683]], "r_squared_": 0.9775643112434748, "error_": 0.06329612449090773}
{"freq_range": [2.0, 80.0], "freq_res": 1.0, "aperiodic_params_": [0.7368307317924878, 1.1942884034415158], "gaussian_params_": [[6.761826168802676, 0.31043608872081907, 0.9355906290454904], [8.792167116613617, 0.8040365790571914, 0.9415166405089943], [10.16908431241423, 0.1426862897097052, 4.734191108592836], [18.255457801988786, 0.32880308244281575, 0.4857594283653139], [52.99663102398214, 0.17920050254194816, 0.2500287046110477], [56.8009814212284, 0.22787230411275258, 1.7225617620084186], [62.4417829520905, 0.24947947129907894, 2.532656646692712], [67.02534282165276, 0.26427563240609886, 0.8329877274922132], [69.51530409937328, 0.7477061259675873, 0.37132515953804573], [71.87137087172802, 0.4155348488659883, 0.7219734069488971], [74.50800583415037, 0.8872845327715823, 0.29387207728955345], [78.69821705408256, 0.37934233106681675, 2.5987979666496828]], "peak_params_": [[6.761826168802676, 0.5459525519240518, 1.8711812580909808], [8.792167116613617, 0.9408378883606284, 1.8830332810179886], [10.16908431241423, 0.4964834876879176, 9.468382217185672], [18.255457801988786, 0.3226673282366414, 0.9715188567306278], [52.99663102398214, 0.19939446966184393, 0.5000574092220954], [56.8009814212284, 0.25116125640786247, 3.445123524016837], [62.4417829520905, 0.24810928926887743, 5.065313293385424], [67.02534282165276, 0.3135599483601972, 1.6659754549844263], [69.51530409937328, 0.3381664125924464, 0.7426503190760915], [71.87137087172802, 0.42288618447061355, 1.4439468138977942], [74.50800583415037, 0.35633755362178654, 0.5877441545791069], [78.69821705408256, 0.3767932574904247, 5.1975959332993655]], "r_squared_": 0.9829707127328173, "error_": 0.04558154901011548}
{"freq_range": [2.0, 80.0], "freq_res": 1.0, "aperiodic_params_": [0.8371907526688743, 1.3073178194759942], "gaussian_params_": [[8.80878199425803, 1.0061961522304526, 1.573350331430511], [17.35190770952693, 0.2512035509289409, 2.9662215299573362], [23.442296937691108, 0.888975054179995, 0.27029538747016263], [44.388540586820085, 0.7273685415411643, 0.25000836044835645], [59.824810014746966, 0.15030274300159202, 5.857706658706803], [72.24246240958554, 0.19486659856323896, 1.924211209838314], [75.61844696922333, 0.37418300584878283, 0.3014165819733505], [77.65714869009459, 0.22919005675144677, 1.2488371682432806]], "peak_params_": [[8.80878199425803, 1.0035619000051117, 3.146700662861022], [17.35190770952693, 0.2494432129553571, 5.9324430599146725], [23.442296937691108, 0.2740429727353765, 0.5405907749403253], [44.388540586820085, 0.22132394163487357, 0.5000167208967129], [59.824810014746966, 0.15023553808135115, 11.715413317413606], [72.24246240958554, 0.21066634689762687, 3.848422419676628], [75.61844696922333, 0.29522728916079366, 0.602833163946701], [77.65714869009459, 0.22415018607471682, 2.4976743364865612]], "r_squared_": 0.98535783077999, "error_": 0.05222730870988937}
{"freq_range": [2.0, 80.0], "freq_res": 1.0, "aperiodic_params_": [0.8551087557161703, 1.3192961228497189], "gaussian_params_": [[8.83617111431002, 1.0071308086030886, 1.5797191289376267], [17.4957449470335, 0.25792958400593924, 2.6515027657067627], [23.44531241090565, 0.9745365471556238, 0.2670155766661209], [59.0834076800609, 0.14658557297672467, 5.999999999999999], [75.43791739835063, 0.19598608036503623, 4.570042204223312]], "peak_params_": [[8.83617111431002, 1.0032505346359433, 3.1594382578752533], [17.4957449470335, 0.2534621478064074, 5.303005531413525], [23.44531241090565, 0.27247301570550686, 0.5340311533322418], [59.0834076800609, 0.146875403910385, 11.999999999999998], [75.43791739835063, 0.19943336333338224, 9.140084408446624]], "r_squared_": 0.9847864879929381, "error_": 0.05545699695491174}
{"freq_range": [2.0, 80.0], "freq_res": 1.0, "aperiodic_params_": [0.8527232667712111, 1.3254724357348135], "gaussian_params_": [[8.79982187733962, 1.0393656637542028, 1.540244680147105], [13.77282855360445, 0.18545756750016332, 1.4269750428903003], [18.287308993136495, 0.36733138545337296, 1.2330043851571084], [23.197845915507635, 0.2912205511818468, 0.5843953864518462], [44.38043076076641, 0.6240064227619283, 0.2564445246328622], [59.545215037367186, 0.1490334675128221, 5.811392813774252], [72.09092115087466, 0.17534437973297398, 1.7623608582915231], [75.62606737294061, 0.4434456010189522, 0.30226500036483606], [77.62676577037442, 0.24776680332017964, 1.1621887161116309]], "peak_params_": [[8.79982187733962, 1.0313149176882515, 3.08048936029421], [13.77282855360445, 0.18747243342347686, 2.8539500857806006], [18.287308993136495, 0.3597983122432726, 2.466008770314217], [23.197845915507635, 0.275247742274892, 1.1687907729036924], [44.38043076076641, 0.21180315082632384, 0.5128890492657244], [59.545215037367186, 0.1485778076567006, 11.622785627548504], [72.09092115087466, 0.1901062798735378, 3.5247217165830462], [75.62606737294061, 0.31701716595276297, 0.6045300007296721], [77.62676577037442, 0.23691130567749052, 2.3243774322232618]], "r_squared_": 0.9874829336121104, "error_": 0.04949076536548331}
{"freq_range": [2.0, 80.0], "freq_res": 1.0, "aperiodic_params_": [1.276906078029972, 1.6218010456087006], "gaussian_params_": [[8.746925450711649, 1.1144682112445832, 1.7666287357214545], [17.8959712393459, 0.5107803140510463, 2.743480211135568], [24.18268395039853, 0.19989544420405653, 1.6872057111747814], [30.049029237781877, 0.2467550253085887, 1.434406139397255], [76.95040814553491, 0.3061890693264432, 1.512008802799817], [78.58935741666592, 0.5487969454110975, 0.3237491373565825]], "peak_params_": [[8.746925450711649, 1.1057526157732027, 3.533257471442909], [17.8959712393459, 0.5106570800548073, 5.486960422271136], [24.18268395039853, 0.24174389188383816, 3.3744114223495627], [30.049029237781877, 0.2471652489844708, 2.86881227879451], [76.95040814553491, 0.3060276285833663, 3.024017605599634], [78.58935741666592, 0.36767891784304596, 0.647498274713165]], "r_squared_": 0.9870541849396943, "error_": 0.06798641222509737}
{"freq_range": [2.0, 80.0], "freq_res": 1.0, "aperiodic_params_": [1.3039474727284004, 1.6380832998619423], "gaussian_params_": [[5.948646195243742, 0.33167261524288205, 0.8030624427589736], [8.701049232411217, 1.077003506870159, 1.3170634731907147], [15.004334766298532, 0.3276499849922076, 3.7187226546272125], [18.387507550341244, 0.43383327986092457, 0.7645643498326341], [23.20780734954624, 0.2310098696262091, 2.682267018625237], [30.268750479910562, 0.22925705389769122, 1.5801365302079802], [55.09771831741929, 0.24228581629304716, 0.43447444808475605], [77.24746979933036, 0.26472967566982525, 1.2658729028814548], [78.5956973397347, 0.610616651258954, 0.291206984983439]], "peak_params_": [[5.948646195243742, 0.4799671630915303, 1.6061248855179473], [8.701049232411217, 1.1388395240999565, 2.6341269463814294], [15.004334766298532, 0.3298245972681769, 7.437445309254425], [18.387507550341244, 0.6534835290333365, 1.5291286996652682], [23.20780734954624, 0.2627980360496067, 5.364534037250474], [30.268750479910562, 0.23542007767684558, 3.1602730604159603], [55.09771831741929, 0.23623462568626508, 0.8689488961695121], [77.24746979933036, 0.2597192106675459, 2.5317458057629096], [78.5956973397347, 0.33444902819684597, 0.582413969966878]], "r_squared_": 0.991052173639184, "error_": 0.05687542057459237}
{"freq_range": [2.0, 80.0], "freq_res": 1.0, "aperiodic_params_": [1.256524756686407, 1.5765306210654477], "gaussian_params_": [[5.9985389549075485, 0.32999845636562997, 0.816743238698824], [8.65485698721564, 1.046052805208956, 1.3154222966854119], [14.84081680532486, 0.30663130021286916, 3.9171618910996044], [18.396201717714646, 0.4445536672009978, 0.7410737331576416], [23.773062304951274, 0.19954859621686322, 2.1968761693457997], [29.706247558183076, 0.2655157499148181, 0.7092549534574638], [55.38692124833259, 0.4729925053292876, 0.31991893614457323], [69.57803818674206, 0.6168592359122955, 0.29563246866654114], [72.47919412118213, 0.7676493304127109, 0.2998182344694676], [77.33545914290329, 0.26974316127817327, 1.6307870420423225], [79.04258154059865, 0.3046929888801549, 0.25012801916854605]], "peak_params_": [[5.9985389549075485, 0.4904843874520022, 1.633486477397648], [8.65485698721564, 1.1119284645529843, 2.6308445933708238], [14.84081680532486, 0.30646844052929345, 7.834323782199209], [18.396201717714646, 0.6131691573034911, 1.4821474663152832], [23.773062304951274, 0.21841247017421073, 4.393752338691599], [29.706247558183076, 0.2474567630442056, 1.4185099069149276], [55.38692124833259, 0.22762799471464112, 0.6398378722891465], [69.57803818674206, 0.22275447379372215, 0.5912649373330823], [72.47919412118213, 0.21530046589775487, 0.5996364689389352], [77.33545914290329, 0.26409614398171644, 3.261574084084645], [79.04258154059865, 0.46053127531112503, 0.5002560383370921]], "r_squared_": 0.9902333009920115, "error_": 0.05263030266694986}
{"freq_range": [2.0, 80.0], "freq_res": 1.0, "aperiodic_params_": [1.1558079865401327, 1.384813151390006], "gaussian_params_": [[8.531046346575977, 0.9806117434125396, 1.753368557137306], [18.026003164012565, 0.4438886082547848, 1.2370000802670698], [57.54796540086405, 0.17098517366509042, 5.207586761760904], [69.81558520990853, 0.4650974201577787, 0.8376040710680531], [72.45058689151696, 1.900947313875332, 0.2501878581174601], [74.7059896753364, 0.4103436087433784, 0.6169930555587867], [77.12843877011674, 0.5581688971223232, 0.5707036191505783], [79.19139110711227, 0.7252697293707611, 0.5525349813466027]], "peak_params_": [[8.531046346575977, 0.9461579583032554, 3.506737114274612], [18.026003164012565, 0.44379099987245074, 2.4740001605341395], [57.54796540086405, 0.17034221809474537, 10.415173523521808], [69.81558520990853, 0.46376449895813343, 1.6752081421361062], [72.45058689151696, 0.39469660473579915, 0.5003757162349202], [74.7059896753364, 0.3674573618381751, 1.2339861111175734], [77.12843877011674, 0.5450578191227754, 1.1414072383011566], [79.19139110711227, 0.6856531767664421, 1.1050699626932055]], "r_squared_": 0.9746038219123598, "error_": 0.0718530434177184}
{"freq_range": [2.0, 80.0], "freq_res": 1.0, "aperiodic_params_": [0.6378320672577963, 0.9197425717839742], "gaussian_params_": [[8.063489738840802, 0.570535451815549, 2.1459264021781173], [8.73620406296228, 0.47990671682699837, 0.5945506674810264], [17.862807642771674, 0.29762496465418276, 0.6970576813389967], [48.541494827530684, 0.16082352955339788, 1.6891362074026475], [55.941016072468464, 0.4062914920582158, 0.9813923678802697], [64.64806843931892, 0.30945032748282053, 5.138190797082707], [69.51770644324527, 1.4188100519542677, 0.28903065895127505], [73.98657564912241, 0.3483743885975913, 2.759056991001853], [77.43718707532162, 1.7984922928737375, 0.2597518581225192], [79.36608329321668, 0.9781734240158243, 0.46714406541997844]], "peak_params_": [[8.063489738840802, 0.7932378385727915, 4.2918528043562345], [8.73620406296228, 0.9536308764040586, 1.1891013349620527], [17.862807642771674, 0.2919285326499938, 1.3941153626779934], [48.541494827530684, 0.15800294250636882, 3.378272414805295], [55.941016072468464, 0.48063550619316814, 1.9627847357605395], [64.64806843931892, 0.31045660200051595, 10.276381594165414], [69.51770644324527, 0.6551562094293877, 0.5780613179025501], [73.98657564912241, 0.40742397020986143, 5.518113982003706], [77.43718707532162, 0.6453694497840157, 0.5195037162450384], [79.36608329321668, 0.7926520351857909, 0.9342881308399569]], "r_squared_": 0.9570463278885908, "error_": 0.05757521529819089}
{"freq_range": [2.0, 80.0], "freq_res": 1.0, "aperiodic_params_": [0.08212237364165721, 0.5580708582795271], "gaussian_params_": [[4.028617105527075, 0.3775201038184698, 5.999999999999999], [8.597826438041619, 0.6598745921326976, 1.1853989448760387], [52.78488413696163, 0.14584585944561893, 5.999971276638212], [56.98793811771436, 0.29057135256337896, 0.7736327944322827], [62.720666446063845, 0.24613760676429142, 2.7536111851391936], [71.51261682066409, 0.3102340651999805, 3.5157216688126844], [75.00165355275912, 0.20595271607350385, 0.25000093512927596], [77.46532997540449, 1.2449438228825154, 0.26940938681845317], [79.27564474517342, 0.3257322055003136, 0.6480203220105009]], "peak_params_": [[4.028617105527075, 0.37787275578674556, 11.999999999999998], [8.597826438041619, 0.890802343005745, 2.3707978897520774], [52.78488413696163, 0.14623721959822633, 11.999942553276425], [56.98793811771436, 0.43299211650802827, 1.5472655888645654], [62.720666446063845, 0.2956527568918539, 5.507222370278387], [71.51261682066409, 0.30897366555210404, 7.031443337625369], [75.00165355275912, 0.39579703851509307, 0.5000018702585519], [77.46532997540449, 0.37260823550191324, 0.5388187736369063], [79.27564474517342, 0.32969041066912896, 1.2960406440210017]], "r_squared_": 0.9279596007314309, "error_": 0.06442266000762199}
{"freq_range": [2.0, 80.0], "freq_res": 1.0, "aperiodic_params_": [0.976957468692308, 1.3851920879510333], "gaussian_params_": [[6.6890774156132835, 0.7904967042780042, 0.2569895262642368], [8.782252902921883, 0.7443896255508681, 1.053492334586282], [13.47938224743478, 0.9831550130755204, 0.280997647236734], [14.888709522502692, 0.5094757026458406, 0.5997133629463282], [18.040108938278646, 0.2580097379655438, 0.9293040293726328], [44.395158538106614, 0.12504636499006455, 1.957515665022464], [49.50998057288772, 0.19747096026675304, 0.9302127689336078], [55.212121375031366, 0.28900157706165597, 1.29982212147188], [59.038022734287736, 0.371609811837964, 1.2454242446468073], [63.2677408863016, 0.25564849628068764, 1.6417646858044121], [68.10753321491656, 0.17855833511693395, 1.1462932862788808], [75.86535932984796, 0.4142834866901493, 4.420205492558063]], "peak_params_": [[6.6890774156132835, 0.5581868664296752, 0.5139790525284736], [8.782252902921883, 0.7286576891995146, 2.106984669172564], [13.47938224743478, 0.2332403420032415, 0.561995294473468], [14.888709522502692, 0.502002652788443, 1.1994267258926563], [18.040108938278646, 0.25777026812919257, 1.8586080587452656], [44.395158538106614, 0.12252430393678448, 3.915031330044928], [49.50998057288772, 0.17405525542070932, 1.8604255378672157], [55.212121375031366, 0.2871235793992404, 2.59964424294376], [59.038022734287736, 0.38457664746211995, 2.4908484892936147], [63.2677408863016, 0.2606323432258235, 3.2835293716088243], [68.10753321491656, 0.26685138689172727, 2.2925865725577617], [75.86535932984796, 0.4140913393034955, 8.840410985116126]], "r_squared_": 0.9749002535578981, "error_": 0.05427578504280871}
{"freq_range": [2.0, 80.0], "freq_res": 1.0, "aperiodic_params_": [0.805653014249847, 1.2824104644574228], "gaussian_params_": [[8.858031231758531, 1.0335736284791843, 1.5142671910428325], [14.129193269818003, 0.26699405822310723, 1.3982820006832715], [18.251228956547376, 0.3625727005007014, 1.410614174958281], [23.411325392270808, 0.8357940762412263, 0.26924861803743966], [44.34409536732826, 0.6501702826125988, 0.2500021431507963], [60.413061345335386, 0.18313346219110763, 4.238801434148827], [71.86994008994746, 0.1881305368275628, 2.6457001382222876], [77.39741000417285, 0.28426524590511326, 1.8573460611847168]], "peak_params_": [[8.858031231758531, 1.0293607346213434, 3.028534382085665], [14.129193269818003, 0.2729612335620875, 2.796564001366543], [18.251228956547376, 0.3626547087343264, 2.821228349916562], [23.411325392270808, 0.26146240758091677, 0.5384972360748793], [44.34409536732826, 0.25225501904668257, 0.5000042863015925], [60.413061345335386, 0.18227400976972974, 8.477602868297653], [71.86994008994746, 0.19643888930005282, 5.291400276444575], [77.39741000417285, 0.30662858705223806, 3.7146921223694336]], "r_squared_": 0.988694774510483, "error_": 0.047233348741817636}
{"freq_range": [2.0, 80.0], "freq_res": 1.0, "aperiodic_params_": [1.119245938282303, 1.5434995893693584], "gaussian_params_": [[8.941158201988555, 1.2148449272070863, 1.5371326514400392], [12.994104384091523, 0.2291135915010602, 1.5098761660023758], [18.510370286860073, 0.6082913936717873, 2.0314862999999512], [23.30390212332657, 0.37356828826917904, 0.524062583300858], [57.40628729868865, 0.6238017982835061, 0.3342408407518739], [61.23862601990337, 0.22800237773726845, 1.5320154741980743], [68.93953261989328, 0.3030466740333857, 0.821046044698346], [72.77552728005725, 0.2973351331528481, 0.5995112937603332], [75.4678088298764, 0.4650377441385273, 0.8405987675959308], [78.20379359982223, 0.5460239414801296, 1.31105413064096]], "peak_params_": [[8.941158201988555, 1.2208922894156717, 3.0742653028800784], [12.994104384091523, 0.28166862222682804, 3.0197523320047517], [18.510370286860073, 0.5909614297841868, 4.0629725999999025], [23.30390212332657, 0.368661189636045, 1.048125166601716], [57.40628729868865, 0.30294982361802547, 0.6684816815037478], [61.23862601990337, 0.2252532986990856, 3.0640309483961485], [68.93953261989328, 0.30222655819745836, 1.642092089396692], [72.77552728005725, 0.28366594885997265, 1.1990225875206664], [75.4678088298764, 0.42620135042745755, 1.6811975351918615], [78.20379359982223, 0.5444445891456726, 2.62210826128192]], "r_squared_": 0.9892588486081967, "error_": 0.0507575036137783}
{"freq_range": [2.0, 80.0], "freq_res": 1.0, "aperiodic_params_": [1.2213652666992514, 1.642261282380819], "gaussian_params_": [[8.964260579645611, 1.175075549866385, 1.7615927433396037], [18.373277978582127, 0.6087814759485937, 3.9432140802672198], [77.45196639138051, 0.39903397477948566, 1.8728864939288306]], "peak_params_": [[8.964260579645611, 1.2109318052483466, 3.5231854866792074], [18.373277978582127, 0.6060621598262436, 7.8864281605344395], [77.45196639138051, 0.3875824919459945, 3.745772987857661]], "r_squared_": 0.9849924377936952, "error_": 0.0752470869298572}
{"freq_range": [2.0, 80.0], "freq_res": 1.0, "aperiodic_params_": [1.3073136773658878, 1.6783344885528069], "gaussian_params_": [[8.782540387636182, 1.0716315238329261, 1.7358607867083715], [18.247699415261454, 0.5420831771999912, 3.970021920438625], [29.717316596349395, 0.25369946094721596, 0.7402558507939813], [72.57125858071255, 0.9127040830982124, 0.25620324001045586], [77.7319842665407, 0.3230972123920662, 1.5173824157525413], [78.9948521823958, 0.09705537673812452, 0.2502185788598739]], "peak_params_": [[8.782540387636182, 1.0992154909672487, 3.471721573416743], [18.247699415261454, 0.5410298954442146, 7.94004384087725], [29.717316596349395, 0.24263879005981115, 1.4805117015879625], [72.57125858071255, 0.22752161604178478, 0.5124064800209117], [77.7319842665407, 0.31813212047898487, 3.0347648315050826], [78.9948521823958, 0.32490806740554046, 0.5004371577197478]], "r_squared_": 0.9878461947409152, "error_": 0.06576391224815863}
{"freq_range": [2.0, 80.0], "freq_res": 1.0, "aperiodic_params_": [1.2046663176123036, 1.5806249186820378], "gaussian_params_": [[8.718780083676869, 1.086061639218204, 1.8775740358976691], [18.029627809218255, 0.5179250934477498, 3.7989501450566827], [23.35860012803374, 0.4611494841328101, 0.25000000000000006], [55.38389251235748, 0.7670003787604583, 0.25000000000000006], [74.69544139120643, 0.17844808222295086, 5.999999999999999], [78.72630942648628, 0.351683697152771, 0.4691108571083069]], "peak_params_": [[8.718780083676869, 1.1046722201244965, 3.7551480717953383], [18.029627809218255, 0.5179147107187096, 7.597900290113365], [23.35860012803374, 0.38490682173020985, 0.5000000000000001], [55.38389251235748, 0.2367376093690814, 0.5000000000000001], [74.69544139120643, 0.17821833967530543, 11.999999999999998], [78.72630942648628, 0.4346039833373405, 0.9382217142166138]], "r_squared_": 0.9854484033375897, "error_": 0.07017745293239887}
{"freq_range": [2.0, 80.0], "freq_res": 1.0, "aperiodic_params_": [1.0315199123582206, 1.373297486050242], "gaussian_params_": [[8.74009645745721, 1.0658646253108142, 1.9490930876903216], [17.875212068985316, 0.36178490517457434, 4.071202433825768], [18.375042833177382, 0.2805218984879426, 0.7757299104599563], [23.317903149166963, 0.2981771238083556, 0.5009655893363183], [67.85124333916043, 0.2913408157224316, 5.999999999999999], [74.96994391870574, 0.20335375412257423, 0.6459826698224663], [77.39241235938972, 1.121234278540918, 0.28279944687873637], [79.20183951689499, 0.5538333845549225, 0.570539712488785]], "peak_params_": [[8.74009645745721, 1.0900415358947138, 3.8981861753806433], [17.875212068985316, 0.6112084353249921, 8.142404867651535], [18.375042833177382, 0.6112084353249921, 1.5514598209199126], [23.317903149166963, 0.40761925814999567, 1.0019311786726366], [67.85124333916043, 0.29125128853496207, 11.999999999999998], [74.96994391870574, 0.34640017952054136, 1.2919653396449327], [77.39241235938972, 0.5210327309009839, 0.5655988937574727], [79.20183951689499, 0.5720794700039633, 1.14107942497757]], "r_squared_": 0.981461137246776, "error_": 0.06415242081566123}
{"freq_range": [2.0, 80.0], "freq_res": 1.0, "aperiodic_params_": [0.6166420496823825, 0.9134125788321068], "gaussian_params_": [[8.572414558917117, 0.8961876732018146, 1.8927208713407442], [18.002390002351934, 0.3288265570775504, 1.0120692909352564], [59.02158653319614, 0.2068253237383137, 5.999999999999989], [62.69074448405435, 0.23021839524452675, 0.5227097156380681], [65.79724675293797, 0.27343649878123444, 1.0848257382411204], [69.48703144406713, 0.4059853286467722, 0.83832275994952], [74.27862849915792, 0.3570086764374163, 2.690947710106736], [77.33910072273973, 0.8655868409449953, 0.2602725787657352], [79.40276949609891, 0.5397593745888802, 0.523231657886278]], "peak_params_": [[8.572414558917117, 0.8736082773761567, 3.7854417426814884], [18.002390002351934, 0.3288293127217659, 2.024138581870513], [59.02158653319614, 0.2068240216863797, 11.999999999999979], [62.69074448405435, 0.36916121795940426, 1.0454194312761362], [65.79724675293797, 0.3770798286938424, 2.1696514764822408], [69.48703144406713, 0.4504563022460397, 1.67664551989904], [74.27862849915792, 0.3642695496367925, 5.381895420213472], [77.33910072273973, 0.5868595492430121, 0.5205451575314703], [79.40276949609891, 0.47876198479801957, 1.046463315772556]], "r_squared_": 0.9623388733326468, "error_": 0.05827128203607035}
{"freq_range": [2.0, 80.0], "freq_res": 1.0, "aperiodic_params_": [0.42193460894412876, 1.0000644051404153], "gaussian_params_": [[5.505740335272955, 0.8881826193761815, 0.26211776515370977], [8.487290499157917, 0.6821903346634012, 1.361057134646022], [11.452034599135956, 0.24417302939924998, 5.288488885060984], [18.230407493509453, 0.13838125386350963, 1.3819299108299563], [52.30517757830454, 0.1775719387505096, 4.088479774672947], [56.80868037564032, 0.298610055994291, 0.596704441562857], [60.65042681736874, 0.2543613240163912, 2.38066667181932], [71.54796540086404, 0.4357745732094463, 5.999999999999999]], "peak_params_": [[5.505740335272955, 0.4220716484604986, 0.5242355303074195], [8.487290499157917, 0.8371625140787865, 2.722114269292044], [11.452034599135956, 0.36739456573835383, 10.576977770121967], [18.230407493509453, 0.24992137185610885, 2.7638598216599126], [52.30517757830454, 0.17958289206362332, 8.176959549345893], [56.80868037564032, 0.4770450408207596, 1.193408883125714], [60.65042681736874, 0.3630691931510719, 4.76133334363864], [71.54796540086404, 0.43454417823968194, 11.999999999999998]], "r_squared_": 0.9521219117816538, "error_": 0.0657468970228756}
{"freq_range": [2.0, 80.0], "freq_res": 1.0, "aperiodic_params_": [0.5415774673377024, 0.9676144070294012], "gaussian_params_": [[6.621038461796102, 0.8965900463959063, 0.31989504674246505], [8.800340533250784, 0.7240008572290405, 0.8301495226004034], [14.562179621033248, 0.6483407415389548, 0.29165609451240887], [14.635827616950339, 0.1783515988129168, 2.928988542904266], [53.239973691660666, 0.15657798384261626, 5.999999999999999], [59.56172496245463, 0.6718934467663129, 0.2707616946302189], [63.14396998136229, 0.15440157082639883, 1.0102181078610126], [72.84177212333059, 0.28492967862834734, 5.999993229624535]], "peak_params_": [[6.621038461796102, 0.5193804222279614, 0.6397900934849301], [8.800340533250784, 0.7313710581860947, 1.6602990452008068], [14.562179621033248, 0.38709996064518154, 0.5833121890248177], [14.635827616950339, 0.38709996064518154, 5.857977085808532], [53.239973691660666, 0.1576550927053022, 11.999999999999998], [59.56172496245463, 0.29434092469907935, 0.5415233892604377], [63.14396998136229, 0.2687566910441701, 2.0204362157220253], [72.84177212333059, 0.2855217108999726, 11.99998645924907]], "r_squared_": 0.9494476698234349, "error_": 0.0592575572878705}
{"freq_range": [2.0, 80.0], "freq_res": 1.0, "aperiodic_params_": [0.8675089558236623, 1.4762123881693905], "gaussian_params_": [[8.888187219841125, 1.1054790720595093, 1.6962436674685264], [12.968929725143663, 0.18025953333026715, 1.1883144889909765], [17.435977109980186, 0.5047414112481584, 3.100357541893541], [54.959270740637926, 0.2744631493630204, 1.7614944341577787], [57.47314741674408, 0.9164158329556089, 0.29791209263679824], [60.877135487602274, 0.2941415718469272, 1.370692985111494], [63.401618980958204, 0.5617714050134641, 0.3017131600252455], [65.53175886952346, 1.0801260721251371, 0.28885621933491956], [68.96586389375075, 0.35245218998677735, 0.8743712792515519], [72.62077489448485, 0.32518971141874203, 0.7544094761975255], [75.99265912263506, 0.4515407511018142, 1.4154317887856531], [78.56026537492853, 0.38634486293047865, 0.7715407890120486]], "peak_params_": [[8.888187219841125, 1.1162176420034102, 3.392487334937053], [12.968929725143663, 0.42010894968960116, 2.376628977981953], [17.435977109980186, 0.5003590710176892, 6.200715083787082], [54.959270740637926, 0.2744197431510622, 3.5229888683155575], [57.47314741674408, 0.40530876588104947, 0.5958241852735965], [60.877135487602274, 0.2937292382697301, 2.741385970222988], [63.401618980958204, 0.3202929391410292, 0.603426320050491], [65.53175886952346, 0.29171100759914603, 0.5777124386698391], [68.96586389375075, 0.3521892000275484, 1.7487425585031038], [72.62077489448485, 0.3349063500570495, 1.508818952395051], [75.99265912263506, 0.4531187132758496, 2.8308635775713062], [78.56026537492853, 0.3756800647838605, 1.5430815780240972]], "r_squared_": 0.9877143275504349, "error_": 0.04915821051198474}
{"freq_range": [2.0, 80.0], "freq_res": 1.0, "aperiodic_params_": [1.21770770806379, 1.6796573623961186], "gaussian_params_": [[8.953555096881226, 1.1891023636892795, 1.489725720357911], [12.051825196242651, 0.28296538834323265, 0.9752265216299397], [18.20028100742978, 0.5995862169892808, 3.413939089176285], [54.60548063855728, 0.30256437449976964, 0.3173722562000191], [58.999175922280365, 0.21019281304805376, 3.7699626528539243], [68.75958779835389, 0.2871039738138471, 0.6108555870657779], [72.62463554785616, 0.3043853725595294, 0.6618844223825614], [75.43688223464909, 0.38843880830796557, 0.8006499015058726], [78.23806437197065, 0.5017166547864391, 1.092372504883198]], "peak_params_": [[8.953555096881226, 1.2065175747295942, 2.979451440715822], [12.051825196242651, 0.5447420409468884, 1.9504530432598794], [18.20028100742978, 0.5985553322656257, 6.82787817835257], [54.60548063855728, 0.25947051711320257, 0.6347445124000382], [58.999175922280365, 0.2101928080263613, 7.539925305707849], [68.75958779835389, 0.2719383163506397, 1.2217111741315558], [72.62463554785616, 0.2631701062262606, 1.3237688447651228], [75.43688223464909, 0.34142210953307783, 1.6012998030117451], [78.23806437197065, 0.49225485823561566, 2.184745009766396]], "r_squared_": 0.9894069288694839, "error_": 0.0560766824937978}
{"freq_range": [2.0, 80.0], "freq_res": 1.0, "aperiodic_params_": [1.248943687951315, 1.6747782650062937], "gaussian_params_": [[8.937309013598256, 1.229783882874183, 1.6313720150011586], [12.270529225557567, 0.24918457171291178, 1.0879770856061526], [18.291158277518985, 0.668076713748739, 2.92614259456132], [23.42519606155784, 0.7919383578507808, 0.28208594053965197], [72.59151475552669, 0.662979924591871, 0.2874241347942282], [77.6166549381659, 0.38415980412053763, 1.8091419197597618]], "peak_params_": [[8.937309013598256, 1.2359149503571356, 3.262744030002317], [12.270529225557567, 0.5189327704554643, 2.175954171212305], [18.291158277518985, 0.6647781434106659, 5.85228518912264], [23.42519606155784, 0.4373061758417952, 0.5641718810793039], [72.59151475552669, 0.25630211500856737, 0.5748482695884564], [77.6166549381659, 0.3756317353154932, 3.6182838395195236]], "r_squared_": 0.9865242168643564, "error_": 0.07149967607037468}
{"freq_range": [2.0, 80.0], "freq_res": 1.0, "aperiodic_params_": [1.2703280688983856, 1.6957198690241169], "gaussian_params_": [[8.800761714738973, 1.142780874657803, 1.4833080759941788], [11.626842395196814, 0.3257589563128342, 0.8391668744925084], [18.111161204443857, 0.5920515598726974, 4.069474177783307], [23.04732427630303, 0.157626927814672, 0.25000323476113967], [77.56312148077036, 0.3041192375036809, 3.1801358413308622]], "peak_params_": [[8.800761714738973, 1.1832367034196323, 2.9666161519883576], [11.626842395196814, 0.5984504513529589, 1.6783337489850167], [18.111161204443857, 0.5918307246078326, 8.138948355566614], [23.04732427630303, 0.4425457268178693, 0.5000064695222793], [77.56312148077036, 0.3012629857106195, 6.3602716826617245]], "r_squared_": 0.9859119922999274, "error_": 0.07516898087559953}
{"freq_range": [2.0, 80.0], "freq_res": 1.0, "aperiodic_params_": [1.2343573248663096, 1.6602777648562126], "gaussian_params_": [[8.801280886463722, 1.1279323468833142, 1.6191015565776385], [11.63475276375483, 0.2836706975492458, 0.7494088663583288], [18.154712225140305, 0.5834215345178314, 3.916873672022972], [23.181168283947184, 0.22483547090922326, 0.2501376815761996], [71.31293248955227, 0.16076214944791486, 5.999999999999999], [77.35925036229834, 0.3444815600999812, 0.7713422151468057], [79.38377489632215, 0.6288604460613528, 0.324366501648792]], "peak_params_": [[8.801280886463722, 1.1580542842036945, 3.238203113155277], [11.63475276375483, 0.5818908243537191, 1.4988177327166576], [18.154712225140305, 0.5829667059314293, 7.833747344045944], [23.181168283947184, 0.4444168284490916, 0.5002753631523992], [71.31293248955227, 0.16054364649472874, 11.999999999999998], [77.35925036229834, 0.4116619294850259, 1.5426844302936114], [79.38377489632215, 0.4189233825303771, 0.648733003297584]], "r_squared_": 0.9877957615201349, "error_": 0.06526487945718698}
{"freq_range": [2.0, 80.0], "freq_res": 1.0, "aperiodic_params_": [1.0690560593529497, 1.5065641129302858], "gaussian_params_": [[8.927975571170007, 1.1165958863088215, 2.0393310620604654], [18.517513074756895, 0.6121891869794805, 4.109212823318937], [69.08045352165266, 0.23050213688926235, 5.999999999999999], [77.15909955894067, 0.37240941459992666, 0.7225617881103896], [79.43552270914064, 0.9830281154302338, 0.3076160296333012]], "peak_params_": [[8.927975571170007, 1.157778889120877, 4.078662124120931], [18.517513074756895, 0.6079893648759486, 8.218425646637874], [69.08045352165266, 0.23048141577735515, 11.999999999999998], [77.15909955894067, 0.4599532645117048, 1.4451235762207792], [79.43552270914064, 0.43410004266710245, 0.6152320592666024]], "r_squared_": 0.9864024139948808, "error_": 0.06453690168014653}
{"freq_range": [2.0, 80.0], "freq_res": 1.0, "aperiodic_params_": [0.7652538944101772, 1.2311007639028881], "gaussian_params_": [[8.811063011668889, 0.979932314146858, 2.041409065710564], [17.096384895975035, 0.42376622738458747, 2.630015950900524], [18.73593159505956, 0.20700007749757132, 0.4856060394989428], [21.329673060254187, 0.3266894675880931, 0.3203912597333677], [23.39198696212636, 0.4529369719287411, 0.35442898201138173], [57.02621982927395, 0.1028794575911222, 1.5596283421410995], [62.114638399348316, 0.04040448492741705, 0.255147872369808], [66.54796540086404, 0.3912985051042547, 5.999999999999999]], "peak_params_": [[8.811063011668889, 0.9794531979954895, 4.082818131421128], [17.096384895975035, 0.42414335843626144, 5.260031901801048], [18.73593159505956, 0.5046635325173245, 0.9712120789978856], [21.329673060254187, 0.3332594897570742, 0.6407825194667354], [23.39198696212636, 0.279833118789207, 0.7088579640227635], [57.02621982927395, 0.2131765100826395, 3.119256684282199], [62.114638399348316, 0.3307545154709757, 0.510295744739616], [66.54796540086404, 0.39018957830774537, 11.999999999999998]], "r_squared_": 0.961042743880673, "error_": 0.08018554186570155}
{"freq_range": [2.0, 80.0], "freq_res": 1.0, "aperiodic_params_": [0.3863978882791785, 0.9654801165570072], "gaussian_params_": [[9.952712232988093, 0.43072997365848203, 5.693295466873787], [62.54796540086405, 0.32121042770736397, 5.999999999999999]], "peak_params_": [[9.952712232988093, 0.43071511643091226, 11.386590933747573], [62.54796540086405, 0.32030012805254504, 11.999999999999998]], "r_squared_": 0.8980073886456021, "error_": 0.11269301837350369}
{"freq_range": [2.0, 80.0], "freq_res": 1.0, "aperiodic_params_": [0.752332367337786, 1.4383966500419845], "gaussian_params_": [[8.5828503086491, 0.624658325414435, 1.8134423656583796], [13.738594819905199, 0.5057734955426713, 2.26841046380921], [19.285823912945006, 0.379308778323994, 2.2488029526979325], [75.2013948231626, 0.2444364576699375, 5.999999999999999]], "peak_params_": [[8.5828503086491, 0.665426557033801, 3.626884731316759], [13.738594819905199, 0.5335850205280069, 4.53682092761842], [19.285823912945006, 0.41059445584376286, 4.497605905395865], [75.2013948231626, 0.2442987976682638, 11.999999999999998]], "r_squared_": 0.9811662919730428, "error_": 0.07031394513581866}
{"freq_range": [2.0, 80.0], "freq_res": 1.0, "aperiodic_params_": [1.059660154707799, 1.6071137214020765], "gaussian_params_": [[8.929931407363267, 1.048893640888517, 1.4802514947537726], [11.501001151047758, 0.9940241171522995, 0.3176271533512658], [12.947091725713983, 0.2542346892399527, 1.0207029802316512], [17.62184725924851, 0.5796094426747079, 3.9643213286013155], [54.96390952633737, 0.2474634585831079, 0.6354260222690549], [76.86560452453338, 0.33156842479771464, 2.9980910299764383]], "peak_params_": [[8.929931407363267, 1.1023164460852783, 2.960502989507545], [11.501001151047758, 0.7888104015494876, 0.6352543067025316], [12.947091725713983, 0.5715970380918778, 2.0414059604633024], [17.62184725924851, 0.5769796996829669, 7.928642657202631], [54.96390952633737, 0.24706463020816072, 1.2708520445381097], [76.86560452453338, 0.33123545512421915, 5.996182059952877]], "r_squared_": 0.9853873426554371, "error_": 0.0687190216219442}
{"freq_range": [2.0, 80.0], "freq_res": 1.0, "aperiodic_params_": [1.0458709670136712, 1.5968674651497086], "gaussian_params_": [[8.929720899714058, 1.0553173048623257, 1.489456635891324], [11.49839509699031, 1.0118055638093235, 0.31806972453968546], [12.953641932614028, 0.2606880755412158, 1.0326236290224193], [17.65380245845928, 0.5909486460380203, 3.901315383760462], [76.71453476606341, 0.314301738553902, 3.1314486756548185]], "peak_params_": [[8.929720899714058, 1.1047941890382138, 2.978913271782648], [11.49839509699031, 0.8796483413780187, 0.6361394490793709], [12.953641932614028, 0.5757679331094159, 2.0652472580448387], [17.65380245845928, 0.5886282010400412, 7.802630767520924], [76.71453476606341, 0.31299847972758776, 6.262897351309637]], "r_squared_": 0.9854599186780993, "error_": 0.07005227675369782}
{"freq_range": [2.0, 80.0], "freq_res": 1.0, "aperiodic_params_": [1.2884958476076716, 1.700545944582767], "gaussian_params_": [[8.847279941778257, 0.9435169723829308, 1.1870194824861144], [11.490050103228208, 0.6036749178267489, 0.7507448312030137], [17.221805858883386, 0.5087630180208047, 5.141880089664595], [77.87947237658182, 0.28861390206598336, 3.4842018045739773]], "peak_params_": [[8.847279941778257, 1.0798902511291346, 2.374038964972229], [11.490050103228208, 0.9147154629607142, 1.5014896624060274], [17.221805858883386, 0.5082898824416772, 10.28376017932919], [77.87947237658182, 0.2884412690267195, 6.968403609147955]], "r_squared_": 0.9897389112195248, "error_": 0.063717060503212}
{"freq_range": [2.0, 80.0], "freq_res": 1.0, "aperiodic_params_": [1.1293526241219247, 1.6490360725368454], "gaussian_params_": [[8.881099480931116, 0.8949208894134999, 1.5664099497207236], [11.493306017186567, 1.3784663835475257, 0.28580733669489305], [17.241220232102172, 0.5550451373557899, 4.814629036797844], [58.251454153467016, 0.14722134517607857, 2.1165731798467378], [72.64119412684519, 0.19290899174713022, 5.999999999999999], [77.39327192284212, 0.3695079464889181, 0.5972135372574539], [79.37184311601736, 0.49195914918454486, 0.33695768047073976]], "peak_params_": [[8.881099480931116, 1.0206095777818804, 3.132819899441447], [11.493306017186567, 0.9088395115478425, 0.5716146733897861], [17.241220232102172, 0.554350260355953, 9.629258073595688], [58.251454153467016, 0.15601108616506965, 4.2331463596934755], [72.64119412684519, 0.1925643635273906, 11.999999999999998], [77.39327192284212, 0.4456491015635282, 1.1944270745149077], [79.37184311601736, 0.3875254775406336, 0.6739153609414795]], "r_squared_": 0.9905731323087147, "error_": 0.056620112751427476}
{"freq_range": [2.0, 80.0], "freq_res": 1.0, "aperiodic_params_": [1.0968721073206467, 1.6271730202341086], "gaussian_params_": [[8.88199830387087, 0.8865243172599543, 1.5893307858653993], [11.495197814764097, 1.4600514867110874, 0.27925556733757473], [17.302814524660782, 0.5603302294414937, 4.839407749069196], [77.01569122035399, 0.3143472197724972, 5.999999999999999]], "peak_params_": [[8.88199830387087, 1.0126921805290423, 3.1786615717307987], [11.495197814764097, 0.90781633997177, 0.5585111346751495], [17.302814524660782, 0.5592362779809219, 9.678815498138391], [77.01569122035399, 0.314346144818628, 11.999999999999998]], "r_squared_": 0.9871737511695275, "error_": 0.06807082483330221}
{"freq_range": [2.0, 80.0], "freq_res": 1.0, "aperiodic_params_": [1.0865923442874756, 1.6142992026460918], "gaussian_params_": [[8.880558104043692, 0.8952946934285445, 1.5282478474574348], [11.468998287231711, 1.1259389875957133, 0.2972702163155188], [12.951651592000989, 0.12357773168588762, 1.046381589687923], [17.58832837905169, 0.5153052962736885, 4.079212935225328], [56.898532887604524, 0.23300623245600355, 0.5773903268323889], [59.47597177246187, 0.643421850416567, 0.3239670561434824], [71.34011911989779, 0.22459684824974696, 5.999999999999999], [75.36325011670655, 0.2698489325813272, 0.2711315707942288], [77.3913207754536, 0.38825197224233476, 0.5498135593987046], [79.33006255112385, 0.31424478199327055, 0.6509912557679347]], "peak_params_": [[8.880558104043692, 0.9488359170688557, 3.0564956949148696], [11.468998287231711, 0.8281251666447847, 0.5945404326310376], [12.951651592000989, 0.4208536783134047, 2.092763179375846], [17.58832837905169, 0.5126889530525938, 8.158425870450657], [56.898532887604524, 0.24234864484528207, 1.1547806536647778], [59.47597177246187, 0.2460664954720042, 0.6479341122869648], [71.34011911989779, 0.22423628254634398, 11.999999999999998], [75.36325011670655, 0.2964900572594873, 0.5422631415884576], [77.3913207754536, 0.4458379458932491, 1.0996271187974092], [79.33006255112385, 0.38113882422819856, 1.3019825115358694]], "r_squared_": 0.990648617552014, "error_": 0.050892134348198635}
{"freq_range": [2.0, 80.0], "freq_res": 1.0, "aperiodic_params_": [1.0770516659197065, 1.6108109562036121], "gaussian_params_": [[8.826621580742007, 0.8508744291340079, 1.5253667563539406], [11.483818103200267, 1.6671654399372382, 0.2614355291970764], [15.727340752584611, 0.4841300283995184, 3.788331707890383], [19.744048648813443, 0.23508729640361978, 1.237769740301694], [23.45742780088964, 1.2877410184772222, 0.2549346809833477], [57.0867102344773, 0.2105945092770036, 0.5940985005643714], [59.48561018250299, 1.1535547579165633, 0.2684055846493046], [62.53758815251328, 0.16788660900253144, 1.3576566589687726], [65.97408061942077, 0.17788189251017927, 0.5093724182353849], [69.43442499047659, 0.1609230686950037, 1.9223913822044953], [72.46258242018543, 0.8699104335529787, 0.25942555535517275], [77.61704243383929, 0.3782412477916424, 3.096396823605554]], "peak_params_": [[8.826621580742007, 0.9454398230946055, 3.050733512707881], [11.483818103200267, 0.8313924240295589, 0.5228710583941528], [15.727340752584611, 0.4853144601871149, 7.576663415780766], [19.744048648813443, 0.4864107291038967, 2.475539480603388], [23.45742780088964, 0.3415385113219076, 0.5098693619666954], [57.0867102344773, 0.20840432144463406, 1.1881970011287428], [59.48561018250299, 0.2313228542865533, 0.5368111692986092], [62.53758815251328, 0.15902542062368652, 2.7153133179375453], [65.97408061942077, 0.21710525015956827, 1.0187448364707699], [69.43442499047659, 0.16473919675762105, 3.8447827644089907], [72.46258242018543, 0.3164692383832217, 0.5188511107103455], [77.61704243383929, 0.37536728765094973, 6.192793647211108]], "r_squared_": 0.9928337630605738, "error_": 0.04486844807471176}
{"freq_range": [2.0, 80.0], "freq_res": 1.0, "aperiodic_params_": [0.5803704784182333, 1.2487152100598855], "gaussian_params_": [[7.50435402828922, 0.44771796871001407, 1.4187633848377874], [13.423137597034122, 0.4820757166750669, 2.504421659177393], [18.98959857855904, 0.26862506225185595, 1.4176968205504794], [44.79858568468173, 0.20369303819316198, 0.7091651504897335], [53.62153396700397, 0.15966759965018582, 4.359926360519141], [72.07530612567649, 0.20030269635206222, 5.9379689822170905], [76.43010179717244, 0.5735024689878866, 0.2577143149967163]], "peak_params_": [[7.50435402828922, 0.4674409933060718, 2.837526769675575], [13.423137597034122, 0.47552669929267954, 5.008843318354786], [18.98959857855904, 0.309015320995343, 2.835393641100959], [44.79858568468173, 0.21824696714180458, 1.418330300979467], [53.62153396700397, 0.1610151523968273, 8.719852721038283], [72.07530612567649, 0.20030870732169337, 11.875937964434181], [76.43010179717244, 0.3034703396362368, 0.5154286299934326]], "r_squared_": 0.9784240137031044, "error_": 0.0487990160875198}
{"freq_range": [2.0, 80.0], "freq_res": 1.0, "aperiodic_params_": [0.9040597175609243, 1.518593119218905], "gaussian_params_": [[8.497783851494557, 0.40258519683541916, 1.4206834217078292], [13.01508592426619, 0.5838676963724606, 2.8640087845654616], [19.42458155263718, 0.40770197177478046, 1.612272243726411], [46.11881090814083, 0.21276868453698522, 0.6364012618449667], [72.59367238316219, 0.32085992137408725, 0.4913798255499869], [77.28267407696026, 0.3322277081459314, 1.8267458339559886]], "peak_params_": [[8.497783851494557, 0.5046494819853319, 2.8413668434156585], [13.01508592426619, 0.586659987644386, 5.728017569130923], [19.42458155263718, 0.45958323225548303, 3.224544487452822], [46.11881090814083, 0.2090929040483509, 1.2728025236899334], [72.59367238316219, 0.2492245278658356, 0.9827596510999738], [77.28267407696026, 0.32827382015470485, 3.653491667911977]], "r_squared_": 0.9852571421072653, "error_": 0.064012446234418}
{"freq_range": [2.0, 80.0], "freq_res": 1.0, "aperiodic_params_": [1.3470791336986376, 1.76725861806969], "gaussian_params_": [[8.590692235777883, 0.6429409099469268, 1.0502487478362812], [11.591678297252166, 0.709507306519153, 1.475595054034657], [17.688788765284077, 0.4988241409946655, 3.96185226962936], [77.26323615229451, 0.27475397874635593, 3.575980585492442]], "peak_params_": [[8.590692235777883, 0.7926945426519623, 2.1004974956725624], [11.591678297252166, 0.8640922148523072, 2.951190108069314], [17.688788765284077, 0.4973444811729026, 7.92370453925872], [77.26323615229451, 0.2740105719014816, 7.151961170984884]], "r_squared_": 0.9882586910760112, "error_": 0.06781762294547235}
{"freq_range": [2.0, 80.0], "freq_res": 1.0, "aperiodic_params_": [1.3672829836322475, 1.8135537112582887], "gaussian_params_": [[10.64597186872228, 0.8676286499547785, 2.236969785233781], [18.344444110905474, 0.4562335311040973, 3.7261017466164503], [26.418762020606998, 0.6343096807379767, 0.25000000000000006], [60.296571522511236, 0.11913895311891162, 2.184900950263665], [72.55790400701314, 0.32799533948928994, 0.4987670466203641], [75.4598947956949, 1.4928693082171378, 0.25000101792780965], [78.1328826538164, 0.4403318610894062, 1.2430258345392533]], "peak_params_": [[10.64597186872228, 0.9222244318996166, 4.473939570467562], [18.344444110905474, 0.45819215978645644, 7.452203493232901], [26.418762020606998, 0.2112444376757383, 0.5000000000000001], [60.296571522511236, 0.11804645601898489, 4.36980190052733], [72.55790400701314, 0.22153064433975067, 0.9975340932407282], [75.4598947956949, 0.2932944338696175, 0.5000020358556193], [78.1328826538164, 0.43782294471864724, 2.4860516690785066]], "r_squared_": 0.9938225245926218, "error_": 0.048502399558530127}
{"freq_range": [2.0, 80.0], "freq_res": 1.0, "aperiodic_params_": [1.2398965837561677, 1.6425426409925343], "gaussian_params_": [[10.440819793939704, 0.7976036927151529, 2.1287107536507524], [18.038124722474045, 0.5664856843488754, 4.248386533516036], [79.54895621683907, 0.24478246102538098, 5.999999999850675]], "peak_params_": [[10.440819793939704, 0.8752727347047045, 4.257421507301505], [18.038124722474045, 0.567920192176469, 8.496773067032072], [79.54895621683907, 0.24409178912989082, 11.99999999970135]], "r_squared_": 0.991318362580371, "error_": 0.05934388809027158}
{"freq_range": [2.0, 80.0], "freq_res": 1.0, "aperiodic_params_": [1.1495262784250069, 1.6522480543182412], "gaussian_params_": [[10.737133923723889, 0.6445601310473014, 2.268390094213305], [15.431528940480645, 0.4940989056820435, 1.0578586683380247], [17.402606819563754, 0.5565753193252022, 0.358920515303747], [19.42543755671967, 0.5246473786707438, 1.2902033766504444], [23.11776435940723, 0.29006107725083613, 0.8330860239862], [58.91970696863981, 0.12866700400609277, 2.823734395096947], [68.57171553835411, 0.19273085824876887, 2.3833177899912297], [72.44652665196607, 0.6646181224422599, 0.29129171915708524], [75.03181535464182, 0.1941499501986559, 0.5859211355208459], [77.9727308878238, 0.3634005792773029, 1.5617401317298691]], "peak_params_": [[10.737133923723889, 0.640323230809115, 4.53678018842661], [15.431528940480645, 0.5663686708541108, 2.1157173366760493], [17.402606819563754, 0.565184659393582, 0.717841030607494], [19.42543755671967, 0.4994331084891925, 2.5804067533008888], [23.11776435940723, 0.2984774266815249, 1.6661720479724], [58.91970696863981, 0.12867560374348996, 5.647468790193894], [68.57171553835411, 0.18986387815403005, 4.766635579982459], [72.44652665196607, 0.27400096826289744, 0.5825834383141705], [75.03181535464182, 0.25831313527958377, 1.1718422710416918], [77.9727308878238, 0.36342274347734893, 3.1234802634597383]], "r_squared_": 0.9909933542839462, "error_": 0.0478417719276066}
{"freq_range": [2.0, 80.0], "freq_res": 1.0, "aperiodic_params_": [0.4687127212602852, 1.2816747842368346], "gaussian_params_": [[9.618224616443293, 0.480367744688029, 1.912767612968506], [15.04508647984295, 0.2667319399167469, 1.5225334267683757], [17.40308114122352, 0.38490447718478094, 0.2775289110595392], [19.63433112232962, 0.2740262735938698, 0.7378404446415358], [54.927695493127985, 0.20633770594830672, 0.2501350933483166], [66.54796540086404, 0.22903969532632842, 5.999999999999999]], "peak_params_": [[9.618224616443293, 0.47199510964267155, 3.825535225937012], [15.04508647984295, 0.27578890324832406, 3.0450668535367513], [17.40308114122352, 0.2517773831167003, 0.5550578221190784], [19.63433112232962, 0.24369597666337928, 1.4756808892830715], [54.927695493127985, 0.23383070034710718, 0.5002701866966331], [66.54796540086404, 0.22839060445750592, 11.999999999999998]], "r_squared_": 0.9497758114170546, "error_": 0.0860189680117801}
{"freq_range": [2.0, 80.0], "freq_res": 1.0, "aperiodic_params_": [0.9664412126782963, 1.6338162131957508], "gaussian_params_": [[11.282283496522547, 0.5906283552171334, 2.9862480591845517], [19.03805900545225, 0.2822485902181593, 2.117119212973522], [54.01147248439548, 0.18810680834453883, 1.9751943603555295], [59.47309597863582, 0.21800636028199558, 0.7351989250538654], [71.94230600951789, 0.1615369562652756, 5.999999999999999], [77.79457333258969, 0.3283967870496372, 1.8313732199352941]], "peak_params_": [[11.282283496522547, 0.5882046174905659, 5.972496118369103], [19.03805900545225, 0.3031412023548776, 4.234238425947044], [54.01147248439548, 0.1899505836792299, 3.950388720711059], [59.47309597863582, 0.2007591287897108, 1.4703978501077308], [71.94230600951789, 0.16372977417126133, 11.999999999999998], [77.79457333258969, 0.42337230974515694, 3.6627464398705882]], "r_squared_": 0.9871811337978975, "error_": 0.05649338272129829}
{"freq_range": [2.0, 80.0], "freq_res": 1.0, "aperiodic_params_": [1.0861974183248648, 1.6561977747055823], "gaussian_params_": [[10.98056817022919, 0.6514285622187351, 2.142595825484277], [16.52264272831112, 0.27889429717379705, 1.479991056148935], [19.43624709838379, 0.9880244406823653, 0.2500256720038274], [21.057771671537175, 0.22615892432119117, 1.4706008254109617], [70.54796540086404, 0.18275840111576314, 5.999999999999999]], "peak_params_": [[10.98056817022919, 0.6516658913172273, 4.285191650968554], [16.52264272831112, 0.28237173642819247, 2.95998211229787], [19.43624709838379, 0.36988771089138006, 0.5000513440076548], [21.057771671537175, 0.22886732012073419, 2.9412016508219234], [70.54796540086404, 0.1822404698934228, 11.999999999999998]], "r_squared_": 0.9844679927503877, "error_": 0.06214948103231062}
{"freq_range": [2.0, 80.0], "freq_res": 1.0, "aperiodic_params_": [1.1168511456703312, 1.6373348960912204], "gaussian_params_": [[10.756217445390382, 0.5821796124857632, 1.8843710525577195], [17.750572123706878, 0.41429964677026676, 3.799456685717018], [56.694329119840376, 0.4100382972132517, 0.25001299295343127]], "peak_params_": [[10.756217445390382, 0.6628028504040734, 3.768742105115439], [17.750572123706878, 0.41376775779603037, 7.598913371434036], [56.694329119840376, 0.19419265956543907, 0.5000259859068625]], "r_squared_": 0.9792908192519196, "error_": 0.07698746047624565}
{"freq_range": [2.0, 80.0], "freq_res": 1.0, "aperiodic_params_": [-0.5981951935823869, 1.0307696504316053], "gaussian_params_": [[7.325018709020854, 0.44103282463167526, 1.2305871817577507], [9.445501808037198, 0.23633181843984377, 0.751273307418811], [14.347629383092578, 0.3228736694224947, 2.9264782787019192], [53.51636286897481, 0.8925516114364492, 0.2645666895807627], [58.39123280405911, 0.2072805897813655, 1.2889852637972155], [62.57336344849447, 0.20870697916702385, 1.185072892316051], [65.60157237028169, 0.3490253952176679, 0.29353056954524426], [67.49222312907155, 0.586974961120381, 0.2699559499982849], [72.54796540086404, 0.20619335091145208, 0.25000000000000006], [75.54796540086404, 0.2623872436148804, 5.446035414672539]], "peak_params_": [[7.325018709020854, 0.4409067643232727, 2.4611743635155015], [9.445501808037198, 0.43368533431409495, 1.502546614837622], [14.347629383092578, 0.32060391474351024, 5.8529565574038385], [53.51636286897481, 0.16860682022836837, 0.5291333791615254], [58.39123280405911, 0.19953148755659234, 2.577970527594431], [62.57336344849447, 0.21441595692347004, 2.370145784632102], [65.60157237028169, 0.19854431792088212, 0.5870611390904885], [67.49222312907155, 0.18810704319403504, 0.5399118999965699], [72.54796540086404, 0.27539658747893725, 0.5000000000000001], [75.54796540086404, 0.2614849510890429, 10.892070829345078]], "r_squared_": 0.9812449747522513, "error_": 0.04119969495714296}
{"freq_range": [2.0, 80.0], "freq_res": 1.0, "aperiodic_params_": [0.17017492726576772, 1.2148497567847178], "gaussian_params_": [[5.456218757599065, 0.6732094534306949, 0.2879662239059189], [8.45852929917745, 0.6440026797166384, 1.32646162385927], [11.538725637535155, 0.5759546448843469, 0.3096094039003665], [13.631084101347692, 0.45205187341922176, 0.28436488954643097], [18.625876836250896, 0.245229132469307, 1.7748942213714904], [53.90663825276336, 0.1313394278123705, 0.9523646588456731], [61.71428429788808, 0.12713165458899925, 5.999999999943886], [66.24406831451809, 0.24276638784086135, 0.2603774941573221], [70.45449951078126, 0.6486834132817956, 0.2944246992656202], [72.38544394728557, 0.23255049150307527, 0.5297392904209791], [74.90966554507457, 0.24485778693264942, 0.6125493485828208], [76.68967046672012, 0.36821474893679335, 0.6516582592791571], [79.36889030821445, 0.30463482289646304, 0.8697432484362542]], "peak_params_": [[5.456218757599065, 0.21343350097129216, 0.5759324478118378], [8.45852929917745, 0.6066524591094229, 2.65292324771854], [11.538725637535155, 0.20831234198977577, 0.619218807800733], [13.631084101347692, 0.20317445589693417, 0.5687297790928619], [18.625876836250896, 0.23984133541929897, 3.549788442742981], [53.90663825276336, 0.18633819000989527, 1.9047293176913462], [61.71428429788808, 0.1269875946448047, 11.999999999887772], [66.24406831451809, 0.2549623147769422, 0.5207549883146442], [70.45449951078126, 0.24605426122815355, 0.5888493985312404], [72.38544394728557, 0.20771857061989318, 1.0594785808419582], [74.90966554507457, 0.2659364155581794, 1.2250986971656417], [76.68967046672012, 0.341883667752211, 1.3033165185583142], [79.36889030821445, 0.28112118270800135, 1.7394864968725083]], "r_squared_": 0.9852159877701946, "error_": 0.039909346835219045}
{"freq_range": [2.0, 80.0], "freq_res": 1.0, "aperiodic_params_": [0.5111500404650905, 1.299048949251548], "gaussian_params_": [[8.644518987009564, 0.6896278205583486, 1.5886789955448515], [14.027291961851162, 0.2501524752775827, 1.2249940802170594], [18.350054954543218, 0.24480203116304547, 0.9445499833740385], [55.04152547445841, 0.1195511532214667, 5.257744685942866], [59.39745822894826, 0.5718161887874968, 0.27696499549820564], [70.72573627222908, 0.16044213263901377, 5.1344582447089495], [75.49412630396067, 0.889575790451648, 0.27570337605922474], [76.72667096574305, 0.2902681096269115, 0.25000499377250596], [79.4629487489546, 0.7668987790334238, 0.29157071858935985]], "peak_params_": [[8.644518987009564, 0.6726330457382246, 3.177357991089703], [14.027291961851162, 0.2524460518749513, 2.4499881604341187], [18.350054954543218, 0.229856133173706, 1.889099966748077], [55.04152547445841, 0.12102088050319759, 10.515489371885732], [59.39745822894826, 0.3060787579063633, 0.5539299909964113], [70.72573627222908, 0.16140754301889593, 10.268916489417899], [75.49412630396067, 0.2920640232635041, 0.5514067521184495], [76.72667096574305, 0.2357409362962679, 0.5000099875450119], [79.4629487489546, 0.2612171730070669, 0.5831414371787197]], "r_squared_": 0.9861105257243639, "error_": 0.045834289906026233}
{"freq_range": [2.0, 80.0], "freq_res": 1.0, "aperiodic_params_": [0.29192849104114177, 1.2472550707754801], "gaussian_params_": [[6.586430483350687, 0.3397076479131284, 1.0942442159095287], [8.852006407466085, 0.7149353174891231, 0.995222854148678], [11.538057695707067, 0.541823359049367, 0.3458879952107796], [13.812288336873435, 0.22120261116546014, 0.44142691867358036], [18.382330189227574, 0.2925282593941351, 1.3283545392741982], [55.76856379269587, 0.14475492889121477, 3.2787620626398155], [59.04760012459281, 0.09767172735133851, 0.2502649949989593], [62.06789930057183, 0.10867417434269383, 0.8660157122675064], [72.54796540086404, 0.28688834158386756, 5.999999999999999]], "peak_params_": [[6.586430483350687, 0.44285193344648927, 2.1884884318190574], [8.852006407466085, 0.7369049505484645, 1.990445708297356], [11.538057695707067, 0.22695701744094088, 0.6917759904215592], [13.812288336873435, 0.2033484121541086, 0.8828538373471607], [18.382330189227574, 0.2806589998773499, 2.6567090785483964], [55.76856379269587, 0.1507917470420388, 6.557524125279631], [59.04760012459281, 0.2076081922554398, 0.5005299899979186], [62.06789930057183, 0.19330454405106212, 1.7320314245350128], [72.54796540086404, 0.2860754551353264, 11.999999999999998]], "r_squared_": 0.9767581897123598, "error_": 0.05487779280350139}
