{"freq_range": [2.0, 80.0], "freq_res": 1.0, "aperiodic_params_": [-0.4979891094658136, 0.4150917719274716], "gaussian_params_": [[22.40261697206255, 0.3151187271318823, 3.770624011741181], [39.77585823878127, 0.14858926072213183, 0.9291165456745698], [43.51609691274155, 0.27752464475186545, 1.062390513094386], [50.09593080172811, 0.11229225066167865, 5.999999999999999]], "peak_params_": [[22.40261697206255, 0.3133293873764986, 7.541248023482362], [39.77585823878127, 0.17275507176513272, 1.8582330913491396], [43.51609691274155, 0.31720361215645165, 2.124781026188772], [50.09593080172811, 0.11227790114970104, 11.999999999999998]], "r_squared_": 0.6625724108139963, "error_": 0.07910374345461423}
{"freq_range": [2.0, 80.0], "freq_res": 1.0, "aperiodic_params_": [-0.7488707156548793, 0.013070146832285781], "gaussian_params_": [[20.342452677575746, 0.23187855912865582, 2.927965997826028], [24.551239744314913, 0.7150768856228364, 0.2926034915359589], [28.166222197855305, 0.21443622616902797, 0.9888090848226091]], "peak_params_": [[20.342452677575746, 0.230297983469672, 5.855931995652056], [24.551239744314913, 0.2872957087915122, 0.5852069830719178], [28.166222197855305, 0.2190135162491864, 1.9776181696452182]], "r_squared_": 0.07018613016162888, "error_": 0.09185099666944124}
{"freq_range": [2.0, 80.0], "freq_res": 1.0, "aperiodic_params_": [-0.5662828370576164, 0.40711480432905367], "gaussian_params_": [[13.365575017608164, 0.363451149939304, 0.283834560576166], [25.79091368531136, 0.45025406520657074, 0.9821321826645932], [28.513966024621656, 0.39608074889693856, 0.8470227104540006], [54.4684401011231, 0.24238909031353822, 3.871824020193679]], "peak_params_": [[13.365575017608164, 0.15856911913736338, 0.567669121152332], [25.79091368531136, 0.445006426857119, 1.9642643653291865], [28.513966024621656, 0.3381214252848249, 1.6940454209080011], [54.4684401011231, 0.24062154045953932, 7.743648040387358]], "r_squared_": 0.6662566578233978, "error_": 0.07639691504810366}
{"freq_range": [2.0, 80.0], "freq_res": 1.0, "aperiodic_params_": [-0.11690446977119408, 0.8651964393604449], "gaussian_params_": [[14.291838945572568, 0.2586929636632614, 1.7970076569496924], [17.450510979956523, 0.2671828091582338, 0.7874343726493349], [20.03881286649215, 0.20957176548057552, 0.6800966513167634], [40.83231822366659, 0.1332113491189025, 1.7161341098534615], [55.320688600032476, 0.07749525006047132, 5.410049264012077], [65.36866029681606, 0.12727009358151686, 1.1056182460932265], [68.6028881200783, 0.4318756836816528, 0.268953487755247]], "peak_params_": [[14.291838945572568, 0.2553219727130278, 3.594015313899385], [17.450510979956523, 0.30995639112226747, 1.5748687452986698], [20.03881286649215, 0.2123112466447592, 1.360193302633527], [40.83231822366659, 0.1349090812181577, 3.432268219706923], [55.320688600032476, 0.07735922207920631, 10.820098528024154], [65.36866029681606, 0.1360261152314688, 2.211236492186453], [68.6028881200783, 0.1489461627070492, 0.537906975510494]], "r_squared_": 0.9358453283793999, "error_": 0.054415695005095514}
{"freq_range": [2.0, 80.0], "freq_res": 1.0, "aperiodic_params_": [-0.31442468825495284, 0.56444869505641], "gaussian_params_": [[16.393866832283507, 0.16603786546220747, 3.047055520467023], [42.12116098640035, 0.1518007628227227, 1.5158682008175668], [49.390082117594446, 0.12295976120023248, 1.6459920642988584], [54.79805167142319, 0.16836957331256752, 0.6289121515448167], [62.28860627957483, 0.15027508687955352, 2.650355459871579], [69.67677615078824, 0.16305686957271967, 0.7353269836036135], [76.9317541198117, 0.13622674593279174, 0.5229946807790998]], "peak_params_": [[16.393866832283507, 0.16465651973342044, 6.094111040934046], [42.12116098640035, 0.15132180144691, 3.0317364016351336], [49.390082117594446, 0.1195604957649743, 3.2919841285977167], [54.79805167142319, 0.16370348088173126, 1.2578243030896334], [62.28860627957483, 0.14938675859558748, 5.300710919743158], [69.67677615078824, 0.15022192529657707, 1.470653967207227], [76.9317541198117, 0.13507187955418076, 1.0459893615581997]], "r_squared_": 0.7932662065158474, "error_": 0.06513664216206634}
{"freq_range": [2.0, 80.0], "freq_res": 1.0, "aperiodic_params_": [-0.7914905754954179, 0.031120244156381816], "gaussian_params_": [[25.1931932972156, 0.14393913887973925, 5.832818299384448], [29.499309749765494, 0.3446823492899217, 0.29490770329283494], [41.54796435381133, 0.10327250044210455, 5.999999999999999], [43.5220322190352, 0.31407335938242303, 0.2834093547423773], [49.40065030430951, 0.1986814108771959, 0.8921420368586174], [60.45203459913595, 0.11016882846018797, 5.393974208804421]], "peak_params_": [[25.1931932972156, 0.14616295956518766, 11.665636598768897], [29.499309749765494, 0.21013613798393505, 0.5898154065856699], [41.54796435381133, 0.10556309364872452, 11.999999999999998], [43.5220322190352, 0.17260073128232134, 0.5668187094847545], [49.40065030430951, 0.23898059639182234, 1.7842840737172347], [60.45203459913595, 0.11069522437333668, 10.787948417608842]], "r_squared_": 0.1673296064161357, "error_": 0.07437040202147255}
{"freq_range": [2.0, 80.0], "freq_res": 1.0, "aperiodic_params_": [-0.851139070340103, 0.03901585246014742], "gaussian_params_": [[25.8021778647447, 0.5907909831262611, 1.2320430369596331], [28.792851317285926, 0.5284227446505538, 1.1457544086979399], [48.82964372726948, 0.19679544009109412, 0.7157175380999156], [53.437415877907284, 0.33541500391619056, 1.7817984794164585], [58.52135794116435, 0.1756302585232207, 2.244262325680341]], "peak_params_": [[25.8021778647447, 0.6103107583717345, 2.4640860739192663], [28.792851317285926, 0.5402056529314538, 2.2915088173958797], [48.82964372726948, 0.20641454040997498, 1.4314350761998311], [53.437415877907284, 0.3339757112876953, 3.563596958832917], [58.52135794116435, 0.17424678389470705, 4.488524651360682]], "r_squared_": 0.5468177812382902, "error_": 0.07621128434284395}
{"freq_range": [2.0, 80.0], "freq_res": 1.0, "aperiodic_params_": [-0.4615614153122306, 0.4922095318012229], "gaussian_params_": [[15.806874284574603, 0.2210148404172861, 2.392530281520266], [20.39651743915402, 0.7367716493228342, 0.2500017023365864], [27.641785893263368, 0.2824532077545126, 2.428837516145544], [42.54796540024668, 0.13011885448418067, 5.99999999987238]], "peak_params_": [[15.806874284574603, 0.22030616657041246, 4.785060563040532], [20.39651743915402, 0.25914506606042176, 0.5000034046731728], [27.641785893263368, 0.28628080877939577, 4.857675032291088], [42.54796540024668, 0.12975010256981467, 11.99999999974476]], "r_squared_": 0.7209642193595577, "error_": 0.0845090004685056}
{"freq_range": [2.0, 80.0], "freq_res": 1.0, "aperiodic_params_": [-0.1828904720021036, 0.7655950881306761], "gaussian_params_": [[14.612920175700596, 0.26234650923374814, 1.830964281691297], [17.597344296851578, 0.23084735930260547, 0.8106360725318402], [20.408381430766063, 0.5486398168507435, 0.3263127707926649], [27.76651522974478, 0.14801670078056053, 2.401545920768361], [40.66922614003571, 0.17921952580139822, 1.600375551793909], [63.45203459913896, 0.09640023673744132, 5.999999999995829], [68.98553525313287, 0.08913584273393318, 0.25005866702549523]], "peak_params_": [[14.612920175700596, 0.2579107208649616, 3.661928563382594], [17.597344296851578, 0.2514937315234429, 1.6212721450636804], [20.408381430766063, 0.2578230115581738, 0.6526255415853298], [27.76651522974478, 0.14731880814827236, 4.803091841536722], [40.66922614003571, 0.1755199300139736, 3.200751103587818], [63.45203459913896, 0.09612704167695041, 11.999999999991658], [68.98553525313287, 0.15185310876851177, 0.5001173340509905]], "r_squared_": 0.9005465836571663, "error_": 0.06318661546983792}
{"freq_range": [2.0, 80.0], "freq_res": 1.0, "aperiodic_params_": [-0.04282926996676869, 0.8506454287436226], "gaussian_params_": [[13.739880044292143, 0.2548953249607878, 1.5495682213606325], [17.37868897836324, 0.28727780044137413, 1.2577801127753296], [20.45104984477751, 0.6541194621050527, 0.28352089146627124], [27.79829731841413, 0.09914091193402735, 1.8428219867371347], [40.78656454743295, 0.1321164654152542, 1.6438807511197067], [56.547965397809776, 0.09765428687355084, 5.9999999571742215], [69.21939670545325, 0.188566457546986, 0.2584954382506751]], "peak_params_": [[13.739880044292143, 0.2591167267557384, 3.099136442721265], [17.37868897836324, 0.30242149893539183, 2.5155602255506593], [20.45104984477751, 0.21736401252337112, 0.5670417829325425], [27.79829731841413, 0.09855001847727873, 3.6856439734742694], [40.78656454743295, 0.134408144299621, 3.2877615022394133], [56.547965397809776, 0.09737753786906223, 11.999999914348443], [69.21939670545325, 0.14286939611396043, 0.5169908765013502]], "r_squared_": 0.9287309070293924, "error_": 0.058416082513667006}
{"freq_range": [2.0, 80.0], "freq_res": 1.0, "aperiodic_params_": [-0.008884165956983298, 0.8641406448669529], "gaussian_params_": [[13.384345530450986, 0.2230317117054461, 1.4321384599617637], [17.044052001335395, 0.30128388858505534, 1.457408331915333], [20.471949172303496, 0.5285991378802772, 0.3039069164303606], [40.31989506688103, 0.1623410057343354, 0.7778459175127725], [43.027806644296675, 0.13955027795125058, 0.7051781162258993], [57.8172961442332, 0.10062682860481859, 5.999955636842819], [64.65287852628269, 0.08094573079169387, 1.1688038915352752], [69.45539327444412, 0.3791269704928801, 0.29450060048336435]], "peak_params_": [[13.384345530450986, 0.22155522281166584, 2.8642769199235274], [17.044052001335395, 0.31035706816369224, 2.914816663830666], [20.471949172303496, 0.19681492709029025, 0.6078138328607212], [40.31989506688103, 0.15041486953292904, 1.555691835025545], [43.027806644296675, 0.1446393939464059, 1.4103562324517986], [57.8172961442332, 0.1005801934960937, 11.999911273685639], [64.65287852628269, 0.1266028429432875, 2.3376077830705504], [69.45539327444412, 0.13249679453454521, 0.5890012009667287]], "r_squared_": 0.9346097228282887, "error_": 0.05344354667167351}
{"freq_range": [2.0, 80.0], "freq_res": 1.0, "aperiodic_params_": [-0.11238835578985065, 0.7468170305314], "gaussian_params_": [[12.748731027745723, 0.12168034533904232, 1.0606887826082805], [16.588626951404656, 0.2615167489494217, 2.4903496297973597], [50.00356719652237, 0.1167806982335755, 1.9623334012736156], [54.46253608463413, 0.5021367416556828, 0.28472956905228874], [61.49247977589816, 0.12559715047992345, 3.5323078744069623], [69.44327915083012, 0.5120025423515586, 0.2797814841059804]], "peak_params_": [[12.748731027745723, 0.21090890002835483, 2.121377565216561], [16.588626951404656, 0.25801254171189125, 4.9806992595947195], [50.00356719652237, 0.1174120045465703, 3.924666802547231], [54.46253608463413, 0.1621341721613443, 0.5694591381045775], [61.49247977589816, 0.12438237959887921, 7.0646157488139245], [69.44327915083012, 0.15906547793877346, 0.5595629682119608]], "r_squared_": 0.8875436997616484, "error_": 0.06726649813593734}
{"freq_range": [2.0, 80.0], "freq_res": 1.0, "aperiodic_params_": [-0.322514597090148, 0.5382975943281476], "gaussian_params_": [[12.476944698290446, 0.1308236559665618, 0.7991535217939837], [16.22047609290656, 0.18169168425357796, 2.427738600344574], [42.57246369922168, 0.13246730007302523, 1.742240119856581], [47.03437048115776, 0.16067342837825346, 0.25023434573336256], [49.74829290669353, 0.16195339242040796, 1.2369157785801845], [54.462711673277624, 0.42362501437285616, 0.2982135760001], [61.98876972831237, 0.13816594644228383, 3.913359307557795]], "peak_params_": [[12.476944698290446, 0.14957569981908492, 1.5983070435879674], [16.22047609290656, 0.18095186066225044, 4.855477200689148], [42.57246369922168, 0.12853937743030164, 3.484480239713162], [47.03437048115776, 0.17822069460105694, 0.5004686914667251], [49.74829290669353, 0.15991546671827228, 2.473831557160369], [54.462711673277624, 0.14475391826543205, 0.5964271520002], [61.98876972831237, 0.13816537752228153, 7.82671861511559]], "r_squared_": 0.7627808572154824, "error_": 0.07173302033848616}
{"freq_range": [2.0, 80.0], "freq_res": 1.0, "aperiodic_params_": [-0.46498542466802756, 0.2792128806327565], "gaussian_params_": [[31.476649730994197, 0.09726815183478173, 2.929269591193562], [47.45203459913595, 0.10516336722493135, 4.708009801235776], [61.68842140835202, 0.1091859116755216, 3.383379203196151]], "peak_params_": [[31.476649730994197, 0.0962234505455708, 5.858539182387124], [47.45203459913595, 0.10468864787318, 9.416019602471552], [61.68842140835202, 0.1096119984675562, 6.766758406392302]], "r_squared_": 0.3843191093676106, "error_": 0.07143519837631933}
{"freq_range": [2.0, 80.0], "freq_res": 1.0, "aperiodic_params_": [-1.0523095984440154, -0.29934948241967924], "gaussian_params_": [[24.709993219256262, 0.2518529760885367, 4.4217773897947605], [32.94862889797961, 0.24568634537591127, 3.2965052539112762], [48.370360055446106, 0.18653627903393227, 5.999999999999999]], "peak_params_": [[24.709993219256262, 0.26483056162029506, 8.843554779589521], [32.94862889797961, 0.2961070873848115, 6.5930105078225525], [48.370360055446106, 0.18618878989890164, 11.999999999999998]], "r_squared_": 0.5098235927943134, "error_": 0.08676651208548193}
{"freq_range": [2.0, 80.0], "freq_res": 1.0, "aperiodic_params_": [-0.7929104521403079, 0.36537376103140856], "gaussian_params_": [[2.0000000000000004, 0.6955773979830379, 0.9428270229364252], [13.995722226919533, 0.3910395430279672, 1.7520534894366058], [17.556211192691137, 0.18515075162418437, 0.6171601287109021], [19.940826562302092, 0.14469984314182222, 0.6189512954243166], [25.87820527055507, 0.2221246706819252, 1.0747605844420118], [28.902824409810478, 0.1998263747517081, 0.9659904026870298], [33.51565252145948, 0.11511925835584666, 1.1698138354271097], [39.56979613874278, 0.13490405167087954, 2.5371001714568706], [48.52719319214155, 0.6008479874115253, 0.27786212015238665], [50.632114372660425, 0.3049198700544101, 0.2576386267694061], [52.58020706446974, 0.13429393012598154, 1.6579907379092347], [58.75130144550109, 0.11223650453056765, 1.804664490433402], [66.10786892903587, 0.18611389813941606, 0.632906797339178]], "peak_params_": [[2.0000000000000004, 0.6955773980089229, 1.8856540458728503], [13.995722226919533, 0.3910383888952562, 3.5041069788732115], [17.556211192691137, 0.17273562785551877, 1.2343202574218042], [19.940826562302092, 0.14521454899222896, 1.2379025908486332], [25.87820527055507, 0.22288969300086103, 2.1495211688840237], [28.902824409810478, 0.20217763660516597, 1.9319808053740597], [33.51565252145948, 0.11778257044599205, 2.3396276708542194], [39.56979613874278, 0.13297854581754498, 5.074200342913741], [48.52719319214155, 0.154448070225655, 0.5557242403047733], [50.632114372660425, 0.19529928560183718, 0.5152772535388122], [52.58020706446974, 0.13075706472893445, 3.3159814758184694], [58.75130144550109, 0.11125034280404633, 3.609328980866804], [66.10786892903587, 0.18346555471102977, 1.265813594678356]], "r_squared_": 0.9542536032759404, "error_": 0.034680422673514226}
{"freq_range": [2.0, 80.0], "freq_res": 1.0, "aperiodic_params_": [-0.4237551618671959, 0.611111622475863], "gaussian_params_": [[15.037090826058023, 0.29329776272672753, 2.466814363176862], [20.427506699752556, 0.8154213483547913, 0.25000000000000006], [26.024807043789696, 0.27930720203898574, 0.7954146565685266], [28.951940526697033, 0.28853256268329597, 1.0898307363812525], [53.54796540086405, 0.09979149600446932, 5.999999999999973], [66.10982263249636, 0.20938808439562176, 0.5074662370178324]], "peak_params_": [[15.037090826058023, 0.29326461048811225, 4.933628726353724], [20.427506699752556, 0.22773355875760493, 0.5000000000000001], [26.024807043789696, 0.2865522809954282, 1.5908293131370532], [28.951940526697033, 0.2885311874630423, 2.179661472762505], [53.54796540086405, 0.099508690228159, 11.999999999999947], [66.10982263249636, 0.21612504540858235, 1.0149324740356649]], "r_squared_": 0.8488228864100362, "error_": 0.06391388592548397}
{"freq_range": [2.0, 80.0], "freq_res": 1.0, "aperiodic_params_": [-0.16026597342829485, 0.7874308110756595], "gaussian_params_": [[13.994914696743242, 0.26320401713618385, 1.6926189418503912], [17.48942818043777, 0.28830441985462474, 1.1646393827905555], [20.422114419062982, 0.6794153657455546, 0.28844467669145246], [27.680822938668502, 0.1279502181046571, 1.9230104910874324], [40.708552308560634, 0.14892999428533102, 1.4091795804426972], [52.276626362665084, 0.07125028306730781, 2.2299197743187484], [59.24895602918918, 0.07103865158525505, 4.1489213098941535], [65.55112710015126, 0.4841104601788104, 0.28991643391630106], [68.64205746940848, 0.34831704940936775, 0.2674740094124986]], "peak_params_": [[13.994914696743242, 0.26644283541244174, 3.3852378837007824], [17.48942818043777, 0.31836749203344317, 2.329278765581111], [20.422114419062982, 0.26162634309586674, 0.5768893533829049], [27.680822938668502, 0.12619987394404353, 3.8460209821748648], [40.708552308560634, 0.14578325574449402, 2.8183591608853944], [52.276626362665084, 0.08614299881657894, 4.459839548637497], [59.24895602918918, 0.07166731163049045, 8.297842619788307], [65.55112710015126, 0.16492067824246837, 0.5798328678326021], [68.64205746940848, 0.1467510813223165, 0.5349480188249972]], "r_squared_": 0.9215630236400709, "error_": 0.05291761099624231}
{"freq_range": [2.0, 80.0], "freq_res": 1.0, "aperiodic_params_": [-0.028749744936417812, 0.8513077966583765], "gaussian_params_": [[13.783366960682695, 0.25394461237888794, 1.5766501578398529], [17.375996865206606, 0.2993935651067602, 1.2389033639840574], [20.456279762364645, 0.8738375058143962, 0.27492929843389025], [40.52013075850432, 0.14590207624709564, 1.0555082127451607], [54.54796540086405, 0.07654215923803949, 5.999378189950122], [65.55411242824405, 0.7251839429266786, 0.2544615958038297], [69.44190833816273, 0.7364168289046837, 0.2500000199991655]], "peak_params_": [[13.783366960682695, 0.2588668506604639, 3.1533003156797057], [17.375996865206606, 0.31760713831462817, 2.477806727968115], [20.456279762364645, 0.25234510065213145, 0.5498585968677805], [40.52013075850432, 0.13755444869209432, 2.1110164254903214], [54.54796540086405, 0.07632519640406876, 11.998756379900245], [65.55411242824405, 0.16858587893449872, 0.5089231916076594], [69.44190833816273, 0.1586033326345937, 0.500000039998331]], "r_squared_": 0.9347875608277191, "error_": 0.05261591359567022}
{"freq_range": [2.0, 80.0], "freq_res": 1.0, "aperiodic_params_": [0.005587646913464195, 0.8512170113861228], "gaussian_params_": [[13.925044406173479, 0.2576093925853281, 1.6863703181963314], [17.458071831196722, 0.269814663203236, 1.195543537139551], [20.464757294680062, 0.916214267415432, 0.2758459917116404], [40.8838092689052, 0.1240039950959691, 1.9645507592360554], [51.53548428929438, 0.6341110595203798, 0.25163535865151326], [56.847874088386476, 0.07908775686139545, 5.183319788895711], [64.43011176958427, 0.13164700097389284, 1.031813402225864], [69.41148685031195, 0.5689657111386036, 0.2587112297527844]], "peak_params_": [[13.925044406173479, 0.26146967908196384, 3.372740636392663], [17.458071831196722, 0.29958218870401554, 2.391087074279102], [20.464757294680062, 0.2501447719864065, 0.5516919834232809], [40.8838092689052, 0.1245255179960747, 3.9291015184721108], [51.53548428929438, 0.16646741486493544, 0.5032707173030265], [56.847874088386476, 0.07905370223546737, 10.366639577791423], [64.43011176958427, 0.1512182333578711, 2.063626804451728], [69.41148685031195, 0.16567473443937653, 0.5174224595055688]], "r_squared_": 0.9344392152653517, "error_": 0.05388647370323096}
{"freq_range": [2.0, 80.0], "freq_res": 1.0, "aperiodic_params_": [-0.10709491177392126, 0.7439307067952877], "gaussian_params_": [[13.12976847411476, 0.14577318378370357, 1.3339545144270055], [17.03640693763218, 0.26400002694797525, 2.552680645648075], [41.40765163108166, 0.117379813958758, 1.829605500765921], [54.547964977596145, 0.11316556177986341, 5.999999999071113]], "peak_params_": [[13.12976847411476, 0.22070992894449093, 2.667909028854011], [17.03640693763218, 0.2661399044635132, 5.10536129129615], [41.40765163108166, 0.12334471603652797, 3.659211001531842], [54.547964977596145, 0.11284485374682118, 11.999999998142226]], "r_squared_": 0.8960913088035974, "error_": 0.06272591660780355}
{"freq_range": [2.0, 80.0], "freq_res": 1.0, "aperiodic_params_": [-0.27555432538262337, 0.5752787572617021], "gaussian_params_": [[12.318400004808657, 0.16825573517112, 0.7600911219235783], [16.235869468959205, 0.23982885229614273, 2.5284891707452215], [42.78363503327424, 0.13858680399282247, 1.909893993244148], [47.25121576174835, 0.1980155263838368, 0.2553301223243071], [50.051628857785666, 0.11177073654393369, 1.4652805064715626], [60.892838958483374, 0.12332179106704048, 4.280857553123227]], "peak_params_": [[12.318400004808657, 0.2130720564486377, 1.5201822438471566], [16.235869468959205, 0.2387889723034483, 5.056978341490443], [42.78363503327424, 0.1377212340025904, 3.819787986488296], [47.25121576174835, 0.1475707436039484, 0.5106602446486141], [50.051628857785666, 0.11665398308883113, 2.930561012943125], [60.892838958483374, 0.12328315845334581, 8.561715106246455]], "r_squared_": 0.7960704922830028, "error_": 0.07016462604037055}
{"freq_range": [2.0, 80.0], "freq_res": 1.0, "aperiodic_params_": [-0.7626402762876674, 0.15905193693528857], "gaussian_params_": [[13.848073033989696, 0.2209770511307218, 1.5359432770005914], [17.414441710786292, 0.274199322909116, 0.7571493877640345], [31.205192650794302, 0.13185476623193682, 5.999999999999999], [33.55935104572357, 0.44426518668987625, 0.25000000003197426], [49.09592925437239, 0.143323079919971, 5.999999999999999]], "peak_params_": [[13.848073033989696, 0.22206967115083087, 3.071886554001183], [17.414441710786292, 0.27095775400690436, 1.514298775528069], [31.205192650794302, 0.1332950990751618, 11.999999999999998], [33.55935104572357, 0.2183256675044879, 0.5000000000639485], [49.09592925437239, 0.14492684816981405, 11.999999999999998]], "r_squared_": 0.22270964597499998, "error_": 0.0823328944880975}
{"freq_range": [2.0, 80.0], "freq_res": 1.0, "aperiodic_params_": [-0.8849977329045348, -0.005380598371784284], "gaussian_params_": [[17.47406916142101, 0.14126292871296947, 4.033666096003725], [26.54474002343037, 0.7927773967194396, 0.27036031580927966], [29.96758697265945, 0.20468395609531545, 1.4479121755295903], [33.56097212389894, 1.0328121092220708, 0.2738037664326964]], "peak_params_": [[17.47406916142101, 0.14029066767570197, 8.06733219200745], [26.54474002343037, 0.22579968295825248, 0.5407206316185593], [29.96758697265945, 0.20577040474209984, 2.8958243510591806], [33.56097212389894, 0.28984952986098345, 0.5476075328653928]], "r_squared_": 0.03302908811624234, "error_": 0.08924079772129251}
{"freq_range": [2.0, 80.0], "freq_res": 1.0, "aperiodic_params_": [-0.6701717663893428, 0.4690792741365626], "gaussian_params_": [[10.468028562301, 1.0080446838762227, 0.2537123102960827], [13.749884194408402, 0.3437610024471603, 1.318402486031273], [17.29737038104187, 0.21088305669663937, 2.0711916614993795], [40.909767988473256, 0.1577638913596624, 0.8072316954474358], [51.83177419601092, 0.1417165049649214, 1.4350194371274243], [56.65189608155662, 0.5197080627212639, 0.2500193785577959], [65.68444247881574, 0.6072008862149505, 0.25000008096930304]], "peak_params_": [[10.468028562301, 0.19032211378326624, 0.5074246205921654], [13.749884194408402, 0.39701555575190417, 2.636804972062546], [17.29737038104187, 0.22518770901914076, 4.142383322998759], [40.909767988473256, 0.15678135960527984, 1.6144633908948716], [51.83177419601092, 0.1407460645754337, 2.8700388742548486], [56.65189608155662, 0.19737446233313372, 0.5000387571155918], [65.68444247881574, 0.27375890442796935, 0.5000001619386061]], "r_squared_": 0.8035839745774926, "error_": 0.06299982773297047}
{"freq_range": [2.0, 80.0], "freq_res": 1.0, "aperiodic_params_": [-0.4519848667795785, 0.6096560744988426], "gaussian_params_": [[13.60718985479934, 0.2881481620903433, 1.588835742845112], [15.411889828156465, 0.1392467111364759, 0.2944813844612331], [17.684472105931533, 0.24013044238854914, 1.2329094009058854], [20.266401110872117, 0.25544853086885205, 0.48897925744712756], [65.62603631826948, 0.6331235247904854, 0.2877008564374464]], "peak_params_": [[13.60718985479934, 0.282238077341598, 3.177671485690224], [15.411889828156465, 0.2710152732747393, 0.5889627689224662], [17.684472105931533, 0.2387050592847726, 2.465818801811771], [20.266401110872117, 0.261468015113941, 0.9779585148942551], [65.62603631826948, 0.27202115938487315, 0.5754017128748928]], "r_squared_": 0.856237451857369, "error_": 0.06501815775987001}
{"freq_range": [2.0, 80.0], "freq_res": 1.0, "aperiodic_params_": [-0.24776149236982017, 0.7237065605141575], "gaussian_params_": [[16.543327700905646, 0.3057538549025652, 3.2502519338301554], [65.57570136057784, 0.7997718286386616, 0.26224101937282807]], "peak_params_": [[16.543327700905646, 0.30275071466029957, 6.500503867660311], [65.57570136057784, 0.21602836041059326, 0.5244820387456561]], "r_squared_": 0.8917499380261721, "error_": 0.06865244469388274}
{"freq_range": [2.0, 80.0], "freq_res": 1.0, "aperiodic_params_": [-0.12594422110692582, 0.774620050706035], "gaussian_params_": [[16.450773452128, 0.32007630023415307, 3.333549092672348]], "peak_params_": [[16.450773452128, 0.3171632855015285, 6.667098185344696]], "r_squared_": 0.9089861301788503, "error_": 0.06719572608857609}
{"freq_range": [2.0, 80.0], "freq_res": 1.0, "aperiodic_params_": [-0.002100664086245596, 0.8380437205554223], "gaussian_params_": [[14.199426263650434, 0.2711435327835373, 1.9019563487409905], [17.7234068492874, 0.2646894921865466, 1.0104831047053484], [20.456939261694853, 0.8449460276194258, 0.28805898193079554], [40.72355860070865, 0.11890870892280513, 1.757706546705606], [50.68617630609316, 0.08769798946710043, 1.2173700013884898], [61.54796539682324, 0.08760953265929963, 5.999999999999999]], "peak_params_": [[14.199426263650434, 0.2699552445438511, 3.803912697481981], [17.7234068492874, 0.2917813431000773, 2.020966209410697], [20.456939261694853, 0.263630872239795, 0.5761179638615911], [40.72355860070865, 0.11769591822302194, 3.515413093411212], [50.68617630609316, 0.1035149719519517, 2.4347400027769797], [61.54796539682324, 0.08736125015697982, 11.999999999999998]], "r_squared_": 0.9315513467034873, "error_": 0.056076290555835274}
{"freq_range": [2.0, 80.0], "freq_res": 1.0, "aperiodic_params_": [-0.18176060583430825, 0.6846632201061026], "gaussian_params_": [[15.939323346233941, 0.3236451094084085, 3.112034234848388]], "peak_params_": [[15.939323346233941, 0.3235835984786226, 6.224068469696776]], "r_squared_": 0.879091726787765, "error_": 0.07070831224284031}
{"freq_range": [2.0, 80.0], "freq_res": 1.0, "aperiodic_params_": [-0.37433865252834003, 0.526779085893761], "gaussian_params_": [[12.326912268674064, 0.20739996019090656, 1.1775088794802493], [14.512566782341903, 0.4667603378842873, 0.28337179621606184], [17.284367731721805, 0.26543136651793736, 2.104465321781261], [33.58526718919514, 0.659207798367426, 0.2545133757197379], [40.354147919489776, 0.19769231605633625, 0.5765516238286544], [43.68567855182475, 0.17825986734155466, 0.9504768022955894], [51.55897961158905, 0.7530056858415618, 0.25845322023412964]], "peak_params_": [[12.326912268674064, 0.21090343346277973, 2.3550177589604986], [14.512566782341903, 0.26934503622551564, 0.5667435924321237], [17.284367731721805, 0.2630979785827261, 4.208930643562522], [33.58526718919514, 0.174754613120095, 0.5090267514394758], [40.354147919489776, 0.1638006795544329, 1.1531032476573089], [43.68567855182475, 0.1687741785896768, 1.9009536045911788], [51.55897961158905, 0.17559846504423193, 0.5169064404682593]], "r_squared_": 0.7983786778382638, "error_": 0.07261805914273715}
{"freq_range": [2.0, 80.0], "freq_res": 1.0, "aperiodic_params_": [-0.6232040116264412, 0.2913585994479034], "gaussian_params_": [[15.60382985668903, 0.1810747920661452, 2.7154026372899938], [31.604903648406513, 0.11322852148421139, 5.0584007101585176], [46.547965333994966, 0.1418984749753516, 5.999999999999999]], "peak_params_": [[15.60382985668903, 0.180129535048153, 5.4308052745799875], [31.604903648406513, 0.12038905482607354, 10.116801420317035], [46.547965333994966, 0.14259935716768657, 11.999999999999998]], "r_squared_": 0.42668031777607796, "error_": 0.08149865160988497}
{"freq_range": [2.0, 80.0], "freq_res": 1.0, "aperiodic_params_": [-0.9870322416996846, 0.03657988056077792], "gaussian_params_": [[22.452034599135946, 0.14386634678248184, 5.999999999999999], [34.407274356219865, 0.1336227957415703, 3.6200847047735922], [46.54796540086402, 0.1529214299082052, 5.999999999999999]], "peak_params_": [[22.452034599135946, 0.14387002865282006, 11.999999999999998], [34.407274356219865, 0.17252104066076124, 7.2401694095471845], [46.54796540086402, 0.1528364001098096, 11.999999999999998]], "r_squared_": 0.10648875971384121, "error_": 0.08281362866783597}
{"freq_range": [2.0, 80.0], "freq_res": 1.0, "aperiodic_params_": [-0.8648646045729016, 0.2829594813974822], "gaussian_params_": [[14.957585604427413, 0.28714110906637486, 2.5670510838805245], [48.968305803902744, 0.16604981570803679, 0.2500022364576548], [65.98436680577564, 0.1695740738777107, 0.25063805782738663]], "peak_params_": [[14.957585604427413, 0.28710191744051206, 5.134102167761049], [48.968305803902744, 0.16472078118529265, 0.5000044729153096], [65.98436680577564, 0.16924453357310876, 0.5012761156547733]], "r_squared_": 0.5919833385899635, "error_": 0.06732775457296733}
{"freq_range": [2.0, 80.0], "freq_res": 1.0, "aperiodic_params_": [-0.5926913566372609, 0.5281278215068559], "gaussian_params_": [[13.625618205319276, 0.21185114708112276, 1.9619925937189344], [15.541643042661212, 0.18305061839481546, 0.29763827951967575], [17.688602979756997, 0.21887722099838586, 0.8231347872275606], [19.972495501807156, 0.29702239763107074, 0.5801975346721999], [40.559684521238445, 0.16405382470152716, 0.9068047421006874], [56.61748453599429, 0.40594860803390526, 0.2731871168451462], [65.62327944197048, 0.6518670916483464, 0.26078031302037474]], "peak_params_": [[13.625618205319276, 0.20803898536908672, 3.923985187437869], [15.541643042661212, 0.18447568727982477, 0.5952765590393515], [17.688602979756997, 0.22232477172830079, 1.6462695744551212], [19.972495501807156, 0.30201600415283314, 1.1603950693443998], [40.559684521238445, 0.14581028678354024, 1.8136094842013748], [56.61748453599429, 0.15231524874918545, 0.5463742336902924], [65.62327944197048, 0.2296188985531027, 0.5215606260407495]], "r_squared_": 0.8094814669749101, "error_": 0.06646484316946301}
{"freq_range": [2.0, 80.0], "freq_res": 1.0, "aperiodic_params_": [-0.2915904249279347, 0.698196686448434], "gaussian_params_": [[12.925830852664768, 0.1946363627531116, 1.661679549382961], [17.722604131112785, 0.28229660407113094, 1.844257271842866], [20.420483722125134, 0.7360406744507039, 0.2679732396988588], [40.7473667127284, 0.1230547981809535, 1.4799918882073841], [52.767260699335374, 0.09887256399058898, 2.8361133377141656], [59.3825484777712, 0.49569144568878815, 0.25004439816388785], [65.5468736171751, 0.7979864428715913, 0.2612684374227291], [69.01934621280729, 0.14180373094903373, 0.7758424064580913]], "peak_params_": [[12.925830852664768, 0.20507965209375612, 3.323359098765922], [17.722604131112785, 0.2809595326690537, 3.688514543685732], [20.420483722125134, 0.34662931353075455, 0.5359464793977176], [40.7473667127284, 0.12129306627605496, 2.9599837764147683], [52.767260699335374, 0.09854020523480389, 5.672226675428331], [59.3825484777712, 0.1626330911268723, 0.5000887963277757], [65.5468736171751, 0.1774268332609319, 0.5225368748454582], [69.01934621280729, 0.14175965922390477, 1.5516848129161827]], "r_squared_": 0.8984746501589437, "error_": 0.05356036652827304}
{"freq_range": [2.0, 80.0], "freq_res": 1.0, "aperiodic_params_": [-0.21644745297733403, 0.708266878745072], "gaussian_params_": [[12.305601743365793, 0.17203489439261183, 1.427974945686089], [17.53859789274633, 0.30141055768102326, 2.7500413346042425]], "peak_params_": [[12.305601743365793, 0.2078008683657585, 2.855949891372178], [17.53859789274633, 0.297258504368916, 5.500082669208485]], "r_squared_": 0.9004166134105641, "error_": 0.06686598163586954}
{"freq_range": [2.0, 80.0], "freq_res": 1.0, "aperiodic_params_": [-0.16662278673129455, 0.7164961081631636], "gaussian_params_": [[15.354084226015043, 0.3055245046041648, 2.869315829907427], [20.48254668068672, 0.8897279857148112, 0.2750162887218148], [59.18618340007697, 0.1729606903439758, 0.6391375878430064]], "peak_params_": [[15.354084226015043, 0.3032070024715037, 5.738631659814854], [20.48254668068672, 0.27323449719731774, 0.5500325774436295], [59.18618340007697, 0.1657756396465726, 1.278275175686013]], "r_squared_": 0.8971389430683707, "error_": 0.06402027334387404}
{"freq_range": [2.0, 80.0], "freq_res": 1.0, "aperiodic_params_": [-0.22804210011709936, 0.6623481021974491], "gaussian_params_": [[16.069525770941244, 0.3007406256967331, 3.3625479813130292]], "peak_params_": [[16.069525770941244, 0.30067634651595565, 6.7250959626260585]], "r_squared_": 0.8740814277978312, "error_": 0.0700294396266048}
{"freq_range": [2.0, 80.0], "freq_res": 1.0, "aperiodic_params_": [-0.37644047476277365, 0.547655374795084], "gaussian_params_": [[14.197394006515644, 0.28108987353256304, 2.0455610117459657], [17.920572070233845, 0.22316309100812456, 0.945515665780733], [20.49362996886091, 1.0684296096034112, 0.27085480231037695], [51.53418852174845, 0.8489399345168857, 0.2618586651301297]], "peak_params_": [[14.197394006515644, 0.2798253825962631, 4.091122023491931], [17.920572070233845, 0.27231682847083627, 1.891031331561466], [20.49362996886091, 0.22790717318574616, 0.5417096046207539], [51.53418852174845, 0.17447933288209438, 0.5237173302602594]], "r_squared_": 0.8199113575912915, "error_": 0.07262833108629906}
{"freq_range": [2.0, 80.0], "freq_res": 1.0, "aperiodic_params_": [-0.6104273708122644, 0.4074975642234939], "gaussian_params_": [[12.1626987469024, 0.18886693376781205, 1.330655361525198], [15.51100091163017, 0.22712964646849293, 1.6271511577954456], [18.026913698088173, 0.20482710977687132, 0.5461608435138483], [20.39932148587053, 0.2797563179340097, 0.5712404121085426], [33.597093560700166, 0.6004912549053749, 0.2500614572725357], [42.353797725930825, 0.124536609264341, 5.999999997089515], [51.550938506634616, 0.610386414927222, 0.26578375061135834]], "peak_params_": [[12.1626987469024, 0.20960458234222468, 2.661310723050396], [15.51100091163017, 0.22027192302809662, 3.2543023155908912], [18.026913698088173, 0.27516306983838956, 1.0923216870276966], [20.39932148587053, 0.22458706620993563, 1.1424808242170852], [33.597093560700166, 0.21122076485445085, 0.5001229145450714], [42.353797725930825, 0.12432028902388481, 11.99999999417903], [51.550938506634616, 0.18066207188103922, 0.5315675012227167]], "r_squared_": 0.68790023888234, "error_": 0.07443735754143331}
{"freq_range": [2.0, 80.0], "freq_res": 1.0, "aperiodic_params_": [-0.826017533792772, 0.28771941147251934], "gaussian_params_": [[33.55934194040797, 0.574588614263828, 0.2724946912895176], [43.205765911482096, 0.13177614781473113, 5.999999999999999]], "peak_params_": [[33.55934194040797, 0.1960287504499505, 0.5449893825790352], [43.205765911482096, 0.13169867961193238, 11.999999999999998]], "r_squared_": 0.4339070505759492, "error_": 0.0753066732269102}
{"freq_range": [2.0, 80.0], "freq_res": 1.0, "aperiodic_params_": [-0.9801829087024633, 0.20082877435068203], "gaussian_params_": [[13.816225613218828, 0.18309490142903673, 1.9147934298971763], [16.988564901648875, 0.1215864166526118, 0.6635749824534226], [20.171618840887835, 0.20525701413010383, 0.7310235628097463], [40.460101233619895, 0.6696822529478115, 0.26394303693798027], [66.13882100719964, 0.18186782051254968, 0.5121483376138813]], "peak_params_": [[13.816225613218828, 0.18225834951398, 3.8295868597943525], [16.988564901648875, 0.16754084443418327, 1.3271499649068452], [20.171618840887835, 0.2006772698147814, 1.4620471256194927], [40.460101233619895, 0.146563447097539, 0.5278860738759605], [66.13882100719964, 0.1753079983115422, 1.0242966752277627]], "r_squared_": 0.42337305615194876, "error_": 0.0644496726799597}
{"freq_range": [2.0, 80.0], "freq_res": 1.0, "aperiodic_params_": [-0.6494721582507115, 0.44727545747405817], "gaussian_params_": [[14.265777074647804, 0.11955206664740839, 3.0120502724394482], [20.26476419859793, 0.2633678811474597, 0.5067424882912632], [40.83739028826388, 0.15612633405130863, 1.3392975469704573], [51.45907787377654, 0.48539260823784125, 0.2873921948760624], [53.621695707476626, 0.19451110284322934, 0.5721404147955291], [59.413047849956364, 0.5132717171506291, 0.27131359928777465], [65.72904584510195, 0.24355184510392355, 0.5487840424965866], [69.16149503474753, 0.1742057365289938, 1.022204481204715]], "peak_params_": [[14.265777074647804, 0.11908755926428327, 6.0241005448788965], [20.26476419859793, 0.24928828287230198, 1.0134849765825265], [40.83739028826388, 0.15497980401856504, 2.6785950939409147], [51.45907787377654, 0.13552656946673558, 0.5747843897521248], [53.621695707476626, 0.15631773349160127, 1.1442808295910583], [59.413047849956364, 0.16108857031015766, 0.5426271985755493], [65.72904584510195, 0.21706238771654163, 1.0975680849931733], [69.16149503474753, 0.17204517255192475, 2.04440896240943]], "r_squared_": 0.7521497432018885, "error_": 0.05722575557696162}
{"freq_range": [2.0, 80.0], "freq_res": 1.0, "aperiodic_params_": [-0.49346956200078856, 0.5525346296651713], "gaussian_params_": [[14.867256209542372, 0.16784826422029225, 3.553450736520725], [20.392004385925308, 0.5626381631775932, 0.29909855783319406], [40.75907156826986, 0.15236251783424895, 1.390036306316333], [52.859453832088704, 0.1200897479595077, 2.8447910540555923], [59.422174912075576, 0.591123982301169, 0.27332987471795683], [65.55811217346998, 0.6109744377052103, 0.28240218251205074], [69.07344925938546, 0.17461555378916185, 0.729104963123285]], "peak_params_": [[14.867256209542372, 0.16773118948483545, 7.10690147304145], [20.392004385925308, 0.29749538447392565, 0.5981971156663881], [40.75907156826986, 0.15011122444613845, 2.780072612632666], [52.859453832088704, 0.11994327811334649, 5.689582108111185], [59.422174912075576, 0.19101202651740357, 0.5466597494359137], [65.55811217346998, 0.17964622504036498, 0.5648043650241015], [69.07344925938546, 0.17373178176138437, 1.45820992624657]], "r_squared_": 0.8350796973389674, "error_": 0.05631949798722738}
{"freq_range": [2.0, 80.0], "freq_res": 1.0, "aperiodic_params_": [-0.27416262659864904, 0.6553424292156212], "gaussian_params_": [[12.126650675634384, 0.16227824728917944, 0.7104562567466005], [15.516918796356306, 0.2283492432261229, 2.6112547467625746], [20.48117550765624, 1.4158523946484591, 0.25000844855960785], [40.78531797557234, 0.1469977455273149, 1.5471102492773312], [58.78675035420881, 0.09502701924548068, 5.999999999999999]], "peak_params_": [[12.126650675634384, 0.2519145028285805, 1.420912513493201], [15.516918796356306, 0.22447493323388612, 5.222509493525149], [20.48117550765624, 0.27446116826287725, 0.5000168971192157], [40.78531797557234, 0.14676299046287156, 3.0942204985546624], [58.78675035420881, 0.09496701885128278, 11.999999999999998]], "r_squared_": 0.873006814915629, "error_": 0.0613505163574756}
{"freq_range": [2.0, 80.0], "freq_res": 1.0, "aperiodic_params_": [-0.18978402050106538, 0.689927532799328], "gaussian_params_": [[14.695745995596285, 0.23284251655597618, 2.724993822741205], [20.492040512185724, 0.6972890136874369, 0.3109335557934987], [40.73760971676053, 0.13447588025481014, 2.3385790466567], [50.580698315223614, 0.13095909876395614, 1.5983336542859976], [59.076363240722394, 0.10221658919211522, 3.151182445941333], [64.79577224208796, 0.12980612381634007, 0.9427676736064161], [69.44888122110935, 0.4621922668456526, 0.28840978375121096]], "peak_params_": [[14.695745995596285, 0.2313956748147763, 5.44998764548241], [20.492040512185724, 0.2343780555210936, 0.6218671115869974], [40.73760971676053, 0.13363208934020143, 4.6771580933134], [50.580698315223614, 0.13036764767004505, 3.196667308571995], [59.076363240722394, 0.10218670473273672, 6.302364891882666], [64.79577224208796, 0.14426167255618783, 1.8855353472128322], [69.44888122110935, 0.13838435627095502, 0.5768195675024219]], "r_squared_": 0.8816770588005582, "error_": 0.05704537957342385}
{"freq_range": [2.0, 80.0], "freq_res": 1.0, "aperiodic_params_": [-0.509273471128831, 0.45411935572290096], "gaussian_params_": [[12.505870775651104, 0.16252632696749642, 1.412739341575248], [16.547965400299137, 0.1268737981844012, 3.1082459606205513], [20.50237873876816, 0.8629456748250782, 0.2788514563344306], [51.55096922404028, 0.7475220119246488, 0.27518143968265446]], "peak_params_": [[12.505870775651104, 0.2190190834313417, 2.825478683150496], [16.547965400299137, 0.12657065266328038, 6.2164919212411025], [20.50237873876816, 0.22106044604927044, 0.5577029126688612], [51.55096922404028, 0.19744087918430675, 0.5503628793653089]], "r_squared_": 0.7470598604440877, "error_": 0.07310510472707532}
{"freq_range": [2.0, 80.0], "freq_res": 1.0, "aperiodic_params_": [-0.7149818868138517, 0.31225734061193666], "gaussian_params_": [[14.203107133920113, 0.1405445778630773, 2.523354197382129], [20.250565521786818, 0.22266043757525666, 0.9638302725979513], [29.640865572401772, 0.09057847626325385, 2.5936937069604777], [33.92015314079344, 0.09990485348124213, 0.2500000061269002], [40.54796540086405, 0.1138815748196441, 5.999999999999999], [51.54611607357911, 0.6237828116945209, 0.2797819121151649], [60.80952943001075, 0.11676899783313878, 3.193610022546536]], "peak_params_": [[14.203107133920113, 0.14009642233426, 5.046708394764258], [20.250565521786818, 0.22571756736950732, 1.9276605451959026], [29.640865572401772, 0.11400001002496807, 5.1873874139209555], [33.92015314079344, 0.1797814792321255, 0.5000000122538004], [40.54796540086405, 0.11356503455063605, 11.999999999999998], [51.54611607357911, 0.188344276871935, 0.5595638242303298], [60.80952943001075, 0.11690301947369375, 6.387220045093072]], "r_squared_": 0.6183812781943636, "error_": 0.05409156550064467}
{"freq_range": [2.0, 80.0], "freq_res": 1.0, "aperiodic_params_": [-0.7069806794285387, 0.3225115066130684], "gaussian_params_": [[17.69303180227718, 0.13563970390367894, 4.516356656328583], [34.33994765554731, 0.10563363917347167, 5.999999880358704], [36.015207400543545, 0.0696374099858828, 0.2500081001418877], [49.45204240157395, 0.10760994999091708, 5.999983706829644], [61.84844017901739, 0.11698018132975768, 2.787400369223466]], "peak_params_": [[17.69303180227718, 0.13791705902366913, 9.032713312657165], [34.33994765554731, 0.10956962622886168, 11.999999760717408], [36.015207400543545, 0.1799286912523128, 0.5000162002837754], [49.45204240157395, 0.1126467049891342, 11.999967413659288], [61.84844017901739, 0.12889148818161678, 5.574800738446932]], "r_squared_": 0.5876679915573221, "error_": 0.0618440868694244}
{"freq_range": [2.0, 80.0], "freq_res": 1.0, "aperiodic_params_": [-1.024491242606253, 0.06790047724485744], "gaussian_params_": [[9.578077937771724, 0.5397252985849922, 0.27507487149051657], [38.442457008943464, 0.5150241287710087, 0.29112961534756227], [56.54796540086344, 0.11215042171162184, 5.999999999999999]], "peak_params_": [[9.578077937771724, 0.16645432054372566, 0.5501497429810331], [38.442457008943464, 0.16322397022643553, 0.5822592306951245], [56.54796540086344, 0.11183259115144728, 11.999999999999998]], "r_squared_": 0.14103941542564144, "error_": 0.05896540199261888}
{"freq_range": [2.0, 80.0], "freq_res": 1.0, "aperiodic_params_": [-0.7454645524454251, 0.2766174288147065], "gaussian_params_": [[20.4624158185222, 0.4865785984945414, 0.28880188163321224], [27.00633865797017, 0.1354074891647336, 0.2500010173245871], [39.7631019063985, 0.12690640732063013, 1.4321521575130607], [42.45780759323413, 0.38912179722258106, 0.29471473553560906], [53.12304265200235, 0.09754360800144479, 4.5298226546459235], [53.949891999415854, 0.11713066153391129, 0.25011800611408924], [59.419332814711915, 0.40658480789162577, 0.2841394462436828], [65.54739471718418, 0.1714339791857996, 0.9672698470081686], [69.54091335509227, 0.14692654096039987, 1.332531184758059], [78.85982242103188, 0.14371999913341293, 0.5152928822815465]], "peak_params_": [[20.4624158185222, 0.13503769808920119, 0.5776037632664245], [27.00633865797017, 0.13536397851726556, 0.5000020346491743], [39.7631019063985, 0.12665003594070412, 2.8643043150261214], [42.45780759323413, 0.15870005130126041, 0.5894294710712181], [53.12304265200235, 0.0975940739228367, 9.059645309291847], [53.949891999415854, 0.210536247579592, 0.5002360122281785], [59.419332814711915, 0.17888111009980867, 0.5682788924873656], [65.54739471718418, 0.15967595808234059, 1.9345396940163373], [69.54091335509227, 0.13855916719172345, 2.665062369516118], [78.85982242103188, 0.13849933952510285, 1.030585764563093]], "r_squared_": 0.5960300986298832, "error_": 0.05125195677522571}
{"freq_range": [2.0, 80.0], "freq_res": 1.0, "aperiodic_params_": [-0.6418552929345196, 0.37165992704207107], "gaussian_params_": [[12.207214596646084, 0.14121281001542088, 1.7284593673756494], [20.455900903786265, 0.5874180890751118, 0.3060000898108948], [27.04511963335082, 0.13812744502487423, 0.25001536915386363], [40.568074621714985, 0.15603622479004275, 1.6153516100168217], [50.94081056668743, 0.13368979549106802, 1.9074402174210139], [54.351834187802744, 0.346616520548403, 0.2707825162983669], [59.25712123353835, 0.2062359529172278, 0.563933506375082], [65.31748462379055, 0.1558775651653288, 0.905510803080438], [69.38722042031432, 0.16096150010097335, 0.7939365601092215]], "peak_params_": [[12.207214596646084, 0.14020168015541756, 3.456918734751299], [20.455900903786265, 0.19362164061908604, 0.6120001796217897], [27.04511963335082, 0.13589635850617077, 0.5000307383077273], [40.568074621714985, 0.15055691497266732, 3.2307032200336434], [50.94081056668743, 0.13362544538175558, 3.8148804348420278], [54.351834187802744, 0.1859665979881353, 0.5415650325967338], [59.25712123353835, 0.18589365000369384, 1.127867012750164], [65.31748462379055, 0.14658509066054348, 1.811021606160876], [69.38722042031432, 0.14295190328218932, 1.587873120218443]], "r_squared_": 0.7034582116211474, "error_": 0.05377621340031162}
{"freq_range": [2.0, 80.0], "freq_res": 1.0, "aperiodic_params_": [-0.5106996654246089, 0.45723108771433657], "gaussian_params_": [[12.142523917307933, 0.14857981602938924, 1.4608996624782113], [15.260079318853075, 0.10210421756065025, 1.9312024388236193], [20.473689589509508, 0.3716448680281795, 0.42376142191803107], [26.71613503334073, 0.2506783725936889, 0.25098853348983663], [40.28214437642888, 0.1477326615330346, 2.0871181969734933], [42.4836005993982, 0.2319058342169181, 0.2528632364679447], [50.39462803832915, 0.13169211566830105, 1.5280050859101195], [54.046690752274344, 0.13366099828865408, 0.25006021615169094], [60.44915693081814, 0.10177580019005894, 4.648314968510387], [69.44638475658047, 0.4648249871160008, 0.29364349922783883]], "peak_params_": [[12.142523917307933, 0.17243490658454352, 2.9217993249564227], [15.260079318853075, 0.1231203255761586, 3.8624048776472386], [20.473689589509508, 0.2039972986000479, 0.8475228438360621], [26.71613503334073, 0.1322380956320568, 0.5019770669796733], [40.28214437642888, 0.14639531358488345, 4.174236393946987], [42.4836005993982, 0.14256894114087038, 0.5057264729358893], [50.39462803832915, 0.13551024338714335, 3.056010171820239], [54.046690752274344, 0.17836444356661874, 0.5001204323033819], [60.44915693081814, 0.10130177002831364, 9.296629937020773], [69.44638475658047, 0.16512434628140404, 0.5872869984556777]], "r_squared_": 0.7794190516669536, "error_": 0.05494105362517727}
{"freq_range": [2.0, 80.0], "freq_res": 1.0, "aperiodic_params_": [-0.5959723767128601, 0.3652079862212611], "gaussian_params_": [[13.86692239927111, 0.15683153755350018, 2.3792457557179407], [20.484417880183255, 0.2665743240172839, 0.6852974615950044], [39.98707174044518, 0.13012909006685813, 5.999999999999999]], "peak_params_": [[13.86692239927111, 0.15659739549371499, 4.7584915114358814], [20.484417880183255, 0.21380585513296668, 1.3705949231900088], [39.98707174044518, 0.13012878798717442, 11.999999999999998]], "r_squared_": 0.6380191023979737, "error_": 0.0729635969463688}
{"freq_range": [2.0, 80.0], "freq_res": 1.0, "aperiodic_params_": [-0.7649262762312725, 0.18915008793167493], "gaussian_params_": [[9.288155476937696, 0.16526008377019744, 0.6125895614839848], [11.8161757023505, 0.09634132544265633, 1.451039831788821], [19.266280049804084, 0.11021693601596862, 3.6357383142965567], [20.534507010464356, 0.5963811647891695, 0.2863300170381598], [26.925231559470244, 0.12723355106430126, 0.6836350987313141], [29.724318146573328, 0.21135564869352247, 0.647296253372828], [31.769010285168388, 0.19591792304870503, 0.4704838820924266], [33.50582370565016, 0.4646422194235892, 0.32063237262724903], [40.24185160181814, 0.1412419556080813, 4.0098334072611435], [50.816728360059, 0.17496790136489235, 1.3991124608446275], [58.83916078441474, 0.1050370046910457, 3.8452400411664276]], "peak_params_": [[9.288155476937696, 0.16464929617573798, 1.2251791229679696], [11.8161757023505, 0.11053943268796784, 2.902079663577642], [19.266280049804084, 0.10992264618638325, 7.271476628593113], [20.534507010464356, 0.2574512271469108, 0.5726600340763196], [26.925231559470244, 0.13858420520222992, 1.3672701974626282], [29.724318146573328, 0.200025236104602, 1.294592506745656], [31.769010285168388, 0.19144081451036143, 0.9409677641848532], [33.50582370565016, 0.18375965157724627, 0.6412647452544981], [40.24185160181814, 0.14098593407162252, 8.019666814522287], [50.816728360059, 0.19048350339671982, 2.798224921689255], [58.83916078441474, 0.10494766521124599, 7.690480082332855]], "r_squared_": 0.5299920387715079, "error_": 0.04858457671722616}
{"freq_range": [2.0, 80.0], "freq_res": 1.0, "aperiodic_params_": [-0.9373046045467864, 0.11007768441026067], "gaussian_params_": [[10.2363352235192, 0.17688439381902177, 1.1969686627765903], [19.43404586225302, 0.22809778802768668, 0.607275246219875], [20.628275606588495, 0.566642567525714, 0.2825082475997524], [25.01538505592508, 0.14120379544881143, 2.2725754831582914], [29.65093582466397, 0.244253967018086, 0.30666846097161266], [32.682155844472334, 0.1759221349930468, 2.148751575441533], [39.99454026294116, 0.1810823507255499, 2.329515900070282], [52.943059356883836, 0.156611771233022, 5.9999999999448255]], "peak_params_": [[10.2363352235192, 0.17346991002531997, 2.3939373255531806], [19.43404586225302, 0.18093151447487965, 1.21455049243975], [20.628275606588495, 0.2762786999914081, 0.5650164951995048], [25.01538505592508, 0.14149858423301465, 4.545150966316583], [29.65093582466397, 0.221375651129458, 0.6133369219432253], [32.682155844472334, 0.17692368473251974, 4.297503150883066], [39.99454026294116, 0.1969028681467988, 4.659031800140564], [52.943059356883836, 0.15660474987520945, 11.999999999889651]], "r_squared_": 0.48739104880066475, "error_": 0.05025954069760343}
{"freq_range": [2.0, 80.0], "freq_res": 1.0, "aperiodic_params_": [-0.8679645878676018, 0.057033820057771877], "gaussian_params_": [[10.56704444320033, 0.15187179160930683, 1.3392653272553525], [20.512600672350256, 0.45658097694858846, 0.3473753181812862], [26.747911913571475, 0.25560044656934156, 0.29939131905593597], [39.799710325635075, 0.1398215704224036, 2.4041497616115817], [42.35844878777212, 0.17170660444441768, 0.3072028834758353], [51.459838180471266, 0.11345632186131807, 3.072951000226911], [53.98084878185336, 0.10067753194258741, 0.2512908583711636], [59.192029757610115, 0.18222138022020715, 0.5950632459358889]], "peak_params_": [[10.56704444320033, 0.14413959296341206, 2.678530654510705], [20.512600672350256, 0.17061905241019215, 0.6947506363625724], [26.747911913571475, 0.17931290273332134, 0.5987826381118719], [39.799710325635075, 0.13944555381548263, 4.808299523223163], [42.35844878777212, 0.17989890052805546, 0.6144057669516706], [51.459838180471266, 0.11219584030494034, 6.145902000453822], [53.98084878185336, 0.18100728594797277, 0.5025817167423272], [59.192029757610115, 0.1785664242646734, 1.1901264918717778]], "r_squared_": 0.1910953430744287, "error_": 0.05938122440620609}
{"freq_range": [2.0, 80.0], "freq_res": 1.0, "aperiodic_params_": [-0.890314434613999, 0.05143449727709767], "gaussian_params_": [[9.563767139950185, 0.32765075978434904, 0.31351308291388585], [11.674792383008338, 0.1267063627212278, 1.1131255785311975], [20.453081541060136, 0.23744564125928516, 0.7481181851826699], [23.4103727669905, 0.4918489643515979, 0.2720704617641654], [26.877631447935105, 0.2145796590867605, 0.3404256082558216], [29.67507392812352, 0.2738464331711912, 0.2944379683595748], [31.757733080887036, 0.14762208581278866, 0.66376779748003], [35.72957213881647, 0.15985891733613256, 0.7062473476858767], [38.345177164978246, 0.3693882170639401, 0.25000176046510125], [39.561089838971135, 0.5095191484148728, 0.29671958490307077], [41.76048078867411, 0.17515849559741875, 1.0872756264387067], [48.49357072002445, 0.6183080470921002, 0.27507464200963], [51.23660662497246, 0.19054496614241528, 0.8664220522608639], [53.95113803145004, 0.18179735608656233, 0.6018757959448103], [59.066611043085636, 0.12419996646768193, 1.4668807884867103], [64.97155003254443, 0.11856239508357938, 1.0650105569854917], [69.45282636948518, 0.4703269642008265, 0.2815149408057355]], "peak_params_": [[9.563767139950185, 0.16530308874720367, 0.6270261658277717], [11.674792383008338, 0.12141256806825229, 2.226251157062395], [20.453081541060136, 0.19765950970125246, 1.4962363703653399], [23.4103727669905, 0.15841350781936492, 0.5441409235283308], [26.877631447935105, 0.20115508516641312, 0.6808512165116432], [29.67507392812352, 0.15338731175029352, 0.5888759367191496], [31.757733080887036, 0.13810974614644267, 1.32753559496006], [35.72957213881647, 0.14855916320942653, 1.4124946953717534], [38.345177164978246, 0.14376025529284298, 0.5000035209302025], [39.561089838971135, 0.21784100280830798, 0.5934391698061415], [41.76048078867411, 0.1709595108623544, 2.1745512528774134], [48.49357072002445, 0.12379653729340356, 0.55014928401926], [51.23660662497246, 0.18357195566744766, 1.7328441045217278], [53.95113803145004, 0.18269587122749897, 1.2037515918896207], [59.066611043085636, 0.12407199578085304, 2.9337615769734207], [64.97155003254443, 0.11855487912611307, 2.1300211139709835], [69.45282636948518, 0.1290830016144101, 0.563029881611471]], "r_squared_": 0.3990852777404377, "error_": 0.04039168857603149}
{"freq_range": [2.0, 80.0], "freq_res": 1.0, "aperiodic_params_": [-0.8545094402761444, 0.10082284597756196], "gaussian_params_": [[19.213990225816435, 0.13362191717389746, 5.999999999999999], [26.723358346035273, 0.24814974658157882, 0.25526674038757746], [29.609220451783212, 0.4093519152583647, 0.3237332711387074], [31.71241395340705, 0.14415116951961496, 0.5106339650022933], [34.177138620087675, 0.15000495638793573, 1.593291768322925], [40.42705376936446, 0.16669535740516905, 2.3339020252461053], [53.46744092505911, 0.13379422557717632, 5.999999999999999], [54.02210512931786, 0.04838193928393807, 0.25007587237412304]], "peak_params_": [[19.213990225816435, 0.13353697012518595, 11.999999999999998], [26.723358346035273, 0.19552238844288672, 0.5105334807751549], [29.609220451783212, 0.22952983787142023, 0.6474665422774148], [31.71241395340705, 0.19624873881764682, 1.0212679300045866], [34.177138620087675, 0.15995438282497476, 3.18658353664585], [40.42705376936446, 0.1752229012665335, 4.667804050492211], [53.46744092505911, 0.13340031998258284, 11.999999999999998], [54.02210512931786, 0.18146153352500927, 0.5001517447482461]], "r_squared_": 0.337968943132289, "error_": 0.05640734227661797}
{"freq_range": [2.0, 80.0], "freq_res": 1.0, "aperiodic_params_": [-1.6089551624964669, 0.37712586201616344], "gaussian_params_": [[13.70195822467446, 0.28130733258348356, 0.8333878017905026], [17.31250018183842, 0.2693883689749691, 0.2795480298883769], [19.414474022910984, 0.11356828069872289, 4.606533152390875], [30.441612306684803, 0.4551170096304466, 0.2984378848171704], [45.339061433136855, 0.17359049433791757, 1.0697089352397653], [49.152502403290164, 0.20250226893047657, 0.4307816920444741], [70.89135835109482, 0.14082943068336906, 0.7364767922944354], [76.97756503655492, 0.12091317058342359, 0.2500059125915141]], "peak_params_": [[13.70195822467446, 0.32080051285573585, 1.6667756035810053], [17.31250018183842, 0.24332270537565148, 0.5590960597767538], [19.414474022910984, 0.11310951487609455, 9.21306630478175], [30.441612306684803, 0.16038369725832835, 0.5968757696343407], [45.339061433136855, 0.16508581650304022, 2.1394178704795306], [49.152502403290164, 0.19069911517842764, 0.8615633840889482], [70.89135835109482, 0.13930545692846952, 1.4729535845888708], [76.97756503655492, 0.12042730095553145, 0.5000118251830282]], "r_squared_": 0.8130177103893929, "error_": 0.04810306972025419}
{"freq_range": [2.0, 80.0], "freq_res": 1.0, "aperiodic_params_": [-0.867792798986247, 0.3879328941528917], "gaussian_params_": [[26.075043457609684, 0.12435997249317036, 1.7948378595714174], [40.45203580740079, 0.10287720360465637, 3.3526105973633005], [47.64745801524692, 0.15771451534293357, 0.7856485695954166], [55.577176318063835, 0.08616499506746401, 3.2967879347172104], [62.0028426955879, 0.11516733746387905, 0.25015699096490845], [69.2771992528674, 0.19347871221955457, 1.1097918745869715], [72.82961261275888, 0.14404281201376062, 0.6561351907644731], [76.38112497850864, 0.15504835280312304, 0.5635012819451505]], "peak_params_": [[26.075043457609684, 0.12426081153659307, 3.589675719142835], [40.45203580740079, 0.10194754117208094, 6.705221194726601], [47.64745801524692, 0.15691034767710277, 1.5712971391908332], [55.577176318063835, 0.08546144049846238, 6.593575869434421], [62.0028426955879, 0.1280764557060421, 0.5003139819298169], [69.2771992528674, 0.18755816723356733, 2.219583749173943], [72.82961261275888, 0.13996391450754775, 1.3122703815289463], [76.38112497850864, 0.1233494347170947, 1.127002563890301]], "r_squared_": 0.6303412363683126, "error_": 0.06269749432855766}
{"freq_range": [2.0, 80.0], "freq_res": 1.0, "aperiodic_params_": [-0.9242790704730058, 0.6853750916484163], "gaussian_params_": [[15.573716110512155, 0.2169425967743286, 2.42727908111955], [40.04788719735647, 0.1571173918605411, 0.771702408142394], [43.58703313691005, 0.3036365408797364, 0.40226870824351324], [51.91727678714851, 0.10918732170783735, 4.764091278806894], [65.38733676812903, 0.15902591711534603, 0.8739210477926171], [68.44045526557278, 0.7854122481161095, 0.2500123185509692], [75.11885785001772, 0.13764267956248102, 1.3536424885190024]], "peak_params_": [[15.573716110512155, 0.2136226677019768, 4.8545581622391], [40.04788719735647, 0.16159481644017193, 1.543404816284788], [43.58703313691005, 0.20671309339883992, 0.8045374164870265], [51.91727678714851, 0.10917086268220433, 9.528182557613787], [65.38733676812903, 0.1466644324947004, 1.7478420955852343], [68.44045526557278, 0.1685821627080002, 0.5000246371019385], [75.11885785001772, 0.13711396855256863, 2.7072849770380047]], "r_squared_": 0.8813019670211077, "error_": 0.0571188714888263}
{"freq_range": [2.0, 80.0], "freq_res": 1.0, "aperiodic_params_": [-0.9149794397399875, 0.5820952468586496], "gaussian_params_": [[48.39105413258815, 0.13544245357710752, 5.999999999999999], [59.5167995496324, 0.8289820244209567, 0.2749496010698285]], "peak_params_": [[48.39105413258815, 0.1351550878630836, 11.999999999999998], [59.5167995496324, 0.19780175234206387, 0.549899202139657]], "r_squared_": 0.8292711509280133, "error_": 0.06181520961278432}
