{"freq_range": [2.0, 80.0], "freq_res": 1.0, "aperiodic_params_": [0.010626380230627267, 0.7273009159995486], "gaussian_params_": [[8.777507717501402, 0.6042188903735702, 0.8417408370943343], [13.355028300301347, 0.19810953888764146, 0.579717387691147], [44.04638012635281, 0.14621736297344223, 0.2500307273391121], [56.652111710207585, 0.31582026956100534, 0.26951873028255885], [72.01869556244158, 0.08679050095763162, 0.25000214842720764], [75.45204054788555, 0.08825967744980152, 5.999999999999999]], "peak_params_": [[8.777507717501402, 0.5834757854993485, 1.6834816741886687], [13.355028300301347, 0.16423625234769024, 1.159434775382294], [44.04638012635281, 0.14372334915377505, 0.5000614546782242], [56.652111710207585, 0.13807355738274185, 0.5390374605651177], [72.01869556244158, 0.16134497129757563, 0.5000042968544153], [75.45204054788555, 0.08800954588926291, 11.999999999999998]], "r_squared_": 0.958165164970654, "error_": 0.049895249971041965}
{"freq_range": [2.0, 80.0], "freq_res": 1.0, "aperiodic_params_": [-0.11574451456350413, 0.7016019363358014], "gaussian_params_": [[7.5831865364795545, 1.1774270048823448, 0.2977722511040931], [9.41328054983359, 1.7858645619215345, 0.3056035856530766], [13.216279019900572, 0.18298455226124333, 0.5158326209496951], [17.011855526667837, 0.13837665889844908, 0.25000259291941884], [19.446133485757365, 0.5721638155879079, 0.29291583347861344], [34.33436573374853, 0.11722123804191097, 1.9998226210664891], [59.12442061924938, 0.12500866912785982, 0.41198847968545316], [60.692469230897245, 0.2330733596254629, 0.25001752563194674], [66.42480118585217, 0.3586756682535256, 0.27863237047210654], [71.67962095470173, 0.25079848998767323, 0.2500259994714384], [77.7914387285468, 0.128413548743565, 1.3262151073559687]], "peak_params_": [[7.5831865364795545, 0.44208259971396535, 0.5955445022081862], [9.41328054983359, 0.7157017350662631, 0.6112071713061532], [13.216279019900572, 0.16758711273792892, 1.0316652418993901], [17.011855526667837, 0.13822115496367082, 0.5000051858388377], [19.446133485757365, 0.17938654731442638, 0.5858316669572269], [34.33436573374853, 0.11559417179734388, 3.9996452421329782], [59.12442061924938, 0.11943604215712789, 0.8239769593709063], [60.692469230897245, 0.10938721643687943, 0.5000350512638935], [66.42480118585217, 0.11219353983555957, 0.5572647409442131], [71.67962095470173, 0.11036166186822882, 0.5000519989428768], [77.7914387285468, 0.1268354365006812, 2.6524302147119374]], "r_squared_": 0.9819376985458127, "error_": 0.02775251372908196}
{"freq_range": [2.0, 80.0], "freq_res": 1.0, "aperiodic_params_": [-0.11692086783300784, 0.6887938431820981], "gaussian_params_": [[8.778540390213356, 0.6014248654105978, 0.7802302163273066], [13.262059563134013, 0.19747585583186017, 0.52494613780863], [49.27579834294205, 0.2826041651412149, 0.25001381476262347], [55.780458190636125, 0.15787908331072592, 0.4925598382245468], [63.064785548421, 0.14695495076985013, 0.25001638218606675], [74.4293580661738, 0.630640558735034, 0.28018841228720726]], "peak_params_": [[8.778540390213356, 0.5776795960343024, 1.5604604326546132], [13.262059563134013, 0.17434069295665788, 1.04989227561726], [49.27579834294205, 0.1537913244816791, 0.5000276295252469], [55.780458190636125, 0.1429504491124869, 0.9851196764490936], [63.064785548421, 0.14210314175425554, 0.5000327643721335], [74.4293580661738, 0.19492711379443994, 0.5603768245744145]], "r_squared_": 0.9536672017160834, "error_": 0.048167809241887974}
{"freq_range": [2.0, 80.0], "freq_res": 1.0, "aperiodic_params_": [-0.13742845257611203, 0.44941317771503514], "gaussian_params_": [[8.853789614583297, 0.5701209712803167, 0.8361811161281648], [19.45090569792234, 0.4490682259061957, 0.27154940325247984], [21.534283682771484, 0.3855840798660779, 0.29950539947384536], [31.11982344692921, 0.12028675789224928, 1.2781812196254623], [34.15867569278351, 0.21066508758269614, 0.6353290777587052], [38.019957068183786, 0.14184865736711005, 0.4823407469054334], [41.448117401172354, 0.478978009282699, 0.27609062513149824], [44.02869580115604, 0.11640159339423299, 1.4770778856707822], [48.62088225213136, 0.15749355955377958, 0.8819226482640372], [51.641421503517044, 0.17783131870436314, 0.7597561176411618], [55.44733997342702, 0.2924613723671601, 0.33767346981057456], [58.526368075776695, 0.4829897061552495, 0.2922794642287667], [61.48273120406319, 0.18418225408562147, 0.9386849525148783], [65.50706690608679, 0.7061698173732128, 0.315365662567405]], "peak_params_": [[8.853789614583297, 0.5614717416766257, 1.6723622322563296], [19.45090569792234, 0.11313224665019095, 0.5430988065049597], [21.534283682771484, 0.1151024344704712, 0.5990107989476907], [31.11982344692921, 0.11976027080807872, 2.5563624392509245], [34.15867569278351, 0.2136944376969626, 1.2706581555174103], [38.019957068183786, 0.1417554475140218, 0.9646814938108668], [41.448117401172354, 0.14253402111205726, 0.5521812502629965], [44.02869580115604, 0.11637980122927727, 2.9541557713415645], [48.62088225213136, 0.1444195282286196, 1.7638452965280744], [51.641421503517044, 0.15919061484118446, 1.5195122352823236], [55.44733997342702, 0.12162069714116053, 0.6753469396211491], [58.526368075776695, 0.1355079324875046, 0.5845589284575334], [61.48273120406319, 0.16136879817881844, 1.8773699050297565], [65.50706690608679, 0.2081580051408799, 0.63073132513481]], "r_squared_": 0.9209254524468924, "error_": 0.032400917032716046}
{"freq_range": [2.0, 80.0], "freq_res": 1.0, "aperiodic_params_": [0.05118885916702225, 0.788324759924728], "gaussian_params_": [[8.883258844441162, 0.6926205936779071, 0.9077514543845786], [13.284936683061717, 0.19900322160919265, 0.56748958828565], [16.93779151290312, 0.15276887086630517, 0.6945934311256484], [19.39024138793773, 0.3232608869441287, 0.3296811356075429], [27.977957623897073, 0.11920462269959146, 0.2500003206787541], [55.303241586151294, 0.13403726124824222, 0.7703711572971034], [66.06911708450845, 0.1332323485255067, 0.62137666960121], [77.52577091744078, 0.5222007716742224, 0.297617824203704]], "peak_params_": [[8.883258844441162, 0.6869165217679507, 1.8155029087691572], [13.284936683061717, 0.17545870823557363, 1.1349791765713], [16.93779151290312, 0.152157405109403, 1.3891868622512968], [19.39024138793773, 0.16229785745212122, 0.6593622712150858], [27.977957623897073, 0.11874218308953621, 0.5000006413575082], [55.303241586151294, 0.12404511670980933, 1.5407423145942067], [66.06911708450845, 0.13241067749158208, 1.24275333920242], [77.52577091744078, 0.14672563780367165, 0.595235648407408]], "r_squared_": 0.9756892178166654, "error_": 0.03705765450277518}
{"freq_range": [2.0, 80.0], "freq_res": 1.0, "aperiodic_params_": [-0.15102634932382192, 0.6239743239853306], "gaussian_params_": [[8.901665701633254, 0.7079771605024905, 0.8764566076777675], [13.330868394915008, 0.3314441907469384, 0.2500297148045914], [54.71203624500822, 0.13295543085883535, 1.045448480404444], [58.67067127111165, 0.35247818956496324, 0.2769966917568826], [65.90780750618123, 0.14677485307937735, 0.7010605362754041], [77.50926350955322, 0.592723767737321, 0.3090287896102914]], "peak_params_": [[8.901665701633254, 0.7035352226787929, 1.752913215355535], [13.330868394915008, 0.1380986154118362, 0.5000594296091828], [54.71203624500822, 0.12800623062285554, 2.090896960808888], [58.67067127111165, 0.17388350289849308, 0.5539933835137651], [65.90780750618123, 0.14551120689568608, 1.4021210725508082], [77.50926350955322, 0.16798299873312872, 0.6180575792205828]], "r_squared_": 0.9261362028334447, "error_": 0.051009936897372946}
{"freq_range": [2.0, 80.0], "freq_res": 1.0, "aperiodic_params_": [-0.09694027474420505, 0.7114761776458315], "gaussian_params_": [[8.720260858320682, 0.5583559241871524, 0.8077187363855935], [13.36300527540802, 0.21027206036640642, 0.5241242523009838], [51.58116368198287, 0.5502234186450158, 0.2518129005327893], [55.77271389564103, 0.1396678420331275, 0.5830834355723256], [59.18015962953351, 0.15192358072837717, 0.7495580899325361], [65.47615946050881, 0.5593673304621438, 0.2738194017225293], [69.54949993515667, 0.481738281334573, 0.2914965657324451], [71.66125544548255, 0.37067309799689535, 0.34874883996608164], [73.8218662476522, 0.20649208022693352, 0.6023104954605234], [77.99714178468035, 0.12466767308212708, 1.9280524789174105]], "peak_params_": [[8.720260858320682, 0.525853975909741, 1.615437472771187], [13.36300527540802, 0.16543225008714257, 1.0482485046019676], [51.58116368198287, 0.13797436583370715, 0.5036258010655786], [55.77271389564103, 0.1294687689460987, 1.1661668711446511], [59.18015962953351, 0.14759805192221087, 1.4991161798650723], [65.47615946050881, 0.12332524460999927, 0.5476388034450586], [69.54949993515667, 0.14596174930965478, 0.5829931314648902], [71.66125544548255, 0.23438922551380803, 0.6974976799321633], [73.8218662476522, 0.21219263365589947, 1.2046209909210468], [77.99714178468035, 0.12466753610358938, 3.856104957834821]], "r_squared_": 0.9593794013119368, "error_": 0.037974961126806095}
{"freq_range": [2.0, 80.0], "freq_res": 1.0, "aperiodic_params_": [-0.09486087837569528, 0.5068113151279252], "gaussian_params_": [[8.792129605641474, 0.5177682751438584, 0.7925678619468097], [38.00454591213985, 0.1462217926424872, 0.7352280798514385], [44.24830953596377, 0.16570026370085394, 0.7759534187594714], [55.98910275347574, 0.20393168286622543, 0.5741877530591585], [59.660588546888015, 0.15178180196401317, 1.5878062830575927], [62.99320052347159, 0.16574314632028675, 0.25000213660823317], [69.85022333177666, 0.20798062031889064, 0.5971409136549326], [72.31974753675604, 0.34598294083780345, 0.28946471171105503], [73.87487992109752, 0.2914183159485046, 0.33703242812732254], [75.78347848407812, 0.16807512681550205, 0.5929423234048441]], "peak_params_": [[8.792129605641474, 0.5002629309617297, 1.5851357238936195], [38.00454591213985, 0.14621899768077917, 1.470456159702877], [44.24830953596377, 0.15742964877050902, 1.5519068375189429], [55.98910275347574, 0.21453817208138615, 1.148375506118317], [59.660588546888015, 0.14835336666010202, 3.1756125661151855], [62.99320052347159, 0.18230510008682366, 0.5000042732164663], [69.85022333177666, 0.20154019061165374, 1.1942818273098652], [72.31974753675604, 0.18829233424334912, 0.5789294234221101], [73.87487992109752, 0.2738367161356876, 0.6740648562546451], [75.78347848407812, 0.15723452701463303, 1.1858846468096882]], "r_squared_": 0.8762715504492101, "error_": 0.047999190988435324}
{"freq_range": [2.0, 80.0], "freq_res": 1.0, "aperiodic_params_": [-0.20810445980151496, 0.4317046035543027], "gaussian_params_": [[4.452034599135944, 0.14660398929376403, 3.8918775463628115], [8.878678843993846, 0.46826907366979453, 0.7513082649821053], [52.067045651814304, 0.1884382078578585, 0.5729842570194598], [54.85734326840006, 0.18985932339340786, 0.5502972352037789], [58.149003708728785, 0.09837590531485237, 0.6789473251870304], [60.5117701650921, 0.3505793972622264, 0.302965667979017], [63.15065751922411, 0.1377607940061174, 0.799147837152304], [66.0458785938073, 0.12260412408989879, 1.0279328966488797], [69.57747834791739, 0.2860196945360144, 0.25798363109624445], [76.54796540086404, 0.10451258441957437, 4.298150863240438]], "peak_params_": [[4.452034599135944, 0.14561844354255715, 7.783755092725623], [8.878678843993846, 0.5362687471062644, 1.5026165299642107], [52.067045651814304, 0.18715287231127187, 1.1459685140389195], [54.85734326840006, 0.1835885858730245, 1.1005944704075579], [58.149003708728785, 0.09604458400880023, 1.3578946503740608], [60.5117701650921, 0.09954123436207296, 0.605931335958034], [63.15065751922411, 0.13758203656733947, 1.598295674304608], [66.0458785938073, 0.12786645300574317, 2.0558657932977593], [69.57747834791739, 0.107629669252719, 0.5159672621924889], [76.54796540086404, 0.10393619195205017, 8.596301726480876]], "r_squared_": 0.9473448723973533, "error_": 0.031094319247201626}
{"freq_range": [2.0, 80.0], "freq_res": 1.0, "aperiodic_params_": [0.2592061469379832, 0.8825779216077573], "gaussian_params_": [[8.898222268610652, 0.5786288950369477, 0.9142850577777567], [19.289628372682134, 0.20996761363660726, 0.5171101829815231], [75.45203459913596, 0.11620410635802136, 5.999999999999999]], "peak_params_": [[8.898222268610652, 0.5750547871522922, 1.8285701155555134], [19.289628372682134, 0.17948699478827335, 1.0342203659630462], [75.45203459913596, 0.11587478779055993, 11.999999999999998]], "r_squared_": 0.9743629552482097, "error_": 0.04118276326545445}
{"freq_range": [2.0, 80.0], "freq_res": 1.0, "aperiodic_params_": [0.36524670151719746, 0.9766582088441407], "gaussian_params_": [[8.936152469367292, 0.616906970892127, 0.8870747431442363], [77.55342333223658, 0.11191913704982706, 5.999999999889616]], "peak_params_": [[8.936152469367292, 0.6153111096593534, 1.7741494862884726], [77.55342333223658, 0.11160956440111791, 11.999999999779233]], "r_squared_": 0.9729579030060599, "error_": 0.04852076739974961}
{"freq_range": [2.0, 80.0], "freq_res": 1.0, "aperiodic_params_": [0.21472043759959206, 0.887803624855083], "gaussian_params_": [[8.94228403353122, 0.6443159333481979, 0.8706361154688793], [18.48261343577271, 0.10328871690457424, 5.999999999999963]], "peak_params_": [[8.94228403353122, 0.6725273640904693, 1.7412722309377586], [18.48261343577271, 0.1029551239009987, 11.999999999999925]], "r_squared_": 0.9757664867451178, "error_": 0.047160788242202975}
{"freq_range": [2.0, 80.0], "freq_res": 1.0, "aperiodic_params_": [0.1983520100160036, 0.8413872914863896], "gaussian_params_": [[8.942994490654549, 0.6236626812399335, 0.866671671061294], [13.291897062549845, 0.19785460500652485, 0.4501207420657206], [19.490582943295234, 0.5168741855082912, 0.2831530042978391], [25.37027441698977, 0.4385333035084186, 0.25001497482552065], [27.561741774308473, 0.559501989436056, 0.2638827264509651], [35.8002276504521, 0.09394874910422775, 1.8001687535300812], [55.42614356670026, 0.1597870226312327, 0.5928675799112587], [66.11476349917027, 0.162991714239664, 0.4766808372695614], [72.29219324411113, 0.2232248940645664, 0.28879221048776554], [77.5540016780103, 0.184797569562324, 0.6756576387791827]], "peak_params_": [[8.942994490654549, 0.6223150391239692, 1.733343342122588], [13.291897062549845, 0.1603458679919404, 0.9002414841314412], [19.490582943295234, 0.11522615555046922, 0.5663060085956781], [25.37027441698977, 0.14645848401482553, 0.5000299496510413], [27.561741774308473, 0.14088772884198997, 0.5277654529019302], [35.8002276504521, 0.09337202394927768, 3.6003375070601624], [55.42614356670026, 0.12341057433096703, 1.1857351598225174], [66.11476349917027, 0.1583357500122955, 0.9533616745391228], [72.29219324411113, 0.13379832929882496, 0.5775844209755311], [77.5540016780103, 0.14862081732021148, 1.3513152775583654]], "r_squared_": 0.9816326138381569, "error_": 0.03184995106281586}
{"freq_range": [2.0, 80.0], "freq_res": 1.0, "aperiodic_params_": [0.06585172734938965, 0.7426033475242241], "gaussian_params_": [[9.012621050773173, 0.6478419432245741, 0.8061831428789941], [25.45658980895834, 0.5070633315476071, 0.2683269564220761], [38.313860796054094, 0.07090643523202964, 5.999999923458413], [54.76024158909848, 0.1740617361774561, 0.8252173762055284], [74.59737527792522, 0.3922451122599902, 0.26620534344585806], [77.51881496357092, 1.010544266404155, 0.26986834151357]], "peak_params_": [[9.012621050773173, 0.6477630236978397, 1.6123662857579881], [25.45658980895834, 0.12525602639909228, 0.5366539128441522], [38.313860796054094, 0.07080948915294538, 11.999999846916825], [54.76024158909848, 0.16835141970001533, 1.6504347524110567], [74.59737527792522, 0.12497584915976456, 0.5324106868917161], [77.51881496357092, 0.20615642037294646, 0.53973668302714]], "r_squared_": 0.9618827087080498, "error_": 0.04321255308287851}
{"freq_range": [2.0, 80.0], "freq_res": 1.0, "aperiodic_params_": [-0.027168307081524668, 0.7067259370105996], "gaussian_params_": [[9.026158903946238, 0.6502759790854671, 0.7948780487746555], [54.14042710419133, 0.09314972161119371, 5.999997330629324], [65.86591789764415, 0.10981089023816211, 1.629477942965294], [71.78157229935391, 0.14040374699967267, 1.5551462345610976], [74.52215173037582, 0.5959113072507247, 0.287685250228267], [77.5771729103435, 0.2851488626497747, 0.6887616203879097]], "peak_params_": [[9.026158903946238, 0.6499239421657994, 1.589756097549311], [54.14042710419133, 0.09312421270400395, 11.999994661258649], [65.86591789764415, 0.1227866854040649, 3.258955885930588], [71.78157229935391, 0.14022733082907513, 3.110292469122195], [74.52215173037582, 0.16697246252476594, 0.575370500456534], [77.5771729103435, 0.23625784338626654, 1.3775232407758193]], "r_squared_": 0.9089283195679054, "error_": 0.05947213666856066}
{"freq_range": [2.0, 80.0], "freq_res": 1.0, "aperiodic_params_": [-0.22417329975857408, 0.5788619001548382], "gaussian_params_": [[8.874480377805503, 0.4730775930160976, 0.8657638328237488], [19.3956042310692, 0.5757198381243961, 0.25217456828383733]], "peak_params_": [[8.874480377805503, 0.46813167883797957, 1.7315276656474976], [19.3956042310692, 0.16819086211504175, 0.5043491365676747]], "r_squared_": 0.9392094390293292, "error_": 0.04549188117802336}
{"freq_range": [2.0, 80.0], "freq_res": 1.0, "aperiodic_params_": [-0.30938260213134255, 0.35348683992288654], "gaussian_params_": [[8.851868515969914, 0.42299308665152874, 0.8478636650308355], [19.391499051148518, 0.33629018832657764, 0.6783315113465981], [21.577402055544134, 0.16825325908914188, 0.8912196302876884], [38.95470286480346, 0.18343083544303423, 0.8657316330242592], [40.88067319701818, 0.13333832708975674, 0.25000550494552143], [43.4694202526714, 0.1413601761335811, 1.1312641888998691], [46.60068765747713, 0.38067570440764176, 0.2552427640249816], [52.533902890873236, 0.1280496371111337, 1.9127783380887153], [57.519300322992905, 0.1590156088272245, 1.1540928131987573], [60.36967628210571, 0.34916283315933666, 0.25242473977815433], [61.50415303392386, 0.4923251600381883, 0.2941458148899385], [66.5353530230111, 0.16767101252362324, 3.3297980507365086], [71.33694380596961, 0.09538757991478569, 0.5041113161760491], [74.42651481358872, 0.3536475681865239, 0.271281341197883], [77.5612948184794, 0.48800381583492786, 0.2582269613136241]], "peak_params_": [[8.851868515969914, 0.41658636173406893, 1.695727330061671], [19.391499051148518, 0.28726575964075834, 1.3566630226931962], [21.577402055544134, 0.15056907485091164, 1.7824392605753767], [38.95470286480346, 0.18323758520076938, 1.7314632660485183], [40.88067319701818, 0.14329216583690418, 0.5000110098910429], [43.4694202526714, 0.1297031226301767, 2.2625283777997383], [46.60068765747713, 0.11500128117394415, 0.5104855280499632], [52.533902890873236, 0.12442157613819038, 3.8255566761774307], [57.519300322992905, 0.15423728190088792, 2.3081856263975147], [60.36967628210571, 0.15975986645557427, 0.5048494795563087], [61.50415303392386, 0.18530418793094638, 0.588291629779877], [66.5353530230111, 0.16604648900159347, 6.659596101473017], [71.33694380596961, 0.14453788886284524, 1.0082226323520982], [74.42651481358872, 0.11634479188818969, 0.542562682395766], [77.5612948184794, 0.11570463825921062, 0.5164539226272482]], "r_squared_": 0.8945582467780493, "error_": 0.033368403644294116}
{"freq_range": [2.0, 80.0], "freq_res": 1.0, "aperiodic_params_": [-0.07391401677755709, 0.4698417932899525], "gaussian_params_": [[8.852393548450317, 0.4350060066247205, 0.9408382013131382], [49.55207584245349, 1.0941252071323504, 0.27158537901690366], [53.74208040338148, 0.19802644476242928, 1.2489227660593567], [57.52057778300719, 0.8464695031000481, 0.27796600355817264], [65.77648154231132, 0.3288720767951317, 0.6316648366105897], [70.77673241168918, 0.18160401635555556, 1.8197887952391856], [73.5960731823523, 0.4171214767684168, 0.25279577638472955], [77.79978126231647, 0.2745055202005688, 2.3384499650126216]], "peak_params_": [[8.852393548450317, 0.4296852135395989, 1.8816764026262764], [49.55207584245349, 0.2830197939587351, 0.5431707580338073], [53.74208040338148, 0.19384844409616797, 2.4978455321187134], [57.52057778300719, 0.1918635290993841, 0.5559320071163453], [65.77648154231132, 0.31470846341972014, 1.2633296732211794], [70.77673241168918, 0.18424627428998452, 3.639577590478371], [73.5960731823523, 0.22752783884678407, 0.5055915527694591], [77.79978126231647, 0.27357003683833736, 4.676899930025243]], "r_squared_": 0.8394200554852076, "error_": 0.05633389445379889}
{"freq_range": [2.0, 80.0], "freq_res": 1.0, "aperiodic_params_": [0.3662883560762338, 0.9522430466292541], "gaussian_params_": [[8.98789027530933, 0.5413428418678394, 0.9450601630091774], [19.371639624484853, 0.2630324082065266, 0.4901651458723685], [27.454963740827516, 0.088558010137148, 2.416454714999244], [65.95241861551068, 0.16232149971498236, 0.5636546629506273], [71.43885999714689, 0.11644603389672761, 1.3525277108946046], [77.40973216713772, 0.1549881144117532, 2.7364440907855823]], "peak_params_": [[8.98789027530933, 0.5412984018523248, 1.8901203260183548], [19.371639624484853, 0.19751887947340319, 0.980330291744737], [27.454963740827516, 0.08700221993680302, 4.832909429998488], [65.95241861551068, 0.16180605727597253, 1.1273093259012545], [71.43885999714689, 0.1204491275946491, 2.705055421789209], [77.40973216713772, 0.1532852697106164, 5.4728881815711645]], "r_squared_": 0.9761043428039536, "error_": 0.04529487805024536}
{"freq_range": [2.0, 80.0], "freq_res": 1.0, "aperiodic_params_": [0.35714830705758993, 0.9780389929585314], "gaussian_params_": [[8.951304012862343, 0.6022915444086975, 0.9041381977741378], [19.354934934733947, 0.1150980146876328, 5.999999999999999], [77.53555602910811, 0.8657465255288455, 0.2674605932351895]], "peak_params_": [[8.951304012862343, 0.6273785004128524, 1.8082763955482757], [19.354934934733947, 0.11489680312112271, 11.999999999999998], [77.53555602910811, 0.19169102004269, 0.534921186470379]], "r_squared_": 0.9790067139890501, "error_": 0.04655602340971004}
{"freq_range": [2.0, 80.0], "freq_res": 1.0, "aperiodic_params_": [0.39632239097576766, 0.9789172728212463], "gaussian_params_": [[9.048014625784676, 0.6484711486569834, 0.9010166449784394]], "peak_params_": [[9.048014625784676, 0.6475510511685296, 1.8020332899568787]], "r_squared_": 0.9726922932130195, "error_": 0.05175194084740031}
{"freq_range": [2.0, 80.0], "freq_res": 1.0, "aperiodic_params_": [0.07949414570755549, 0.720568145666487], "gaussian_params_": [[9.050386171088508, 0.6295598547875384, 0.8230725688550836], [20.44250289130792, 0.08585895206235854, 3.2919598666107306], [41.537446796023254, 0.6987143856096613, 0.2559152709399732], [44.44120607977994, 0.7847679220177295, 0.2501416473263695], [66.48948875502417, 1.1191551355912537, 0.2612246991378972], [71.60303281258753, 0.7211716580236659, 0.26786299787997736], [74.9739164425158, 0.1827626499783352, 0.6945667246259424]], "peak_params_": [[9.050386171088508, 0.6285855987869737, 1.6461451377101672], [20.44250289130792, 0.08508677222217176, 6.583919733221461], [41.537446796023254, 0.13642981742379645, 0.5118305418799464], [44.44120607977994, 0.1656453070470716, 0.500283294652739], [66.48948875502417, 0.19339286614575002, 0.5224493982757944], [71.60303281258753, 0.24052560400425738, 0.5357259957599547], [74.9739164425158, 0.1826338220445689, 1.3891334492518848]], "r_squared_": 0.9723960974428998, "error_": 0.0413939128539386}
{"freq_range": [2.0, 80.0], "freq_res": 1.0, "aperiodic_params_": [-0.08076269952855607, 0.6507828443390433], "gaussian_params_": [[9.131427829975806, 0.6532277087716978, 0.7996455741388679], [34.45203460226991, 0.07026289654794474, 5.9999969639680675], [49.016172551883926, 0.0988751486138679, 2.399436892901998], [54.45401924810151, 0.8289160894891549, 0.2500060617437973], [71.83419430350897, 0.19432908097936422, 0.7512510681869556], [74.97880754682677, 0.22629113070716786, 0.5186329258935115], [77.53460149829168, 1.2974803237988768, 0.2507879963362281]], "peak_params_": [[9.131427829975806, 0.6444727626284074, 1.5992911482777359], [34.45203460226991, 0.07006377394448737, 11.999993927936135], [49.016172551883926, 0.10258928487561358, 4.798873785803996], [54.45401924810151, 0.17113815516331132, 0.5000121234875946], [71.83419430350897, 0.189653269294227, 1.5025021363739113], [74.97880754682677, 0.22612935318675054, 1.037265851787023], [77.53460149829168, 0.23189513072339918, 0.5015759926724562]], "r_squared_": 0.9491638310621536, "error_": 0.04623293707937071}
{"freq_range": [2.0, 80.0], "freq_res": 1.0, "aperiodic_params_": [-0.3512449713385117, 0.48792632207959846], "gaussian_params_": [[9.120154183805985, 0.6637691850202339, 0.8216695371031146], [30.002862226411025, 0.14421217861118754, 0.2500045748115054], [71.63219935655897, 0.3241099621368386, 0.27277386197141185], [74.85279981487739, 0.13828750273621795, 0.5725178984891754], [77.55623734840603, 0.4930584394777134, 0.2861875603023229]], "peak_params_": [[9.120154183805985, 0.6567100599899746, 1.6433390742062293], [30.002862226411025, 0.14420272778515075, 0.5000091496230108], [71.63219935655897, 0.13058620619986994, 0.5455477239428237], [74.85279981487739, 0.1337914235334261, 1.145035796978351], [77.55623734840603, 0.148182791040129, 0.5723751206046458]], "r_squared_": 0.9255274751111553, "error_": 0.04633722971849325}
{"freq_range": [2.0, 80.0], "freq_res": 1.0, "aperiodic_params_": [-0.9171859554576041, -0.305501548469397], "gaussian_params_": [[18.319435517359604, 0.5180331405161861, 1.2069052904822315], [21.60822162587849, 0.3511590197896983, 0.7828428353850154], [25.523859354125932, 0.2462845816492978, 2.0903579965390793], [40.84728417640858, 0.2524502574481578, 5.999999999999999]], "peak_params_": [[18.319435517359604, 0.5007691531622386, 2.413810580964463], [21.60822162587849, 0.3760735138128122, 1.5656856707700308], [25.523859354125932, 0.25179453775811633, 4.1807159930781586], [40.84728417640858, 0.2523684974145967, 11.999999999999998]], "r_squared_": 0.6663821303047647, "error_": 0.06690008062168495}
{"freq_range": [2.0, 80.0], "freq_res": 1.0, "aperiodic_params_": [-0.2823119557944153, 0.43541814791915184], "gaussian_params_": [[9.144817970831031, 0.4145779114077417, 0.8699451466701622], [19.29533862505206, 0.1637782982226234, 1.3781795135986559], [39.26075945994546, 0.17984766054330353, 0.759377352521919], [74.07555758745045, 0.14532647176765137, 0.2501211890117154]], "peak_params_": [[9.144817970831031, 0.4088732211548835, 1.7398902933403244], [19.29533862505206, 0.16006056000904334, 2.7563590271973117], [39.26075945994546, 0.1695509092311588, 1.518754705043838], [74.07555758745045, 0.13884461022806915, 0.5002423780234307]], "r_squared_": 0.9174543878964241, "error_": 0.04185639305275541}
{"freq_range": [2.0, 80.0], "freq_res": 1.0, "aperiodic_params_": [0.1004807374475098, 0.7636137593028559], "gaussian_params_": [[9.18628386882446, 0.5087262367056413, 0.8256446885355148], [19.2322385584557, 0.23694622032430843, 0.7179108715790335], [28.131790118776824, 0.16929414334681073, 1.1384513756748236], [36.45204396275912, 0.1029442706353632, 2.1122766650163878], [47.419878381852484, 0.564184691620005, 0.250592993809909], [72.1881701941305, 0.26842536177513515, 0.25000496778743586], [74.00307208522544, 0.17538544092647967, 0.4652329072450295], [77.32501060080538, 0.1371900481170431, 0.9197915812869083]], "peak_params_": [[9.18628386882446, 0.4959411701895486, 1.6512893770710295], [19.2322385584557, 0.22486710857411785, 1.435821743158067], [28.131790118776824, 0.16819792345297135, 2.276902751349647], [36.45204396275912, 0.10061366489758483, 4.2245533300327756], [47.419878381852484, 0.1386106236955884, 0.501185987619818], [72.1881701941305, 0.20222922217667727, 0.5000099355748717], [74.00307208522544, 0.1755809850113954, 0.930465814490059], [77.32501060080538, 0.12888727749404372, 1.8395831625738166]], "r_squared_": 0.9764513718971467, "error_": 0.038265608263323335}
{"freq_range": [2.0, 80.0], "freq_res": 1.0, "aperiodic_params_": [0.3267819987932979, 0.9533170714878194], "gaussian_params_": [[9.160214233255346, 0.633931825856623, 0.8931177592286971], [16.395624436198595, 0.1405511605447478, 2.1080956693178305], [19.4560322941769, 0.40247109924118957, 0.3639404523872376], [28.136046811740734, 0.17753519703349327, 1.4387977751157075], [35.6345162216526, 0.1273785571917249, 1.7011758584517738], [65.58420264698941, 0.47561189838687706, 0.25000000000000006], [72.31696861907082, 0.3968625150717122, 0.25000000000000006], [77.40163522832134, 0.17559783630026926, 0.7457288139613497]], "peak_params_": [[9.160214233255346, 0.6241122574088469, 1.7862355184573941], [16.395624436198595, 0.1380977416431689, 4.216191338635661], [19.4560322941769, 0.24909061513589292, 0.7278809047744752], [28.136046811740734, 0.17674874183838318, 2.877595550231415], [35.6345162216526, 0.12447257013701618, 3.4023517169035475], [65.58420264698941, 0.11928345935106499, 0.5000000000000001], [72.31696861907082, 0.17765386300514696, 0.5000000000000001], [77.40163522832134, 0.1518907807955614, 1.4914576279226994]], "r_squared_": 0.9865561334321766, "error_": 0.0352278934993825}
{"freq_range": [2.0, 80.0], "freq_res": 1.0, "aperiodic_params_": [0.44972942251618603, 1.0453520851571285], "gaussian_params_": [[9.163866097431185, 0.6930272308972857, 0.906747972204844], [13.442538476518298, 0.4371199939044345, 0.27875701173230644], [16.416418347550348, 0.17538686572821557, 1.4390090578135566], [19.491634336553684, 0.2445790728306549, 0.6489818872167188], [24.605238110937655, 0.09737507717390409, 1.1370036281561235], [28.53305940159213, 0.15603146905810292, 1.3575681477768318], [35.465168611431295, 0.11111342587524961, 1.8688095547925627], [65.99073620029198, 0.14339537666440835, 0.4382043737365317], [73.06788527255668, 0.09201832549575524, 2.0989404511543466], [77.52669978450717, 0.554003697367181, 0.28719601699990516]], "peak_params_": [[9.163866097431185, 0.6818025847016241, 1.813495944409688], [13.442538476518298, 0.1345349026033762, 0.5575140234646129], [16.416418347550348, 0.16819516094835807, 2.878018115627113], [19.491634336553684, 0.21856892109588566, 1.2979637744334376], [24.605238110937655, 0.09695761718379092, 2.274007256312247], [28.53305940159213, 0.147404888636117, 2.7151362955536635], [35.465168611431295, 0.10772590941530447, 3.7376191095851254], [65.99073620029198, 0.14368074639273698, 0.8764087474730634], [73.06788527255668, 0.09197021036621811, 4.197880902308693], [77.52669978450717, 0.14830086282237565, 0.5743920339998103]], "r_squared_": 0.9893861138477109, "error_": 0.03432450986416166}
{"freq_range": [2.0, 80.0], "freq_res": 1.0, "aperiodic_params_": [0.36942302527228765, 0.9826076375562381], "gaussian_params_": [[9.184154698534682, 0.6933701875040235, 0.8957313444051913], [13.396895846552153, 0.43697749665231506, 0.2733949959559963], [15.260419948226009, 0.15849970569390734, 0.6474836182599469], [16.900713061990025, 0.1621872785943031, 0.5991164616801471], [19.51134728757747, 0.2619903021045834, 0.5314262792822634], [24.98179981992949, 0.0969082881990843, 0.25000164780674794], [30.54796540083589, 0.0802900092496108, 5.237009965918836], [47.01493523313101, 0.12409174148036814, 0.2500049350046721], [66.3744470709904, 0.30888722530465695, 0.2752939886223755], [72.27944038913945, 0.25018507332007683, 0.2560808427365384]], "peak_params_": [[9.184154698534682, 0.6788872384329877, 1.7914626888103826], [13.396895846552153, 0.1530709325160431, 0.5467899919119926], [15.260419948226009, 0.14822114849612267, 1.2949672365198939], [16.900713061990025, 0.16709820743404447, 1.1982329233602942], [19.51134728757747, 0.18222970734400468, 1.0628525585645268], [24.98179981992949, 0.1424619866788306, 0.5000032956134959], [30.54796540083589, 0.07999147139587492, 10.474019931837672], [47.01493523313101, 0.12444812290087426, 0.5000098700093442], [66.3744470709904, 0.12247939640887817, 0.550587977244751], [72.27944038913945, 0.13794030567875604, 0.5121616854730768]], "r_squared_": 0.9881471758062739, "error_": 0.03490177811456478}
{"freq_range": [2.0, 80.0], "freq_res": 1.0, "aperiodic_params_": [0.12196872354615262, 0.7771043620834809], "gaussian_params_": [[9.234754236334968, 0.705669404979425, 0.8380688527246631], [19.55789144006063, 0.19762883634825784, 0.7979516530060263], [25.34939454512692, 0.3521600288845935, 0.2547909664500904], [28.33492852374359, 0.11110524982681028, 1.2719623475407673], [44.437872787973504, 0.5599925831400527, 0.26684612626965515], [47.3842181503646, 0.3936663332013008, 0.26622683139228376], [66.4480357495363, 0.496413542209013, 0.28064503335443425], [71.69039625907077, 0.3046699633013019, 0.2500144310806345]], "peak_params_": [[9.234754236334968, 0.6785207975426469, 1.6761377054493263], [19.55789144006063, 0.16950842210940453, 1.5959033060120527], [25.34939454512692, 0.1411046812611284, 0.5095819329001808], [28.33492852374359, 0.10731948106090616, 2.5439246950815346], [44.437872787973504, 0.14570973330389192, 0.5336922525393103], [47.3842181503646, 0.13894703226675476, 0.5324536627845675], [66.4480357495363, 0.13880681023649322, 0.5612900667088685], [71.69039625907077, 0.14152576913102877, 0.500028862161269]], "r_squared_": 0.9726560863367991, "error_": 0.04375765602408223}
{"freq_range": [2.0, 80.0], "freq_res": 1.0, "aperiodic_params_": [-0.2667793521458399, 0.44253773473374586], "gaussian_params_": [[9.278407401514984, 0.622197904500909, 0.753360474763464], [20.09920185621021, 0.2427888997308632, 1.4070900729248026], [22.628093356282424, 0.660331762663872, 0.2527214285201301], [25.28407787823744, 0.20434059180932387, 0.9033685075159386], [29.148465121894137, 0.17741072079391096, 0.9022719327174168], [41.60609285086491, 0.3170845263390345, 0.264331438501144], [44.172973018113076, 0.08135012658677182, 0.2518958045063718], [44.45203459961516, 0.1507586587489028, 5.999999999999999]], "peak_params_": [[9.278407401514984, 0.5811292142344113, 1.506720949526928], [20.09920185621021, 0.24222358056172988, 2.814180145849605], [22.628093356282424, 0.2612243020855822, 0.5054428570402602], [25.28407787823744, 0.19583804951408645, 1.8067370150318771], [29.148465121894137, 0.18053962926160017, 1.8045438654348336], [41.60609285086491, 0.24314206123239812, 0.528662877002288], [44.172973018113076, 0.2145950788583011, 0.5037916090127436], [44.45203459961516, 0.2145950788583011, 11.999999999999998]], "r_squared_": 0.9110902761002297, "error_": 0.046639461001962416}
{"freq_range": [2.0, 80.0], "freq_res": 1.0, "aperiodic_params_": [-0.8540687311110567, -0.26033765351428284], "gaussian_params_": [[9.185622558833446, 0.43143303716490944, 0.717048984855848], [15.446037337759524, 0.14468314777669453, 1.9824033766122044], [20.384762980053114, 0.37129759511983296, 0.858052015553344], [22.528809860768888, 1.3015747914707976, 0.298731256777472], [24.85670165757757, 0.26608467425252275, 0.9147909189238165], [36.58158589148601, 0.5365529759065487, 0.2585735779611631], [45.17028969469543, 0.14463978703273198, 2.8851092395226012], [49.611511568553524, 0.5791990536703052, 0.2576994401040065]], "peak_params_": [[9.185622558833446, 0.41794855658499375, 1.434097969711696], [15.446037337759524, 0.1410668736914496, 3.964806753224409], [20.384762980053114, 0.34612331273910035, 1.716104031106688], [22.528809860768888, 0.4127655367880452, 0.597462513554944], [24.85670165757757, 0.26284153282942607, 1.829581837847633], [36.58158589148601, 0.14750835942458923, 0.5171471559223262], [45.17028969469543, 0.14438805887609996, 5.7702184790452025], [49.611511568553524, 0.22154888953302762, 0.515398880208013]], "r_squared_": 0.6646837938822832, "error_": 0.05209881671035575}
{"freq_range": [2.0, 80.0], "freq_res": 1.0, "aperiodic_params_": [-0.8687696324938157, -0.23524962487508597], "gaussian_params_": [[18.158140519177028, 0.3517987066939555, 0.8161775492008236], [22.315042062156923, 0.28292442368058673, 3.7856484037497347], [40.497136669687194, 0.2419709823121295, 5.723479058859346], [56.984892937593756, 0.1399694577988641, 2.556175547287154]], "peak_params_": [[18.158140519177028, 0.49311915340581086, 1.6323550984016473], [22.315042062156923, 0.2832572988249796, 7.571296807499469], [40.497136669687194, 0.24106508567057855, 11.446958117718692], [56.984892937593756, 0.14375535720769705, 5.112351094574308]], "r_squared_": 0.6655727139057432, "error_": 0.06251998249015527}
{"freq_range": [2.0, 80.0], "freq_res": 1.0, "aperiodic_params_": [-0.30869501608583455, 0.396835595517203], "gaussian_params_": [[9.330054075590997, 0.6454583057632921, 0.6786558167062748], [19.412843825610675, 0.2616403520712124, 0.4422442057493175], [20.671116234233615, 0.2705834646168019, 0.2500051370434134], [24.342555789459425, 0.10782293470250899, 5.999995036012753], [41.54796540086278, 0.12117325084375521, 5.999999999999984]], "peak_params_": [[9.330054075590997, 0.5775672409907511, 1.3573116334125497], [19.412843825610675, 0.24186530495776792, 0.884488411498635], [20.671116234233615, 0.20698428043479, 0.5000102740868267], [24.342555789459425, 0.10933005110843497, 11.999990072025506], [41.54796540086278, 0.12224910381803278, 11.999999999999968]], "r_squared_": 0.9002721191953447, "error_": 0.04407208901914921}
{"freq_range": [2.0, 80.0], "freq_res": 1.0, "aperiodic_params_": [0.05678408672165483, 0.712915773433021], "gaussian_params_": [[9.297139275480996, 0.7753187043218349, 0.738505750483379], [18.39708257485068, 0.21472047153675478, 1.8876530427483227], [28.355945669646225, 0.1843227121899566, 1.0352584237772273], [72.01181239327818, 0.1830634811853843, 0.25004346764207763], [73.96327280565919, 0.18901413245034582, 0.250003713290182]], "peak_params_": [[9.297139275480996, 0.7150352575299429, 1.477011500966758], [18.39708257485068, 0.21002190694842704, 3.7753060854966454], [28.355945669646225, 0.17374416939929838, 2.0705168475544546], [72.01181239327818, 0.1828593195178725, 0.5000869352841553], [73.96327280565919, 0.18698548869034393, 0.500007426580364]], "r_squared_": 0.9692945511445452, "error_": 0.04281351580074684}
{"freq_range": [2.0, 80.0], "freq_res": 1.0, "aperiodic_params_": [0.2843101405126021, 0.9144932190679963], "gaussian_params_": [[9.27798056860425, 0.8822598063562961, 0.8028686084537972], [17.856455313866636, 0.23598851841928076, 2.193586245863464], [28.19371420379789, 0.1832823322766457, 1.1612635256064898], [35.37248185491791, 0.10735229097274544, 1.9388015254709714], [72.32313309553518, 0.3402801870882472, 0.2500064279442276]], "peak_params_": [[9.27798056860425, 0.8309997396036795, 1.6057372169075943], [17.856455313866636, 0.23548378641837164, 4.387172491726928], [28.19371420379789, 0.18083307541967653, 2.3225270512129796], [35.37248185491791, 0.10538928253384894, 3.877603050941943], [72.32313309553518, 0.14759799557196152, 0.5000128558884552]], "r_squared_": 0.9828112191960223, "error_": 0.03900717671671819}
{"freq_range": [2.0, 80.0], "freq_res": 1.0, "aperiodic_params_": [0.3453772999312655, 0.9838252828581561], "gaussian_params_": [[9.28985994671608, 1.0129939941354225, 0.8541122656044067], [16.46507790353316, 0.21555141706413145, 2.0207311363868063], [19.422432594909804, 0.18219583001197534, 0.7707254648795612], [29.439675266170884, 0.10895973253708058, 5.633926734579115], [72.35118301996619, 0.35583930014251336, 0.2540659299284655]], "peak_params_": [[9.28985994671608, 0.9566931173742167, 1.7082245312088133], [16.46507790353316, 0.21625945562293014, 4.041462272773613], [19.422432594909804, 0.27449585980363667, 1.5414509297591223], [29.439675266170884, 0.10862843715316384, 11.26785346915823], [72.35118301996619, 0.136888890827356, 0.508131859856931]], "r_squared_": 0.9861617633012235, "error_": 0.03865619993566492}
{"freq_range": [2.0, 80.0], "freq_res": 1.0, "aperiodic_params_": [0.27561172967638564, 0.9317126049702209], "gaussian_params_": [[9.308482584263231, 0.9838757752519134, 0.8736024993377894], [16.2978594228257, 0.19514513055261584, 2.10737838552303], [19.563840294289392, 0.20637175228644422, 0.6504609783043167], [30.33135938917167, 0.10836219284782582, 5.999999994914579], [46.982852149047964, 0.1389214077873698, 0.38774930141373765], [71.7494485677348, 0.23438623866350675, 0.26977095867941525]], "peak_params_": [[9.308482584263231, 0.9250894107227751, 1.7472049986755789], [16.2978594228257, 0.19945745963589212, 4.21475677104606], [19.563840294289392, 0.23113543690311822, 1.3009219566086334], [30.33135938917167, 0.10819706800867324, 11.999999989829158], [46.982852149047964, 0.14107102418962514, 0.7754986028274753], [71.7494485677348, 0.15227321437381258, 0.5395419173588305]], "r_squared_": 0.9860044383967226, "error_": 0.037231202789047936}
{"freq_range": [2.0, 80.0], "freq_res": 1.0, "aperiodic_params_": [0.06994656644599576, 0.7592506422362368], "gaussian_params_": [[9.306843627294915, 0.96514237035791, 0.8603564732500958], [16.981970337123737, 0.16378314904265695, 2.823284647754285], [19.502604522060224, 0.5237503654638537, 0.29109597554647043], [25.284628262393067, 0.1675759445605681, 0.2501215172770865], [30.547964677937156, 0.09504107980099276, 5.999999999999999], [41.52211699251091, 0.7526028346701211, 0.2519199458489086], [47.12941562534507, 0.15041995856226675, 0.3655487613249893]], "peak_params_": [[9.306843627294915, 0.9088325318304166, 1.7207129465001916], [16.981970337123737, 0.1712062041283262, 5.64656929550857], [19.502604522060224, 0.23442073026786414, 0.5821919510929409], [25.284628262393067, 0.152586566826735, 0.500243034554173], [30.547964677937156, 0.09477246179482257, 11.999999999999998], [41.52211699251091, 0.13987530732597775, 0.5038398916978172], [47.12941562534507, 0.14349705997749274, 0.7310975226499786]], "r_squared_": 0.9781679691845285, "error_": 0.0406835307300414}
{"freq_range": [2.0, 80.0], "freq_res": 1.0, "aperiodic_params_": [-0.21891830614636143, 0.47967687123653674], "gaussian_params_": [[9.275559729073708, 0.8630676576440919, 0.7959971209318765], [16.567229087434352, 0.6290786575291175, 0.2802794614315194], [19.300889477705443, 0.2106748209337419, 0.7927456837745124], [25.066215380498118, 0.10714926202283541, 3.67056724023981], [35.66767317332224, 0.14850683753848185, 2.5687065057252614], [41.567142745128464, 0.9605838864553782, 0.25001391374097437], [44.48516243203808, 1.1554325252278985, 0.2598621753108557], [47.02576445361997, 0.1968799401348222, 0.6776359700725108]], "peak_params_": [[9.275559729073708, 0.8128781946582387, 1.591994241863753], [16.567229087434352, 0.20368332540622214, 0.5605589228630388], [19.300889477705443, 0.223379537919147, 1.5854913675490248], [25.066215380498118, 0.1071585365066765, 7.34113448047962], [35.66767317332224, 0.1485374784279866, 5.137413011450523], [41.567142745128464, 0.22171856351956465, 0.5000278274819487], [44.48516243203808, 0.20300640812456727, 0.5197243506217114], [47.02576445361997, 0.19674650726406928, 1.3552719401450215]], "r_squared_": 0.9448671735448422, "error_": 0.04385453241753502}
{"freq_range": [2.0, 80.0], "freq_res": 1.0, "aperiodic_params_": [-0.7363037745975303, -0.05121301798156076], "gaussian_params_": [[9.010447982230634, 0.595595739359353, 0.7974648027627962], [22.126677001615185, 0.27119411285835476, 4.993409858995245], [33.65109101340719, 0.1867904249735113, 1.0839088806447617], [44.34017646319518, 0.207907831412895, 5.999999999999999]], "peak_params_": [[9.010447982230634, 0.604108392320921, 1.5949296055255924], [22.126677001615185, 0.2713098452371841, 9.98681971799049], [33.65109101340719, 0.24050405578613776, 2.1678177612895233], [44.34017646319518, 0.2075924216070385, 11.999999999999998]], "r_squared_": 0.6936415640234024, "error_": 0.04895686940152399}
{"freq_range": [2.0, 80.0], "freq_res": 1.0, "aperiodic_params_": [-0.8158704186509691, -0.2538739750077567], "gaussian_params_": [[9.155819610334877, 0.6160961237887711, 0.6481907957364], [24.087599602023147, 0.34484814270431136, 5.316740696429132]], "peak_params_": [[9.155819610334877, 0.6047007395807141, 1.2963815914728], [24.087599602023147, 0.3448013388381577, 10.633481392858265]], "r_squared_": 0.627433277750957, "error_": 0.0667379243272617}
{"freq_range": [2.0, 80.0], "freq_res": 1.0, "aperiodic_params_": [-0.36307595411951116, 0.27614303049610933], "gaussian_params_": [[9.221513863813165, 0.9733748653830585, 0.6800222783584753], [22.118786008519177, 0.1327138812789455, 5.999999999999999], [28.752156820682497, 0.13470784791797039, 0.6210096397826906]], "peak_params_": [[9.221513863813165, 0.9352353068644995, 1.3600445567169506], [22.118786008519177, 0.13268787537954774, 11.999999999999998], [28.752156820682497, 0.193150320136664, 1.2420192795653813]], "r_squared_": 0.8617463162683374, "error_": 0.053987353027815904}
{"freq_range": [2.0, 80.0], "freq_res": 1.0, "aperiodic_params_": [-0.012515766742999673, 0.6613645303380834], "gaussian_params_": [[9.280015010934514, 1.1392350398097566, 0.7241349156027318], [17.87226229522262, 0.21782252478448377, 2.541742199009751], [28.566114593466008, 0.1900944718950322, 0.7670040275252681]], "peak_params_": [[9.280015010934514, 1.0576595064019128, 1.4482698312054636], [17.87226229522262, 0.21754762536753924, 5.083484398019502], [28.566114593466008, 0.16200253534732878, 1.5340080550505362]], "r_squared_": 0.9693998742741338, "error_": 0.043124417960961406}
{"freq_range": [2.0, 80.0], "freq_res": 1.0, "aperiodic_params_": [0.40433731443508597, 0.9922222807383261], "gaussian_params_": [[9.325501886631631, 1.3090208855189263, 0.8306523750041409], [17.953909156291104, 0.24261831001429376, 3.453195981233022], [28.36965155051059, 0.1907087108651518, 0.7733694588777789], [33.91804592800673, 0.19227962470591126, 0.4899998619107381]], "peak_params_": [[9.325501886631631, 1.2206913959495869, 1.6613047500082818], [17.953909156291104, 0.242596699699267, 6.906391962466044], [28.36965155051059, 0.17364663658044643, 1.5467389177555577], [33.91804592800673, 0.18961393242204005, 0.9799997238214762]], "r_squared_": 0.9838333321527352, "error_": 0.045489443225185375}
{"freq_range": [2.0, 80.0], "freq_res": 1.0, "aperiodic_params_": [0.4570784518954492, 1.0170496727960956], "gaussian_params_": [[9.333591149608893, 1.294963762039881, 0.8099969519363522], [18.08310760322946, 0.2787281669918096, 2.666808347700814]], "peak_params_": [[9.333591149608893, 1.1905131308781751, 1.6199939038727045], [18.08310760322946, 0.2785928528065664, 5.333616695401628]], "r_squared_": 0.9797554793893666, "error_": 0.05333291040191329}
{"freq_range": [2.0, 80.0], "freq_res": 1.0, "aperiodic_params_": [0.16005540915306976, 0.8207600661865336], "gaussian_params_": [[9.309706482652217, 1.3320296720619844, 0.854453128811452], [18.763825357185176, 0.26885041060277276, 3.959452337519997]], "peak_params_": [[9.309706482652217, 1.2601961486960176, 1.708906257622904], [18.763825357185176, 0.2683725615110476, 7.918904675039994]], "r_squared_": 0.974519293970487, "error_": 0.053034057797125014}
{"freq_range": [2.0, 80.0], "freq_res": 1.0, "aperiodic_params_": [-0.16229519105993617, 0.5620207376295475], "gaussian_params_": [[8.559578102307647, 1.8575616553682281, 0.3214357687439739], [9.808365432481903, 0.8734058061674794, 0.8268745577137933], [18.670643446168448, 0.32099301928124274, 2.5043692623158624], [25.381736681714184, 0.29034950618376804, 0.2887856954863554], [27.729869865999554, 0.1418165159598375, 1.56999676421939], [34.758766962576786, 0.11754624498305241, 2.7780054345228335], [41.54032554605748, 0.5554744345178732, 0.28277881818089934], [44.44232414685998, 0.617643405263098, 0.27862303034204344]], "peak_params_": [[8.559578102307647, 1.2683599398924166, 0.6428715374879478], [9.808365432481903, 0.8511438168578632, 1.6537491154275865], [18.670643446168448, 0.3182291418362665, 5.008738524631725], [25.381736681714184, 0.16588650998237986, 0.5775713909727108], [27.729869865999554, 0.14613735290258245, 3.13999352843878], [34.758766962576786, 0.1171070226112394, 5.556010869045667], [41.54032554605748, 0.15213873740254302, 0.5655576363617987], [44.44232414685998, 0.17563805781442832, 0.5572460606840869]], "r_squared_": 0.9736068548818783, "error_": 0.03954323334807224}
{"freq_range": [2.0, 80.0], "freq_res": 1.0, "aperiodic_params_": [-0.45486412410968324, 0.11886756370606717], "gaussian_params_": [[9.020234665382452, 1.0913192374228589, 0.8532624331687375]], "peak_params_": [[9.020234665382452, 1.0910124146709677, 1.706524866337475]], "r_squared_": 0.6879671736090676, "error_": 0.08590125811391708}
{"freq_range": [2.0, 80.0], "freq_res": 1.0, "aperiodic_params_": [-0.6274666108768098, 0.4695627610390495], "gaussian_params_": [[9.212508565918121, 0.8398148734238416, 0.6482383320905609], [18.452034599135946, 0.1012484098444323, 3.739319119987877], [26.46905849509188, 0.7590825812720381, 0.2522525665703255], [28.829383621974717, 0.11469919986314801, 1.4433699142199772], [34.212046501542716, 0.14979707523204952, 0.8316580691690401], [37.7208147759339, 0.10079335556648367, 3.058121160815095]], "peak_params_": [[9.212508565918121, 0.8000277003468014, 1.2964766641811218], [18.452034599135946, 0.1005113024547526, 7.478638239975754], [26.46905849509188, 0.1647909187848018, 0.504505133140651], [28.829383621974717, 0.1175234000328167, 2.8867398284399544], [34.212046501542716, 0.19329288547611823, 1.6633161383380801], [37.7208147759339, 0.1003790054206104, 6.11624232163019]], "r_squared_": 0.9513552478699776, "error_": 0.040194174123002496}
{"freq_range": [2.0, 80.0], "freq_res": 1.0, "aperiodic_params_": [-0.33937354465761305, 0.39689371163137926], "gaussian_params_": [[9.133515108503405, 1.1266470166701932, 0.7835633975738245], [17.017686408259163, 0.2052263295588617, 2.6784849110631654], [41.61302199785547, 0.41105051981538054, 0.27288061599906543], [71.67679160920525, 0.18883396056532534, 0.4792778252960377], [79.06873125055981, 0.1597845777059951, 0.6150516772411788]], "peak_params_": [[9.133515108503405, 1.1127350493949113, 1.567126795147649], [17.017686408259163, 0.2052218555253641, 5.356969822126331], [41.61302199785547, 0.1503823629759643, 0.5457612319981309], [71.67679160920525, 0.15042787827271997, 0.9585556505920754], [79.06873125055981, 0.1587900085124473, 1.2301033544823576]], "r_squared_": 0.9469730126678442, "error_": 0.0445811871898425}
{"freq_range": [2.0, 80.0], "freq_res": 1.0, "aperiodic_params_": [0.044584115599018044, 0.7632560342069725], "gaussian_params_": [[9.197321039620773, 1.4017689222599696, 0.762553233679347], [12.135235189662122, 0.24783967446010455, 1.8444101878699204], [15.897878746405624, 0.1777970670293605, 0.6292286775593618], [18.51786718497968, 0.3731292477591988, 1.4994324284015395], [26.81427737642325, 0.12405894979642672, 2.6972326215361546], [34.02843689857633, 0.1427874071554436, 0.2500006295908591]], "peak_params_": [[9.197321039620773, 1.4140569211750749, 1.525106467358694], [12.135235189662122, 0.2488381932323791, 3.688820375739841], [15.897878746405624, 0.2942087184588993, 1.2584573551187237], [18.51786718497968, 0.35644101239432, 2.998864856803079], [26.81427737642325, 0.12376524287968471, 5.394465243072309], [34.02843689857633, 0.14543470880031772, 0.5000012591817182]], "r_squared_": 0.9886967148564826, "error_": 0.033880619292520085}
{"freq_range": [2.0, 80.0], "freq_res": 1.0, "aperiodic_params_": [0.18655097446176677, 0.9099082250826321], "gaussian_params_": [[9.26385127484482, 1.623498921380307, 0.8564595061997508], [13.46213165554546, 0.26134243739760177, 2.940367381583827], [18.768968543827707, 0.42661065087219285, 1.1504150562656863], [26.569314012691176, 0.13373445402496562, 5.999996321426772], [33.99798053222256, 0.10882014372813767, 0.25000140758977096]], "peak_params_": [[9.26385127484482, 1.6327236619507837, 1.7129190123995015], [13.46213165554546, 0.2686218053348287, 5.880734763167654], [18.768968543827707, 0.5227962369764386, 2.3008301125313726], [26.569314012691176, 0.13339688059254962, 11.999992642853544], [33.99798053222256, 0.17093105881475723, 0.5000028151795419]], "r_squared_": 0.9911177535897121, "error_": 0.038561002632410954}
{"freq_range": [2.0, 80.0], "freq_res": 1.0, "aperiodic_params_": [0.1930272020171498, 0.895730003647396], "gaussian_params_": [[9.286579932368044, 1.6252888727830086, 0.907278083832652], [13.893280018926102, 0.22116187005746998, 2.856413050968056], [18.89673112188434, 0.4916049926958804, 1.2400101700478612], [27.15744895131968, 0.14535281875794417, 5.999999717632637], [34.023121250148286, 0.09561779413674353, 0.2502928148718779]], "peak_params_": [[9.286579932368044, 1.598677107416247, 1.814556167665304], [13.893280018926102, 0.23433973515372597, 5.712826101936112], [18.89673112188434, 0.5923203553092714, 2.4800203400957224], [27.15744895131968, 0.145308707642809, 11.999999435265273], [34.023121250148286, 0.17106990083049434, 0.5005856297437558]], "r_squared_": 0.9878362967297593, "error_": 0.04363521577115063}
{"freq_range": [2.0, 80.0], "freq_res": 1.0, "aperiodic_params_": [-0.1143999012018408, 0.7256808566814245], "gaussian_params_": [[9.035851122593336, 1.0970652578897955, 0.813162170462139], [9.665400360085137, 0.45623497475999647, 1.2259460861498175], [17.842291249706903, 0.30548098911081756, 3.9103431063002185], [18.740236336635267, 0.31382053004889193, 0.7156432174626874], [28.535100464838774, 0.19894534864720123, 1.9482425899212636], [33.88443811458911, 0.13975753062933904, 0.36157490696999045]], "peak_params_": [[9.035851122593336, 1.5134421251386874, 1.626324340924278], [9.665400360085137, 1.0236418853576892, 2.451892172299635], [17.842291249706903, 0.48903595059880933, 7.820686212600437], [18.740236336635267, 0.5861963806872976, 1.4312864349253749], [28.535100464838774, 0.19857318557224302, 3.8964851798425273], [33.88443811458911, 0.13675055824327287, 0.7231498139399809]], "r_squared_": 0.9866439920672092, "error_": 0.03995750238460052}
{"freq_range": [2.0, 80.0], "freq_res": 1.0, "aperiodic_params_": [-0.49367535930340595, 0.504847124348312], "gaussian_params_": [[9.072214733410389, 1.0873300291823769, 0.8821675803696915], [15.909196813054287, 0.21143125869264742, 0.6394528669439457], [18.77506789210562, 0.29834048244091155, 0.9721509463188841], [21.937637383043448, 0.1655390116620401, 0.4460557996607764], [33.521506805140106, 0.8009455427211868, 0.27553999490082515], [72.447946586028, 0.9438327714798241, 0.25267233511154663], [78.47161031539007, 0.9094358052006377, 0.25709251812861733]], "peak_params_": [[9.072214733410389, 1.0836929441112986, 1.764335160739383], [15.909196813054287, 0.21438344425262978, 1.2789057338878913], [18.77506789210562, 0.29046241444918863, 1.9443018926377682], [21.937637383043448, 0.16514548921033456, 0.8921115993215528], [33.521506805140106, 0.17732131601668089, 0.5510799898016503], [72.447946586028, 0.19607072610281562, 0.5053446702230933], [78.47161031539007, 0.16907022463888222, 0.5141850362572347]], "r_squared_": 0.9564644442197657, "error_": 0.045156989372709656}
{"freq_range": [2.0, 80.0], "freq_res": 1.0, "aperiodic_params_": [-0.07616531451648702, 0.7669029664028008], "gaussian_params_": [[9.187498752066558, 1.3865992899849091, 0.7974939120429289], [12.26542673100087, 0.18255750111227612, 1.1376100096469883], [15.80076961812932, 0.23823286492683113, 1.0466291761084168], [18.869354816357518, 0.3120606957478587, 1.1479893299067867], [31.151679538586407, 0.07485130169129757, 5.999999999999999], [34.02902512498626, 0.0621981430090736, 0.25005050800073225]], "peak_params_": [[9.187498752066558, 1.3518493585585938, 1.5949878240858577], [12.26542673100087, 0.181202434366172, 2.2752200192939767], [15.80076961812932, 0.2516054762873394, 2.0932583522168335], [18.869354816357518, 0.3219029289888945, 2.2959786598135734], [31.151679538586407, 0.07482738773265751, 11.999999999999998], [34.02902512498626, 0.12865544055352052, 0.5001010160014645]], "r_squared_": 0.9878406839750624, "error_": 0.03284530729283993}
{"freq_range": [2.0, 80.0], "freq_res": 1.0, "aperiodic_params_": [-0.06031746538113979, 0.8017327370998262], "gaussian_params_": [[9.205440286344876, 1.5253408343709622, 0.8322539618057395], [15.63880875967568, 0.21618665886766744, 3.814515676992426], [18.941580940750125, 0.2836908708450752, 0.8189151919545815], [30.169255240891236, 0.09303658983209359, 5.999999999999999], [33.99887799747299, 0.06825632836810852, 0.250000294644789]], "peak_params_": [[9.205440286344876, 1.5272964032724423, 1.664507923611479], [15.63880875967568, 0.22139075667858044, 7.629031353984852], [18.941580940750125, 0.4460513605207732, 1.637830383909163], [30.169255240891236, 0.09318026195306883, 11.999999999999998], [33.99887799747299, 0.14413960626981814, 0.500000589289578]], "r_squared_": 0.9889515777532296, "error_": 0.03689714595661638}
{"freq_range": [2.0, 80.0], "freq_res": 1.0, "aperiodic_params_": [-0.05649652030634361, 0.791300939008955], "gaussian_params_": [[9.19062190362929, 1.5343654835508849, 0.8608729888349488], [13.018923213113888, 0.20415854986352738, 2.618387161236193], [18.76147926527353, 0.4519203990331774, 1.4185630864315626], [28.818620832738166, 0.12126225409142814, 5.999994785088361]], "peak_params_": [[9.19062190362929, 1.560588811611799, 1.7217459776698976], [13.018923213113888, 0.20811042461510842, 5.236774322472386], [18.76147926527353, 0.49239079462402313, 2.837126172863125], [28.818620832738166, 0.12120686089437838, 11.999989570176721]], "r_squared_": 0.9868475313895041, "error_": 0.04212040533826615}
{"freq_range": [2.0, 80.0], "freq_res": 1.0, "aperiodic_params_": [-0.8227328175180528, 0.43120903656405546], "gaussian_params_": [[8.905402081940853, 0.32959847308131857, 0.7476129303475002], [13.154104212861888, 0.1659508688567373, 1.1542388680139068], [19.437199078980395, 0.1480384529036228, 1.2258245394985798], [20.879921524163024, 0.12284009725463346, 0.2500302246407323], [27.307929512714036, 0.170454284450392, 2.3243619498635737], [30.557080979306047, 0.4230040417356465, 0.26645100552241996], [34.22205601489147, 0.19880906538674276, 1.0831922744693536], [37.61184177803977, 0.2986678918225479, 0.27103271820644576], [40.01285838936801, 0.08983371717505058, 3.8822441265176884], [78.0351455231951, 0.11676913620561147, 0.6288536838523388]], "peak_params_": [[8.905402081940853, 0.32722591597690864, 1.4952258606950004], [13.154104212861888, 0.16447862999271967, 2.3084777360278137], [19.437199078980395, 0.1392032596111592, 2.4516490789971597], [20.879921524163024, 0.17942928920512302, 0.5000604492814646], [27.307929512714036, 0.16929143288352155, 4.648723899727147], [30.557080979306047, 0.16297491717331658, 0.5329020110448399], [34.22205601489147, 0.22445022244324653, 2.1663845489387072], [37.61184177803977, 0.186098947529572, 0.5420654364128915], [40.01285838936801, 0.0898334133656582, 7.764488253035377], [78.0351455231951, 0.11658691463156456, 1.2577073677046775]], "r_squared_": 0.9289764092662023, "error_": 0.03651256506095383}
{"freq_range": [2.0, 80.0], "freq_res": 1.0, "aperiodic_params_": [-0.5448616914974632, 0.5331607754729117], "gaussian_params_": [[8.706709922678446, 0.7336363386332678, 0.786385751725958], [13.124415866899945, 0.20933161766176672, 0.698895000813213], [16.7935904146186, 0.17427623991262817, 0.3874570734562167], [77.78392181648834, 0.12861099379220803, 1.4477630119051852]], "peak_params_": [[8.706709922678446, 0.6843462816319963, 1.572771503451916], [13.124415866899945, 0.20604110415053922, 1.397790001626426], [16.7935904146186, 0.1512209284607302, 0.7749141469124334], [77.78392181648834, 0.12718650609941817, 2.8955260238103704]], "r_squared_": 0.9145792886362116, "error_": 0.05405940527695583}
{"freq_range": [2.0, 80.0], "freq_res": 1.0, "aperiodic_params_": [-0.4476719470466574, 0.5573073233931314], "gaussian_params_": [[8.6696149373389, 0.674388109770566, 0.8480511549750194], [13.150602156178719, 0.2410437175102363, 0.6122688737356476], [16.68950605630421, 0.28288975785481274, 0.2593234414349039], [19.328182723146302, 0.21341425204231376, 0.5888340743353134], [34.34147109960184, 0.07812748259010756, 5.999999999999449], [71.59946239834514, 0.4470095753740265, 0.2500015412152975], [77.86965484886717, 0.1490357645526794, 0.9230905893790243]], "peak_params_": [[8.6696149373389, 0.625114987889236, 1.6961023099500387], [13.150602156178719, 0.23400223675432152, 1.2245377474712953], [16.68950605630421, 0.13942488625421867, 0.5186468828698078], [19.328182723146302, 0.18568611643324118, 1.1776681486706269], [34.34147109960184, 0.07800105914454547, 11.999999999998899], [71.59946239834514, 0.12386012208691288, 0.500003082430595], [77.86965484886717, 0.14755734200505644, 1.8461811787580487]], "r_squared_": 0.9399266544504963, "error_": 0.04371010548833551}
{"freq_range": [2.0, 80.0], "freq_res": 1.0, "aperiodic_params_": [-0.6569913639763005, 0.4808901428045793], "gaussian_params_": [[8.757699312157904, 0.7868420092557874, 0.8514997900318233], [13.157618083488094, 0.17631498435196846, 0.48910263450215336], [16.907690734309206, 0.10510158749848458, 0.25009058624463165], [22.547965400864054, 0.10211511579165107, 5.999999999999999]], "peak_params_": [[8.757699312157904, 0.7636009443468645, 1.7029995800636466], [13.157618083488094, 0.19618398841255547, 0.9782052690043067], [16.907690734309206, 0.16477377123803594, 0.5001811724892633], [22.547965400864054, 0.10182572495424758, 11.999999999999998]], "r_squared_": 0.9381885710030523, "error_": 0.046590400272629666}
