{"freq_range": [2.0, 80.0], "freq_res": 1.0, "aperiodic_params_": [-0.26278301707256946, 0.40790687104832907], "gaussian_params_": [[9.726350291808755, 0.3990686798554499, 0.2500735260015862], [17.459845236459074, 0.13579488291347452, 2.0643204380287954], [35.62333043541157, 0.43676718414348936, 0.279055713013879], [38.5144298890139, 0.19568794518901753, 1.1244906353841835], [45.70067472973832, 0.2178550602559323, 0.43337977180393644], [51.4438203960366, 0.18693975170988925, 2.2833018588545757], [54.97621496725665, 0.1417861262035531, 0.25001458544379995]], "peak_params_": [[9.726350291808755, 0.21949205358065538, 0.5001470520031724], [17.459845236459074, 0.13246716786439705, 4.128640876057591], [35.62333043541157, 0.19170030883020028, 0.558111426027758], [38.5144298890139, 0.17826839388329363, 2.248981270768367], [45.70067472973832, 0.182523518851753, 0.8667595436078729], [51.4438203960366, 0.18344139717274943, 4.566603717709151], [54.97621496725665, 0.19673166765144123, 0.5000291708875999]], "r_squared_": 0.8267877146745778, "error_": 0.05251019736986782}
{"freq_range": [2.0, 80.0], "freq_res": 1.0, "aperiodic_params_": [-0.26568807947504536, 0.5501096485040115], "gaussian_params_": [[9.551725981677496, 0.955663308178382, 0.2748564038187229], [16.016075189069575, 0.17803808067328356, 0.25000007114916817], [18.89151776438844, 0.15296460504880693, 2.2984484538341685], [28.08266640010049, 0.2658354900112059, 2.0999139262259168], [37.52295803403306, 0.17288318852928605, 3.064466864633482], [45.01847319279312, 0.10894833149480371, 1.444963335758935], [50.315851184670905, 0.33020888867482473, 0.2545643406579096], [52.313392075545224, 0.1447100236088639, 2.2806738259175043]], "peak_params_": [[9.551725981677496, 0.252842116823189, 0.5497128076374458], [16.016075189069575, 0.24700102740063878, 0.5000001422983363], [18.89151776438844, 0.15281735381628592, 4.596896907668337], [28.08266640010049, 0.2670720059473778, 4.1998278524518335], [37.52295803403306, 0.1708057417311868, 6.128933729266964], [45.01847319279312, 0.1185970852980982, 2.88992667151787], [50.315851184670905, 0.23977336370391433, 0.5091286813158192], [52.313392075545224, 0.14335363238912846, 4.561347651835009]], "r_squared_": 0.9267296943803035, "error_": 0.047305426332953655}
{"freq_range": [2.0, 80.0], "freq_res": 1.0, "aperiodic_params_": [-0.36127964560468817, 0.3641827440511317], "gaussian_params_": [[9.588933835642274, 0.7186700910678252, 0.25000000018298096], [17.05062239162723, 0.1940954368128939, 1.277629741157713], [27.223824568596545, 0.1641419262319641, 1.3910379750573352], [34.737963474361585, 0.12520224896580948, 3.2482147046476406], [38.50560515196113, 0.7855316666916748, 0.26329603644729543], [42.21636035003012, 0.1583017462101946, 0.7111246340237106], [45.96513793186412, 0.09719266050334863, 3.132004066386355], [53.54796539431945, 0.10912543872365038, 5.999999999999999], [61.4158982664764, 0.6128233269429336, 0.2501935123994318]], "peak_params_": [[9.588933835642274, 0.18597263381317952, 0.5000000003659619], [17.05062239162723, 0.19394318307045588, 2.555259482315426], [27.223824568596545, 0.1693703261998396, 2.7820759501146703], [34.737963474361585, 0.12592532027158343, 6.496429409295281], [38.50560515196113, 0.2016675242032816, 0.5265920728945909], [42.21636035003012, 0.2221600252645365, 1.4222492680474212], [45.96513793186412, 0.14695675970544242, 6.26400813277271], [53.54796539431945, 0.11243461722603243, 11.999999999999998], [61.4158982664764, 0.20438429381372836, 0.5003870247988637]], "r_squared_": 0.8246912348845817, "error_": 0.044760225831078755}
{"freq_range": [2.0, 80.0], "freq_res": 1.0, "aperiodic_params_": [-0.2934399089945351, 0.1874983329198665], "gaussian_params_": [[9.556251168461058, 0.7677802884528115, 0.2507258519383821], [27.385819051891016, 0.16288254176672548, 1.5233233373480042], [34.38742438121632, 0.2251948746905382, 0.5802314115092451], [38.91675983895643, 0.19691364403042935, 1.0529463117722757], [43.31085944965897, 0.18981522388923397, 1.0360077536967829], [50.47421954284192, 0.737820126459327, 0.26775131103030037], [58.716480001340955, 0.13594965831313352, 1.247021233398002], [61.51035386369214, 0.7216762222587579, 0.26478286835384024], [66.10184295249884, 0.17952750951368204, 1.7992064645737191], [72.53360795183406, 0.6590422067067465, 0.2741162175994469]], "peak_params_": [[9.556251168461058, 0.16034170940660536, 0.5014517038767642], [27.385819051891016, 0.1577411402122716, 3.0466466746960084], [34.38742438121632, 0.1802136339156919, 1.1604628230184901], [38.91675983895643, 0.19633229405651098, 2.1058926235445514], [43.31085944965897, 0.18156672072005803, 2.0720155073935658], [50.47421954284192, 0.15374080353158037, 0.5355026220606007], [58.716480001340955, 0.1325552327691648, 2.494042466796004], [61.51035386369214, 0.14814325343952034, 0.5295657367076805], [66.10184295249884, 0.1792401370809915, 3.5984129291474383], [72.53360795183406, 0.1551022098995276, 0.5482324351988938]], "r_squared_": 0.49993108246283385, "error_": 0.04979185451358558}
{"freq_range": [2.0, 80.0], "freq_res": 1.0, "aperiodic_params_": [-0.22025484964296688, 0.3446918958191732], "gaussian_params_": [[19.11206440592053, 0.1783083512509164, 2.2951982653459653], [28.243638852110784, 0.255846249549774, 0.9503333279141946], [35.481189900607276, 0.09823808777688442, 2.229943903647489], [38.562727545379154, 0.291619986053245, 0.27580130362282274], [45.54796540086405, 0.14130548540892182, 5.999999999999999], [55.5112548629941, 0.6569743664058543, 0.2898028258042974], [64.8687094575084, 0.2068312778655225, 0.3985701610214259]], "peak_params_": [[19.11206440592053, 0.1781038636071099, 4.5903965306919305], [28.243638852110784, 0.24998944739314055, 1.9006666558283891], [35.481189900607276, 0.12611129884818206, 4.459887807294978], [38.562727545379154, 0.18916702204696678, 0.5516026072456455], [45.54796540086405, 0.14090647775113485, 11.999999999999998], [55.5112548629941, 0.18945601730671013, 0.5796056516085948], [64.8687094575084, 0.19664651776380881, 0.7971403220428518]], "r_squared_": 0.7161400717359628, "error_": 0.05921380057667397}
{"freq_range": [2.0, 80.0], "freq_res": 1.0, "aperiodic_params_": [-0.5345741893076611, 0.0856512829309201], "gaussian_params_": [[16.442297627282755, 0.6043340032384527, 0.2841219960126454], [19.37269262069226, 0.31731206822726066, 2.0195568097583445], [29.07166916872011, 0.16030657649223984, 3.123703299144977], [38.884722093766115, 0.2531769399368566, 3.8989854263339536], [48.71958704726865, 0.13014871591663366, 2.550033369560523], [56.03150526432305, 0.10635289617064839, 4.234271214539983]], "peak_params_": [[16.442297627282755, 0.25861427993099245, 0.5682439920252907], [19.37269262069226, 0.3128413848959281, 4.039113619516689], [29.07166916872011, 0.1704484319050058, 6.247406598289954], [38.884722093766115, 0.2542164420467314, 7.797970852667907], [48.71958704726865, 0.1648995272314543, 5.100066739121046], [56.03150526432305, 0.10857673042959193, 8.468542429079966]], "r_squared_": 0.5614800663381941, "error_": 0.052101014043145016}
{"freq_range": [2.0, 80.0], "freq_res": 1.0, "aperiodic_params_": [-0.2134267992531621, 0.481545427790384], "gaussian_params_": [[9.599610574846844, 0.6826279336889082, 0.2632858146279101], [16.032547180860437, 0.139560536124447, 0.25000019017743175], [17.732874623794665, 0.12446002589815909, 1.5713728889910292], [27.18718518086637, 0.17483371647455168, 1.26039491905033], [36.511515266572225, 0.10295163935334013, 4.740127440604547], [50.54796540086405, 0.12666170389350975, 5.999999999999999], [71.83753593676461, 0.16618355243207283, 0.9313280167678284]], "peak_params_": [[9.599610574846844, 0.21478279421222146, 0.5265716292558202], [16.032547180860437, 0.20614851997036732, 0.5000003803548635], [17.732874623794665, 0.12272488808112547, 3.1427457779820585], [27.18718518086637, 0.18672362959944833, 2.52078983810066], [36.511515266572225, 0.11230360747414536, 9.480254881209094], [50.54796540086405, 0.1272664050517205, 11.999999999999998], [71.83753593676461, 0.1638864127780144, 1.8626560335356568]], "r_squared_": 0.8918782470931012, "error_": 0.046613874783955955}
{"freq_range": [2.0, 80.0], "freq_res": 1.0, "aperiodic_params_": [-0.2947123170072173, 0.26076636950851706], "gaussian_params_": [[9.62082832402074, 0.41113469136181613, 0.25261728664135025], [16.050162078754802, 0.1441976445765614, 0.2502561042245373], [17.144933923029807, 0.2689326701491635, 1.633679064163923], [27.227745354099852, 0.20096425311567326, 1.256025440083281], [32.26399362122592, 0.2568365285663424, 1.3028710934761754], [36.46645521128415, 0.6120702442432651, 0.28787417798111026], [39.331848180048475, 0.21417889379677127, 0.8041887763453506], [42.792680220252436, 0.143241615256316, 1.18750422657018], [47.978955276391005, 0.1133210008377115, 1.8167611168928623], [51.990136513703874, 0.13424615888378855, 1.02270726255637], [60.88568148066327, 0.07946032771462846, 5.44541074818083], [68.21261301694526, 0.15216586136688545, 0.25031377315776027]], "peak_params_": [[9.62082832402074, 0.13330008786567626, 0.5052345732827005], [16.050162078754802, 0.35170205441096664, 0.5005122084490746], [17.144933923029807, 0.2679837800308953, 3.267358128327846], [27.227745354099852, 0.197760907159859, 2.512050880166562], [32.26399362122592, 0.2517652616651151, 2.6057421869523507], [36.46645521128415, 0.16894503376534786, 0.5757483559622205], [39.331848180048475, 0.1975971737848765, 1.6083775526907012], [42.792680220252436, 0.14409351753774202, 2.37500845314036], [47.978955276391005, 0.11822247070364744, 3.6335222337857247], [51.990136513703874, 0.16501230675011624, 2.04541452511274], [60.88568148066327, 0.0794428193985256, 10.89082149636166], [68.21261301694526, 0.13993097448390146, 0.5006275463155205]], "r_squared_": 0.7290705306158594, "error_": 0.04353885748713941}
{"freq_range": [2.0, 80.0], "freq_res": 1.0, "aperiodic_params_": [-0.02172424789856027, 0.4350515031811958], "gaussian_params_": [[15.71795363959509, 0.2253494514104928, 1.2913554173223993], [25.32386598159456, 0.14609254572318225, 0.89743714962843], [27.525432885882232, 1.010734364125711, 0.2843451220281747], [29.92784344245899, 0.22792932580824696, 0.9864032619906657], [35.06781934517821, 0.14754497172082132, 1.2992590128903745], [39.73357449029988, 0.17755364138695734, 1.0329202141469853], [45.11145047936001, 0.11110079524187405, 1.3471197615168842], [54.54704588570867, 0.08448206880389744, 5.999999999999999]], "peak_params_": [[15.71795363959509, 0.2200380773672055, 2.5827108346447987], [25.32386598159456, 0.13688391747175888, 1.79487429925686], [27.525432885882232, 0.2865309522010516, 0.5686902440563494], [29.92784344245899, 0.2274134039058936, 1.9728065239813315], [35.06781934517821, 0.14776825896261647, 2.598518025780749], [39.73357449029988, 0.17640724329146096, 2.0658404282939706], [45.11145047936001, 0.13454390846576492, 2.6942395230337683], [54.54704588570867, 0.08424167579316899, 11.999999999999998]], "r_squared_": 0.8993692984186165, "error_": 0.03916997715170487}
{"freq_range": [2.0, 80.0], "freq_res": 1.0, "aperiodic_params_": [0.19523915170286138, 0.7233732534150579], "gaussian_params_": [[9.576767833793383, 0.9053885282125577, 0.25000000000000006], [16.08203661647684, 0.21664179775676112, 0.6185138102648173], [27.803553951550892, 0.31847791530403396, 1.8806788650537745], [39.294939103466014, 0.17802813233877898, 0.45301278249874133], [48.276654074348855, 0.11389831111824822, 5.999999999999999]], "peak_params_": [[9.576767833793383, 0.21601771823481314, 0.5000000000000001], [16.08203661647684, 0.21474462650626985, 1.2370276205296347], [27.803553951550892, 0.3171224074877267, 3.761357730107549], [39.294939103466014, 0.1784967202008858, 0.9060255649974827], [48.276654074348855, 0.11377729920773039, 11.999999999999998]], "r_squared_": 0.9502047531187419, "error_": 0.04781379316471746}
{"freq_range": [2.0, 80.0], "freq_res": 1.0, "aperiodic_params_": [0.230069641082775, 0.7816892831125096], "gaussian_params_": [[4.453417975650265, 0.0979342510978648, 2.441674979274733], [9.61445576336608, 0.7254612045123795, 0.2503370863917109], [16.115441889178324, 0.24107115437327145, 0.5859304350024925], [27.76269060219467, 0.33216075038748505, 1.651635945149771], [35.585227801977794, 0.19340311220223885, 0.7244311208911359], [38.777208384067876, 0.14925724843490978, 0.9573918034992439], [43.8587391956532, 0.123192690554935, 1.6105509700971432], [50.07155385170049, 0.06533983858634149, 0.2513354572451382], [52.14931848975778, 0.13740105837612807, 2.983498478754129], [61.493562232462835, 0.9153255925576692, 0.26576389337668166]], "peak_params_": [[4.453417975650265, 0.09626012693795971, 4.883349958549466], [9.61445576336608, 0.22901511248691298, 0.5006741727834217], [16.115441889178324, 0.23643866630193183, 1.171860870004985], [27.76269060219467, 0.32874976360945163, 3.303271890299542], [35.585227801977794, 0.1663888075167692, 1.4488622417822719], [38.777208384067876, 0.1465823846238533, 1.9147836069984878], [43.8587391956532, 0.12601495875342117, 3.2211019401942864], [50.07155385170049, 0.16882799245095614, 0.5026709144902765], [52.14931848975778, 0.13722943229194895, 5.966996957508258], [61.493562232462835, 0.16485535900454162, 0.5315277867533633]], "r_squared_": 0.9712316092568011, "error_": 0.03823854816246006}
{"freq_range": [2.0, 80.0], "freq_res": 1.0, "aperiodic_params_": [0.15024412348351276, 0.7198131057782173], "gaussian_params_": [[6.523243909878198, 0.9602930080971543, 0.2615223844164972], [9.626056772889436, 0.7104476114248257, 0.25000027282318643], [16.02122506936359, 0.23485863869860263, 0.5880848938925055], [19.19645303704879, 0.2203113499396654, 1.5460895110785187], [27.931226675032505, 0.29055773940978497, 1.747936195219814], [50.45203459913595, 0.12936297568605906, 5.999999999999999]], "peak_params_": [[6.523243909878198, 0.18228447099744166, 0.5230447688329944], [9.626056772889436, 0.23211417275626978, 0.5000005456463729], [16.02122506936359, 0.26070010276117245, 1.176169787785011], [19.19645303704879, 0.21854139652554927, 3.0921790221570373], [27.931226675032505, 0.2904507556109792, 3.495872390439628], [50.45203459913595, 0.12899636532115322, 11.999999999999998]], "r_squared_": 0.9504646125537097, "error_": 0.04842552579382728}
{"freq_range": [2.0, 80.0], "freq_res": 1.0, "aperiodic_params_": [-0.11227553881030805, 0.45312730458150446], "gaussian_params_": [[6.514614918547911, 0.5871640292828499, 0.28745268326929646], [9.9129580659877, 0.21630543631227925, 0.2500000013067964], [15.906991503511012, 0.2301617159573865, 0.6685240639039898], [19.267530718475953, 0.2761820672948507, 1.3664839888650748], [27.384078323122825, 0.2086114668789342, 1.4628298506432889], [30.437384025991157, 0.4946737283589692, 0.29499330027672244], [37.58789229126054, 0.1868580926935217, 2.2854727856331807], [42.38429334809926, 0.1954610457673422, 0.6836811352065713], [44.51964307068999, 0.1948426657578751, 0.6989728830719826], [50.70304680702265, 0.16052920513252494, 2.618878777463798], [53.3759601660034, 0.2519448836194654, 0.28300486096313004], [57.31106174333203, 0.21094562687638532, 0.550822675320736], [61.52741052840025, 0.13449022673445676, 2.058808579249513]], "peak_params_": [[6.514614918547911, 0.14112745374915603, 0.5749053665385929], [9.9129580659877, 0.20358448540224644, 0.5000000026135928], [15.906991503511012, 0.24377885431980206, 1.3370481278079795], [19.267530718475953, 0.2709446328921212, 2.7329679777301497], [27.384078323122825, 0.20154757602858608, 2.9256597012865777], [30.437384025991157, 0.20771417886878774, 0.5899866005534449], [37.58789229126054, 0.1838461559833029, 4.570945571266361], [42.38429334809926, 0.19682363018580873, 1.3673622704131425], [44.51964307068999, 0.16995175142940533, 1.3979457661439652], [50.70304680702265, 0.1595008286468923, 5.237757554927596], [53.3759601660034, 0.21354975437552115, 0.5660097219262601], [57.31106174333203, 0.20075370070984122, 1.101645350641472], [61.52741052840025, 0.1310079035896281, 4.117617158499026]], "r_squared_": 0.917171843695018, "error_": 0.0353425609028994}
{"freq_range": [2.0, 80.0], "freq_res": 1.0, "aperiodic_params_": [-0.3864794023205432, 0.20351067465259834], "gaussian_params_": [[17.856920801217903, 0.31458554876626166, 2.104828465394793], [34.616612040520884, 0.16140270554412095, 5.175046470226374], [38.11742762399388, 0.18340442236876484, 0.25063143859260734], [43.77514500492101, 0.10964687798729862, 1.2138412343655867], [52.54796540086124, 0.16551262423182803, 5.999999999999996]], "peak_params_": [[17.856920801217903, 0.31479097128088923, 4.209656930789586], [34.616612040520884, 0.16325881984429114, 10.350092940452749], [38.11742762399388, 0.30344002053202246, 0.5012628771852147], [43.77514500492101, 0.19896283955762217, 2.4276824687311733], [52.54796540086124, 0.16533715919910752, 11.999999999999991]], "r_squared_": 0.5710245444215234, "error_": 0.06051367226409376}
{"freq_range": [2.0, 80.0], "freq_res": 1.0, "aperiodic_params_": [-0.52296836798772, 0.24702858688096838], "gaussian_params_": [[6.516200199599282, 0.9761350111406402, 0.2771520378302002], [9.60577441044401, 0.7339313114102048, 0.2500071766053608], [18.10104292064692, 0.21395080943258651, 1.9248040197848786], [27.733754464187815, 0.11824222466697672, 4.124461918414722], [35.559236144441286, 0.4458721605882315, 0.2880384505760024], [42.106275540459634, 0.1775987309740605, 3.599381472565029], [51.625036917549735, 0.1823699031711448, 1.7734263611869456], [72.47399879426256, 0.6787504630082459, 0.28425969565694725]], "peak_params_": [[6.516200199599282, 0.2127298226707246, 0.5543040756604004], [9.60577441044401, 0.21174320162215687, 0.5000143532107216], [18.10104292064692, 0.22095655881689524, 3.849608039569757], [27.733754464187815, 0.11807858456608367, 8.248923836829444], [35.559236144441286, 0.19626159973985857, 0.5760769011520048], [42.106275540459634, 0.17781978897457917, 7.198762945130058], [51.625036917549735, 0.182401142522437, 3.5468527223738913], [72.47399879426256, 0.1690171770284552, 0.5685193913138945]], "r_squared_": 0.6134280876224327, "error_": 0.0601036675391592}
{"freq_range": [2.0, 80.0], "freq_res": 1.0, "aperiodic_params_": [-0.31689563708553403, 0.21798829359766364], "gaussian_params_": [[9.733951010805168, 0.26830200311633473, 0.2537781184341748], [17.040524581542165, 0.17893979072433705, 1.8064318623601345], [39.52327694913229, 0.11912355659865778, 4.885004942907313], [54.32771994378505, 0.1274467785788305, 2.532169858168682], [57.31789041746768, 0.19571224353914682, 0.2590658667954011], [62.13257924966965, 0.11564629799410266, 1.1497667068436108], [71.01307725089762, 0.09121449196105345, 3.4765910797401767]], "peak_params_": [[9.733951010805168, 0.1549608260793266, 0.5075562368683496], [17.040524581542165, 0.17889765210223613, 3.612863724720269], [39.52327694913229, 0.1185576751959696, 9.770009885814625], [54.32771994378505, 0.1278599190971782, 5.064339716337364], [57.31789041746768, 0.16544342624196928, 0.5181317335908022], [62.13257924966965, 0.11934334359284504, 2.2995334136872216], [71.01307725089762, 0.0912138468305509, 6.953182159480353]], "r_squared_": 0.45734564836720865, "error_": 0.059043911572732796}
{"freq_range": [2.0, 80.0], "freq_res": 1.0, "aperiodic_params_": [-0.1403300523362609, 0.4451091496390298], "gaussian_params_": [[9.617642298210566, 0.4564354267191178, 0.27077059622700145], [16.14258866485501, 0.17271844500375055, 0.26757269344083373], [17.677443883505, 0.00010024817420738998, 0.4893309606751533], [18.05074357900782, 0.17932429034006664, 2.0016298791816496], [27.18536794558606, 0.20206012135767096, 1.13848039656377], [36.50975411671596, 0.40901622985964764, 0.3009458307310852], [39.4826868094598, 0.22977296409993253, 0.9390267158685898], [42.72821647974544, 0.11995866123886695, 1.1040371127816346], [61.61910481983779, 0.24837746700805793, 0.31087838151899044], [71.2055357641526, 0.08367440570285954, 1.1884284448777145]], "peak_params_": [[9.617642298210566, 0.16846830327019457, 0.5415411924540029], [16.14258866485501, 0.2559534841661066, 0.5351453868816675], [17.677443883505, 0.1793473475231947, 0.9786619213503066], [18.05074357900782, 0.1793473475231947, 4.003259758363299], [27.18536794558606, 0.1994076187760162, 2.27696079312754], [36.50975411671596, 0.11548986012415718, 0.6018916614621704], [39.4826868094598, 0.20173744444577613, 1.8780534317371795], [42.72821647974544, 0.11658475534403023, 2.2080742255632693], [61.61910481983779, 0.11725658599336886, 0.6217567630379809], [71.2055357641526, 0.08243233051290977, 2.376856889755429]], "r_squared_": 0.9053011779577245, "error_": 0.03825345240553466}
{"freq_range": [2.0, 80.0], "freq_res": 1.0, "aperiodic_params_": [-0.004492767954891092, 0.5199532822601044], "gaussian_params_": [[9.598538809693148, 0.5848658058371762, 0.2646406551962155], [16.265067726463908, 0.397890940252009, 0.2675917530125642], [17.55762017594027, 0.43929943577900205, 0.3082610953666636], [28.001390104096135, 0.24520226382402274, 1.6116305768128147], [39.25755794703578, 0.20581857517207738, 0.6906296820525734], [43.76804098578685, 0.10316186016229893, 1.3961206582842742], [51.24602403200391, 0.12315530248465938, 2.279656955352493], [70.00884311779232, 0.1267610859479649, 0.2500001397642892]], "peak_params_": [[9.598538809693148, 0.18506930625355356, 0.529281310392431], [16.265067726463908, 0.24361058611654396, 0.5351835060251284], [17.55762017594027, 0.15687537256330164, 0.6165221907333271], [28.001390104096135, 0.24520217261074795, 3.2232611536256295], [39.25755794703578, 0.1922950383991059, 1.3812593641051467], [43.76804098578685, 0.10253585309496782, 2.7922413165685485], [51.24602403200391, 0.12244034232018397, 4.559313910704986], [70.00884311779232, 0.12668180835947918, 0.5000002795285784]], "r_squared_": 0.9315963670080794, "error_": 0.0363778983403786}
{"freq_range": [2.0, 80.0], "freq_res": 1.0, "aperiodic_params_": [0.2090031431159927, 0.7504254668962286], "gaussian_params_": [[9.600198143049507, 0.8584957455134371, 0.26121124796918], [16.158320182853636, 0.26467041880585324, 0.5822985302751338], [17.83022284021534, 0.18519438234963165, 0.2500194496492952], [27.814879584928967, 0.32895769107462564, 1.7892905828264387], [39.20116685394789, 0.17763987667077605, 0.7497222923450143], [43.86436624358263, 0.11229521371341523, 1.5943772094599322], [50.316026038146326, 0.2313215294214216, 0.2500107156020647], [52.03856073508025, 0.13865993995595455, 2.140702129325971], [61.51653514193941, 0.48158112513885193, 0.29540258364255023]], "peak_params_": [[9.600198143049507, 0.26609699499591716, 0.52242249593836], [16.158320182853636, 0.25506635170746805, 1.1645970605502676], [17.83022284021534, 0.14884164166842218, 0.5000388992985904], [27.814879584928967, 0.3272018092978519, 3.5785811656528774], [39.20116685394789, 0.17242815157200342, 1.4994445846900286], [43.86436624358263, 0.11200983886390359, 3.1887544189198644], [50.316026038146326, 0.19223225834639213, 0.5000214312041295], [52.03856073508025, 0.13863769523184644, 4.281404258651942], [61.51653514193941, 0.1261935623400694, 0.5908051672851005]], "r_squared_": 0.9735931302402759, "error_": 0.03421857089196546}
{"freq_range": [2.0, 80.0], "freq_res": 1.0, "aperiodic_params_": [0.26180762986863854, 0.8105705512107536], "gaussian_params_": [[9.588696359063348, 1.0284339953954007, 0.2699060923170767], [15.642716825463383, 0.39932848681896277, 0.27340551018248666], [18.146634976279366, 0.15400125104389273, 2.01121045210888], [27.72827443175564, 0.2917824996439187, 1.658933317346025], [39.09021969594022, 0.10522547740496578, 4.059809118441543], [50.442480139142056, 0.3238930593385014, 0.2846220731611359], [54.27439662590321, 0.11270539895088799, 5.999999997227597]], "peak_params_": [[9.588696359063348, 0.32208744353610325, 0.5398121846341534], [15.642716825463383, 0.25714975318949496, 0.5468110203649733], [18.146634976279366, 0.15359263907937026, 4.02242090421776], [27.72827443175564, 0.29042503557703014, 3.31786663469205], [39.09021969594022, 0.1096118137442571, 8.119618236883086], [50.442480139142056, 0.1870265898745973, 0.5692441463222718], [54.27439662590321, 0.11271157885496064, 11.999999994455194]], "r_squared_": 0.9680400997007738, "error_": 0.041970037475560634}
{"freq_range": [2.0, 80.0], "freq_res": 1.0, "aperiodic_params_": [0.23372021839472287, 0.7920992917896976], "gaussian_params_": [[9.614972494465704, 1.0084290357974193, 0.2500096512093199], [18.223571620951724, 0.28231081001944996, 2.150084917371841], [27.297927957888785, 0.33048102406574453, 1.2718260675508306], [29.994270314033933, 0.20288645547027448, 0.7316251157795368], [36.86355399147403, 0.11970637141498043, 1.9177922201111464], [49.92548433541942, 0.12404574072828879, 5.999999999999999], [52.536353103311725, 0.4304726680716275, 0.2606422591961419]], "peak_params_": [[9.614972494465704, 0.3082407558606267, 0.5000193024186398], [18.223571620951724, 0.2807887876100365, 4.300169834743682], [27.297927957888785, 0.3217357151050988, 2.543652135101661], [29.994270314033933, 0.23817179629800966, 1.4632502315590736], [36.86355399147403, 0.13158943550118762, 3.8355844402222927], [49.92548433541942, 0.12403617479340312, 11.999999999999998], [52.536353103311725, 0.19725776567764108, 0.5212845183922838]], "r_squared_": 0.9701265090908824, "error_": 0.04021117836662864}
{"freq_range": [2.0, 80.0], "freq_res": 1.0, "aperiodic_params_": [0.22044009755375962, 0.7490973755025202], "gaussian_params_": [[9.596167297174134, 0.8355172984823735, 0.2577137202646538], [15.98734934980902, 0.17134726546063486, 0.2500198531081167], [18.862680955072147, 0.30623315635356696, 1.8652892952961428], [28.204734987692863, 0.3259914084820186, 2.0167224634339895], [37.12261033209485, 0.1341763740070587, 2.708065979772029], [44.52652391785181, 0.16063772904665266, 1.6178395991824452], [49.75212197679038, 0.12749791156851456, 1.4123776810423763], [52.61173953756634, 0.1764610478872417, 0.7300182004130543]], "peak_params_": [[9.596167297174134, 0.24477778050907018, 0.5154274405293076], [15.98734934980902, 0.2654465376109054, 0.5000397062162334], [18.862680955072147, 0.305414208852363, 3.7305785905922857], [28.204734987692863, 0.32477854641048143, 4.033444926867979], [37.12261033209485, 0.13406628749485983, 5.416131959544058], [44.52652391785181, 0.15629867726396474, 3.2356791983648905], [49.75212197679038, 0.12636956123212262, 2.8247553620847525], [52.61173953756634, 0.1622502058127282, 1.4600364008261086]], "r_squared_": 0.9666410750813597, "error_": 0.039559529171773654}
{"freq_range": [2.0, 80.0], "freq_res": 1.0, "aperiodic_params_": [-0.06839429535353116, 0.5321785980481494], "gaussian_params_": [[6.536576644705623, 0.8307456408472695, 0.25703121050790656], [16.11683283225773, 0.21193223247814408, 0.6240560830378595], [19.06764881866722, 0.22065669244299724, 1.003119936758213], [27.164410489760822, 0.23753325837918546, 0.7551312215498145], [29.71403377894328, 0.21250550395624082, 0.6754845939729369], [37.90707932159224, 0.20406604385743798, 0.6084112047075773], [45.238718847619324, 0.17673192667932985, 1.2927311523080396], [51.047205645943876, 0.18320262274773402, 1.0737606874450332]], "peak_params_": [[6.536576644705623, 0.1635218528934293, 0.5140624210158131], [16.11683283225773, 0.2103061809441118, 1.248112166075719], [19.06764881866722, 0.22016040750238675, 2.006239873516426], [27.164410489760822, 0.23203580204002783, 1.510262443099629], [29.71403377894328, 0.1944966430616003, 1.3509691879458738], [37.90707932159224, 0.20169992815684545, 1.2168224094151545], [45.238718847619324, 0.17374419610391822, 2.585462304616079], [51.047205645943876, 0.18303426401027234, 2.1475213748900663]], "r_squared_": 0.8736668885470791, "error_": 0.05227767681454732}
{"freq_range": [2.0, 80.0], "freq_res": 1.0, "aperiodic_params_": [-0.026841773265942562, 0.6569018141535764], "gaussian_params_": [[9.921078223595691, 0.15234401936117534, 0.2500014236103888], [18.85834347886337, 0.1576397740332197, 1.7120091417796164], [27.4059439247023, 0.12411938251202692, 2.3591773106876803], [44.524223694387, 0.1149726064431566, 5.9999870832093825], [50.4203945881666, 0.49614767859554637, 0.2501106105639483], [61.13322127477162, 0.14294073779068667, 1.1900717395637745], [64.64855682170901, 0.38403497468525866, 0.2855392883514338]], "peak_params_": [[9.921078223595691, 0.14493920283615458, 0.5000028472207776], [18.85834347886337, 0.15733187052434194, 3.4240182835592328], [27.4059439247023, 0.12391251747048715, 4.718354621375361], [44.524223694387, 0.11461170647017638, 11.999974166418765], [50.4203945881666, 0.19662746571744827, 0.5002212211278966], [61.13322127477162, 0.14469781172374918, 2.380143479127549], [64.64855682170901, 0.1811296087629024, 0.5710785767028675]], "r_squared_": 0.8873335091019222, "error_": 0.05820616237185528}
{"freq_range": [2.0, 80.0], "freq_res": 1.0, "aperiodic_params_": [-0.6175488514216871, -0.1304401594736585], "gaussian_params_": [[10.340983834473505, 0.4760336091453552, 0.25000214498238443], [19.875646273814194, 0.3155142569347367, 3.3614852808312023], [34.870277224556204, 0.1400802188322762, 1.522487250369832], [39.50035461848874, 0.7618694938563721, 0.2819955446293325], [45.58326395960796, 0.1444075494263273, 5.999999999999999]], "peak_params_": [[10.340983834473505, 0.1920087298793407, 0.5000042899647689], [19.875646273814194, 0.3153147171514625, 6.722970561662405], [34.870277224556204, 0.17006342831233015, 3.044974500739664], [39.50035461848874, 0.25269626196760303, 0.563991089258665], [45.58326395960796, 0.14405964828422796, 11.999999999999998]], "r_squared_": 0.4249449500778307, "error_": 0.06416473490506203}
{"freq_range": [2.0, 80.0], "freq_res": 1.0, "aperiodic_params_": [-0.2603642955931452, 0.3120941439194547], "gaussian_params_": [[9.955909178663942, 0.24202483156930601, 0.5274815843801439], [18.882254443597436, 0.2411412845920483, 2.334508373202336], [39.902140635812515, 0.19802642477250557, 2.555487547811727], [50.28475870337767, 0.28255582657066114, 0.250647505021874], [58.419659659415075, 0.11317720063021226, 3.8850884498095364], [66.02343510738683, 0.13713652298120735, 0.2500716872359933], [74.54796464098685, 0.1087528769294287, 5.084850996141992]], "peak_params_": [[9.955909178663942, 0.24135411003356166, 1.0549631687602878], [18.882254443597436, 0.24083476122666025, 4.669016746404672], [39.902140635812515, 0.19788277169216573, 5.110975095623454], [50.28475870337767, 0.15908744226058735, 0.501295010043748], [58.419659659415075, 0.11306417972876026, 7.770176899619073], [66.02343510738683, 0.1798768380706114, 0.5001433744719866], [74.54796464098685, 0.10833654665103598, 10.169701992283985]], "r_squared_": 0.7183765593857184, "error_": 0.049994347193662705}
{"freq_range": [2.0, 80.0], "freq_res": 1.0, "aperiodic_params_": [-0.0862141608921136, 0.5055084005746907], "gaussian_params_": [[9.860923150808624, 0.3492492322880335, 0.5860378416784897], [16.316507406922998, 0.3715920282698047, 0.48874495813322555], [17.680058418418046, 0.41069152635294337, 0.2683233950028959], [20.200681397803454, 0.2605940519056268, 1.5776310683061034], [39.082562505543656, 0.20058472951626158, 0.9446583950941169], [42.82015609246084, 0.09344233081481115, 1.413677342491533], [50.44336979885836, 0.734304454329779, 0.27669414230612516], [52.84910649017115, 0.14204891660596433, 0.6464108249665509], [70.34568152442223, 0.3263861266656717, 0.2500088531480351]], "peak_params_": [[9.860923150808624, 0.3395516524521456, 1.1720756833569794], [16.316507406922998, 0.30882476945003484, 0.9774899162664511], [17.680058418418046, 0.301222257444693, 0.5366467900057919], [20.200681397803454, 0.2584942312666189, 3.155262136612207], [39.082562505543656, 0.20224593367184762, 1.8893167901882337], [42.82015609246084, 0.09272622080134219, 2.827354684983066], [50.44336979885836, 0.20339554481680044, 0.5533882846122503], [52.84910649017115, 0.1382309777463746, 1.2928216499331018], [70.34568152442223, 0.1254846060806315, 0.5000177062960702]], "r_squared_": 0.9283125413737379, "error_": 0.04235745133241197}
{"freq_range": [2.0, 80.0], "freq_res": 1.0, "aperiodic_params_": [0.02987261503982024, 0.6585334888196881], "gaussian_params_": [[9.874392379228516, 0.4881077677069279, 0.542691492633318], [16.08177866759325, 0.284854539155046, 0.7313725707321245], [18.013402830973018, 0.22866221563170055, 0.250240609388343], [20.363533622662658, 0.29582195413388274, 0.37220639711029063], [35.9833705146299, 0.09359865706296165, 0.250015417992626], [39.68065372973957, 0.10225721815289766, 5.999999999999999], [51.78753430445566, 0.13766843975525564, 2.536280368342075]], "peak_params_": [[9.874392379228516, 0.47520771174708887, 1.085382985266636], [16.08177866759325, 0.2831217547196225, 1.462745141464249], [18.013402830973018, 0.23762261233682214, 0.500481218776686], [20.363533622662658, 0.1840766631103209, 0.7444127942205813], [35.9833705146299, 0.17811048336370472, 0.500030835985252], [39.68065372973957, 0.10211529032595679, 11.999999999999998], [51.78753430445566, 0.14961019316166946, 5.07256073668415]], "r_squared_": 0.9507145392269538, "error_": 0.04308506155446856}
{"freq_range": [2.0, 80.0], "freq_res": 1.0, "aperiodic_params_": [0.04183992296968756, 0.6866810500763421], "gaussian_params_": [[9.865627005427589, 0.5579824515948432, 0.5308984291793031], [16.690419114633762, 0.23848383593821856, 1.8388448837524112], [20.51751985663912, 0.13137635985336316, 0.8062479140262789], [35.92700170745635, 0.20515721011199353, 0.5861951885863671], [38.70529226995931, 0.15895837301264806, 0.7548906423286103], [49.77626891146692, 0.12240796246980937, 5.999999999999999], [51.52283720295868, 0.09151871699658139, 1.1179973544770292]], "peak_params_": [[9.865627005427589, 0.5407112486354315, 1.0617968583586062], [16.690419114633762, 0.23513761023254975, 3.6776897675048223], [20.51751985663912, 0.12514160070876468, 1.6124958280525579], [35.92700170745635, 0.2126021306820356, 1.1723903771727342], [38.70529226995931, 0.17169244213126977, 1.5097812846572205], [49.77626891146692, 0.15851602689592836, 11.999999999999998], [51.52283720295868, 0.19783470027641137, 2.2359947089540584]], "r_squared_": 0.9567271869914371, "error_": 0.04319475090098483}
{"freq_range": [2.0, 80.0], "freq_res": 1.0, "aperiodic_params_": [0.19596883733864595, 0.7656175190032101], "gaussian_params_": [[9.94453873760463, 0.424413385488941, 0.5232138434258049], [18.44633528440453, 0.38922590757176895, 2.335616090493158], [28.394681527232947, 0.1585121789916359, 1.7018609770930828], [41.45203459913595, 0.06255144798177083, 4.657738470164692], [52.54796540086404, 0.09810827120431737, 5.999999785623462]], "peak_params_": [[9.94453873760463, 0.42259852475035264, 1.0464276868516098], [18.44633528440453, 0.3821835223020795, 4.671232180986316], [28.394681527232947, 0.15538567097984157, 3.4037219541861656], [41.45203459913595, 0.07765054535740445, 9.315476940329384], [52.54796540086404, 0.10072385129993866, 11.999999571246924]], "r_squared_": 0.9665704627905539, "error_": 0.04530695958423328}
{"freq_range": [2.0, 80.0], "freq_res": 1.0, "aperiodic_params_": [0.17990450939010946, 0.7661248685086104], "gaussian_params_": [[9.682204676468015, 0.8320989232936807, 0.2501165997237898], [16.021538070070836, 0.1959565720478509, 0.2500217254273638], [18.891968050049563, 0.4982148066610215, 2.192244645101566], [27.07701257431959, 0.2017047390960635, 1.1705535514875163], [30.051687350533737, 0.19981917371797955, 0.9019634766192687], [47.55028786647392, 0.11025691223794166, 5.999999999999999], [52.50223565265416, 0.523614706151846, 0.26640338389458296]], "peak_params_": [[9.682204676468015, 0.3713379739157723, 0.5002331994475796], [16.021538070070836, 0.40393384239694274, 0.5000434508547276], [18.891968050049563, 0.4976115684960938, 4.384489290203132], [27.07701257431959, 0.20276771025024698, 2.3411071029750326], [30.051687350533737, 0.2099488219932616, 1.8039269532385374], [47.55028786647392, 0.10994764583920191, 11.999999999999998], [52.50223565265416, 0.1643842404683694, 0.5328067677891659]], "r_squared_": 0.9713918781427187, "error_": 0.04043946188136683}
{"freq_range": [2.0, 80.0], "freq_res": 1.0, "aperiodic_params_": [-0.24478792771155106, 0.5297292886138305], "gaussian_params_": [[9.624131834580824, 0.83491423912751, 0.26310668151195893], [15.504329812068779, 0.1927901489588461, 1.122651777314533], [19.007097370809916, 0.35803211885887143, 1.2815863570519648], [28.91222960586352, 0.18331124694662645, 2.3958064575396905], [49.95513986307289, 0.28106662388350917, 0.5249543471513608]], "peak_params_": [[9.624131834580824, 0.3009417384457958, 0.5262133630239179], [15.504329812068779, 0.19771096321985349, 2.245303554629066], [19.007097370809916, 0.35957442363957093, 2.5631727141039296], [28.91222960586352, 0.18318827500234103, 4.791612915079381], [49.95513986307289, 0.280042235208424, 1.0499086943027216]], "r_squared_": 0.8901445509870454, "error_": 0.060902650709749796}
{"freq_range": [2.0, 80.0], "freq_res": 1.0, "aperiodic_params_": [-0.1987252314755144, 0.5359553463311485], "gaussian_params_": [[9.688237411969634, 0.37211043244435316, 0.25083342924594665], [16.382913088150154, 0.15254425011544287, 2.0647049572133307], [28.73205231255651, 0.11438086430636565, 1.1689269869152688], [36.547965355588715, 0.09395397077805767, 5.999901850609871], [46.46089477674957, 0.48791812341728574, 0.2923796128797115], [47.673370851649864, 0.3085182829452837, 0.26606546669641257], [51.4120577078953, 0.1515195443913508, 1.1680673455426716], [54.463374163228444, 0.579954083007199, 0.30570000697722977], [61.06898220974908, 0.16769193919477587, 0.9176730025524659], [69.11734065473804, 0.12827816412354703, 2.8018993163506183]], "peak_params_": [[9.688237411969634, 0.17316543588554512, 0.5016668584918933], [16.382913088150154, 0.15021008884591525, 4.129409914426661], [28.73205231255651, 0.15400006491865814, 2.3378539738305375], [36.547965355588715, 0.09368769960311119, 11.999803701219742], [46.46089477674957, 0.16801809020946612, 0.584759225759423], [47.673370851649864, 0.1625451193653471, 0.5321309333928251], [51.4120577078953, 0.14754364548991927, 2.336134691085343], [54.463374163228444, 0.19824087604533036, 0.6114000139544595], [61.06898220974908, 0.16917232002428373, 1.8353460051049317], [69.11734065473804, 0.12816576494740106, 5.603798632701237]], "r_squared_": 0.8490420363157771, "error_": 0.05128897665354513}
{"freq_range": [2.0, 80.0], "freq_res": 1.0, "aperiodic_params_": [-0.34173894428692053, 0.2361696516060955], "gaussian_params_": [[9.815861837026173, 0.2849000057620403, 0.3229373152295073], [11.699853956119282, 0.1810226501063762, 0.6432424920222108], [13.622678791776755, 0.23961451729438044, 0.630218836179181], [15.546786175473018, 0.9698499477856656, 0.2825772846386032], [20.957950566177995, 0.10254384071019011, 4.4849673808897945], [44.41510283762065, 0.5695343909827179, 0.26475520011514136], [46.24955926641048, 0.19772924266944386, 0.5054268654902003], [47.62089848667533, 0.5392740004435349, 0.2500016834115544], [50.47217538499208, 0.8676918018097141, 0.27294987765944295], [69.78919797013063, 0.22619835929365958, 0.250242751646631]], "peak_params_": [[9.815861837026173, 0.25284979978584926, 0.6458746304590146], [11.699853956119282, 0.18501088382250275, 1.2864849840444217], [13.622678791776755, 0.23138062741426108, 1.260437672358362], [15.546786175473018, 0.32384834592019607, 0.5651545692772064], [20.957950566177995, 0.10253933387405567, 8.969934761779589], [44.41510283762065, 0.1666281810271637, 0.5295104002302827], [46.24955926641048, 0.17503739138232743, 1.0108537309804007], [47.62089848667533, 0.1712918984879772, 0.5000033668231088], [50.47217538499208, 0.19433110590323077, 0.5458997553188859], [69.78919797013063, 0.1586343273077293, 0.500485503293262]], "r_squared_": 0.6525400248941425, "error_": 0.05712798872593636}
{"freq_range": [2.0, 80.0], "freq_res": 1.0, "aperiodic_params_": [-0.11332485739621331, 0.4328314712108287], "gaussian_params_": [[10.008522189717604, 0.27744392689291836, 0.5342155242922898], [15.596789401625964, 0.6544786641508759, 0.2732602235749548], [20.2676359999994, 0.291130568490154, 1.8192192614131086], [40.03144345067799, 0.08915797284673631, 5.999999999999999]], "peak_params_": [[10.008522189717604, 0.277408984792861, 1.0684310485845796], [15.596789401625964, 0.2389599223683858, 0.5465204471499095], [20.2676359999994, 0.28833577749122985, 3.6384385228262173], [40.03144345067799, 0.0891567485544641, 11.999999999999998]], "r_squared_": 0.8482572349106073, "error_": 0.05475554503127292}
{"freq_range": [2.0, 80.0], "freq_res": 1.0, "aperiodic_params_": [0.07797277684614021, 0.6141037576993275], "gaussian_params_": [[10.03010498765338, 0.47217841083610856, 0.6176994063399387], [16.03339214187502, 0.215753797333546, 0.2500002566000877], [19.86447228067437, 0.39149680697552386, 2.7137335873930017], [50.44866453627259, 0.698428943286891, 0.28781087695184765]], "peak_params_": [[10.03010498765338, 0.47214698952719997, 1.2353988126798774], [16.03339214187502, 0.3558664072309857, 0.5000005132001754], [19.86447228067437, 0.3910088862134039, 5.4274671747860035], [50.44866453627259, 0.20721763935941162, 0.5756217539036953]], "r_squared_": 0.9376554779150862, "error_": 0.05337126697369249}
{"freq_range": [2.0, 80.0], "freq_res": 1.0, "aperiodic_params_": [-0.01715934647723842, 0.6378526759620742], "gaussian_params_": [[9.968892838251945, 0.6668168239010901, 0.6134169909818926], [16.041478673978002, 0.3006526998398069, 0.7281202729047308], [18.032522881151678, 0.2641380426010482, 0.2500841797389195], [20.271880935700068, 0.23683033213113996, 0.2727365563121047], [20.979296548026806, 0.20027213692407142, 1.8777329095640012], [35.98706781124137, 0.12499070414169504, 0.2500010897667009], [39.41805931157509, 0.12024286148727974, 4.898912133320536], [51.73406303993337, 0.13692184644565902, 2.852511948764351]], "peak_params_": [[9.968892838251945, 0.6659599797853263, 1.2268339819637852], [16.041478673978002, 0.30611877446406266, 1.4562405458094616], [18.032522881151678, 0.3268746416538914, 0.500168359477839], [20.271880935700068, 0.318948711904528, 0.5454731126242094], [20.979296548026806, 0.20707348656725388, 3.7554658191280024], [35.98706781124137, 0.2190884671864931, 0.5000021795334018], [39.41805931157509, 0.11981226917991528, 9.797824266641072], [51.73406303993337, 0.1407713982180392, 5.705023897528702]], "r_squared_": 0.9441847783161753, "error_": 0.04865466140153013}
{"freq_range": [2.0, 80.0], "freq_res": 1.0, "aperiodic_params_": [0.0804839499438027, 0.7053252766102422], "gaussian_params_": [[10.03663405381495, 0.7477517619267153, 0.6362176194977092], [15.961881731532042, 0.11922942968236713, 0.2500012650025362], [18.836340260677378, 0.21878252467133363, 3.2563120074148038], [35.813251892296776, 0.16255729427642351, 0.2508611087268263], [38.197834699249285, 0.10669729893506874, 3.313737778262574], [51.18896998459734, 0.13542919347921392, 5.999999341720881]], "peak_params_": [[10.03663405381495, 0.7520214743666818, 1.2724352389954183], [15.961881731532042, 0.2675664673314936, 0.5000025300050724], [18.836340260677378, 0.21850645950691905, 6.5126240148296075], [35.813251892296776, 0.21434474733009523, 0.5017222174536526], [38.197834699249285, 0.11859868572590604, 6.627475556525148], [51.18896998459734, 0.13542329214896798, 11.999998683441762]], "r_squared_": 0.9473337748791929, "error_": 0.04881547454335233}
{"freq_range": [2.0, 80.0], "freq_res": 1.0, "aperiodic_params_": [-0.03876134429583406, 0.649616120317453], "gaussian_params_": [[10.002316643162967, 0.7900905339220146, 0.6230989006766433], [19.012089314385513, 0.482478945864248, 3.0397789068478516], [36.88861290921269, 0.14906107389265494, 1.7916926539388687], [49.84882535015402, 0.1250861837502501, 5.999999999999999]], "peak_params_": [[10.002316643162967, 0.7960396424075058, 1.2461978013532866], [19.012089314385513, 0.4824753577368764, 6.079557813695703], [36.88861290921269, 0.1614030458894361, 3.5833853078777373], [49.84882535015402, 0.12504648600306134, 11.999999999999998]], "r_squared_": 0.9487645046958573, "error_": 0.05172975146857003}
{"freq_range": [2.0, 80.0], "freq_res": 1.0, "aperiodic_params_": [0.08708566889127048, 0.7199859891770054], "gaussian_params_": [[10.025192631889125, 0.6346324018704519, 0.5045725777125487], [19.468459306018623, 0.5327116195021575, 3.2221029803227865], [48.68193238867174, 0.11536728798990503, 5.999999999999999]], "peak_params_": [[10.025192631889125, 0.6409433708822749, 1.0091451554250974], [19.468459306018623, 0.5271115854167221, 6.444205960645573], [48.68193238867174, 0.1152052995568067, 11.999999999999998]], "r_squared_": 0.958924307047324, "error_": 0.053402135835599954}
{"freq_range": [2.0, 80.0], "freq_res": 1.0, "aperiodic_params_": [-0.10996061797391213, 0.6703461279734388], "gaussian_params_": [[9.974072014475224, 0.5669015879494185, 0.473400710691248], [15.610285132550992, 0.5567640592275495, 0.27160503861441954], [18.69722777706077, 0.3175760137658811, 1.4091573879856725], [24.406211389500395, 0.1569988449921031, 5.999999999999999], [49.72647216513415, 0.1304103402692528, 5.999999999999999]], "peak_params_": [[9.974072014475224, 0.5748431746877192, 0.946801421382496], [15.610285132550992, 0.30857417439564205, 0.5432100772288391], [18.69722777706077, 0.4149467954108025, 2.818314775971345], [24.406211389500395, 0.15691995229335953, 11.999999999999998], [49.72647216513415, 0.13029246705838182, 11.999999999999998]], "r_squared_": 0.9480817112450077, "error_": 0.04856058628070822}
{"freq_range": [2.0, 80.0], "freq_res": 1.0, "aperiodic_params_": [-0.463840080217825, 0.4347356453675729], "gaussian_params_": [[9.607723922126464, 0.6616567147407127, 0.2502615513078699], [16.46971189962975, 0.24177281219934516, 2.085967894849161], [29.973935738300966, 0.12664955177010664, 2.0708409289975043], [44.54796540086405, 0.09362679079864522, 5.999999999999999], [50.73307541132559, 0.12944984061555415, 1.1751579199991318], [60.7097540156574, 0.16764938398912874, 0.6230357442262708]], "peak_params_": [[9.607723922126464, 0.19566339715997572, 0.5005231026157398], [16.46971189962975, 0.23572149042721802, 4.171935789698322], [29.973935738300966, 0.13159169302435436, 4.1416818579950085], [44.54796540086405, 0.0933623344670651, 11.999999999999998], [50.73307541132559, 0.17867037123400076, 2.3503158399982635], [60.7097540156574, 0.1525912443046813, 1.2460714884525417]], "r_squared_": 0.8353868624951635, "error_": 0.054097513924693544}
{"freq_range": [2.0, 80.0], "freq_res": 1.0, "aperiodic_params_": [-0.3468083114008337, 0.18393666177411522], "gaussian_params_": [[10.069962946910369, 0.14475470409712599, 0.46274217984855137], [15.603328609719874, 0.5273151647160074, 0.2502408807912204], [36.27375675509573, 0.13095368879013847, 5.131004536727868], [45.79736018344212, 0.150484988417598, 0.5463719855036839], [47.840010195462916, 0.20131703774931775, 0.25006445967403], [50.45434106040699, 0.8429879674095709, 0.25004023779590534], [57.36071135912143, 0.09067333495717833, 5.999999992687716]], "peak_params_": [[10.069962946910369, 0.14310991134865125, 0.9254843596971027], [15.603328609719874, 0.15017335035679114, 0.5004817615824408], [36.27375675509573, 0.13092785583082767, 10.262009073455737], [45.79736018344212, 0.17730267424465984, 1.0927439710073679], [47.840010195462916, 0.2005672179608452, 0.50012891934806], [50.45434106040699, 0.2081351230855088, 0.5000804755918107], [57.36071135912143, 0.09054711896646095, 11.999999985375432]], "r_squared_": 0.5168973741657175, "error_": 0.044767543534623484}
{"freq_range": [2.0, 80.0], "freq_res": 1.0, "aperiodic_params_": [-0.08936524833548289, 0.4664060780710175], "gaussian_params_": [[9.71087670467159, 0.4526094737592258, 0.5165803329450245], [15.57544386396091, 0.12063449484036376, 2.3485298451483665], [20.60001083788547, 0.20038198031793622, 1.3377167412949023], [33.45203459913595, 0.09372760289573433, 5.999999999999999], [40.92371982794558, 0.06056653656776264, 2.9840777496616284], [47.97640774826694, 0.14606375143157188, 0.25000003932952775], [50.44471295804052, 0.8888300216729151, 0.2600630939479545], [57.54791802286913, 0.08570390915025906, 5.484850516419327]], "peak_params_": [[9.71087670467159, 0.3942425847309748, 1.033160665890049], [15.57544386396091, 0.12058526997216057, 4.697059690296733], [20.60001083788547, 0.2108760273081569, 2.6754334825898045], [33.45203459913595, 0.09524890035160005, 11.999999999999998], [40.92371982794558, 0.10393489915112042, 5.968155499323257], [47.97640774826694, 0.17284820132931522, 0.5000000786590555], [50.44471295804052, 0.24192114525753372, 0.520126187895909], [57.54791802286913, 0.0854350148853148, 10.969701032838653]], "r_squared_": 0.8787262172585056, "error_": 0.052168036491473585}
{"freq_range": [2.0, 80.0], "freq_res": 1.0, "aperiodic_params_": [-0.03078101959984836, 0.5706852858336254], "gaussian_params_": [[9.925231530522806, 0.6991864309917556, 0.6299056301122997], [15.964038110901127, 0.148782893922674, 0.25001248003536225], [19.79308075984586, 0.34042802956793095, 3.0359891296519446], [27.461885115480737, 0.15574980566316043, 1.5227471646414188], [38.54796540084917, 0.10806924036054087, 5.999995592500969], [50.44605668783795, 0.7010114270270529, 0.28815272829890815]], "peak_params_": [[9.925231530522806, 0.6961529561470403, 1.2598112602245994], [15.964038110901127, 0.3033259696268759, 0.5000249600707245], [19.79308075984586, 0.34054824565032654, 6.071978259303889], [27.461885115480737, 0.18604467878153463, 3.0454943292828376], [38.54796540084917, 0.10776297597659723, 11.999991185001939], [50.44605668783795, 0.22901881937282742, 0.5763054565978163]], "r_squared_": 0.9293667280248278, "error_": 0.05374952077608574}
{"freq_range": [2.0, 80.0], "freq_res": 1.0, "aperiodic_params_": [0.021997992932535557, 0.6731047212118972], "gaussian_params_": [[9.998622497145837, 0.9830951299483643, 0.6299067209413917], [15.984887313992585, 0.11056099707919285, 0.2500001107434456], [20.967601942811047, 0.21844471693379083, 4.644429722365212], [37.958501589170815, 0.13066689286469016, 2.469772937824381], [50.84706873313358, 0.12146031194888288, 5.999928700131602]], "peak_params_": [[9.998622497145837, 0.9965336903044237, 1.2598134418827833], [15.984887313992585, 0.23364794724926374, 0.5000002214868912], [20.967601942811047, 0.21843991607845725, 9.288859444730424], [37.958501589170815, 0.14318150230605375, 4.939545875648762], [50.84706873313358, 0.12142097848302957, 11.999857400263204]], "r_squared_": 0.947790817719512, "error_": 0.054834002160009554}
{"freq_range": [2.0, 80.0], "freq_res": 1.0, "aperiodic_params_": [0.013708423030170953, 0.6811910297242822], "gaussian_params_": [[9.985465575172558, 1.021595082395508, 0.641953373293456], [16.437152776398392, 0.6690568596226434, 0.26123582141418933], [18.50465749944901, 1.2208577022121085, 0.26307124387955316], [20.491894798375007, 0.30278391902716395, 0.5969045870073539], [21.788042521988253, 0.2288935661456381, 5.61420624191797], [37.63784221366086, 0.13674550711129688, 1.8737467532465002], [50.71332088636995, 0.1388507352551624, 5.999999999999999]], "peak_params_": [[9.985465575172558, 1.0465858174089835, 1.283906746586912], [16.437152776398392, 0.29949814781710815, 0.5224716428283787], [18.50465749944901, 0.42305616083897735, 0.5261424877591063], [20.491894798375007, 0.4331842154872984, 1.1938091740147079], [21.788042521988253, 0.24117685474943362, 11.22841248383594], [37.63784221366086, 0.15246482650378046, 3.7474935064930004], [50.71332088636995, 0.13869263599360138, 11.999999999999998]], "r_squared_": 0.95810644335771, "error_": 0.048320823551730716}
{"freq_range": [2.0, 80.0], "freq_res": 1.0, "aperiodic_params_": [0.06157259244348224, 0.7195382616252908], "gaussian_params_": [[10.03990769092686, 0.9809472875970977, 0.6280814208603097], [16.063784564403125, 0.13456497755279828, 0.25000007832891585], [19.397895922321357, 0.40355159094193843, 2.192709726558372], [24.70378219065582, 0.19500140869027027, 1.3312836562416603], [29.207953162413443, 0.21357140493151275, 1.0928339846963675], [36.366642744404075, 0.5039195023841815, 0.25905472892981274], [48.54959396111046, 0.1314297894149006, 5.999999999999999]], "peak_params_": [[10.03990769092686, 0.9790105397688134, 1.2561628417206194], [16.063784564403125, 0.2517203360248855, 0.5000001566578317], [19.397895922321357, 0.396982591166757, 4.385419453116744], [24.70378219065582, 0.20585624413330705, 2.6625673124833207], [29.207953162413443, 0.21148597108353728, 2.185667969392735], [36.366642744404075, 0.1998418781767599, 0.5181094578596255], [48.54959396111046, 0.13105999696528237, 11.999999999999998]], "r_squared_": 0.9669500422120378, "error_": 0.04272774618221296}
{"freq_range": [2.0, 80.0], "freq_res": 1.0, "aperiodic_params_": [0.09133539988325104, 0.7470581982858141], "gaussian_params_": [[10.000878997903978, 0.8243430521288843, 0.5936404445889072], [19.20322106446681, 0.20611572549131982, 2.829004643781743], [25.539971541234213, 0.8676058183759472, 0.2502526782512031], [28.937169427100716, 0.22629246424777236, 1.0342100133073557], [41.54796540086405, 0.09550793319140809, 5.999999999999999], [50.413183882686326, 0.9288357761302082, 0.2504187581114214]], "peak_params_": [[10.000878997903978, 0.8253798262981534, 1.1872808891778144], [19.20322106446681, 0.2056665241964588, 5.658009287563486], [25.539971541234213, 0.1789922037034818, 0.5005053565024062], [28.937169427100716, 0.2371110718460826, 2.0684200266147115], [41.54796540086405, 0.09523726688945566, 11.999999999999998], [50.413183882686326, 0.27352026843078314, 0.5008375162228428]], "r_squared_": 0.958122367909026, "error_": 0.047254822033167165}
{"freq_range": [2.0, 80.0], "freq_res": 1.0, "aperiodic_params_": [-0.27415942035971325, 0.5979428655424149], "gaussian_params_": [[9.959204406798744, 0.510736082009262, 0.5994578469894326], [16.89663002264123, 0.15568996363915016, 0.8050125895601575], [25.661641578421623, 0.4420430658796911, 0.26050038384537344], [28.805408129738623, 0.22232104674152817, 0.8599937300778044], [34.0198362340351, 0.15281184568570688, 0.25000000035179754], [38.56287261454992, 0.39552194618128456, 0.2925275562953546], [50.01922369119313, 0.11847227064031772, 5.999999999999999], [55.006690740834344, 0.07204905840760951, 0.2500000097494977], [72.56471263531355, 0.5185335629575675, 0.2770797003095212]], "peak_params_": [[9.959204406798744, 0.5095547472191546, 1.1989156939788652], [16.89663002264123, 0.15441171762565364, 1.610025179120315], [25.661641578421623, 0.19128590456220507, 0.5210007676907469], [28.805408129738623, 0.21695826860827083, 1.7199874601556089], [34.0198362340351, 0.1556869934404903, 0.5000000007035951], [38.56287261454992, 0.1514438998218095, 0.5850551125907092], [50.01922369119313, 0.11847166256599606, 11.999999999999998], [55.006690740834344, 0.15596487815360227, 0.5000000194989954], [72.56471263531355, 0.15103680450506096, 0.5541594006190425]], "r_squared_": 0.9442288922675762, "error_": 0.04127746028362739}
{"freq_range": [2.0, 80.0], "freq_res": 1.0, "aperiodic_params_": [-0.4449964342622975, 0.08264543031476017], "gaussian_params_": [[2.4520345991359433, 0.22170087107863695, 1.572341566090682], [10.708487692416556, 0.16952261508121225, 1.1030179072075137], [30.892372708281425, 0.1828455162132929, 0.8056639204486958], [35.77814619081183, 0.18574919388800054, 1.6678378640801097], [42.272556955580455, 0.1475836006999457, 2.8700958238781107], [45.662060620363384, 0.3796762693847772, 0.2760228967302202], [48.00069193078074, 0.22839131811255575, 0.25000222435886893], [50.453406679755105, 0.7677179822230277, 0.3004739491415745], [52.63407673406658, 0.20277687788469728, 0.6194503970548412], [54.53274673196719, 0.6400128178022314, 0.3003933871944586], [57.20371076568025, 0.20573870056257698, 0.25008358827368654], [59.03169848231847, 0.14982943833792095, 0.6323130052577642], [61.66429758619505, 0.1936819506250426, 0.8833621369038215], [72.52294223439102, 0.46087217629303223, 0.3203259752088639], [77.66334870046735, 0.2626786500048038, 0.29398639627518264]], "peak_params_": [[2.4520345991359433, 0.2127256713334389, 3.144683132181364], [10.708487692416556, 0.16370455099332049, 2.2060358144150274], [30.892372708281425, 0.1843540554907952, 1.6113278408973917], [35.77814619081183, 0.19766083774695786, 3.3356757281602194], [42.272556955580455, 0.14709622396223287, 5.740191647756221], [45.662060620363384, 0.24294185106280725, 0.5520457934604404], [48.00069193078074, 0.24854174093188375, 0.5000044487177379], [50.453406679755105, 0.249858869649075, 0.600947898283149], [52.63407673406658, 0.1704496329543822, 1.2389007941096823], [54.53274673196719, 0.19104443457985093, 0.6007867743889173], [57.20371076568025, 0.14850888615922653, 0.5001671765473731], [59.03169848231847, 0.15169126337852346, 1.2646260105155285], [61.66429758619505, 0.18019153126550058, 1.766724273807643], [72.52294223439102, 0.15203803658532988, 0.6406519504177278], [77.66334870046735, 0.1363568426598747, 0.5879727925503653]], "r_squared_": 0.8126211147012715, "error_": 0.02687901007803163}
{"freq_range": [2.0, 80.0], "freq_res": 1.0, "aperiodic_params_": [-0.20192982741614668, 0.23029518735939766], "gaussian_params_": [[9.529440194654153, 0.7625653842659583, 0.30389730319004427], [37.78585909499394, 0.13469424397619628, 5.107076557191944], [45.929609447760114, 0.11641825957994036, 0.2501525699844905], [47.9961740339138, 0.19531546876406153, 0.25000000000110595], [50.414415593973615, 0.6786493464555869, 0.2779917364776539], [54.77455004609685, 0.11973020950046559, 3.0122305232270987], [61.47569783286192, 0.174094473743531, 0.863787035460906], [72.71947614777474, 0.1635472587415227, 0.7231165895478805]], "peak_params_": [[9.529440194654153, 0.22995659899657758, 0.6077946063800885], [37.78585909499394, 0.13457591212736225, 10.214153114383889], [45.929609447760114, 0.1505693283552108, 0.500305139968981], [47.9961740339138, 0.22306838667134676, 0.5000000000022119], [50.414415593973615, 0.26520046534289926, 0.5559834729553078], [54.77455004609685, 0.11985482949017157, 6.024461046454197], [61.47569783286192, 0.16375098142628697, 1.727574070921812], [72.71947614777474, 0.15169233407259608, 1.446233179095761]], "r_squared_": 0.7340367415069976, "error_": 0.040387616331096686}
{"freq_range": [2.0, 80.0], "freq_res": 1.0, "aperiodic_params_": [-0.06996760581492366, 0.5043978635528582], "gaussian_params_": [[9.865862160869806, 0.879119831207642, 0.662625697562105], [20.574232603575666, 0.14622634027875997, 4.593059083278829], [38.54796539632263, 0.11071441473924999, 5.999999999999999], [48.01029005135749, 0.1786019628314609, 0.25000590692824026], [50.428435228150896, 0.7567423644210695, 0.2959308231398173]], "peak_params_": [[9.865862160869806, 0.8716214870672414, 1.32525139512421], [20.574232603575666, 0.14713689494729876, 9.186118166557659], [38.54796539632263, 0.11044746971911101, 11.999999999999998], [48.01029005135749, 0.2104626365762039, 0.5000118138564805], [50.428435228150896, 0.283255156053299, 0.5918616462796346]], "r_squared_": 0.9074164086343844, "error_": 0.05612875924122597}
{"freq_range": [2.0, 80.0], "freq_res": 1.0, "aperiodic_params_": [0.09636610932300688, 0.6718094528708426], "gaussian_params_": [[9.962756295963553, 1.1347155905382285, 0.699852251144048], [37.33712849913699, 0.1336014183589041, 1.830177906159404], [51.128541961393005, 0.12660005396338533, 5.999999999999947]], "peak_params_": [[9.962756295963553, 1.1331099712159025, 1.399704502288096], [37.33712849913699, 0.13926756130340423, 3.660355812318808], [51.128541961393005, 0.12657100427980816, 11.999999999999893]], "r_squared_": 0.9326191261340151, "error_": 0.06453728582280992}
{"freq_range": [2.0, 80.0], "freq_res": 1.0, "aperiodic_params_": [0.04512329553135797, 0.6838881313509919], "gaussian_params_": [[9.955619301967173, 1.2355619456868403, 0.7217681704339426], [20.496285816874703, 0.16931898404302423, 3.309688108234049], [28.929415965033822, 0.19681818182956942, 1.0464869637674743], [49.530291547015366, 0.138038352552598, 5.999999999999999]], "peak_params_": [[9.955619301967173, 1.2343368351230066, 1.4435363408678852], [20.496285816874703, 0.16742684867403546, 6.619376216468098], [28.929415965033822, 0.20300723283271416, 2.0929739275349486], [49.530291547015366, 0.13761601587486705, 11.999999999999998]], "r_squared_": 0.9586674240862237, "error_": 0.05257964038680466}
{"freq_range": [2.0, 80.0], "freq_res": 1.0, "aperiodic_params_": [-0.08783916371894354, 0.6283000785245959], "gaussian_params_": [[9.870152817633588, 0.7883376808651377, 0.6641788993838779], [25.555063396532624, 0.7584631766885198, 0.2500303690718086], [28.832900616971127, 0.23167302928455738, 0.8781324009310021], [38.517719250874585, 0.776109481155814, 0.2500015756598503], [45.36371777269926, 0.08150821806101181, 5.94843641039752], [50.35322281295018, 0.4962316898417925, 0.25004053147230165], [57.54796540086405, 0.08288249734047293, 5.999999999999999]], "peak_params_": [[9.870152817633588, 0.7734154403499595, 1.3283577987677557], [25.555063396532624, 0.15738079652970582, 0.5000607381436172], [28.832900616971127, 0.2293705051078787, 1.7562648018620042], [38.517719250874585, 0.1674188366120315, 0.5000031513197006], [45.36371777269926, 0.09066142494185803, 11.89687282079504], [50.35322281295018, 0.2806793098936946, 0.5000810629446033], [57.54796540086405, 0.09118428881567775, 11.999999999999998]], "r_squared_": 0.9506880730300296, "error_": 0.044567401133281545}
{"freq_range": [2.0, 80.0], "freq_res": 1.0, "aperiodic_params_": [-0.480509333026128, 0.33557616032013926], "gaussian_params_": [[9.609336575278373, 0.44065766849102367, 0.41561295443976903], [28.45605467125557, 0.16730705378223093, 2.122081503766921], [33.620280185677586, 0.5223828213276704, 0.2561828220712138], [37.25499439831281, 0.1401517043299187, 1.7287636462823674], [41.753104501296924, 0.16426298788400817, 0.334154289762368], [43.574899851142206, 0.3044666792626504, 0.2654508717116131], [46.370598530447296, 0.13826467399532205, 2.4100956886328153], [50.392606674176264, 0.5340274960803802, 0.2762976902831412], [53.07194060194866, 0.1759661871898785, 1.4985746504357307], [61.909264865778425, 0.08263892976610299, 3.1979322554211578]], "peak_params_": [[9.609336575278373, 0.2832973787047596, 0.8312259088795381], [28.45605467125557, 0.1634877913273839, 4.244163007533842], [33.620280185677586, 0.20347431643154035, 0.5123656441424276], [37.25499439831281, 0.13875800596607224, 3.457527292564735], [41.753104501296924, 0.15497056162067835, 0.668308579524736], [43.574899851142206, 0.16976531564568176, 0.5309017434232262], [46.370598530447296, 0.1366429725228373, 4.820191377265631], [50.392606674176264, 0.26068554529697086, 0.5525953805662824], [53.07194060194866, 0.18061457259498104, 2.9971493008714614], [61.909264865778425, 0.0826056765743246, 6.3958645108423156]], "r_squared_": 0.8403829991668599, "error_": 0.0405604680665303}
{"freq_range": [2.0, 80.0], "freq_res": 1.0, "aperiodic_params_": [-0.23923341619079816, 0.2729580093501738], "gaussian_params_": [[9.646470077332522, 0.5688462561074766, 0.5522666383608543], [38.34006501292054, 0.1265403155031645, 5.969837812480062], [48.01439248569686, 0.19934795780004344, 0.2500000000086365], [50.42149893591227, 0.7793304307428432, 0.28586400515123034], [52.65325479151597, 0.22653431256762332, 0.4784248162811335], [54.70399783127902, 0.18862528698072215, 0.5630116173875768], [60.40125947832811, 0.1468013303494744, 1.8613368830856183]], "peak_params_": [[9.646470077332522, 0.46346080003326584, 1.1045332767217086], [38.34006501292054, 0.12633517779628411, 11.939675624960124], [48.01439248569686, 0.2331896256574214, 0.500000000017273], [50.42149893591227, 0.2815888447059857, 0.5717280103024607], [52.65325479151597, 0.1824024766424337, 0.956849632562267], [54.70399783127902, 0.16903465052556255, 1.1260232347751535], [60.40125947832811, 0.14360477253027903, 3.7226737661712366]], "r_squared_": 0.800475536536006, "error_": 0.042938226176766375}
{"freq_range": [2.0, 80.0], "freq_res": 1.0, "aperiodic_params_": [-0.21501941581089293, 0.412872920099926], "gaussian_params_": [[9.826294913730901, 0.8511359679033214, 0.6416495034167599], [36.810325338039085, 0.13863192947247102, 5.999999999999999], [48.295507070190965, 0.42706251312837074, 0.2505386038051171], [50.358144002382154, 0.5100675420386118, 0.31796036201803796], [53.391487921963346, 0.17046746498603538, 1.4598034118731011], [60.65978577116875, 0.1524944489033339, 1.9355690502568819]], "peak_params_": [[9.826294913730901, 0.8205181145473281, 1.2832990068335197], [36.810325338039085, 0.13856267610266115, 11.999999999999998], [48.295507070190965, 0.23755207131124934, 0.5010772076102342], [50.358144002382154, 0.2943194129154093, 0.6359207240360759], [53.391487921963346, 0.16814511653998954, 2.9196068237462023], [60.65978577116875, 0.1501980717626339, 3.8711381005137637]], "r_squared_": 0.869169184413374, "error_": 0.0541330574913668}
{"freq_range": [2.0, 80.0], "freq_res": 1.0, "aperiodic_params_": [0.038055475240361396, 0.586736100000492], "gaussian_params_": [[9.779698067265958, 0.9273505543148929, 0.6574394938233032], [36.37727350327337, 0.6109506874653673, 0.2509049590250723], [47.693645717427664, 0.41925575452082753, 0.25654972309454604], [50.12961226786598, 0.30134906882275075, 0.5834819558615746]], "peak_params_": [[9.779698067265958, 0.8767209269863121, 1.3148789876466065], [36.37727350327337, 0.19726204426911953, 0.5018099180501446], [47.693645717427664, 0.2058979998028897, 0.5130994461890921], [50.12961226786598, 0.29400510145285597, 1.1669639117231492]], "r_squared_": 0.9189988882697194, "error_": 0.060942635694693506}
{"freq_range": [2.0, 80.0], "freq_res": 1.0, "aperiodic_params_": [-0.800679588855587, 0.3975895344139832], "gaussian_params_": [[10.422200391659945, 0.7258358671127692, 0.26533039247858714], [27.183938172117205, 0.1313996523303787, 5.999999999999999], [37.08272007361606, 0.1758019123156241, 1.7285528889507524], [48.68882054604496, 0.21160084841177235, 5.999999999999999]], "peak_params_": [[10.422200391659945, 0.2068298998232736, 0.5306607849571743], [27.183938172117205, 0.13164560690798655, 11.999999999999998], [37.08272007361606, 0.241791217288855, 3.457105777901505], [48.68882054604496, 0.21149338091646608, 11.999999999999998]], "r_squared_": 0.8111769715493945, "error_": 0.055971353924872354}
{"freq_range": [2.0, 80.0], "freq_res": 1.0, "aperiodic_params_": [-0.6112695733505894, 0.43724124448849766], "gaussian_params_": [[18.5479654004703, 0.1495310658385841, 2.1535326911838344], [28.932897697566354, 0.14843748790360237, 3.754739023022963], [36.08900849576374, 0.2527813926069834, 0.5185772238533484], [38.58462089008249, 0.21102259814079882, 0.9175916524136117], [44.12348609024019, 0.18710531320707494, 2.3690556077147225], [50.53023266787369, 0.23716244686291435, 1.2073815675092492], [52.76334378501217, 0.17754718136826983, 0.6290525261991692], [55.38572969034007, 0.47850237424688874, 0.2972244444715949]], "peak_params_": [[18.5479654004703, 0.15075918756896334, 4.307065382367669], [28.932897697566354, 0.1484149328758988, 7.509478046045926], [36.08900849576374, 0.2788540495928642, 1.0371544477066967], [38.58462089008249, 0.21259982654982879, 1.8351833048272235], [44.12348609024019, 0.1868987184476547, 4.738111215429445], [50.53023266787369, 0.2261358513647993, 2.4147631350184984], [52.76334378501217, 0.19485518356508869, 1.2581050523983384], [55.38572969034007, 0.20671458813485888, 0.5944488889431898]], "r_squared_": 0.8375678303578629, "error_": 0.0509462359545857}
{"freq_range": [2.0, 80.0], "freq_res": 1.0, "aperiodic_params_": [-0.6203695251388004, 0.38924964324061323], "gaussian_params_": [[9.58661119337287, 0.7667262304105984, 0.26626925233752785], [17.490739653380093, 0.1425762252591301, 2.045159941884626], [28.246565043232703, 0.15606615583558123, 2.4303744949070545], [35.975366799816506, 0.18205202791320815, 1.6408493908266943], [38.79707578436629, 0.15495927207672616, 0.7728223895232792], [44.03448475067446, 0.14182073156067818, 3.7381231364317604], [45.93203747260202, 0.07669063964607183, 0.2500278397470943], [50.4465220693409, 0.6249451740618003, 0.29859201807252256], [52.508600179338465, 0.2813022733892718, 0.47809195556923106], [54.98930400539255, 0.1637429114111896, 0.6108208336297017]], "peak_params_": [[9.58661119337287, 0.22991869509993612, 0.5325385046750557], [17.490739653380093, 0.13853369482673927, 4.090319883769252], [28.246565043232703, 0.15528101804897454, 4.860748989814109], [35.975366799816506, 0.19729523318063102, 3.2816987816533887], [38.79707578436629, 0.2402722475763568, 1.5456447790465584], [44.03448475067446, 0.14181586287801595, 7.476246272863521], [45.93203747260202, 0.19742007140809625, 0.5000556794941886], [50.4465220693409, 0.24397844305061622, 0.5971840361450451], [52.508600179338465, 0.17467679344325204, 0.9561839111384621], [54.98930400539255, 0.16563766394309387, 1.2216416672594035]], "r_squared_": 0.8471396029744157, "error_": 0.04670806600925629}
{"freq_range": [2.0, 80.0], "freq_res": 1.0, "aperiodic_params_": [-0.7443677730150345, 0.41466665276943765], "gaussian_params_": [[9.531556213287685, 1.2097673939459257, 0.25000000000000006], [17.768812849918287, 0.15483477589924763, 2.2688985126038057], [28.02192283738679, 0.1684254832139773, 2.3219431172076703], [36.52309536664654, 0.1553187568964942, 2.5106127265738802], [42.471770175217344, 0.37937820228369823, 0.270863008706127], [49.36185219447459, 0.17105118007081654, 5.999999999999999], [61.497826373374224, 0.16633579769182277, 0.7958741017102392]], "peak_params_": [[9.531556213287685, 0.2095100697989707, 0.5000000000000001], [17.768812849918287, 0.1540484543886329, 4.537797025207611], [28.02192283738679, 0.16921458707925696, 4.643886234415341], [36.52309536664654, 0.17311876708760798, 5.0212254531477605], [42.471770175217344, 0.17820016309087028, 0.541726017412254], [49.36185219447459, 0.17074106758327812, 11.999999999999998], [61.497826373374224, 0.1628499463981492, 1.5917482034204784]], "r_squared_": 0.8549272084910916, "error_": 0.049686834167318054}
