{"freq_range": [2.0, 80.0], "freq_res": 1.0, "aperiodic_params_": [0.1831743541535432, 1.0926072244476506], "gaussian_params_": [[9.029675361995066, 1.7522037779732837, 0.7947751669455367], [12.066454960203286, 0.3914473428385423, 1.4572610280973024], [18.216934979087352, 0.31009897500711014, 0.6181110669769407], [48.05424864860472, 0.16469297575807576, 0.2501169744154619], [54.86499049684455, 0.11074950245124171, 3.5239310143953566], [63.54796540033532, 0.14089852125101712, 3.7808906778439484], [74.64389620259216, 0.22292884724541648, 5.999999999999999]], "peak_params_": [[9.029675361995066, 1.7937553968253153, 1.5895503338910735], [12.066454960203286, 0.3926644915124339, 2.914522056194605], [18.216934979087352, 0.2916751399889943, 1.2362221339538815], [48.05424864860472, 0.17751115722088096, 0.5002339488309238], [54.86499049684455, 0.1226559909549183, 7.047862028790713], [63.54796540033532, 0.1899590905554036, 7.561781355687897], [74.64389620259216, 0.22397111168471495, 11.999999999999998]], "r_squared_": 0.9870327616511444, "error_": 0.044418379674115716}
{"freq_range": [2.0, 80.0], "freq_res": 1.0, "aperiodic_params_": [0.11951997130821333, 1.2086081430967266], "gaussian_params_": [[4.409260571689745, 0.6661227041912946, 0.2500284091396404], [6.775223923458945, 0.4120861469245352, 0.26090906395849073], [8.969156682191105, 1.8751824303766549, 0.7968829821967448], [11.85040087108801, 0.47633620971069707, 1.8035293434118118], [18.21033570449942, 0.43907661380439106, 0.9493687742104657], [57.37745967606732, 0.44630170778425904, 0.2500488793034142], [60.452034851331256, 0.09585318950049491, 5.999999999999999], [68.2492451774205, 0.16212896592765075, 0.5794990833021381], [75.54796274997653, 0.1416640263554895, 5.999999999999999]], "peak_params_": [[4.409260571689745, 0.17451915689704567, 0.5000568182792808], [6.775223923458945, 0.38566370191203325, 0.5218181279169815], [8.969156682191105, 2.010398123836421, 1.5937659643934896], [11.85040087108801, 0.47605511913513254, 3.6070586868236236], [18.21033570449942, 0.4298547452243009, 1.8987375484209315], [57.37745967606732, 0.22525071594406465, 0.5000977586068284], [60.452034851331256, 0.10051465685545269, 11.999999999999998], [68.2492451774205, 0.2554641554665631, 1.1589981666042761], [75.54796274997653, 0.14460040615293224, 11.999999999999998]], "r_squared_": 0.9925736499634527, "error_": 0.039720404878880254}
{"freq_range": [2.0, 80.0], "freq_res": 1.0, "aperiodic_params_": [0.17102413382512394, 0.9452257892871782], "gaussian_params_": [[9.071104383324982, 1.6530527255083847, 0.7451487552029433], [12.05648351595899, 0.2552402249961445, 1.2955883251052784], [18.393113426200728, 0.5665487305221238, 0.2700015111006682], [50.961337626014796, 0.13881337428476137, 0.44058327904314587], [56.093412365255126, 0.12771044866967066, 5.9002263657411715], [60.80656578276284, 0.1369669344574862, 0.41627265518698053], [63.292149956905085, 0.11543295298418146, 0.5569222602343823], [68.5458170886804, 0.18960464248140163, 2.801753910547381], [74.42225854082375, 0.1601934709587929, 1.096205038141065], [78.53222074496458, 0.26745575988306153, 1.2138769126054154]], "peak_params_": [[9.071104383324982, 1.6613344862883592, 1.4902975104058866], [12.05648351595899, 0.2557279269611328, 2.591176650210557], [18.393113426200728, 0.1963065396322098, 0.5400030222013364], [50.961337626014796, 0.22626430167940637, 0.8811665580862917], [56.093412365255126, 0.12770283516592573, 11.800452731482343], [60.80656578276284, 0.2183948283633288, 0.8325453103739611], [63.292149956905085, 0.19169857313032135, 1.1138445204687646], [68.5458170886804, 0.19880306767456957, 5.603507821094762], [74.42225854082375, 0.17877314232892072, 2.19241007628213], [78.53222074496458, 0.2485902590808855, 2.427753825210831]], "r_squared_": 0.9856533521035815, "error_": 0.035038918947769344}
{"freq_range": [2.0, 80.0], "freq_res": 1.0, "aperiodic_params_": [0.49580835432946974, 1.2543633770311502], "gaussian_params_": [[6.816202680378354, 0.2681000006486105, 0.29336957041635575], [9.025312464700082, 1.7145872420489443, 0.7578777512655984], [11.910905564471182, 0.3574368701456592, 1.40519651059096], [18.493513422469068, 0.6606782098409077, 0.32485159492659704], [47.6411901677228, 0.41754419542780685, 0.2674952231306779], [50.44201862635904, 0.1391305165089333, 1.1763706316097309], [56.207833946019015, 0.1770620136375911, 0.9379090382541803], [61.03169833558017, 0.12270944860777741, 0.2500000000627256], [67.83740667664945, 0.1887938042327658, 5.199833041718325], [75.1765491962475, 0.18839515543388255, 1.0725823246782802], [78.87739034818834, 0.22848855272000412, 1.172530843730577]], "peak_params_": [[6.816202680378354, 0.26936266699258693, 0.5867391408327115], [9.025312464700082, 1.7554498367801903, 1.5157555025311968], [11.910905564471182, 0.35749330347973474, 2.81039302118192], [18.493513422469068, 0.20839417158421536, 0.6497031898531941], [47.6411901677228, 0.18608425279111263, 0.5349904462613558], [50.44201862635904, 0.13017316578540306, 2.3527412632194618], [56.207833946019015, 0.18691579469924546, 1.8758180765083605], [61.03169833558017, 0.2012576600034155, 0.5000000001254512], [67.83740667664945, 0.18870153051104932, 10.39966608343665], [75.1765491962475, 0.25993350477609933, 2.1451646493565604], [78.87739034818834, 0.24641944149460548, 2.345061687461154]], "r_squared_": 0.9914489115336226, "error_": 0.03611618218297022}
{"freq_range": [2.0, 80.0], "freq_res": 1.0, "aperiodic_params_": [0.5443460226425736, 1.3345105977139267], "gaussian_params_": [[7.519538401842538, 1.3643996587793845, 0.3114184463082901], [9.056390629699017, 1.8211856481283932, 0.6001549186006663], [10.47013340146588, 1.0032647993524166, 0.33154648352284233], [12.631977527249845, 0.35486583728800225, 0.8995517852615419], [18.18440312751619, 0.3703666879263663, 1.0021644916236319], [24.95757899763579, 0.18679551351643084, 0.2500000000000626], [63.80401566567499, 0.144285735190929, 5.999999999999999], [72.18191990541452, 0.12930396536878005, 0.7955474536526047], [75.29509254149883, 0.20169741697233573, 0.25017509097019835], [78.67805173631312, 0.21902161823445848, 2.7229569093572326]], "peak_params_": [[7.519538401842538, 0.8018943834020753, 0.6228368926165802], [9.056390629699017, 1.813337386822008, 1.2003098372013326], [10.47013340146588, 0.9011371659953314, 0.6630929670456847], [12.631977527249845, 0.32637693045206095, 1.7991035705230838], [18.18440312751619, 0.3641495696402597, 2.0043289832472637], [24.95757899763579, 0.18412560806330402, 0.5000000000001252], [63.80401566567499, 0.14420889091168454, 11.999999999999998], [72.18191990541452, 0.1935507317856371, 1.5910949073052094], [75.29509254149883, 0.2141010255828013, 0.5003501819403967], [78.67805173631312, 0.2233353011181718, 5.445913818714465]], "r_squared_": 0.9913580040776028, "error_": 0.03926611670928388}
{"freq_range": [2.0, 80.0], "freq_res": 1.0, "aperiodic_params_": [0.1864046377520913, 1.0620186007623882], "gaussian_params_": [[4.0263284371088, 0.16673114061200814, 0.25000043235971947], [7.555013747093489, 1.0845512420088999, 0.33359785734676917], [9.174636838153013, 1.878825412533759, 0.646652268693613], [10.639901202220104, 0.4041671205219023, 0.35492064745404417], [12.534382321196258, 0.32051899118320193, 0.8234853706344737], [18.147771932891246, 0.38447266778990735, 0.7395065490057189], [48.958532413191406, 0.1403298019038847, 1.444859322352993], [54.001889838301686, 0.10262578304667698, 0.8461448825556274], [61.68598021831278, 0.1854001569402178, 5.1033955751744156], [75.53103472600084, 0.20890290929054303, 5.999982706805118]], "peak_params_": [[4.0263284371088, 0.1658090964183242, 0.5000008647194389], [7.555013747093489, 0.8064299655337792, 0.6671957146935383], [9.174636838153013, 1.8116773265996553, 1.293304537387226], [10.639901202220104, 0.333016566248992, 0.7098412949080883], [12.534382321196258, 0.27316883383353796, 1.6469707412689474], [18.147771932891246, 0.3768727797823336, 1.4790130980114378], [48.958532413191406, 0.1487234869350258, 2.889718644705986], [54.001889838301686, 0.16292374330916326, 1.6922897651112547], [61.68598021831278, 0.2014769614340015, 10.206791150348831], [75.53103472600084, 0.21189513216880274, 11.999965413610235]], "r_squared_": 0.9864099534769823, "error_": 0.04484505257699673}
{"freq_range": [2.0, 80.0], "freq_res": 1.0, "aperiodic_params_": [0.4157413231407125, 1.0511919065748725], "gaussian_params_": [[9.097652558009713, 1.5265475423663253, 0.7352851365697869], [51.17363789147591, 0.19834630790000113, 2.3842052126284043], [58.06782183753509, 0.20293879115935237, 1.170446079112372], [63.99832691913205, 0.1669628530740526, 1.6000691319085483], [67.39904328554529, 0.4140092317614404, 0.28435223348946603], [68.74357512907345, 0.1984343285706726, 0.7454503193782481], [73.93611098184734, 0.16960696269246475, 1.586810478389715], [78.63345379925781, 0.22695203595450839, 0.8283514423797147]], "peak_params_": [[9.097652558009713, 1.5131439142165217, 1.4705702731395738], [51.17363789147591, 0.19782099496464967, 4.768410425256809], [58.06782183753509, 0.20603754478145264, 2.340892158224744], [63.99832691913205, 0.16696340187423386, 3.2001382638170965], [67.39904328554529, 0.1962768222113902, 0.5687044669789321], [68.74357512907345, 0.18963956225472844, 1.4909006387564963], [73.93611098184734, 0.16946958284846558, 3.17362095677943], [78.63345379925781, 0.20682803166452968, 1.6567028847594294]], "r_squared_": 0.983740707213135, "error_": 0.043438326889988076}
{"freq_range": [2.0, 80.0], "freq_res": 1.0, "aperiodic_params_": [0.45823175987812115, 1.217855478962381], "gaussian_params_": [[7.5423955534544005, 2.0419551309975805, 0.2873231635916422], [9.258387493871796, 2.0171896001526335, 0.5830025511607313], [11.484783452767836, 0.3833044822548537, 0.7139960930493375], [13.197483814480883, 0.32214761741265724, 0.5806699261710893], [18.52193774316054, 0.20319040258409177, 1.4371844834337373], [74.06328043925242, 0.18811617578606352, 5.999999999999999]], "peak_params_": [[7.5423955534544005, 0.7708125152599589, 0.5746463271832845], [9.258387493871796, 1.829395970157773, 1.1660051023214626], [11.484783452767836, 0.32792218149934166, 1.427992186098675], [13.197483814480883, 0.3444997408405006, 1.1613398523421785], [18.52193774316054, 0.19225439021611113, 2.8743689668674746], [74.06328043925242, 0.18810571364580153, 11.999999999999998]], "r_squared_": 0.9860513658878672, "error_": 0.0507488331179492}
{"freq_range": [2.0, 80.0], "freq_res": 1.0, "aperiodic_params_": [0.4819716964571634, 1.229966703162444], "gaussian_params_": [[7.530338061298514, 1.2930412070661164, 0.32183743578339225], [9.215018829569503, 1.9244340454672637, 0.6398635917669588], [11.560970766195776, 0.401997502018644, 0.661888695789345], [13.391297052843298, 0.5497984650890613, 0.3475212628055781], [18.522391732743042, 0.19228325323201956, 1.402958290078759], [62.6279439317693, 0.12166924316468997, 5.999999873394723], [67.2074500933969, 0.15345684552058564, 0.25005143450150863], [76.85567017382743, 0.20059662341538376, 3.89188377147764]], "peak_params_": [[7.530338061298514, 0.7630365025600153, 0.6436748715667845], [9.215018829569503, 1.8190530959477764, 1.2797271835339177], [11.560970766195776, 0.32295031113790507, 1.32377739157869], [13.391297052843298, 0.32958909221128185, 0.6950425256111562], [18.522391732743042, 0.18145786345603576, 2.805916580157518], [62.6279439317693, 0.12179041338939345, 11.999999746789445], [67.2074500933969, 0.21019893899661768, 0.5001028690030173], [76.85567017382743, 0.207365300180536, 7.78376754295528]], "r_squared_": 0.9883902052986697, "error_": 0.04363150451184032}
{"freq_range": [2.0, 80.0], "freq_res": 1.0, "aperiodic_params_": [0.4807578534775905, 1.2359302218859791], "gaussian_params_": [[7.542025954609705, 1.8386600029097888, 0.29496787713395684], [9.258393092036597, 2.0087705582319697, 0.5954896786481702], [11.548644232016361, 0.45051977995918147, 0.602557734660082], [13.421691230703129, 0.9180301005912396, 0.29009352457356224], [18.430558018531233, 0.20269429919040055, 1.4013511571683357], [64.45203459913596, 0.1305240417235021, 5.999999999999999], [76.19199464754391, 0.18017920857110029, 2.8025467336635943], [79.05344746701353, 0.09784328474359329, 0.5989973884514859]], "peak_params_": [[7.542025954609705, 0.7662466815238805, 0.5899357542679137], [9.258393092036597, 1.8283574485344913, 1.1909793572963403], [11.548644232016361, 0.34036937242936716, 1.205115469320164], [13.421691230703129, 0.3440414007673125, 0.5801870491471245], [18.430558018531233, 0.1933494569666393, 2.8027023143366714], [64.45203459913596, 0.13016814062144855, 11.999999999999998], [76.19199464754391, 0.20023606756184975, 5.605093467327189], [79.05344746701353, 0.21342968555881736, 1.1979947769029717]], "r_squared_": 0.9878407100425697, "error_": 0.04522689900456801}
{"freq_range": [2.0, 80.0], "freq_res": 1.0, "aperiodic_params_": [0.7115679105859629, 1.3911167420492494], "gaussian_params_": [[7.53215424598498, 0.5757204363678847, 0.543589922355912], [9.024404070481866, 1.7892915177010338, 0.5918505478613308], [10.43990755646727, 1.0923478336836385, 0.3215917044689144], [12.593659151581143, 0.3680033465514546, 0.8272658711913188], [18.08463411520525, 0.35383865662635133, 0.9193986047125691], [63.209268658680145, 0.10325447608962815, 5.999999999999999], [63.47246705036343, 0.709326010431816, 0.25922426894400574], [71.6925878272895, 0.16574924359800502, 1.082313515621028], [75.76345519726306, 0.2363262090345206, 1.395923872933217], [79.12363990474503, 0.2965810656374023, 0.7480415767978584]], "peak_params_": [[7.53215424598498, 0.7976002994780619, 1.087179844711824], [9.024404070481866, 1.8028761107749804, 1.1837010957226617], [10.43990755646727, 0.8912015862136531, 0.6431834089378288], [12.593659151581143, 0.32618371747910824, 1.6545317423826376], [18.08463411520525, 0.35234263199508453, 1.8387972094251381], [63.209268658680145, 0.23793147949365845, 11.999999999999998], [63.47246705036343, 0.23793147949365845, 0.5184485378880115], [71.6925878272895, 0.2007368452356153, 2.164627031242056], [75.76345519726306, 0.24370955693269813, 2.791847745866434], [79.12363990474503, 0.31186858865623157, 1.4960831535957169]], "r_squared_": 0.9896348992118466, "error_": 0.044523300861632385}
{"freq_range": [2.0, 80.0], "freq_res": 1.0, "aperiodic_params_": [0.7141219553075999, 1.3880098261845129], "gaussian_params_": [[7.461837597829558, 0.5097659285525047, 0.5330934624090818], [9.015147078584544, 1.7908610141890038, 0.6271333779696067], [10.451638811053675, 0.913510457481649, 0.33431652509100096], [12.570529685226035, 0.37451339688807433, 0.7768185081653783], [18.14228058448188, 0.36713430994073676, 0.7763391993554293], [64.92472077479916, 0.14520786457909363, 5.999999999999999], [75.79447282885464, 0.2099319601574743, 1.458369230614954], [79.06834297961721, 0.23246102886788803, 0.8162112253458211]], "peak_params_": [[7.461837597829558, 0.3605191466612025, 1.0661869248181637], [9.015147078584544, 1.7983572852486809, 1.2542667559392133], [10.451638811053675, 0.8902076019764066, 0.6686330501820019], [12.570529685226035, 0.321437013294366, 1.5536370163307567], [18.14228058448188, 0.3610200834085697, 1.5526783987108586], [64.92472077479916, 0.14519643603726373, 11.999999999999998], [75.79447282885464, 0.2344867782764366, 2.916738461229908], [79.06834297961721, 0.25966464340556894, 1.6324224506916423]], "r_squared_": 0.9896203471349162, "error_": 0.045816870461672786}
{"freq_range": [2.0, 80.0], "freq_res": 1.0, "aperiodic_params_": [0.6109996860626267, 1.3220484787540998], "gaussian_params_": [[6.60256399681734, 0.6602767741282952, 0.30093331206328056], [8.868689791727984, 1.8199274460396744, 0.6821751475985979], [10.444304331375529, 0.9358492715182789, 0.3542874424649755], [12.527946155354059, 0.38669586147833274, 0.6941670708168066], [18.212383347368075, 0.3402482757557642, 1.0716584983908704], [22.625216710476916, 0.5327477864759863, 0.2500018852994211], [65.2665947569746, 0.11685245122464576, 5.999999999999999], [77.48189435919862, 0.20194122285090238, 3.285038478610117]], "peak_params_": [[6.60256399681734, 0.31876384090908827, 0.6018666241265611], [8.868689791727984, 1.7867536766411725, 1.3643502951971958], [10.444304331375529, 0.8868835782612192, 0.708574884929951], [12.527946155354059, 0.3068708036268605, 1.3883341416336132], [18.212383347368075, 0.33363164851885463, 2.1433169967817407], [22.625216710476916, 0.17320156223568217, 0.5000037705988422], [65.2665947569746, 0.1168851557648467, 11.999999999999998], [77.48189435919862, 0.217046953581995, 6.570076957220234]], "r_squared_": 0.9897254610097629, "error_": 0.044821112323910804}
{"freq_range": [2.0, 80.0], "freq_res": 1.0, "aperiodic_params_": [0.2871051433080884, 1.0029227691853468], "gaussian_params_": [[9.0098913273556, 1.7277450290286431, 0.8054260555793454], [12.080835242210828, 0.3360037111429269, 0.9217478376168313], [18.307789710636747, 0.3147188139223698, 0.6168058843654777], [39.42054525092799, 0.6413811269591012, 0.28569875059218597], [56.54796540086405, 0.1198143788682925, 5.999999999999999], [59.95415552066102, 0.12297908244853882, 0.2500598199810044], [74.64389620259216, 0.2824114278347419, 5.999999999999999]], "peak_params_": [[9.0098913273556, 1.728875053789728, 1.6108521111586909], [12.080835242210828, 0.3364707558688703, 1.8434956752336626], [18.307789710636747, 0.2778763404181095, 1.2336117687309553], [39.42054525092799, 0.21874013993753905, 0.5713975011843719], [56.54796540086405, 0.12321696135425109, 11.999999999999998], [59.95415552066102, 0.23683558043711783, 0.5001196399620088], [74.64389620259216, 0.2829732182187663, 11.999999999999998]], "r_squared_": 0.9745925018449251, "error_": 0.05549519768441459}
{"freq_range": [2.0, 80.0], "freq_res": 1.0, "aperiodic_params_": [0.2514515257136016, 0.9269224029645945], "gaussian_params_": [[6.871470617268228, 0.2458039124635872, 0.36608019647459605], [9.010807437628523, 1.5955087931603045, 0.7537429856901624], [11.590255279087332, 0.22110152409210632, 0.8328884152335352], [18.216429978671275, 0.17391774623847286, 0.6454787255538763], [41.68184827767199, 0.21718651962585905, 0.4475897431250308], [52.93172220567308, 0.15501365414816223, 0.25000000093872804], [62.915215332432005, 0.19654207913455107, 5.999999999999999], [71.19438472521968, 0.2358166865424509, 0.8357165397961844], [74.33865888542738, 0.19908754558168412, 0.8133990837568534], [78.19102822666828, 0.20731445369394969, 1.188370547568802]], "peak_params_": [[6.871470617268228, 0.2765549153851308, 0.7321603929491921], [9.010807437628523, 1.597100166123964, 1.5074859713803248], [11.590255279087332, 0.1965147435137975, 1.6657768304670704], [18.216429978671275, 0.1644109226615208, 1.2909574511077526], [41.68184827767199, 0.16915310055771826, 0.8951794862500616], [52.93172220567308, 0.1995100167880739, 0.5000000018774561], [62.915215332432005, 0.19652245746248198, 11.999999999999998], [71.19438472521968, 0.3088517643053932, 1.6714330795923689], [74.33865888542738, 0.21948346986546574, 1.6267981675137069], [78.19102822666828, 0.21299600289621012, 2.376741095137604]], "r_squared_": 0.9835964359483401, "error_": 0.03842241418927776}
{"freq_range": [2.0, 80.0], "freq_res": 1.0, "aperiodic_params_": [-0.1325750218271873, 0.38059691127598716], "gaussian_params_": [[9.06959566475853, 1.4487773312706915, 0.6979940377088437], [25.19572713720373, 0.297184750517053, 0.5651679401989407], [28.414508085861158, 0.26837455748821154, 0.2500065840878843], [28.452034599135946, 0.20086486142864587, 5.262150224625525], [38.58700969928726, 0.23154965545086756, 0.6197182358388853], [41.595357257537984, 0.2584244626158168, 1.056962407499306], [44.55384759497296, 0.6056811040793788, 0.30190820923777767], [47.519384086781656, 0.26408503087891627, 1.0400753508723615], [51.650725833413404, 0.27201276271327945, 1.6862752772809373], [57.23411218692764, 0.24821727810591065, 1.0907588598095879], [63.99997800803387, 0.102986315337078, 2.8877152796777947]], "peak_params_": [[9.06959566475853, 1.4418101261055438, 1.3959880754176874], [25.19572713720373, 0.44186443767963457, 1.1303358803978814], [28.414508085861158, 0.2680185898442861, 0.5000131681757686], [28.452034599135946, 0.2680185898442861, 10.52430044925105], [38.58700969928726, 0.2250601905015236, 1.2394364716777706], [41.595357257537984, 0.24746761149697893, 2.113924814998612], [44.55384759497296, 0.22028688527781892, 0.6038164184755553], [47.519384086781656, 0.2636548342351427, 2.080150701744723], [51.650725833413404, 0.2662944319788303, 3.3725505545618746], [57.23411218692764, 0.24979648858666914, 2.1815177196191757], [63.99997800803387, 0.10298631645549561, 5.7754305593555895]], "r_squared_": 0.9328653222545787, "error_": 0.04831174912660055}
{"freq_range": [2.0, 80.0], "freq_res": 1.0, "aperiodic_params_": [0.6430218963306445, 1.118883207693857], "gaussian_params_": [[9.09211284032052, 1.5317722098499231, 0.7446327478231407], [51.619630612169026, 0.22364618883616003, 0.7905735667709229], [57.76134510252005, 0.1281603137331763, 2.2106153414889946], [63.41778674655169, 0.22424892096324867, 0.6336609746040782], [64.6631271341437, 0.3879902372856672, 0.26057910270318396], [68.11754935017939, 0.16846578605242166, 0.7706424712951666], [71.93674733656587, 0.1661866551627606, 0.5170273905897985], [78.2954764955099, 0.14412942674870594, 1.0017165798949585]], "peak_params_": [[9.09211284032052, 1.520097128634208, 1.4892654956462814], [51.619630612169026, 0.20349595683677268, 1.5811471335418459], [57.76134510252005, 0.12741562790006822, 4.421230682977989], [63.41778674655169, 0.18817302408727077, 1.2673219492081564], [64.6631271341437, 0.17880745239399087, 0.5211582054063679], [68.11754935017939, 0.1665201368725997, 1.5412849425903332], [71.93674733656587, 0.16494817067737322, 1.034054781179597], [78.2954764955099, 0.13799369509521675, 2.003433159789917]], "r_squared_": 0.9852059305820878, "error_": 0.04486205180192958}
{"freq_range": [2.0, 80.0], "freq_res": 1.0, "aperiodic_params_": [0.6646436474825073, 1.2689255690633465], "gaussian_params_": [[7.536479334493686, 1.3212330451464607, 0.30667548815570816], [9.209132942364047, 1.8208972411392153, 0.6101772482393204], [11.444927769364174, 0.33773529460503915, 0.7403107287279722], [13.317425689557115, 0.36904984713854727, 0.41817133440980625], [18.581592661346622, 0.2681341359536015, 0.6191812631952651], [51.56844057082057, 0.17884690635104225, 0.7999940947901348], [63.01090729388494, 0.09979742528663746, 0.2500000000001028], [65.79623468873471, 0.12740816205613845, 5.999999999999999], [77.75222388630236, 0.14798657516317035, 3.019506343485963]], "peak_params_": [[7.536479334493686, 0.6772460277729038, 0.6133509763114163], [9.209132942364047, 1.7184866889828925, 1.2203544964786408], [11.444927769364174, 0.3064629464235344, 1.4806214574559444], [13.317425689557115, 0.3138624882893249, 0.8363426688196125], [18.581592661346622, 0.21340102312277687, 1.2383625263905302], [51.56844057082057, 0.16368819412449542, 1.5999881895802697], [63.01090729388494, 0.21400037350200796, 0.5000000000002056], [65.79623468873471, 0.1274107044387609, 11.999999999999998], [77.75222388630236, 0.16359042950698854, 6.039012686971926]], "r_squared_": 0.9898515004478333, "error_": 0.03961066429247945}
{"freq_range": [2.0, 80.0], "freq_res": 1.0, "aperiodic_params_": [0.8302415349744701, 1.3747177840994695], "gaussian_params_": [[7.270752485015803, 0.4043677260550944, 0.25000600699288555], [9.009029573153505, 1.5368833998442162, 0.709942325614786], [11.437875787903476, 0.2758853099995151, 2.2938292241766014], [18.480749958193105, 0.7340939369853685, 0.3021294186660813], [61.9473589430929, 0.14298473478411347, 5.999983552583834], [74.7688327554142, 0.21879653975823535, 2.073917203177157], [78.71358293961613, 0.2480005919085038, 0.5739575302657117]], "peak_params_": [[7.270752485015803, 0.29544557152288536, 0.5000120139857711], [9.009029573153505, 1.693597509232039, 1.419884651229572], [11.437875787903476, 0.30102299135421984, 4.587658448353203], [18.480749958193105, 0.21159867348530215, 0.6042588373321626], [61.9473589430929, 0.14297923305706073, 11.999967105167668], [74.7688327554142, 0.2308576553405457, 4.147834406354314], [78.71358293961613, 0.24878827613554844, 1.1479150605314234]], "r_squared_": 0.9901511488476621, "error_": 0.04156926923703141}
{"freq_range": [2.0, 80.0], "freq_res": 1.0, "aperiodic_params_": [0.6779512422368605, 1.3342442711766045], "gaussian_params_": [[7.482995469308522, 0.8277833720287464, 0.3358085319591945], [9.08281169409149, 1.578993565496947, 0.6333991800465941], [9.740931463396235, 0.08812481956545787, 0.31923004662376375], [11.237776044359082, 0.3407875438314129, 2.904162174108593], [18.19769063096176, 0.3467449387645603, 0.6530277223244023], [63.44354713129487, 0.14070969248345702, 5.999999336172312], [71.96074117663993, 0.13528048152020444, 1.2338907677821687], [75.26843180188558, 0.28590540657971425, 0.6499329044984083], [78.52227696747694, 0.27136254665298065, 1.0427070094838757]], "peak_params_": [[7.482995469308522, 0.4188444574846788, 0.671617063918389], [9.08281169409149, 1.8248014756607223, 1.2667983600931882], [9.740931463396235, 0.9280259848891066, 0.6384600932475275], [11.237776044359082, 0.35586307202178546, 5.808324348217186], [18.19769063096176, 0.35387012890539027, 1.3060554446488046], [63.44354713129487, 0.14032573957605, 11.999998672344624], [71.96074117663993, 0.18611244183433495, 2.4677815355643373], [75.26843180188558, 0.29196431343290286, 1.2998658089968167], [78.52227696747694, 0.249207634824129, 2.0854140189677515]], "r_squared_": 0.9886060272537927, "error_": 0.046625038776241835}
{"freq_range": [2.0, 80.0], "freq_res": 1.0, "aperiodic_params_": [0.6358624344712877, 1.327390658081848], "gaussian_params_": [[6.633616956863808, 0.750419486063474, 0.2819001040403734], [8.939067723396777, 1.7436431625740856, 0.7487322542256083], [10.443330314123891, 0.32701745288839507, 0.9362585042791446], [12.7134145730825, 0.39822191065143003, 0.8955033101464149], [15.497440162569927, 0.5972432776547647, 0.3557576905493353], [17.958621017495666, 0.39454593780019276, 0.7182403457757193], [63.34712921370163, 0.19290894703398034, 0.25019831576999957], [64.18423866814935, 0.16970487595480807, 1.8759913643269601], [75.69495806959524, 0.19049707515529907, 3.786543984551636], [79.02791704575654, 0.11948872224912696, 0.5470829087931885]], "peak_params_": [[6.633616956863808, 0.38381437070124086, 0.5638002080807468], [8.939067723396777, 1.837611637797861, 1.4974645084512166], [10.443330314123891, 0.9353285252647078, 1.8725170085582892], [12.7134145730825, 0.3862018195096132, 1.7910066202928299], [15.497440162569927, 0.2400716189131452, 0.7115153810986706], [17.958621017495666, 0.39389172335961975, 1.4364806915514385], [63.34712921370163, 0.2134198129321867, 0.5003966315399991], [64.18423866814935, 0.17691357103500338, 3.7519827286539202], [75.69495806959524, 0.18987995758339582, 7.573087969103272], [79.02791704575654, 0.2494865784640008, 1.094165817586377]], "r_squared_": 0.9910308236799158, "error_": 0.04179662198453923}
{"freq_range": [2.0, 80.0], "freq_res": 1.0, "aperiodic_params_": [0.6786106840578351, 1.3242385613806633], "gaussian_params_": [[7.113728607287917, 0.2849531131410471, 0.4524849446787302], [8.883687711465795, 1.596699345478274, 0.6294540317678283], [9.888458071845937, 0.2927748356532943, 0.38442356674785794], [11.668619186187291, 0.33649427532103926, 2.5301999261844594], [18.184155197237672, 0.321644187728171, 0.6707088352222258], [22.646193965808955, 0.4530856575065489, 0.2507994978311153], [25.32291573855024, 0.4003645509679619, 0.25017347552354496], [63.295779953485706, 0.12250104602457706, 2.112053617801461], [76.83529257554947, 0.19431856698815547, 4.70699946540076]], "peak_params_": [[7.113728607287917, 0.3555604068879787, 0.9049698893574604], [8.883687711465795, 1.7829203172966643, 1.2589080635356567], [9.888458071845937, 0.8827656927127425, 0.7688471334957159], [11.668619186187291, 0.33362832212861054, 5.060399852368919], [18.184155197237672, 0.3244446779426575, 1.3414176704444516], [22.646193965808955, 0.16752200325802047, 0.5015989956622307], [25.32291573855024, 0.1740490619770485, 0.5003469510470899], [63.295779953485706, 0.12389072156858116, 4.224107235602922], [76.83529257554947, 0.19419963762315717, 9.41399893080152]], "r_squared_": 0.9917404345416169, "error_": 0.042285292244116306}
{"freq_range": [2.0, 80.0], "freq_res": 1.0, "aperiodic_params_": [0.39043291092671306, 1.0811988793083225], "gaussian_params_": [[8.114084653970973, 0.6743443704511835, 0.8219330675455134], [9.402739049157947, 2.492631949419484, 0.33300719653315614], [11.292022880742483, 0.3347974867221369, 2.0906790549231147], [18.04494007111771, 0.2859940348339062, 0.6752865563698037], [25.3522308609486, 0.21372027822236558, 0.5550242253539124]], "peak_params_": [[8.114084653970973, 0.7651423771054547, 1.6438661350910269], [9.402739049157947, 1.7604337909501226, 0.6660143930663123], [11.292022880742483, 0.3329912417047563, 4.181358109846229], [18.04494007111771, 0.2873083229549618, 1.3505731127396075], [25.3522308609486, 0.17473930746088162, 1.1100484507078248]], "r_squared_": 0.987484628832869, "error_": 0.04719464836324164}
{"freq_range": [2.0, 80.0], "freq_res": 1.0, "aperiodic_params_": [0.23904441001958168, 0.9132808176730733], "gaussian_params_": [[7.384408136190593, 0.4738122953299285, 0.2760283731841686], [8.924713144105155, 1.495867961656031, 0.7113368198664118], [11.111529856404445, 0.21813607809250563, 1.6841247376035664], [18.403276562901308, 0.40330506133505156, 0.27550422138283404], [43.6545643156729, 0.10768491055734933, 1.6864619942740102], [53.08570593885555, 0.125155342396484, 1.7589776436062303], [57.43458959352584, 0.34205985861977023, 0.2989876422493109], [64.03754169298426, 0.16886387517626508, 0.7915607659939956], [67.78443520934617, 0.22422880635248602, 0.582807101040644]], "peak_params_": [[7.384408136190593, 0.2292124129105083, 0.5520567463683372], [8.924713144105155, 1.5869110959198485, 1.4226736397328237], [11.111529856404445, 0.23887342595522065, 3.368249475207133], [18.403276562901308, 0.13820530189989266, 0.5510084427656681], [43.6545643156729, 0.10544969293758832, 3.3729239885480204], [53.08570593885555, 0.12500688726794307, 3.5179552872124606], [57.43458959352584, 0.12946040717641694, 0.5979752844986218], [64.03754169298426, 0.1686740647181051, 1.5831215319879912], [67.78443520934617, 0.20940428749350648, 1.165614202081288]], "r_squared_": 0.9858916671802779, "error_": 0.040647839545793915}
{"freq_range": [2.0, 80.0], "freq_res": 1.0, "aperiodic_params_": [-0.00511666379010231, 0.5099729900561507], "gaussian_params_": [[9.074081048600503, 1.4459274048211441, 0.739093866827955], [47.57588765119376, 0.5128536617703177, 0.29341579058406003], [49.57929672179415, 0.4314425781310213, 0.33374102889271257], [51.66135886945462, 0.2709798431628697, 0.7131350389785361], [57.38939687142739, 0.25448243858405334, 0.7743326616869699], [64.329173088526, 0.14980113868844558, 2.0393181888531045], [74.13181452026342, 0.12611389693809985, 5.999999999999998]], "peak_params_": [[9.074081048600503, 1.4386823577783292, 1.47818773365591], [47.57588765119376, 0.18044817319738227, 0.5868315811681201], [49.57929672179415, 0.21292894625311343, 0.6674820577854251], [51.66135886945462, 0.24222705260066002, 1.4262700779570723], [57.38939687142739, 0.22663064761422347, 1.5486653233739398], [64.329173088526, 0.17817117651564718, 4.078636377706209], [74.13181452026342, 0.1260854266650181, 11.999999999999996]], "r_squared_": 0.9122969262581437, "error_": 0.05872453674516437}
{"freq_range": [2.0, 80.0], "freq_res": 1.0, "aperiodic_params_": [0.387321515477107, 0.9681773377664591], "gaussian_params_": [[9.000899494896716, 1.4240721257120086, 0.7048143773505151], [10.897242873012988, 0.3051750064036394, 2.133142557923387], [15.575327384286059, 0.9459890390876408, 0.2523310283430333], [18.639701731160066, 0.24630576239027083, 1.3305134816777573]], "peak_params_": [[9.000899494896716, 1.629552964620462, 1.4096287547010302], [10.897242873012988, 0.3303251164788949, 4.266285115846774], [15.575327384286059, 0.28139218959211937, 0.5046620566860666], [18.639701731160066, 0.23766302958017604, 2.6610269633555146]], "r_squared_": 0.982045196499557, "error_": 0.04904444138852297}
{"freq_range": [2.0, 80.0], "freq_res": 1.0, "aperiodic_params_": [0.5632715979918175, 1.1984679390281134], "gaussian_params_": [[6.702328917015813, 0.5637686971753065, 0.2611311231411157], [9.005856480355714, 1.7166365238242347, 0.7810218844616738], [12.392220507362415, 0.3556024449374994, 1.9691768970576486], [15.5966201487745, 0.7206923468036269, 0.29876625739515505], [18.161597764441964, 0.3278507675578696, 0.6655928585362887], [20.363421276500898, 0.22671447767243347, 1.1703680953727706], [61.94722406953815, 0.09540570831632161, 5.999999664575299], [75.90007903148681, 0.14673752421494668, 3.247324834355468]], "peak_params_": [[6.702328917015813, 0.3662107267382154, 0.5222622462822314], [9.005856480355714, 1.797231600729654, 1.5620437689233475], [12.392220507362415, 0.3497230394026388, 3.9383537941152973], [15.5966201487745, 0.3579570276067696, 0.5975325147903101], [18.161597764441964, 0.3540043303257212, 1.3311857170725774], [20.363421276500898, 0.22347666822187873, 2.3407361907455413], [61.94722406953815, 0.09541743025107108, 11.999999329150597], [75.90007903148681, 0.1528113202894843, 6.494649668710936]], "r_squared_": 0.9913153398355152, "error_": 0.03887048381011924}
{"freq_range": [2.0, 80.0], "freq_res": 1.0, "aperiodic_params_": [0.8598625865941597, 1.3559277851703493], "gaussian_params_": [[6.643729515003688, 0.5067490891067578, 0.2788127289836603], [8.933603493370532, 1.639524051981871, 0.7095513163455556], [10.665437926461848, 0.36172351927780444, 0.8956890513533251], [12.860726539070948, 0.3400737876006377, 0.7476785163650269], [15.914488544477145, 0.27431177489880404, 0.5649588164564238], [18.492658567884895, 0.26889581637362436, 0.7995724883037771], [62.92694148102084, 0.0974505310587862, 5.999999999999999], [75.74413192856662, 0.2042135353158299, 1.9860095010043741], [79.38784051323321, 0.48147193882269274, 0.26028306584664074]], "peak_params_": [[6.643729515003688, 0.26408323028482805, 0.5576254579673205], [8.933603493370532, 1.6965753919586142, 1.4191026326911111], [10.665437926461848, 0.3763264865641582, 1.7913781027066502], [12.860726539070948, 0.3463362105020463, 1.4953570327300538], [15.914488544477145, 0.2733234504640256, 1.1299176329128475], [18.492658567884895, 0.22270691607773097, 1.5991449766075543], [62.92694148102084, 0.09744330729896378, 11.999999999999998], [75.74413192856662, 0.21160202374079518, 3.9720190020087482], [79.38784051323321, 0.214611597525314, 0.5205661316932815]], "r_squared_": 0.9917491180064936, "error_": 0.0378421750326924}
{"freq_range": [2.0, 80.0], "freq_res": 1.0, "aperiodic_params_": [0.6198624262226012, 1.2894354896849978], "gaussian_params_": [[7.029744547465362, 0.33830595336733515, 0.2500877671232557], [8.992043695138278, 1.816985416022822, 0.7798568382272287], [12.022438149002843, 0.4696725400225814, 1.5207934805363608], [15.563275866946917, 0.7567528593724705, 0.2933027773939268], [18.12092557046222, 0.3650969142809381, 0.895387208563974], [63.65732102540404, 0.14339168802181065, 3.1200142909899866], [75.12608154167127, 0.20893104854008498, 2.7240501898557268], [78.6251584796307, 0.5296692235111956, 0.2597595893713632]], "peak_params_": [[7.029744547465362, 0.4075163706977397, 0.5001755342465114], [8.992043695138278, 1.8820699733532673, 1.5597136764544575], [12.022438149002843, 0.47069015055610913, 3.0415869610727215], [15.563275866946917, 0.2871996510765936, 0.5866055547878536], [18.12092557046222, 0.3619899522907545, 1.790774417127948], [63.65732102540404, 0.14257924253568732, 6.240028581979973], [75.12608154167127, 0.208900833642103, 5.4481003797114536], [78.6251584796307, 0.2630004474859384, 0.5195191787427264]], "r_squared_": 0.9893454356004204, "error_": 0.04504329072740097}
{"freq_range": [2.0, 80.0], "freq_res": 1.0, "aperiodic_params_": [0.579606749159305, 1.2442766464852335], "gaussian_params_": [[6.59069324639371, 0.9228909575249968, 0.28133372258960304], [8.980103925331496, 1.7029714255914667, 0.7555772128348524], [12.022925617356043, 0.5251354846409373, 1.7738129678832508], [15.240818316632284, 0.27221432421529107, 0.5904164870275275], [17.851267887084216, 0.6207237123202637, 1.6880780936831747], [22.137304903277418, 0.2420111005297605, 0.913651989472125], [24.718230784957843, 0.20454735443140523, 0.6037469854514684], [64.08921395219132, 0.1358022667024686, 1.4637274433311334], [76.85957512586245, 0.13634995055505045, 3.831540124217213]], "peak_params_": [[6.59069324639371, 0.3847412037623702, 0.5626674451792061], [8.980103925331496, 1.8252993146203425, 1.5111544256697047], [12.022925617356043, 0.5271976401726562, 3.5476259357665016], [15.240818316632284, 0.5279682559773605, 1.180832974055055], [17.851267887084216, 0.6201301967660416, 3.3761561873663495], [22.137304903277418, 0.26959202978349706, 1.82730397894425], [24.718230784957843, 0.18530717697049437, 1.2074939709029369], [64.08921395219132, 0.13603849285386893, 2.9274548866622667], [76.85957512586245, 0.1362584085349885, 7.663080248434426]], "r_squared_": 0.9938531084179485, "error_": 0.03674681924590672}
{"freq_range": [2.0, 80.0], "freq_res": 1.0, "aperiodic_params_": [0.6273610630087414, 1.2818973767168491], "gaussian_params_": [[6.628632280973716, 0.6366667332814823, 0.2921921299976897], [9.028096620100804, 1.7903565571219937, 0.7780951830890498], [11.836740442424146, 0.39549739430638436, 0.9646670871142097], [16.859244442656816, 0.31563963682810287, 2.9644145669294075], [25.024186611121955, 0.20196508656970052, 0.6159620885172797], [64.41336167079822, 0.18219329461865727, 1.6548022213280094], [75.72595110185938, 0.18640753349501235, 2.871846123555675], [79.30973614246611, 0.23278662373423248, 0.2500050494461275]], "peak_params_": [[6.628632280973716, 0.34507148574401697, 0.5843842599953794], [9.028096620100804, 1.8038254569044727, 1.5561903661780996], [11.836740442424146, 0.47345257743856556, 1.9293341742284194], [16.859244442656816, 0.3152842679340163, 5.928829133858815], [25.024186611121955, 0.2090805268652668, 1.2319241770345595], [64.41336167079822, 0.17664153282061612, 3.3096044426560187], [75.72595110185938, 0.18556073721792, 5.74369224711135], [79.30973614246611, 0.20538443188411803, 0.500010098892255]], "r_squared_": 0.9925304189285804, "error_": 0.03993904656688548}
{"freq_range": [2.0, 80.0], "freq_res": 1.0, "aperiodic_params_": [0.5834405046206252, 1.2056158086280178], "gaussian_params_": [[8.9468784840943, 1.312861634137264, 0.6342953879117742], [10.299320113701608, 0.42874845699767783, 2.25151554456628], [17.884028246767173, 0.2693219720077048, 2.163862540212995], [25.12193399539819, 0.17021941689787567, 0.6218043321356809], [70.8706981712005, 0.09842496257515607, 5.9999999999996785], [77.73099837473643, 0.1553947555753327, 1.1012440776852905]], "peak_params_": [[8.9468784840943, 1.6713073706586867, 1.2685907758235484], [10.299320113701608, 0.7561789685408851, 4.50303108913256], [17.884028246767173, 0.2701714931346575, 4.32772508042599], [25.12193399539819, 0.1681854539836709, 1.2436086642713617], [70.8706981712005, 0.09840211138243382, 11.999999999999357], [77.73099837473643, 0.19941459078518897, 2.202488155370581]], "r_squared_": 0.9933186550640153, "error_": 0.03500404585947283}
{"freq_range": [2.0, 80.0], "freq_res": 1.0, "aperiodic_params_": [0.10881116968095103, 0.6644348886802057], "gaussian_params_": [[8.928734870803623, 1.418686986226998, 0.7878401743189335], [19.777637204817058, 0.2171365337805105, 1.3304450794675329], [41.66876212029459, 0.1196757325034222, 3.133602625120177], [54.01270523348108, 0.2070820502732721, 1.3345443067318727], [57.83930725280619, 0.14948252023483247, 0.9314944337768931], [63.70332293225257, 0.10286540199678151, 1.3732859208346326], [76.45203571387245, 0.10611974507073053, 5.999999999898718]], "peak_params_": [[8.928734870803623, 1.4128947480378649, 1.575680348637867], [19.777637204817058, 0.21412488790316608, 2.6608901589350658], [41.66876212029459, 0.11900900116712154, 6.267205250240354], [54.01270523348108, 0.20725182902430606, 2.6690886134637455], [57.83930725280619, 0.15061742546867918, 1.8629888675537862], [63.70332293225257, 0.11281065931363332, 2.7465718416692653], [76.45203571387245, 0.10581900376613418, 11.999999999797437]], "r_squared_": 0.957844255730235, "error_": 0.05380780925617528}
{"freq_range": [2.0, 80.0], "freq_res": 1.0, "aperiodic_params_": [0.20764653466461483, 0.9753931356576627], "gaussian_params_": [[9.067083322606765, 1.3178392284482643, 0.7234293277047711], [12.098413576168829, 0.2723458192928685, 2.306210227047977], [18.19602907899569, 0.2541031067321718, 0.5549333401587623], [48.39701704324207, 0.47044323838063745, 0.2844411779736483], [51.721289572338115, 0.18856954263908554, 0.42756841277300556], [65.35238118331301, 0.16406745924355773, 5.999999999999999], [74.74853909595467, 0.253387391352709, 0.7105351466724579], [77.33425004203447, 0.36377917867663717, 0.34075927215268687], [79.10782226753442, 0.24942188089070053, 0.6174381076853286]], "peak_params_": [[9.067083322606765, 1.4226356915733618, 1.4468586554095422], [12.098413576168829, 0.27245337778681167, 4.612420454095954], [18.19602907899569, 0.24904069875101575, 1.1098666803175246], [48.39701704324207, 0.18011236954716758, 0.5688823559472966], [51.721289572338115, 0.16626874891350063, 0.8551368255460111], [65.35238118331301, 0.16378474939809085, 11.999999999999998], [74.74853909595467, 0.2830458028977634, 1.4210702933449157], [77.33425004203447, 0.25219401258766516, 0.6815185443053737], [79.10782226753442, 0.25799645654606684, 1.2348762153706572]], "r_squared_": 0.9864435295369877, "error_": 0.03454144561529148}
{"freq_range": [2.0, 80.0], "freq_res": 1.0, "aperiodic_params_": [0.7102435164363442, 1.2647910258526183], "gaussian_params_": [[9.097948113922131, 1.5893177201882847, 0.8035221914598973], [11.474240083967219, 1.0889668016237983, 0.313521941915287], [13.367262645909722, 0.357653514175022, 0.6859994198506021], [15.548363604121631, 0.5510717876205283, 0.4435497573032106], [17.74681746476819, 0.35045742363789417, 0.5931277693310066], [19.852319384223367, 0.2090909853576045, 2.0388269583403327], [71.45008215589377, 0.13887615597478314, 5.999999999999999], [79.02489857167899, 0.20514751635029707, 0.2500000000112222]], "peak_params_": [[9.097948113922131, 1.5775536026222254, 1.6070443829197947], [11.474240083967219, 0.4443068148200004, 0.627043883830574], [13.367262645909722, 0.3106585632175474, 1.3719988397012042], [15.548363604121631, 0.3680413987156363, 0.8870995146064212], [17.74681746476819, 0.4583287187139179, 1.1862555386620133], [19.852319384223367, 0.20880080843899906, 4.077653916680665], [71.45008215589377, 0.13848597330653378, 11.999999999999998], [79.02489857167899, 0.26705476417223784, 0.5000000000224444]], "r_squared_": 0.9875832283618461, "error_": 0.04410077339711232}
{"freq_range": [2.0, 80.0], "freq_res": 1.0, "aperiodic_params_": [0.6361385487341803, 1.236182277509693], "gaussian_params_": [[7.55845211400198, 1.9534699948687493, 0.28313861623402553], [9.25546580385458, 1.9221613329699205, 0.5617867071208088], [11.235954319230139, 0.38738182539729477, 0.6813747671900171], [13.311976737762356, 0.1994079039749206, 0.3071579158733432], [17.179743421919884, 0.49190586853923957, 3.613979830844475], [64.38156307255198, 0.13469832597165082, 1.601447401453385], [72.45131066343545, 0.08584065135610112, 2.2215196556394416], [75.48303726023921, 0.18604203782738796, 1.1053806335128014], [78.63562895506516, 0.21773523940518882, 0.6631770883733228]], "peak_params_": [[7.55845211400198, 0.7568249135370714, 0.5662772324680511], [9.25546580385458, 1.7731070072302852, 1.1235734142416176], [11.235954319230139, 0.4943323907817032, 1.3627495343800342], [13.311976737762356, 0.3846367261727013, 0.6143158317466864], [17.179743421919884, 0.49129784831265066, 7.22795966168895], [64.38156307255198, 0.13099056850060475, 3.20289480290677], [72.45131066343545, 0.08538808945475052, 4.443039311278883], [75.48303726023921, 0.2135511023570651, 2.2107612670256027], [78.63562895506516, 0.18952309034448178, 1.3263541767466456]], "r_squared_": 0.9938308973570747, "error_": 0.03513919186351402}
{"freq_range": [2.0, 80.0], "freq_res": 1.0, "aperiodic_params_": [0.639558232033123, 1.2704533260286568], "gaussian_params_": [[6.68462364638604, 0.6394889595230356, 0.2704062684743818], [8.974869546500244, 1.7052958656496562, 0.7586965284343941], [11.550100164946027, 0.48585948938180173, 1.608343934487606], [15.54006590517458, 0.7918626309515396, 0.2623265879100494], [17.866801258347436, 0.3367266233856103, 2.7496800773452876], [64.1294922474447, 0.12312118153828673, 3.2759485884193245], [74.99874898625032, 0.1789468600331515, 2.2504465710212997], [78.59259245359492, 0.5881254307524472, 0.2509962142008574]], "peak_params_": [[6.68462364638604, 0.39056513240882434, 0.5408125369487636], [8.974869546500244, 1.8444531630675824, 1.5173930568687881], [11.550100164946027, 0.5023929409544186, 3.216687868975212], [15.54006590517458, 0.4482599367458782, 0.5246531758200988], [17.866801258347436, 0.33648819367159577, 5.499360154690575], [64.1294922474447, 0.1230261959445147, 6.551897176838649], [74.99874898625032, 0.17944724866047768, 4.5008931420425995], [78.59259245359492, 0.19436980241388802, 0.5019924284017148]], "r_squared_": 0.9917822409555568, "error_": 0.038630954530903976}
{"freq_range": [2.0, 80.0], "freq_res": 1.0, "aperiodic_params_": [0.5631386915332973, 1.2362399482123445], "gaussian_params_": [[6.666972857664532, 0.5816796755289295, 0.29552336186739725], [9.00791052106111, 1.8272841598274447, 0.7846747420613448], [11.64088237036169, 0.470712551565152, 1.3063806667137798], [16.910007654192853, 0.36421114873257426, 2.865642876729359], [63.96571369664141, 0.12166220167757064, 1.8080554566422333], [75.02543840266323, 0.1870134660968405, 2.7717068126057827], [78.96652108319735, 0.12761413411623745, 0.2500088576676107]], "peak_params_": [[6.666972857664532, 0.37921342366288546, 0.5910467237347945], [9.00791052106111, 1.8962666314789973, 1.5693494841226896], [11.64088237036169, 0.538450236744749, 2.6127613334275597], [16.910007654192853, 0.36413594648714076, 5.731285753458718], [63.96571369664141, 0.1217088597360847, 3.6161109132844667], [75.02543840266323, 0.18700559085317514, 5.543413625211565], [78.96652108319735, 0.19336420037179836, 0.5000177153352214]], "r_squared_": 0.9926017213802528, "error_": 0.04174738580794103}
{"freq_range": [2.0, 80.0], "freq_res": 1.0, "aperiodic_params_": [0.5309317935987988, 1.217744642141243], "gaussian_params_": [[6.625328078199742, 0.6775929333118607, 0.307933436864876], [9.01089957557827, 1.838642432393876, 0.7785052137945595], [11.706716222508698, 0.4791011151549023, 1.2926906362996247], [15.464524605015566, 0.2441405560040406, 0.2846118107154475], [17.023529846016746, 0.4421318427350863, 2.885033317377418], [75.04808048564571, 0.19237140923683468, 2.7712739610384802], [79.19435264287496, 0.20666492021125069, 0.25726548856193715]], "peak_params_": [[6.625328078199742, 0.39032650837350313, 0.615866873729752], [9.01089957557827, 1.9012153930923343, 1.557010427589119], [11.706716222508698, 0.5651761873403182, 2.5853812725992493], [15.464524605015566, 0.42883358582434816, 0.569223621430895], [17.023529846016746, 0.4422267693095707, 5.770066634754836], [75.04808048564571, 0.1923424587001743, 5.5425479220769605], [79.19435264287496, 0.2249514011137861, 0.5145309771238743]], "r_squared_": 0.9894578028737777, "error_": 0.048235278820146096}
{"freq_range": [2.0, 80.0], "freq_res": 1.0, "aperiodic_params_": [0.6586221632258331, 1.2868892005991148], "gaussian_params_": [[6.608744459264127, 0.8639634709441785, 0.28614907198636713], [9.03464868724754, 1.8129438112323173, 0.7874535542076969], [11.991574443474311, 0.43708880013577006, 1.094091997853627], [17.223102454122518, 0.26601878015163455, 2.3422536174830912], [73.42338086668872, 0.1235257838787764, 5.999999999999999], [78.61535979268011, 0.39306471233778706, 0.25001649747444804]], "peak_params_": [[6.608744459264127, 0.4036569326045134, 0.5722981439727343], [9.03464868724754, 1.8221514307524387, 1.5749071084153938], [11.991574443474311, 0.4607227358105702, 2.188183995707254], [17.223102454122518, 0.2648270545812036, 4.6845072349661825], [73.42338086668872, 0.12321863631195784, 11.999999999999998], [78.61535979268011, 0.20056706183532613, 0.5000329949488961]], "r_squared_": 0.9905546745726161, "error_": 0.04561035974208886}
{"freq_range": [2.0, 80.0], "freq_res": 1.0, "aperiodic_params_": [0.5933346424254821, 1.2152399353243393], "gaussian_params_": [[6.53942951793501, 1.1636895997478616, 0.25362240139724257], [8.995279439486994, 1.612010883340641, 0.7380072506154842], [11.563913659967186, 0.3250981720919371, 0.9377653683319668], [16.94287818184398, 0.5099763178512844, 3.5374461497981917], [65.25119869024407, 0.18701583223777393, 0.5377919902516373], [73.54796540086404, 0.10611835424403852, 2.649962112388934], [78.68426147835238, 0.29593832520810914, 0.4101326749279888]], "peak_params_": [[6.53942951793501, 0.27525885566867203, 0.5072448027944851], [8.995279439486994, 1.6607170106643077, 1.4760145012309684], [11.563913659967186, 0.48430955171072976, 1.8755307366639336], [16.94287818184398, 0.5099098504248377, 7.074892299596383], [65.25119869024407, 0.16827198413105848, 1.0755839805032745], [73.54796540086404, 0.10458561215088036, 5.299924224777868], [78.68426147835238, 0.23282532768580988, 0.8202653498559777]], "r_squared_": 0.9917656893269466, "error_": 0.04404015900116413}
{"freq_range": [2.0, 80.0], "freq_res": 1.0, "aperiodic_params_": [0.7057768510497998, 1.1894939189723372], "gaussian_params_": [[8.880374447133693, 1.1821496819915953, 0.6186818705255421], [11.934618782461103, 0.31471774497922106, 1.5272581980160629], [14.594936726416904, 0.5435393901687593, 0.2711809444205841], [17.520883569673227, 0.19073966952292662, 1.3088300773082882], [52.7183465173801, 0.162317586004626, 1.588569394113077], [70.09593072054805, 0.19285800477293932, 5.999999999999999], [70.97737655355526, 0.0889082750248996, 0.2500172798692026]], "peak_params_": [[8.880374447133693, 1.2099369329770902, 1.2373637410510843], [11.934618782461103, 0.3144591586315075, 3.0545163960321258], [14.594936726416904, 0.24996891277908895, 0.5423618888411682], [17.520883569673227, 0.17849684140715705, 2.6176601546165763], [52.7183465173801, 0.16311516188762654, 3.177138788226154], [70.09593072054805, 0.19287606034601623, 11.999999999999998], [70.97737655355526, 0.279226096583286, 0.5000345597384052]], "r_squared_": 0.981390578030163, "error_": 0.0493407935454025}
{"freq_range": [2.0, 80.0], "freq_res": 1.0, "aperiodic_params_": [0.5100577906598662, 1.181396724730186], "gaussian_params_": [[9.208632893210172, 1.154247242008704, 0.9141627046175388], [11.463413425442758, 1.214178517080719, 0.3102565252942246], [13.352086908619864, 0.46460195216650707, 0.6767045553658882], [15.543386647931756, 0.9779669896556715, 0.28818695611876394], [18.111095964867708, 0.3452979245370685, 0.7657543555896446], [43.34013177979999, 0.4218457565162917, 0.25001981004114254], [51.114604532283586, 0.16023494147557288, 1.1388671767035956], [60.885334757281214, 0.12123769036307522, 3.733936803071732], [66.70399921046491, 0.18143421302834145, 1.0267796215555318], [74.12345774895076, 0.24183156339768833, 3.088008827780831], [78.60423976694645, 1.010828880449239, 0.26272194110019204]], "peak_params_": [[9.208632893210172, 1.124575397484761, 1.8283254092350776], [11.463413425442758, 0.5682862276862306, 0.6205130505884492], [13.352086908619864, 0.40600454863049507, 1.3534091107317765], [15.543386647931756, 0.28667740108112316, 0.5763739122375279], [18.111095964867708, 0.34168300779709315, 1.531508711179289], [43.34013177979999, 0.16721441887777, 0.5000396200822851], [51.114604532283586, 0.16307052171433178, 2.277734353407191], [60.885334757281214, 0.12120952325554613, 7.467873606143464], [66.70399921046491, 0.2226720366993018, 2.0535592431110636], [74.12345774895076, 0.24189239349732183, 6.176017655561662], [78.60423976694645, 0.3945346380620165, 0.5254438822003841]], "r_squared_": 0.9896874447355269, "error_": 0.03968437687023354}
{"freq_range": [2.0, 80.0], "freq_res": 1.0, "aperiodic_params_": [0.7438100278201935, 1.290728203273777], "gaussian_params_": [[9.142476144485588, 1.4470276840662062, 0.8221422552166473], [11.489372602787677, 1.899006752085677, 0.282754075146], [13.468386396401364, 0.5219505321460469, 0.6036586073805617], [15.4932940372082, 1.463683642112591, 0.26970166086802094], [18.21774439016897, 0.42423945607660324, 0.8094412829945395], [76.45203459913596, 0.14994267387168855, 5.999999999999999]], "peak_params_": [[9.142476144485588, 1.4254611396418493, 1.6442845104332946], [11.489372602787677, 0.5375317079951976, 0.565508150292], [13.468386396401364, 0.38630134206093963, 1.2073172147611233], [15.4932940372082, 0.29583294834643276, 0.5394033217360419], [18.21774439016897, 0.4091639754750156, 1.618882565989079], [76.45203459913596, 0.1495177413274924, 11.999999999999998]], "r_squared_": 0.9871413412678502, "error_": 0.048355793293508816}
{"freq_range": [2.0, 80.0], "freq_res": 1.0, "aperiodic_params_": [0.7238892752233969, 1.3134983993488578], "gaussian_params_": [[9.123518626477674, 1.6421303045785254, 0.8418680243199981], [11.469858372467348, 2.189560286661798, 0.27338048986127844], [13.43786223108775, 0.441192413868289, 0.6084512760607776], [15.521430596402377, 1.1564151539656233, 0.2700023792961916], [18.39393203625214, 0.8770391066311908, 0.2514359001535748], [18.539531410749245, 0.24344237057909734, 3.3584200893795124], [72.01254652085936, 0.12362351764795604, 5.999999999999999], [78.73896263718514, 0.3571305234474369, 0.2500000000017753]], "peak_params_": [[9.123518626477674, 1.628859309207674, 1.6837360486399962], [11.469858372467348, 0.656629908409969, 0.5467609797225569], [13.43786223108775, 0.40304642717493283, 1.2169025521215553], [15.521430596402377, 0.42336146227831817, 0.5400047585923832], [18.39393203625214, 0.4973609117137904, 0.5028718003071496], [18.539531410749245, 0.28917787149847896, 6.716840178759025], [72.01254652085936, 0.12362324736743235, 11.999999999999998], [78.73896263718514, 0.2698012615418097, 0.5000000000035506]], "r_squared_": 0.9915058683419862, "error_": 0.040691209388158164}
{"freq_range": [2.0, 80.0], "freq_res": 1.0, "aperiodic_params_": [0.4905450720522072, 1.1850942168291834], "gaussian_params_": [[6.685052468455965, 0.4416182695255733, 0.2905163865877629], [9.001080542040388, 1.494809702378242, 0.730877131580944], [11.30871810736159, 0.654159903950666, 2.066994564761364], [15.481761939174673, 0.7235029246957615, 0.31712420203103797], [17.825155292020387, 0.4639726024328465, 1.4127422537773853], [22.07717672645025, 0.19866217420853477, 0.8552825586204602], [63.57936163084625, 0.16141263739628925, 2.0513614637446427], [75.4809698803218, 0.21609954976569312, 1.118329905151251], [78.83850142087098, 0.2056671684508972, 0.5171129524913156]], "peak_params_": [[6.685052468455965, 0.35509677088124103, 0.5810327731755258], [9.001080542040388, 1.8453812147948985, 1.461754263161888], [11.30871810736159, 0.6824159509339353, 4.133989129522728], [15.481761939174673, 0.42380284629970993, 0.6342484040620759], [17.825155292020387, 0.46390321230220344, 2.8254845075547705], [22.07717672645025, 0.203746960814294, 1.7105651172409204], [63.57936163084625, 0.1580546138072707, 4.102722927489285], [75.4809698803218, 0.19701019625633887, 2.236659810302502], [78.83850142087098, 0.19740728410274833, 1.0342259049826312]], "r_squared_": 0.9924895419299496, "error_": 0.03806996082411389}
{"freq_range": [2.0, 80.0], "freq_res": 1.0, "aperiodic_params_": [0.6020611151633364, 1.2288041079951129], "gaussian_params_": [[9.022398890032921, 1.6305159408132017, 0.8131669082565867], [11.550183819994528, 0.38123900464019733, 0.9683644095031386], [16.23988217415484, 0.48565603147151926, 3.708194983200567]], "peak_params_": [[9.022398890032921, 1.7139975504145077, 1.6263338165131733], [11.550183819994528, 0.5968568285576168, 1.9367288190062772], [16.23988217415484, 0.48465082388819447, 7.416389966401134]], "r_squared_": 0.9843495165377096, "error_": 0.061077732570674406}
{"freq_range": [2.0, 80.0], "freq_res": 1.0, "aperiodic_params_": [0.7749515851632092, 1.3396599281806882], "gaussian_params_": [[6.786834165658184, 0.3053310529242798, 0.2939161213492742], [8.980500608707164, 1.4177039810884455, 0.6929293617792989], [11.120838977982569, 0.4511802343042132, 1.4896588772482366], [16.95678563306357, 0.5248134731445496, 2.989395159321211], [63.16267445464859, 0.10829268763213036, 3.953036945085297], [71.80877133826138, 0.1829993410889071, 0.6959677384426486], [75.56292396076817, 0.23261874900712087, 1.143496718576721], [79.44951096132601, 0.7865620389278355, 0.2766063006973953]], "peak_params_": [[6.786834165658184, 0.27046084889757244, 0.5878322426985484], [8.980500608707164, 1.5960940427106307, 1.3858587235585977], [11.120838977982569, 0.5420591940968602, 2.9793177544964733], [16.95678563306357, 0.5249457324752254, 5.978790318642422], [63.16267445464859, 0.10820103134596426, 7.906073890170594], [71.80877133826138, 0.18693259454401123, 1.3919354768852972], [75.56292396076817, 0.21678734286933676, 2.286993437153442], [79.44951096132601, 0.21259636138809568, 0.5532126013947906]], "r_squared_": 0.9927596576902326, "error_": 0.04073004699360792}
{"freq_range": [2.0, 80.0], "freq_res": 1.0, "aperiodic_params_": [0.6550691830025313, 1.2488773516532203], "gaussian_params_": [[8.934434470844021, 1.0989747135509513, 0.5873431310404792], [11.451298620335304, 0.5086196792076912, 2.2643740824806065], [17.54035144770236, 0.4353050602109533, 2.1239543400090133], [23.494883562384054, 0.14839188166677708, 2.043185366945916], [64.04597266517455, 0.16721554949041648, 2.2726150809622063], [75.13592585650233, 0.15456097872709765, 2.949553054541936], [79.00439926930167, 0.11217802932149108, 0.25003907129889424]], "peak_params_": [[8.934434470844021, 1.3753666933054276, 1.1746862620809584], [11.451298620335304, 0.5046837448071125, 4.528748164961213], [17.54035144770236, 0.436984348967776, 4.247908680018027], [23.494883562384054, 0.16009853570371957, 4.086370733891832], [64.04597266517455, 0.1673054644620906, 4.545230161924413], [75.13592585650233, 0.15439845380858697, 5.899106109083872], [79.00439926930167, 0.1776880299805963, 0.5000781425977885]], "r_squared_": 0.9916887593870942, "error_": 0.03915041552756924}
{"freq_range": [2.0, 80.0], "freq_res": 1.0, "aperiodic_params_": [0.48423959522543164, 1.1325268866621743], "gaussian_params_": [[7.43030470318439, 0.7102376238985517, 0.3000658733814232], [8.957950723979012, 0.932048267243688, 0.6396448777228069], [11.462325115034814, 0.46591864475132166, 1.3401959958920664], [14.438167093496562, 0.345701261522564, 0.9895450376759624], [16.73856725597071, 0.3627337328213361, 0.25212953821833944], [18.863979334013873, 0.26121700886509724, 1.458333863032264], [23.69397551688954, 0.31893830149018443, 0.2500305549695524], [51.89066357398782, 0.15977122568013144, 0.5506191537418453], [56.41282839840646, 0.5321811598959304, 0.2568045589029091], [62.020039822140674, 0.059202117992795865, 0.25000000000024697], [64.66741928390165, 0.16800406731727197, 4.6596595235543905], [71.07106253906903, 0.19611258740155918, 0.2500000000000001], [75.57519726220951, 0.1666326863710785, 1.8802073091944917], [78.57498924319054, 0.7479532708571165, 0.27768958064929417]], "peak_params_": [[7.43030470318439, 0.264440106047983, 0.6001317467628464], [8.957950723979012, 1.0161967699787804, 1.2792897554456137], [11.462325115034814, 0.44553667243347195, 2.680391991784133], [14.438167093496562, 0.3920029805402668, 1.9790900753519247], [16.73856725597071, 0.3395123945934141, 0.5042590764366789], [18.863979334013873, 0.26009169746558836, 2.916667726064528], [23.69397551688954, 0.15133201151029907, 0.5000611099391048], [51.89066357398782, 0.1608258197921506, 1.1012383074836907], [56.41282839840646, 0.17596840506315403, 0.5136091178058182], [62.020039822140674, 0.20162584382364734, 0.5000000000004939], [64.66741928390165, 0.167576701584764, 9.319319047108781], [71.07106253906903, 0.2636982123613676, 0.5000000000000002], [75.57519726220951, 0.17116142812813662, 3.7604146183889835], [78.57498924319054, 0.2650484854325623, 0.5553791612985883]], "r_squared_": 0.9910304732793075, "error_": 0.032149508550602425}
{"freq_range": [2.0, 80.0], "freq_res": 1.0, "aperiodic_params_": [0.30982669105609284, 1.0412697279466485], "gaussian_params_": [[9.125255688399346, 1.4878978649974564, 0.8750197153375959], [11.484778972183003, 1.9046732278172045, 0.3042086924010689], [13.462703066395914, 1.144856651249643, 0.3129468298733908], [17.98592258476195, 0.2540856463332623, 0.5521650412019343], [47.375197187807935, 0.5147974315184443, 0.2717944372644388], [52.630094716229195, 0.16188124036613052, 0.5872930120681509], [56.39681416129863, 0.48176356623566696, 0.25001923013822663], [63.881365444451085, 0.2110738474431337, 5.999999999999999], [70.04024071612814, 0.1303027989520166, 1.6643863335503686], [75.04141090755309, 0.07383663676269529, 0.2500000051197204], [79.54796540086404, 0.25925522222179925, 5.066475749552345]], "peak_params_": [[9.125255688399346, 1.4727315698993906, 1.7500394306751919], [11.484778972183003, 0.6849266842469601, 0.6084173848021378], [13.462703066395914, 0.383843591208922, 0.6258936597467816], [17.98592258476195, 0.25400308292853635, 1.1043300824038687], [47.375197187807935, 0.20256539862227996, 0.5435888745288776], [52.630094716229195, 0.17351595630255612, 1.1745860241363018], [56.39681416129863, 0.22580381189602594, 0.5000384602764533], [63.881365444451085, 0.21354995787366904, 11.999999999999998], [70.04024071612814, 0.2996633887186486, 3.328772667100737], [75.04141090755309, 0.28555887764318144, 0.5000000102394409], [79.54796540086404, 0.26394403323085935, 10.13295149910469]], "r_squared_": 0.9794771434173132, "error_": 0.04581511179266088}
{"freq_range": [2.0, 80.0], "freq_res": 1.0, "aperiodic_params_": [0.5378624301158227, 1.2885665071251884], "gaussian_params_": [[9.260532527631423, 0.5385206933536981, 0.25001509453208265], [9.733233907683926, 1.060687865459543, 1.7153439675655173], [13.475930497892296, 0.7677310726938932, 0.30531909132380125], [16.671260969207616, 0.36357789074707747, 3.3727725817152043], [63.142849357405204, 0.12406027147789371, 2.0531970269818354], [65.75922937543076, 0.14165572031713503, 0.5509315642453639], [75.85471039426454, 0.24557843801815932, 5.8459485592277876]], "peak_params_": [[9.260532527631423, 1.3083443907505279, 0.5000301890641653], [9.733233907683926, 1.1061326705526093, 3.4306879351310346], [13.475930497892296, 0.6018552173406986, 0.6106381826476025], [16.671260969207616, 0.36198941947130503, 6.745545163430409], [63.142849357405204, 0.14565056384164876, 4.106394053963671], [65.75922937543076, 0.23517633555401662, 1.1018631284907279], [75.85471039426454, 0.24550260643613786, 11.691897118455575]], "r_squared_": 0.9913961832588959, "error_": 0.04157532542674176}
{"freq_range": [2.0, 80.0], "freq_res": 1.0, "aperiodic_params_": [0.7154043487114267, 1.3018706574223369], "gaussian_params_": [[9.189038189064199, 1.4016450599488295, 0.8926288924083592], [11.38627820391862, 1.019028139020857, 0.3021976484047938], [12.521080825801135, 0.25273388808844727, 0.7281997141124612], [15.554127459035326, 0.29581398442235995, 3.889294962500788], [18.185939276695308, 0.07227685095778184, 0.26012685764546906], [64.61788820030388, 0.12830060773251434, 2.7503066243343635], [71.45688184377649, 0.5483546270394203, 0.31224209903379985], [75.41195769543681, 0.2132825464055259, 1.3788980106984807], [77.42280036167645, 0.20920846842971785, 0.2863846732410159], [79.21139329611064, 0.22035899296003159, 0.5419493785418175]], "peak_params_": [[9.189038189064199, 1.4420749457049968, 1.7852577848167184], [11.38627820391862, 0.8067501210629906, 0.6043952968095876], [12.521080825801135, 0.4421724400310123, 1.4563994282249224], [15.554127459035326, 0.2938792780709578, 7.778589925001576], [18.185939276695308, 0.2987219705364842, 0.5202537152909381], [64.61788820030388, 0.12706828827783578, 5.500613248668727], [71.45688184377649, 0.19795703672945208, 0.6244841980675997], [75.41195769543681, 0.204076624681923, 2.7577960213969615], [77.42280036167645, 0.180298546644035, 0.5727693464820318], [79.21139329611064, 0.21143943131272747, 1.083898757083635]], "r_squared_": 0.9926722472010687, "error_": 0.037467064538635776}
{"freq_range": [2.0, 80.0], "freq_res": 1.0, "aperiodic_params_": [0.6090382870053981, 1.2672853103142314], "gaussian_params_": [[9.044323007025877, 1.366897287449446, 0.7603998169685032], [11.045924041884504, 0.6575621989933328, 1.0078601356640775], [15.571122220836871, 0.3762288954977391, 4.057722806493677], [75.50128928851777, 0.24032097818598927, 2.2021300148510248], [79.44535784292952, 0.7856529530690461, 0.2536739276922645]], "peak_params_": [[9.044323007025877, 1.5497414174321462, 1.5207996339370065], [11.045924041884504, 0.9063973258936714, 2.015720271328155], [15.571122220836871, 0.37413700403772765, 8.115445612987354], [75.50128928851777, 0.23423659443423017, 4.4042600297020496], [79.44535784292952, 0.23626430254973574, 0.507347855384529]], "r_squared_": 0.9880680372562635, "error_": 0.0498243819864314}
{"freq_range": [2.0, 80.0], "freq_res": 1.0, "aperiodic_params_": [0.5876811460960085, 1.2318093607666134], "gaussian_params_": [[7.084791976682003, 0.15956279938096948, 0.28652758455429256], [8.944206380181965, 0.8053320964251621, 0.6410095820032927], [10.53937148553303, 0.655948075796697, 1.5329982576486307], [14.512859192969634, 0.2906473540822117, 0.2914919956975369], [16.32969334876109, 0.41497493170469824, 3.824007070490349], [44.58624275739277, 0.46016017115096974, 0.27580739559851736], [50.60920315535342, 0.3800035752315043, 0.2940709652763012], [63.22522415367896, 0.17011910000738162, 0.6530191271147859], [65.5083662071742, 0.7172544873649643, 0.28883986576240295], [75.748231897699, 0.18925167474811128, 1.7343051748445193], [79.47187860754825, 0.43362833881174734, 0.3140841192405702]], "peak_params_": [[7.084791976682003, 0.22762368069172212, 0.5730551691085851], [8.944206380181965, 1.2645905172739003, 1.2820191640065854], [10.53937148553303, 0.7888106741207728, 3.0659965152972615], [14.512859192969634, 0.4720724582161452, 0.5829839913950738], [16.32969334876109, 0.41458864363629955, 7.648014140980698], [44.58624275739277, 0.1493546422139287, 0.5516147911970347], [50.60920315535342, 0.1571445713501256, 0.5881419305526024], [63.22522415367896, 0.16029596808945, 1.3060382542295719], [65.5083662071742, 0.16850797199271716, 0.5776797315248059], [75.748231897699, 0.18726798376400278, 3.4686103496890386], [79.47187860754825, 0.17290612573349673, 0.6281682384811405]], "r_squared_": 0.9934809856075361, "error_": 0.035695304220981015}
{"freq_range": [2.0, 80.0], "freq_res": 1.0, "aperiodic_params_": [0.6125456781363295, 1.2580675644710784], "gaussian_params_": [[7.523834392525949, 1.1524843368214188, 0.30559736920651065], [9.219904507409776, 1.2316823008176894, 0.6186681605781179], [11.193195642507655, 0.65982769861215, 0.8827991608052257], [14.0975232186035, 0.45820277132663384, 1.3187737047917594], [17.29667768809436, 0.30607475095518705, 0.4994004110846292], [18.78242374006828, 0.32430275462821695, 0.8730411317302105], [23.481219866909008, 0.14309645618773628, 1.5564007118379384], [47.56091168322367, 0.6126822126136384, 0.25000623771808195], [51.65847661537956, 0.21232173328888174, 0.4975273998352765], [58.568768086307905, 0.1778034061938921, 1.0523446537845493], [63.74297646110387, 0.17342539568520002, 1.556139972295442], [69.8212122885704, 0.09355759116378491, 1.2180629806455863], [77.64512572621412, 0.20465107324834705, 5.999999999999999]], "peak_params_": [[7.523834392525949, 0.5195713307433542, 0.6111947384130213], [9.219904507409776, 1.1866950944833445, 1.2373363211562358], [11.193195642507655, 0.6928844915278773, 1.7655983216104514], [14.0975232186035, 0.46116216768518775, 2.6375474095835187], [17.29667768809436, 0.3375997730138164, 0.9988008221692584], [18.78242374006828, 0.31802247593602784, 1.746082263460421], [23.481219866909008, 0.13642032767518308, 3.1128014236758768], [47.56091168322367, 0.13104526037381659, 0.5000124754361639], [51.65847661537956, 0.16777662585206188, 0.995054799670553], [58.568768086307905, 0.16678833652487612, 2.1046893075690987], [63.74297646110387, 0.1864922412404335, 3.112279944590884], [69.8212122885704, 0.18348772476990494, 2.4361259612911725], [77.64512572621412, 0.2042934293774401, 11.999999999999998]], "r_squared_": 0.9945670086478461, "error_": 0.0316102626883595}
{"freq_range": [2.0, 80.0], "freq_res": 1.0, "aperiodic_params_": [0.180097345210784, 1.0468040610350426], "gaussian_params_": [[6.629632881685561, 0.49504701586772765, 0.3243412531079001], [8.95526672465016, 1.6522455210053217, 0.7700579311675904], [11.320664695441447, 0.580079185960218, 1.744579026390111], [14.385682267503165, 0.2891962492896915, 0.7896937553489408], [18.26086484234569, 0.4652755237392017, 0.9053237473805978], [51.09105115225105, 0.14280197015940135, 0.5957812015435466], [55.566080515014896, 0.18667658343627955, 1.1888502939271894], [64.21078179183395, 0.1650147346609131, 0.2845597042523617], [69.58273474250986, 0.3537344862575949, 0.29505090703330056], [73.45203459913596, 0.21075856929108586, 5.999999999999999]], "peak_params_": [[6.629632881685561, 0.3507221225984696, 0.6486825062158001], [8.95526672465016, 1.888930297256363, 1.5401158623351807], [11.320664695441447, 0.6190388996266856, 3.489158052780222], [14.385682267503165, 0.4350517734129338, 1.5793875106978816], [18.26086484234569, 0.4467443432096849, 1.8106474947611957], [51.09105115225105, 0.1414528835335207, 1.1915624030870933], [55.566080515014896, 0.1777137559849351, 2.377700587854379], [64.21078179183395, 0.18636191332515528, 0.5691194085047234], [69.58273474250986, 0.3087416701532031, 0.5901018140666011], [73.45203459913596, 0.21016128652462895, 11.999999999999998]], "r_squared_": 0.9906298637361179, "error_": 0.03765756635244414}
{"freq_range": [2.0, 80.0], "freq_res": 1.0, "aperiodic_params_": [0.5509474553030549, 1.2657943242221792], "gaussian_params_": [[9.399304418363112, 0.9491910894189298, 0.30398610298560175], [9.995665300163047, 0.9749337886165387, 1.775133780741069], [15.78351658191598, 0.3463495666354932, 4.477836115960995], [68.45203894071042, 0.1369831261843633, 5.999999999999933], [79.99939139353188, 0.1490883927211626, 4.704911451160036]], "peak_params_": [[9.399304418363112, 1.3435422930920666, 0.6079722059712035], [9.995665300163047, 1.2600585550914305, 3.550267561482138], [15.78351658191598, 0.34914079320184643, 8.95567223192199], [68.45203894071042, 0.1423626356688774, 11.999999999999867], [79.99939139353188, 0.17058079082560962, 9.409822902320071]], "r_squared_": 0.9877845393898339, "error_": 0.05582285595025674}
{"freq_range": [2.0, 80.0], "freq_res": 1.0, "aperiodic_params_": [0.4863483890584112, 1.241694131804374], "gaussian_params_": [[10.122332608200125, 1.076084420738303, 1.694880736585811], [15.582291310365207, 0.316466567976751, 3.9098718262892116], [18.548907964446915, 0.3552516048156434, 0.3171899347346657], [64.13836802107912, 0.14888130908668323, 2.7634740703542846], [71.45682687329665, 0.4307224124782239, 0.3314049871152406], [75.19203669330756, 0.19763838254072766, 2.2584933564170577], [79.12335737646085, 0.22942603045900564, 0.4874807235002232]], "peak_params_": [[10.122332608200125, 1.1874898193684658, 3.389761473171622], [15.582291310365207, 0.31729821464692787, 7.819743652578423], [18.548907964446915, 0.34520507460663763, 0.6343798694693314], [64.13836802107912, 0.1486957195750387, 5.526948140708569], [71.45682687329665, 0.20869008491138752, 0.6628099742304812], [75.19203669330756, 0.19699103232074888, 4.5169867128341155], [79.12335737646085, 0.26990173246408644, 0.9749614470004464]], "r_squared_": 0.9886578263482405, "error_": 0.047752084117655295}
{"freq_range": [2.0, 80.0], "freq_res": 1.0, "aperiodic_params_": [0.4973931039705925, 1.1981961284338183], "gaussian_params_": [[6.743193463046183, 0.273113010327746, 0.3449585826856869], [8.838708749830703, 0.8156493267324242, 0.6786080219216355], [10.662061591389316, 0.9945941193171833, 1.5207356829703904], [14.309588622695939, 0.43452367597704883, 0.9575368422971696], [18.08507063511085, 0.45582203366035806, 1.537897445900521], [21.877194455355486, 0.16222591997882313, 0.8282668193341055], [24.22702679856666, 0.2437695437659802, 0.2936263356983604], [47.944251732137985, 0.13139238491436644, 0.25000000055367394], [56.22677969391385, 0.20267551614409637, 0.577137894091374], [64.85079804666483, 0.21033338933191292, 1.6570111065431066], [76.4696627253064, 0.16418212742500707, 3.2798828151764203], [79.43779777228575, 0.576815157735524, 0.3091976125042236]], "peak_params_": [[6.743193463046183, 0.2825325752491405, 0.6899171653713738], [8.838708749830703, 1.340280619121534, 1.357216043843271], [10.662061591389316, 0.9765701464821936, 3.041471365940781], [14.309588622695939, 0.5152096679736093, 1.9150736845943392], [18.08507063511085, 0.4553953120014338, 3.075794891801042], [21.877194455355486, 0.1783018983993344, 1.656533638668211], [24.22702679856666, 0.18714405741209605, 0.5872526713967208], [47.944251732137985, 0.1281658586782517, 0.5000000011073479], [56.22677969391385, 0.18761774959573807, 1.154275788182748], [64.85079804666483, 0.2098454243475636, 3.314022213086213], [76.4696627253064, 0.1625074659493857, 6.559765630352841], [79.43779777228575, 0.3336111992908819, 0.6183952250084472]], "r_squared_": 0.9946696581965238, "error_": 0.031259231563730706}
{"freq_range": [2.0, 80.0], "freq_res": 1.0, "aperiodic_params_": [-0.7321731797677385, 1.0235181279918215], "gaussian_params_": [[9.076729098289972, 1.2840889569447813, 0.6781986299002278], [12.879470927228006, 0.27967152703010495, 3.4201565728489842], [63.26917154037541, 0.21090178755686415, 0.4252936170511613], [64.6112814944828, 0.612356407278529, 0.2500225774891383], [73.45203459913596, 0.1546289028322741, 5.999999999999999], [79.3628169977279, 0.42974452371668087, 0.25224000592857015]], "peak_params_": [[9.076729098289972, 1.4228778663517112, 1.3563972598004557], [12.879470927228006, 0.27949798637885936, 6.8403131456979684], [63.26917154037541, 0.20653328997510245, 0.8505872341023226], [64.6112814944828, 0.24024398190283636, 0.5000451549782766], [73.45203459913596, 0.1541906896712697, 11.999999999999998], [79.3628169977279, 0.25357713577083274, 0.5044800118571403]], "r_squared_": 0.979886288423, "error_": 0.04991628093986193}
{"freq_range": [2.0, 80.0], "freq_res": 1.0, "aperiodic_params_": [-0.18820629779777986, 0.8612003403067569], "gaussian_params_": [[7.144139112743051, 0.10182441012169051, 0.2501776444642084], [9.10088906508215, 1.0499908286436717, 0.5291665602681083], [9.363233359849005, 0.3881468115501741, 2.011211782817821], [62.45203459913595, 0.1527605980595439, 5.999999999999999], [69.60578081565687, 0.1466604941038651, 0.9196466484924924], [72.51758842086811, 0.6845541219094498, 0.27639542054274857], [77.63241375570395, 0.14224603009483294, 4.942615226276279]], "peak_params_": [[7.144139112743051, 0.28126656322356614, 0.5003552889284169], [9.10088906508215, 1.4129475521138288, 1.0583331205362165], [9.363233359849005, 1.4129475521138288, 4.022423565635642], [62.45203459913595, 0.15328459876800138, 11.999999999999998], [69.60578081565687, 0.24620310326152128, 1.839293296984985], [72.51758842086811, 0.27367116704310535, 0.5527908410854971], [77.63241375570395, 0.14717270902934243, 9.885230452552557]], "r_squared_": 0.9589584208382957, "error_": 0.05972262764561702}
{"freq_range": [2.0, 80.0], "freq_res": 1.0, "aperiodic_params_": [-0.1699577699630124, 0.9916593606421037], "gaussian_params_": [[7.489012207804902, 1.0256879938309449, 0.2986458765880263], [9.08799631559307, 1.6957287902882907, 0.6650783352535967], [11.013731287838079, 0.38251036785276277, 1.171632483300914], [13.688073668718443, 0.2333322352130665, 0.6933876727456856], [18.376620039049342, 0.26334698858493644, 0.6036480617055356], [48.046432821812196, 0.12668304910504208, 4.065027136485015], [54.47845512458276, 0.5183902773595005, 0.2918717747537599], [57.46252064012917, 0.17775110102587388, 1.060350296504561], [60.7947584115535, 0.17750110763982618, 0.6075803403585706], [63.28793126424299, 0.3651362080430077, 0.2624656885972885], [64.60784142688432, 0.36364433730177215, 0.28720491577694984], [67.9859712127224, 0.15038006735260737, 2.250101518108469], [72.94063404962463, 0.15854879472029493, 0.25000001179324033], [76.49051729864405, 0.19837247272273142, 5.999999999997567]], "peak_params_": [[7.489012207804902, 0.2817721501603956, 0.5972917531760527], [9.08799631559307, 1.7682862981850194, 1.3301566705071934], [11.013731287838079, 0.40981824934506594, 2.343264966601828], [13.688073668718443, 0.22573543104410643, 1.3867753454913712], [18.376620039049342, 0.21677128156598213, 1.2072961234110713], [48.046432821812196, 0.12667730471099503, 8.13005427297003], [54.47845512458276, 0.17963208967152267, 0.5837435495075198], [57.46252064012917, 0.17383654062283282, 2.120700593009122], [60.7947584115535, 0.17742274303535743, 1.2151606807171411], [63.28793126424299, 0.2291850113352929, 0.524931377194577], [64.60784142688432, 0.2372274942031769, 0.5744098315538997], [67.9859712127224, 0.22326500682010697, 4.500203036216938], [72.94063404962463, 0.3341900504707316, 0.5000000235864807], [76.49051729864405, 0.19797529056676755, 11.999999999995135]], "r_squared_": 0.9896182500161324, "error_": 0.03465891247024155}
{"freq_range": [2.0, 80.0], "freq_res": 1.0, "aperiodic_params_": [-0.06714238766114633, 0.996367079947523], "gaussian_params_": [[9.018395353329613, 1.182309522085497, 0.5934101990554114], [9.722124365004651, 0.41206415299403454, 1.9932690496244259], [64.9040691982719, 0.1777899870631457, 5.999999999999999], [72.52187809711741, 0.6804189171715486, 0.2553265780586468], [77.68752817038202, 0.1883747431033539, 5.989190381189292]], "peak_params_": [[9.018395353329613, 1.5676326523605608, 1.1868203981108227], [9.722124365004651, 0.70906933243397, 3.9865380992488517], [64.9040691982719, 0.1977449185896234, 11.999999999999998], [72.52187809711741, 0.3280683591741689, 0.5106531561172936], [77.68752817038202, 0.20454036677560827, 11.978380762378585]], "r_squared_": 0.9652532076012966, "error_": 0.06484738508878725}
