{"freq_range": [2.0, 80.0], "freq_res": 1.0, "aperiodic_params_": [1.0153134861731035, 1.3021031997740924], "gaussian_params_": [[8.995316912373134, 0.5088756211761317, 1.4571227590640248], [20.786693313113517, 0.216617210329586, 0.2845523139352487], [41.41763233783088, 0.5248673410496949, 0.2684920472066431], [48.04856099729008, 0.14294408533013325, 0.25000014858261804], [68.71499753396863, 0.10176509794682488, 5.999999999999999], [74.53149709385993, 0.3507200963259647, 0.3000444846931946]], "peak_params_": [[8.995316912373134, 0.508872993010006, 2.9142455181280496], [20.786693313113517, 0.16355759389396562, 0.5691046278704974], [41.41763233783088, 0.15655561950451902, 0.5369840944132862], [48.04856099729008, 0.14053525152027202, 0.5000002971652361], [68.71499753396863, 0.10165035694334734, 11.999999999999998], [74.53149709385993, 0.1624349823950082, 0.6000889693863892]], "r_squared_": 0.9882860921070068, "error_": 0.04304489654213154}
{"freq_range": [2.0, 80.0], "freq_res": 1.0, "aperiodic_params_": [0.8100442257552405, 1.0621031556432692], "gaussian_params_": [[6.407074052172342, 0.5682201832065975, 0.2576236907235887], [9.087883036892952, 0.3600634709866739, 1.794460475639116], [22.889605584241334, 0.21103311930145116, 2.2169607913471916], [26.578759873836184, 0.5653155161702876, 0.2533147306004632], [41.79664068076426, 0.15742763625246495, 2.5103656727914876], [51.16572350522074, 0.0978579658274574, 4.988829289053389], [60.847164148296045, 0.138481294079115, 0.7268528864243193], [67.92303900016331, 0.1474790866610807, 2.2657525190650083], [73.44882109471145, 0.4623582070619453, 0.29113961184697945]], "peak_params_": [[6.407074052172342, 0.24498120289205433, 0.5152473814471774], [9.087883036892952, 0.35963192174248115, 3.588920951278232], [22.889605584241334, 0.21077165635913186, 4.433921582694383], [26.578759873836184, 0.17968223898316515, 0.5066294612009264], [41.79664068076426, 0.17500945316095717, 5.020731345582975], [51.16572350522074, 0.09799387288071493, 9.977658578106778], [60.847164148296045, 0.1508597694634617, 1.4537057728486387], [67.92303900016331, 0.14772367432437383, 4.531505038130017], [73.44882109471145, 0.15288988697981964, 0.5822792236939589]], "r_squared_": 0.9823743117830526, "error_": 0.04215396237295351}
{"freq_range": [2.0, 80.0], "freq_res": 1.0, "aperiodic_params_": [0.32511232975178567, 0.9577906875080001], "gaussian_params_": [[3.452034603374846, 0.31411945553131776, 3.4963892251899074], [9.24065412842047, 0.6387071135114548, 1.430752957698075], [62.60812218083002, 0.38966941637208263, 0.2805879011422616], [66.80020699903723, 0.2141495350965557, 0.3937070753629162], [68.5132375448919, 0.3099336976222898, 0.32338938287143554], [73.77689132839792, 0.2967713205082269, 5.704589854179544]], "peak_params_": [[3.452034603374846, 0.3115523653745279, 6.992778450379815], [9.24065412842047, 0.7189332759537631, 2.86150591539615], [62.60812218083002, 0.1967617776075512, 0.5611758022845232], [66.80020699903723, 0.33482599800153334, 0.7874141507258324], [68.5132375448919, 0.3088449238054658, 0.6467787657428711], [73.77689132839792, 0.29654443334877745, 11.409179708359089]], "r_squared_": 0.9683217642965578, "error_": 0.06068918841149746}
{"freq_range": [2.0, 80.0], "freq_res": 1.0, "aperiodic_params_": [1.3171588693311749, 1.3669566775895954], "gaussian_params_": [[8.796380380917299, 0.4432512009793818, 1.845975842729927], [16.41434076660709, 0.5187951138360705, 0.25000000000000006], [72.45203459913596, 0.08851778569123459, 5.999999999994067]], "peak_params_": [[8.796380380917299, 0.44056284495217884, 3.691951685459854], [16.41434076660709, 0.13159726844495837, 0.5000000000000001], [72.45203459913596, 0.08826692923450197, 11.999999999988134]], "r_squared_": 0.991487818608121, "error_": 0.03806458469703823}
{"freq_range": [2.0, 80.0], "freq_res": 1.0, "aperiodic_params_": [0.8909115193067012, 1.3099475764511679], "gaussian_params_": [[6.459752161307671, 0.42607445821643114, 0.6272032128223581], [9.122836183125152, 0.7042966557163407, 1.037105790875369], [11.783936479467059, 0.30883843689077567, 0.7302342914002149], [72.18852766515917, 0.11727514129828849, 5.999999999999999]], "peak_params_": [[6.459752161307671, 0.33326020299553966, 1.2544064256447163], [9.122836183125152, 0.6997063011376693, 2.074211581750738], [11.783936479467059, 0.31062605318792735, 1.4604685828004298], [72.18852766515917, 0.11721726290634282, 11.999999999999998]], "r_squared_": 0.9874577756929237, "error_": 0.04583588285976226}
{"freq_range": [2.0, 80.0], "freq_res": 1.0, "aperiodic_params_": [0.4355431445986536, 0.9413455120786642], "gaussian_params_": [[6.513053810913726, 1.2503516738378597, 0.28449100624551177], [9.358359277720414, 0.5829549635307717, 1.019858988020641], [11.575168795124052, 0.7557626104276117, 0.27850665335661084], [20.57466546286307, 0.7169027995187756, 0.297351738975738], [22.518917550579047, 0.31279787700989803, 0.6291771408190365], [24.540415293828904, 0.44557278057520067, 0.44050801519895655], [26.694802032386963, 0.27553684300558756, 0.48909704299130774], [46.55841815879389, 0.908522529020485, 0.2594430195092102], [51.460042800483784, 0.20678438314692343, 2.0368130804266076]], "peak_params_": [[6.513053810913726, 0.3291930035340013, 0.5689820124910235], [9.358359277720414, 0.5480549518770365, 2.039717976041282], [11.575168795124052, 0.25647459861788313, 0.5570133067132217], [20.57466546286307, 0.27469975251631207, 0.594703477951476], [22.518917550579047, 0.23449744148823592, 1.258354281638073], [24.540415293828904, 0.2593690259994482, 0.8810160303979131], [26.694802032386963, 0.22679167900447672, 0.9781940859826155], [46.55841815879389, 0.2322468163625162, 0.5188860390184205], [51.460042800483784, 0.20157657705300935, 4.073626160853215]], "r_squared_": 0.973298979681921, "error_": 0.04696012996693112}
{"freq_range": [2.0, 80.0], "freq_res": 1.0, "aperiodic_params_": [-0.008877444737769172, 0.4555549720652515], "gaussian_params_": [[6.452034599135944, 0.5403528839253102, 4.006995947147621], [24.206339607015178, 0.24389076961173076, 1.3060425744583262], [47.626987939486504, 0.2910306768581044, 2.677479515819022], [60.716510135116735, 0.23788644701551154, 0.9188318503002579], [63.32172232049146, 0.3915287284434626, 0.26964573637528166], [70.55914344136174, 0.36622152105108663, 4.362608019233141], [79.99995354352244, 0.1945369142948218, 5.99919964398783]], "peak_params_": [[6.452034599135944, 0.5369254269811073, 8.013991894295241], [24.206339607015178, 0.2409028779787794, 2.6120851489166523], [47.626987939486504, 0.28822079328610234, 5.354959031638044], [60.716510135116735, 0.26132499978457546, 1.8376637006005159], [63.32172232049146, 0.28812694636806124, 0.5392914727505633], [70.55914344136174, 0.42749506279063004, 8.725216038466282], [79.99995354352244, 0.22976010459572005, 11.99839928797566]], "r_squared_": 0.8954000869659797, "error_": 0.06648006288222237}
{"freq_range": [2.0, 80.0], "freq_res": 1.0, "aperiodic_params_": [-0.06458211686780954, 0.4774419449457722], "gaussian_params_": [[5.08660086045592, 0.6862375857309984, 4.861981126615706], [55.356103797407904, 0.15425602203530736, 5.999999999999999], [71.33236350997899, 0.29544083602761645, 5.941822679082601]], "peak_params_": [[5.08660086045592, 0.6861287358555374, 9.723962253231411], [55.356103797407904, 0.1607427862957862, 11.999999999999998], [71.33236350997899, 0.3001319284316689, 11.883645358165202]], "r_squared_": 0.9144018391403905, "error_": 0.0740553937585034}
{"freq_range": [2.0, 80.0], "freq_res": 1.0, "aperiodic_params_": [0.7392115202784533, 1.1131694042481555], "gaussian_params_": [[3.212490452750957, 0.28671712011781014, 1.674348597594405], [6.440631355069077, 0.6807752721305879, 0.3097476659416682], [9.259816692115898, 0.6557140898383934, 1.5648772677528837], [51.34091702633463, 0.13125250283389525, 5.775789185330184], [56.63710968202643, 0.11305524870374409, 1.1808233126238643], [61.21462505908046, 0.20961728684687986, 0.8026320131673486], [63.9970554846958, 0.15415285666386133, 1.4070612383431642], [68.56442758560472, 0.23842721922286847, 0.2933229553312145], [71.52824121222574, 0.14468139527364754, 0.32677527717822646], [74.05571220904424, 0.254878747597835, 5.643192231584702]], "peak_params_": [[3.212490452750957, 0.28463725708534277, 3.34869719518881], [6.440631355069077, 0.3941037080540362, 0.6194953318833364], [9.259816692115898, 0.6474678419054557, 3.1297545355057674], [51.34091702633463, 0.13108582898071086, 11.551578370660367], [56.63710968202643, 0.19170561759980354, 2.3616466252477286], [61.21462505908046, 0.2682894938228514, 1.6052640263346971], [63.9970554846958, 0.21864588392699735, 2.8141224766863284], [68.56442758560472, 0.2512916490639019, 0.586645910662429], [71.52824121222574, 0.28976576279140875, 0.6535505543564529], [74.05571220904424, 0.2549260348413427, 11.286384463169403]], "r_squared_": 0.9849673473067604, "error_": 0.04415339528067927}
{"freq_range": [2.0, 80.0], "freq_res": 1.0, "aperiodic_params_": [0.9229348373152978, 1.2538840499788748], "gaussian_params_": [[2.8942041989576395, 0.1795685934788391, 3.169267177198164], [6.469121777735869, 0.901132293134943, 0.29224200450697335], [9.318345214798198, 0.6145555102444463, 1.5602622102196142], [52.9804578002669, 0.16405165265830568, 4.057879206500364], [57.68889842255822, 0.4219452491200536, 0.25165487556252947], [61.31621312001295, 0.2370992938159413, 1.0177596411198957], [64.13859356776675, 0.11211065449202212, 0.6650404669822646], [72.91429804048032, 0.24258141642042988, 5.787472634895442]], "peak_params_": [[2.8942041989576395, 0.1796374636976772, 6.338534354396328], [6.469121777735869, 0.42356948421726504, 0.5844840090139467], [9.318345214798198, 0.6299667805742589, 3.1205244204392284], [52.9804578002669, 0.16470112637653855, 8.115758413000728], [57.68889842255822, 0.28279076667095926, 0.5033097511250589], [61.31621312001295, 0.27834943385201116, 2.0355192822397914], [64.13859356776675, 0.19521626541753156, 1.3300809339645292], [72.91429804048032, 0.24255567160946345, 11.574945269790884]], "r_squared_": 0.9877753052073246, "error_": 0.043346967690708844}
{"freq_range": [2.0, 80.0], "freq_res": 1.0, "aperiodic_params_": [1.1371371773444259, 1.413433745228482], "gaussian_params_": [[6.4450125812589665, 0.5038830472919974, 0.34257275095435524], [9.093415102848578, 0.5853838700858369, 1.9256894719551607], [52.31388317947999, 0.1315421834765193, 3.5794722516459325], [57.7025534677224, 0.26773081982059566, 0.26768111898925134], [61.59046999596715, 0.19348386338003778, 1.0127620375851958], [71.82119504697299, 0.16041784730804493, 5.201684058024886], [76.98111633004751, 0.14841993372544654, 0.25000000000302103]], "peak_params_": [[6.4450125812589665, 0.37781821648112, 0.6851455019087105], [9.093415102848578, 0.5846955079649482, 3.8513789439103214], [52.31388317947999, 0.13115018911107135, 7.158944503291865], [57.7025534677224, 0.18671247242744538, 0.5353622379785027], [61.59046999596715, 0.20866225054450793, 2.0255240751703916], [71.82119504697299, 0.16032313585378, 10.403368116049773], [76.98111633004751, 0.2457234303839484, 0.5000000000060421]], "r_squared_": 0.9898901639820714, "error_": 0.04370741410271394}
{"freq_range": [2.0, 80.0], "freq_res": 1.0, "aperiodic_params_": [1.0469688787856655, 1.3914475578941177], "gaussian_params_": [[6.711714568524146, 0.4497289794640278, 1.1333507364446682], [9.244741034004589, 0.7092711875406759, 0.7601915704871701], [11.697497842322141, 0.3877776766628444, 0.8574131600658652], [55.51639732646997, 0.6791186627172193, 0.3036493844366844], [57.93328899581534, 0.22737859276427844, 0.6954210132020247], [61.339958898144296, 0.20353560625449874, 0.9634992665595808], [72.08202190908547, 0.17293561294473322, 5.366830895865661], [74.484300797459, 0.30960413982720114, 0.29429387700256204], [76.98265613546742, 0.1615993622229219, 0.2500000018975444]], "peak_params_": [[6.711714568524146, 0.44447885007407856, 2.2667014728893364], [9.244741034004589, 0.7347782395791009, 1.5203831409743402], [11.697497842322141, 0.3653837650855909, 1.7148263201317304], [55.51639732646997, 0.1977644139094179, 0.6072987688733688], [57.93328899581534, 0.2323668522233313, 1.3908420264040493], [61.339958898144296, 0.21177760528250444, 1.9269985331191617], [72.08202190908547, 0.17291541751929573, 10.733661791731322], [74.484300797459, 0.24217401146837836, 0.5885877540051241], [76.98265613546742, 0.27485333381014887, 0.5000000037950888]], "r_squared_": 0.9886632316736702, "error_": 0.04616749164330654}
{"freq_range": [2.0, 80.0], "freq_res": 1.0, "aperiodic_params_": [0.9105398430253409, 1.1848757334193993], "gaussian_params_": [[6.738308684455998, 0.382126759068146, 0.9748801761807513], [9.298900909229312, 0.644837614213739, 0.701071378846978], [11.827291703037906, 0.3753954849592417, 0.792044570300044], [27.416530473814102, 0.629463157596733, 0.2500084914212743], [57.99299776911535, 0.09826559037992094, 5.99999999999254], [70.84380984990986, 0.2655571945734767, 0.8380434548257619], [73.78526531611979, 0.2732968421398626, 0.9510912542531528], [76.73291882362169, 0.23290697228082372, 0.5968446981956752], [79.13628767447817, 0.1953337940299995, 0.27620867797554854]], "peak_params_": [[6.738308684455998, 0.3715865852485381, 1.9497603523615026], [9.298900909229312, 0.6153668730192996, 1.402142757693956], [11.827291703037906, 0.366961912038498, 1.584089140600088], [27.416530473814102, 0.15711555096830154, 0.5000169828425486], [57.99299776911535, 0.09826552346211748, 11.99999999998508], [70.84380984990986, 0.27411157671298714, 1.6760869096515238], [73.78526531611979, 0.2694448595378145, 1.9021825085063055], [76.73291882362169, 0.2122707939150299, 1.1936893963913504], [79.13628767447817, 0.17333116177038232, 0.5524173559510971]], "r_squared_": 0.9872377687182059, "error_": 0.037310499068777044}
{"freq_range": [2.0, 80.0], "freq_res": 1.0, "aperiodic_params_": [0.7015399414988044, 0.9914612500951944], "gaussian_params_": [[6.762964161950395, 0.2330675865275244, 1.1249181478070487], [9.46240079138556, 1.518502991054451, 0.3057359999792595], [11.824224626659257, 0.25231004268882384, 0.8476050861533826], [18.39713887697795, 0.5306185063005694, 0.25594769095902165], [24.16388904859316, 0.1814486154360559, 2.1027583489470976], [46.10275594428816, 0.18987384799030632, 0.4245226445419237], [57.54462735039854, 0.1564002870651407, 1.1883556537369009], [68.04566965561496, 0.11205506069280992, 1.7617015246899337], [70.98363716848336, 0.08420730620279047, 0.2500002155561948], [76.54796540086404, 0.12805391211969733, 5.999999999999999]], "peak_params_": [[6.762964161950395, 0.22795048188161457, 2.2498362956140974], [9.46240079138556, 0.5170961843573765, 0.611471999958519], [11.824224626659257, 0.24694712935409385, 1.6952101723067652], [18.39713887697795, 0.16168489560206722, 0.5118953819180433], [24.16388904859316, 0.18089833329359772, 4.205516697894195], [46.10275594428816, 0.184392620087528, 0.8490452890838474], [57.54462735039854, 0.14640600622023703, 2.3767113074738018], [68.04566965561496, 0.15843238404547666, 3.5234030493798674], [70.98363716848336, 0.19499971958422269, 0.5000004311123896], [76.54796540086404, 0.1276912867170208, 11.999999999999998]], "r_squared_": 0.9793326789089597, "error_": 0.04140513224783324}
{"freq_range": [2.0, 80.0], "freq_res": 1.0, "aperiodic_params_": [0.445742852453534, 0.9906574808840874], "gaussian_params_": [[2.0000000000000004, 0.24438960414445213, 1.8681762725285516], [6.501951427914674, 1.2888395468232368, 0.27836621636106534], [9.416086061298822, 0.5687122359337559, 0.9507226746987031], [11.778794327618218, 0.2949655346784098, 0.6105193441855317], [50.94176235295144, 0.2704020905972304, 0.6434042464238976], [53.47281605810384, 0.5745956995321557, 0.28790217887285974], [56.89557867455551, 0.2413536042857035, 0.7014114744104337], [59.78991915535629, 0.23396489932096085, 0.7744680385892115], [64.25701732505793, 0.19732148711245137, 0.9864104664539786], [67.5924706990917, 0.4091490382820976, 0.5034013640266735], [70.64099010311797, 0.1766139370795468, 0.9499426434138177], [73.33552246836308, 0.6292635339247465, 0.2500001932487747], [74.63530601593897, 0.2784860279477469, 0.5272106654546953], [77.47979205115024, 0.27034552218862024, 0.5156160746772718], [79.16228436699632, 0.3818727401149566, 0.6253945202056648]], "peak_params_": [[2.0000000000000004, 0.24438960414448696, 3.736352545057103], [6.501951427914674, 0.2893764427739767, 0.5567324327221307], [9.416086061298822, 0.5170013683971785, 1.9014453493974062], [11.778794327618218, 0.2903807520643984, 1.2210386883710633], [50.94176235295144, 0.26929666221737714, 1.2868084928477952], [53.47281605810384, 0.15079690779664645, 0.5758043577457195], [56.89557867455551, 0.23904959390003366, 1.4028229488208674], [59.78991915535629, 0.225544898269193, 1.548936077178423], [64.25701732505793, 0.19073585210282284, 1.9728209329079571], [67.5924706990917, 0.29867927779611936, 1.006802728053347], [70.64099010311797, 0.16444093177161312, 1.8998852868276355], [73.33552246836308, 0.26604259660316654, 0.5000003864975494], [74.63530601593897, 0.21923569250264907, 1.0544213309093906], [77.47979205115024, 0.17632718801575198, 1.0312321493545435], [79.16228436699632, 0.3727320465954298, 1.2507890404113295]], "r_squared_": 0.9869286262136687, "error_": 0.027770168260364592}
{"freq_range": [2.0, 80.0], "freq_res": 1.0, "aperiodic_params_": [-0.3666637378784893, 0.11822408025243548], "gaussian_params_": [[3.9040691982718863, 0.7842097395233756, 4.215973129562229], [19.366783808203955, 0.24718852389306112, 1.1699987702487367], [38.4414053868281, 0.26290534793042536, 2.8988762194658926], [54.06225124823325, 0.2782439791489227, 2.6424892147524757], [60.29661344678404, 0.27938181820777, 1.395474237299342], [67.05375995574165, 0.23721425157754972, 3.3896062494527985], [72.22781393284261, 0.2724205285469377, 0.9023442804091395], [75.26788436223111, 0.12083221092320127, 1.5067912233211176], [79.99999978255488, 0.25305381792193904, 5.034574423025354]], "peak_params_": [[3.9040691982718863, 0.7840067533283336, 8.431946259124459], [19.366783808203955, 0.23662507242954012, 2.3399975404974733], [38.4414053868281, 0.2598751565207487, 5.797752438931785], [54.06225124823325, 0.27832069502283385, 5.284978429504951], [60.29661344678404, 0.3227343817073252, 2.790948474598684], [67.05375995574165, 0.24621273602855426, 6.779212498905597], [72.22781393284261, 0.4287803732657553, 1.804688560818279], [75.26788436223111, 0.29110419166627044, 3.013582446642235], [79.99999978255488, 0.254086978637201, 10.069148846050709]], "r_squared_": 0.8171104383243752, "error_": 0.07786114376535871}
{"freq_range": [2.0, 80.0], "freq_res": 1.0, "aperiodic_params_": [0.2839327355764442, 0.44339559002779283], "gaussian_params_": [[56.356103797436425, 0.21573804542037542, 5.9999999999999885], [60.04408810742184, 0.14432801663761388, 0.2500042825121342], [71.54796433129249, 0.25226975427513426, 5.951644643517388]], "peak_params_": [[56.356103797436425, 0.22367482675784, 11.999999999999977], [60.04408810742184, 0.359909056500027, 0.5000085650242684], [71.54796433129249, 0.2587499176268788, 11.903289287034776]], "r_squared_": 0.47019940071639377, "error_": 0.12663851585686484}
{"freq_range": [2.0, 80.0], "freq_res": 1.0, "aperiodic_params_": [-0.32609582844445634, 0.1885312937019423], "gaussian_params_": [[6.452034599135944, 0.8306092381238438, 4.54586695357724], [55.10718259160415, 0.3056843829412671, 4.439867594813281], [63.67878361971323, 0.464743488282079, 0.26231729235530815], [67.11665743974834, 0.030026496308786236, 0.25076098491207877], [73.12942527376704, 0.27033576857546743, 5.627905462949922]], "peak_params_": [[6.452034599135944, 0.8265128269958232, 9.09173390715448], [55.10718259160415, 0.30710384756072096, 8.879735189626562], [63.67878361971323, 0.3332386835582281, 0.5246345847106163], [67.11665743974834, 0.184796979959108, 0.5015219698241575], [73.12942527376704, 0.27035518898819605, 11.255810925899844]], "r_squared_": 0.79715503443808, "error_": 0.09363971832850787}
{"freq_range": [2.0, 80.0], "freq_res": 1.0, "aperiodic_params_": [0.7139874066670941, 1.1023130015004239], "gaussian_params_": [[7.759303321752275, 0.611716296118183, 3.072804845503976], [40.15230216598923, 0.22252381040541538, 0.25150745583165546], [54.25702137560147, 0.25198101115365384, 3.0898588935206175], [57.63768237753695, 0.5200304532374381, 0.2736222752897288], [61.352842436970825, 0.3315149779910359, 0.7897999129002629], [64.02951773361369, 0.21208834911876887, 0.8205877211763971], [67.71139519587689, 0.09167895550140727, 1.0558747198040832], [73.56024373595564, 0.3100291787236601, 5.022319052466424]], "peak_params_": [[7.759303321752275, 0.6098424916251565, 6.145609691007952], [40.15230216598923, 0.18525193468951806, 0.5030149116633109], [54.25702137560147, 0.25126837828064486, 6.179717787041235], [57.63768237753695, 0.33998980166420967, 0.5472445505794576], [61.352842436970825, 0.3371467148152376, 1.5795998258005257], [64.02951773361369, 0.26574258569650966, 1.6411754423527942], [67.71139519587689, 0.2563083639706045, 2.1117494396081664], [73.56024373595564, 0.30884298641044494, 10.044638104932847]], "r_squared_": 0.9724697076787787, "error_": 0.05459938439755123}
{"freq_range": [2.0, 80.0], "freq_res": 1.0, "aperiodic_params_": [1.0140552025949812, 1.3430825871223764], "gaussian_params_": [[6.895357854562988, 0.36386790035352895, 2.3493560208123303], [9.745074429015315, 0.408105566216804, 1.604825253092813], [54.04622844487589, 0.14886161134919604, 5.554920690019285], [57.945084413630994, 0.17119362988001274, 0.25000226645271545], [61.66500418821651, 0.1774002623330327, 0.9978433702419226], [73.06947511181747, 0.2256992727315466, 5.850790229868112]], "peak_params_": [[6.895357854562988, 0.4580070227358312, 4.698712041624661], [9.745074429015315, 0.5549505902417675, 3.209650506185626], [54.04622844487589, 0.14997015711338113, 11.10984138003857], [57.945084413630994, 0.2910578031589428, 0.5000045329054309], [61.66500418821651, 0.2587777405649767, 1.9956867404838452], [73.06947511181747, 0.22612463495407575, 11.701580459736224]], "r_squared_": 0.9851613926059469, "error_": 0.049120374542966215}
{"freq_range": [2.0, 80.0], "freq_res": 1.0, "aperiodic_params_": [0.9616954777191621, 1.2772147955896977], "gaussian_params_": [[4.318963708553461, 0.22017928255966265, 0.6300901797256457], [6.5199876968402695, 0.9874064725053184, 0.3488218681830293], [9.063345409500938, 0.7049657870980707, 0.9946593063263738], [11.853060344333779, 0.4222564205156973, 0.7795672393078756], [58.02019496792289, 0.12686180452138085, 0.25000001463970073], [58.767665629469626, 0.1336222099806762, 5.999999999999999], [68.4520346425555, 0.08734658551007556, 2.018292847623626], [73.46328726242433, 0.20314084319590855, 2.37473756319187], [76.72727373156452, 0.3325427677025277, 0.2801836927778059], [79.39102223341563, 0.39382967264325364, 0.31032481146316926]], "peak_params_": [[4.318963708553461, 0.19370217838377923, 1.2601803594512915], [6.5199876968402695, 0.46509731301122254, 0.6976437363660586], [9.063345409500938, 0.7040589051368058, 1.9893186126527476], [11.853060344333779, 0.42384444149924255, 1.5591344786157513], [58.02019496792289, 0.2589816925119819, 0.5000000292794015], [58.767665629469626, 0.13358217891442625, 11.999999999999998], [68.4520346425555, 0.1404899295695814, 4.036585695247252], [73.46328726242433, 0.21422632568818623, 4.74947512638374], [76.72727373156452, 0.2754089700882454, 0.5603673855556118], [79.39102223341563, 0.19191324474186477, 0.6206496229263385]], "r_squared_": 0.9916474401502984, "error_": 0.03359980753262323}
{"freq_range": [2.0, 80.0], "freq_res": 1.0, "aperiodic_params_": [-0.14682015236124094, 0.46959402066543326], "gaussian_params_": [[6.599021046575839, 0.8080336127382389, 5.132350480336719], [57.26322332345837, 0.17914267386907926, 5.999999898911275], [70.99041872721007, 0.21830137012996823, 0.25000290501771355], [73.6567414168907, 0.2293882491214124, 2.0174213272480355], [77.26953524657333, 0.26802068868721607, 0.4842804072966903], [78.82032505007474, 0.3382424436357587, 0.250008359520584]], "peak_params_": [[6.599021046575839, 0.8055712761605942, 10.264700960673437], [57.26322332345837, 0.17897036550467427, 11.99999979782255], [70.99041872721007, 0.327552996197345, 0.5000058100354271], [73.6567414168907, 0.22975237715919183, 4.034842654496071], [77.26953524657333, 0.28847044395260657, 0.9685608145933806], [78.82032505007474, 0.26884099910246306, 0.500016719041168]], "r_squared_": 0.9279821727592611, "error_": 0.07062999365585301}
{"freq_range": [2.0, 80.0], "freq_res": 1.0, "aperiodic_params_": [0.6564299937012795, 1.1330049325290048], "gaussian_params_": [[6.775073808532244, 0.2921917604213614, 1.3372888252700588], [9.48273404729243, 2.7598246463304066, 0.26643816426280204], [11.758493190819216, 0.5281451550887771, 0.7907893948375432], [24.052769271212888, 0.16829224952469068, 0.9903417319776576], [58.02096849046281, 0.1385215859774483, 1.8536953544976813], [62.143076065150545, 0.17313422092931705, 0.5375103774861074], [70.37148403020106, 0.19297876631582495, 2.008085213208428], [73.50378690886288, 0.37917831173581035, 0.2500021477701254], [77.33825853385432, 0.17820622430258368, 2.969083910352802]], "peak_params_": [[6.775073808532244, 0.288087840034673, 2.6745776505401175], [9.48273404729243, 0.6090611486486116, 0.5328763285256041], [11.758493190819216, 0.5042223763196664, 1.5815787896750864], [24.052769271212888, 0.16805351351581976, 1.9806834639553152], [58.02096849046281, 0.13851272520383162, 3.7073907089953626], [62.143076065150545, 0.1809758894579545, 1.0750207549722148], [70.37148403020106, 0.1981081964110174, 4.016170426416856], [73.50378690886288, 0.1853196241649968, 0.5000042955402508], [77.33825853385432, 0.17788421181037606, 5.938167820705604]], "r_squared_": 0.9812308905018137, "error_": 0.045312132176979075}
{"freq_range": [2.0, 80.0], "freq_res": 1.0, "aperiodic_params_": [0.4941030358163585, 1.0531350560036612], "gaussian_params_": [[3.428965408810504, 0.19446753610599285, 1.3968395955495365], [6.519837712537443, 0.8638825938156557, 0.29379870291181176], [9.85825019163243, 0.4667528615881836, 1.5371735465091674], [51.37753893714109, 0.3954983808804811, 0.26026549744388744], [57.055106711025644, 0.11799795915552816, 0.25000000004457307], [58.95252588931095, 0.12811077852617567, 4.483493846344471], [64.52124952856627, 0.6127825728378118, 0.28945083681066114], [68.31350361363279, 0.169834815921238, 1.7729050084771796], [73.3426083038646, 0.4752966243511677, 0.26640204762153374], [74.66254789486338, 0.20267190791697023, 0.8189611967851975], [78.62852946468948, 0.35228788989915555, 0.9346798785119335]], "peak_params_": [[3.428965408810504, 0.18553260737737357, 2.793679191099073], [6.519837712537443, 0.317483152242375, 0.5875974058236235], [9.85825019163243, 0.4647755954931834, 3.0743470930183348], [51.37753893714109, 0.16467960937119597, 0.5205309948877749], [57.055106711025644, 0.23168652881745566, 0.5000000000891461], [58.95252588931095, 0.12810376966464565, 8.966987692688942], [64.52124952856627, 0.2372475948004371, 0.5789016736213223], [68.31350361363279, 0.18392394696423242, 3.545810016954359], [73.3426083038646, 0.2398040619006696, 0.5328040952430675], [74.66254789486338, 0.1867149382392137, 1.637922393570395], [78.62852946468948, 0.3255420185828124, 1.869359757023867]], "r_squared_": 0.9804510663358106, "error_": 0.04230622268421118}
{"freq_range": [2.0, 80.0], "freq_res": 1.0, "aperiodic_params_": [-0.5296584927043168, 0.038078583309333044], "gaussian_params_": [[3.9040691982718863, 0.7442187625713224, 4.587425300819642], [19.504302487302187, 0.2579918036760762, 1.362090350346604], [21.489521922179982, 0.31340656998463823, 0.3175760216386973], [37.107804251380514, 0.2679214829065487, 1.8130680381419382], [41.27862397405093, 0.44867749689961395, 0.8783311001317067], [56.36963466287774, 0.28134745233789177, 4.6459330329030974], [61.47030500717207, 0.39223591578466294, 0.320852312871707], [66.79863602692987, 0.2686164475119024, 2.2346602547484586], [72.48926386190954, 0.7116062987767374, 0.30453786033072144], [76.9995781908691, 0.29312415873007086, 3.430665102823079]], "peak_params_": [[3.9040691982718863, 0.744056057429394, 9.174850601639283], [19.504302487302187, 0.24304515875260657, 2.724180700693208], [21.489521922179982, 0.2374316289387729, 0.6351520432773946], [37.107804251380514, 0.2674987415812374, 3.6261360762838764], [41.27862397405093, 0.45459089997667906, 1.7566622002634134], [56.36963466287774, 0.2804606886336127, 9.291866065806195], [61.47030500717207, 0.3144569771339048, 0.641704625743414], [66.79863602692987, 0.29224798405516306, 4.469320509496917], [72.48926386190954, 0.31601437317990927, 0.6090757206614429], [76.9995781908691, 0.29314687575311044, 6.861330205646158]], "r_squared_": 0.8077427150500933, "error_": 0.07351445380692646}
{"freq_range": [2.0, 80.0], "freq_res": 1.0, "aperiodic_params_": [-0.7563169078230335, -0.09434694686473476], "gaussian_params_": [[5.904069198271887, 0.815034951859728, 4.579759484004195], [9.510674243518022, 0.6721813126253591, 0.2719248575628872], [61.45203459913595, 0.17350681099022405, 5.999999999999999], [69.40122024395485, 0.9920386551700141, 0.2573546087819307]], "peak_params_": [[5.904069198271887, 0.8148561675479208, 9.15951896800839], [9.510674243518022, 0.6795157729126994, 0.5438497151257744], [61.45203459913595, 0.17301509846619278, 11.999999999999998], [69.40122024395485, 0.3729140089471056, 0.5147092175638615]], "r_squared_": 0.6429635073331882, "error_": 0.1069109190451448}
{"freq_range": [2.0, 80.0], "freq_res": 1.0, "aperiodic_params_": [-0.27768162266809987, 0.2217653366423028], "gaussian_params_": [[9.452034599135944, 0.644612599058685, 5.587588734291158], [54.23272074522813, 0.30693502522586646, 2.871194691379092], [57.64115048872886, 0.49890875633129317, 0.25395478603832267], [61.155177471594314, 0.3116739192969945, 0.7539401804615068], [72.19441312229982, 0.26415941656389763, 5.999999999999999]], "peak_params_": [[9.452034599135944, 0.6425066256324524, 11.175177468582316], [54.23272074522813, 0.30858976268398935, 5.742389382758184], [57.64115048872886, 0.3297607312575696, 0.5079095720766453], [61.155177471594314, 0.37057173222001505, 1.5078803609230136], [72.19441312229982, 0.2640207837270691, 11.999999999999998]], "r_squared_": 0.6073747258721229, "error_": 0.1219217330874584}
{"freq_range": [2.0, 80.0], "freq_res": 1.0, "aperiodic_params_": [0.3503905147869997, 0.8524750940128976], "gaussian_params_": [[6.893942000456658, 0.682285734895105, 4.075289911701074], [40.374359384202116, 0.5321868164769875, 0.26223207819607586], [54.53009276986637, 0.19363646299484205, 2.6085186332400743], [57.63902704158771, 0.6667420711132278, 0.26011111839855766], [61.27583795580182, 0.34381578724065204, 0.8135703270801944], [63.92588019880322, 0.20432685610176235, 0.6914906534090864], [66.80258339911167, 0.09555330396751148, 1.3712701771888767], [73.74415155233798, 0.2698858662904638, 4.174601811976894]], "peak_params_": [[6.893942000456658, 0.6820547239237326, 8.150579823402149], [40.374359384202116, 0.19209517150435973, 0.5244641563921517], [54.53009276986637, 0.19053121522380823, 5.2170372664801485], [57.63902704158771, 0.3348007721008115, 0.5202222367971153], [61.27583795580182, 0.3361416630398284, 1.6271406541603888], [63.92588019880322, 0.23422790034186491, 1.3829813068181729], [66.80258339911167, 0.16776988496573764, 2.7425403543777533], [73.74415155233798, 0.2693795843106337, 8.349203623953787]], "r_squared_": 0.9659107907760166, "error_": 0.05626254176017383}
{"freq_range": [2.0, 80.0], "freq_res": 1.0, "aperiodic_params_": [1.0054204978035535, 1.303973699035555], "gaussian_params_": [[8.401471488869078, 0.550422040498129, 2.559901232232744], [55.81798018576485, 0.23697648120176243, 0.6897556419871255], [57.92013315591376, 0.28330628599484897, 0.2500344832465044], [61.52925286602958, 0.24659823163142075, 1.0829218452219331], [73.25667494853305, 0.19586229502510635, 5.323002631022719]], "peak_params_": [[8.401471488869078, 0.543694426154154, 5.119802464465488], [55.81798018576485, 0.2298904113326441, 1.379511283974251], [57.92013315591376, 0.27524616541230085, 0.5000689664930088], [61.52925286602958, 0.24530007789866248, 2.1658436904438663], [73.25667494853305, 0.19563472135057203, 10.646005262045438]], "r_squared_": 0.9808488619154248, "error_": 0.05598203532223526}
{"freq_range": [2.0, 80.0], "freq_res": 1.0, "aperiodic_params_": [0.8849777175632475, 1.2892140000931855], "gaussian_params_": [[4.5019994870260645, 0.3127023842597362, 0.6560276591626608], [6.586622792630878, 0.9139662031658383, 0.3477207802231337], [9.210545962483609, 0.822758196768762, 1.002988325336473], [11.737846275643212, 0.4420537983446429, 0.6986159053100862], [55.90066481128631, 0.18241087740791398, 0.7616329814214742], [58.35873749346011, 0.5804979130387555, 0.27893118771061753], [61.430548183197104, 0.2087445299302307, 0.8639956888067528], [72.60637565660693, 0.17829998421222684, 5.979216678573199], [76.85394414716389, 0.15624655636543652, 0.25000006254119755]], "peak_params_": [[4.5019994870260645, 0.23457237746639997, 1.3120553183253216], [6.586622792630878, 0.523603933617967, 0.6954415604462674], [9.210545962483609, 0.8050330739018445, 2.005976650672946], [11.737846275643212, 0.42920767021198525, 1.3972318106201724], [55.90066481128631, 0.18463434446591132, 1.5232659628429484], [58.35873749346011, 0.2670613626959055, 0.5578623754212351], [61.430548183197104, 0.2114696869973116, 1.7279913776135056], [72.60637565660693, 0.17791403854903587, 11.958433357146397], [76.85394414716389, 0.2678465995412622, 0.5000001250823951]], "r_squared_": 0.9874987552540908, "error_": 0.03968286082602094}
{"freq_range": [2.0, 80.0], "freq_res": 1.0, "aperiodic_params_": [0.7536559227188033, 1.1612937959817187], "gaussian_params_": [[7.703345161449895, 0.3663717108609847, 2.2459845358764343], [9.482214403787912, 1.8188313232639481, 0.29113149913189407], [11.852644857154097, 0.538226335944154, 0.8947217707058701], [52.92890831838012, 0.20665285119035112, 1.0591894054664452], [56.440699798457885, 0.8258861429932292, 0.29684710285675886], [58.46950720632016, 0.8199839666125932, 0.313273533905057], [62.41803252526916, 0.2205850672682631, 1.5288231379203614], [68.61033489334405, 0.15637249974866568, 1.8677183104696518], [74.94749168111117, 0.027944747883770667, 0.2503926979166582], [75.07144828968208, 0.27154478194623016, 3.3098006919179794]], "peak_params_": [[7.703345161449895, 0.3632447447658299, 4.491969071752869], [9.482214403787912, 0.7748449913784746, 0.5822629982637881], [11.852644857154097, 0.5897555035884889, 1.7894435414117402], [52.92890831838012, 0.20618789561785356, 2.1183788109328905], [56.440699798457885, 0.27747944429121363, 0.5936942057135177], [58.46950720632016, 0.27011707080328295, 0.626547067810114], [62.41803252526916, 0.21290048143964402, 3.057646275840723], [68.61033489334405, 0.2035102003692444, 3.7354366209393035], [74.94749168111117, 0.29926797146428386, 0.5007853958333164], [75.07144828968208, 0.29926797146428386, 6.619601383835959]], "r_squared_": 0.9814170236453552, "error_": 0.045049132667065464}
{"freq_range": [2.0, 80.0], "freq_res": 1.0, "aperiodic_params_": [0.5429332063096636, 1.0971067384634268], "gaussian_params_": [[3.9081861828505513, 0.20584332653019347, 1.1319340913411586], [6.569083745213376, 1.2981493948999667, 0.2763802655869478], [9.389807781213975, 0.6982735430143517, 0.9724545649602683], [11.829401004841644, 0.45669308862310065, 0.7355991491404364], [52.8662842094956, 0.11572805986938953, 5.999999999999999], [61.616907063809045, 0.7472513276793213, 0.25004121523424094], [72.54796540086404, 0.2628173989835571, 5.999999999999999]], "peak_params_": [[3.9081861828505513, 0.20516744484657645, 2.2638681826823173], [6.569083745213376, 0.424020875706443, 0.5527605311738956], [9.389807781213975, 0.6446567371568166, 1.9449091299205366], [11.829401004841644, 0.46361104196806807, 1.471198298280873], [52.8662842094956, 0.1170017082434538, 11.999999999999998], [61.616907063809045, 0.32344083876454666, 0.5000824304684819], [72.54796540086404, 0.26248784453071794, 11.999999999999998]], "r_squared_": 0.9802898292969846, "error_": 0.04655179088252906}
{"freq_range": [2.0, 80.0], "freq_res": 1.0, "aperiodic_params_": [0.5716211593171799, 1.1237839505182412], "gaussian_params_": [[3.6174072642015416, 0.6531306772845277, 0.2591390912475724], [9.018299774631416, 0.5188456048019082, 1.946824742428155], [51.80380999351552, 0.17942707393481658, 0.6027492745912748], [54.6173301017403, 0.6135136321288003, 0.26679565441706027], [57.385129067325494, 0.5468928460392645, 0.26656395283852735], [60.672215625403894, 0.16818271087531586, 1.9712998117713687], [64.26613552938208, 0.18747667728175518, 0.6250874934850933], [67.96425459782661, 0.1732526841715219, 2.4556001953450033], [75.3336381225144, 0.2167768979278771, 2.4824509756142157], [78.56821522332513, 0.5396014372641348, 0.31567185881722415]], "peak_params_": [[3.6174072642015416, 0.2383362501434455, 0.5182781824951448], [9.018299774631416, 0.518822683656216, 3.89364948485631], [51.80380999351552, 0.17018028268795193, 1.2054985491825496], [54.6173301017403, 0.22200693057133725, 0.5335913088341205], [57.385129067325494, 0.2222590894919887, 0.5331279056770547], [60.672215625403894, 0.16897922405655685, 3.9425996235427374], [64.26613552938208, 0.2587639076372106, 1.2501749869701866], [67.96425459782661, 0.1761623511122783, 4.911200390690007], [75.3336381225144, 0.21768586435403403, 4.964901951228431], [78.56821522332513, 0.2845838148353188, 0.6313437176344483]], "r_squared_": 0.9887239097102284, "error_": 0.03401457112843359}
{"freq_range": [2.0, 80.0], "freq_res": 1.0, "aperiodic_params_": [-0.4738002933921595, -0.06893841249543226], "gaussian_params_": [[3.9040691982718863, 0.7076270678434464, 4.4971275079800295], [20.280097066629857, 0.34224592913115354, 1.2738869592190816], [22.42921572055125, 0.5146346564113236, 0.3285240032080872], [37.5608042046444, 0.24862385862879996, 0.9217257788567307], [41.28045715204027, 0.4813462905102972, 1.1475108046721032], [58.004570561667435, 0.27892383015640254, 2.316831928050318], [60.655104704173645, 0.2908579804104912, 0.2724600803553381], [65.79318200459181, 0.26780714871894656, 3.086886015644673], [74.55068023992588, 0.5527991651319708, 0.2905028139766729], [79.99975120221978, 0.306826100529004, 3.5339786693331323]], "peak_params_": [[3.9040691982718863, 0.7074660882661487, 8.994255015960059], [20.280097066629857, 0.3352417875970376, 2.547773918438163], [22.42921572055125, 0.3569843114974047, 0.6570480064161744], [37.5608042046444, 0.23003013513617754, 1.8434515577134614], [41.28045715204027, 0.4674182564531958, 2.2950216093442064], [58.004570561667435, 0.28998445400722, 4.633663856100636], [60.655104704173645, 0.3316742078666874, 0.5449201607106762], [65.79318200459181, 0.2680501165872681, 6.173772031289346], [74.55068023992588, 0.2830659320891864, 0.5810056279533458], [79.99975120221978, 0.3068328351633697, 7.067957338666265]], "r_squared_": 0.7788846422101576, "error_": 0.07171525220744934}
{"freq_range": [2.0, 80.0], "freq_res": 1.0, "aperiodic_params_": [-0.9564773498985689, -0.27981304009051294], "gaussian_params_": [[4.904069198271887, 0.9271308284788178, 4.835187037393015], [20.2884673174818, 0.4522644117300972, 1.2485344720888167], [40.46730828433797, 1.0916619079001075, 0.29206072285583473], [40.77330230780344, 0.3317551410718053, 2.3459655458665867], [57.9473852528472, 0.15739017989646484, 0.25000000058008626], [61.661636120974784, 0.374828134283857, 4.055335567287587], [71.55528036937609, 0.8657384884396607, 0.2972774645701758], [74.50268737522005, 1.152985458852762, 0.2910139066058514], [77.89935418020133, 0.3193999030106898, 1.4185499609650893]], "peak_params_": [[4.904069198271887, 0.9269483725917815, 9.67037407478603], [20.2884673174818, 0.447440355708534, 2.4970689441776335], [40.46730828433797, 0.6177167950712217, 0.5841214457116695], [40.77330230780344, 0.5370903459038981, 4.691931091733173], [57.9473852528472, 0.4032877368435532, 0.5000000011601725], [61.661636120974784, 0.37352568462505065, 8.110671134575174], [71.55528036937609, 0.2973605668919978, 0.5945549291403516], [74.50268737522005, 0.3089546297470019, 0.5820278132117028], [77.89935418020133, 0.3187089915421642, 2.8370999219301787]], "r_squared_": 0.7764972752700873, "error_": 0.09074042885081554}
{"freq_range": [2.0, 80.0], "freq_res": 1.0, "aperiodic_params_": [-0.3835953036656973, 0.2628838599734736], "gaussian_params_": [[4.904069198271887, 0.840055299123069, 5.854251167998405], [40.55289173599889, 0.39927200981528777, 1.0421570629513262], [55.452034599162936, 0.06847672227006131, 5.999999999977699], [62.44180170995761, 0.25932976980248645, 5.999999999779046], [71.85648366739728, 0.22338014349262159, 0.6297199106945033], [74.50190787320494, 1.535444768274934, 0.25000349044337633], [77.69243319435984, 0.2327340981063459, 2.3873708875103974]], "peak_params_": [[4.904069198271887, 0.8399425216986749, 11.70850233599681], [40.55289173599889, 0.3683689836703917, 2.0843141259026523], [55.452034599162936, 0.18845514772295746, 11.999999999955397], [62.44180170995761, 0.2963780856171543, 11.999999999558092], [71.85648366739728, 0.3056516862559694, 1.2594398213890066], [74.50190787320494, 0.3635709647597868, 0.5000069808867527], [77.69243319435984, 0.23986013216129942, 4.774741775020795]], "r_squared_": 0.8771956922060062, "error_": 0.08641265503750942}
{"freq_range": [2.0, 80.0], "freq_res": 1.0, "aperiodic_params_": [0.6517586206380596, 1.0968055485684245], "gaussian_params_": [[8.52770159880877, 0.7082961304323402, 2.7423264917861356], [40.43723112214906, 0.9933589541431658, 0.28384063921922703], [55.1942134964966, 0.20717364232347898, 3.2493100426843156], [57.727816627681804, 0.4360451607159714, 0.26007557443348456], [61.18132307259448, 0.33974381224203665, 0.7741241038008015], [64.42382987470828, 0.1814316763650194, 2.095606784593016], [69.31474293464248, 8.332558245891261e-08, 3.990536849119771], [74.60326376518614, 0.3418027794565717, 5.483488958119249]], "peak_params_": [[8.52770159880877, 0.6978690429187255, 5.484652983572271], [40.43723112214906, 0.3032846837602401, 0.5676812784384541], [55.1942134964966, 0.2073848065443078, 6.498620085368631], [57.727816627681804, 0.4000875171850299, 0.5201511488669691], [61.18132307259448, 0.4360495094120673, 1.548248207601603], [64.42382987470828, 0.23617839656299555, 4.191213569186032], [69.31474293464248, 0.21953137393412603, 7.981073698239542], [74.60326376518614, 0.3409099021968305, 10.966977916238498]], "r_squared_": 0.9711517547631376, "error_": 0.05989893568091553}
{"freq_range": [2.0, 80.0], "freq_res": 1.0, "aperiodic_params_": [1.0077484026205392, 1.311228200073896], "gaussian_params_": [[8.999033379352753, 0.6744915050450777, 2.0793745826931684], [57.602936930603384, 0.8332881486730899, 0.2714706934654496], [61.17090269399699, 0.3008620230521918, 0.9033484195746572], [65.93048434974588, 0.0979425714058672, 2.1009758346397125], [71.55005937449782, 0.4149742732237666, 0.2758771400368271], [74.44933334320447, 0.2582809605498555, 0.4403011688563301], [75.27071508107042, 0.14647080939689835, 5.999999999999713]], "peak_params_": [[8.999033379352753, 0.6744914321676327, 4.158749165386337], [57.602936930603384, 0.28896383474583764, 0.5429413869308992], [61.17090269399699, 0.310420664637592, 1.8066968391493143], [65.93048434974588, 0.14228427949460154, 4.201951669279425], [71.55005937449782, 0.23750933956067932, 0.5517542800736542], [74.44933334320447, 0.29672604475108977, 0.8806023377126602], [75.27071508107042, 0.2644828308470748, 11.999999999999426]], "r_squared_": 0.9842112855965572, "error_": 0.050337370102693485}
{"freq_range": [2.0, 80.0], "freq_res": 1.0, "aperiodic_params_": [0.8989451057171147, 1.319318828369531], "gaussian_params_": [[9.120483864668623, 0.8350148623423274, 2.0319071586407866], [58.04204723453413, 0.24141148015937952, 0.5843191303574792], [61.40866612217617, 0.24652206369553392, 0.7471929422846839], [73.14381739890298, 0.20230255662659044, 5.999999999999999]], "peak_params_": [[9.120483864668623, 0.8335481917698758, 4.063814317281573], [58.04204723453413, 0.24916387264425666, 1.1686382607149584], [61.40866612217617, 0.23836525471454917, 1.4943858845693678], [73.14381739890298, 0.20224444950588838, 11.999999999999998]], "r_squared_": 0.9834487960811051, "error_": 0.05104802093781056}
{"freq_range": [2.0, 80.0], "freq_res": 1.0, "aperiodic_params_": [0.9237299294558747, 1.3230822104596491], "gaussian_params_": [[6.9040691982719045, 0.09168224120710271, 1.864745642839879], [9.671824410104284, 0.7870443310678282, 1.6825319470841658], [55.94290095083146, 0.17414853938740482, 0.44487397094107883], [57.78741061538063, 0.2670859485837918, 0.250028768165833], [61.69810566434374, 0.13381314937730351, 1.4432031249121342], [68.48791909527054, 0.3532405661150263, 0.2744158905878183], [75.75330638607028, 0.1819289753016262, 5.9999997117659625]], "peak_params_": [[6.9040691982719045, 0.31462235400260774, 3.729491285679758], [9.671824410104284, 0.7953214385028781, 3.3650638941683315], [55.94290095083146, 0.17358111250791475, 0.8897479418821577], [57.78741061538063, 0.1933740413305225, 0.500057536331666], [61.69810566434374, 0.14406809523027286, 2.8864062498242684], [68.48791909527054, 0.15165932401003013, 0.5488317811756366], [75.75330638607028, 0.1817752654500875, 11.999999423531925]], "r_squared_": 0.9903154444190752, "error_": 0.04118610104711368}
{"freq_range": [2.0, 80.0], "freq_res": 1.0, "aperiodic_params_": [0.2807603543707473, 0.8977293532754816], "gaussian_params_": [[9.17307950267943, 0.8545464992535702, 1.990996313922729]], "peak_params_": [[9.17307950267943, 0.851323680851675, 3.981992627845458]], "r_squared_": 0.9210378072174381, "error_": 0.10372546476026022}
{"freq_range": [2.0, 80.0], "freq_res": 1.0, "aperiodic_params_": [0.6911527817429853, 1.1453629487180728], "gaussian_params_": [[8.925222482444646, 0.6855415397016374, 1.6112736519840662], [47.54019205622272, 0.17381032864802476, 1.122325758430753], [51.52833337508673, 1.13010874757045, 0.26114436526481], [57.25109776102755, 0.18587601773139198, 1.9430848248838877], [61.47007816058796, 1.027227553357878, 0.2563970255243792], [63.95038853682032, 0.30591649388371583, 0.6811459468986071], [66.84185182386489, 0.1877613216845516, 1.2132636320342622], [75.35971858147973, 0.2557584525785212, 4.139351806417798]], "peak_params_": [[8.925222482444646, 0.6848036806113476, 3.2225473039681325], [47.54019205622272, 0.15982105189995854, 2.244651516861506], [51.52833337508673, 0.22606767299459474, 0.52228873052962], [57.25109776102755, 0.18434414047059255, 3.8861696497677753], [61.47007816058796, 0.22087052135675833, 0.5127940510487584], [63.95038853682032, 0.3235585432586032, 1.3622918937972142], [66.84185182386489, 0.21946522313288241, 2.4265272640685245], [75.35971858147973, 0.25479453174872546, 8.278703612835596]], "r_squared_": 0.9835976307731558, "error_": 0.042350714343398516}
{"freq_range": [2.0, 80.0], "freq_res": 1.0, "aperiodic_params_": [0.18098596089818503, 0.598147770211643], "gaussian_params_": [[5.7679619719001805, 0.48113089483165533, 5.103266361333085], [20.492391494012672, 0.21670542626192252, 1.2566873116875694], [37.747203545037735, 0.35100516855668534, 0.28121977999064746], [40.64895750054979, 0.40109513627038, 0.5956724907579198], [43.81463285881936, 0.2954020384932794, 0.4740719259713025], [56.698654876490664, 0.26223433752188563, 1.2868339404607347], [63.733561039650574, 0.2831489155728812, 2.6175486482799215], [66.98221422633732, 0.1859067547373813, 0.250015564574931]], "peak_params_": [[5.7679619719001805, 0.4806338098248565, 10.20653272266617], [20.492391494012672, 0.2105428515628554, 2.513374623375139], [37.747203545037735, 0.2343584339728717, 0.5624395599812949], [40.64895750054979, 0.3371570535969558, 1.1913449815158397], [43.81463285881936, 0.27366174287768885, 0.948143851942605], [56.698654876490664, 0.26549374999420505, 2.5736678809214695], [63.733561039650574, 0.28168586805119367, 5.235097296559843], [66.98221422633732, 0.31541241144439125, 0.500031129149862]], "r_squared_": 0.8983816334510236, "error_": 0.08412256911792491}
{"freq_range": [2.0, 80.0], "freq_res": 1.0, "aperiodic_params_": [0.1367274240372981, 0.5596275560895833], "gaussian_params_": [[6.6124419861862975, 0.5962191585738122, 4.611641152949223], [38.040957581895796, 0.22856627943340976, 0.6275173345023078], [40.599107049270884, 0.43733498910957197, 0.6825634266278177], [57.417194111346866, 0.31390322404267257, 1.2721636518110333], [61.09655948615303, 0.3947127445766762, 0.8733591608034836], [64.05454143093289, 0.365742274620486, 1.0700501019902167], [66.53080565958197, 1.3312562791090803, 0.2502502360709565], [71.54568326286959, 0.8214207264224951, 0.2667843576004673], [74.4743064690238, 1.1739835484794037, 0.2542170288179049], [78.4459781976016, 0.2702435021235321, 4.033503153532382]], "peak_params_": [[6.6124419861862975, 0.5941174534643117, 9.223282305898445], [38.040957581895796, 0.22839055661599217, 1.2550346690046157], [40.599107049270884, 0.3680533361561308, 1.3651268532556353], [57.417194111346866, 0.2974764377297886, 2.5443273036220666], [61.09655948615303, 0.4044995309195574, 1.7467183216069673], [64.05454143093289, 0.36728265293142937, 2.1401002039804333], [66.53080565958197, 0.24267764604282027, 0.500500472141913], [71.54568326286959, 0.26804700469993736, 0.5335687152009346], [74.4743064690238, 0.35315701724951176, 0.5084340576358098], [78.4459781976016, 0.26859662559052033, 8.067006307064764]], "r_squared_": 0.9122315243573413, "error_": 0.07376899541483915}
{"freq_range": [2.0, 80.0], "freq_res": 1.0, "aperiodic_params_": [0.25440031326943424, 0.8004155288832657], "gaussian_params_": [[8.02968843081014, 0.7716691717777215, 3.7447870479591807], [40.4860885203273, 0.48812715374173116, 0.6562574571890017], [56.18860108165126, 0.2800861153516368, 0.7547222398330489], [58.234691578903266, 0.4843617152360857, 0.29578238517809746], [61.00353151480335, 0.34913361240594337, 0.9682873721206899], [64.66997167051774, 0.24670389532616643, 2.5941856501185057], [75.94484585367266, 0.31819994228855053, 4.520009014195357]], "peak_params_": [[8.02968843081014, 0.7716449216201093, 7.489574095918361], [40.4860885203273, 0.37102121468361804, 1.3125149143780035], [56.18860108165126, 0.2724215971657795, 1.5094444796660977], [58.234691578903266, 0.3812886375583594, 0.5915647703561949], [61.00353151480335, 0.44117259020885147, 1.9365747442413799], [64.66997167051774, 0.26174844424644106, 5.188371300237011], [75.94484585367266, 0.3181940425079022, 9.040018028390714]], "r_squared_": 0.9448144803496629, "error_": 0.06998586202199814}
{"freq_range": [2.0, 80.0], "freq_res": 1.0, "aperiodic_params_": [1.0477933993798256, 1.4126817030437988], "gaussian_params_": [[7.531557977154128, 0.34060192709232734, 1.5727816526587268], [10.082620200991363, 0.8210226715705569, 1.2778340049771266], [40.44291379711568, 0.6414990819538088, 0.2756674730206142], [51.94573319718252, 0.13962523038782781, 1.1719083418307286], [55.69950910162766, 0.31891280592238397, 0.3262623346135459], [57.877637173156074, 0.29077844981887513, 0.7538017873271659], [61.33290489982844, 0.3623501705013814, 0.8644574459151325], [63.82839741616357, 0.20321519603988245, 0.644085780186616], [66.51666080930434, 0.17897344209159627, 0.9283015396018918], [69.05629825832526, 0.14117387003627851, 0.6629170619198189], [71.54675627581189, 0.5678197627303105, 0.3206666879299145], [74.50216764195356, 0.8531134423925895, 0.27434594412959434], [75.95940858551907, 0.2093469649695122, 3.7015881846713867]], "peak_params_": [[7.531557977154128, 0.543372403591593, 3.1455633053174537], [10.082620200991363, 0.9187019668654444, 2.5556680099542533], [40.44291379711568, 0.17645606192660024, 0.5513349460412283], [51.94573319718252, 0.13947561308890744, 2.343816683661457], [55.69950910162766, 0.2220984659615377, 0.6525246692270918], [57.877637173156074, 0.287188805211005, 1.5076035746543317], [61.33290489982844, 0.33658054566608775, 1.728914891830265], [63.82839741616357, 0.20490481055201237, 1.288171560373232], [66.51666080930434, 0.16862369888432482, 1.8566030792037835], [69.05629825832526, 0.18141472110854218, 1.3258341238396378], [71.54675627581189, 0.3272700281784875, 0.641333375859829], [74.50216764195356, 0.36686080900019435, 0.5486918882591887], [75.95940858551907, 0.20933466545529922, 7.4031763693427735]], "r_squared_": 0.9931414769722671, "error_": 0.033484659422674895}
{"freq_range": [2.0, 80.0], "freq_res": 1.0, "aperiodic_params_": [1.0549233573000099, 1.4374971561776229], "gaussian_params_": [[7.255354708944212, 0.3264457719379202, 0.9250350548602557], [9.823007260534496, 0.9952449763704888, 1.2408968195718053], [57.65293474604836, 0.6456294433208843, 0.2603836071468937], [61.35533052785871, 0.260496764395366, 0.5972147772624719], [64.35274917896677, 0.10480928411137988, 2.1476512037946964], [74.85929401817938, 0.21246984115896853, 5.999999999999999]], "peak_params_": [[7.255354708944212, 0.3890730420686904, 1.8500701097205114], [9.823007260534496, 0.9891734346180129, 2.4817936391436106], [57.65293474604836, 0.2709995882766736, 0.5207672142937874], [61.35533052785871, 0.263973249792399, 1.1944295545249437], [64.35274917896677, 0.14472354413219346, 4.295302407589393], [74.85929401817938, 0.21241190770398632, 11.999999999999998]], "r_squared_": 0.988722744685335, "error_": 0.04509781806016184}
{"freq_range": [2.0, 80.0], "freq_res": 1.0, "aperiodic_params_": [0.9561706796462598, 1.4082567318800903], "gaussian_params_": [[9.50694731989527, 1.106392517381378, 1.600674409346469], [61.553468384091744, 0.2656303771942552, 0.578904074255749], [74.10459188059819, 0.19636550834034336, 5.999999999999999]], "peak_params_": [[9.50694731989527, 1.0551301100396615, 3.201348818692938], [61.553468384091744, 0.22294060963067142, 1.157808148511498], [74.10459188059819, 0.19633567542737462, 11.999999999999998]], "r_squared_": 0.9880110558787374, "error_": 0.0502063199496101}
{"freq_range": [2.0, 80.0], "freq_res": 1.0, "aperiodic_params_": [0.8914666080904302, 1.352018656127916], "gaussian_params_": [[9.367552762222335, 1.0142875553969932, 1.5503256211168999], [61.49773989927772, 1.1754208750149837, 0.2633644302436619], [64.45556386623787, 0.581812565291186, 0.2502335046370663], [69.45203459913596, 0.12459032836289952, 5.999999999999999], [74.49223815141525, 0.36215987279556633, 0.2580548203450579], [78.33476245415694, 0.10496122820812974, 5.410759929647321]], "peak_params_": [[9.367552762222335, 0.9861791450449935, 3.1006512422337997], [61.49773989927772, 0.24386571496618403, 0.5267288604873238], [64.45556386623787, 0.1965238294604097, 0.5004670092741326], [69.45203459913596, 0.14793535661897605, 11.999999999999998], [74.49223815141525, 0.22835088333926246, 0.5161096406901158], [78.33476245415694, 0.14992007545850017, 10.821519859294643]], "r_squared_": 0.9867348375617859, "error_": 0.04707450500128257}
{"freq_range": [2.0, 80.0], "freq_res": 1.0, "aperiodic_params_": [0.9024456384249582, 1.3624200496862229], "gaussian_params_": [[9.353471309789747, 1.0136291263066974, 1.5379174648846006], [61.50046586506403, 1.0271399297413994, 0.26435212151263815], [64.49591190887644, 0.4922948704220141, 0.26066079379051327], [66.9040691982719, 0.12322211199509346, 5.999999999999999], [76.51360678746511, 0.15801441179366352, 4.846763441310729]], "peak_params_": [[9.353471309789747, 0.9872069520729934, 3.075834929769201], [61.50046586506403, 0.26229861623473694, 0.5287042430252763], [64.49591190887644, 0.19582417095419546, 0.5213215875810265], [66.9040691982719, 0.14622353725902348, 11.999999999999998], [76.51360678746511, 0.18713466566465464, 9.693526882621457]], "r_squared_": 0.984810013602092, "error_": 0.04954507358398401}
{"freq_range": [2.0, 80.0], "freq_res": 1.0, "aperiodic_params_": [0.293359269147401, 1.1530676149092505], "gaussian_params_": [[9.614382168437952, 0.7833994803456074, 1.3992664550468874], [40.08498396736401, 0.18745343737064793, 0.7508794771274799], [43.990022402283145, 0.1892439579879208, 0.2500000000461432], [62.30124414642104, 0.27122136268458197, 0.2980717752249333], [73.93234127440799, 0.12869119446947822, 5.999999999999999], [79.45336425530357, 0.4046338880427508, 0.2906737853583641]], "peak_params_": [[9.614382168437952, 0.7542086227116067, 2.798532910093775], [40.08498396736401, 0.18625669239643194, 1.5017589542549599], [43.990022402283145, 0.18909404206036928, 0.5000000000922864], [62.30124414642104, 0.18056590613558798, 0.5961435504498666], [73.93234127440799, 0.12868301264504822, 11.999999999999998], [79.45336425530357, 0.20998200686088753, 0.5813475707167282]], "r_squared_": 0.9820700132998073, "error_": 0.047186498090930375}
{"freq_range": [2.0, 80.0], "freq_res": 1.0, "aperiodic_params_": [0.7691360540339491, 1.2407230126691615], "gaussian_params_": [[8.957719330564949, 0.5727048762006359, 1.6160097854896782], [9.626975839642942, 0.7588563031437798, 0.40185438412539665], [11.493361101170064, 0.4917340239873273, 0.326358586837207], [38.28041021386158, 0.2633819037610165, 0.46124868799035296], [40.490920680761654, 0.8858040676630133, 0.3173362087476056], [56.1967733289043, 0.18481200633178319, 1.4201002753234047], [58.26140421572455, 0.23509016463815718, 0.2942974729923962], [63.7767335251355, 0.28490575447848965, 2.7312347039936635], [70.81859488733035, 0.06442374726497159, 0.7572381322549852], [76.73966659964607, 0.26748394920053065, 4.0770811892239465]], "peak_params_": [[8.957719330564949, 0.7971918209969017, 3.2320195709793564], [9.626975839642942, 0.958404649858947, 0.8037087682507933], [11.493361101170064, 0.41676637137517836, 0.652717173674414], [38.28041021386158, 0.21894297196002432, 0.9224973759807059], [40.490920680761654, 0.26795710065648914, 0.6346724174952112], [56.1967733289043, 0.18799261397532163, 2.8402005506468093], [58.26140421572455, 0.27142444140353095, 0.5885949459847925], [63.7767335251355, 0.28598373035690217, 5.462469407987327], [70.81859488733035, 0.17052704421073117, 1.5144762645099703], [76.73966659964607, 0.26694152910734426, 8.154162378447893]], "r_squared_": 0.9892512452640808, "error_": 0.03796398227352967}
{"freq_range": [2.0, 80.0], "freq_res": 1.0, "aperiodic_params_": [0.8097378208293622, 1.3086948733384707], "gaussian_params_": [[9.669159889797173, 1.0198874877825586, 1.6413251830913524], [40.346286787308564, 0.38600901199538973, 0.4908251294606083], [57.149742454125466, 0.24736451571556572, 1.1233229685296005], [61.33524143485625, 0.3203780806825027, 0.8347604953698863], [65.30899324483127, 0.19406151993739632, 2.3091473006265626], [71.51126110026517, 0.6280556813245068, 0.2946932838682121], [74.49433066676796, 1.2084530369571298, 0.2502903716148261], [79.99999999999999, 0.2669908110951724, 5.996675936031709]], "peak_params_": [[9.669159889797173, 0.9993774984110619, 3.282650366182705], [40.346286787308564, 0.30096130704920543, 0.9816502589212166], [57.149742454125466, 0.24564702997095766, 2.246645937059201], [61.33524143485625, 0.3320412083601145, 1.6695209907397726], [65.30899324483127, 0.20404294550088253, 4.618294601253125], [71.51126110026517, 0.271327548977665, 0.5893865677364242], [74.49433066676796, 0.3338793136371636, 0.5005807432296522], [79.99999999999999, 0.2669908114104129, 11.993351872063418]], "r_squared_": 0.9797295575188323, "error_": 0.058505686770989065}
{"freq_range": [2.0, 80.0], "freq_res": 1.0, "aperiodic_params_": [1.017282706973934, 1.39490269628143], "gaussian_params_": [[9.794171474426044, 1.0748834847865676, 1.601380791226592], [40.368907549845694, 0.5186296459862739, 0.25141143321134457], [61.27692242072257, 0.26395616967402213, 0.7454582688204141], [64.19102566849126, 0.26387638537440666, 0.5379556660644175], [66.45970939294372, 0.7891465284320922, 0.2777495686054553], [71.8013758128435, 0.2895082951475879, 0.8160137394445712], [74.45252213624889, 0.7635400554326347, 0.28468085154637446], [77.09924630040949, 0.24170009190166725, 0.7512823096688082]], "peak_params_": [[9.794171474426044, 1.0660412744716337, 3.202761582453184], [40.368907549845694, 0.17673261831199394, 0.5028228664226891], [61.27692242072257, 0.24635771420413688, 1.4909165376408282], [64.19102566849126, 0.24808770467434482, 1.075911332128835], [66.45970939294372, 0.2015095873193924, 0.5554991372109106], [71.8013758128435, 0.2810577736025317, 1.6320274788891425], [74.45252213624889, 0.22357822752862, 0.5693617030927489], [77.09924630040949, 0.23960030265968135, 1.5025646193376163]], "r_squared_": 0.98669068959897, "error_": 0.04826225916340432}
{"freq_range": [2.0, 80.0], "freq_res": 1.0, "aperiodic_params_": [1.084780272796102, 1.3137409360846666], "gaussian_params_": [[9.799434310829003, 0.9724098786891298, 1.3812006210949672]], "peak_params_": [[9.799434310829003, 0.962211486345506, 2.7624012421899344]], "r_squared_": 0.9832042520167976, "error_": 0.05880523081655707}
{"freq_range": [2.0, 80.0], "freq_res": 1.0, "aperiodic_params_": [0.4616916598730983, 1.0358970633328775], "gaussian_params_": [[9.391341442239373, 1.0031890936731191, 1.4061195437824339], [62.45203459913595, 0.1475730072641815, 5.999999999999998], [76.97735290290488, 0.18263369745891472, 4.418141921703246]], "peak_params_": [[9.391341442239373, 0.9650792446356495, 2.8122390875648677], [62.45203459913595, 0.14773844027939065, 11.999999999999996], [76.97735290290488, 0.1904368306104265, 8.836283843406491]], "r_squared_": 0.9759687377825561, "error_": 0.05546080917780095}
{"freq_range": [2.0, 80.0], "freq_res": 1.0, "aperiodic_params_": [0.6432353996508527, 1.058433020414301], "gaussian_params_": [[8.018104110544344, 0.2212648181207652, 4.356990717382792], [62.90407035749784, 0.11881904334636602, 5.999999999999999], [71.53012531401667, 1.1307736873309344, 0.25001943804332805], [74.03776396587979, 0.19943766414190053, 0.7942035617130536], [77.18732467829406, 0.23250914719859583, 0.503459840491611], [79.21313200189452, 0.2185950165134785, 0.5506829894153461]], "peak_params_": [[8.018104110544344, 0.22126290799654674, 8.713981434765584], [62.90407035749784, 0.11880385776395075, 11.999999999999998], [71.53012531401667, 0.2384568131764686, 0.5000388760866561], [74.03776396587979, 0.22070273593886225, 1.5884071234261072], [77.18732467829406, 0.22474022213201827, 1.006919680983222], [79.21313200189452, 0.20642911337752734, 1.1013659788306922]], "r_squared_": 0.9746559644198735, "error_": 0.05047576117587616}
{"freq_range": [2.0, 80.0], "freq_res": 1.0, "aperiodic_params_": [0.8142812418581338, 1.3154722060050978], "gaussian_params_": [[9.680665651970088, 1.0160661876633033, 1.635196466772797], [40.45165650010319, 1.0344247499920651, 0.2848969701209084], [55.70578057171358, 0.3360706897193016, 0.30943324861002103], [57.530986197767426, 1.0527489145600037, 0.2777064874902713], [61.37672416737856, 0.34004324751912135, 0.9376754557576013], [65.38993984760769, 0.2151113146258416, 1.6625178602253825], [71.54452491674306, 0.6220862948145389, 0.27267427662928945], [74.48173429599947, 0.7303483805695701, 0.2768453849570907], [78.76370751109712, 0.24209526556422784, 5.999999999999999]], "peak_params_": [[9.680665651970088, 0.9968746729408099, 3.270392933545594], [40.45165650010319, 0.29440629644653626, 0.5697939402418168], [55.70578057171358, 0.2140326089215967, 0.6188664972200421], [57.530986197767426, 0.25403847497023224, 0.5554129749805427], [61.37672416737856, 0.32328790633667914, 1.8753509115152025], [65.38993984760769, 0.22690023531154102, 3.325035720450765], [71.54452491674306, 0.2824802437669329, 0.5453485532585789], [74.48173429599947, 0.3373528274548159, 0.5536907699141814], [78.76370751109712, 0.2419075997132769, 11.999999999999998]], "r_squared_": 0.9837747953548521, "error_": 0.050492450338189054}
{"freq_range": [2.0, 80.0], "freq_res": 1.0, "aperiodic_params_": [0.8078201497153401, 1.3279600325573557], "gaussian_params_": [[9.838531294541392, 1.0444816550356868, 1.3837486813935973], [58.257271546163146, 0.2810011474457594, 0.4119186344298489], [61.425679249208635, 0.33896778789343845, 0.6907030249642524], [72.33311277295206, 0.2733515686095846, 0.25000045708900764], [75.69525770646484, 0.19434565922658617, 5.999999995630546]], "peak_params_": [[9.838531294541392, 1.0373947671117438, 2.7674973627871946], [58.257271546163146, 0.23372015355868747, 0.8238372688596978], [61.425679249208635, 0.2900197382180354, 1.3814060499285048], [72.33311277295206, 0.2732826708478435, 0.5000009141780153], [75.69525770646484, 0.1940951476734667, 11.999999991261092]], "r_squared_": 0.9822556450264597, "error_": 0.057004603688694755}
{"freq_range": [2.0, 80.0], "freq_res": 1.0, "aperiodic_params_": [0.647477200994646, 1.1478915758575177], "gaussian_params_": [[9.768700543878143, 0.8958358024732309, 1.455016546754732], [72.41688809180789, 0.14891703467078934, 5.999999999999999]], "peak_params_": [[9.768700543878143, 0.8845879150621443, 2.910033093509464], [72.41688809180789, 0.1485580079170985, 11.999999999999998]], "r_squared_": 0.978974695712224, "error_": 0.056027729995637904}
{"freq_range": [2.0, 80.0], "freq_res": 1.0, "aperiodic_params_": [-0.3489147348854528, 0.9793572611736111], "gaussian_params_": [[9.963938198075867, 0.22026597398232517, 2.6339958171379916], [15.570645535071561, 0.4887963421877665, 0.27990432320425146], [21.12744197615366, 0.23237080648340647, 2.0464409439927658], [35.496808739318034, 0.1271041757980272, 0.7924847459760047], [39.31118011588863, 0.2488194723169677, 0.25001718014815577], [51.17977752166952, 0.20766856489576874, 0.8699978983291723], [54.8127277418072, 0.20058564195515471, 0.41280819900249865], [57.640485899726755, 0.17449703198459968, 0.9814272372406757], [62.2039187563555, 0.17664867413311378, 0.6146126519417913], [68.15104880643484, 0.133083166844677, 0.6815211108532441], [75.95149067026432, 0.12759290213501012, 0.7409441971264916]], "peak_params_": [[9.963938198075867, 0.22024541981827483, 5.267991634275983], [15.570645535071561, 0.17674077314347603, 0.5598086464085029], [21.12744197615366, 0.23195461536156947, 4.0928818879855315], [35.496808739318034, 0.10442876727805861, 1.5849694919520094], [39.31118011588863, 0.1146900030893645, 0.5000343602963115], [51.17977752166952, 0.2032817710953576, 1.7399957966583446], [54.8127277418072, 0.1856619983804737, 0.8256163980049973], [57.640485899726755, 0.16317339845799483, 1.9628544744813514], [62.2039187563555, 0.167197657038606, 1.2292253038835825], [68.15104880643484, 0.12985432580862089, 1.3630422217064881], [75.95149067026432, 0.1273197461171094, 1.4818883942529832]], "r_squared_": 0.9902975985734994, "error_": 0.02538393593001284}
{"freq_range": [2.0, 80.0], "freq_res": 1.0, "aperiodic_params_": [-0.04599073272621883, 1.2032337421566632], "gaussian_params_": [[9.323620778061173, 0.9029422130658984, 1.467416952586424], [12.441732169368445, 1.059004145860279, 0.26554669547618315], [20.45425620111166, 0.6494984302612543, 0.2766675740684047], [52.565787543302115, 0.7144155530202295, 0.25319203603209334], [55.425633031591374, 0.633348929216203, 0.2500110919858158], [67.9697221369507, 0.16012692970537307, 0.49349002555833094], [78.78686987226952, 0.13913678665353368, 2.475040988451886]], "peak_params_": [[9.323620778061173, 0.8812489085966673, 2.934833905172848], [12.441732169368445, 0.4365959449953031, 0.5310933909523663], [20.45425620111166, 0.1687313940191668, 0.5533351481368094], [52.565787543302115, 0.1641749787841369, 0.5063840720641867], [55.425633031591374, 0.14868682936153577, 0.5000221839716316], [67.9697221369507, 0.1598362674306042, 0.9869800511166619], [78.78686987226952, 0.13862187582784813, 4.950081976903772]], "r_squared_": 0.9907353490163552, "error_": 0.040415500095193256}
{"freq_range": [2.0, 80.0], "freq_res": 1.0, "aperiodic_params_": [-0.26411012546366375, 0.9332321071812737], "gaussian_params_": [[9.180913377748972, 0.7701366313623541, 1.8983287836409208], [43.59595480464717, 0.1636272629412858, 2.06998956286828], [51.96971656470414, 0.18399886274446287, 2.239633141499763], [56.938508238267396, 0.1726893227162195, 0.5754616385613178], [60.44387477237113, 0.1551114450780483, 1.4640530979428192], [64.47319487464736, 0.3173250791756991, 0.48011304088404666], [72.10981570735508, 0.2765044504842785, 5.999999999923444]], "peak_params_": [[9.180913377748972, 0.7666472329988789, 3.7966575672818417], [43.59595480464717, 0.16087183643974123, 4.13997912573656], [51.96971656470414, 0.18503067296541897, 4.479266282999526], [56.938508238267396, 0.20783217143783506, 1.1509232771226356], [60.44387477237113, 0.18451104118794515, 2.9281061958856385], [64.47319487464736, 0.3142750942721919, 0.9602260817680933], [72.10981570735508, 0.2764581418272989, 11.999999999846889]], "r_squared_": 0.9592529428237192, "error_": 0.059012197611145574}
{"freq_range": [2.0, 80.0], "freq_res": 1.0, "aperiodic_params_": [0.12087986250540599, 1.2563730346148565], "gaussian_params_": [[6.446282797082384, 0.7574343509469431, 0.2550524421849779], [9.86771495937561, 0.7911813478080229, 1.7997921177952496], [51.79937624212686, 0.11731576648185084, 1.1675629219744776], [55.37252236789287, 0.48555685028183704, 0.2528445620804343], [58.94647992870005, 0.1100656262279625, 1.5195074595246358], [62.43924145989673, 0.4094200897665913, 0.280395038856654], [64.4453824551023, 0.45468821629961886, 0.28217511481620017], [67.71990432384597, 0.2908874285797092, 0.25849781027616686], [70.00404792306391, 0.057941410492251544, 0.25051319586140364], [75.54796540086404, 0.17000272039949654, 5.999999994194703]], "peak_params_": [[6.446282797082384, 0.24248087965987075, 0.5101048843699558], [9.86771495937561, 0.7890471414423516, 3.5995842355904992], [51.79937624212686, 0.11567661310813193, 2.3351258439489553], [55.37252236789287, 0.17101037101388594, 0.5056891241608686], [58.94647992870005, 0.11378806602214131, 3.0390149190492717], [62.43924145989673, 0.14793011393111932, 0.560790077713308], [64.4453824551023, 0.15794674926029906, 0.5643502296324003], [67.71990432384597, 0.23878109575402884, 0.5169956205523337], [70.00404792306391, 0.1687991021657913, 0.5010263917228073], [75.54796540086404, 0.16952093835057136, 11.999999988389407]], "r_squared_": 0.9892571058549358, "error_": 0.03878277241766493}
