{"freq_range": [2.0, 80.0], "freq_res": 1.0, "aperiodic_params_": [0.1976782761942288, 0.6964646040347524], "gaussian_params_": [[2.4510475061577317, 0.45400458315429965, 0.6357124192591357], [6.915360169549068, 0.2705195123056131, 3.6035758622028475], [22.123880820891312, 0.24221131208196608, 1.7141839600934219], [43.088955097043446, 0.2236129822238055, 1.1947053399960899], [47.6605558109196, 0.21532781303964502, 2.0394408658176704], [53.64870646781517, 0.24048779944859766, 0.6854786504029272], [58.261188206632525, 0.20845358300403768, 0.9863825484433264], [62.322577761223485, 0.17484905485414087, 0.8507572080520976], [65.00044655539715, 0.0660768190676126, 0.25015118652809964], [69.20154586796389, 0.18522831323701452, 5.999999405781801], [72.99989544956138, 0.11298343359501672, 0.25000641799322054]], "peak_params_": [[2.4510475061577317, 0.4596811820562169, 1.2714248385182714], [6.915360169549068, 0.2704449033578196, 7.207151724405695], [22.123880820891312, 0.24162202307111924, 3.4283679201868438], [43.088955097043446, 0.23882403146016518, 2.3894106799921797], [47.6605558109196, 0.21277377042244638, 4.078881731635341], [53.64870646781517, 0.22010804511123316, 1.3709573008058544], [58.261188206632525, 0.23369681664691155, 1.9727650968866528], [62.322577761223485, 0.25301205087671996, 1.7015144161041953], [65.00044655539715, 0.21226548464059913, 0.5003023730561993], [69.20154586796389, 0.18512384115367364, 11.999998811563602], [72.99989544956138, 0.26457603537881447, 0.5000128359864411]], "r_squared_": 0.9608787127277489, "error_": 0.04267959129978236}
{"freq_range": [2.0, 80.0], "freq_res": 1.0, "aperiodic_params_": [0.23511015143668798, 0.7171905969463949], "gaussian_params_": [[2.5327178339840892, 0.4308778756703276, 0.7747839969767697], [7.526251454204149, 0.28317008676837446, 3.0038205820200226], [19.719142117642527, 0.18370810791864808, 0.4966264266786128], [38.56303478077677, 0.6847403180401325, 0.2610013868513174], [43.95972861606429, 0.2173199431519876, 1.341804814084978], [48.621435896383545, 0.20007958080893207, 1.0622690483939807], [51.52458815653431, 0.7308647137310104, 0.29135308590226505], [54.02798746554367, 0.19692228277126134, 0.44659074908709867], [57.410622874767746, 0.25545868032642693, 0.8725473822356292], [67.425439705225, 0.19931477005803078, 0.6842156311691557], [73.30587094228329, 0.21898762786967926, 0.9242075564324286]], "peak_params_": [[2.5327178339840892, 0.4502186649368317, 1.5495679939535394], [7.526251454204149, 0.27967009272690724, 6.007641164040045], [19.719142117642527, 0.15661034458413325, 0.9932528533572256], [38.56303478077677, 0.16884451855674998, 0.5220027737026348], [43.95972861606429, 0.2172376194655964, 2.683609628169956], [48.621435896383545, 0.18795689989735043, 2.1245380967879615], [51.52458815653431, 0.19432795741816944, 0.5827061718045301], [54.02798746554367, 0.1966594112168546, 0.8931814981741973], [57.410622874767746, 0.22868085286311757, 1.7450947644712584], [67.425439705225, 0.1642800806403184, 1.3684312623383115], [73.30587094228329, 0.20731713814506292, 1.8484151128648572]], "r_squared_": 0.9727468091867612, "error_": 0.037156793411607394}
{"freq_range": [2.0, 80.0], "freq_res": 1.0, "aperiodic_params_": [0.3384429061895247, 0.8829980265096636], "gaussian_params_": [[2.4923343073184583, 0.9512746900272937, 0.2993438134820384], [6.840346517452023, 0.19700823092422085, 4.257635747722254], [8.54943655482203, 0.6364793444250734, 0.25218849089295026], [45.81350023949052, 0.12219255329768057, 3.8319134908093755], [50.49424366221701, 0.9593458257348727, 0.250340689573864], [53.61793685252299, 0.2226087604791501, 0.6844840553839362], [56.37657393466147, 0.6593918168092722, 0.2602603147242736], [60.041476302300474, 0.2912484413502636, 1.8685806464944708], [65.32661705097132, 0.19893555685322578, 1.6743837903899075], [74.96426953167685, 0.22690488983866391, 5.553556461990129]], "peak_params_": [[2.4923343073184583, 0.3492194483458646, 0.5986876269640768], [6.840346517452023, 0.19686977586894142, 8.515271495444509], [8.54943655482203, 0.3022448841043651, 0.5043769817859005], [45.81350023949052, 0.12204819653693644, 7.663826981618751], [50.49424366221701, 0.20392456052460228, 0.500681379147728], [53.61793685252299, 0.20471572251152437, 1.3689681107678724], [56.37657393466147, 0.26433189352552544, 0.5205206294485472], [60.041476302300474, 0.2985829704776706, 3.7371612929889415], [65.32661705097132, 0.24917365002351932, 3.348767580779815], [74.96426953167685, 0.22690020490833174, 11.107112923980258]], "r_squared_": 0.9769188438527111, "error_": 0.03726195783288152}
{"freq_range": [2.0, 80.0], "freq_res": 1.0, "aperiodic_params_": [0.5664358573313768, 0.9209583115043587], "gaussian_params_": [[4.452034599135944, 0.22112288505731623, 5.190804463121784], [8.962262319243646, 0.08090663859874928, 0.2500480665854837], [11.000729448787265, 0.04800419765089472, 0.250033975550601], [20.28439459270617, 0.20549740707362685, 0.45175296230687384], [41.77803902490996, 0.3414996783093978, 0.2501738957188445], [43.98965187091344, 0.21971206502502794, 0.6863677503745692], [47.86488335983404, 0.15738649612482625, 1.1306684045975215], [50.50172535128423, 0.7683739419632752, 0.25867476953801144], [54.88425357705631, 0.12460000384221634, 1.0824915853342567], [57.40752872378932, 0.427869465660467, 0.27731075742403766], [61.76813114466902, 0.19909594549798648, 1.2016266812501224], [66.8090882754443, 0.20065383831022118, 1.8531723718526674], [69.61332425423709, 0.4303916811844791, 0.2522351614904534], [72.71344969533949, 0.15840362203515942, 1.6190667844478042], [78.58276963893594, 0.16483193830300222, 1.7129248188721342]], "peak_params_": [[4.452034599135944, 0.2202860216152273, 10.381608926243567], [8.962262319243646, 0.23063032392390548, 0.5000961331709673], [11.000729448787265, 0.14779563556816683, 0.500067951101202], [20.28439459270617, 0.17104869772124953, 0.9035059246137477], [41.77803902490996, 0.23367693480040186, 0.500347791437689], [43.98965187091344, 0.22014392750730105, 1.3727355007491384], [47.86488335983404, 0.1562667187554413, 2.261336809195043], [50.50172535128423, 0.12375380333454145, 0.5173495390760229], [54.88425357705631, 0.12388977666650303, 2.1649831706685134], [57.40752872378932, 0.16385374786958495, 0.5546215148480753], [61.76813114466902, 0.20234364704943864, 2.403253362500245], [66.8090882754443, 0.19992021716290964, 3.7063447437053347], [69.61332425423709, 0.2173660997113419, 0.5044703229809068], [72.71344969533949, 0.15751251794430954, 3.2381335688956083], [78.58276963893594, 0.16009833521847594, 3.4258496377442684]], "r_squared_": 0.9772798493977578, "error_": 0.03778943210332176}
{"freq_range": [2.0, 80.0], "freq_res": 1.0, "aperiodic_params_": [0.9390444983340506, 1.3453906291095374], "gaussian_params_": [[8.745577221881124, 0.3015584810635667, 3.246078620915831], [13.547965400864056, 0.2389142398975783, 0.25000000000000006], [21.36429555633321, 0.15835616670912595, 1.3239336908045645], [43.74142868169154, 0.20027338420738725, 0.5803747292257969], [50.15697307669557, 0.1527651550624451, 1.1373274591591673], [54.4051423166966, 0.6720239241241268, 0.25000000000000255], [58.37565498015294, 0.17734969069884904, 1.4985630859591066], [65.12545510162015, 0.2551704416307032, 2.326714738450932], [69.46664537795327, 1.179606694422775, 0.2500537171291839], [72.6192722347179, 0.22518749853809988, 1.4091971035599011], [76.8337016800173, 0.23158213461786456, 0.8548681920999637], [79.29755511370809, 0.23276612736128421, 0.49419444016086306]], "peak_params_": [[8.745577221881124, 0.3006336367169241, 6.492157241831662], [13.547965400864056, 0.1279507305567048, 0.5000000000000001], [21.36429555633321, 0.15271580918652106, 2.647867381609129], [43.74142868169154, 0.18135157633557286, 1.1607494584515938], [50.15697307669557, 0.15131705631015047, 2.2746549183183347], [54.4051423166966, 0.18376698909418865, 0.5000000000000051], [58.37565498015294, 0.174209882605582, 2.997126171918213], [65.12545510162015, 0.25481001444575924, 4.653429476901864], [69.46664537795327, 0.2788724993729246, 0.5001074342583678], [72.6192722347179, 0.21795793978451328, 2.8183942071198023], [76.8337016800173, 0.22904183687868884, 1.7097363841999274], [79.29755511370809, 0.20352391807248105, 0.9883888803217261]], "r_squared_": 0.9903763345599959, "error_": 0.03666150547004103}
{"freq_range": [2.0, 80.0], "freq_res": 1.0, "aperiodic_params_": [0.06636044080702871, 0.4859707829172355], "gaussian_params_": [[3.4520345991359433, 0.38039914023199356, 3.09792888381001], [9.44343886120896, 0.7580685894625616, 0.28068561082608473], [10.75576379510961, 0.22211912544817367, 0.2500076486194356], [19.56920123306053, 0.23680811300432358, 0.99196843078302], [23.554727087266357, 0.19341482311022987, 0.8932316583452626], [36.395038397291465, 0.6314306784086852, 0.25891346987431224], [38.55314244720445, 0.8300059273403483, 0.2597687475085832], [43.9069951585337, 0.15951204625162146, 0.7708601433362304], [48.61005340755662, 0.2080334598639822, 5.9678129462006435], [57.517946401768604, 0.2112298160218294, 0.744234034139621], [63.82578672964355, 0.1881347056544313, 0.8165865367691892], [67.71830019371961, 0.18511786292542942, 0.8827632724334099], [73.49951667145041, 0.13459065687636831, 1.1188965085301685]], "peak_params_": [[3.4520345991359433, 0.37637103892640306, 6.19585776762002], [9.44343886120896, 0.2941616531937945, 0.5613712216521695], [10.75576379510961, 0.1573834609415773, 0.5000152972388712], [19.56920123306053, 0.21556989149741296, 1.98393686156604], [23.554727087266357, 0.17086937121284201, 1.7864633166905253], [36.395038397291465, 0.2194775282487486, 0.5178269397486245], [38.55314244720445, 0.2459139478297625, 0.5195374950171664], [43.9069951585337, 0.312722060483263, 1.5417202866724609], [48.61005340755662, 0.20758983127732633, 11.935625892401287], [57.517946401768604, 0.23159063963537385, 1.488468068279242], [63.82578672964355, 0.19140975601099797, 1.6331730735383785], [67.71830019371961, 0.17699070455076382, 1.7655265448668198], [73.49951667145041, 0.12187404576124183, 2.237793017060337]], "r_squared_": 0.9553172135919866, "error_": 0.0388482748540688}
{"freq_range": [2.0, 80.0], "freq_res": 1.0, "aperiodic_params_": [0.44763049691243334, 1.1015768034537312], "gaussian_params_": [[2.4955855193112892, 1.1253424579422273, 0.30084565049427525], [5.555490847338174, 0.1496908548363394, 1.5782968467565917], [8.561794515415576, 0.36297612370430665, 0.894389468390205], [11.46013670156604, 0.14590254556777973, 4.147922916407517], [11.485312334315553, 0.7132975203415989, 0.2615711804568872], [42.472183232589536, 0.8905776879464423, 0.2635426937721599], [47.40086201810741, 0.15463881617317704, 1.8535992530537908], [60.79631878851771, 0.21833455921046216, 5.339592821077688], [68.77899972545433, 0.12149434015852402, 2.5781909929759905], [77.54796540086404, 0.2274867896396058, 5.999999999999999]], "peak_params_": [[2.4955855193112892, 0.3124178513165034, 0.6016913009885505], [5.555490847338174, 0.21122009196034808, 3.1565936935131833], [8.561794515415576, 0.4581269558676513, 1.78877893678041], [11.46013670156604, 0.281804160949047, 8.295845832815035], [11.485312334315553, 0.281804160949047, 0.5231423609137744], [42.472183232589536, 0.18156051430512132, 0.5270853875443198], [47.40086201810741, 0.15881812221252645, 3.7071985061075816], [60.79631878851771, 0.2245297217751061, 10.679185642155376], [68.77899972545433, 0.27057793504272776, 5.156381985951981], [77.54796540086404, 0.22826095411920866, 11.999999999999998]], "r_squared_": 0.9847115085710428, "error_": 0.0415482283931401}
{"freq_range": [2.0, 80.0], "freq_res": 1.0, "aperiodic_params_": [0.08772656980100974, 0.3994926129803996], "gaussian_params_": [[4.452034599135944, 0.3034015908311871, 3.4178158249262993], [8.954991225194814, 0.07340136579905907, 0.25003970800940006], [17.715828346986367, 0.2692555767158645, 0.4824840873903435], [32.468936299192016, 0.4979594574122815, 0.304689187808453], [34.58736423698104, 0.5656255710735303, 0.2799580904718467], [42.637414509556756, 0.3769299808960518, 0.25088270246596933], [51.20602372239685, 0.15130173308363407, 4.98533933459703], [60.40337177218518, 0.16439663742965643, 1.409766785755337], [64.04576672672556, 0.2531295301459692, 0.6653511071008513], [70.1880339600838, 0.19870358380447173, 2.573591259918886], [78.3917265105393, 0.12548433711650742, 1.7381602645067795]], "peak_params_": [[4.452034599135944, 0.30075957092284406, 6.835631649852599], [8.954991225194814, 0.1973981173747295, 0.5000794160188001], [17.715828346986367, 0.22649739688251835, 0.964968174780687], [32.468936299192016, 0.1524372904265373, 0.609378375616906], [34.58736423698104, 0.1916606008652394, 0.5599161809436934], [42.637414509556756, 0.171687542719121, 0.5017654049319387], [51.20602372239685, 0.1511725893363991, 9.97067866919406], [60.40337177218518, 0.18980970218191323, 2.819533571510674], [64.04576672672556, 0.27553362531503806, 1.3307022142017026], [70.1880339600838, 0.19829912999343613, 5.147182519837772], [78.3917265105393, 0.12432135121206889, 3.476320529013559]], "r_squared_": 0.8867452605973226, "error_": 0.04383281939409087}
{"freq_range": [2.0, 80.0], "freq_res": 1.0, "aperiodic_params_": [0.9348288130679461, 1.2141849582828321], "gaussian_params_": [[7.368911639441713, 0.41000801619683436, 0.2785173539515888], [9.255850779786611, 0.09804399983275722, 5.714290729615754], [20.171829514274773, 0.17999304461877602, 0.6579921526729585], [48.99807439492409, 0.1542797502484917, 0.9859223253302497], [54.37699255302822, 0.15375663835605077, 0.8139418166864346], [57.65810871665797, 0.14498581671617816, 0.7471053039656246], [60.69868882357872, 0.20368228153496906, 0.25496254936330104], [64.44637794422707, 0.19841499609033042, 2.3508439096702074], [69.3199265244874, 0.2534753601077596, 0.573150836054327], [72.0780534549635, 0.281619206917057, 1.3064140075396118]], "peak_params_": [[7.368911639441713, 0.2612313672408757, 0.5570347079031776], [9.255850779786611, 0.0979457894285009, 11.428581459231507], [20.171829514274773, 0.19069905218534167, 1.315984305345917], [48.99807439492409, 0.15427945612909455, 1.9718446506604994], [54.37699255302822, 0.1381295215601832, 1.6278836333728692], [57.65810871665797, 0.1352011910462647, 1.4942106079312492], [60.69868882357872, 0.16906880662103219, 0.5099250987266021], [64.44637794422707, 0.1948701815350995, 4.701687819340415], [69.3199265244874, 0.2648541601282923, 1.146301672108654], [72.0780534549635, 0.2822583076421894, 2.6128280150792236]], "r_squared_": 0.988578178490697, "error_": 0.03298696497415492}
{"freq_range": [2.0, 80.0], "freq_res": 1.0, "aperiodic_params_": [1.1760605514645206, 1.4977030725084106], "gaussian_params_": [[7.154093750431954, 0.26434114809541875, 0.5747388876470026], [9.267121432783052, 0.2676340185765587, 0.29357565830154564], [10.631652023161424, 0.20763714274584277, 0.2500082202182892], [12.442840847070913, 0.1520065866267495, 4.931680465456085], [20.604244765048154, 0.12085664543348537, 1.2119128232478085], [48.418122828818206, 0.48483882052552296, 0.2619060440232614], [49.788065098180255, 0.21236964442230502, 0.4655850238349187], [54.397022611244616, 0.5596530052746931, 0.261065860612105], [57.3467698600384, 0.1517289111624, 0.5288764622316923], [61.724717114691416, 0.1366018101219277, 0.5792652319174838], [68.36085674479673, 0.2634705274185519, 5.505205049397613], [77.44217933854723, 0.6445778414586096, 0.271278073158214], [79.42925239551063, 0.2281624871728399, 0.6201279650384941]], "peak_params_": [[7.154093750431954, 0.3376828913541577, 1.1494777752940053], [9.267121432783052, 0.29757046515072527, 0.5871513166030913], [10.631652023161424, 0.21577332985056236, 0.5000164404365784], [12.442840847070913, 0.151395058220692, 9.86336093091217], [20.604244765048154, 0.1483175513282744, 2.423825646495617], [48.418122828818206, 0.13598314021815527, 0.5238120880465228], [49.788065098180255, 0.1924809876386866, 0.9311700476698374], [54.397022611244616, 0.18485176737754094, 0.52213172122421], [57.3467698600384, 0.1537121352164883, 1.0577529244633845], [61.724717114691416, 0.25717265919430754, 1.1585304638349676], [68.36085674479673, 0.2629051241837259, 11.010410098795226], [77.44217933854723, 0.24776114382188785, 0.542556146316428], [79.42925239551063, 0.22026910685529133, 1.2402559300769882]], "r_squared_": 0.9941750630012902, "error_": 0.03052085494040716}
{"freq_range": [2.0, 80.0], "freq_res": 1.0, "aperiodic_params_": [1.2348731695447284, 1.5509763361617506], "gaussian_params_": [[7.133631615266672, 0.3076039568005842, 0.6352161570511714], [9.330011701570955, 0.32668111598073185, 0.29747796721239267], [10.685474845170507, 0.26968692230065794, 0.25002258787115883], [11.566781103237602, 0.19349763927744512, 4.090154649279558], [20.23460064962304, 0.18029497924232935, 0.6344365710493707], [22.425478622009702, 0.42855158621467, 0.29773188408584667], [49.44133142608442, 0.13458390784052407, 0.8462889429712924], [54.390987391277406, 0.5391962547669986, 0.2759100103726377], [57.451724168066896, 0.21730019141174992, 0.546640044621428], [59.300604963202474, 0.13945507900307977, 0.505607222109666], [61.560363203654966, 0.3147451430079564, 0.3071669984620313], [65.2175554884101, 0.25979617916362663, 2.2372618747511344], [69.70584375182386, 0.2594365421183488, 1.002037271730393], [73.12774962108817, 0.2766974920562004, 1.1480330698331547], [77.12615630189072, 0.31491651470370313, 0.7907952354721041], [79.47989764548686, 0.546581330420305, 0.35946361457773524]], "peak_params_": [[7.133631615266672, 0.4046179921240904, 1.2704323141023428], [9.330011701570955, 0.33957471991471444, 0.5949559344247853], [10.685474845170507, 0.3138899878976486, 0.5000451757423177], [11.566781103237602, 0.19241556783525884, 8.180309298559116], [20.23460064962304, 0.19147713614721296, 1.2688731420987414], [22.425478622009702, 0.16559411378719047, 0.5954637681716933], [49.44133142608442, 0.11747338745038793, 1.6925778859425848], [54.390987391277406, 0.19755605782619923, 0.5518200207452754], [57.451724168066896, 0.1547553207022907, 1.093280089242856], [59.300604963202474, 0.12626325711251285, 1.011214444219332], [61.560363203654966, 0.20537731847862273, 0.6143339969240627], [65.2175554884101, 0.25857498034640547, 4.474523749502269], [69.70584375182386, 0.2817068847293007, 2.004074543460786], [73.12774962108817, 0.2767699578299414, 2.2960661396663093], [77.12615630189072, 0.3118714664673763, 1.5815904709442081], [79.47989764548686, 0.24320472326486264, 0.7189272291554705]], "r_squared_": 0.9957740874865691, "error_": 0.02450870619290349}
{"freq_range": [2.0, 80.0], "freq_res": 1.0, "aperiodic_params_": [1.25183212070105, 1.5598348663398363], "gaussian_params_": [[7.115372530216287, 0.3483993342712483, 0.9603327600172084], [9.417376628015578, 0.705806683317032, 0.29111802699996986], [10.634861924445808, 0.4214714907431738, 0.3127819025854811], [13.462924798144211, 0.17291560715955084, 2.350628123654401], [20.068441147528514, 0.18118534885472523, 0.9054153073453562], [22.391494735061162, 0.4531823643598361, 0.2965391412091686], [49.574190363854065, 0.40196215539437674, 0.3475438236165897], [54.01842272914422, 0.19796318975882665, 0.25000000000252853], [57.2377114993807, 0.2253616224506934, 0.25001206805183535], [58.49283152971813, 0.3282570966587407, 0.30391804992861543], [65.97185383509478, 0.20750512053314246, 4.7703234418214375], [78.21584668248717, 0.20204680070316136, 5.999999999999998]], "peak_params_": [[7.115372530216287, 0.34984161321414203, 1.9206655200344167], [9.417376628015578, 0.33185099774813764, 0.5822360539999397], [10.634861924445808, 0.3131960370112814, 0.6255638051709622], [13.462924798144211, 0.16959473011893683, 4.701256247308802], [20.068441147528514, 0.18428617976342898, 1.8108306146907125], [22.391494735061162, 0.20843158718881294, 0.5930782824183372], [49.574190363854065, 0.1905349480621792, 0.6950876472331794], [54.01842272914422, 0.20638442211044716, 0.5000000000050571], [57.2377114993807, 0.1791928138905352, 0.5000241361036707], [58.49283152971813, 0.14235624574271455, 0.6078360998572309], [65.97185383509478, 0.23293084243948625, 9.540646883642875], [78.21584668248717, 0.21055516004628982, 11.999999999999996]], "r_squared_": 0.9936366752190303, "error_": 0.03260867187268888}
{"freq_range": [2.0, 80.0], "freq_res": 1.0, "aperiodic_params_": [1.0264577173549945, 1.3141671883655026], "gaussian_params_": [[8.760626614797845, 0.24646652199453914, 2.674854246521233], [19.919103090360345, 0.12540689571904354, 0.7560875985968384], [22.42141436642404, 0.4117843474320182, 0.302103159575301], [44.392976933881876, 0.3740227296551988, 0.2633016403808943], [48.94922847228179, 0.1483469834015038, 0.8386113220053397], [54.07543334965459, 0.15054037355471023, 0.2500000000612209], [56.69286094410782, 0.18724646044190366, 0.3527885268301765], [58.5397387478933, 0.45625933897990334, 0.28943564936614324], [65.07119147536886, 0.1787425050403287, 2.1333740158052064], [69.48052063152947, 0.5407059798297486, 0.2807343254340975], [73.2450421441843, 0.14418069039686737, 2.6960731436985577], [78.67409726801966, 0.5012237632683169, 0.2528597481176893]], "peak_params_": [[8.760626614797845, 0.24548158103690051, 5.349708493042466], [19.919103090360345, 0.12472726458456196, 1.5121751971936768], [22.42141436642404, 0.15848751525545324, 0.604206319150602], [44.392976933881876, 0.1227982556637981, 0.5266032807617886], [48.94922847228179, 0.14807535833790664, 1.6772226440106794], [54.07543334965459, 0.14384143774558322, 0.5000000001224418], [56.69286094410782, 0.12832156100128222, 0.705577053660353], [58.5397387478933, 0.1319715510908921, 0.5788712987322865], [65.07119147536886, 0.17998596817965096, 4.266748031610413], [69.48052063152947, 0.19949433902766756, 0.561468650868195], [73.2450421441843, 0.14376538448966092, 5.392146287397115], [78.67409726801966, 0.23320343773225916, 0.5057194962353786]], "r_squared_": 0.993513928787039, "error_": 0.027981233513394887}
{"freq_range": [2.0, 80.0], "freq_res": 1.0, "aperiodic_params_": [0.4825263824764489, 0.582479927039296], "gaussian_params_": [[2.5838759829162425, 0.28877744739533995, 0.5423820447961321], [29.81338188526668, 0.19356353443929528, 0.7261552127245794], [39.86588969768948, 0.1511656527884889, 0.9459394274170634], [44.29842491870788, 0.1553275702271268, 1.1614389425456966], [48.06502563179768, 0.2881535906590815, 0.5794752888331712], [51.09211897738668, 0.18804255026540975, 0.8847892377148726], [56.49704913397346, 0.1115106659631093, 1.433014180031235], [64.53681263655929, 0.19856714557650584, 1.687530458755037]], "peak_params_": [[2.5838759829162425, 0.2151523436728502, 1.0847640895922641], [29.81338188526668, 0.18727584519388174, 1.4523104254491588], [39.86588969768948, 0.14981884957655406, 1.8918788548341268], [44.29842491870788, 0.15029465144858029, 2.322877885091393], [48.06502563179768, 0.2877314242327019, 1.1589505776663425], [51.09211897738668, 0.18709804847776912, 1.7695784754297452], [56.49704913397346, 0.10500116284458044, 2.86602836006247], [64.53681263655929, 0.19122651374016608, 3.375060917510074]], "r_squared_": 0.9587407556461913, "error_": 0.033123048836937875}
{"freq_range": [2.0, 80.0], "freq_res": 1.0, "aperiodic_params_": [0.4888131314397123, 0.9804001066701812], "gaussian_params_": [[3.168475023273411, 0.2813403925473249, 0.6290127007374696], [6.107841674608688, 0.3067084793500311, 0.6498511119062254], [9.2165561106336, 0.39203072220394614, 0.9964303016034632], [11.353670179418572, 0.11767289332962837, 0.638021872249917], [47.20871201089468, 0.24131919932048954, 0.6594803169521931], [49.7940684917157, 0.24958739833538282, 0.6898566812971456], [54.00045475884921, 0.18358388317506305, 0.25000017316753564], [58.19180515072237, 0.18070618388929524, 1.2350483639357002], [64.08269323390306, 0.203533514909019, 2.7581146693804546], [69.32662931589795, 0.45427701147571165, 0.2777617007603157], [72.73896664304533, 0.2829818510525051, 1.1508349093000751], [77.7149967924173, 0.1823545877794624, 1.3532619967772275]], "peak_params_": [[3.168475023273411, 0.2714310822315287, 1.2580254014749392], [6.107841674608688, 0.30466603183863844, 1.2997022238124507], [9.2165561106336, 0.3830265884965107, 1.9928606032069265], [11.353670179418572, 0.1799254603759891, 1.276043744499834], [47.20871201089468, 0.2296000476177742, 1.3189606339043862], [49.7940684917157, 0.23874261817187947, 1.3797133625942912], [54.00045475884921, 0.1844082582500861, 0.5000003463350713], [58.19180515072237, 0.19642536448359382, 2.4700967278714003], [64.08269323390306, 0.2034449039582069, 5.516229338760909], [69.32662931589795, 0.2705134494917403, 0.5555234015206314], [72.73896664304533, 0.27731028454565365, 2.3016698186001503], [77.7149967924173, 0.17836379644303002, 2.706523993554455]], "r_squared_": 0.9823021516317282, "error_": 0.03396511542925727}
{"freq_range": [2.0, 80.0], "freq_res": 1.0, "aperiodic_params_": [0.29734846205387744, 0.9943427694511836], "gaussian_params_": [[2.4935783493939163, 0.408580092119005, 0.6678824227568052], [8.443743523267269, 0.410627072668643, 0.5907871845903131], [9.582408434231782, 0.31384276397683314, 3.579028035985339], [59.814103599968334, 0.22230430351329847, 5.999999999999999], [73.54796540086404, 0.30797416122013727, 5.999999999999999]], "peak_params_": [[2.4935783493939163, 0.3442164649208203, 1.3357648455136104], [8.443743523267269, 0.5943193836941159, 1.1815743691806262], [9.582408434231782, 0.32449729798147703, 7.158056071970678], [59.814103599968334, 0.24626235183231038, 11.999999999999998], [73.54796540086404, 0.32068753706117725, 11.999999999999998]], "r_squared_": 0.9642181619209845, "error_": 0.06182281869603317}
{"freq_range": [2.0, 80.0], "freq_res": 1.0, "aperiodic_params_": [0.41390928227508456, 1.0545082216299653], "gaussian_params_": [[2.511208527200641, 1.0811122471887211, 0.3006696105784266], [4.952910984029991, 0.12067721999954396, 0.9323292112020689], [8.48197796735369, 0.4761648628906442, 1.1026184496779368], [11.447523782965508, 0.540193044074906, 0.26551690979591], [13.957942907459355, 0.15645632376937738, 2.718631137015505], [43.977882759381124, 0.13846951577862787, 1.286424785634858], [49.08630252689411, 0.11675389470665959, 1.130950762953063], [54.40686496401181, 0.4356994459234172, 0.26060376457623413], [60.25176216464477, 0.16988718674676634, 5.736228588428187], [65.92509897078136, 0.16584247540776384, 2.076891250748175], [70.2744681724728, 0.30067398784957416, 0.9910797885296239], [73.59771505959463, 0.2716987922135541, 1.9219975557506164], [77.39958405359499, 0.300097149722248, 0.5498505005125407], [79.39121168478663, 0.3760845162562858, 0.48392298839065845]], "peak_params_": [[2.511208527200641, 0.30189887595511766, 0.6013392211568532], [4.952910984029991, 0.12446302477412952, 1.8646584224041378], [8.48197796735369, 0.4475308092864529, 2.2052368993558735], [11.447523782965508, 0.25217945095459365, 0.53103381959182], [13.957942907459355, 0.15643933862736348, 5.43726227403101], [43.977882759381124, 0.14152380248734509, 2.572849571269716], [49.08630252689411, 0.14129472006837207, 2.261901525906126], [54.40686496401181, 0.22260920064249423, 0.5212075291524683], [60.25176216464477, 0.17255740495064487, 11.472457176856373], [65.92509897078136, 0.2686980544772093, 4.15378250149635], [70.2744681724728, 0.40077331988721254, 1.9821595770592477], [73.59771505959463, 0.27576696450875526, 3.8439951115012327], [77.39958405359499, 0.28955743386117216, 1.0997010010250814], [79.39121168478663, 0.2816366419829466, 0.9678459767813169]], "r_squared_": 0.9858139596020763, "error_": 0.035688781825092164}
{"freq_range": [2.0, 80.0], "freq_res": 1.0, "aperiodic_params_": [0.8284815409722013, 1.3007793557986895], "gaussian_params_": [[2.0000044025626833, 0.11968056824994291, 3.885152247343887], [7.093351717285918, 0.19162024350476356, 0.25506470192283404], [8.856231958720928, 0.2589178012533875, 0.8842449016581425], [14.754365058219717, 0.18853602663891977, 3.8132911920783945], [43.58146813563004, 0.3393533834504415, 0.2798679280646983], [48.417874631737405, 0.44346569187475066, 0.25230513750187017], [50.03405964354654, 0.13858694799503402, 0.9530209370990665], [54.413717849111066, 0.5582679684658041, 0.27446780245842106], [57.106478871685276, 0.09037858544921995, 0.7985413956407864], [63.54796540086405, 0.16586197635146022, 4.524151321057822], [74.10827933878106, 0.21819163055849242, 5.999999999999999]], "peak_params_": [[2.0000044025626833, 0.12038225808942893, 7.770304494687774], [7.093351717285918, 0.2839319137001986, 0.5101294038456681], [8.856231958720928, 0.33951190188004854, 1.768489803316285], [14.754365058219717, 0.18858868682568808, 7.626582384156789], [43.58146813563004, 0.11093865209419707, 0.5597358561293966], [48.417874631737405, 0.12719086779673394, 0.5046102750037403], [50.03405964354654, 0.1404392565883703, 1.906041874198133], [54.413717849111066, 0.19800584558454415, 0.5489356049168421], [57.106478871685276, 0.1515158533257217, 1.5970827912815728], [63.54796540086405, 0.21782203884989637, 9.048302642115644], [74.10827933878106, 0.2296575200827271, 11.999999999999998]], "r_squared_": 0.9924059700831454, "error_": 0.03274201385424506}
{"freq_range": [2.0, 80.0], "freq_res": 1.0, "aperiodic_params_": [1.0891292341546237, 1.481127634691975], "gaussian_params_": [[11.045688637818984, 0.2209934045713142, 5.4052576798670735], [49.432404024665324, 0.2047509296991054, 1.0726126873862734], [54.38039113816626, 0.34604553697907464, 0.30887911945887075], [65.36671900953004, 0.24723046850458225, 5.999999999999999], [78.10514306470986, 0.2155779355633926, 5.999999999999999]], "peak_params_": [[11.045688637818984, 0.22098551006139588, 10.810515359734147], [49.432404024665324, 0.19476199215142964, 2.1452253747725467], [54.38039113816626, 0.2032899805597903, 0.6177582389177415], [65.36671900953004, 0.26661464041006533, 11.999999999999998], [78.10514306470986, 0.24248605196094708, 11.999999999999998]], "r_squared_": 0.9881724753285328, "error_": 0.04403230499076521}
{"freq_range": [2.0, 80.0], "freq_res": 1.0, "aperiodic_params_": [1.1628117061822782, 1.5178862363382772], "gaussian_params_": [[8.871977780303824, 0.3110634121555001, 2.7168444285198086], [13.598001558038513, 0.3069570960251652, 0.30547791419953024], [18.947905040867163, 0.124563204042533, 3.1408723040723676], [49.32390297801911, 0.21338827979970348, 0.9423659906972858], [54.17383055909772, 0.18581718475649894, 0.5703031957444226], [57.57218587005269, 0.1781606581435162, 0.8542345247234452], [62.601214231757126, 0.129464012627881, 2.936328087448782], [70.98393026757819, 0.26521968388293, 5.653183431165517], [79.54796533219078, 0.19258327353019172, 2.0293499317807826]], "peak_params_": [[8.871977780303824, 0.31154446842693156, 5.433688857039617], [13.598001558038513, 0.21753576941573716, 0.6109558283990605], [18.947905040867163, 0.12484472174337169, 6.281744608144735], [49.32390297801911, 0.2012894770230751, 1.8847319813945715], [54.17383055909772, 0.18209458640718013, 1.1406063914888451], [57.57218587005269, 0.2140624755373166, 1.7084690494468904], [62.601214231757126, 0.2261101135863457, 5.872656174897564], [70.98393026757819, 0.2674113354011334, 11.306366862331034], [79.54796533219078, 0.2622125850223149, 4.058699863561565]], "r_squared_": 0.9904599313378751, "error_": 0.039923424908454366}
{"freq_range": [2.0, 80.0], "freq_res": 1.0, "aperiodic_params_": [1.1180179898849445, 1.4932205321891308], "gaussian_params_": [[8.672946563021277, 0.308406390255372, 2.7923530296355894], [14.779114567290225, 0.12088982841647083, 1.9011404500513138], [19.54930504557504, 0.16436487528894092, 0.9760995022886212], [22.40036326179697, 0.4658288639326375, 0.25002603573637344], [43.83104160086839, 0.14917312508243566, 0.62097859227695], [49.29047934742881, 0.20079483488144456, 0.914570230465783], [54.098250494655304, 0.20760201313700075, 0.4434337357843896], [57.95549658401944, 0.22225692540339198, 1.2107041359775734], [61.59091841183447, 0.19607372263713652, 0.8145212750606929], [65.0842753757821, 0.25300071017399917, 1.634525917916729], [69.53954916244008, 0.2879644714864596, 1.511578088867145], [73.27518985587136, 0.27055302155736144, 0.6035484895054181], [78.83256092678036, 0.27681575279860027, 3.961758402228261]], "peak_params_": [[8.672946563021277, 0.30748906106962187, 5.584706059271179], [14.779114567290225, 0.14375383784723206, 3.8022809001026276], [19.54930504557504, 0.15061254107130095, 1.9521990045772424], [22.40036326179697, 0.13637461311245314, 0.5000520714727469], [43.83104160086839, 0.14375245282646576, 1.2419571845539], [49.29047934742881, 0.1909181252033625, 1.829140460931566], [54.098250494655304, 0.20363771681042597, 0.8868674715687792], [57.95549658401944, 0.2221399870384917, 2.421408271955147], [61.59091841183447, 0.21636658467606962, 1.6290425501213859], [65.0842753757821, 0.25648776372271365, 3.269051835833458], [69.53954916244008, 0.3007184966844363, 3.02315617773429], [73.27518985587136, 0.3584570875134614, 1.2070969790108361], [78.83256092678036, 0.2765686356120707, 7.923516804456522]], "r_squared_": 0.994203691127257, "error_": 0.029437174442618123}
{"freq_range": [2.0, 80.0], "freq_res": 1.0, "aperiodic_params_": [1.0058862653716458, 1.3985759903080515], "gaussian_params_": [[3.070874505933073, 0.10290636406176716, 0.25000248240664236], [8.755474762271904, 0.3011860101001438, 2.5497035149710094], [14.471230964342128, 0.10055824152910513, 0.8652584418299182], [18.78871722178087, 0.09266147788965433, 3.126750700605753], [49.578251244772794, 0.19572530681411934, 0.6662170804628872], [54.066175987293576, 0.18034017478339492, 0.250005954612592], [57.368641340332076, 0.2749793940169344, 0.28960049119276393], [59.07785507627192, 0.12049347849879799, 1.9928569453980063], [65.84768674023478, 0.1788657862356238, 3.2537712323584356], [73.39008293218487, 0.21675529418444692, 0.2602069568379323], [76.64389620259216, 0.1930499767079581, 5.9999999999996065]], "peak_params_": [[3.070874505933073, 0.1224239632844657, 0.5000049648132847], [8.755474762271904, 0.3004938247379163, 5.099407029942019], [14.471230964342128, 0.15169388020309926, 1.7305168836598364], [18.78871722178087, 0.09254431306618849, 6.253501401211506], [49.578251244772794, 0.16020116484540847, 1.3324341609257744], [54.066175987293576, 0.17921373892061143, 0.500011909225184], [57.368641340332076, 0.19761624816996193, 0.5792009823855279], [59.07785507627192, 0.14249242501147497, 3.9857138907960126], [65.84768674023478, 0.21898153467037584, 6.507542464716871], [73.39008293218487, 0.24697027600472654, 0.5204139136758646], [76.64389620259216, 0.19321322148636266, 11.999999999999213]], "r_squared_": 0.993472561266836, "error_": 0.029482222361785444}
{"freq_range": [2.0, 80.0], "freq_res": 1.0, "aperiodic_params_": [0.7461029811216771, 1.1953139919673], "gaussian_params_": [[3.0489716361419728, 0.14535064422366864, 0.25003725469025406], [9.25615043603, 0.30106955117707457, 2.318240262264428], [53.9510532505525, 0.21121274189715836, 0.25000055733521004], [57.626515429040985, 0.14369357858831217, 1.027185631023346], [67.52662848373095, 0.18055284091102863, 4.2949455144466], [73.0261158752758, 0.09876514272589075, 0.6500006677707664], [76.8426658467125, 0.13773764043685194, 0.8396246519524243], [79.3393170775094, 0.1817972818111421, 0.6253919234797106]], "peak_params_": [[3.0489716361419728, 0.15048216031666029, 0.5000745093805081], [9.25615043603, 0.29923729890162826, 4.636480524528856], [53.9510532505525, 0.20875237800239854, 0.5000011146704201], [57.626515429040985, 0.14992790990367522, 2.054371262046692], [67.52662848373095, 0.17945952663137565, 8.5898910288932], [73.0261158752758, 0.1788479857988583, 1.3000013355415327], [76.8426658467125, 0.1513616073121169, 1.6792493039048486], [79.3393170775094, 0.167083601811848, 1.2507838469594212]], "r_squared_": 0.9879557200068682, "error_": 0.034813657273305855}
{"freq_range": [2.0, 80.0], "freq_res": 1.0, "aperiodic_params_": [0.46692136322172784, 1.081234890805293], "gaussian_params_": [[2.933771390730852, 0.27420577709781685, 0.5681849147906464], [5.849698022102135, 0.26890840309665603, 0.5703169934022007], [9.456434804681384, 0.4779773243351842, 1.7162997365111101], [49.82830580445192, 0.15418846449593612, 0.6239536276006948], [53.686559578795865, 0.1921626773640164, 0.2875837185459998], [62.42044592023987, 0.1704629689052015, 5.056565838729442], [70.22778761246035, 0.0864842071045416, 0.2500442379855385], [75.54796540086404, 0.19968803576565394, 5.999999999999999]], "peak_params_": [[2.933771390730852, 0.2727544252771009, 1.1363698295812927], [5.849698022102135, 0.3226395964540564, 1.1406339868044013], [9.456434804681384, 0.4613703445340559, 3.4325994730222202], [49.82830580445192, 0.15682939589032552, 1.2479072552013897], [53.686559578795865, 0.1490226079802044, 0.5751674370919996], [62.42044592023987, 0.18547810019008204, 10.113131677458885], [70.22778761246035, 0.242764184415172, 0.500088475971077], [75.54796540086404, 0.20375179443829183, 11.999999999999998]], "r_squared_": 0.9789366286654871, "error_": 0.04686605829290059}
{"freq_range": [2.0, 80.0], "freq_res": 1.0, "aperiodic_params_": [-0.29574313379345557, 0.5991918736187417], "gaussian_params_": [[6.357023067813911, 0.4887150601888633, 5.999999999999999], [8.477777518326832, 1.2596971748685897, 0.27186933210040076], [63.54796540086405, 0.2642835538966382, 5.999999999999999]], "peak_params_": [[6.357023067813911, 0.48785062704492643, 11.999999999999998], [8.477777518326832, 0.7396575814716582, 0.5437386642008015], [63.54796540086405, 0.26353458310635736, 11.999999999999998]], "r_squared_": 0.9047946596699372, "error_": 0.08737583311599949}
{"freq_range": [2.0, 80.0], "freq_res": 1.0, "aperiodic_params_": [0.1326242886719006, 0.7882324818145039], "gaussian_params_": [[2.567748865771048, 0.46086198643310416, 0.7588804177038411], [8.437431799345466, 0.32740717714778417, 0.9594540336316757], [11.57574973215497, 0.27240277040723154, 3.471656620589288], [43.02161264835045, 0.1775735778045831, 0.5076116841949249], [49.50195934244519, 0.18638834949943187, 1.5226028756692531], [60.99246799468497, 0.13407376674793886, 0.2500322081658548], [61.129040586196574, 0.21266768381691104, 5.999999999999955], [75.07352131147404, 0.27177286510319587, 5.999999999999999]], "peak_params_": [[2.567748865771048, 0.4047390761973205, 1.5177608354076821], [8.437431799345466, 0.4553563642190054, 1.9189080672633514], [11.57574973215497, 0.2707084036992904, 6.943313241178576], [43.02161264835045, 0.17964770952953313, 1.0152233683898497], [49.50195934244519, 0.21479644539339005, 3.0452057513385062], [60.99246799468497, 0.36398987367672975, 0.5000644163317096], [61.129040586196574, 0.36398987367672975, 11.99999999999991], [75.07352131147404, 0.28644676363549504, 11.999999999999998]], "r_squared_": 0.9601503779909395, "error_": 0.05185302021914966}
{"freq_range": [2.0, 80.0], "freq_res": 1.0, "aperiodic_params_": [0.6529011716416945, 1.2016401262106151], "gaussian_params_": [[2.688832485692102, 0.25900472455354484, 0.596421070730084], [8.821380707798198, 0.3776312690588998, 2.1355054874137], [13.90652646222093, 0.22407938601557276, 2.0412764645830874], [18.600808592736914, 0.16810767614233646, 1.637154026086591], [49.553613326075215, 0.17068397333806318, 1.1801343572361207], [54.38107053385092, 0.3465095575177546, 0.25776766556916475], [57.591028443313945, 0.3071224853990825, 0.27597114062646777], [63.54796540086405, 0.20717311533516403, 5.999996545194105], [75.015045546802, 0.2371199027078291, 5.999999999999999]], "peak_params_": [[2.688832485692102, 0.23524081074732484, 1.192842141460168], [8.821380707798198, 0.3887812834798594, 4.2710109748274], [13.90652646222093, 0.2470425939751737, 4.082552929166175], [18.600808592736914, 0.17315138778665873, 3.274308052173182], [49.553613326075215, 0.17512835717030284, 2.3602687144722414], [54.38107053385092, 0.17524112758032628, 0.5155353311383295], [57.591028443313945, 0.24178817542726927, 0.5519422812529355], [63.54796540086405, 0.2505517016279666, 11.99999309038821], [75.015045546802, 0.2706356427422574, 11.999999999999998]], "r_squared_": 0.9846829151069704, "error_": 0.041166781755571105}
{"freq_range": [2.0, 80.0], "freq_res": 1.0, "aperiodic_params_": [0.8745209843909688, 1.3500964425070627], "gaussian_params_": [[2.9943027801804623, 0.13196499107043594, 0.5033676432042072], [8.730930785145796, 0.3095547802441947, 2.4782542537281387], [15.874309086027687, 0.15859375328926828, 3.2161731335045207], [25.826944356875938, 0.1261167011609603, 0.5165022253569178], [43.8331793097504, 0.11582408325002506, 0.6098223443512204], [49.55380118225, 0.21146635866821487, 1.022540816315481], [54.15511669806078, 0.11859409364288528, 0.4389591430090078], [57.88391557389489, 0.12705713226662396, 0.48895984025502154], [63.54796540086405, 0.1973510295271464, 5.599242614606039], [75.7828011974536, 0.23118247054089106, 5.999999999999999]], "peak_params_": [[2.9943027801804623, 0.15336519895767464, 1.0067352864084145], [8.730930785145796, 0.3238880079184179, 4.956508507456277], [15.874309086027687, 0.1626659417103633, 6.432346267009041], [25.826944356875938, 0.12034929011065743, 1.0330044507138356], [43.8331793097504, 0.11201591616563267, 1.2196446887024408], [49.55380118225, 0.20285172526887285, 2.045081632630962], [54.15511669806078, 0.15786282074882374, 0.8779182860180156], [57.88391557389489, 0.24718295234457677, 0.9779196805100431], [63.54796540086405, 0.2303232574762042, 11.198485229212078], [75.7828011974536, 0.2476769889399868, 11.999999999999998]], "r_squared_": 0.9895785669376038, "error_": 0.03787425556710174}
{"freq_range": [2.0, 80.0], "freq_res": 1.0, "aperiodic_params_": [0.9993190965993559, 1.4296093884572696], "gaussian_params_": [[3.3844498235016816, 0.3965998023546503, 0.25000355446240385], [4.6725889329402035, 0.17218668798253245, 0.37442102814674844], [7.09686695309518, 0.21564474335089337, 0.8828975608093258], [9.63263058010212, 0.2664899046515769, 0.8004507508722153], [13.106666385762061, 0.19353992136705697, 4.294439137452851], [19.47728489506406, 0.5256785584189412, 0.277672423479552], [43.64477095496274, 0.15253491060267496, 0.8533310912314647], [48.46477346691294, 0.8585283955605219, 0.2622320141498955], [50.09717813169627, 0.21930256838814374, 0.7249161827152026], [54.00791495565392, 0.1673822528272812, 0.6964726805917125], [57.72028405153348, 0.15962531341030778, 0.6881761646886332], [65.28411850761859, 0.2523377951352632, 5.1285514812306054], [78.0959308017281, 0.2580273598442099, 5.999999999999999]], "peak_params_": [[3.3844498235016816, 0.13372543257332492, 0.5000071089248077], [4.6725889329402035, 0.1629100490287143, 0.7488420562934969], [7.09686695309518, 0.2859622339375606, 1.7657951216186516], [9.63263058010212, 0.3897998727368579, 1.6009015017444306], [13.106666385762061, 0.1935184867356256, 8.588878274905703], [19.47728489506406, 0.1954705145907626, 0.555344846959104], [43.64477095496274, 0.1399206129220354, 1.7066621824629293], [48.46477346691294, 0.1826981293779708, 0.524464028299791], [50.09717813169627, 0.2203195874973487, 1.4498323654304053], [54.00791495565392, 0.18987853783544728, 1.392945361183425], [57.72028405153348, 0.239946684393755, 1.3763523293772664], [65.28411850761859, 0.2757839335619767, 10.257102962461211], [78.0959308017281, 0.26966393909990405, 11.999999999999998]], "r_squared_": 0.9923772215623428, "error_": 0.03343373070460468}
{"freq_range": [2.0, 80.0], "freq_res": 1.0, "aperiodic_params_": [0.9558496812711393, 1.416772688015631], "gaussian_params_": [[3.23316647425178, 0.17031082776663087, 0.2503459038917957], [9.552802752570821, 0.3837569169140229, 2.9951481852467543], [16.723624747316315, 0.14029022047102704, 1.8873414411611926], [19.478127067369556, 0.5884166792341192, 0.29783013681479076], [43.53820093312178, 0.15407112727757646, 0.8153478667369677], [48.41876549907904, 0.5987005681893643, 0.2553155796664472], [49.638874599624266, 0.40324970559539164, 0.42538506587315184], [53.928322753510955, 0.17324611045312985, 0.45373615069590634], [57.65407022410353, 0.15596640043869842, 0.8829288236478613], [66.65271738512492, 0.29337236064288735, 5.999999999999999], [73.4763221415094, 0.6537003342838006, 0.2715397052064168], [79.54796540086404, 0.27741827711646183, 3.3146970450328785]], "peak_params_": [[3.23316647425178, 0.14542560032739094, 0.5006918077835913], [9.552802752570821, 0.379749309455651, 5.990296370493509], [16.723624747316315, 0.15623583614752257, 3.7746828823223852], [19.478127067369556, 0.23263806509697027, 0.5956602736295815], [43.53820093312178, 0.13147454301561456, 1.6306957334739354], [48.41876549907904, 0.1585473933324728, 0.5106311593328944], [49.638874599624266, 0.2874731046332555, 0.8507701317463037], [53.928322753510955, 0.20287955309863248, 0.9074723013918127], [57.65407022410353, 0.24815233416607074, 1.7658576472957226], [66.65271738512492, 0.2930958009003295, 11.999999999999998], [73.4763221415094, 0.34742244454307913, 0.5430794104128336], [79.54796540086404, 0.29955884778739006, 6.629394090065757]], "r_squared_": 0.9927740215406835, "error_": 0.032370708020847204}
{"freq_range": [2.0, 80.0], "freq_res": 1.0, "aperiodic_params_": [0.9478607265021245, 1.409553837377072], "gaussian_params_": [[8.748401116819904, 0.263036109868833, 2.6397401050570886], [9.2201263164088, 0.09400689548492104, 0.25003542838754367], [10.92645227801244, 0.6483949562960619, 0.6334944869946407], [16.745607788438303, 0.17995428697095983, 3.2008294023306414], [22.439255423577013, 0.7119114385391037, 0.2901133802192686], [49.493866312029525, 0.21108560664811604, 0.794835634370417], [53.75097501600371, 0.2938165636861029, 0.2649901674203412], [57.77849419015668, 0.16574308862700055, 1.0111255613093346], [61.556047007817924, 0.32769055154578663, 0.25226337124377746], [66.6621251654433, 0.2503103506693092, 5.492313892944971], [79.2633081083642, 0.24278428529562437, 5.999999996422636]], "peak_params_": [[8.748401116819904, 0.34164256202386817, 5.279480210114177], [9.2201263164088, 0.34164256202386817, 0.5000708567750873], [10.92645227801244, 0.8627947603097612, 1.2669889739892815], [16.745607788438303, 0.1813738313239207, 6.401658804661283], [22.439255423577013, 0.27304526367694926, 0.5802267604385372], [49.493866312029525, 0.1754530404597332, 1.589671268740834], [53.75097501600371, 0.20667318230884013, 0.5299803348406824], [57.77849419015668, 0.2344382484367158, 2.0222511226186692], [61.556047007817924, 0.2481347313514779, 0.5045267424875549], [66.6621251654433, 0.27990454194221814, 10.984627785889941], [79.2633081083642, 0.26262749962779486, 11.999999992845272]], "r_squared_": 0.9926953549155919, "error_": 0.03409213767564181}
{"freq_range": [2.0, 80.0], "freq_res": 1.0, "aperiodic_params_": [0.6247754861921652, 1.1136222314099622], "gaussian_params_": [[3.263879878955763, 0.23582329085324152, 0.3130144713187737], [9.492075757329607, 0.2864563663068413, 2.200986227191498], [11.09207192982733, 0.5638400801349577, 0.5864980338004022], [18.19300645638871, 0.15799806486716805, 2.219121701471669], [22.047482892440286, 0.16654113935661183, 0.2502585635442644], [49.6885291616272, 0.2735634170442218, 0.46023930629469134], [58.4905502545709, 0.1911924651838801, 3.5097734329502983], [65.93185131322429, 0.25982468144502113, 1.8970956277028224], [71.31783780829743, 0.17704706443674575, 1.9116206457796174], [77.423511196278, 0.21479500963111262, 2.761477616811998]], "peak_params_": [[3.263879878955763, 0.16899226425692832, 0.6260289426375474], [9.492075757329607, 0.2803888399919651, 4.401972454382996], [11.09207192982733, 0.7842956028204133, 1.1729960676008044], [18.19300645638871, 0.15756468934335421, 4.438243402943338], [22.047482892440286, 0.19984216970838553, 0.5005171270885288], [49.6885291616272, 0.22782196897703155, 0.9204786125893827], [58.4905502545709, 0.18937566436635156, 7.019546865900597], [65.93185131322429, 0.2827763249039108, 3.7941912554056447], [71.31783780829743, 0.19663404474359236, 3.823241291559235], [77.423511196278, 0.2144195296129423, 5.522955233623996]], "r_squared_": 0.9771307216513163, "error_": 0.045311875652863945}
{"freq_range": [2.0, 80.0], "freq_res": 1.0, "aperiodic_params_": [-0.15304966188367694, 0.35382526403755943], "gaussian_params_": [[2.576073565791194, 0.415176908460571, 0.6801656403316341], [9.753236098972351, 0.21685976287851363, 3.988631243337618], [33.54796540086405, 0.1355695528160744, 3.20062083318296], [58.452034629631456, 0.18431885587885286, 5.999999999999999]], "peak_params_": [[2.576073565791194, 0.39360825169779357, 1.3603312806632681], [9.753236098972351, 0.21644514410360588, 7.977262486675236], [33.54796540086405, 0.13426979506646353, 6.40124166636592], [58.452034629631456, 0.18379650230933176, 11.999999999999998]], "r_squared_": 0.7673808993469325, "error_": 0.08146608379583448}
{"freq_range": [2.0, 80.0], "freq_res": 1.0, "aperiodic_params_": [-0.5748089486258441, 0.13520853322950332], "gaussian_params_": [[5.452034599135944, 0.31386387848588937, 5.450741564839133], [11.43658654063901, 0.14475001820846592, 1.785412220895366], [15.035428131199476, 0.10194484449455582, 0.8888985063997639], [63.54796540086284, 0.25322878833246243, 5.999999999999999]], "peak_params_": [[5.452034599135944, 0.3130044073287915, 10.901483129678265], [11.43658654063901, 0.32746269610008505, 3.570824441790732], [15.035428131199476, 0.1892950603465854, 1.7777970127995277], [63.54796540086284, 0.25251114637962857, 11.999999999999998]], "r_squared_": 0.5959782560528307, "error_": 0.0821464723140296}
{"freq_range": [2.0, 80.0], "freq_res": 1.0, "aperiodic_params_": [-0.09826619525839625, 0.5046589574530865], "gaussian_params_": [[2.5200790105398294, 0.5021055858296903, 0.8471253814811228], [8.909275209316249, 0.42261838342392816, 2.023247932532218], [14.312818974351076, 0.25514368867857057, 1.9064169562468298], [58.45203459913595, 0.18597624186651435, 5.999999999999999], [66.36959828702524, 0.11875856924088977, 0.6761039399435808], [73.81696530806185, 0.22780415507038645, 5.999999997892229], [74.9665216079199, 0.08237736985334078, 0.250064808045912]], "peak_params_": [[2.5200790105398294, 0.43359925358920276, 1.6942507629622456], [8.909275209316249, 0.4274460637105076, 4.046495865064436], [14.312818974351076, 0.2695648970540473, 3.8128339124936597], [58.45203459913595, 0.19250473886679165, 11.999999999999998], [66.36959828702524, 0.2840683018328276, 1.3522078798871615], [73.81696530806185, 0.23422133006585977, 11.999999995784458], [74.9665216079199, 0.3092080342532453, 0.500129616091824]], "r_squared_": 0.9124254109284855, "error_": 0.05717916400235585}
{"freq_range": [2.0, 80.0], "freq_res": 1.0, "aperiodic_params_": [0.46325959744407563, 1.0427378075848015], "gaussian_params_": [[2.5652403371192922, 0.5410048811518914, 0.3303474056195316], [8.904092734231106, 0.43203998652323405, 2.0540024055601793], [13.271023389101918, 0.24284951799107246, 1.601181541361412], [15.533953741138884, 0.21245285125861874, 0.30926349873574427], [17.699396913279063, 0.20246606002590875, 1.405650343007163], [43.71947537626611, 0.13629356268075837, 1.350437314163594], [49.901363334512745, 0.23034038667147122, 1.3750108319983785], [54.80881376303662, 0.17604632092587258, 1.4448285602109137], [58.28215620646834, 0.22193224569612977, 0.7128421555232781], [70.17218271012304, 0.37793532771413324, 5.999999999999999]], "peak_params_": [[2.5652403371192922, 0.234499506629711, 0.6606948112390632], [8.904092734231106, 0.43849246955613796, 4.108004811120359], [13.271023389101918, 0.2993147943082682, 3.202363082722824], [15.533953741138884, 0.22368168939150967, 0.6185269974714885], [17.699396913279063, 0.2010116741882817, 2.811300686014326], [43.71947537626611, 0.1334353875302403, 2.700874628327188], [49.901363334512745, 0.23177056761936043, 2.750021663996757], [54.80881376303662, 0.1902047229571595, 2.8896571204218273], [58.28215620646834, 0.268842717306776, 1.4256843110465562], [70.17218271012304, 0.3777797402287284, 11.999999999999998]], "r_squared_": 0.9729530730769054, "error_": 0.04890424959803234}
{"freq_range": [2.0, 80.0], "freq_res": 1.0, "aperiodic_params_": [0.6517789924716877, 1.2151596916447722], "gaussian_params_": [[2.724472233376853, 0.18494804546764326, 0.5840043921860456], [9.367207109253982, 0.4392910446309816, 3.0994774769787345], [17.19380366563325, 0.21596361095926322, 2.3206409169552575], [49.35089168489695, 0.20165056660697553, 1.0360182299666143], [54.34890056760719, 0.22979957046600777, 0.27093528973656533], [63.09593080172042, 0.20328390937837595, 5.999999999996616], [75.55755532839639, 0.24242744485553303, 5.999999999999999]], "peak_params_": [[2.724472233376853, 0.21872520121216033, 1.1680087843720912], [9.367207109253982, 0.4366427648684044, 6.198954953957469], [17.19380366563325, 0.23638947880623196, 4.641281833910515], [49.35089168489695, 0.20329418550568246, 2.0720364599332286], [54.34890056760719, 0.16510181173282823, 0.5418705794731307], [63.09593080172042, 0.2303850242482668, 11.999999999993232], [75.55755532839639, 0.26189285526898987, 11.999999999999998]], "r_squared_": 0.9843980714419552, "error_": 0.04588889873903863}
{"freq_range": [2.0, 80.0], "freq_res": 1.0, "aperiodic_params_": [0.7726520055440098, 1.3040615265535234], "gaussian_params_": [[9.158004601894657, 0.33403277878442844, 3.7983030814479593], [10.109600846603994, 0.26449240559755943, 0.8569993884693164], [16.085278473922155, 0.18830089171920314, 1.7787663894130439], [19.379290071023775, 0.2219650864110335, 0.8531917306754072], [49.46027086482958, 0.2351088915382127, 1.0511044487316203], [53.85499659141882, 0.12438900954338979, 0.5927205395792298], [57.678091347507966, 0.16913397799322408, 0.7875546322066491], [66.32860296861938, 0.2691314339004813, 5.999999999999999], [79.99999999994242, 0.23309543429530635, 5.999999999999999]], "peak_params_": [[9.158004601894657, 0.4482024252897717, 7.5966061628959185], [10.109600846603994, 0.5888050489414496, 1.713998776938633], [16.085278473922155, 0.25411824846479314, 3.5575327788260878], [19.379290071023775, 0.26189849509512186, 1.7063834613508144], [49.46027086482958, 0.21777139885633745, 2.1022088974632407], [53.85499659141882, 0.15336062788673943, 1.1854410791584595], [57.678091347507966, 0.25855740595423415, 1.5751092644132982], [66.32860296861938, 0.28404913427388867, 11.999999999999998], [79.99999999994242, 0.2531662732282216, 11.999999999999998]], "r_squared_": 0.9889605466255541, "error_": 0.03899468094009215}
{"freq_range": [2.0, 80.0], "freq_res": 1.0, "aperiodic_params_": [0.8887105980980915, 1.3827046255937157], "gaussian_params_": [[8.70381981047046, 0.2948908195618717, 2.1128676710802146], [10.678785515495074, 0.545375191963617, 0.6414102080712443], [15.433560152260902, 0.20382351097466903, 3.219637783819705], [19.41153181508849, 0.6224448041652177, 0.2512739151308922], [49.39914500676617, 0.2134050829082515, 0.9157632412432023], [53.911761196205454, 0.12695272223626247, 0.25076467364576055], [62.42050257729149, 0.2130724080477574, 5.403223707242518], [75.19186160345622, 0.28666495802402103, 5.999999999999999]], "peak_params_": [[8.70381981047046, 0.33743788318714457, 4.225735342160429], [10.678785515495074, 0.7234567475122656, 1.2828204161424885], [15.433560152260902, 0.20546246393231438, 6.43927556763941], [19.41153181508849, 0.27315585497639705, 0.5025478302617844], [49.39914500676617, 0.20383567218478804, 1.8315264824864046], [53.911761196205454, 0.18315508793297242, 0.5015293472915211], [62.42050257729149, 0.23799500125123374, 10.806447414485037], [75.19186160345622, 0.3006936993706719, 11.999999999999998]], "r_squared_": 0.9880174411572348, "error_": 0.04382380492622674}
{"freq_range": [2.0, 80.0], "freq_res": 1.0, "aperiodic_params_": [0.8554201313901997, 1.366972946836044], "gaussian_params_": [[7.689014911187977, 0.20949785980274233, 1.6177256308372547], [8.822296076131888, 0.16286262888225364, 0.4422745447953779], [10.811407995794763, 0.9058312252257658, 0.7776421184029956], [15.113466344530313, 0.25980612275506587, 1.9221292323527095], [19.46196667753386, 0.9480106156527787, 0.251402787252329], [21.855874754096202, 0.2939550924233726, 0.7241154153321139], [49.52597719192543, 0.2320533782224594, 0.756734402535678], [53.97605600842342, 0.14498944422967638, 0.25001232646339216], [62.34100145386967, 0.2356028936427693, 5.1582229520913785], [75.19186160345622, 0.30371158875822735, 5.999999999999999]], "peak_params_": [[7.689014911187977, 0.23617243568380078, 3.2354512616745095], [8.822296076131888, 0.3628375514557076, 0.8845490895907558], [10.811407995794763, 0.9316900572739101, 1.5552842368059911], [15.113466344530313, 0.25936198810133637, 3.844258464705419], [19.46196667753386, 0.20898593561565426, 0.502805574504658], [21.855874754096202, 0.28861374014545826, 1.4482308306642278], [49.52597719192543, 0.20422484650413764, 1.513468805071356], [53.97605600842342, 0.20865608448710504, 0.5000246529267843], [62.34100145386967, 0.2621758376421295, 10.316445904182757], [75.19186160345622, 0.3151533640170736, 11.999999999999998]], "r_squared_": 0.9876551600314488, "error_": 0.04380010560239767}
{"freq_range": [2.0, 80.0], "freq_res": 1.0, "aperiodic_params_": [0.5564196509023124, 1.1311766418220963], "gaussian_params_": [[10.047806680144083, 0.2760464244306319, 3.100161819827182], [10.899498625468915, 0.6650140187285613, 0.6428082606143606], [15.332410531043383, 0.13268959599845398, 1.2535558020342674], [21.86738775722684, 0.3028591497088875, 0.6350627775080965], [53.5798073702063, 0.7055146959883006, 0.26995286340178626], [69.9149534113658, 0.39723165428550566, 5.999999999999999]], "peak_params_": [[10.047806680144083, 0.5258517564067731, 6.200323639654364], [10.899498625468915, 0.9206017181414845, 1.2856165212287212], [15.332410531043383, 0.2051765653467622, 2.507111604068535], [21.86738775722684, 0.29649110118724054, 1.270125555016193], [53.5798073702063, 0.2218692800783737, 0.5399057268035725], [69.9149534113658, 0.39719175148888475, 11.999999999999998]], "r_squared_": 0.9585497431906134, "error_": 0.06632927026544377}
{"freq_range": [2.0, 80.0], "freq_res": 1.0, "aperiodic_params_": [-0.06641775702758249, 0.6191267105503407], "gaussian_params_": [[2.5284156347221463, 0.3966900858847043, 0.7013557581247859], [5.441919790167946, 0.20714972167775375, 2.0753212367491174], [8.539851033584805, 0.6772065663279663, 0.346493806499419], [10.693418569163992, 0.6439056398678072, 0.6685526320215727], [13.072714536557985, 0.23968366347203623, 1.5833041009003082], [53.546210459862415, 0.9095996587880113, 0.2644603404054724], [70.2746727777179, 0.3805748692854697, 5.999999999999999]], "peak_params_": [[2.5284156347221463, 0.4200977615404633, 1.4027115162495718], [5.441919790167946, 0.20330422886220378, 4.150642473498235], [8.539851033584805, 0.36283430689215984, 0.692987612998838], [10.693418569163992, 0.6871197051614077, 1.3371052640431453], [13.072714536557985, 0.24137921823384034, 3.1666082018006163], [53.546210459862415, 0.21829878077117393, 0.5289206808109448], [70.2746727777179, 0.3801762931135285, 11.999999999999998]], "r_squared_": 0.923362240716272, "error_": 0.06357465555204765}
{"freq_range": [2.0, 80.0], "freq_res": 1.0, "aperiodic_params_": [-0.604335069342194, 0.2495161768810368], "gaussian_params_": [[2.3930543362912746, 0.5671094626647367, 0.7404870084872598], [9.791317598694572, 0.38551815642310006, 3.4479195433319534], [58.23903948225056, 0.23054506997085686, 0.5992049117009007], [60.63026308390476, 0.4317721051439633, 0.280452944863076], [69.61646300284396, 0.22585089855863005, 5.999999999999999]], "peak_params_": [[2.3930543362912746, 0.5225960674130121, 1.4809740169745196], [9.791317598694572, 0.3848126928683101, 6.895839086663907], [58.23903948225056, 0.24757426279194417, 1.1984098234018015], [60.63026308390476, 0.26160944986844603, 0.560905889726152], [69.61646300284396, 0.225389941697682, 11.999999999999998]], "r_squared_": 0.8401532942138633, "error_": 0.06250316881299148}
{"freq_range": [2.0, 80.0], "freq_res": 1.0, "aperiodic_params_": [0.009350279371893783, 0.6913785379834672], "gaussian_params_": [[2.517557204781783, 1.1939846386534556, 0.30890888033200575], [9.511361924850286, 0.4885854102154075, 2.971972904359472], [14.823300883954413, 0.19946449827251356, 1.9353983599826303], [54.26017299567972, 0.16010512166514745, 5.999999999999999], [58.43662770003906, 0.5651507165643654, 0.25628184830313866], [61.02264056268704, 0.16046359743324035, 0.2620590215946204], [71.56695884574049, 0.3000295288477598, 5.999999999999999]], "peak_params_": [[2.517557204781783, 0.39697804878469256, 0.6178177606640115], [9.511361924850286, 0.4909633134064527, 5.943945808718944], [14.823300883954413, 0.28741657738956106, 3.8707967199652606], [54.26017299567972, 0.16408268763616984, 11.999999999999998], [58.43662770003906, 0.2875106500487683, 0.5125636966062773], [61.02264056268704, 0.308686336510023, 0.5241180431892408], [71.56695884574049, 0.30127291607916074, 11.999999999999998]], "r_squared_": 0.9595399414004672, "error_": 0.04940638244957466}
{"freq_range": [2.0, 80.0], "freq_res": 1.0, "aperiodic_params_": [0.34494393049528393, 0.9797326778855708], "gaussian_params_": [[2.5348650765379794, 1.0405596058537216, 0.25002458224791174], [10.956640982595559, 0.4835588984177966, 3.8823526883383797], [52.855341048470926, 0.1629031947351492, 5.999999999999999], [58.431362125257046, 0.6563089192494868, 0.2578825244803754], [70.93836444792484, 0.3401154278612843, 5.999999999999999]], "peak_params_": [[2.5348650765379794, 0.24359857767902493, 0.5000491644958235], [10.956640982595559, 0.48352874235286536, 7.764705376676759], [52.855341048470926, 0.1667522435072606, 11.999999999999998], [58.431362125257046, 0.3080594167067059, 0.5157650489607508], [70.93836444792484, 0.3417804122735293, 11.999999999999998]], "r_squared_": 0.9663548681821118, "error_": 0.0572163087733236}
{"freq_range": [2.0, 80.0], "freq_res": 1.0, "aperiodic_params_": [0.8118545328582167, 1.3233639080790054], "gaussian_params_": [[10.012787652056392, 0.5296923246532705, 2.336960942446327], [15.72074780916886, 0.2811361228891075, 1.152124978467953], [19.08030608039155, 0.2411527126956051, 0.6880228070600352], [49.47677493673617, 0.20037798087773986, 0.9206834029644582], [59.76601422953001, 0.15328012100414506, 5.999999999999999], [71.57357171749405, 0.2632606559974197, 5.999991629796618], [76.61071633988185, 0.5424233247561362, 0.26457394759786235], [79.48441014448098, 0.7296690158673343, 0.2863411791108137]], "peak_params_": [[10.012787652056392, 0.529685639625681, 4.673921884892654], [15.72074780916886, 0.2929037388726177, 2.304249956935906], [19.08030608039155, 0.24473619989995443, 1.3760456141200703], [49.47677493673617, 0.20610041386353628, 1.8413668059289163], [59.76601422953001, 0.19413019061321268, 11.999999999999998], [71.57357171749405, 0.28176977073746623, 11.999983259593236], [76.61071633988185, 0.3611229701781231, 0.5291478951957247], [79.48441014448098, 0.2977292036271575, 0.5726823582216274]], "r_squared_": 0.9862494452732613, "error_": 0.045179973734974614}
{"freq_range": [2.0, 80.0], "freq_res": 1.0, "aperiodic_params_": [0.7720164380621144, 1.3000243414585717], "gaussian_params_": [[8.358764327028306, 0.2577414934757646, 2.1589773227029068], [10.55284475808376, 0.5428109967017707, 0.8687098967402666], [15.485167225829237, 0.23988238995042369, 2.988590546529189], [49.688833211100956, 0.31103036120706173, 0.672045166562727], [57.93799018636197, 0.16997662951368603, 0.7138668781560742], [65.16941936719962, 0.2683791419461667, 5.999999999999999], [78.77712549480842, 0.24941898166004467, 5.999999999999999]], "peak_params_": [[8.358764327028306, 0.2718616734501201, 4.3179546454058135], [10.55284475808376, 0.6752034334209993, 1.737419793480533], [15.485167225829237, 0.23901548691682029, 5.977181093058378], [49.688833211100956, 0.29040150949328725, 1.344090333125454], [57.93799018636197, 0.3013913543209268, 1.4277337563121484], [65.16941936719962, 0.28613810142383267, 11.999999999999998], [78.77712549480842, 0.26808099195227575, 11.999999999999998]], "r_squared_": 0.9853674115299733, "error_": 0.04470890579607507}
{"freq_range": [2.0, 80.0], "freq_res": 1.0, "aperiodic_params_": [0.7027034292950677, 1.2599958246381733], "gaussian_params_": [[9.653467033476266, 0.3406089272439139, 2.2013612385417427], [10.730688932686219, 0.5535514951064979, 0.7088931596057327], [15.20823458355815, 0.29541438854105656, 1.6594626086552726], [21.662237921246675, 0.20241050783469008, 0.6168164885816174], [35.61216683399355, 0.45749982402994566, 0.2530127326908384], [43.35164780538275, 0.16856029998727742, 0.9662791267417014], [49.568056509368546, 0.23367696470707264, 0.8952571650309565], [53.922823587836355, 0.12437292712257234, 0.25004298844579553], [62.41776615476432, 0.23505657460170457, 4.832264830598922], [75.19186160345622, 0.29612393178203505, 5.999999999999999]], "peak_params_": [[9.653467033476266, 0.6639863096442912, 4.402722477083485], [10.730688932686219, 0.809364418368772, 1.4177863192114655], [15.20823458355815, 0.3109360163988737, 3.3189252173105452], [21.662237921246675, 0.1742971984797722, 1.2336329771632348], [35.61216683399355, 0.1413086823812466, 0.5060254653816768], [43.35164780538275, 0.15783341783745808, 1.9325582534834027], [49.568056509368546, 0.2166994381774927, 1.790514330061913], [53.922823587836355, 0.17071784345877994, 0.5000859768915911], [62.41776615476432, 0.26059027161188864, 9.664529661197845], [75.19186160345622, 0.30389698726010606, 11.999999999999998]], "r_squared_": 0.9873045377340606, "error_": 0.038575538244544086}
{"freq_range": [2.0, 80.0], "freq_res": 1.0, "aperiodic_params_": [0.6887591143449833, 1.2426097951099064], "gaussian_params_": [[10.056748218255768, 0.3842512693517016, 2.3603590913989754], [10.701232293365578, 0.5281281452582652, 0.6045292804004733], [15.378361379634724, 0.28385638348667686, 1.3531689737827493], [21.71463862679826, 0.21397815070249973, 0.5933453024938159], [49.68569448330674, 0.29984352440959244, 0.5835528024148067], [62.15660008611636, 0.22418943152898152, 5.234045992989833], [75.19186160345622, 0.2937191329832089, 5.999999999999999]], "peak_params_": [[10.056748218255768, 0.6537488604915241, 4.720718182797951], [10.701232293365578, 0.8236883636541769, 1.2090585608009465], [15.378361379634724, 0.31584935533927133, 2.7063379475654985], [21.71463862679826, 0.1906118084554168, 1.1866906049876318], [49.68569448330674, 0.274510803722527, 1.1671056048296133], [62.15660008611636, 0.2502851201667453, 10.468091985979665], [75.19186160345622, 0.3046129042740562, 11.999999999999998]], "r_squared_": 0.982656948946042, "error_": 0.04478933069366522}
{"freq_range": [2.0, 80.0], "freq_res": 1.0, "aperiodic_params_": [0.16003452547572244, 0.8943310220436275], "gaussian_params_": [[2.603606284655183, 0.21541669680190859, 0.6413238773359499], [9.549448308565058, 0.28340595574081745, 2.7199457767669326], [10.616871722696816, 0.6997491869101425, 0.397018838047907], [12.530830667235918, 0.38335823715248846, 0.32782786383314416], [14.888440733308984, 0.17068946919788733, 1.2126236362498994], [35.66947660568493, 0.37736535974352337, 0.26282176928017564], [49.23748880709253, 0.14115912328334293, 3.879365895529258], [57.778777017972196, 0.16723651989901767, 0.7343925480394659], [65.61395279921551, 0.24492933148180537, 4.709971740778597], [77.61335114863921, 0.2573184660024534, 4.483591921750483]], "peak_params_": [[2.603606284655183, 0.19356837887872008, 1.2826477546718997], [9.549448308565058, 0.48886746143831405, 5.439891553533865], [10.616871722696816, 0.6861066469896918, 0.794037676095814], [12.530830667235918, 0.3151861190448567, 0.6556557276662883], [14.888440733308984, 0.2080237291160083, 2.425247272499799], [35.66947660568493, 0.17155113337279904, 0.5256435385603513], [49.23748880709253, 0.1413814643639817, 7.758731791058516], [57.778777017972196, 0.23715739517623247, 1.4687850960789317], [65.61395279921551, 0.25310740367114026, 9.419943481557194], [77.61335114863921, 0.264078527139763, 8.967183843500965]], "r_squared_": 0.9745739680188666, "error_": 0.04085772328260379}
{"freq_range": [2.0, 80.0], "freq_res": 1.0, "aperiodic_params_": [-0.8605869488962579, 0.07560085089682249], "gaussian_params_": [[27.438033095357323, 0.7708257124566363, 0.2500000547386672], [44.47449634080565, 0.12212480744642354, 1.3478635259296687], [54.54796540086405, 0.0873426983771733, 5.999999999999999]], "peak_params_": [[27.438033095357323, 0.16608387583073847, 0.5000001094773344], [44.47449634080565, 0.133413245906153, 2.6957270518593375], [54.54796540086405, 0.08709517207876216, 11.999999999999998]], "r_squared_": 0.08852553799893603, "error_": 0.06975434509277297}
{"freq_range": [2.0, 80.0], "freq_res": 1.0, "aperiodic_params_": [-0.6526559526810386, 0.12474389596068361], "gaussian_params_": [[5.452034599135944, 0.2641360220582186, 5.146362221159268], [11.130610674539117, 0.14862587779056305, 1.562898729729273], [45.5669586816538, 0.2006767523929563, 1.7413482011731183], [50.19179657757764, 0.2312603474793953, 0.500243782374054], [52.383733603389445, 0.4094839278357743, 0.3291355940165879], [57.93275321878702, 0.17196662759080672, 2.290958792120191], [66.54793107928425, 0.16363325553564478, 3.5850216604520675], [72.17442830240414, 0.23521163927233432, 0.7802374296464031], [75.65378097530208, 0.2657149894917215, 0.7874637190523667], [79.37460368633597, 0.5255663923057371, 0.2841151067689721]], "peak_params_": [[5.452034599135944, 0.2631868148393917, 10.292724442318535], [11.130610674539117, 0.29583731383967593, 3.125797459458546], [45.5669586816538, 0.1945667585908506, 3.4826964023462366], [50.19179657757764, 0.22316053644419498, 1.000487564748108], [52.383733603389445, 0.21413861962887026, 0.6582711880331757], [57.93275321878702, 0.18142857217853892, 4.581917584240382], [66.54793107928425, 0.16240566844515392, 7.170043320904135], [72.17442830240414, 0.2808939892601672, 1.5604748592928062], [75.65378097530208, 0.2462995161807735, 1.5749274381047333], [79.37460368633597, 0.22078520526812684, 0.5682302135379442]], "r_squared_": 0.6619811192615961, "error_": 0.05936245357589202}
{"freq_range": [2.0, 80.0], "freq_res": 1.0, "aperiodic_params_": [0.32898322700058225, 0.9582039061811678], "gaussian_params_": [[2.5433934720081877, 0.917054253014986, 0.27646080557546215], [10.90510326682074, 0.5857808864755744, 3.0451177738025814], [50.60776413646306, 0.12844837575973672, 5.999999999999999], [58.26915700137003, 0.23413813251576265, 0.5476470166472244], [60.64932379205617, 0.1540746302575435, 0.6123944881040239], [71.13455490195796, 0.29949139933214647, 5.999999999999999]], "peak_params_": [[2.5433934720081877, 0.25460540700294243, 0.5529216111509243], [10.90510326682074, 0.585496509762279, 6.090235547605163], [50.60776413646306, 0.12924834745888303, 11.999999999999998], [58.26915700137003, 0.2949240451852744, 1.0952940332944487], [60.64932379205617, 0.23135898617170492, 1.2247889762080477], [71.13455490195796, 0.29981458862119204, 11.999999999999998]], "r_squared_": 0.9710380738630067, "error_": 0.05268305924904157}
{"freq_range": [2.0, 80.0], "freq_res": 1.0, "aperiodic_params_": [0.5546985779154691, 1.1174616839506093], "gaussian_params_": [[10.459720395478382, 0.62859573385579, 1.8070350200055474], [15.595079231227738, 0.23393959447942617, 1.4248204316298125], [49.72995420479456, 0.2863870337992505, 0.621547216599862], [57.896912805678895, 0.15077713468897583, 0.46130955321305495], [63.45965136421324, 0.1996820846336443, 5.999999999999999], [75.80926107055812, 0.2189027723731137, 5.999999999999999]], "peak_params_": [[10.459720395478382, 0.6086841221714155, 3.6140700400110948], [15.595079231227738, 0.23039791064850867, 2.849640863259625], [49.72995420479456, 0.27674264686020456, 1.243094433199724], [57.896912805678895, 0.2817232522343234, 0.9226191064261099], [63.45965136421324, 0.22151305893027362, 11.999999999999998], [75.80926107055812, 0.2412705947899052, 11.999999999999998]], "r_squared_": 0.9742727182207992, "error_": 0.054747226744294136}
{"freq_range": [2.0, 80.0], "freq_res": 1.0, "aperiodic_params_": [0.7301806431937883, 1.1982880511641396], "gaussian_params_": [[10.149296106805293, 0.6883147358065557, 1.303412060779927], [14.808729918349202, 0.29200648620697717, 2.526318248634191], [49.82112981260696, 0.27222111375837715, 0.5899717176452118], [58.04299154989001, 0.18600139252136014, 0.9840673894517009], [60.880007549786214, 0.12556391978038475, 0.6138861482394509], [70.0959308017281, 0.31618001994008343, 5.999999999999999]], "peak_params_": [[10.149296106805293, 0.7315273657831555, 2.606824121559854], [14.808729918349202, 0.29184735787069566, 5.052636497268382], [49.82112981260696, 0.2611516295245506, 1.1799434352904237], [58.04299154989001, 0.22726442100754563, 1.9681347789034018], [60.880007549786214, 0.22542755350272348, 1.2277722964789017], [70.0959308017281, 0.31613960980337596, 11.999999999999998]], "r_squared_": 0.9804940675869093, "error_": 0.050486651428794445}
{"freq_range": [2.0, 80.0], "freq_res": 1.0, "aperiodic_params_": [0.17355434188356128, 0.7892391268082496], "gaussian_params_": [[2.521256251692017, 0.23171995173159943, 0.8033531397453477], [10.916967081983366, 0.46195625612253455, 2.893152101080096], [43.048859715704594, 0.1697117904144823, 0.7546629818291593], [49.72949624172131, 0.2767655152846627, 0.7861542129898798], [57.5334034227889, 0.21497977690172704, 0.6983187202018915], [60.625172439367574, 0.18866213410422994, 0.9011899923497695], [71.85134829463848, 0.27389305161362615, 5.999999999999999]], "peak_params_": [[2.521256251692017, 0.20494884580724204, 1.6067062794906954], [10.916967081983366, 0.46176604342745203, 5.786304202160192], [43.048859715704594, 0.16935907794305094, 1.5093259636583185], [49.72949624172131, 0.26121825447876557, 1.5723084259797595], [57.5334034227889, 0.19374822926140656, 1.396637440403783], [60.625172439367574, 0.22640280325430395, 1.802379984699539], [71.85134829463848, 0.2738090047197692, 11.999999999999998]], "r_squared_": 0.9606402180972972, "error_": 0.05092742430204512}
{"freq_range": [2.0, 80.0], "freq_res": 1.0, "aperiodic_params_": [-0.6612554196316496, 0.42782214864768336], "gaussian_params_": [[2.9040691982718863, 0.38723757853976604, 1.551443108968885], [8.452034599140315, 0.34890994169912776, 1.5501378029721262], [12.438894295975349, 0.27262334160709517, 1.6953543367260553], [32.46356839716417, 0.5150217953745176, 0.28125516056613803], [35.51568282453752, 0.26340916707220596, 0.6083266623550715], [39.8883504467753, 0.15339291199946678, 0.5513233261658862], [42.97493666708179, 0.15500626934077583, 0.531895425250178], [49.430191844724455, 0.17997348761944826, 3.7220111501561814], [57.44257221723057, 0.90108074017307, 0.2565633529411167], [60.60839869273286, 0.16164088954388617, 1.3979629141151122], [64.96774980939794, 0.18802250885594082, 1.1351054763800779], [68.0016023852933, 0.17773706385484364, 0.5241910113136993], [69.7959122097716, 0.10615947385364993, 0.2500390452123612], [75.54796540086393, 0.1485651328734122, 5.999996036676719]], "peak_params_": [[2.9040691982718863, 0.3872167826415967, 3.10288621793777], [8.452034599140315, 0.34499476640950477, 3.1002756059442524], [12.438894295975349, 0.2890582161041393, 3.3907086734521106], [32.46356839716417, 0.13241353619313623, 0.5625103211322761], [35.51568282453752, 0.19213134518469022, 1.216653324710143], [39.8883504467753, 0.15754533358129175, 1.1026466523317724], [42.97493666708179, 0.19530138983383383, 1.063790850500356], [49.430191844724455, 0.17878370495264617, 7.444022300312363], [57.44257221723057, 0.23330300785309488, 0.5131267058822334], [60.60839869273286, 0.16513306826136165, 2.7959258282302244], [64.96774980939794, 0.22082031166012173, 2.2702109527601557], [68.0016023852933, 0.2503810363458385, 1.0483820226273985], [69.7959122097716, 0.17310275560347188, 0.5000780904247224], [75.54796540086393, 0.1481441036806399, 11.999992073353438]], "r_squared_": 0.9409582084764446, "error_": 0.03897072537726315}
{"freq_range": [2.0, 80.0], "freq_res": 1.0, "aperiodic_params_": [-0.5868391740385246, 0.2668281807288589], "gaussian_params_": [[4.4414168591146375, 0.28103487663137755, 5.999999999644728], [45.20932059133077, 0.18655507488401288, 1.6141930740182686], [50.01784605329186, 0.17141327826375932, 0.6280756034618653], [52.36596779178592, 0.5045990422942536, 0.2722583086582218], [58.28728418858464, 0.16756485389460213, 2.0939535876053053], [67.20386376169616, 0.18541565352329725, 3.1159648402200295], [72.49601547149194, 1.1523799539145545, 0.2501325244458348], [75.8725315838872, 0.22402072881782756, 0.8682625251741521]], "peak_params_": [[4.4414168591146375, 0.28027535869063913, 11.999999999289455], [45.20932059133077, 0.18499313084099644, 3.2283861480365372], [50.01784605329186, 0.1736917704789822, 1.2561512069237306], [52.36596779178592, 0.20750615230869474, 0.5445166173164436], [58.28728418858464, 0.16835885203062917, 4.1879071752106105], [67.20386376169616, 0.1850483961981213, 6.231929680440059], [72.49601547149194, 0.21804879510500108, 0.5002650488916696], [75.8725315838872, 0.22506877003731873, 1.7365250503483043]], "r_squared_": 0.7301520834856139, "error_": 0.0656210042422418}
{"freq_range": [2.0, 80.0], "freq_res": 1.0, "aperiodic_params_": [-0.29616738279339644, 0.47955510223586595], "gaussian_params_": [[10.456269059710413, 0.44691147971096723, 1.537217736658083], [43.39326245123275, 0.09650661880675966, 5.999999999999999], [50.08777509129948, 0.13545538933339854, 0.9874076570125335], [57.9563945231017, 0.17591680056106365, 0.8215397570156682], [68.5220104024741, 0.16917896355462017, 5.999999999999999], [76.54037487634382, 0.10926207656391036, 0.9376800910768942]], "peak_params_": [[10.456269059710413, 0.42765254551131865, 3.074435473316166], [43.39326245123275, 0.09631946873228547, 11.999999999999998], [50.08777509129948, 0.18899814979955964, 1.974815314025067], [57.9563945231017, 0.21700676752365078, 1.6430795140313363], [68.5220104024741, 0.16865366832154027, 11.999999999999998], [76.54037487634382, 0.15923821533301696, 1.8753601821537884]], "r_squared_": 0.8293969973813374, "error_": 0.059649450944351555}
{"freq_range": [2.0, 80.0], "freq_res": 1.0, "aperiodic_params_": [-0.1787615510988702, 0.4245771533750027], "gaussian_params_": [[10.18935335080414, 0.3833804816060611, 1.6739467780871442], [33.09590775258391, 0.1402732933738624, 0.993833724542412], [35.54094838713194, 0.6327254446581319, 0.2726504505419881], [42.94386810319135, 0.1342269859043447, 2.6944503582836807], [49.83227371263752, 0.20888636437688665, 1.2792263490460416], [57.49425032483937, 0.6398736527918503, 0.2685648344208309], [65.44751401427196, 0.15091721654757134, 5.416715938970722], [77.40238116260414, 0.10855777808563122, 5.99997572048714]], "peak_params_": [[10.18935335080414, 0.38093550802632525, 3.3478935561742884], [33.09590775258391, 0.13976967291658227, 1.987667449084824], [35.54094838713194, 0.16015444066866125, 0.5453009010839762], [42.94386810319135, 0.13422615618996647, 5.3889007165673615], [49.83227371263752, 0.21403990973923648, 2.558452698092083], [57.49425032483937, 0.1627317894327739, 0.5371296688416618], [65.44751401427196, 0.16322154384094367, 10.833431877941443], [77.40238116260414, 0.1238385330956665, 11.99995144097428]], "r_squared_": 0.7961491427591995, "error_": 0.05377256341609044}
{"freq_range": [2.0, 80.0], "freq_res": 1.0, "aperiodic_params_": [-0.8017877966549466, 0.8924668798449847], "gaussian_params_": [[9.368581874101356, 0.3589026174286941, 2.969047029541296], [12.193120889182001, 0.08480629753408457, 1.2458866193364007], [14.649418247535685, 0.26490279208816475, 0.2767544813183946], [18.404210236823115, 0.3793694044954011, 0.2895098365224544], [41.63052934199487, 0.13356574836203633, 1.3085534496249813], [46.42474814619929, 0.373642532441619, 0.2733478227060184], [52.25195062355153, 0.20589171290372416, 2.0078774081776394], [56.491669805004435, 0.46110761518701043, 0.293677773430382], [58.43425250605556, 0.3213281405624359, 0.30956647630816253], [63.08246441676267, 0.2866403663780698, 0.6947808221182737], [66.05486903640366, 0.22185466017334765, 0.6675525204987905], [68.21232438827026, 0.2268449324138038, 0.9536600469234612], [73.6756376432912, 0.28671378757586324, 2.2686262709440466], [77.7306580604707, 0.22553108176564649, 1.535906325795489]], "peak_params_": [[9.368581874101356, 0.35932510216404556, 5.938094059082592], [12.193120889182001, 0.326123863041035, 2.4917732386728013], [14.649418247535685, 0.18485335231272026, 0.5535089626367892], [18.404210236823115, 0.1483892955853514, 0.5790196730449088], [41.63052934199487, 0.12834686303909493, 2.6171068992499626], [46.42474814619929, 0.1138466868750978, 0.5466956454120367], [52.25195062355153, 0.20427714269394848, 4.015754816355279], [56.491669805004435, 0.14960155617430004, 0.587355546860764], [58.43425250605556, 0.12355073813590112, 0.6191329526163251], [63.08246441676267, 0.2846393628513937, 1.3895616442365475], [66.05486903640366, 0.23747213912298726, 1.335105040997581], [68.21232438827026, 0.23701252256243954, 1.9073200938469224], [73.6756376432912, 0.295603215057473, 4.537252541888093], [77.7306580604707, 0.26869739019455885, 3.071812651590978]], "r_squared_": 0.9836465207724081, "error_": 0.03135161876217005}
{"freq_range": [2.0, 80.0], "freq_res": 1.0, "aperiodic_params_": [-0.2007942955361775, 0.9508400934641604], "gaussian_params_": [[2.975114813104241, 0.396358636509419, 0.8171606347806694], [6.163164141345851, 0.3776669626059774, 0.8300757113902574], [8.54252457553076, 1.1092389586986668, 0.293477647812471], [10.741731511663808, 0.42387352506558246, 0.9806793650486186], [22.916892189789966, 0.14690586028548544, 0.2500000022272974], [43.617817191235204, 0.38162822852015427, 0.25373297860784666], [47.020167738284314, 0.13401241765200617, 0.7640094108701505], [50.08421108709466, 0.22968904135911494, 0.7246627813954604], [54.43115632016422, 0.4618753766946469, 0.26192742476912895], [58.42105292336307, 0.17146045084361042, 0.7453412599102175], [65.85206680985361, 0.1792191970198677, 5.315566153693815], [74.04340045679344, 0.11326823489025044, 2.1420620590035124], [79.4572167022044, 0.8753676556149395, 0.2751458672921071]], "peak_params_": [[2.975114813104241, 0.39644024451043125, 1.6343212695613387], [6.163164141345851, 0.37086378261253006, 1.6601514227805148], [8.54252457553076, 0.4177950454956547, 0.586955295624942], [10.741731511663808, 0.40942624708761055, 1.9613587300972373], [22.916892189789966, 0.13900872646046514, 0.5000000044545948], [43.617817191235204, 0.12283238028622723, 0.5074659572156933], [47.020167738284314, 0.13432521520489793, 1.528018821740301], [50.08421108709466, 0.2303098918768045, 1.4493255627909207], [54.43115632016422, 0.1340847560735967, 0.5238548495382579], [58.42105292336307, 0.2063668564021386, 1.490682519820435], [65.85206680985361, 0.17924806208816513, 10.63113230738763], [74.04340045679344, 0.16860205925156801, 4.284124118007025], [79.4572167022044, 0.23627676695625754, 0.5502917345842142]], "r_squared_": 0.9868295664504717, "error_": 0.03246069601638912}
{"freq_range": [2.0, 80.0], "freq_res": 1.0, "aperiodic_params_": [-0.06645416400540298, 1.024486889384683], "gaussian_params_": [[2.529068218205733, 0.5169312591875831, 0.5164492447547046], [9.140225316950218, 0.446158781527117, 3.3527631445327493], [48.63449905813597, 0.1682633786682985, 3.582487612303635], [54.401730933896786, 0.4263627062344633, 0.26188237654367885], [58.105725673292575, 0.17579513970662078, 1.9182497964529284], [65.29931461171327, 0.24845033934785374, 4.27749984575098], [72.98516615905065, 0.23164395249292216, 3.206436087528159], [77.43435557925774, 0.6951338654559391, 0.27444504926866475], [79.48213274618242, 0.3312472004284684, 0.6387007675226781]], "peak_params_": [[2.529068218205733, 0.4244973995032836, 1.032898489509409], [9.140225316950218, 0.4457687347837146, 6.7055262890654985], [48.63449905813597, 0.16756688945808507, 7.16497522460727], [54.401730933896786, 0.21165258321474179, 0.5237647530873577], [58.105725673292575, 0.23898443704585315, 3.8364995929058567], [65.29931461171327, 0.25854886926997867, 8.55499969150196], [72.98516615905065, 0.2807849451453093, 6.412872175056318], [77.43435557925774, 0.3105201704905518, 0.5488900985373295], [79.48213274618242, 0.29047155521277324, 1.2774015350453563]], "r_squared_": 0.9820904356705401, "error_": 0.043564458476010856}
{"freq_range": [2.0, 80.0], "freq_res": 1.0, "aperiodic_params_": [0.007937429668896255, 1.0691965229750935], "gaussian_params_": [[3.1579453752554296, 0.3501466073433743, 0.5642399464096677], [5.966703028312422, 0.34607476129455433, 0.5863078945741594], [9.610251850232881, 0.4462893638518179, 1.6669373927060889], [50.08458475446579, 0.1871499257576058, 0.830507754340077], [53.8153975252634, 0.20991316069764696, 0.25000000000000006], [63.81539542763085, 0.204416659018398, 5.999999999999999], [74.99102884311381, 0.17436681420356717, 4.190886416661323], [79.37361065118685, 0.20712236573500598, 0.5133252142611846]], "peak_params_": [[3.1579453752554296, 0.33686610271103284, 1.1284798928193354], [5.966703028312422, 0.3882791168070342, 1.1726157891483189], [9.610251850232881, 0.43425580312552725, 3.3338747854121777], [50.08458475446579, 0.20061102803445707, 1.661015508680154], [53.8153975252634, 0.21345510930222078, 0.5000000000000001], [63.81539542763085, 0.2099164172652268, 11.999999999999998], [74.99102884311381, 0.2103378274079435, 8.381772833322646], [79.37361065118685, 0.2775862695432585, 1.0266504285223692]], "r_squared_": 0.9802894528126246, "error_": 0.047011511225747316}
