{"freq_range": [2.0, 80.0], "freq_res": 1.0, "aperiodic_params_": [-0.03377188395728555, 0.41031373190556386], "gaussian_params_": [[22.186044542436786, 0.444095397914787, 3.0317597494114152], [47.00400463579113, 0.14425785723598267, 0.2500784388766057], [48.904069269752725, 0.20728024547315813, 5.999999999999999], [49.39757052976535, 0.10367859402890123, 0.25670785035959015]], "peak_params_": [[22.186044542436786, 0.44326894544039125, 6.0635194988228305], [47.00400463579113, 0.3413406670974135, 0.5001568777532114], [48.904069269752725, 0.23850368249463816, 11.999999999999998], [49.39757052976535, 0.23850368249463816, 0.5134157007191803]], "r_squared_": 0.7209823096057578, "error_": 0.0766949582239384}
{"freq_range": [2.0, 80.0], "freq_res": 1.0, "aperiodic_params_": [0.05145400983055786, 0.5110333360779283], "gaussian_params_": [[16.715627156089642, 0.3502353645019695, 0.25000834004254524], [19.649931269934847, 0.35559299942871514, 0.3240345794346187], [22.14477337762265, 0.3877049598762058, 0.9226607848468097], [24.271696642068378, 0.2828616713579257, 0.9177235978249304], [43.90900871735181, 0.2815380115836949, 0.9769913615289139], [46.50149833586646, 0.6887770911323589, 0.3032730170375882]], "peak_params_": [[16.715627156089642, 0.18340661362096145, 0.5000166800850905], [19.649931269934847, 0.22440153934877477, 0.6480691588692374], [22.14477337762265, 0.39617520099549386, 1.8453215696936194], [24.271696642068378, 0.3220858080890428, 1.8354471956498608], [43.90900871735181, 0.28031962882257677, 1.9539827230578277], [46.50149833586646, 0.18027915572273678, 0.6065460340751764]], "r_squared_": 0.8576430643360627, "error_": 0.06667423760253391}
{"freq_range": [2.0, 80.0], "freq_res": 1.0, "aperiodic_params_": [-0.025922914275870707, 0.6686403140186842], "gaussian_params_": [[9.800463448828173, 0.27395068071429063, 1.2420613108498375], [21.15613246545956, 0.37851185546245303, 2.3112155642525516], [44.38101423833343, 0.24598209599812917, 3.947356294331212], [58.73424181431968, 0.20841725805752492, 0.9457435803966411], [63.56058647475315, 0.16406540764025446, 1.836309974162273], [69.96802830117967, 0.15508707079217066, 1.0334894985874334], [73.58813251376937, 0.13552309051156058, 1.5700532639085163]], "peak_params_": [[9.800463448828173, 0.2704415964526905, 2.484122621699675], [21.15613246545956, 0.3776491617190384, 4.622431128505103], [44.38101423833343, 0.24483887002308657, 7.894712588662424], [58.73424181431968, 0.20811741051828148, 1.8914871607932822], [63.56058647475315, 0.15943589365932365, 3.672619948324546], [69.96802830117967, 0.1653148274913221, 2.066978997174867], [73.58813251376937, 0.13101620237572487, 3.1401065278170326]], "r_squared_": 0.880872534451177, "error_": 0.06885425074643846}
{"freq_range": [2.0, 80.0], "freq_res": 1.0, "aperiodic_params_": [0.06268427867056414, 0.5594069869002097], "gaussian_params_": [[9.802547231367202, 0.2593218363843705, 0.8045620648245156], [18.872132547839133, 0.3633807405300411, 1.4710710122918058], [22.763752973001925, 0.3476290356265414, 1.5042030523954963], [42.162286873547096, 0.2093222352611108, 4.032082576895444], [60.54796539662085, 0.14559066083528185, 5.999999999999999]], "peak_params_": [[9.802547231367202, 0.2516288796497, 1.6091241296490313], [18.872132547839133, 0.3772021727628509, 2.9421420245836116], [22.763752973001925, 0.3504595191479377, 3.0084061047909927], [42.162286873547096, 0.2103773944397045, 8.064165153790888], [60.54796539662085, 0.14518187331973442, 11.999999999999998]], "r_squared_": 0.8052428829932345, "error_": 0.08062869573614309}
{"freq_range": [2.0, 80.0], "freq_res": 1.0, "aperiodic_params_": [0.34084951783499556, 0.7595745411426881], "gaussian_params_": [[18.737625456747224, 0.20948999239755575, 1.6118086747879359], [22.43905861749337, 0.28677857691438274, 0.5755195576069808], [24.48789461170717, 0.613690974208759, 0.29899759068735965], [38.76680897943272, 0.16124283349120286, 1.9737916504451425], [43.624924769671146, 0.32597915077995393, 0.2540335048986566], [47.93894503245045, 0.13715248545009198, 4.4892316696252506], [58.36973983724355, 0.17546519218586962, 1.6239766688555954], [63.21076591647336, 0.23167161864755823, 0.7472501241486218], [67.41840080669809, 0.1918635080469162, 1.2133335396839866], [72.12255392238917, 0.19423516059820847, 0.8703251319763382], [76.02167396414987, 0.1884352670784304, 0.7265592385199183]], "peak_params_": [[18.737625456747224, 0.2067327493345722, 3.2236173495758718], [22.43905861749337, 0.24138360480675536, 1.1510391152139616], [24.48789461170717, 0.17035344015012777, 0.5979951813747193], [38.76680897943272, 0.17901196689048804, 3.947583300890285], [43.624924769671146, 0.207729317091629, 0.5080670097973132], [47.93894503245045, 0.13714265752255528, 8.978463339250501], [58.36973983724355, 0.1821066310982179, 3.247953337711191], [63.21076591647336, 0.2263962331072854, 1.4945002482972436], [67.41840080669809, 0.18080602483838915, 2.426667079367973], [72.12255392238917, 0.19247283785681724, 1.7406502639526764], [76.02167396414987, 0.1883609552004516, 1.4531184770398367]], "r_squared_": 0.9380841184781094, "error_": 0.05093211978992029}
{"freq_range": [2.0, 80.0], "freq_res": 1.0, "aperiodic_params_": [0.33467507461944623, 1.0349781919826544], "gaussian_params_": [[9.6385413073698, 0.24336057883801254, 1.018796075825395], [43.58124050353417, 0.51094227029727, 0.2734850511202546], [47.64810534991259, 0.12579861451998897, 1.0163414253539562], [51.46849707173935, 0.3711466509218234, 0.300078793443367], [54.457625299102745, 0.2017551723995127, 3.8646505690487953], [61.6090262300878, 0.312178924362486, 0.42704058124646765], [70.98176336204388, 0.05396996821398144, 0.25000012803513916], [72.70498693763905, 0.23063759110963936, 5.999999999999999]], "peak_params_": [[9.6385413073698, 0.2285159985754468, 2.03759215165079], [43.58124050353417, 0.16360675917931444, 0.5469701022405092], [47.64810534991259, 0.1684778633716637, 2.0326828507079124], [51.46849707173935, 0.245800037551982, 0.600157586886734], [54.457625299102745, 0.20213428017827306, 7.729301138097591], [61.6090262300878, 0.2822984884752977, 0.8540811624929353], [70.98176336204388, 0.27535890132682006, 0.5000002560702783], [72.70498693763905, 0.2303609908810731, 11.999999999999998]], "r_squared_": 0.9591365350566513, "error_": 0.05501685018435016}
{"freq_range": [2.0, 80.0], "freq_res": 1.0, "aperiodic_params_": [0.12436388170279876, 0.7600262716663017], "gaussian_params_": [[10.246260033402105, 0.35067744580684, 0.8851786493971279], [17.28979603487934, 0.22203943517664845, 0.4665111510393584], [22.186729071847495, 0.24414740709454058, 2.120348936533113], [41.824198529985715, 0.1943217287450708, 2.6796236038634187], [48.204812928258235, 0.10924133716409025, 1.1751432284813679], [56.54796532169221, 0.13403915743313433, 5.999999987364406], [68.51269699514208, 1.4612839071864085, 0.25000052469038553], [70.92059417502352, 0.23291018272866795, 0.39548356865613216]], "peak_params_": [[10.246260033402105, 0.3373659425505196, 1.7703572987942557], [17.28979603487934, 0.19533243270200074, 0.9330223020787168], [22.186729071847495, 0.24320250750093175, 4.240697873066226], [41.824198529985715, 0.20099376135707203, 5.359247207726837], [48.204812928258235, 0.1698276381210253, 2.3502864569627357], [56.54796532169221, 0.13365931586219948, 11.999999974728812], [68.51269699514208, 0.23418692884398173, 0.5000010493807711], [70.92059417502352, 0.23563148621390884, 0.7909671373122643]], "r_squared_": 0.9009889557777586, "error_": 0.06687893437255973}
{"freq_range": [2.0, 80.0], "freq_res": 1.0, "aperiodic_params_": [0.1893322104525499, 0.7600615094769192], "gaussian_params_": [[9.846570659804163, 0.33609816014005, 0.9137260839564796], [17.351723985945494, 0.3884958100669342, 0.7416913302558659], [19.58439930049224, 0.6878119515133128, 0.26770346635983716], [22.203792715898086, 0.3383364050040816, 0.8635295761591394], [42.14069016487221, 0.12022282100192816, 1.6247251075923395], [46.54796540086405, 0.13113446107690627, 5.999999999999999]], "peak_params_": [[9.846570659804163, 0.33139312256267045, 1.8274521679129592], [17.351723985945494, 0.3471797646617125, 1.4833826605117317], [19.58439930049224, 0.21981864847322385, 0.5354069327196743], [22.203792715898086, 0.3290748218153343, 1.7270591523182788], [42.14069016487221, 0.21816355765297846, 3.249450215184679], [46.54796540086405, 0.13213549472306851, 11.999999999999998]], "r_squared_": 0.9086681569290853, "error_": 0.07199862796757203}
{"freq_range": [2.0, 80.0], "freq_res": 1.0, "aperiodic_params_": [0.49278686998528143, 0.9924411028158608], "gaussian_params_": [[2.1062015558964395, 0.15841446406539803, 2.147744286325015], [9.889340963589197, 0.3127338931426352, 0.7104766008653924], [17.35104438791123, 0.3545470553623974, 0.6160901471055987], [21.50432278488873, 0.40738783178151, 2.050977376961415], [41.98263524056138, 0.23596328366677485, 3.7750570304420714], [53.5086482963887, 0.09682621245250747, 5.999999999999999], [67.90078275851023, 0.12533669381887727, 1.9462713501008386], [73.5151035727367, 1.022884724695713, 0.25002379963240356]], "peak_params_": [[2.1062015558964395, 0.15822091280467032, 4.29548857265003], [9.889340963589197, 0.3091482469414533, 1.4209532017307849], [17.35104438791123, 0.3379519346849702, 1.2321802942111975], [21.50432278488873, 0.3956627155092788, 4.10195475392283], [41.98263524056138, 0.2513451026244964, 7.550114060884143], [53.5086482963887, 0.09798912209421617, 11.999999999999998], [67.90078275851023, 0.1304136229402959, 3.8925427002016773], [73.5151035727367, 0.15719017521083, 0.5000475992648071]], "r_squared_": 0.9832694940343059, "error_": 0.04066798441972157}
{"freq_range": [2.0, 80.0], "freq_res": 1.0, "aperiodic_params_": [0.6499964889477181, 1.1411649024528754], "gaussian_params_": [[4.196706582723813, 0.17465910757066003, 1.6179202015582415], [9.944279241629323, 0.34562602970336664, 0.9724076084920619], [17.30778827551853, 0.4406327606181142, 0.6596722374264348], [19.501428320050394, 0.5137090157199574, 0.34744788267648996], [22.09714916730157, 0.21531811445686808, 0.5437427819449928], [62.14143774360083, 0.1916941680399808, 0.9035426066987555], [64.56049077022436, 0.6507452635384757, 0.2646873899747081], [68.25050517798479, 0.2104758984537849, 0.8281677798552005], [70.49858797970109, 0.5227428626630809, 0.29095521610571684], [73.58541301720469, 0.45234066025057384, 0.2501382156633788], [76.35121008183513, 0.12203050170470692, 5.999999999999999]], "peak_params_": [[4.196706582723813, 0.17337299191469044, 3.235840403116483], [9.944279241629323, 0.3453398850090534, 1.9448152169841237], [17.30778827551853, 0.39518913280260626, 1.3193444748528695], [19.501428320050394, 0.18371415954557035, 0.6948957653529799], [22.09714916730157, 0.2119086949549458, 1.0874855638899856], [62.14143774360083, 0.19634480234020169, 1.807085213397511], [64.56049077022436, 0.18570578817276173, 0.5293747799494162], [68.25050517798479, 0.24738633442545188, 1.656335559710401], [70.49858797970109, 0.21269218357266872, 0.5819104322114337], [73.58541301720469, 0.22754837753220958, 0.5002764313267576], [76.35121008183513, 0.12182162120825257, 11.999999999999998]], "r_squared_": 0.9773772846322983, "error_": 0.04940771824596771}
{"freq_range": [2.0, 80.0], "freq_res": 1.0, "aperiodic_params_": [0.8310760625642049, 1.333014310640387], "gaussian_params_": [[4.7636295471251575, 0.1963812852236134, 1.1339617891239764], [10.031808402993065, 0.3255061497560307, 1.2003014286299258], [17.244513444849837, 0.4168386092857926, 0.6477047759553181], [19.49459442523183, 0.704815181062402, 0.2958878898875473], [22.27583587525243, 0.2732681583597301, 0.448278518079309], [52.04125630569182, 0.21008751678483953, 0.908858582971484], [54.46833477057356, 0.5472897092401109, 0.2970538539726453], [56.990070955414645, 0.1687880125498903, 0.7613298415540268], [63.021785174936134, 0.14315273090843858, 1.8979196714724813], [68.42640562064726, 0.5511888957517963, 0.25293101968336046], [73.68714055414584, 0.2296893083808198, 5.99999973748523]], "peak_params_": [[4.7636295471251575, 0.19221062361742264, 2.2679235782479528], [10.031808402993065, 0.32539647291341295, 2.4006028572598517], [17.244513444849837, 0.3881699203893649, 1.2954095519106361], [19.49459442523183, 0.18490625520827586, 0.5917757797750945], [22.27583587525243, 0.22613737431490644, 0.896557036158618], [52.04125630569182, 0.21020550272179506, 1.817717165942968], [54.46833477057356, 0.17965851938805177, 0.5941077079452906], [56.990070955414645, 0.1745094566538592, 1.5226596831080537], [63.021785174936134, 0.19015555751470758, 3.7958393429449626], [68.42640562064726, 0.2842504936921446, 0.5058620393667209], [73.68714055414584, 0.2293772751246903, 11.99999947497046]], "r_squared_": 0.9851131941583466, "error_": 0.04159886927398311}
{"freq_range": [2.0, 80.0], "freq_res": 1.0, "aperiodic_params_": [0.8593797898006438, 1.3522386731915237], "gaussian_params_": [[4.931721555917364, 0.1956180430921265, 1.1904462428110139], [10.030473481621216, 0.3024316432437196, 1.2444344785066213], [17.206984993199693, 0.3713337612710252, 0.7808866198871235], [19.46627079903718, 0.42922164215411085, 0.3297022866459581], [22.079510554581617, 0.24606582613030736, 0.48763874496922993], [48.291060839904674, 0.1858714178406657, 0.9219349576161728], [53.77266108895032, 0.16848640627069894, 2.1953758156899585], [63.466361877044896, 0.18639540915139846, 3.274634112010689], [70.00407942879484, 0.2500557293361791, 1.456956755712575], [73.53470424530906, 0.6594621017143841, 0.3096975648686484], [76.89358286726511, 0.225044233121428, 1.9472423202895397]], "peak_params_": [[4.931721555917364, 0.1953821104465475, 2.3808924856220277], [10.030473481621216, 0.3023636473012649, 2.4888689570132425], [17.206984993199693, 0.358515513126556, 1.561773239774247], [19.46627079903718, 0.18450329597359727, 0.6594045732919162], [22.079510554581617, 0.24281651877617338, 0.9752774899384599], [48.291060839904674, 0.18214934212805245, 1.8438699152323457], [53.77266108895032, 0.170441577007872, 4.390751631379917], [63.466361877044896, 0.18454165400992517, 6.549268224021378], [70.00407942879484, 0.2759496572375171, 2.91391351142515], [73.53470424530906, 0.29479685627506935, 0.6193951297372968], [76.89358286726511, 0.2247473102670905, 3.8944846405790794]], "r_squared_": 0.990025571886694, "error_": 0.035100413148570445}
{"freq_range": [2.0, 80.0], "freq_res": 1.0, "aperiodic_params_": [0.4569706887743367, 0.7745802347386752], "gaussian_params_": [[17.18528508331551, 0.2561219283819323, 1.130222249501745], [21.69342257773986, 0.3677426217183769, 0.2947282903122985], [43.986030258003716, 0.10679878477683379, 1.2941529808024999], [48.0450338856034, 0.17261396953652666, 0.8688348038747977], [54.168410549505374, 0.17150594357499283, 2.0182200003307784], [60.5140148216537, 0.1690796597987149, 1.2511426395249896], [64.66428771446928, 0.1769563934536547, 0.5786619372332523], [70.40792658511909, 0.3762714903066224, 0.29608748713607397], [74.53776531891953, 0.39376244562539553, 0.33725344487181835]], "peak_params_": [[17.18528508331551, 0.2527032732180655, 2.26044449900349], [21.69342257773986, 0.21411402481900543, 0.589456580624597], [43.986030258003716, 0.10679648086155757, 2.5883059616049997], [48.0450338856034, 0.17485873273237929, 1.7376696077495954], [54.168410549505374, 0.170910096449727, 4.036440000661557], [60.5140148216537, 0.1573509965844554, 2.502285279049979], [64.66428771446928, 0.14982089283563105, 1.1573238744665046], [70.40792658511909, 0.1456563957266399, 0.5921749742721479], [74.53776531891953, 0.15392962113449227, 0.6745068897436367]], "r_squared_": 0.9437640065439378, "error_": 0.05170231620586999}
{"freq_range": [2.0, 80.0], "freq_res": 1.0, "aperiodic_params_": [0.22730764969993483, 0.6042106302826055], "gaussian_params_": [[19.66465202692529, 0.4952433257177926, 2.0720394842738257], [20.99542175955178, 0.06878088410266117, 0.2500452343179429], [38.58240153151835, 0.3457574337638498, 1.8796022197590971], [43.65458285623016, 0.22567080108912702, 0.45998424983849867], [49.69336088142881, 0.1271694940499121, 3.1386348488186004], [55.475000180199935, 0.7272383666174437, 0.2882274583124951], [56.87835491783658, 0.2522675727465816, 0.5391809880306627], [59.4164982089258, 0.42696313994759266, 0.34836209776166494], [61.71514510349317, 0.17538230314686812, 0.8397676861388563]], "peak_params_": [[19.66465202692529, 0.4888244040016506, 4.144078968547651], [20.99542175955178, 0.47114433009299117, 0.5000904686358858], [38.58240153151835, 0.3377119038378589, 3.7592044395181943], [43.65458285623016, 0.20019549295363326, 0.9199684996769973], [49.69336088142881, 0.12656403029225527, 6.277269697637201], [55.475000180199935, 0.21807260664862216, 0.5764549166249902], [56.87835491783658, 0.25439282905014693, 1.0783619760613254], [59.4164982089258, 0.21154473844821675, 0.6967241955233299], [61.71514510349317, 0.16563552981582874, 1.6795353722777127]], "r_squared_": 0.9112194915533235, "error_": 0.0569725968514526}
{"freq_range": [2.0, 80.0], "freq_res": 1.0, "aperiodic_params_": [0.36340654834042807, 0.9637720599627655], "gaussian_params_": [[9.649574017436427, 0.2502713252372719, 0.9175715309805954], [18.515745486669516, 0.17288246634203613, 2.4218808606443685], [38.55373092096834, 0.9178067278568023, 0.250001050828297], [40.83397034361523, 0.21134370019139326, 0.5902486476996043], [70.54796540086404, 0.12243299777902253, 5.999999999999999]], "peak_params_": [[9.649574017436427, 0.23302695807743423, 1.8351430619611908], [18.515745486669516, 0.16946086643604463, 4.843761721288737], [38.55373092096834, 0.1882526940186945, 0.500002101656594], [40.83397034361523, 0.20314654427907242, 1.1804972953992086], [70.54796540086404, 0.12208602674071534, 11.999999999999998]], "r_squared_": 0.9509854558788554, "error_": 0.060886546121202346}
{"freq_range": [2.0, 80.0], "freq_res": 1.0, "aperiodic_params_": [0.16501962617499888, 0.7763242923519607], "gaussian_params_": [[9.921608296519846, 0.27874034990773466, 0.8872741733912419], [16.95560540125779, 0.23613006519353116, 1.0628646459816673], [20.280353093025536, 0.25364275012804277, 0.5274226457600457], [22.411599969333235, 0.4385955667658544, 0.3202253530164347], [41.313818549747666, 0.16064091621984802, 1.2031361998728192], [44.73720141790525, 0.17660582335246475, 0.6820056987616969], [53.586951744466425, 0.4845980217246444, 0.2690606916342856], [60.989336790519715, 0.11139631146995636, 0.25000053968862646], [68.43834473802204, 0.12853377028580004, 5.960585195380586], [74.3441778784367, 0.1276773950415279, 0.6253358196648245]], "peak_params_": [[9.921608296519846, 0.2776545568043099, 1.7745483467824839], [16.95560540125779, 0.23592417573993973, 2.1257292919633346], [20.280353093025536, 0.22413034040174118, 1.0548452915200914], [22.411599969333235, 0.19325499169083882, 0.6404507060328694], [41.313818549747666, 0.1552715440466157, 2.4062723997456383], [44.73720141790525, 0.16549647925234834, 1.3640113975233938], [53.586951744466425, 0.15599132553512352, 0.5381213832685712], [60.989336790519715, 0.17029501111987733, 0.5000010793772529], [68.43834473802204, 0.12818667078437773, 11.921170390761173], [74.3441778784367, 0.1929016318593817, 1.250671639329649]], "r_squared_": 0.9354635187601342, "error_": 0.0540588829324514}
{"freq_range": [2.0, 80.0], "freq_res": 1.0, "aperiodic_params_": [0.35265170273517826, 0.9958462117546295], "gaussian_params_": [[9.839598400079797, 0.41173263647221364, 0.9840152513614705], [17.261973537992294, 0.33024378827531986, 0.6731022489062622], [19.548686772542894, 1.0513288445640117, 0.2500018033436262], [22.190283034160956, 0.29667662206043016, 0.5348993156738604], [48.3001313741299, 0.1341126235066076, 0.5216717950323987], [53.62024027077755, 0.11052221909566035, 5.999999999999999], [68.47299517893579, 0.5710070088565954, 0.26866373242418634], [70.43609228435449, 0.43428940596181337, 0.25012051601584295], [72.3873711195764, 0.13901166263290257, 5.999999999999999]], "peak_params_": [[9.839598400079797, 0.40629866598356335, 1.968030502722941], [17.261973537992294, 0.30615502093930846, 1.3462044978125245], [19.548686772542894, 0.2062527815241666, 0.5000036066872524], [22.190283034160956, 0.27848633427509584, 1.0697986313477208], [48.3001313741299, 0.18496458307898433, 1.0433435900647974], [53.62024027077755, 0.11157077195589582, 11.999999999999998], [68.47299517893579, 0.23387881718776127, 0.5373274648483727], [70.43609228435449, 0.22608263459742362, 0.5002410320316859], [72.3873711195764, 0.13973567222320793, 11.999999999999998]], "r_squared_": 0.9665052932236291, "error_": 0.05040270125693834}
{"freq_range": [2.0, 80.0], "freq_res": 1.0, "aperiodic_params_": [0.6819247254521542, 1.2457479632188608], "gaussian_params_": [[3.4217668554577245, 0.14478069241985128, 1.902845656974694], [9.855626595594561, 0.4891121897675539, 1.0042918008005743], [17.3065195588288, 0.5288276385144013, 0.6391043076574624], [19.52644521596899, 0.5732605090824654, 0.32327545064552154], [22.141386020779002, 0.2378233972198135, 0.46298839979732215], [52.16556824823328, 0.1757623924718183, 0.6276184735670574], [54.31438911376272, 0.3137535651676771, 0.3132832577808149], [64.64028948835539, 0.1334989267195997, 5.999999999999999], [69.12121380020515, 0.14344861400433812, 1.59816131611749], [73.54117998716012, 0.8688102712584024, 0.26374108063443125], [78.54796540086404, 0.16248477522785768, 3.806738500954607]], "peak_params_": [[3.4217668554577245, 0.1412675542929329, 3.805691313949388], [9.855626595594561, 0.48445197706600773, 2.0085836016011487], [17.3065195588288, 0.47137342853922337, 1.2782086153149248], [19.52644521596899, 0.19613993972475774, 0.6465509012910431], [22.141386020779002, 0.22698882918564767, 0.9259767995946443], [52.16556824823328, 0.18426360663636787, 1.2552369471341147], [54.31438911376272, 0.21978926690793266, 0.6265665155616298], [64.64028948835539, 0.13870861061044693, 11.999999999999998], [69.12121380020515, 0.2525559954007921, 3.19632263223498], [73.54117998716012, 0.3118063964729285, 0.5274821612688625], [78.54796540086404, 0.16895874717203574, 7.613477001909214]], "r_squared_": 0.985994484464133, "error_": 0.040401916314306445}
{"freq_range": [2.0, 80.0], "freq_res": 1.0, "aperiodic_params_": [0.945898304422838, 1.4502392093783563], "gaussian_params_": [[4.69951770958401, 0.1522014184701533, 1.0908705141216999], [9.931920073634515, 0.4622981224425128, 1.248199489654205], [17.214475323653595, 0.5431129157160767, 0.749799668120307], [19.497680784302837, 0.937020105975683, 0.279992629999348], [22.159984752987977, 0.22775095212427862, 0.2500001106680128], [48.03177733060127, 0.16768354566045476, 0.7979329466092463], [53.31203377105923, 0.2104026311565362, 2.1240932704194933], [65.81408307404848, 0.212787017583169, 5.01720539138816], [73.57354451448566, 0.40856435483287223, 0.25000553090438293], [77.64389620259216, 0.23824257811178023, 5.999999999999999]], "peak_params_": [[4.69951770958401, 0.14672379535221608, 2.1817410282433998], [9.931920073634515, 0.46161212863959133, 2.49639897930841], [17.214475323653595, 0.521342335564782, 1.499599336240614], [19.497680784302837, 0.22493663909559203, 0.559985259998696], [22.159984752987977, 0.1855810906059313, 0.5000002213360256], [48.03177733060127, 0.17716611574677388, 1.5958658932184926], [53.31203377105923, 0.21635236515278589, 4.2481865408389865], [65.81408307404848, 0.24888336778456677, 10.03441078277632], [73.57354451448566, 0.34971399245642876, 0.5000110618087659], [77.64389620259216, 0.2489650430552628, 11.999999999999998]], "r_squared_": 0.9883037252854859, "error_": 0.04303141625818834}
{"freq_range": [2.0, 80.0], "freq_res": 1.0, "aperiodic_params_": [0.9263551821526039, 1.4242443503452689], "gaussian_params_": [[4.869682223915249, 0.19138595618215762, 1.3280678418429543], [9.765322401474924, 0.4337853023820809, 1.1249387016441723], [15.080452995209281, 0.16507149520280057, 2.5683635983488764], [17.448913490842806, 1.2161836024781696, 0.2952569252332098], [19.470426071732998, 0.48564190127738877, 0.34826354363953443], [22.382764727310917, 0.3242757042012608, 0.31038277371512224], [51.94247299678076, 0.17200283501670652, 2.688550681080156], [64.54796540086404, 0.2646117727395063, 5.999999999999999]], "peak_params_": [[4.869682223915249, 0.190596399812788, 2.6561356836859087], [9.765322401474924, 0.44789330933086197, 2.2498774032883446], [15.080452995209281, 0.16499914511025682, 5.136727196697753], [17.448913490842806, 0.5076957543852161, 0.5905138504664196], [19.470426071732998, 0.2465519312165404, 0.6965270872790689], [22.382764727310917, 0.1559736583938366, 0.6207655474302445], [51.94247299678076, 0.20167211518787953, 5.377101362160312], [64.54796540086404, 0.2638631705626511, 11.999999999999998]], "r_squared_": 0.972967975600906, "error_": 0.06662775395815498}
{"freq_range": [2.0, 80.0], "freq_res": 1.0, "aperiodic_params_": [0.9273953043979902, 1.4389094106207942], "gaussian_params_": [[4.442938151731456, 0.227960605565439, 0.8751980957691383], [6.480084289443906, 0.40834022812978593, 0.32887039221314823], [9.458088876062035, 0.4793323308586618, 0.8341175785066894], [11.774667436337541, 0.2420263322969483, 0.7829718572461114], [14.646008494890205, 0.23773743964251415, 0.7274618271176913], [17.227212044748015, 0.5032131586675268, 0.6982742503658256], [19.475289614007846, 0.831413109202232, 0.29929310903991896], [22.326454905027713, 0.34262384104454746, 0.25017573789781977], [53.68354800104465, 0.18526348669791992, 3.513718238572439], [63.212470778048186, 0.16000814669646124, 1.7421581537796769], [73.56731849065653, 0.2817770592758991, 5.999999999999999]], "peak_params_": [[4.442938151731456, 0.20055810373198935, 1.7503961915382766], [6.480084289443906, 0.18761664611108103, 0.6577407844262965], [9.458088876062035, 0.4126873944832149, 1.6682351570133789], [11.774667436337541, 0.2371403621703132, 1.5659437144922228], [14.646008494890205, 0.21435164947664054, 1.4549236542353825], [17.227212044748015, 0.47853186227458394, 1.3965485007316512], [19.475289614007846, 0.2556628886003899, 0.5985862180798379], [22.326454905027713, 0.14623985523848715, 0.5003514757956395], [53.68354800104465, 0.18589552864116277, 7.027436477144878], [63.212470778048186, 0.22408321273854215, 3.4843163075593537], [73.56731849065653, 0.2810453495775964, 11.999999999999998]], "r_squared_": 0.9927251027035817, "error_": 0.0346081458946148}
{"freq_range": [2.0, 80.0], "freq_res": 1.0, "aperiodic_params_": [0.853381304448053, 1.3484013439895095], "gaussian_params_": [[5.121425697704703, 0.17198914939198406, 1.3327739738135527], [9.46279844663145, 0.47074615285191274, 0.5533313044145366], [11.624962018911157, 0.2199645883120856, 0.6168267030750479], [17.232005471108085, 0.3165827050240475, 1.7231774167643594], [19.497307566128395, 0.4317531681030177, 0.2551054108272331], [21.61327512636824, 0.45347589874121075, 0.27514724705460136], [54.252051947879124, 0.13927467418788375, 5.999998969315605], [64.28576650652919, 0.15075098308981583, 2.27365406362035], [69.78248798980877, 0.13516549508285083, 0.9520310117658528], [75.0672887920806, 0.20206008416833304, 4.779359738719478]], "peak_params_": [[5.121425697704703, 0.17127682412847373, 2.6655479476271053], [9.46279844663145, 0.33432614902067587, 1.1066626088290732], [11.624962018911157, 0.1860083839628761, 1.2336534061500959], [17.232005471108085, 0.3137262532984369, 3.446354833528719], [19.497307566128395, 0.25159322120588345, 0.5102108216544662], [21.61327512636824, 0.175767984710264, 0.5502944941092027], [54.252051947879124, 0.1391694572863018, 11.99999793863121], [64.28576650652919, 0.20061782644145953, 4.5473081272407], [69.78248798980877, 0.2577179981613251, 1.9040620235317056], [75.0672887920806, 0.20239497615161972, 9.558719477438956]], "r_squared_": 0.9884790048710379, "error_": 0.04108683541025226}
{"freq_range": [2.0, 80.0], "freq_res": 1.0, "aperiodic_params_": [0.3916782171149857, 0.8738915820703756], "gaussian_params_": [[9.433259721459711, 0.3331743192463816, 0.4675981104054968], [16.899875602887242, 0.16164488930480725, 2.4182300218372346], [42.547965400863994, 0.10786560436714202, 5.999999999999999], [48.18683558045687, 0.18521644219857994, 0.7180461332667832]], "peak_params_": [[9.433259721459711, 0.21767156977425411, 0.9351962208109936], [16.899875602887242, 0.16151886618228894, 4.836460043674469], [42.547965400863994, 0.10755991683748978, 11.999999999999998], [48.18683558045687, 0.2504332535008542, 1.4360922665335665]], "r_squared_": 0.9576577002015185, "error_": 0.05464458757026261}
{"freq_range": [2.0, 80.0], "freq_res": 1.0, "aperiodic_params_": [0.32267010044161665, 1.1211680324876394], "gaussian_params_": [[4.074910639733034, 0.1845536268768334, 1.749238250990982], [5.588462205048372, 0.2907884441127106, 0.2500416601883649], [9.577488806108432, 0.29180191394309674, 0.9419677437489087], [13.331248685477181, 0.12222737130984639, 1.3023242921674438], [17.824772602715242, 0.15393161200516575, 1.2534574773949254], [46.5306945633199, 0.6837703246746928, 0.25001337105082394], [51.5678620777141, 0.45640203046259237, 0.2500027602496796], [61.50009444394414, 0.10755742149399851, 5.999999999999999], [64.63542285712647, 0.3013863735901469, 0.2500291261521189], [69.77123944105422, 0.15549431748235715, 1.4451331169258328], [73.49187469238743, 0.7203893329601988, 0.25001744449370983], [79.96541834604592, 0.2009390611260271, 5.999999999999999]], "peak_params_": [[4.074910639733034, 0.1843844803770773, 3.498476501981964], [5.588462205048372, 0.17598548210310427, 0.5000833203767298], [9.577488806108432, 0.26911012219014463, 1.8839354874978174], [13.331248685477181, 0.11882733050880367, 2.6046485843348877], [17.824772602715242, 0.1526327138307777, 2.506914954789851], [46.5306945633199, 0.12322851671296253, 0.5000267421016479], [51.5678620777141, 0.13317087479586132, 0.5000055204993592], [61.50009444394414, 0.10945595450372214, 11.999999999999998], [64.63542285712647, 0.20445066611460128, 0.5000582523042378], [69.77123944105422, 0.2435775572974601, 2.8902662338516656], [73.49187469238743, 0.23639590021104695, 0.5000348889874197], [79.96541834604592, 0.2018630971874409, 11.999999999999998]], "r_squared_": 0.9888431926229356, "error_": 0.033643412392079755}
{"freq_range": [2.0, 80.0], "freq_res": 1.0, "aperiodic_params_": [-0.2988225079466729, 0.43439323613949987], "gaussian_params_": [[4.904069198271887, 0.27740030617136446, 5.999999999999999], [63.1080553939964, 0.13211063553948926, 5.9999999974813205], [71.45072343510286, 0.6109294072092507, 0.2500007347784939]], "peak_params_": [[4.904069198271887, 0.2773648523678724, 11.999999999999998], [63.1080553939964, 0.13208921339349655, 11.999999994962641], [71.45072343510286, 0.17589790369515823, 0.5000014695569878]], "r_squared_": 0.8412087931194574, "error_": 0.0633470553390868}
{"freq_range": [2.0, 80.0], "freq_res": 1.0, "aperiodic_params_": [0.30924832114319023, 0.9288080560051697], "gaussian_params_": [[9.777434950012788, 0.4782566769170493, 0.9337194987970016], [16.983456999737573, 0.24357672783672227, 0.48025025981034625], [52.65451276752692, 0.12638029354908878, 5.999999999949859], [69.78385541365755, 0.1918876263116558, 5.999999999985296], [74.00133651383246, 0.11735241743030343, 0.25011291597751134], [79.4757552837915, 0.20858007020239208, 0.6566671539206455]], "peak_params_": [[9.777434950012788, 0.46486120986149015, 1.8674389975940031], [16.983456999737573, 0.2434322630010014, 0.9605005196206925], [52.65451276752692, 0.1300069936202113, 11.999999999899718], [69.78385541365755, 0.1936991146740521, 11.999999999970592], [74.00133651383246, 0.267484512374929, 0.5002258319550227], [79.4757552837915, 0.21942223129438942, 1.313334307841291]], "r_squared_": 0.9453287974351501, "error_": 0.06185707132739978}
{"freq_range": [2.0, 80.0], "freq_res": 1.0, "aperiodic_params_": [0.6144161200534403, 1.2455139589487474], "gaussian_params_": [[9.779083910378382, 0.6761786978102161, 1.0689878350911253], [17.43384604807463, 0.3681351757115402, 1.948786814568357], [56.54796540086405, 0.24273551640187963, 5.999999999999999]], "peak_params_": [[9.779083910378382, 0.6621474887292996, 2.1379756701822505], [17.43384604807463, 0.3591246526538632, 3.897573629136714], [56.54796540086405, 0.24204761203224234, 11.999999999999998]], "r_squared_": 0.9271135976324405, "error_": 0.1122333716009758}
{"freq_range": [2.0, 80.0], "freq_res": 1.0, "aperiodic_params_": [0.797984117815067, 1.3613218280829782], "gaussian_params_": [[9.774662393610907, 0.6554964194325097, 1.1650978202023201], [17.3202305201004, 0.4079081130009633, 1.9740305957724789], [56.54796540086405, 0.22007471238057932, 5.999999999999999]], "peak_params_": [[9.774662393610907, 0.6437717993373124, 2.3301956404046402], [17.3202305201004, 0.40257604463297847, 3.9480611915449577], [56.54796540086405, 0.21945102797486338, 11.999999999999998]], "r_squared_": 0.9419537893433729, "error_": 0.11181935607653908}
{"freq_range": [2.0, 80.0], "freq_res": 1.0, "aperiodic_params_": [1.0866733495423406, 1.55522673796154], "gaussian_params_": [[5.100911305120325, 0.12459037103512902, 1.4618461431967869], [9.62585406707735, 0.5172807224193539, 0.9899920808870376], [15.131006716037678, 0.1986653537467322, 3.432550727086212], [17.44795600400098, 1.682097781694938, 0.26095619879980925], [19.492009200605466, 0.9414104752548133, 0.26052107876121067], [52.67386943619056, 0.18303282567602525, 3.3814665444312277], [67.12632168268445, 0.22932649132824134, 5.999999999999999], [78.99043248742767, 0.24099061551628, 5.999999999999999]], "peak_params_": [[5.100911305120325, 0.1268532578020806, 2.9236922863935737], [9.62585406707735, 0.5470815264854151, 1.9799841617740752], [15.131006716037678, 0.19852092059260795, 6.865101454172424], [17.44795600400098, 0.5567591249803068, 0.5219123975996185], [19.492009200605466, 0.263486069692229, 0.5210421575224213], [52.67386943619056, 0.1965513511773278, 6.7629330888624555], [67.12632168268445, 0.2620175108295246, 11.999999999999998], [78.99043248742767, 0.2733538437671734, 11.999999999999998]], "r_squared_": 0.9916799077533559, "error_": 0.03928095185918671}
{"freq_range": [2.0, 80.0], "freq_res": 1.0, "aperiodic_params_": [0.8986202242998058, 1.4626416777299376], "gaussian_params_": [[5.303704372816837, 0.1574140094661031, 2.280340129001049], [9.470120703630938, 1.2797494874520328, 0.28868807868716], [10.763119807336842, 0.31827051785136246, 1.7911673019293362], [14.544670928442944, 0.6592463240162713, 0.295004511695383], [16.59700774778328, 0.9678078730375161, 0.26639429920484337], [18.367325525442443, 0.31838124096466003, 1.9417877321937789], [53.036485170343056, 0.15627109185925675, 3.4001483078729478], [68.0959308017281, 0.3578518998360205, 5.999999999999999]], "peak_params_": [[5.303704372816837, 0.1578220896065509, 4.560680258002098], [9.470120703630938, 0.5782159001714187, 0.57737615737432], [10.763119807336842, 0.3226895998667723, 3.5823346038586723], [14.544670928442944, 0.29053066543953787, 0.590009023390766], [16.59700774778328, 0.5574303123394531, 0.5327885984096867], [18.367325525442443, 0.31282703552970426, 3.8835754643875577], [53.036485170343056, 0.1713670110129324, 6.8002966157458955], [68.0959308017281, 0.35781589790429646, 11.999999999999998]], "r_squared_": 0.9823073388710182, "error_": 0.0523440771199785}
{"freq_range": [2.0, 80.0], "freq_res": 1.0, "aperiodic_params_": [0.7939588830273352, 1.4161762556597712], "gaussian_params_": [[5.518368548525873, 0.1468883587690881, 1.735090839277902], [9.393893144064371, 0.5965254650882928, 0.7358402160657135], [11.831543489530139, 0.27575834731613846, 0.9419012690507989], [14.541271921903727, 0.33118677740919195, 0.4862321564689611], [16.60010487908414, 0.6943555529615388, 0.3120324855514024], [18.501113521037556, 0.2930493065674556, 1.6367031880706282], [53.55199896560956, 0.17228182243886728, 3.31126000801754], [68.0959308017281, 0.33999413393341527, 5.999999999999999]], "peak_params_": [[5.518368548525873, 0.1413512758213417, 3.470181678555804], [9.393893144064371, 0.5395255306450889, 1.471680432131427], [11.831543489530139, 0.27275725788104727, 1.8838025381015977], [14.541271921903727, 0.24292663890173705, 0.9724643129379222], [16.60010487908414, 0.49787639437308, 0.6240649711028048], [18.501113521037556, 0.2797470364561616, 3.2734063761412564], [53.55199896560956, 0.19223842453941087, 6.62252001603508], [68.0959308017281, 0.33996333096547326, 11.999999999999998]], "r_squared_": 0.9804025902927168, "error_": 0.05178139891510484}
{"freq_range": [2.0, 80.0], "freq_res": 1.0, "aperiodic_params_": [0.5109275355999283, 1.2822849697913652], "gaussian_params_": [[5.2368868797326495, 0.14499056876474942, 1.7595189573054848], [9.308589097124743, 0.5365545375939605, 0.6600525378474257], [11.720567955361158, 0.24054250305126088, 0.8701731585228561], [14.532154153619613, 0.36919582549338176, 0.40209466266913846], [16.874124236924754, 0.33367236833456543, 0.7169816034309248], [19.16047697293518, 0.15938592248601594, 1.1909768666429577], [53.588971610121426, 0.14764693379596772, 3.311945515854338], [68.0959308017281, 0.3274832820563117, 5.999999999999789]], "peak_params_": [[5.2368868797326495, 0.14368247977873422, 3.5190379146109696], [9.308589097124743, 0.49754593907736, 1.3201050756948514], [11.720567955361158, 0.22867584975330513, 1.7403463170457123], [14.532154153619613, 0.19913445179213296, 0.8041893253382769], [16.874124236924754, 0.35932169716483275, 1.4339632068618495], [19.16047697293518, 0.16205976112510168, 2.3819537332859153], [53.588971610121426, 0.16724838906559225, 6.623891031708676], [68.0959308017281, 0.3274528543912556, 11.999999999999577]], "r_squared_": 0.9772438321470287, "error_": 0.04873770302724429}
{"freq_range": [2.0, 80.0], "freq_res": 1.0, "aperiodic_params_": [0.33803225436888396, 1.102818555120626], "gaussian_params_": [[9.660178354755894, 0.3677377763766768, 1.0587453196313803], [47.72492917086021, 0.12658842210257396, 1.4329856460456778], [52.28328873760039, 0.1890865055245132, 0.46774877198663817], [56.52610385371111, 0.12649193960672162, 1.0362095548586432], [62.652993082060895, 0.1203818294409006, 1.6808528858423413], [73.94922411204095, 0.20110663650020882, 5.999999999999999]], "peak_params_": [[9.660178354755894, 0.3492752920373445, 2.1174906392627606], [47.72492917086021, 0.12429500542008487, 2.8659712920913556], [52.28328873760039, 0.15913898533358006, 0.9354975439732763], [56.52610385371111, 0.11807359476504753, 2.0724191097172864], [62.652993082060895, 0.15588819989544933, 3.3617057716846825], [73.94922411204095, 0.20109943537666375, 11.999999999999998]], "r_squared_": 0.9768046263121901, "error_": 0.04639991505912507}
{"freq_range": [2.0, 80.0], "freq_res": 1.0, "aperiodic_params_": [0.31481676477714604, 1.1089463080908153], "gaussian_params_": [[2.452035839244395, 0.23550847998979751, 2.275192115463526], [9.93682280594747, 0.5329335535790392, 1.0659057677973938], [52.42584118239649, 0.15252580420476752, 4.962486359260187], [64.7056616058541, 0.2602359962948295, 3.882114343611259], [77.2034904903258, 0.30706046050291014, 5.999999999999999]], "peak_params_": [[2.452035839244395, 0.23090583612066218, 4.550384230927052], [9.93682280594747, 0.5329579260902128, 2.1318115355947875], [52.42584118239649, 0.1532389554946083, 9.924972718520374], [64.7056616058541, 0.3044519097890179, 7.764228687222518], [77.2034904903258, 0.3086125320549937, 11.999999999999998]], "r_squared_": 0.9659489837976852, "error_": 0.05783211691341268}
{"freq_range": [2.0, 80.0], "freq_res": 1.0, "aperiodic_params_": [0.46267076691347764, 1.243782885675461], "gaussian_params_": [[2.4520345991359433, 0.20689338783647235, 2.8791064411757628], [9.527492366359512, 0.9066480120616448, 0.4621313798666879], [11.324680070818896, 0.3268567074647139, 1.7602298922674908], [16.85795521462848, 0.36103075142797614, 0.9884068340539927], [19.52472579358376, 0.6978489133069063, 0.32671481094234245], [52.44848086473995, 0.2962592334772403, 0.2858782857125865], [53.610029638019384, 0.41268030452406934, 0.2666298781756126], [56.83301307178561, 0.1393937228806694, 5.664582766752672], [59.98732492576798, 0.0720629349989348, 0.250014363405289], [71.64389620259216, 0.3789096436931826, 5.999999999999999]], "peak_params_": [[2.4520345991359433, 0.20435927627930572, 5.7582128823515255], [9.527492366359512, 0.7904722387420527, 0.9242627597333758], [11.324680070818896, 0.32952457124929013, 3.5204597845349817], [16.85795521462848, 0.359129638699933, 1.9768136681079853], [19.52472579358376, 0.24454655156481708, 0.6534296218846849], [52.44848086473995, 0.18519584284460278, 0.571756571425173], [53.610029638019384, 0.2696391264081899, 0.5332597563512252], [56.83301307178561, 0.15861017640655461, 11.329165533505344], [59.98732492576798, 0.24883679029617722, 0.500028726810578], [71.64389620259216, 0.3821109940752001, 11.999999999999998]], "r_squared_": 0.9784395621877687, "error_": 0.05539437010512189}
{"freq_range": [2.0, 80.0], "freq_res": 1.0, "aperiodic_params_": [0.8110166775066566, 1.4220581274855286], "gaussian_params_": [[9.495817316076419, 2.0258268337149867, 0.284001047389426], [10.419782824146976, 0.4144672514358464, 1.5567362208313873], [15.587907682314695, 0.2286533434008895, 1.0825218319861802], [17.40814500541282, 0.9070764508487257, 0.29652268816085964], [19.33467058750208, 0.24848981845313614, 1.4065054307927864], [52.39860382894999, 0.24113693250503662, 0.7189881908653682], [54.31905021007366, 0.49692162681704305, 0.28047784564858774], [56.74225787652858, 0.15434163990895938, 1.0435141645369421], [68.0959308017281, 0.3880610179728826, 5.999999999999999]], "peak_params_": [[9.495817316076419, 0.7147659754602755, 0.568002094778852], [10.419782824146976, 0.8186881227232208, 3.1134724416627746], [15.587907682314695, 0.22830699383470343, 2.1650436639723605], [17.40814500541282, 0.5121246568001719, 0.5930453763217193], [19.33467058750208, 0.2431461397273217, 2.813010861585573], [52.39860382894999, 0.217412850689356, 1.4379763817307365], [54.31905021007366, 0.30984042332363537, 0.5609556912971755], [56.74225787652858, 0.21989209374719976, 2.0870283290738842], [68.0959308017281, 0.3880114209148835, 11.999999999999998]], "r_squared_": 0.9724597012657439, "error_": 0.06148983698936329}
{"freq_range": [2.0, 80.0], "freq_res": 1.0, "aperiodic_params_": [0.7403630530508308, 1.3567706418390324], "gaussian_params_": [[9.686073508345403, 0.7432887525715907, 0.8859125190103856], [12.4520346173861, 0.21172370234366963, 4.725271718420626], [17.31441578912041, 0.5899122060492937, 0.25006413299180474], [18.129052531998294, 0.2597357707042088, 1.9963451445151177], [56.54796540086405, 0.24179851085598109, 5.999999999999999]], "peak_params_": [[9.686073508345403, 0.883175762861716, 1.7718250380207712], [12.4520346173861, 0.2376227895367134, 9.450543436841253], [17.31441578912041, 0.6221885852861114, 0.5001282659836095], [18.129052531998294, 0.37922669368275896, 3.9926902890302354], [56.54796540086405, 0.24111326192885585, 11.999999999999998]], "r_squared_": 0.939453348078338, "error_": 0.11847241642313579}
{"freq_range": [2.0, 80.0], "freq_res": 1.0, "aperiodic_params_": [1.0802669651648895, 1.5921681797432579], "gaussian_params_": [[9.6627820675324, 0.6609534356379255, 0.945271575865642], [12.452062088428118, 0.2129087582047239, 4.031776393986285], [17.260856228028615, 0.4602704442724184, 0.2500040880392837], [18.1459025748549, 0.3025174902118485, 2.220951093840956], [52.07551634237701, 0.1353236455043249, 2.3815695221139817], [53.61269383711522, 0.36301422297593966, 0.2502687912871313], [56.743250167556404, 0.09601447291097659, 0.7659041959079744], [64.10005728798639, 0.21865002314168538, 5.402020360724173], [76.81933868524892, 0.32570524469374906, 5.999999999999999]], "peak_params_": [[9.6627820675324, 0.7975276327580729, 1.890543151731284], [12.452062088428118, 0.24924249359720702, 8.06355278797257], [17.260856228028615, 0.6445643625673089, 0.5000081760785674], [18.1459025748549, 0.3902930392580537, 4.441902187681912], [52.07551634237701, 0.153112416851362, 4.763139044227963], [53.61269383711522, 0.2457138294094816, 0.5005375825742626], [56.743250167556404, 0.20029590411117026, 1.5318083918159489], [64.10005728798639, 0.25184643007354723, 10.804040721448345], [76.81933868524892, 0.3381896737249095, 11.999999999999998]], "r_squared_": 0.9913313626121061, "error_": 0.042588351050722284}
{"freq_range": [2.0, 80.0], "freq_res": 1.0, "aperiodic_params_": [0.9831746827236152, 1.552762247306763], "gaussian_params_": [[9.683367759990265, 0.7762507619593285, 1.1915323575579664], [15.044685469333869, 0.32422892714795465, 2.2252223289971886], [17.351748976576808, 0.7919784849845196, 0.2617134765383333], [19.5018571563839, 0.2750771275383386, 1.4347614865781717], [53.43521199798192, 0.19518956099563325, 3.0482294757376267], [68.0959308017281, 0.3959042581682872, 5.999999999999999]], "peak_params_": [[9.683367759990265, 0.7741425587240073, 2.3830647151159328], [15.044685469333869, 0.3262030540794485, 4.450444657994377], [17.351748976576808, 0.6014969560209895, 0.5234269530766666], [19.5018571563839, 0.28615264798350304, 2.8695229731563434], [53.43521199798192, 0.20992131973228734, 6.096458951475253], [68.0959308017281, 0.39585581099204714, 11.999999999999998]], "r_squared_": 0.9765007475891153, "error_": 0.06396876975158686}
{"freq_range": [2.0, 80.0], "freq_res": 1.0, "aperiodic_params_": [0.8107115537308728, 1.4610470998580047], "gaussian_params_": [[9.604134654207854, 0.5864638813532419, 0.8555277880916111], [12.463572201644181, 0.27223140054860256, 4.30891785085808], [16.84626439644307, 0.35991632302876747, 0.39966474763772813], [19.53135036655612, 0.21781125522554778, 1.3629569843016007], [53.0896019242077, 0.14799304508864816, 3.2654121628900588], [68.0959308017281, 0.37401889730864446, 5.999999999999999]], "peak_params_": [[9.604134654207854, 0.7581083500268493, 1.7110555761832222], [12.463572201644181, 0.2822818794494491, 8.61783570171616], [16.84626439644307, 0.5294768621788212, 0.7993294952754563], [19.53135036655612, 0.2642825413395562, 2.7259139686032015], [53.0896019242077, 0.1637246648716466, 6.5308243257801175], [68.0959308017281, 0.37397548791291935, 11.999999999999998]], "r_squared_": 0.9751236550848609, "error_": 0.06441723666329838}
{"freq_range": [2.0, 80.0], "freq_res": 1.0, "aperiodic_params_": [0.5852402682710766, 1.3660991824478417], "gaussian_params_": [[9.51530520303016, 0.4980458455362359, 0.6947279500886581], [10.947406014089724, 0.2522161923774972, 4.021268942537417], [14.851033251464697, 0.11293838829260747, 0.3580770337880211], [16.844330139391513, 0.32653539248781377, 0.46632140071990036], [19.629214308224643, 0.19188680062565702, 1.0975336445858275], [54.49659599387128, 0.20528863224052774, 3.3440569700546536], [59.481452293181825, 0.4887786782974972, 0.3004358140049299], [63.3035434595645, 0.17443082623771958, 1.3727300428572151], [73.0959308017281, 0.38308409502258933, 5.999999999999999]], "peak_params_": [[9.51530520303016, 0.6357690357227239, 1.3894559001773161], [10.947406014089724, 0.302955171223638, 8.042537885074834], [14.851033251464697, 0.2555185959214862, 0.7161540675760422], [16.844330139391513, 0.40097721798602914, 0.9326428014398007], [19.629214308224643, 0.20125615141804298, 2.195067289171655], [54.49659599387128, 0.2054571087452257, 6.688113940109307], [59.481452293181825, 0.243787680198998, 0.6008716280098598], [63.3035434595645, 0.2713134419313197, 2.7454600857144302], [73.0959308017281, 0.383035180193821, 11.999999999999998]], "r_squared_": 0.9880661280211497, "error_": 0.04115685879923021}
{"freq_range": [2.0, 80.0], "freq_res": 1.0, "aperiodic_params_": [0.2724669010707575, 1.151676359809389], "gaussian_params_": [[5.904069198271887, 0.10372970282245987, 5.999999999999999], [9.783259874842367, 0.4795471362153476, 1.0061317489416945], [16.354135461717206, 0.16195384999347828, 2.286831574544048], [55.75456052497578, 0.12201685124280437, 5.507236046926328], [71.64389620259216, 0.27484090121814686, 5.999999999999999]], "peak_params_": [[5.904069198271887, 0.10413007550519104, 11.999999999999998], [9.783259874842367, 0.554128761136883, 2.012263497883389], [16.354135461717206, 0.18520539817865644, 4.573663149088096], [55.75456052497578, 0.1310768085711631, 11.014472093852657], [71.64389620259216, 0.27593090955653565, 11.999999999999998]], "r_squared_": 0.9775909645469504, "error_": 0.051312457725989635}
{"freq_range": [2.0, 80.0], "freq_res": 1.0, "aperiodic_params_": [0.6508686274356302, 1.3875595626753976], "gaussian_params_": [[9.642956921158891, 0.9942668353987948, 0.7439936239014359], [11.82530893091776, 0.3629661766542484, 1.1342182404436287], [17.18291260194841, 0.2918801015060182, 2.1278768123464493], [53.47542950101688, 0.22212920864073707, 3.6689984436128267], [61.10970761745274, 0.09775341902490886, 2.606339395130185], [70.0959308017281, 0.4067461582168644, 5.999999999999999]], "peak_params_": [[9.642956921158891, 0.9865215930963772, 1.4879872478028717], [11.82530893091776, 0.38029249518158514, 2.2684364808872575], [17.18291260194841, 0.2908146823091766, 4.255753624692899], [53.47542950101688, 0.22806520198287927, 7.337996887225653], [61.10970761745274, 0.2536920415602171, 5.21267879026037], [70.0959308017281, 0.4069937253545335, 11.999999999999998]], "r_squared_": 0.9728906805209717, "error_": 0.06055227932252229}
{"freq_range": [2.0, 80.0], "freq_res": 1.0, "aperiodic_params_": [0.6059009177311276, 1.3223787811582577], "gaussian_params_": [[9.844229285563005, 0.9946675858794853, 0.9710551213146995], [16.024652041032912, 0.2985229978074941, 3.350632338635899], [61.64389620259217, 0.3632533525777104, 5.999999999999999]], "peak_params_": [[9.844229285563005, 1.0412352790542019, 1.942110242629399], [16.024652041032912, 0.2985149199959899, 6.701264677271798], [61.64389620259217, 0.3626141361165576, 11.999999999999998]], "r_squared_": 0.9362350345010251, "error_": 0.10565661584605805}
{"freq_range": [2.0, 80.0], "freq_res": 1.0, "aperiodic_params_": [0.8560108551239034, 1.5111133310128806], "gaussian_params_": [[9.912892112473115, 1.0230011826561658, 1.171893792271572], [17.0726554849343, 0.39204009243750043, 2.6867633201032053], [55.739749383948805, 0.20269366006409145, 5.457267491086564], [59.96350018987835, 0.09049556124910907, 0.2500489149949344], [71.64389620259216, 0.4305189242696631, 5.999999999999999]], "peak_params_": [[9.912892112473115, 1.0324419196685066, 2.343787584543144], [17.0726554849343, 0.3918967866847354, 5.373526640206411], [55.739749383948805, 0.21684480825834318, 10.914534982173128], [59.96350018987835, 0.3044820244132307, 0.5000978299898688], [71.64389620259216, 0.43215496764125416, 11.999999999999998]], "r_squared_": 0.9782819649319501, "error_": 0.06614057533170993}
{"freq_range": [2.0, 80.0], "freq_res": 1.0, "aperiodic_params_": [1.0063080863978409, 1.57159863980463], "gaussian_params_": [[9.881132458260529, 0.983161544499415, 1.2080310976534636], [16.799694365515634, 0.47705154499160973, 2.9851682110531885], [53.572469762189314, 0.17171354712947595, 3.3665715293017118], [68.09593080172797, 0.40527539461131556, 5.999999999998402]], "peak_params_": [[9.881132458260529, 1.0140502908297735, 2.4160621953069272], [16.799694365515634, 0.4759788313242076, 5.970336422106377], [53.572469762189314, 0.19599389838154324, 6.7331430586034235], [68.09593080172797, 0.40524124707752884, 11.999999999996804]], "r_squared_": 0.9731816470293921, "error_": 0.07360816527388811}
{"freq_range": [2.0, 80.0], "freq_res": 1.0, "aperiodic_params_": [0.9177096034994612, 1.5178043844890197], "gaussian_params_": [[9.881676070920046, 0.9428901575980273, 1.2128124412894918], [16.703677877230003, 0.41829195719956364, 3.0500920024486016], [53.624503855525894, 0.16602743440205722, 3.3813318871868847], [68.0959308017281, 0.39509016105336076, 5.999999999999999]], "peak_params_": [[9.881676070920046, 0.9757840463452535, 2.4256248825789837], [16.703677877230003, 0.4163226179128785, 6.100184004897203], [53.624503855525894, 0.19002140153961355, 6.762663774373769], [68.0959308017281, 0.39505940428396813, 11.999999999999998]], "r_squared_": 0.973025610086123, "error_": 0.07174443102721226}
{"freq_range": [2.0, 80.0], "freq_res": 1.0, "aperiodic_params_": [0.8394180352448241, 1.5041020499538642], "gaussian_params_": [[9.868340181907726, 0.8063576783115188, 1.000080127820499], [13.309847253466755, 0.3093960568465118, 3.964431944525153], [17.379273992716556, 0.7202953518673008, 0.277329257252407], [19.46546963163185, 0.39153039558308095, 0.4199772819853149], [21.346216270545554, 0.37570535524628734, 0.33629756193659033], [54.65335856562551, 0.19194479276016133, 4.060305673077917], [62.89743555264594, 0.10188697047897216, 0.7992980949333119], [70.54796540086404, 0.4162718638215114, 5.999999999999999]], "peak_params_": [[9.868340181907726, 1.017751451718263, 2.000160255640998], [13.309847253466755, 0.3144399837944828, 7.928863889050306], [17.379273992716556, 0.4833535247281122, 0.554658514504814], [19.46546963163185, 0.32230103613520766, 0.8399545639706298], [21.346216270545554, 0.26879715847427677, 0.6725951238731807], [54.65335856562551, 0.20574222230362338, 8.120611346155833], [62.89743555264594, 0.3129376791686522, 1.5985961898666239], [70.54796540086404, 0.4151501823660648, 11.999999999999998]], "r_squared_": 0.9839933551326298, "error_": 0.05363421406107409}
{"freq_range": [2.0, 80.0], "freq_res": 1.0, "aperiodic_params_": [0.7158964008118351, 1.4436104544642787], "gaussian_params_": [[9.918172836259172, 0.7918046858456648, 1.0416374370352268], [12.942799269518062, 0.3016353455205199, 3.535850234672842], [16.67848024650246, 0.4816931946389927, 0.2705738983020939], [20.16745482849018, 0.22657764621267915, 1.248322627714242], [54.98609609360472, 0.19111898949903394, 3.9497508798392866], [63.046842899454305, 0.09049606300036829, 0.9068318765038769], [70.54796540086404, 0.39715997204769393, 5.999999999999999]], "peak_params_": [[9.918172836259172, 1.002703374229723, 2.0832748740704536], [12.942799269518062, 0.3115456496385802, 7.071700469345684], [16.67848024650246, 0.40299151368515873, 0.5411477966041878], [20.16745482849018, 0.26570594384157653, 2.496645255428484], [54.98609609360472, 0.20494793987193471, 7.899501759678573], [63.046842899454305, 0.2947939110670652, 1.8136637530077537], [70.54796540086404, 0.39608593160480554, 11.999999999999998]], "r_squared_": 0.9847109680818168, "error_": 0.05009066359524075}
{"freq_range": [2.0, 80.0], "freq_res": 1.0, "aperiodic_params_": [0.6092711420228971, 1.3883106633256583], "gaussian_params_": [[9.865885069246186, 0.6606015338543898, 1.0779557245420295], [12.953623533575158, 0.2976649139502451, 3.2868812346745067], [17.305100291388978, 0.30476408615442074, 0.27246841167222074], [19.94733348191667, 0.14918863297013804, 0.9940291193525858], [54.63481762157613, 0.15293742918939116, 2.6802193858251675], [59.43918266744682, 0.5536625586434794, 0.28101347378063846], [62.22714984465234, 0.21431507976094266, 0.738571538059551], [64.4186570328389, 0.21526358828583192, 0.8560391945216819], [68.39514296899786, 0.2314219950846886, 2.3893597835947715], [73.8691294548958, 0.1184648358270818, 1.4432206905861633], [78.54796538684423, 0.2732722430928166, 4.913104437431954]], "peak_params_": [[9.865885069246186, 0.854292401775044, 2.155911449084059], [12.953623533575158, 0.30728071569689464, 6.573762469349013], [17.305100291388978, 0.3041718662831969, 0.5449368233444415], [19.94733348191667, 0.17888525523331555, 1.9880582387051715], [54.63481762157613, 0.15152725019184254, 5.360438771650335], [59.43918266744682, 0.20406909709547705, 0.5620269475612769], [62.22714984465234, 0.21927648359329233, 1.477143076119102], [64.4186570328389, 0.2493946725123779, 1.7120783890433637], [68.39514296899786, 0.25561620810839925, 4.778719567189543], [73.8691294548958, 0.3107972643502577, 2.8864413811723266], [78.54796538684423, 0.2723435876761964, 9.826208874863909]], "r_squared_": 0.9919293218189684, "error_": 0.03606192379174898}
{"freq_range": [2.0, 80.0], "freq_res": 1.0, "aperiodic_params_": [0.5386495603082112, 1.2226531440495338], "gaussian_params_": [[10.369455380481481, 0.8856824464443529, 1.4364697374489441], [69.5926576439964, 0.3517347512594917, 5.999999999999999]], "peak_params_": [[10.369455380481481, 0.8568675739434203, 2.8729394748978883], [69.5926576439964, 0.3509250932939554, 11.999999999999998]], "r_squared_": 0.951506716773801, "error_": 0.08679695307040455}
{"freq_range": [2.0, 80.0], "freq_res": 1.0, "aperiodic_params_": [0.48278897099080526, 1.2031592289862336], "gaussian_params_": [[10.035190442294878, 1.0200172939405872, 1.1063253334386993], [15.283986740267345, 0.31279700555205353, 3.813303706021022]], "peak_params_": [[10.035190442294878, 1.1392640179261915, 2.2126506668773986], [15.283986740267345, 0.31197399212673904, 7.626607412042044]], "r_squared_": 0.9401846752005575, "error_": 0.1157822515836019}
{"freq_range": [2.0, 80.0], "freq_res": 1.0, "aperiodic_params_": [0.897995208439645, 1.5185242443861897], "gaussian_params_": [[10.072674097591046, 1.1566952789671359, 1.2974717609817517], [16.61028197969396, 0.3768164459200569, 3.3493445025040733], [53.247877505066484, 0.1391469014189987, 2.8839327524013614], [64.57051791878845, 0.26328029205540954, 5.648950295883346], [78.34625691452162, 0.33207256247882855, 5.999999999999999]], "peak_params_": [[10.072674097591046, 1.2086245243188116, 2.5949435219635033], [16.61028197969396, 0.37427497905044804, 6.698689005008147], [53.247877505066484, 0.17099325819722022, 5.767865504802723], [64.57051791878845, 0.29053323279021903, 11.297900591766693], [78.34625691452162, 0.34712119349741477, 11.999999999999998]], "r_squared_": 0.9840792048142615, "error_": 0.06056053363719734}
{"freq_range": [2.0, 80.0], "freq_res": 1.0, "aperiodic_params_": [1.0403465340997937, 1.6115440241051668], "gaussian_params_": [[10.086877604866944, 1.0433312653080404, 1.068470994332643], [13.657366887225901, 0.33979585426900866, 3.241958584781184], [16.9889365904075, 0.17049966165169525, 0.5664079101661529], [19.50298786006545, 0.4788580216267637, 0.37348315655597125], [21.41911872564645, 0.6371235587693602, 0.313617080043389], [53.90308029489055, 0.18865989042474163, 3.9106532071519196], [64.95088487256594, 0.2711957652452472, 4.679899062032961], [77.81632296997586, 0.3770341961600239, 5.999999999967605]], "peak_params_": [[10.086877604866944, 1.2197160274188024, 2.136941988665286], [13.657366887225901, 0.3391795957973379, 6.483917169562368], [16.9889365904075, 0.3701657414366619, 1.1328158203323058], [19.50298786006545, 0.24769311075375455, 0.7469663131119425], [21.41911872564645, 0.28715499106333786, 0.627234160086778], [53.90308029489055, 0.2062953139495609, 7.821306414303839], [64.95088487256594, 0.31305961198799936, 9.359798124065922], [77.81632296997586, 0.3824167004366861, 11.99999999993521]], "r_squared_": 0.9910918639085097, "error_": 0.044438948732919877}
{"freq_range": [2.0, 80.0], "freq_res": 1.0, "aperiodic_params_": [0.9086897167569175, 1.5352900978257713], "gaussian_params_": [[10.086596774911703, 1.0296139536894873, 1.0947427238252014], [13.302602765643112, 0.31275870620412205, 3.1226817912292915], [17.030647656815344, 0.2120165654776931, 0.5581541415298008], [19.518942344143536, 0.6350235619706186, 0.34357843115461395], [21.42284051772438, 0.8474019178033001, 0.2851565979086512], [54.62702812017119, 0.2034217372960101, 3.786786052730303], [59.50806119889608, 0.37510374906202226, 0.2592366416491141], [64.63771709292813, 0.21686081928563203, 3.4531805317959035], [76.21632765469283, 0.3728993046311669, 5.999999999999999]], "peak_params_": [[10.086596774911703, 1.2051775008426109, 2.189485447650403], [13.302602765643112, 0.3411311887910103, 6.245363582458583], [17.030647656815344, 0.3668561554604325, 1.1163082830596016], [19.518942344143536, 0.269645419882107, 0.6871568623092279], [21.42284051772438, 0.29729223544289574, 0.5703131958173024], [54.62702812017119, 0.20756875947863307, 7.573572105460606], [59.50806119889608, 0.23398825687346192, 0.5184732832982282], [64.63771709292813, 0.28542126517838806, 6.906361063591807], [76.21632765469283, 0.3736235578541678, 11.999999999999998]], "r_squared_": 0.9915422991811906, "error_": 0.042495467954991255}
{"freq_range": [2.0, 80.0], "freq_res": 1.0, "aperiodic_params_": [0.7366034425003855, 1.4706845463603386], "gaussian_params_": [[10.178361594185782, 1.0139836820144372, 1.2683467893719973], [16.06335298536445, 0.2693833879583393, 3.7906441577705268], [59.70360238051331, 0.21549176744396917, 5.999999999999999], [75.19186160345615, 0.356783283123599, 5.999999999999999]], "peak_params_": [[10.178361594185782, 1.0789587671389007, 2.5366935787439946], [16.06335298536445, 0.2693727619255647, 7.5812883155410535], [59.70360238051331, 0.22969316896102798, 11.999999999999998], [75.19186160345615, 0.3649587893566346, 11.999999999999998]], "r_squared_": 0.98791663788617, "error_": 0.052921822145248376}
{"freq_range": [2.0, 80.0], "freq_res": 1.0, "aperiodic_params_": [0.5520739710176348, 1.320077948931873], "gaussian_params_": [[10.196118800521646, 0.8746292463614816, 1.2868354279290302], [15.906907304141567, 0.22667122357911698, 3.3297980345643543], [53.725568467938785, 0.15246414212743323, 2.569330130560232], [63.972861588083134, 0.2242923162325552, 3.500598213880381], [69.96651453885276, 0.08641593093623456, 0.3963401099186023], [76.41019771146225, 0.26565865142583645, 5.999999999999999]], "peak_params_": [[10.196118800521646, 0.9115256819311548, 2.5736708558580603], [15.906907304141567, 0.22661612447132473, 6.659596069128709], [53.725568467938785, 0.1557213449675341, 5.138660261120464], [63.972861588083134, 0.2556220755339125, 7.001196427760762], [69.96651453885276, 0.28718417877540126, 0.7926802198372046], [76.41019771146225, 0.2656516569014029, 11.999999999999998]], "r_squared_": 0.983932331907305, "error_": 0.04805886397473611}
{"freq_range": [2.0, 80.0], "freq_res": 1.0, "aperiodic_params_": [0.7722921190295156, 1.4207852100512741], "gaussian_params_": [[10.18395162398376, 1.1238649972173438, 1.2807717517159605], [16.090542785546127, 0.31003031040392387, 3.6633696214964973], [70.38501897876785, 0.38711689788810333, 5.999999999999999]], "peak_params_": [[10.18395162398376, 1.1901708984101735, 2.561543503431921], [16.090542785546127, 0.30997303305999224, 7.3267392429929945], [70.38501897876785, 0.386320689215377, 11.999999999999998]], "r_squared_": 0.9721994942199241, "error_": 0.07831465463915108}
{"freq_range": [2.0, 80.0], "freq_res": 1.0, "aperiodic_params_": [0.6899735263522457, 1.3115426372543042], "gaussian_params_": [[10.46749685525291, 1.2525033296166102, 1.522536476407443]], "peak_params_": [[10.46749685525291, 1.194830042804424, 3.045072952814886]], "r_squared_": 0.9423383063919006, "error_": 0.12814862286496023}
{"freq_range": [2.0, 80.0], "freq_res": 1.0, "aperiodic_params_": [0.6413659827135786, 1.3054410428998013], "gaussian_params_": [[10.434664221781581, 1.182988216271364, 1.535031096882042]], "peak_params_": [[10.434664221781581, 1.1364995209519453, 3.070062193764084]], "r_squared_": 0.9431258207262084, "error_": 0.12450737364696976}
{"freq_range": [2.0, 80.0], "freq_res": 1.0, "aperiodic_params_": [-1.0772867173928062, 0.444775845556163], "gaussian_params_": [[9.790883311999817, 0.3838481929936758, 0.8465409756010521], [17.630786411108275, 0.21600743776162515, 0.6078068640217295], [52.194211870516135, 0.13430514789402523, 2.1271468885064757], [59.5964468639255, 0.20796568510695224, 1.5729124347775092], [63.518253333978755, 0.554453925615235, 0.2732625073961692], [68.31352167170061, 0.24048370312368433, 2.9173327187763247], [70.79459906891486, 0.1344180054542915, 0.44116609659487793], [75.32433995866991, 0.20897721810458977, 1.6896141063617474], [79.50130847632154, 1.1093490947082534, 0.28608810585425043]], "peak_params_": [[9.790883311999817, 0.37231359502308115, 1.6930819512021043], [17.630786411108275, 0.1796146605344533, 1.215613728043459], [52.194211870516135, 0.13374836065033513, 4.254293777012951], [59.5964468639255, 0.20553883038451892, 3.1458248695550184], [63.518253333978755, 0.20194808146557586, 0.5465250147923384], [68.31352167170061, 0.23911646475984405, 5.834665437552649], [70.79459906891486, 0.2858907476871104, 0.8823321931897559], [75.32433995866991, 0.22255500241127546, 3.3792282127234947], [79.50130847632154, 0.24742585163941966, 0.5721762117085009]], "r_squared_": 0.7232430012533496, "error_": 0.07206820687190932}
{"freq_range": [2.0, 80.0], "freq_res": 1.0, "aperiodic_params_": [-0.2752850634650127, 1.0596748456926068], "gaussian_params_": [[10.142533174997812, 0.4104390457456199, 1.3197197815111392], [17.524178791346788, 0.17138819886658044, 1.473895825557832], [47.7008692815956, 0.16479423625445297, 1.00570792534996], [53.398080885172256, 0.14543016079311474, 1.0544520742135888], [58.60482493425463, 0.17448400657949875, 1.563511868905319], [63.068303360925356, 0.15446040073120001, 0.7322894662265785], [73.55159209310968, 0.27041748485744693, 5.999999999999999]], "peak_params_": [[10.142533174997812, 0.4080525926561578, 2.6394395630222784], [17.524178791346788, 0.1626858189341629, 2.947791651115664], [47.7008692815956, 0.15769520614101906, 2.01141585069992], [53.398080885172256, 0.13647622272642268, 2.1089041484271775], [58.60482493425463, 0.1832811976806903, 3.127023737810638], [63.068303360925356, 0.21475216533765362, 1.464578932453157], [73.55159209310968, 0.2696633612696222, 11.999999999999998]], "r_squared_": 0.9641517061964567, "error_": 0.05561175438615404}
{"freq_range": [2.0, 80.0], "freq_res": 1.0, "aperiodic_params_": [-0.37723485044457766, 0.861701003706445], "gaussian_params_": [[10.297312260104606, 0.382688529700935, 1.0728472211873208], [17.43899519489099, 0.21837132457231886, 0.5446662717014519], [48.420710082576655, 0.1616882893599939, 1.07948964451144], [53.62145777373654, 0.3164671116381172, 0.45984718390484336], [59.41768102890567, 0.2012407783071137, 1.9626475349910026], [63.402664907323945, 0.16296410622747431, 0.9572855473046076], [65.84130046255196, 0.24003069048440576, 0.5407394156970653], [68.46475189943796, 0.5422088657477777, 0.3796121066885572], [70.51731309247509, 0.94870990101072, 0.29124688616422684], [74.54911923671835, 0.24520821681705746, 2.3909715786379753], [79.49011096366621, 1.0378704823596903, 0.2814235588316886]], "peak_params_": [[10.297312260104606, 0.36827223106773355, 2.1456944423746416], [17.43899519489099, 0.15780933410822784, 1.0893325434029038], [48.420710082576655, 0.1498635862003561, 2.15897928902288], [53.62145777373654, 0.22997527114790328, 0.9196943678096867], [59.41768102890567, 0.19673902467305004, 3.9252950699820053], [63.402664907323945, 0.18721276589190183, 1.9145710946092152], [65.84130046255196, 0.2351569089779677, 1.0814788313941306], [68.46475189943796, 0.26212471135300497, 0.7592242133771144], [70.51731309247509, 0.3217539426331397, 0.5824937723284537], [74.54911923671835, 0.24088681810552082, 4.7819431572759505], [79.49011096366621, 0.2711502023078318, 0.5628471176633772]], "r_squared_": 0.9339528707756645, "error_": 0.057587114802170436}
{"freq_range": [2.0, 80.0], "freq_res": 1.0, "aperiodic_params_": [-0.11262366501992173, 0.930861740088479], "gaussian_params_": [[9.958282117669302, 0.31038331616098414, 1.170263839971719], [42.57604710387111, 0.4853384625981784, 0.2873854121967011], [46.99484221148484, 0.19385022149210107, 0.6907226784598444], [68.04760074766193, 0.11209849504090165, 0.2500008682531266], [70.48748622424398, 0.5908875369092633, 0.3045133289414232], [74.24804717508228, 0.17407395995869643, 5.999999999999999]], "peak_params_": [[9.958282117669302, 0.3101861613664807, 2.340527679943438], [42.57604710387111, 0.16348651134349468, 0.5747708243934022], [46.99484221148484, 0.19385060250921105, 1.3814453569196887], [68.04760074766193, 0.21130364569809368, 0.5000017365062532], [70.48748622424398, 0.29954273701943457, 0.6090266578828464], [74.24804717508228, 0.1739252690779136, 11.999999999999998]], "r_squared_": 0.9527100481797629, "error_": 0.058369772484373264}
