{"freq_range": [2.0, 80.0], "freq_res": 1.0, "aperiodic_params_": [0.5666387351914768, 0.9380238901236388], "gaussian_params_": [[11.938052482431056, 0.1568607865451071, 2.85802171801912], [28.814064557391198, 0.22066820996959768, 0.5762973000164651], [54.64494075307885, 0.44084686012355717, 0.3283853948028046], [62.32506666224485, 0.13824162011309069, 5.999999999999999], [65.9998018265764, 0.1551398135493771, 0.25000006387833096], [78.47277948218438, 0.5453465749561831, 0.3108825697493107]], "peak_params_": [[11.938052482431056, 0.15682394395527766, 5.71604343603824], [28.814064557391198, 0.20947674860820775, 1.1525946000329301], [54.64494075307885, 0.31132766656005884, 0.6567707896056092], [62.32506666224485, 0.1380388833386058, 11.999999999999998], [65.9998018265764, 0.26973791979850203, 0.5000001277566619], [78.47277948218438, 0.17613742142221667, 0.6217651394986214]], "r_squared_": 0.9482991315743681, "error_": 0.05784961359835651}
{"freq_range": [2.0, 80.0], "freq_res": 1.0, "aperiodic_params_": [0.4224241372229915, 1.0559363771347414], "gaussian_params_": [[10.544654036378581, 0.3816644541626194, 2.431147324692472], [15.90198895853281, 0.24773773837018173, 1.7461491010768593], [34.8963336774048, 0.25749984128181475, 0.7474537942973196], [42.667736365205364, 0.4756064545143334, 0.25003079110291465], [58.22490833189435, 0.41272654965498695, 0.5181945272475915], [61.60698508509341, 0.5586390829181426, 0.2672456121079938], [64.6430072278425, 0.21768694721371065, 0.9648644167577636], [75.54801665680492, 0.7558319173746127, 0.28024561503960593], [79.01380102777713, 0.22538488448738217, 1.2055362725069039]], "peak_params_": [[10.544654036378581, 0.3798440335318162, 4.862294649384944], [15.90198895853281, 0.2781292022121229, 3.4922982021537186], [34.8963336774048, 0.2550351255069957, 1.4949075885946392], [42.667736365205364, 0.19668732157605762, 0.5000615822058293], [58.22490833189435, 0.37562724937184555, 1.036389054495183], [61.60698508509341, 0.19456564888370864, 0.5344912242159876], [64.6430072278425, 0.20328536215682025, 1.9297288335155272], [75.54801665680492, 0.21577223696930647, 0.5604912300792119], [79.01380102777713, 0.225370115767362, 2.4110725450138077]], "r_squared_": 0.9783245616115647, "error_": 0.05156356178546503}
{"freq_range": [2.0, 80.0], "freq_res": 1.0, "aperiodic_params_": [0.282142360760205, 0.8617446460640653], "gaussian_params_": [[10.9181431298352, 0.3969380649606819, 2.2308369290805397], [16.056691397226082, 0.2231293437739768, 0.6956470005962833], [50.54189443257439, 0.16428954160974982, 1.5602279287711118], [59.46353633534573, 0.2490393372027745, 0.678042191936893], [62.02464591040643, 0.24009103813527666, 0.690133834845486], [63.59030241137929, 0.3756753445059307, 0.30393524387073195], [66.00660680202137, 0.14687574268746284, 0.7006373364538907], [73.00297194107274, 0.0251204756550049, 0.2500855344215437], [74.0959308017281, 0.13170797469045947, 5.999999999999999]], "peak_params_": [[10.9181431298352, 0.3966709358637923, 4.461673858161079], [16.056691397226082, 0.2520297182239508, 1.3912940011925665], [50.54189443257439, 0.15743815465465882, 3.1204558575422237], [59.46353633534573, 0.20271867645747887, 1.356084383873786], [62.02464591040643, 0.257427762615841, 1.380267669690972], [63.59030241137929, 0.18984124491326382, 0.6078704877414639], [66.00660680202137, 0.19986713880367746, 1.4012746729077814], [73.00297194107274, 0.1546478205345434, 0.5001710688430874], [74.0959308017281, 0.1317000263821233, 11.999999999999998]], "r_squared_": 0.9606153717607041, "error_": 0.04761590623334472}
{"freq_range": [2.0, 80.0], "freq_res": 1.0, "aperiodic_params_": [0.4925635598414608, 0.9726713030223983], "gaussian_params_": [[7.010780694472721, 0.2602806354233326, 1.0223671113992219], [10.70932245311143, 0.3160189278571704, 1.1953777968373385], [15.16093117826751, 0.2659720892676717, 2.7223394075212815], [32.45695158581833, 1.3780734146913116, 0.2801187107872907], [34.13458725789408, 0.304502252799056, 0.4465888669910421], [44.998584969973884, 0.19872278668725027, 0.25000000000000006], [57.64786480527236, 0.18523332130966222, 5.999999999999998], [66.4717945148641, 1.1419707586414434, 0.3065416237991246], [69.21494680897428, 0.2820869865282997, 0.2604509205149589], [70.51762788892965, 0.42510748494786427, 0.40150758732640485], [77.55894884267356, 0.16359624371499967, 3.105631315030186]], "peak_params_": [[7.010780694472721, 0.2658041115212314, 2.0447342227984437], [10.70932245311143, 0.38965005945392683, 2.390755593674677], [15.16093117826751, 0.26601132019249435, 5.444678815042563], [32.45695158581833, 0.3642976009213795, 0.5602374215745815], [34.13458725789408, 0.2910625368076627, 0.8931777339820842], [44.998584969973884, 0.21880176078695768, 0.5000000000000001], [57.64786480527236, 0.18491458538084937, 11.999999999999996], [66.4717945148641, 0.41982345069511084, 0.6130832475982492], [69.21494680897428, 0.23560564069131562, 0.5209018410299178], [70.51762788892965, 0.23973470830544108, 0.8030151746528097], [77.55894884267356, 0.16254261642345225, 6.211262630060372]], "r_squared_": 0.9701518076254161, "error_": 0.04795350853149169}
{"freq_range": [2.0, 80.0], "freq_res": 1.0, "aperiodic_params_": [0.5984906936781329, 1.0720410948016494], "gaussian_params_": [[10.434294982873276, 0.3258634508083071, 2.7091348418543637], [16.359384803645636, 0.22786781482304752, 1.6460670252501017], [51.94509909654908, 0.18597123322822431, 1.0179900344408725], [58.15767895312076, 0.24798690040367805, 0.5058570398248453], [62.1551003044838, 0.23221157651860533, 0.7420997874785673], [64.48040911363098, 0.2512132102426328, 0.5978384069741262], [73.19542704635465, 0.18210778013942328, 0.5519988228495755], [75.47223964412034, 0.5329865384302809, 0.2845596080603063], [78.3359308614381, 0.1865452485382972, 1.061846984587464]], "peak_params_": [[10.434294982873276, 0.32183392893872015, 5.418269683708727], [16.359384803645636, 0.2619952797701702, 3.2921340505002035], [51.94509909654908, 0.18570097933771534, 2.035980068881745], [58.15767895312076, 0.236227566760558, 1.0117140796496906], [62.1551003044838, 0.22724077891445904, 1.4841995749571346], [64.48040911363098, 0.19245946758900834, 1.1956768139482523], [73.19542704635465, 0.17104587768671986, 1.103997645699151], [75.47223964412034, 0.13669627824554076, 0.5691192161206126], [78.3359308614381, 0.1774396462134944, 2.123693969174928]], "r_squared_": 0.9869735597207102, "error_": 0.037389336511626514}
{"freq_range": [2.0, 80.0], "freq_res": 1.0, "aperiodic_params_": [0.4741971306577897, 0.9840434148277057], "gaussian_params_": [[7.623742127995157, 0.37730546251669217, 0.2959135755830736], [9.527157459097388, 0.8801054377200137, 0.3030764073032957], [12.148353512957467, 0.2185736285619375, 1.6765010598113608], [34.21781839129427, 0.1841599911910284, 1.085654743496182], [41.374979294892405, 0.13341426174194504, 1.1781401409026526], [44.3272591920331, 0.30457010190419903, 0.2500048501307377], [47.17487465711222, 0.20960111849024513, 0.9832722272995423], [50.99960079199269, 0.2666892591235852, 0.5605846551226827], [59.12389086939617, 0.17169342895266837, 1.8883845906395342], [64.58240703117146, 0.4874367693762865, 0.27326017456298096], [78.86705062956813, 0.1773014415359453, 0.6650942794836011]], "peak_params_": [[7.623742127995157, 0.17835803216898274, 0.5918271511661471], [9.527157459097388, 0.3567732710105187, 0.6061528146065914], [12.148353512957467, 0.217719534178762, 3.3530021196227215], [34.21781839129427, 0.18049048430428316, 2.171309486992364], [41.374979294892405, 0.12682494346743445, 2.3562802818053052], [44.3272591920331, 0.14159056372771084, 0.5000097002614754], [47.17487465711222, 0.2063137955644615, 1.9665444545990847], [50.99960079199269, 0.26681406488203896, 1.1211693102453655], [59.12389086939617, 0.17132432037361234, 3.7767691812790685], [64.58240703117146, 0.1529914357646769, 0.5465203491259619], [78.86705062956813, 0.1737942682001583, 1.3301885589672022]], "r_squared_": 0.9833650943837718, "error_": 0.0365368485320264}
{"freq_range": [2.0, 80.0], "freq_res": 1.0, "aperiodic_params_": [0.38447966532588007, 0.9208669876251917], "gaussian_params_": [[10.575319832126011, 0.5170890072034318, 1.961491377243332], [59.163495683442015, 0.2499521468813555, 1.199410444377255], [61.997042344798494, 0.217344057666262, 0.25002301287137907], [65.54765777580931, 0.19801277844566403, 1.540734901192033], [72.0959308017281, 0.19281559039880183, 5.999999999999999]], "peak_params_": [[10.575319832126011, 0.5051103841093189, 3.922982754486664], [59.163495683442015, 0.2654740810434961, 2.39882088875451], [61.997042344798494, 0.29336872358576416, 0.5000460257427581], [65.54765777580931, 0.30473919156216933, 3.081469802384066], [72.0959308017281, 0.19282173466622599, 11.999999999999998]], "r_squared_": 0.9340957352325981, "error_": 0.07104386315188756}
{"freq_range": [2.0, 80.0], "freq_res": 1.0, "aperiodic_params_": [0.3561209354214058, 0.8910878386510556], "gaussian_params_": [[10.397532042813973, 0.3461044657976159, 0.5214652832602407], [12.009907501570039, 0.286888046629904, 4.754648121787899], [50.65743366020446, 0.3035720747206171, 0.5849449849589174], [66.45544316674273, 0.2503789623003395, 5.999999999999999], [73.42646528538005, 0.937412691314447, 0.25005002945324356]], "peak_params_": [[10.397532042813973, 0.5211944964861311, 1.0429305665204813], [12.009907501570039, 0.2899677818849258, 9.509296243575799], [50.65743366020446, 0.26480592532567226, 1.169889969917835], [66.45544316674273, 0.2496586708176538, 11.999999999999998], [73.42646528538005, 0.3570405030326642, 0.5001000589064871]], "r_squared_": 0.9390659169191866, "error_": 0.06554634263781295}
{"freq_range": [2.0, 80.0], "freq_res": 1.0, "aperiodic_params_": [0.6374823234561308, 1.0318180238323504], "gaussian_params_": [[7.143055707951556, 0.20117495935863958, 0.8259726336916444], [10.327686056987634, 0.37494508703440393, 0.7304194144988112], [12.984795171358634, 0.2844679854734384, 1.3344950171246674], [15.949147880076982, 0.27018427482906837, 0.689802035789343], [18.32569779474788, 0.2410062888650289, 0.7016068438965921], [20.434061203254956, 0.36555919537893294, 0.3292264427887813], [31.029671459850857, 0.23618264854432056, 0.25000000000000006], [34.96848171561645, 0.16095656160824753, 1.3898932259518042], [51.51952145193483, 0.5688491041598783, 0.28980456972643126], [59.873851263776075, 0.24029796232250328, 0.8778105746204897], [62.34638954756938, 0.4155128718261236, 0.2898765275752708], [63.66379563591457, 0.3754354991318368, 0.3564192478735916], [65.66464111821962, 0.3593853266904992, 0.7214024330529609], [70.10064019396368, 0.18008856976425044, 1.0953261594979185], [73.28090169356635, 0.5023852831756573, 0.2766552510254793], [74.54634256812557, 0.5541056177046932, 0.2904240786609374]], "peak_params_": [[7.143055707951556, 0.19820401731915152, 1.6519452673832888], [10.327686056987634, 0.36287763930897193, 1.4608388289976224], [12.984795171358634, 0.2849434417835566, 2.668990034249335], [15.949147880076982, 0.2925977144315301, 1.379604071578686], [18.32569779474788, 0.21988466890715774, 1.4032136877931842], [20.434061203254956, 0.1672628564710269, 0.6584528855775627], [31.029671459850857, 0.2372567375707294, 0.5000000000000001], [34.96848171561645, 0.1609151821193574, 2.7797864519036084], [51.51952145193483, 0.14391644854135466, 0.5796091394528625], [59.873851263776075, 0.23782940088572713, 1.7556211492409795], [62.34638954756938, 0.21627411859998635, 0.5797530551505417], [63.66379563591457, 0.2656988720574325, 0.7128384957471832], [65.66464111821962, 0.32274021431333455, 1.4428048661059218], [70.10064019396368, 0.179330004542805, 2.190652318995837], [73.28090169356635, 0.3054555876344076, 0.5533105020509586], [74.54634256812557, 0.16359638536784482, 0.5808481573218748]], "r_squared_": 0.9780823021836755, "error_": 0.039713465025078956}
{"freq_range": [2.0, 80.0], "freq_res": 1.0, "aperiodic_params_": [0.937509795336666, 1.2520874326323026], "gaussian_params_": [[7.008240814824833, 0.29189509578573264, 1.036977642306515], [10.56673515353724, 0.24914553179284796, 0.854414001008622], [15.213268847946036, 0.313407779353465, 3.826922470938999], [33.731435214619594, 0.23411015423769888, 1.4120820699238148], [62.074634370689175, 0.16340554686815167, 0.25000004332430115], [64.05892233555625, 0.1756824773561814, 0.9654613613467671], [76.0389492370536, 0.17603706327897198, 0.59598502550879], [77.93626409597502, 0.1812052237735796, 0.25144493994337436]], "peak_params_": [[7.008240814824833, 0.32325315331142396, 2.07395528461303], [10.56673515353724, 0.39022764101838375, 1.708828002017244], [15.213268847946036, 0.31292184132853723, 7.653844941877998], [33.731435214619594, 0.22991587484331788, 2.8241641398476296], [62.074634370689175, 0.17436234308018617, 0.5000000866486023], [64.05892233555625, 0.1753556004627972, 1.9309227226935342], [76.0389492370536, 0.17566153927711547, 1.19197005101758], [77.93626409597502, 0.17626082987138347, 0.5028898798867487]], "r_squared_": 0.9903657297637292, "error_": 0.03962996466289679}
{"freq_range": [2.0, 80.0], "freq_res": 1.0, "aperiodic_params_": [0.9296891289899752, 1.325789647082856], "gaussian_params_": [[7.108909536434902, 0.33118219109668745, 0.9695237271770861], [10.785664853091289, 0.243202861747797, 1.2724485199385926], [15.223719530120812, 0.36726043191114705, 3.4766354263906685], [19.872529265249707, 0.12130318089710528, 0.2500659824401403], [34.21880630486311, 0.28444831593500425, 1.4396476591215124], [51.26584199408194, 0.1466935932953517, 0.46221647773977576], [58.113783188832016, 0.18629001387136612, 0.6609575738482205], [62.076499419381754, 0.18889590570700898, 0.2501465681120372], [64.01780328749746, 0.19372988297695548, 0.5860231791544623]], "peak_params_": [[7.108909536434902, 0.35439599727609716, 1.9390474543541723], [10.785664853091289, 0.4154624981222693, 2.5448970398771853], [15.223719530120812, 0.3675101376452144, 6.953270852781337], [19.872529265249707, 0.24945723690027655, 0.5001319648802806], [34.21880630486311, 0.2811820439414767, 2.8792953182430248], [51.26584199408194, 0.12433126641991232, 0.9244329554795515], [58.113783188832016, 0.1835499860172396, 1.321915147696441], [62.076499419381754, 0.1807821572437247, 0.5002931362240745], [64.01780328749746, 0.19364050361710783, 1.1720463583089247]], "r_squared_": 0.9889517072401837, "error_": 0.04466172328857145}
{"freq_range": [2.0, 80.0], "freq_res": 1.0, "aperiodic_params_": [0.9322069415680132, 1.3241531421569939], "gaussian_params_": [[7.0982033701467575, 0.32377079966963773, 0.9546582642037623], [10.629759777062938, 0.27717140529024265, 1.3353256342397308], [15.746113881301008, 0.3786033369120464, 3.321873919239457], [34.36783453365318, 0.28409408017565374, 1.2929554798392835], [57.6638317519649, 0.18614340962732495, 0.5914897155820628], [62.06835192185366, 0.14966075842426144, 0.25003726430856665], [63.94685630440029, 0.15706605877210553, 0.7974936168403532]], "peak_params_": [[7.0982033701467575, 0.3407807124634035, 1.9093165284075246], [10.629759777062938, 0.4032286839342002, 2.6706512684794617], [15.746113881301008, 0.377584417115653, 6.643747838478914], [34.36783453365318, 0.27282708273957124, 2.585910959678567], [57.6638317519649, 0.15838222762148368, 1.1829794311641255], [62.06835192185366, 0.15215153726008768, 0.5000745286171333], [63.94685630440029, 0.15671770591896816, 1.5949872336807065]], "r_squared_": 0.9910224599717694, "error_": 0.04257498862917504}
{"freq_range": [2.0, 80.0], "freq_res": 1.0, "aperiodic_params_": [0.7959553616415682, 1.2100508634873808], "gaussian_params_": [[7.291293864919321, 0.2793427745844344, 0.8002117591747167], [10.131226625649537, 0.21217793984886857, 1.2221386404532064], [14.824350726576164, 0.33764353237916, 3.3172545679992167], [34.15936239698157, 0.28904640546924304, 0.9484077721915535], [50.40388203896288, 0.5060146724727328, 0.29342831601659014], [51.76977472687288, 0.31650698152844325, 0.2500503422091984], [58.14959037694913, 0.21267357741075227, 0.463791365793034], [69.39714330405167, 0.4465866381901975, 0.27631660141592546], [77.76181680083408, 0.10486151287032387, 3.3944525837930333]], "peak_params_": [[7.291293864919321, 0.29031280516002445, 1.6004235183494333], [10.131226625649537, 0.32913480596923544, 2.444277280906413], [14.824350726576164, 0.3372464630393791, 6.634509135998433], [34.15936239698157, 0.2849945388303494, 1.896815544383107], [50.40388203896288, 0.19623107532596729, 0.5868566320331803], [51.76977472687288, 0.20715918919760723, 0.5001006844183968], [58.14959037694913, 0.20189406027709356, 0.927582731586068], [69.39714330405167, 0.16272407104900655, 0.5526332028318509], [77.76181680083408, 0.10460368229633299, 6.7889051675860665]], "r_squared_": 0.9918813699666128, "error_": 0.03195212267669261}
{"freq_range": [2.0, 80.0], "freq_res": 1.0, "aperiodic_params_": [0.5302477926023793, 0.9721957262281832], "gaussian_params_": [[9.50573096005114, 0.3271398354745228, 1.5416315529575164], [14.707313454767402, 0.20506358068916283, 2.4617865436742283], [22.523794343526234, 0.7350796602986519, 0.2718237189812758], [43.96478180144396, 0.13699556545314004, 1.6413494198684233], [47.068839706595355, 0.16968995175272922, 0.25000004376736923], [50.7513030371043, 0.17322317577426333, 1.3097930596432308], [58.00321106219954, 0.21634263613223662, 0.5688115699278692], [64.44765578489499, 0.6924601748651218, 0.2724300813334206], [77.66159615834718, 0.3344488059665125, 0.2500098088149666]], "peak_params_": [[9.50573096005114, 0.34370608323022517, 3.083263105915033], [14.707313454767402, 0.20419034533975022, 4.923573087348457], [22.523794343526234, 0.1591509823521211, 0.5436474379625515], [43.96478180144396, 0.1369643275713217, 3.2826988397368466], [47.068839706595355, 0.19102658685898688, 0.5000000875347385], [50.7513030371043, 0.17014262384850642, 2.6195861192864616], [58.00321106219954, 0.2163392276255901, 1.1376231398557384], [64.44765578489499, 0.17950545502944149, 0.5448601626668412], [77.66159615834718, 0.13380967126608478, 0.5000196176299332]], "r_squared_": 0.9866423157767293, "error_": 0.03305513590417154}
{"freq_range": [2.0, 80.0], "freq_res": 1.0, "aperiodic_params_": [0.44425262232052837, 1.0859065793605545], "gaussian_params_": [[9.34415553826367, 0.5327155695025548, 1.1873909382962633], [13.479294981335068, 0.242478791479597, 3.51627212783054], [57.67744745011374, 0.7547704904738329, 0.25000070707939587], [61.55356902661167, 0.8369962541169161, 0.27267292469921656], [64.41593668335986, 0.7362294182772292, 0.25756344758161426], [66.77668663615702, 0.18995986528499287, 1.9043203854700352], [72.77242905892585, 0.14574844414290603, 1.1520179875058993], [78.16816674110629, 0.2221952546912626, 2.089984579320115]], "peak_params_": [[9.34415553826367, 0.6185226226585803, 2.3747818765925266], [13.479294981335068, 0.24489286812626432, 7.03254425566108], [57.67744745011374, 0.3283602619306112, 0.5000014141587917], [61.55356902661167, 0.22727682726757203, 0.5453458493984331], [64.41593668335986, 0.26547178140341177, 0.5151268951632285], [66.77668663615702, 0.18865888557302224, 3.8086407709400705], [72.77242905892585, 0.15428839139201211, 2.3040359750117987], [78.16816674110629, 0.22148206530912096, 4.17996915864023]], "r_squared_": 0.9754282649403493, "error_": 0.054385028913459615}
{"freq_range": [2.0, 80.0], "freq_res": 1.0, "aperiodic_params_": [0.20865824703687366, 0.7019991549304624], "gaussian_params_": [[10.29461898947245, 0.5117576832013687, 1.0801013255240681], [14.585442490284521, 0.19704673340811157, 4.64180362544406], [41.93448783600183, 0.2540043661720448, 0.7624964793053309], [45.405728403666835, 0.49937104354957845, 0.2830334758500645], [59.163668637724854, 0.19303110625671582, 1.5276040324582583], [62.019243195813814, 0.28249791764718685, 0.2500000001285911], [66.68320795353158, 0.19804741380356924, 1.9797928690566695], [68.8451553484737, 0.1684194032030714, 0.2624481134605718], [75.04978448023758, 0.18378520258434333, 1.984433132744616], [78.99477348852808, 0.25130166558145345, 0.6920208434550441]], "peak_params_": [[10.29461898947245, 0.6140351899072221, 2.1602026510481362], [14.585442490284521, 0.19630117733940516, 9.28360725088812], [41.93448783600183, 0.25306858194416526, 1.5249929586106619], [45.405728403666835, 0.17881074514308604, 0.566066951700129], [59.163668637724854, 0.1920326256309619, 3.0552080649165165], [62.019243195813814, 0.3281696178621605, 0.5000000002571822], [66.68320795353158, 0.1955776468612127, 3.959585738113339], [68.8451553484737, 0.2431406718609168, 0.5248962269211436], [75.04978448023758, 0.18375654881775194, 3.968866265489232], [78.99477348852808, 0.2766379560752865, 1.3840416869100882]], "r_squared_": 0.9354292812877437, "error_": 0.05399692766627358}
{"freq_range": [2.0, 80.0], "freq_res": 1.0, "aperiodic_params_": [0.3008991576867108, 0.7564731360341674], "gaussian_params_": [[10.41304971942389, 0.3557842899117016, 0.6688189210724488], [12.53961797183604, 0.21091069134645207, 4.59884887218332], [50.485565469181985, 0.36232653435974244, 0.8540732623963345], [58.69741139633261, 0.2777724730022618, 0.9947805720934262], [62.10366336212905, 0.27272461905811335, 0.6523342364310903], [65.48254578602722, 0.3097993879861986, 1.854125509057277], [68.57907102234684, 0.9156514243769858, 0.2878327387465614], [71.07160190751709, 0.2754213919238368, 0.25002433689943265], [73.24114877257036, 0.29535370461914007, 0.6264537665204887], [77.49987784997805, 0.24250496108156025, 3.322401589959947]], "peak_params_": [[10.41304971942389, 0.47509544915635393, 1.3376378421448976], [12.53961797183604, 0.21005715903980549, 9.19769774436664], [50.485565469181985, 0.30825679565890685, 1.708146524792669], [58.69741139633261, 0.2659048942704354, 1.9895611441868524], [62.10366336212905, 0.32351960831743454, 1.3046684728621807], [65.48254578602722, 0.29970221923442375, 3.708251018114554], [68.57907102234684, 0.3747189285605077, 0.5756654774931228], [71.07160190751709, 0.30432397805906997, 0.5000486737988653], [73.24114877257036, 0.37125846596119727, 1.2529075330409774], [77.49987784997805, 0.2397756203499587, 6.644803179919894]], "r_squared_": 0.9327250014319036, "error_": 0.05479336210178759}
{"freq_range": [2.0, 80.0], "freq_res": 1.0, "aperiodic_params_": [0.8912269208975956, 1.1859449529725523], "gaussian_params_": [[12.245629173565556, 0.2562086053666518, 3.0231597492669193], [15.752978131294977, 0.2966186920957851, 0.2539080257038653], [18.96710096144417, 0.1719672633724442, 1.5320886000438259], [34.402360715409465, 0.26112342912796593, 1.0961280070262964], [39.607062765820594, 0.941990345121065, 0.2607230207472819], [49.365091372931204, 0.7159600385426717, 0.2598452264184339], [50.63522470140638, 0.27132511533724785, 0.6410371368820207], [58.0046663879775, 0.23544230503077285, 1.0135271684606828], [62.762677440167245, 0.22742603378112874, 1.125643112297032], [73.44354252665875, 0.9127489729849249, 0.27827460931297815], [75.68538547609708, 0.7197818983169297, 0.2541342500218518], [78.69531487872828, 0.16936222483368635, 1.9930943983470406]], "peak_params_": [[12.245629173565556, 0.255369887400474, 6.046319498533839], [15.752978131294977, 0.32964603180933416, 0.5078160514077306], [18.96710096144417, 0.19304606856291007, 3.0641772000876517], [34.402360715409465, 0.24411058371955008, 2.192256014052593], [39.607062765820594, 0.30256998995091133, 0.5214460414945638], [49.365091372931204, 0.2773003432454264, 0.5196904528368678], [50.63522470140638, 0.2307684800553106, 1.2820742737640414], [58.0046663879775, 0.23546928612624674, 2.0270543369213656], [62.762677440167245, 0.2224284400912604, 2.251286224594064], [73.44354252665875, 0.25911727873439716, 0.5565492186259563], [75.68538547609708, 0.40237595372264456, 0.5082685000437036], [78.69531487872828, 0.1673947984733528, 3.986188796694081]], "r_squared_": 0.9789932589885738, "error_": 0.04449348083947277}
{"freq_range": [2.0, 80.0], "freq_res": 1.0, "aperiodic_params_": [0.9738399895141534, 1.3390401089822577], "gaussian_params_": [[6.932051067454397, 0.24734068738323142, 1.1617151736917497], [11.163388945366028, 0.291118635764183, 1.5148159984819511], [16.437052422076114, 0.3480171623863162, 3.4255981527980173], [34.01216250547844, 0.2264347564187352, 1.310023822218212], [51.15945366613112, 0.18896117742672436, 0.5766459886129897], [58.0918594292824, 0.2652965229380875, 0.5517854412780934], [63.593946306462534, 0.16549645889884476, 1.4196752940512454], [78.54796540086404, 0.17266906951074346, 2.6737115632646637]], "peak_params_": [[6.932051067454397, 0.261409494649506, 2.3234303473834994], [11.163388945366028, 0.38872640111850265, 3.0296319969639023], [16.437052422076114, 0.34697602500420827, 6.8511963055960345], [34.01216250547844, 0.22642567960026116, 2.620047644436424], [51.15945366613112, 0.1818732761668247, 1.1532919772259793], [58.0918594292824, 0.2617159642782394, 1.1035708825561867], [63.593946306462534, 0.15886373980692503, 2.8393505881024907], [78.54796540086404, 0.17021888331101165, 5.3474231265293275]], "r_squared_": 0.9876772582443512, "error_": 0.04574004175449333}
{"freq_range": [2.0, 80.0], "freq_res": 1.0, "aperiodic_params_": [1.074505970856765, 1.408036672728997], "gaussian_params_": [[7.338367786165771, 0.24966055761782224, 1.2262875058536298], [11.195172758300883, 0.18776841040365885, 1.2112833876959193], [15.510047451861189, 0.3775626037880003, 3.6049603624241366], [34.3374357888101, 0.28330658339875586, 1.664076272000473], [51.43594273217105, 0.6197423188091168, 0.25332554006258795], [57.84809978784843, 0.22434918941441068, 0.5652546560493462], [63.56622134857067, 0.9051817078923151, 0.26548054172408486], [69.45207453710213, 0.5167260606517594, 0.2611595891553993]], "peak_params_": [[7.338367786165771, 0.2640771352672964, 2.4525750117072596], [11.195172758300883, 0.36086952072463635, 2.4225667753918385], [15.510047451861189, 0.3741634615693044, 7.209920724848273], [34.3374357888101, 0.27754222954270547, 3.328152544000946], [51.43594273217105, 0.14097613582991508, 0.5066510801251759], [57.84809978784843, 0.21639298555643505, 1.1305093120986924], [63.56622134857067, 0.23823547852034488, 0.5309610834481697], [69.45207453710213, 0.11550156304326253, 0.5223191783107985]], "r_squared_": 0.9928667373949086, "error_": 0.03852856212399918}
{"freq_range": [2.0, 80.0], "freq_res": 1.0, "aperiodic_params_": [1.0683216100438087, 1.4007278796782976], "gaussian_params_": [[7.358984914748241, 0.24497328976134783, 1.2416793851461674], [11.201210940691247, 0.1780837105888585, 1.1411043129399614], [15.370784003570035, 0.38105273314338584, 3.6491482791014227], [34.32638998550457, 0.27306363219876206, 1.6682604390391664], [57.56629041098801, 0.7374820760848672, 0.25986216290702824], [63.56046348153504, 0.8286280791093665, 0.2740291965635637]], "peak_params_": [[7.358984914748241, 0.26258748586923314, 2.4833587702923348], [11.201210940691247, 0.3646411829452908, 2.282208625879923], [15.370784003570035, 0.37978911890984707, 7.298296558202845], [34.32638998550457, 0.26788803548686857, 3.336520878078333], [57.56629041098801, 0.18317896066322792, 0.5197243258140565], [63.56046348153504, 0.2289263572184541, 0.5480583931271275]], "r_squared_": 0.9924767881067573, "error_": 0.040113631351043066}
{"freq_range": [2.0, 80.0], "freq_res": 1.0, "aperiodic_params_": [0.9968798374464299, 1.357627375988623], "gaussian_params_": [[7.188299172855418, 0.24762938282300734, 0.6825817661580277], [10.565788823524993, 0.14695146359652103, 1.6280424222558463], [15.494824396969717, 0.3556799591887275, 4.024675145661702], [34.20191506979338, 0.3115947264359552, 1.5008863598570101], [45.0250041824095, 0.1341786714050192, 0.25000000000008366], [50.435264410347536, 0.46686678846395846, 0.28492130079371963], [62.06952766728446, 0.20131800694514249, 0.2532752185645542], [63.9130612126893, 0.23612331430172864, 0.6461734368581605]], "peak_params_": [[7.188299172855418, 0.29007598916526545, 1.3651635323160554], [10.565788823524993, 0.3324577187261141, 3.2560848445116926], [15.494824396969717, 0.356602002236006, 8.049350291323403], [34.20191506979338, 0.3087968799028964, 3.0017727197140203], [45.0250041824095, 0.13350922911706542, 0.5000000000001673], [50.435264410347536, 0.14535269876496404, 0.5698426015874393], [62.06952766728446, 0.19682358266809086, 0.5065504371291084], [63.9130612126893, 0.23399579307928242, 1.292346873716321]], "r_squared_": 0.9919779326473515, "error_": 0.0403808922515437}
{"freq_range": [2.0, 80.0], "freq_res": 1.0, "aperiodic_params_": [0.5814901035147118, 1.0449742083526568], "gaussian_params_": [[9.269364851136126, 0.27470600352418834, 1.663961589855722], [13.930562359043313, 0.23919655146090976, 3.274787619570042], [18.02209161266071, 0.11132109518628186, 0.25000024164205603], [33.39799817153433, 0.5029402113395756, 0.26478736135003433], [40.83806068023174, 0.17581878648630767, 0.5831631052495954], [45.345323725603336, 0.6078173588064077, 0.2500024961396514], [48.366685503162174, 0.4709978613369791, 0.2622499579034694], [52.68353716576849, 0.12421135365340792, 2.4438979372143264], [58.71641319394088, 0.22691689731964085, 0.9195132768162327], [61.27844553048604, 0.24950523832376767, 0.2962859267509469], [68.15484038565971, 0.2321899034913596, 5.058726943588715], [78.53924202700426, 0.7481729613421769, 0.27853899345528504]], "peak_params_": [[9.269364851136126, 0.34813353063252306, 3.327923179711444], [13.930562359043313, 0.24397058231123014, 6.549575239140084], [18.02209161266071, 0.22140659842305077, 0.5000004832841121], [33.39799817153433, 0.16252594090487127, 0.5295747227000687], [40.83806068023174, 0.1691703795760232, 1.1663262104991907], [45.345323725603336, 0.23503005181203518, 0.5000049922793028], [48.366685503162174, 0.1970916084175578, 0.5244999158069388], [52.68353716576849, 0.12578654948773882, 4.887795874428653], [58.71641319394088, 0.2659308397996478, 1.8390265536324655], [61.27844553048604, 0.25660334717209476, 0.5925718535018938], [68.15484038565971, 0.2320811617798566, 10.11745388717743], [78.53924202700426, 0.21378652972151313, 0.5570779869105701]], "r_squared_": 0.9803872579976712, "error_": 0.0401510796833096}
{"freq_range": [2.0, 80.0], "freq_res": 1.0, "aperiodic_params_": [0.502080336957789, 1.0880287992529123], "gaussian_params_": [[10.353004677316523, 0.5188310447494231, 2.1163944027466037], [52.06453379511235, 0.13342363999186, 0.8239436847528843], [53.54796540086405, 0.13243039424830252, 4.601291511968788], [61.47857783020198, 0.5895262743047093, 0.32069133471985667], [64.41868338094503, 0.8482150569940006, 0.25087945105063164], [67.91789787876982, 0.18552964681608605, 2.214057022306835], [79.99999049834167, 0.14206435710317117, 5.891179825315094]], "peak_params_": [[10.353004677316523, 0.5116638933313388, 4.2327888054932075], [52.06453379511235, 0.2581611626409468, 1.6478873695057685], [53.54796540086405, 0.14025461407855788, 9.202583023937576], [61.47857783020198, 0.2314699634047992, 0.6413826694397133], [64.41868338094503, 0.2630868642375135, 0.5017589021012633], [67.91789787876982, 0.20420157132883476, 4.42811404461367], [79.99999049834167, 0.1420644293140365, 11.782359650630188]], "r_squared_": 0.9596924838014349, "error_": 0.06674153522806595}
{"freq_range": [2.0, 80.0], "freq_res": 1.0, "aperiodic_params_": [-0.00655313677998981, 0.4136771547264224], "gaussian_params_": [[10.57539149417525, 0.41544132107678, 0.9780022191458145], [16.823860583260966, 0.24227143277342275, 4.9522423200080885], [38.69281666795591, 0.29687972816049396, 0.2909172393307682], [41.9873946123562, 0.310375697632838, 0.7578841812686603], [45.42343848490824, 0.47126866495596215, 0.31475645257004387], [48.61819054714469, 0.1498828245038993, 1.8361885941176999], [60.38152950566725, 0.2534277155849944, 0.5226143494976856], [61.6998367302262, 0.46749379583133593, 0.25001468409936634], [68.22734228699022, 0.14561577543488954, 1.0906444346708386], [75.66124234768182, 0.4899998648329946, 0.257744308748459], [78.59620744836874, 0.8170104403148984, 0.2741735226557658]], "peak_params_": [[10.57539149417525, 0.4994118520596772, 1.956004438291629], [16.823860583260966, 0.2421182380878817, 9.904484640016177], [38.69281666795591, 0.17015099962253977, 0.5818344786615364], [41.9873946123562, 0.3105597133807195, 1.5157683625373206], [45.42343848490824, 0.21229002005336572, 0.6295129051400877], [48.61819054714469, 0.14667733279722683, 3.6723771882353997], [60.38152950566725, 0.19414382759190396, 1.0452286989953712], [61.6998367302262, 0.229490057533269, 0.5000293681987327], [68.22734228699022, 0.14248635815805843, 2.181288869341677], [75.66124234768182, 0.20658065267684989, 0.515488617496918], [78.59620744836874, 0.2762031960546033, 0.5483470453115316]], "r_squared_": 0.8357081422909076, "error_": 0.0553377138787243}
{"freq_range": [2.0, 80.0], "freq_res": 1.0, "aperiodic_params_": [0.32207751672291224, 0.8260932270304114], "gaussian_params_": [[10.674142454622398, 0.45794149666711315, 1.179267690573209], [13.53491151724182, 0.7053888886007298, 0.3490429448806116], [15.725361694451584, 0.3243531254218494, 0.7143975041288781], [19.294045026800102, 0.1857264727762846, 1.5734869583223379], [50.48519905450275, 0.29358858300984025, 0.9691293119031532], [58.11516758144958, 0.20804501916517357, 1.066692994088409], [61.60669633849824, 0.2957990058063078, 0.9710427873346258], [64.47929613793198, 0.6068660171350623, 0.3540414111037994], [65.69695392390545, 0.6192986507936434, 0.25001591398255696], [68.7524353384665, 0.28931028529386366, 0.6571579236109006], [73.80240062538283, 0.38126749460347736, 0.8019336170146844], [76.3849915035407, 0.7621279921140246, 0.30247671895559824]], "peak_params_": [[10.674142454622398, 0.4407883906032825, 2.358535381146418], [13.53491151724182, 0.3171147053345868, 0.6980858897612232], [15.725361694451584, 0.32202518682489206, 1.4287950082577563], [19.294045026800102, 0.1825205173576112, 3.1469739166446757], [50.48519905450275, 0.25900617216483957, 1.9382586238063064], [58.11516758144958, 0.20713471989698995, 2.133385988176818], [61.60669633849824, 0.27277850333292464, 1.9420855746692516], [64.47929613793198, 0.2569154431239259, 0.7080828222075988], [65.69695392390545, 0.29719065581303705, 0.5000318279651139], [68.7524353384665, 0.26949254668606093, 1.3143158472218013], [73.80240062538283, 0.3698671302299933, 1.6038672340293687], [76.3849915035407, 0.3479600079115952, 0.6049534379111965]], "r_squared_": 0.9467273025575129, "error_": 0.05096842334315485}
{"freq_range": [2.0, 80.0], "freq_res": 1.0, "aperiodic_params_": [0.6469180275984476, 1.10478328741595], "gaussian_params_": [[6.5285621643105465, 0.15557749613747476, 0.9075861663916358], [11.189431449158674, 0.2789324337376561, 1.7148565045207287], [16.268600792369313, 0.3110897790242122, 2.918420664187443], [20.03082762151926, 0.15655757799316644, 0.25008852369963264], [50.42673718939586, 0.17952322909961724, 1.147571687160639], [57.57686777486372, 0.3403056536379622, 0.4780866696971791], [63.314275335241064, 0.2083635339058991, 2.6876275851926272]], "peak_params_": [[6.5285621643105465, 0.15205908788013597, 1.8151723327832716], [11.189431449158674, 0.3382163954922952, 3.4297130090414574], [16.268600792369313, 0.31522877422067747, 5.836841328374886], [20.03082762151926, 0.29274805429659645, 0.5001770473992653], [50.42673718939586, 0.1675312878086268, 2.295143374321278], [57.57686777486372, 0.2595246211884834, 0.9561733393943582], [63.314275335241064, 0.20694385414571004, 5.3752551703852545]], "r_squared_": 0.96916430747306, "error_": 0.05737472721144151}
{"freq_range": [2.0, 80.0], "freq_res": 1.0, "aperiodic_params_": [1.0136683227376144, 1.3762912483739969], "gaussian_params_": [[6.8172037079249925, 0.1908375701759712, 1.2306625910840086], [11.205896342226815, 0.26681727913997105, 1.4955377776801166], [15.91302550641308, 0.3665640772297268, 3.0162220737847814], [20.06229189430807, 0.14713208712314874, 0.2500515606245213], [33.49019803608635, 0.13326581613176627, 1.1465999226534545], [57.58465197908874, 0.4577155929110237, 0.3449913984673381], [63.57762185814833, 0.17351489962161784, 1.4161544675746593], [76.0295885822639, 0.13195777636083528, 0.25000309280873845], [79.99999999999999, 0.18163359917370314, 3.360767468290462]], "peak_params_": [[6.8172037079249925, 0.19851394836073633, 2.461325182168017], [11.205896342226815, 0.3621700305331058, 2.9910755553602333], [15.91302550641308, 0.3679778481818472, 6.032444147569563], [20.06229189430807, 0.28901058811527713, 0.5001031212490425], [33.49019803608635, 0.12162688558532864, 2.293199845306909], [57.58465197908874, 0.22181648777984853, 0.6899827969346762], [63.57762185814833, 0.16596848573257228, 2.8323089351493187], [76.0295885822639, 0.2204884655774202, 0.5000061856174769], [79.99999999999999, 0.18163359917370325, 6.721534936580924]], "r_squared_": 0.991977667285765, "error_": 0.03658562810109129}
{"freq_range": [2.0, 80.0], "freq_res": 1.0, "aperiodic_params_": [1.1977825345856299, 1.4517549364469724], "gaussian_params_": [[6.883519522176754, 0.13553778450433523, 1.4038159072583154], [11.216833412581893, 0.25004124416845086, 1.2930936670180169], [16.123215468083508, 0.3567917564965992, 3.1390292889932163], [20.00120976358188, 0.10220630411197165, 0.25000111873933134], [33.59733749358754, 0.16687308194854814, 1.8576972658549096], [57.57061707906841, 0.6296259318623739, 0.2819878134799913], [63.55678798423471, 0.15412016758614644, 1.7182499112592176], [78.54796489341638, 0.09912739670814359, 5.1623785568586005]], "peak_params_": [[6.883519522176754, 0.1415247369048236, 2.807631814516631], [11.216833412581893, 0.34257695183333003, 2.5861873340360337], [16.123215468083508, 0.35678420642660746, 6.278058577986433], [20.00120976358188, 0.2686238237384013, 0.5000022374786627], [33.59733749358754, 0.16299877401384344, 3.715394531709819], [57.57061707906841, 0.19837726840466385, 0.5639756269599826], [63.55678798423471, 0.15094675197183105, 3.436499822518435], [78.54796489341638, 0.09874810256733357, 10.324757113717201]], "r_squared_": 0.9928640197261751, "error_": 0.038270053584416035}
{"freq_range": [2.0, 80.0], "freq_res": 1.0, "aperiodic_params_": [1.0257913859082142, 1.3608434954516953], "gaussian_params_": [[7.338715146853356, 0.16962215156868674, 1.6665397471027776], [11.49325845861457, 0.18453606678680076, 1.1926677772367023], [15.660821657659167, 0.4181282949915231, 3.3016795049596674], [34.616063573021854, 0.18801650339226067, 1.5357704515961246], [58.00095256316787, 0.20262427021300844, 0.4291510958072942], [63.495130719425084, 0.14432771486809573, 1.4148540675808274]], "peak_params_": [[7.338715146853356, 0.17970823867012442, 3.3330794942055553], [11.49325845861457, 0.3389736521228361, 2.3853355544734045], [15.660821657659167, 0.4160744220246851, 6.603359009919335], [34.616063573021854, 0.18223204205233412, 3.071540903192249], [58.00095256316787, 0.20270029165341819, 0.8583021916145884], [63.495130719425084, 0.1357552161084885, 2.829708135161655]], "r_squared_": 0.9890907266825377, "error_": 0.042831936704830834}
{"freq_range": [2.0, 80.0], "freq_res": 1.0, "aperiodic_params_": [0.9307628229223239, 1.3776199492258239], "gaussian_params_": [[7.221038867019291, 0.19634336446599016, 1.1930906385885238], [11.356490365187184, 0.25433899944974, 1.882086379019244], [16.43277653711924, 0.41165485099606836, 3.13828229582915], [34.00700836011722, 0.1530656918018428, 1.8178789764802006], [46.92231066653303, 0.18176794830795415, 0.5761356585955254], [50.50981184725157, 0.5144084450466909, 0.28637587585100344], [57.56731601863388, 0.7299334374041745, 0.272782366372641], [63.817628479785, 0.24283870979747912, 1.134099227201491], [66.01304018381792, 0.10582004330043429, 0.2500001450005105], [69.4881603245818, 0.4372706348231894, 0.34077121883588246], [77.54796540086404, 0.1552502101126562, 3.1505434917374497]], "peak_params_": [[7.221038867019291, 0.21495443746076345, 2.3861812771770476], [11.356490365187184, 0.3431180973677441, 3.764172758038488], [16.43277653711924, 0.41988206428979286, 6.2765645916583], [34.00700836011722, 0.15306461892398038, 3.635757952960401], [46.92231066653303, 0.18012286515414488, 1.1522713171910508], [50.50981184725157, 0.11887442881383037, 0.5727517517020069], [57.56731601863388, 0.20746449380141296, 0.545564732745282], [63.817628479785, 0.2397341192670832, 2.268198454402982], [66.01304018381792, 0.14398975095482047, 0.500000290001021], [69.4881603245818, 0.16064670113218438, 0.6815424376717649], [77.54796540086404, 0.15366041405510433, 6.3010869834748995]], "r_squared_": 0.9932503286631034, "error_": 0.033519783789215635}
{"freq_range": [2.0, 80.0], "freq_res": 1.0, "aperiodic_params_": [0.40847071606980223, 0.9821531364015094], "gaussian_params_": [[3.135021148979818, 0.17061248877150134, 0.6867306248045664], [11.870252523116488, 0.3582684678375581, 3.5258108956407024], [18.39131645329843, 0.4930705924339214, 0.3104288186489974], [46.25103776246482, 0.17426707620843765, 1.3249422022489774], [50.50244042050073, 0.17603470029186985, 1.1526463261241806], [53.97422672247677, 0.1815923158987864, 0.2500000079768679], [56.333887696547414, 0.45777646872767547, 0.2503884078055598], [57.526504692265284, 0.7321023532474824, 0.28863565992884416], [61.40588670280232, 1.1879239792012761, 0.26878723958205136], [64.60016501834447, 0.2326541001582817, 1.322914208723822], [69.31657631102998, 0.309550822357638, 0.49059729430343], [74.67173019596476, 0.464901144047107, 0.2500616534707907], [79.99999999999999, 0.1542041027522193, 5.9960333405507]], "peak_params_": [[3.135021148979818, 0.1824759336330465, 1.3734612496091327], [11.870252523116488, 0.3580259680396736, 7.051621791281405], [18.39131645329843, 0.30181540347040325, 0.6208576372979948], [46.25103776246482, 0.17125254725330596, 2.649884404497955], [50.50244042050073, 0.16065879151417883, 2.305292652248361], [53.97422672247677, 0.1824055394003843, 0.5000000159537358], [56.333887696547414, 0.18821479447190614, 0.5007768156111196], [57.526504692265284, 0.19082084921402553, 0.5772713198576883], [61.40588670280232, 0.3866161568258766, 0.5375744791641027], [64.60016501834447, 0.22901418548857588, 2.645828417447644], [69.31657631102998, 0.28095149974199995, 0.98119458860686], [74.67173019596476, 0.30531955496553453, 0.5001233069415814], [79.99999999999999, 0.15420410275221919, 11.9920666811014]], "r_squared_": 0.9827138512091536, "error_": 0.0357665158884772}
{"freq_range": [2.0, 80.0], "freq_res": 1.0, "aperiodic_params_": [0.2007472517374237, 0.6216145049950627], "gaussian_params_": [[9.993352937601518, 0.31519447369801457, 1.0654143316167985], [13.058252580279557, 0.23463366428726312, 1.1048493192673996], [45.66787082611095, 0.08293453253173945, 5.999999984400805], [50.555031974750094, 0.5150719295045947, 0.27153310071897313], [64.2576150172843, 0.2437437865530985, 0.2501664797228997], [65.64952355158515, 0.22308868392953995, 0.7096343712221003], [73.03491352304638, 0.1521216440370903, 0.2500005560049783]], "peak_params_": [[9.993352937601518, 0.3202771261519695, 2.130828663233597], [13.058252580279557, 0.2401858228136366, 2.209698638534799], [45.66787082611095, 0.08280756744524975, 11.99999996880161], [50.555031974750094, 0.19038227914056194, 0.5430662014379463], [64.2576150172843, 0.15918587307031684, 0.5003329594457994], [65.64952355158515, 0.19774061699972556, 1.4192687424442005], [73.03491352304638, 0.15064801183750187, 0.5000011120099566]], "r_squared_": 0.9267232050460745, "error_": 0.04537862692266805}
{"freq_range": [2.0, 80.0], "freq_res": 1.0, "aperiodic_params_": [0.2124673425216221, 0.6580947152660865], "gaussian_params_": [[11.005779062489466, 0.3731575343537641, 0.5075353918796979], [13.839607332808214, 0.35229646288828503, 1.0604628497620976], [42.52371865452435, 1.4361723375668154, 0.29158201099968034], [50.14894657578769, 0.3787592187890856, 0.9892639764447002], [57.03562310805564, 0.33500752118844007, 1.333766737070414], [63.41807828176809, 0.8799906075823047, 0.25000104919170496], [65.55636614519636, 1.3340795809881387, 0.2756144610595311], [68.97434724265922, 0.32104888963351563, 0.8131789079565632], [73.48027184932921, 1.204680439114273, 0.27652103957175234], [76.44175530434273, 1.297121130846276, 0.2671088170217317], [79.4904592304287, 1.3642969913556078, 0.26936047950293246]], "peak_params_": [[11.005779062489466, 0.38290434990430183, 1.0150707837593957], [13.839607332808214, 0.34828988198385574, 2.120925699524195], [42.52371865452435, 0.37829553780855807, 0.5831640219993607], [50.14894657578769, 0.3744906724933681, 1.9785279528894004], [57.03562310805564, 0.33488805337593264, 2.667533474140828], [63.41807828176809, 0.2173866219801881, 0.5000020983834099], [65.55636614519636, 0.36564234947590823, 0.5512289221190622], [68.97434724265922, 0.3208891807670682, 1.6263578159131264], [73.48027184932921, 0.2665800968102384, 0.5530420791435047], [76.44175530434273, 0.33040158493818983, 0.5342176340434635], [79.4904592304287, 0.26000123663132957, 0.5387209590058649]], "r_squared_": 0.8934233483574117, "error_": 0.059473838650775955}
{"freq_range": [2.0, 80.0], "freq_res": 1.0, "aperiodic_params_": [0.4819932570386713, 1.0031331855738779], "gaussian_params_": [[10.554342224824325, 0.890345829593092, 0.25001102925571084], [13.517252174762884, 1.1067302363029499, 0.2599078409433747], [16.193072765714412, 0.2660640102851186, 4.1659956757059105], [42.66544741540428, 0.29030861309234335, 0.6952083800898601], [50.37239925040386, 0.23574643326783606, 1.5450771011728743], [57.381097557556856, 0.39104705249288557, 0.8503222935191729], [63.507908795160525, 1.2644361470987793, 0.2588946967494919], [65.55923192688822, 1.7301813842021891, 0.25165295026331175], [68.68213639874708, 0.34676036762057444, 0.6198549558937101], [73.67470379117242, 0.32489427091759476, 1.0967841051618874], [76.43936917705356, 1.4332728524186706, 0.27088998395914243], [79.47842179214783, 0.44728462257955104, 0.6300869728820484]], "peak_params_": [[10.554342224824325, 0.3041325308175986, 0.5000220585114217], [13.517252174762884, 0.4288411947295425, 0.5198156818867494], [16.193072765714412, 0.26577843056489675, 8.331991351411821], [42.66544741540428, 0.2585697594218159, 1.3904167601797202], [50.37239925040386, 0.2289974179598201, 3.0901542023457487], [57.381097557556856, 0.35370475149034664, 1.7006445870383458], [63.507908795160525, 0.20767566154286454, 0.5177893934989838], [65.55923192688822, 0.37323179899457126, 0.5033059005266235], [68.68213639874708, 0.30407419925116574, 1.2397099117874202], [73.67470379117242, 0.31091411661668045, 2.193568210323775], [76.43936917705356, 0.41899219616485683, 0.5417799679182849], [79.47842179214783, 0.335270665964972, 1.2601739457640968]], "r_squared_": 0.9767101618080656, "error_": 0.04287759678763202}
{"freq_range": [2.0, 80.0], "freq_res": 1.0, "aperiodic_params_": [0.6746405392823434, 1.1769364000859834], "gaussian_params_": [[15.089547995045335, 0.41285776767713844, 4.763085801067361], [50.58740841399172, 0.2735036452989748, 0.7028979804697635], [57.61152810315736, 0.342679466614787, 0.7329587174375055], [63.340977166244066, 0.19934741414626284, 1.5778487742311875], [65.96904104340175, 0.22335772255067893, 0.25000008225773], [69.38173990962619, 0.19832160918860497, 0.9702401714525486], [73.52317964841544, 0.7889716621089319, 0.3205272875560067], [76.11924988643604, 0.3308035500854028, 0.68837682395819]], "peak_params_": [[15.089547995045335, 0.41278481066959466, 9.526171602134722], [50.58740841399172, 0.23022069847365656, 1.405795960939527], [57.61152810315736, 0.2984243014059682, 1.465917434875011], [63.340977166244066, 0.19474654493668075, 3.155697548462375], [65.96904104340175, 0.27029390491317606, 0.50000016451546], [69.38173990962619, 0.18387125444639008, 1.9404803429050972], [73.52317964841544, 0.2638217644932528, 0.6410545751120134], [76.11924988643604, 0.325876925938027, 1.37675364791638]], "r_squared_": 0.9737057258755148, "error_": 0.05582985493885034}
{"freq_range": [2.0, 80.0], "freq_res": 1.0, "aperiodic_params_": [0.9461507773373221, 1.3671991374523034], "gaussian_params_": [[6.702196231277492, 0.16398761031486125, 1.2382091501176822], [11.492075194031147, 0.18923862847913672, 1.6788720578197571], [16.041361225674205, 0.41322432399553116, 3.6861322122904996], [20.034262533629356, 0.10794319358396415, 0.2500099701292932], [57.61249139623555, 0.32413926301943513, 0.4902320755410141], [63.58523868356814, 0.7512967487234459, 0.2977927721346207], [78.54796540086404, 0.17687628520776408, 5.99999999999998]], "peak_params_": [[6.702196231277492, 0.18499681166827203, 2.4764183002353644], [11.492075194031147, 0.34386601875608114, 3.3577441156395142], [16.041361225674205, 0.4183439580074214, 7.372264424580999], [20.034262533629356, 0.339072423235251, 0.5000199402585864], [57.61249139623555, 0.23766818440120163, 0.9804641510820282], [63.58523868356814, 0.2941806549283441, 0.5955855442692414], [78.54796540086404, 0.1763750237060142, 11.99999999999996]], "r_squared_": 0.9877802819996906, "error_": 0.045819220155092134}
{"freq_range": [2.0, 80.0], "freq_res": 1.0, "aperiodic_params_": [1.0733057961787025, 1.425263241018921], "gaussian_params_": [[6.110741843038456, 0.10102470909980141, 1.0109823434174263], [14.7542040883955, 0.4394959586627296, 4.3083911660454675], [57.54819714280104, 0.9222710698529287, 0.26234003117858], [63.5550397328542, 0.7127267074804617, 0.31054351469955255], [78.54505703804202, 0.12646594385541085, 5.999999999999999]], "peak_params_": [[6.110741843038456, 0.15619552078965684, 2.0219646868348526], [14.7542040883955, 0.4387813132451648, 8.616782332090935], [57.54819714280104, 0.20967612223548615, 0.52468006235716], [63.5550397328542, 0.2620323315133457, 0.6210870293991051], [78.54505703804202, 0.12610292354217245, 11.999999999999998]], "r_squared_": 0.9896727320815791, "error_": 0.045977767073279684}
{"freq_range": [2.0, 80.0], "freq_res": 1.0, "aperiodic_params_": [0.9933461106768797, 1.4047347388569562], "gaussian_params_": [[14.771145015925864, 0.4584639951589647, 4.544862255827466], [57.55840403731848, 0.8278342593465225, 0.2651637890845812], [63.91905589128604, 0.2900339249535381, 0.8245676516393994], [69.57756547253307, 0.4350443956391244, 0.30363894216532783], [79.99999999999999, 0.14901953642955099, 5.999999999300893]], "peak_params_": [[14.771145015925864, 0.45788312472826775, 9.089724511654932], [57.55840403731848, 0.2070479236122551, 0.5303275781691624], [63.91905589128604, 0.2928966524727319, 1.6491353032787988], [69.57756547253307, 0.20244384371374124, 0.6072778843306557], [79.99999999999999, 0.149019536429551, 11.999999998601785]], "r_squared_": 0.9904865814791667, "error_": 0.04325729449021605}
{"freq_range": [2.0, 80.0], "freq_res": 1.0, "aperiodic_params_": [0.8865015372705677, 1.3580894133207884], "gaussian_params_": [[15.0049198538425, 0.4509416820649194, 4.620885527452368], [46.91091676949843, 0.1465884109905367, 0.74708557802641], [50.48514024474429, 0.8558134166417897, 0.26354325629181413], [57.56196791392455, 0.8177661934107405, 0.25737660728842676], [63.70959435242139, 0.24467795515706042, 1.1403627282260336], [66.40949784729652, 0.5485941452679094, 0.2500067444894619], [69.88689309273113, 0.20864519526774572, 0.6842014379879469], [79.99999999999999, 0.17345819406926555, 4.908922831674662]], "peak_params_": [[15.0049198538425, 0.45094142647469226, 9.241771054904737], [46.91091676949843, 0.14554997913364698, 1.49417115605282], [50.48514024474429, 0.15725869577008633, 0.5270865125836283], [57.56196791392455, 0.19216795527222752, 0.5147532145768535], [63.70959435242139, 0.23772698835013828, 2.280725456452067], [66.40949784729652, 0.17896759604248857, 0.5000134889789238], [69.88689309273113, 0.2275946261536541, 1.3684028759758937], [79.99999999999999, 0.17345819406926566, 9.817845663349324]], "r_squared_": 0.9908847046085129, "error_": 0.038933734793064174}
{"freq_range": [2.0, 80.0], "freq_res": 1.0, "aperiodic_params_": [0.6847186591053872, 1.1506994016866468], "gaussian_params_": [[11.547965400864056, 0.20614373433235994, 2.385969301469652], [13.494471382750172, 0.5120986715292066, 0.29553409355643045], [15.607323705295274, 0.48797496823581843, 0.26404009565465003], [18.193570941456294, 0.27190399810828947, 1.2161583701368974], [47.00830712039672, 0.1759262186985495, 1.0151526768637509], [50.373111759277705, 0.25816399846602284, 0.6791943933740305], [56.34266251123967, 0.3658715969741611, 0.2586476981565939], [57.70802295077836, 0.283263685964802, 0.49773190186717287], [64.01257140978407, 0.24533608508005073, 1.1295745224262224], [65.92588271920759, 0.11671470578033602, 0.25000000013149043], [68.47920636740773, 0.6750269712724113, 0.2766089630947285], [70.42209574945292, 0.7396080280336006, 0.2945037110719323], [77.54796540086404, 0.134049207936006, 4.103189721663246]], "peak_params_": [[11.547965400864056, 0.20247921111021067, 4.771938602939304], [13.494471382750172, 0.29764487786667737, 0.5910681871128609], [15.607323705295274, 0.25108917693045596, 0.5280801913093001], [18.193570941456294, 0.27380616605904595, 2.432316740273795], [47.00830712039672, 0.17592146625096738, 2.0303053537275018], [50.373111759277705, 0.22429390542548444, 1.358388786748061], [56.34266251123967, 0.15291072291412222, 0.5172953963131878], [57.70802295077836, 0.23848989290048506, 0.9954638037343457], [64.01257140978407, 0.2458962410337584, 2.2591490448524447], [65.92588271920759, 0.1664361260092071, 0.5000000002629809], [68.47920636740773, 0.1599448733700355, 0.553217926189457], [70.42209574945292, 0.28950048087127866, 0.5890074221438646], [77.54796540086404, 0.13323821446621942, 8.206379443326492]], "r_squared_": 0.9874968408927848, "error_": 0.034196093277919455}
{"freq_range": [2.0, 80.0], "freq_res": 1.0, "aperiodic_params_": [0.08811497442460389, 0.6617744639603306], "gaussian_params_": [[11.04171055972776, 0.16442813581759597, 0.2500003354318384], [12.603482007190873, 0.23994753980223676, 2.3113210501888397], [46.7926535173862, 0.27324836581864753, 0.7265777513981645], [50.406501271533465, 0.7702171153387237, 0.28718257452278767], [55.977210025386846, 0.12276684270891215, 1.9276648017000189], [65.46925003749917, 0.2081452929252818, 2.112147975171847], [70.40542056744918, 0.7329564704589066, 0.28247166725354644]], "peak_params_": [[11.04171055972776, 0.3507830890521423, 0.5000006708636768], [12.603482007190873, 0.23644244280054477, 4.622642100377679], [46.7926535173862, 0.26234779595208724, 1.453155502796329], [50.406501271533465, 0.2838586778429396, 0.5743651490455753], [55.977210025386846, 0.12276725497061847, 3.8553296034000377], [65.46925003749917, 0.2030734611982501, 4.224295950343694], [70.40542056744918, 0.28252758128321875, 0.5649433345070929]], "r_squared_": 0.9102566217196694, "error_": 0.05864284259175145}
{"freq_range": [2.0, 80.0], "freq_res": 1.0, "aperiodic_params_": [0.2445304026856729, 0.6592383428443104], "gaussian_params_": [[13.672501643013588, 0.4643317926138275, 0.716801091445276], [16.518101468979086, 0.28461923941974876, 1.0029911535658733], [19.561407212811087, 0.7050940550660701, 0.3034547975771751], [37.9910196742883, 0.20712372978281754, 0.25000000000242883], [42.61110314569359, 0.6925066444799567, 0.46939189989214386], [46.55651262009364, 0.2861673660077701, 0.9910627254308518], [50.022049217426236, 0.27044725457749264, 0.6304688561705245], [57.420261977857656, 0.6268638140360866, 0.5864093327691646], [65.69430466243898, 0.6134872735857015, 0.5180643274533837], [70.5182904851215, 0.7971244296419061, 0.29664246686816614], [75.59096359601855, 0.2976720324469557, 1.34516083180554]], "peak_params_": [[13.672501643013588, 0.4304890418949937, 1.433602182890552], [16.518101468979086, 0.2536027364429618, 2.0059823071317466], [19.561407212811087, 0.24878950499841357, 0.6069095951543502], [37.9910196742883, 0.2069901428640314, 0.5000000000048577], [42.61110314569359, 0.4917802883714134, 0.9387837997842877], [46.55651262009364, 0.2589060812046815, 1.9821254508617037], [50.022049217426236, 0.2709660230150519, 1.260937712341049], [57.420261977857656, 0.4848896641492329, 1.1728186655383293], [65.69430466243898, 0.5154637299590175, 1.0361286549067674], [70.5182904851215, 0.21414357566201625, 0.5932849337363323], [75.59096359601855, 0.2842232491709533, 2.69032166361108]], "r_squared_": 0.9030607957253968, "error_": 0.06088817604018974}
{"freq_range": [2.0, 80.0], "freq_res": 1.0, "aperiodic_params_": [0.7116299210807906, 1.1822619506981145], "gaussian_params_": [[8.84647522036543, 0.22872362616191044, 0.562276145391687], [13.356208743834825, 0.4783046445998144, 1.2200534653412285], [16.912977478186672, 0.4352287326557523, 1.3549844731300826], [20.03670677039044, 0.3372875106657416, 0.7928676217694763], [22.589283472452397, 0.2811848920255827, 0.5608790730288737], [42.88092180566022, 0.2516579037127146, 0.7205311404891238], [50.35690886732147, 0.22891988423725285, 0.6448650556974062], [57.28293885716157, 0.414709918477355, 0.8157453132685976], [63.50545313656129, 1.240027530196694, 0.2826612368477037], [65.80632822269207, 0.40464743426868677, 0.48675563724784227], [69.29538753397217, 0.19574864069134215, 1.249967178660495], [73.49908435677331, 0.5969619704840214, 0.25925928102982415], [78.54796540086173, 0.2421733827657741, 4.330190815365465]], "peak_params_": [[8.84647522036543, 0.22117017620358093, 1.124552290783374], [13.356208743834825, 0.4650738054296979, 2.440106930682457], [16.912977478186672, 0.44008338671432456, 2.7099689462601653], [20.03670677039044, 0.36941260927614583, 1.5857352435389527], [22.589283472452397, 0.21538698083413, 1.1217581460577475], [42.88092180566022, 0.24824457963576407, 1.4410622809782476], [50.35690886732147, 0.19641141504349569, 1.2897301113948123], [57.28293885716157, 0.39050096781194166, 1.6314906265371951], [63.50545313656129, 0.26965372620387673, 0.5653224736954074], [65.80632822269207, 0.38354819389093775, 0.9735112744956845], [69.29538753397217, 0.2116581633736352, 2.49993435732099], [73.49908435677331, 0.202594875484289, 0.5185185620596483], [78.54796540086173, 0.24085742167713287, 8.66038163073093]], "r_squared_": 0.979204107357935, "error_": 0.04675714300648268}
{"freq_range": [2.0, 80.0], "freq_res": 1.0, "aperiodic_params_": [0.7900883542169792, 1.2844043096903173], "gaussian_params_": [[15.804682639856797, 0.511804038901568, 4.491427108804139], [57.51859425917523, 1.4840258377133912, 0.26860184290931394], [63.52825197262505, 1.2871025418619437, 0.2714969989007941], [65.64345208501227, 0.3530646399381914, 0.3534688427545826], [77.51169549751526, 0.19909386303240667, 5.999999999999999]], "peak_params_": [[15.804682639856797, 0.511320332999821, 8.982854217608278], [57.51859425917523, 0.2988015648936, 0.5372036858186279], [63.52825197262505, 0.30022689446823536, 0.5429939978015882], [65.64345208501227, 0.24388155372698073, 0.7069376855091652], [77.51169549751526, 0.1984356175158024, 11.999999999999998]], "r_squared_": 0.9792196752220025, "error_": 0.05795358026878028}
{"freq_range": [2.0, 80.0], "freq_res": 1.0, "aperiodic_params_": [0.9893211189285757, 1.4142018417873778], "gaussian_params_": [[15.269800276767466, 0.5032073315754148, 4.5471075399880725], [51.21400264384791, 0.14586699088236926, 0.5467753007949325], [57.55668598658868, 0.8941321599831441, 0.26476082704151266], [63.76611225912185, 0.316584088432075, 0.7544174036268774], [66.43070298187216, 0.5010439784182736, 0.2852665185893443], [70.34953849415079, 0.16842578427419364, 0.5497882290418366], [78.54796540086404, 0.18181478020770278, 3.952802450923213]], "peak_params_": [[15.269800276767466, 0.5023223196782178, 9.094215079976145], [51.21400264384791, 0.13511171217016726, 1.093550601589865], [57.55668598658868, 0.22009441592422196, 0.5295216540830253], [63.76611225912185, 0.3019377266836494, 1.5088348072537547], [66.43070298187216, 0.1654056068403036, 0.5705330371786886], [70.34953849415079, 0.15515090886703242, 1.099576458083673], [78.54796540086404, 0.18062979426409886, 7.905604901846426]], "r_squared_": 0.9897139388871518, "error_": 0.043330436302091185}
{"freq_range": [2.0, 80.0], "freq_res": 1.0, "aperiodic_params_": [0.9678236563507017, 1.416291643078002], "gaussian_params_": [[7.6980937156441245, 0.13105482051353734, 1.7116247436704874], [12.107153406961572, 0.2711035615589642, 1.1822157113173815], [16.81803583444782, 0.4789809096579305, 3.4749067765137873], [50.7107873930499, 0.1877134634591703, 0.6689248064805069], [56.32636334744787, 0.358211220611002, 0.2500280858286936], [57.57545682772905, 0.6425355624689644, 0.30231681473848854], [63.850953511113744, 0.2535237847432108, 1.7246640008321863], [70.05530240614146, 0.2703620571976921, 0.7403295806344362], [74.55392471323395, 0.07271293949901561, 0.8349708242453893], [78.54796540086404, 0.18776623956772834, 3.363139043174735]], "peak_params_": [[7.6980937156441245, 0.14882271516556614, 3.423249487340975], [12.107153406961572, 0.4587353424367638, 2.364431422634763], [16.81803583444782, 0.47837641797914654, 6.949813553027575], [50.7107873930499, 0.1709637406051674, 1.3378496129610138], [56.32636334744787, 0.15282107315249527, 0.5000561716573872], [57.57545682772905, 0.24050473152871166, 0.6046336294769771], [63.850953511113744, 0.25259505992564324, 3.4493280016643726], [70.05530240614146, 0.27747643520516396, 1.4806591612688724], [74.55392471323395, 0.1706761548844553, 1.6699416484907785], [78.54796540086404, 0.18607786728455422, 6.72627808634947]], "r_squared_": 0.9909681353398898, "error_": 0.041072963288672756}
{"freq_range": [2.0, 80.0], "freq_res": 1.0, "aperiodic_params_": [0.8749697503117433, 1.359620464806877], "gaussian_params_": [[8.074277891856543, 0.11684719206363127, 1.5640217667422616], [12.17321460857913, 0.27144324037880335, 1.181562187219349], [16.99338199613157, 0.4854607966764295, 3.3272557886838188], [50.5144993713579, 0.7059410075794762, 0.29599158737964876], [56.262898963524684, 0.37631032406736437, 0.25000928074068846], [57.561328476927265, 0.6566310549445942, 0.30679186409141657], [63.71617613203246, 0.32091732044767457, 0.947148070737762], [65.9999044381782, 0.17306156559668134, 0.25490021076479985], [70.18607893521924, 0.2708892211347739, 0.5840035195326984], [79.99999933014558, 0.195365030358371, 5.988416040908097]], "peak_params_": [[8.074277891856543, 0.12982669731032143, 3.128043533484523], [12.17321460857913, 0.43097733707897434, 2.363124374438698], [16.99338199613157, 0.48552440251384077, 6.6545115773676375], [50.5144993713579, 0.18388818130019446, 0.5919831747592975], [56.262898963524684, 0.21655161454951766, 0.5000185614813769], [57.561328476927265, 0.2364725610023577, 0.6135837281828331], [63.71617613203246, 0.3123316714177571, 1.894296141475524], [65.9999044381782, 0.20330099186112727, 0.5098004215295997], [70.18607893521924, 0.3059350810460495, 1.1680070390653967], [79.99999933014558, 0.19536503035836983, 11.976832081816195]], "r_squared_": 0.9907855472563653, "error_": 0.03899870399956173}
{"freq_range": [2.0, 80.0], "freq_res": 1.0, "aperiodic_params_": [0.3518192652882568, 0.8981783983692072], "gaussian_params_": [[13.867994677097236, 0.32502432129189973, 3.3589227565279614], [17.61828063856481, 0.652629130940577, 0.25000000000000006], [46.81225984994193, 0.23975019452539315, 0.8535993386549884], [50.38788922356733, 0.34661408062998733, 0.6300420094829772], [56.31452187834422, 0.2947472033376527, 0.3795954669246667], [57.55836956821031, 1.277459118719638, 0.25000173317421426], [63.19299103793807, 0.20377507177559162, 1.2845345966482387], [65.6093513217343, 0.9463452232633823, 0.2718232175656392], [67.6961112902755, 0.6516252384590303, 0.25000000000000006], [70.28632256620698, 0.3780905150455604, 0.7177713594962343]], "peak_params_": [[13.867994677097236, 0.3247734210734893, 6.717845513055923], [17.61828063856481, 0.3559458802666179, 0.5000000000000001], [46.81225984994193, 0.23402118108689252, 1.7071986773099768], [50.38788922356733, 0.2869989564098867, 1.2600840189659543], [56.31452187834422, 0.20910846594235877, 0.7591909338493334], [57.55836956821031, 0.2684386597377164, 0.5000034663484285], [63.19299103793807, 0.20148812929675408, 2.5690691932964773], [65.6093513217343, 0.3556607729296921, 0.5436464351312784], [67.6961112902755, 0.31383030520712196, 0.5000000000000001], [70.28632256620698, 0.34917439659266547, 1.4355427189924685]], "r_squared_": 0.9525286087879492, "error_": 0.05892126302902232}
{"freq_range": [2.0, 80.0], "freq_res": 1.0, "aperiodic_params_": [0.3254568281237451, 0.8796208767684475], "gaussian_params_": [[13.790733864694982, 0.32987207977123906, 3.4170044863519347], [18.00213382848985, 0.20980739516093438, 0.4224989061493005], [46.770965701513, 0.22771401301041594, 0.8682746579018388], [50.47287556118221, 0.40111815095024267, 0.5123798474178526], [56.265395168075294, 0.22471117036948, 0.6371165507397168], [57.639825634813995, 0.6148614907557933, 0.26986268551201464], [63.344952786495654, 0.21687576002275488, 1.0996041001419996], [65.62487841405824, 0.7963576611198769, 0.28747139653083226], [67.99044040830842, 0.3130271476481854, 0.2500001733200238], [70.27352497826136, 0.40666842010782095, 0.5905818615075742]], "peak_params_": [[13.790733864694982, 0.3292540417199991, 6.834008972703869], [18.00213382848985, 0.3642696707826658, 0.844997812298601], [46.770965701513, 0.21992802261200506, 1.7365493158036776], [50.47287556118221, 0.2622362448570317, 1.0247596948357052], [56.265395168075294, 0.20603708500775508, 1.2742331014794337], [57.639825634813995, 0.2578535698698229, 0.5397253710240293], [63.344952786495654, 0.20646250431286672, 2.199208200283999], [65.62487841405824, 0.35166011717698653, 0.5749427930616645], [67.99044040830842, 0.3130723584796249, 0.5000003466400476], [70.27352497826136, 0.36531009467579145, 1.1811637230151484]], "r_squared_": 0.9528852997396705, "error_": 0.0559773203030894}
{"freq_range": [2.0, 80.0], "freq_res": 1.0, "aperiodic_params_": [-0.026914318083326658, 0.4233924215498691], "gaussian_params_": [[14.817531604600068, 0.19339308261416016, 3.0798854452835345], [34.41151478872912, 0.8977681740883472, 0.263027448451547], [37.58415612244516, 1.2064501045802924, 0.25003431329138154], [43.32657967585904, 0.42956974645376, 0.5347746621385779], [46.518470421780506, 0.2455493495333062, 0.5221774468676925], [49.73919365677528, 0.2050939664742093, 1.440566516519488], [57.76836244923643, 0.23734115973697584, 0.6514135148273534], [65.77182900066686, 0.33125362443198814, 0.5866386358391329], [76.0955640812395, 0.17018539768171695, 3.1392956113241723]], "peak_params_": [[14.817531604600068, 0.19305397613913727, 6.159770890567069], [34.41151478872912, 0.26402191577768214, 0.526054896903094], [37.58415612244516, 0.3025988984536834, 0.5000686265827631], [43.32657967585904, 0.3564968071547173, 1.0695493242771559], [46.518470421780506, 0.1941413831051384, 1.044354893735385], [49.73919365677528, 0.20176017303238858, 2.881133033038976], [57.76836244923643, 0.22280029076918761, 1.3028270296547069], [65.77182900066686, 0.30808842908805134, 1.1732772716782658], [76.0955640812395, 0.1701065631228128, 6.278591222648345]], "r_squared_": 0.8043580582755143, "error_": 0.0499566979584295}
{"freq_range": [2.0, 80.0], "freq_res": 1.0, "aperiodic_params_": [0.6349767419168583, 1.1390968066815035], "gaussian_params_": [[8.601708468972136, 0.6105037131866046, 0.2752461275950566], [14.898938218558795, 0.5517798580206245, 3.315974497264022], [21.42849753133292, 0.15086791278694658, 2.039496793014335], [37.63149968891047, 0.5511859047285995, 0.25464020074807986], [43.38978914763831, 0.2402955657402973, 0.756706075337232], [52.61870466116075, 0.5994939469876595, 0.28009571566673264], [57.340253814563276, 0.3028266882504036, 0.8610766603442526], [63.493054966942466, 1.1642072999441002, 0.2889018774754789], [66.05590697626026, 0.2942049218103689, 0.5342953076316698], [68.7892636418641, 0.19762060055682928, 1.6347017552106355], [76.33344837762787, 0.27291548392889076, 4.066589345194257]], "peak_params_": [[8.601708468972136, 0.32767806002097394, 0.5504922551901132], [14.898938218558795, 0.5525737134109489, 6.631948994528044], [21.42849753133292, 0.2491227362462647, 4.07899358602867], [37.63149968891047, 0.19343922956310444, 0.5092804014961597], [43.38978914763831, 0.21043966409279147, 1.513412150674464], [52.61870466116075, 0.23734527426839325, 0.5601914313334653], [57.340253814563276, 0.2800872672528385, 1.7221533206885051], [63.493054966942466, 0.2730022883617933, 0.5778037549509578], [66.05590697626026, 0.3495032606261861, 1.0685906152633395], [68.7892636418641, 0.24967082779729988, 3.269403510421271], [76.33344837762787, 0.2720113171991283, 8.133178690388513]], "r_squared_": 0.9734056707726508, "error_": 0.05319062693145512}
{"freq_range": [2.0, 80.0], "freq_res": 1.0, "aperiodic_params_": [0.8568986955631359, 1.3364956832381598], "gaussian_params_": [[8.91381785519216, 0.1956914921951516, 0.6021372698562005], [12.72643046195808, 0.2867510889379048, 0.8118460476479293], [16.52268594410838, 0.5523557748686212, 4.217183972309471], [57.3554570596011, 0.23328078345117095, 0.9324487902058501], [63.53090575566028, 0.7837535417939399, 0.3122381887105601], [76.23377120795773, 0.18501768362572005, 5.999999999999999]], "peak_params_": [[8.91381785519216, 0.30623160827756946, 1.204274539712401], [12.72643046195808, 0.6606000582672744, 1.6236920952958587], [16.52268594410838, 0.5488294024526553, 8.434367944618941], [57.3554570596011, 0.21801770983040636, 1.8648975804117003], [63.53090575566028, 0.27669233257801396, 0.6244763774211202], [76.23377120795773, 0.18487730597255103, 11.999999999999998]], "r_squared_": 0.9852141620951036, "error_": 0.05203251577319826}
{"freq_range": [2.0, 80.0], "freq_res": 1.0, "aperiodic_params_": [0.96604084263548, 1.4025442504153023], "gaussian_params_": [[12.264685799452078, 0.4251659404810312, 2.7181035182772035], [17.864901984753157, 0.46806573077530683, 3.5617690206612296], [57.33456969249714, 0.17673495478043078, 1.020458706553868], [63.65326029930795, 0.240877912931103, 0.7244299067081655], [72.54796540086403, 0.14570269962015064, 5.999999991005703]], "peak_params_": [[12.264685799452078, 0.5438080149402273, 5.436207036554407], [17.864901984753157, 0.5136233938321013, 7.123538041322459], [57.33456969249714, 0.17256052240022157, 2.040917413107736], [63.65326029930795, 0.2676196880030979, 1.448859813416331], [72.54796540086403, 0.14528978302054285, 11.999999982011406]], "r_squared_": 0.9853427821812751, "error_": 0.056148127969002974}
{"freq_range": [2.0, 80.0], "freq_res": 1.0, "aperiodic_params_": [0.7866190938309914, 1.2661695193422229], "gaussian_params_": [[12.316575913012215, 0.2716214165777043, 0.8052748138401423], [15.84951919528696, 0.5282992108681444, 4.155805280441879], [50.6614514102033, 0.24247659093309185, 0.53000075487664], [56.324855682802166, 0.5675126991099338, 0.25002363480000706], [57.63420703322583, 0.47504953699666913, 0.293156201466115], [63.608191324693436, 0.2786557019592098, 1.013788734667577], [65.9305942497193, 0.18141894359247035, 0.2500781181535559], [70.26151406037454, 0.2973377946118126, 0.8251836605370836]], "peak_params_": [[12.316575913012215, 0.595424504427538, 1.6105496276802846], [15.84951919528696, 0.5279607597540877, 8.311610560883757], [50.6614514102033, 0.19772785348163913, 1.06000150975328], [56.324855682802166, 0.24400125380530602, 0.5000472696000141], [57.63420703322583, 0.21809880731158415, 0.58631240293223], [63.608191324693436, 0.25860291330098173, 2.027577469335154], [65.9305942497193, 0.19179920741519085, 0.5001562363071118], [70.26151406037454, 0.2827748265930774, 1.6503673210741672]], "r_squared_": 0.9803465714492158, "error_": 0.055106748904446556}
{"freq_range": [2.0, 80.0], "freq_res": 1.0, "aperiodic_params_": [0.5522798904745498, 1.0244944587635352], "gaussian_params_": [[14.391783508813047, 0.6085722056547235, 3.42483937876905], [17.72307308852491, 0.3244911671168729, 0.2634146722033859], [22.963186972415237, 0.18417002791473164, 0.7641188640420977], [50.53303490766724, 1.165260338348864, 0.29331445297751896], [56.22078925592345, 0.30798022952958937, 0.46112465940906217], [57.64441412139412, 0.5516731796345581, 0.2870592449820379], [62.92019889628153, 0.19647924986174356, 0.8861979272940788], [65.6151278136821, 0.7374838871809164, 0.26173025253140614], [68.01206971963707, 0.12288223665637227, 0.250000000000193], [72.54796540086404, 0.19627394979419557, 5.999999999999999]], "peak_params_": [[14.391783508813047, 0.6046032708214151, 6.8496787575381], [17.72307308852491, 0.5360992846151663, 0.5268293444067718], [22.963186972415237, 0.20980770998776244, 1.5282377280841954], [50.53303490766724, 0.3284444847638147, 0.5866289059550379], [56.22078925592345, 0.2790019260510096, 0.9222493188181243], [57.64441412139412, 0.2667064821731817, 0.5741184899640758], [62.92019889628153, 0.2510161618779241, 1.7723958545881575], [65.6151278136821, 0.3588245557377918, 0.5234605050628123], [68.01206971963707, 0.27000413511249777, 0.500000000000386], [72.54796540086404, 0.19571771595701026, 11.999999999999998]], "r_squared_": 0.966710919280073, "error_": 0.05734180987019831}
{"freq_range": [2.0, 80.0], "freq_res": 1.0, "aperiodic_params_": [0.17737948180215604, 0.6835878263217112], "gaussian_params_": [[11.32977692999682, 0.2173728027655068, 1.6787507399333457], [14.998455252329684, 0.4666618006128649, 3.0885101425948913], [37.8889557974201, 0.3244078741179409, 0.25012422616079427], [47.001983665977605, 0.35813298852649805, 0.5636685551579002], [51.15716117911951, 0.22404665988987343, 0.7285119346444006], [62.06361009283617, 0.20106345117727334, 0.396779616572996], [65.80350525999555, 0.4944349615802926, 0.6004958890640144], [71.68535014230136, 0.2159828300421906, 1.3536278346616502], [77.09769358452611, 0.21715451444887424, 1.2700090281460565]], "peak_params_": [[11.32977692999682, 0.41508017057632085, 3.3575014798666913], [14.998455252329684, 0.48658123251975505, 6.177020285189783], [37.8889557974201, 0.2939627439956559, 0.5002484523215885], [47.001983665977605, 0.358130789858199, 1.1273371103158003], [51.15716117911951, 0.21889339363862736, 1.4570238692888011], [62.06361009283617, 0.19849619715696032, 0.793559233145992], [65.80350525999555, 0.46869252641678394, 1.2009917781280288], [71.68535014230136, 0.210294780098515, 2.7072556693233003], [77.09769358452611, 0.21661004695340846, 2.540018056292113]], "r_squared_": 0.9259839812874853, "error_": 0.06261305537879672}
{"freq_range": [2.0, 80.0], "freq_res": 1.0, "aperiodic_params_": [0.6476123845079764, 1.1769558331981176], "gaussian_params_": [[13.117304935945716, 0.5198361015136675, 3.1387350179739366], [18.824302413777218, 0.33014304658239607, 3.119504584858902], [57.18824790374246, 0.14585407465829436, 1.4439586225683816]], "peak_params_": [[13.117304935945716, 0.577248949245506, 6.277470035947873], [18.824302413777218, 0.4193811503695154, 6.239009169717804], [57.18824790374246, 0.14461984680387308, 2.887917245136763]], "r_squared_": 0.9767828231894387, "error_": 0.06504694369738812}
{"freq_range": [2.0, 80.0], "freq_res": 1.0, "aperiodic_params_": [0.7660878905212016, 1.270909256772435], "gaussian_params_": [[12.40693893889583, 0.29392833914851474, 0.7376821503265841], [15.373943584130926, 0.5580798198078808, 4.377991946310349], [50.61954295276301, 0.3547222134652903, 0.4235496284750322], [53.009774493633245, 0.19776752573577575, 0.5111992913938876], [56.335647020775255, 0.5533967385239026, 0.2500559983059041], [58.34190827842045, 0.4023987014444074, 0.32084886226513654], [63.76532912000452, 0.18962200447697158, 0.7554706544722194], [72.54796540086404, 0.15508466673385007, 5.999999999999999]], "peak_params_": [[12.40693893889583, 0.6671366273593711, 1.4753643006531683], [15.373943584130926, 0.5566574563248223, 8.755983892620698], [50.61954295276301, 0.23729470740629632, 0.8470992569500644], [53.009774493633245, 0.19849994350066602, 1.0223985827877753], [56.335647020775255, 0.2282572258470743, 0.5001119966118082], [58.34190827842045, 0.2362728790273232, 0.6416977245302731], [63.76532912000452, 0.23690349898744145, 1.5109413089444388], [72.54796540086404, 0.15464516195312683, 11.999999999999998]], "r_squared_": 0.9830237831716463, "error_": 0.051096557715864126}
{"freq_range": [2.0, 80.0], "freq_res": 1.0, "aperiodic_params_": [0.6989238259841736, 1.158304333082557], "gaussian_params_": [[9.066431892928057, 0.3386323808535759, 0.6205344657887449], [12.105177584420467, 0.6243287048828288, 1.15064378970614], [15.731800349487592, 0.5818828930714984, 2.0096599019080053], [18.384633833322265, 0.5184403853925285, 0.3248089505981794], [20.140111138019055, 0.23904492086439963, 0.46915185689600064], [22.582406405549616, 0.21335399940621985, 1.2326738418204197], [50.55749477592707, 0.9781446293164868, 0.2721235791731578], [56.14255174875984, 0.37416422620495926, 0.2500000000940027], [58.139882340619586, 0.23243707032285948, 0.6595998362594375], [64.21627712153895, 0.21767218996225893, 1.3269040900571216], [70.02053732246154, 0.2505630684314353, 0.9432911982103704]], "peak_params_": [[9.066431892928057, 0.3551952056805134, 1.2410689315774899], [12.105177584420467, 0.7255001756567951, 2.30128757941228], [15.731800349487592, 0.5787539602053475, 4.0193198038160105], [18.384633833322265, 0.5651439750952785, 0.6496179011963588], [20.140111138019055, 0.31339592582877057, 0.9383037137920013], [22.582406405549616, 0.20229631688202832, 2.4653476836408394], [50.55749477592707, 0.2607407525853995, 0.5442471583463157], [56.14255174875984, 0.31922860038382694, 0.5000000001880054], [58.139882340619586, 0.2272722825530611, 1.319199672518875], [64.21627712153895, 0.2147998640674602, 2.6538081801142432], [70.02053732246154, 0.25051998907204, 1.8865823964207409]], "r_squared_": 0.9770224161720269, "error_": 0.05303341328964441}
{"freq_range": [2.0, 80.0], "freq_res": 1.0, "aperiodic_params_": [-1.4983255440647625, 0.7194419360022386], "gaussian_params_": [[11.40318486885046, 0.31455437190976326, 1.9570001127564394], [16.725396942259238, 0.19265112291314748, 3.5813035242191398], [35.42421254534854, 0.6397561439354105, 0.27066999054247814], [40.359671554482524, 0.5807853194320737, 0.2563531288329248], [46.06004535568598, 0.20729230741175964, 0.649938970580132], [49.28609244747052, 0.30275620298575096, 0.25005617069661584], [53.913653559521954, 0.12446117266263969, 3.08373763546635], [67.32827727980899, 0.17358841202573444, 2.58588022762858]], "peak_params_": [[11.40318486885046, 0.361625549925503, 3.9140002255128787], [16.725396942259238, 0.19735365565892327, 7.1626070484382796], [35.42421254534854, 0.18733980655895532, 0.5413399810849563], [40.359671554482524, 0.21705570934767993, 0.5127062576658497], [46.06004535568598, 0.21103310914351026, 1.299877941160264], [49.28609244747052, 0.19232188789724924, 0.5001123413932317], [53.913653559521954, 0.12441268703650366, 6.1674752709327], [67.32827727980899, 0.17221052611399745, 5.17176045525716]], "r_squared_": 0.9304137196714756, "error_": 0.057226543132378786}
{"freq_range": [2.0, 80.0], "freq_res": 1.0, "aperiodic_params_": [-0.5174767283283951, 0.9029982961726054], "gaussian_params_": [[9.618436301611926, 0.38466202876296307, 1.4125054797160803], [14.660560331887176, 0.44956736655266943, 2.829161654704411], [50.54796540086405, 0.1400128541022904, 5.999999999999999], [79.99999999999999, 0.21642226561772648, 5.999999999999999]], "peak_params_": [[9.618436301611926, 0.4866310210948619, 2.8250109594321606], [14.660560331887176, 0.44661428737771836, 5.658323309408822], [50.54796540086405, 0.1396178925474354, 11.999999999999998], [79.99999999999999, 0.21642308595229176, 11.999999999999998]], "r_squared_": 0.9553931691384203, "error_": 0.06307785235373164}
{"freq_range": [2.0, 80.0], "freq_res": 1.0, "aperiodic_params_": [-0.08083904985133922, 0.8274751217430255], "gaussian_params_": [[10.517432649353463, 0.5504377026231824, 1.419896957711694], [15.577850334520965, 0.2582850801312397, 2.097933454779745], [58.84872375638017, 0.19263455340836813, 1.10412871407011], [62.0381039526885, 0.2443046770628917, 0.2500000685176026], [66.54796540085471, 0.12546343420349337, 3.884532747574536], [73.30416326660743, 0.2158249294559014, 0.32677590963439634], [76.44159191588923, 0.3647605878386165, 0.3162564569674874], [79.07725000228537, 0.20775999982339, 2.499573714655941]], "peak_params_": [[10.517432649353463, 0.5434360217861627, 2.839793915423388], [15.577850334520965, 0.2534272323439649, 4.19586690955949], [58.84872375638017, 0.2098310215482857, 2.20825742814022], [62.0381039526885, 0.30798493161215545, 0.5000001370352052], [66.54796540085471, 0.12461859459591618, 7.769065495149072], [73.30416326660743, 0.18234440454558776, 0.6535518192687927], [76.44159191588923, 0.24148082641932156, 0.6325129139349748], [79.07725000228537, 0.208397384451807, 4.999147429311882]], "r_squared_": 0.9560658225218115, "error_": 0.05435019395465874}
{"freq_range": [2.0, 80.0], "freq_res": 1.0, "aperiodic_params_": [-0.08087635990934655, 0.9775314766335572], "gaussian_params_": [[9.476676305215287, 0.5252996395239381, 1.3131182406988684], [14.309502471938703, 0.31691947922805885, 2.703192321754339], [58.41234876365952, 0.7880716165314704, 0.2906388176398272], [61.54165150217903, 0.5642526343635937, 0.2933224984208959], [70.85878269909064, 0.1422659838937758, 5.999999999999999], [78.05243214067356, 0.28298897731194234, 0.25007318255362376]], "peak_params_": [[9.476676305215287, 0.5378520951399502, 2.626236481397737], [14.309502471938703, 0.31624125376563006, 5.406384643508678], [58.41234876365952, 0.30236481229155143, 0.5812776352796544], [61.54165150217903, 0.21427233126616474, 0.5866449968417918], [70.85878269909064, 0.14222658498031437, 11.999999999999998], [78.05243214067356, 0.346900545523108, 0.5001463651072475]], "r_squared_": 0.9701869646166782, "error_": 0.05433980457276774}
