{"freq_range": [2.0, 80.0], "freq_res": 1.0, "aperiodic_params_": [-0.23631824245637667, 0.4905735512152929], "gaussian_params_": [[6.452034599135944, 0.18148735861429222, 4.21080236776108], [17.47105722120163, 0.26228575474265753, 0.9050841045203306], [19.760595230283254, 0.19175555721476087, 0.6887946503756521], [37.32740406038707, 0.3783238657679527, 0.25576373388394147], [38.77712588948819, 0.20123432151961446, 0.5115550401126867], [49.59824569190271, 0.1987261482322641, 1.4053091318045323], [56.34633781636513, 0.4051939292314085, 0.2557422258604898], [64.47510920323693, 0.12186111201837453, 5.999999999999999], [66.02512644513563, 0.08064964436865336, 0.25000162839679013]], "peak_params_": [[6.452034599135944, 0.18044461055423444, 8.42160473552216], [17.47105722120163, 0.23700058314472627, 1.8101682090406612], [19.760595230283254, 0.1868313155445548, 1.3775893007513043], [37.32740406038707, 0.16722249471524697, 0.5115274677678829], [38.77712588948819, 0.18302864977557298, 1.0231100802253734], [49.59824569190271, 0.19740663547388582, 2.8106182636090646], [56.34633781636513, 0.20690809791448672, 0.5114844517209796], [64.47510920323693, 0.12147966087452344, 11.999999999999998], [66.02512644513563, 0.1982317311854893, 0.5000032567935803]], "r_squared_": 0.9055710996483739, "error_": 0.04878627408156443}
{"freq_range": [2.0, 80.0], "freq_res": 1.0, "aperiodic_params_": [-0.023122763670362225, 0.8124385515127144], "gaussian_params_": [[2.5361193914304145, 0.4498507029524688, 0.33665366324873275], [5.69775622981329, 0.1352179828089943, 1.2616414593182026], [9.78171107710668, 0.19354226446582867, 1.1191232478303943], [18.987637565918657, 0.15560683018553653, 1.668711555092657], [32.55665504345443, 0.627917720981461, 0.25077545400096307], [45.54933341840575, 0.11815240648888345, 4.91964074257207], [49.08043577655976, 0.08884596231783282, 0.25002934821973516], [60.85689199355481, 0.15094764720599993, 1.2244069636176675], [65.09593059727119, 0.06089988343729399, 5.999999999999999]], "peak_params_": [[2.5361193914304145, 0.1878388336389237, 0.6733073264974655], [5.69775622981329, 0.1320345100324839, 2.523282918636405], [9.78171107710668, 0.19029901577478026, 2.2382464956607886], [18.987637565918657, 0.15560261611204118, 3.337423110185314], [32.55665504345443, 0.13615416051091023, 0.5015509080019261], [45.54933341840575, 0.11804235444434319, 9.83928148514414], [49.08043577655976, 0.17841952263410055, 0.5000586964394703], [60.85689199355481, 0.19901412234167637, 2.448813927235335], [65.09593059727119, 0.06143237846267846, 11.999999999999998]], "r_squared_": 0.9759098370840363, "error_": 0.037866774219456646}
{"freq_range": [2.0, 80.0], "freq_res": 1.0, "aperiodic_params_": [-0.08926799585197583, 0.6607097348805204], "gaussian_params_": [[9.528672985685892, 0.8159841354210493, 0.2939961347586151], [19.93948219275746, 0.2194622142053926, 1.218196459787359], [23.314245189214642, 0.3085270927467413, 0.2648643320812643], [38.538135910450784, 0.5648926292221499, 0.29138426039666826], [43.511841726670106, 0.14637314494913575, 1.350612911772542], [48.566884161770055, 0.10778338117230236, 2.3657499182910944], [56.24442858170645, 0.14678252157399133, 1.0902631167755235], [61.54887477806464, 0.10246326311604291, 2.354632006912388], [67.00427931846127, 0.14057219465624096, 0.25000000000009903]], "peak_params_": [[9.528672985685892, 0.22572358511755486, 0.5879922695172302], [19.93948219275746, 0.21919157323720517, 2.436392919574718], [23.314245189214642, 0.1619751598564887, 0.5297286641625286], [38.538135910450784, 0.16142329511975428, 0.5827685207933365], [43.511841726670106, 0.1538423639745734, 2.701225823545084], [48.566884161770055, 0.10603021085392439, 4.731499836582189], [56.24442858170645, 0.1502914127420365, 2.180526233551047], [61.54887477806464, 0.10060000027482374, 4.709264013824776], [67.00427931846127, 0.1475784784908265, 0.5000000000001981]], "r_squared_": 0.9488813115305836, "error_": 0.042982813435706736}
{"freq_range": [2.0, 80.0], "freq_res": 1.0, "aperiodic_params_": [0.2966697105862577, 0.9852202469924441], "gaussian_params_": [[7.010125289675452, 0.1677258205564977, 0.6294270170306414], [9.547722441377397, 0.4010464781931483, 0.528281072983725], [33.21894632019693, 0.1971080857031612, 0.2501989771924723], [49.020460092787594, 0.16862499172130155, 0.844609861260195], [52.07404590594226, 0.11480773718810032, 0.25009225936638557], [58.496112116185174, 0.11130157533059482, 3.088657085859264], [65.2930551715217, 0.2378580139849958, 0.25607710018662483], [66.70457827561981, 0.3635117358071975, 0.2500188147553392], [70.9637038106714, 0.18155159844298085, 0.6597337386392618], [77.02740172076038, 0.16456936139807138, 1.4747554419066202]], "peak_params_": [[7.010125289675452, 0.16770769102947702, 1.2588540340612828], [9.547722441377397, 0.27799557022213917, 1.05656214596745], [33.21894632019693, 0.13440559296252075, 0.5003979543849446], [49.020460092787594, 0.1695615539786719, 1.68921972252039], [52.07404590594226, 0.12240744360247602, 0.5001845187327711], [58.496112116185174, 0.10987500429183283, 6.177314171718528], [65.2930551715217, 0.1356987026493155, 0.5121542003732497], [66.70457827561981, 0.18337460994296562, 0.5000376295106784], [70.9637038106714, 0.18134661047633172, 1.3194674772785235], [77.02740172076038, 0.16454095803309032, 2.9495108838132404]], "r_squared_": 0.9839288367031194, "error_": 0.030887544142141312}
{"freq_range": [2.0, 80.0], "freq_res": 1.0, "aperiodic_params_": [0.035661793416846777, 0.7007660848209878], "gaussian_params_": [[6.452034599406608, 0.15051119785057765, 4.573811516122712], [19.944591429483808, 0.14668375040294943, 1.7303916721202597], [32.60396449412957, 0.7159204988599429, 0.2500104038325041], [46.484250726998255, 0.17051923833004803, 5.1737939984304555], [54.48363384435453, 0.2170841043823392, 0.6799789322201952], [57.16239186679405, 0.12448499978245092, 0.7229848910999618], [61.15694629923798, 0.19030911251359356, 1.64617008873086]], "peak_params_": [[6.452034599406608, 0.14977792505176835, 9.147623032245424], [19.944591429483808, 0.14848108779493407, 3.4607833442405194], [32.60396449412957, 0.20987530110064156, 0.5000208076650082], [46.484250726998255, 0.16977396618726448, 10.347587996860911], [54.48363384435453, 0.22796030955965152, 1.3599578644403905], [57.16239186679405, 0.15107621669995996, 1.4459697821999236], [61.15694629923798, 0.192776561063156, 3.29234017746172]], "r_squared_": 0.9626020397938796, "error_": 0.04199018135066748}
{"freq_range": [2.0, 80.0], "freq_res": 1.0, "aperiodic_params_": [-0.047612243745247716, 0.7778531100275453], "gaussian_params_": [[2.693318117429075, 0.20259582587096933, 0.8347813708493569], [6.147789863878162, 0.14710853797504383, 0.9503486215555492], [9.819790627363968, 0.15931558556522538, 1.1869025788101581], [18.585188543863485, 0.4812711918034142, 0.2998821794439283], [45.87851876049375, 0.1684566471355876, 0.703425017801563], [49.44066467771702, 0.5010890159081266, 0.31095889275161614], [58.29598426641121, 0.17708887786634459, 0.683288588053825], [61.34914541708364, 0.24577858199456123, 0.5836448225198249], [66.68802363070326, 0.35533747464071547, 0.28234958327926213], [71.42520066788097, 0.2234642004029832, 0.4727456492828561], [75.6014427503966, 0.24048434406526378, 1.1919871172918979]], "peak_params_": [[2.693318117429075, 0.18998496217235256, 1.6695627416987138], [6.147789863878162, 0.14631758129727512, 1.9006972431110984], [9.819790627363968, 0.15752957912091758, 2.3738051576203163], [18.585188543863485, 0.1848867103386438, 0.5997643588878566], [45.87851876049375, 0.16596316211415796, 1.406850035603126], [49.44066467771702, 0.18359351195432905, 0.6219177855032323], [58.29598426641121, 0.161229867421123, 1.36657717610765], [61.34914541708364, 0.20558150809997788, 1.1672896450396497], [66.68802363070326, 0.19298904541442186, 0.5646991665585243], [71.42520066788097, 0.149261852343318, 0.9454912985657122], [75.6014427503966, 0.22741020121919386, 2.3839742345837958]], "r_squared_": 0.9793968628903635, "error_": 0.032148070667028544}
{"freq_range": [2.0, 80.0], "freq_res": 1.0, "aperiodic_params_": [-0.07192287460214819, 0.7878473317060191], "gaussian_params_": [[9.527884799544804, 0.2759433562683831, 0.8543528954653031], [16.050514968891648, 0.1893064507656145, 0.7994403732029143], [30.341729692890326, 0.29905086248727425, 0.27591131983122386], [32.73271722008723, 0.15363253864932488, 0.55397198107431], [39.001952641164515, 0.15856698003674774, 0.250000001390537], [49.452034599136255, 0.08933802866166635, 5.9999975020653045], [60.732990975244256, 0.16124514084066477, 1.0391398198276713], [67.37959737899708, 0.4267116901234437, 0.30661382180186575], [71.45715087567191, 0.6466408062173663, 0.29783307488261324]], "peak_params_": [[9.527884799544804, 0.236870213661457, 1.7087057909306063], [16.050514968891648, 0.1889289205358763, 1.5988807464058286], [30.341729692890326, 0.13934734176515828, 0.5518226396624477], [32.73271722008723, 0.1388334448052171, 1.10794396214862], [39.001952641164515, 0.1781543907152825, 0.500000002781074], [49.452034599136255, 0.08908484745316136, 11.999995004130609], [60.732990975244256, 0.17002592505247915, 2.0782796396553427], [67.37959737899708, 0.19953413215185867, 0.6132276436037315], [71.45715087567191, 0.1992392273862975, 0.5956661497652265]], "r_squared_": 0.9645633513301259, "error_": 0.04140122715349901}
{"freq_range": [2.0, 80.0], "freq_res": 1.0, "aperiodic_params_": [0.3036664350675004, 0.9996735336601854], "gaussian_params_": [[9.564668409750652, 0.28709425305263275, 0.8058042621430963], [24.994674178467942, 0.1518517981445352, 0.6866242902490504], [27.595644971233266, 0.49048510486498464, 0.2805265863349466], [32.65404386172433, 0.33093740466037813, 0.2628459465934003], [35.97004455471476, 0.1127945787940272, 0.25001125280785486], [38.67111314687906, 0.34794351440731003, 0.25003189871352716], [44.547965400864044, 0.07901735906788608, 5.999999969599085], [61.02822606065148, 0.15940317743222812, 0.5013042350196459], [67.0656325418262, 0.169173103086626, 0.2500002460209351]], "peak_params_": [[9.564668409750652, 0.24811152662431135, 1.6116085242861926], [24.994674178467942, 0.1522387983770892, 1.3732485804981007], [27.595644971233266, 0.17533831722341087, 0.5610531726698932], [32.65404386172433, 0.15157466278522103, 0.5256918931868007], [35.97004455471476, 0.14062881009561012, 0.5000225056157097], [38.67111314687906, 0.19801602353593983, 0.5000637974270543], [44.547965400864044, 0.07879342650154486, 11.99999993919817], [61.02822606065148, 0.16099181309392896, 1.0026084700392919], [67.0656325418262, 0.16351450088042085, 0.5000004920418702]], "r_squared_": 0.9772005953363162, "error_": 0.04409256028080358}
{"freq_range": [2.0, 80.0], "freq_res": 1.0, "aperiodic_params_": [0.3926015726300787, 1.0810691280498916], "gaussian_params_": [[6.929954122580294, 0.15820161190078585, 1.351911997225113], [9.613534879732786, 0.3498499886540374, 0.7328198008153355], [12.55613538661494, 0.37752447512213755, 0.28418554951563185], [17.08107732599351, 0.1160283129108569, 2.263466348225533], [48.65134273738595, 0.16276609934476524, 0.6331690782853464], [60.69530141470842, 0.09389745380302279, 4.550388026022382], [67.03464146340728, 0.17223557985041663, 0.25001956840295153], [71.0979945016842, 0.1901219451957552, 0.5288992444893464], [77.35847593443658, 0.16438167982480778, 1.961088401792093]], "peak_params_": [[6.929954122580294, 0.15860036172831576, 2.703823994450226], [9.613534879732786, 0.31730709082026176, 1.465639601630671], [12.55613538661494, 0.13433758141383056, 0.5683710990312637], [17.08107732599351, 0.11595390049057785, 4.526932696451066], [48.65134273738595, 0.14332189265444928, 1.2663381565706928], [60.69530141470842, 0.09368718196888515, 9.100776052044765], [67.03464146340728, 0.20654857260570925, 0.5000391368059031], [71.0979945016842, 0.19497227764938652, 1.0577984889786929], [77.35847593443658, 0.16181119554569712, 3.922176803584186]], "r_squared_": 0.9890709303665054, "error_": 0.03201470373596273}
{"freq_range": [2.0, 80.0], "freq_res": 1.0, "aperiodic_params_": [0.4426513912545353, 1.1001744398631879], "gaussian_params_": [[6.704300416182144, 0.1724245650438541, 1.6855970383339367], [9.665943384171154, 0.34248716092689757, 0.7781420752077026], [12.567933230227663, 0.3875087047171462, 0.33274222973499656], [16.906103181580086, 0.12671242651612205, 1.9077068628007205], [28.040615162270825, 0.128240893581904, 0.25000010162024594], [48.75374574992684, 0.12264534128382253, 0.8016570724548526], [60.94222516111662, 0.21654886949023447, 0.5154028219487539], [67.34939890984344, 0.5250629614822759, 0.27367882820409406], [70.88200269282558, 0.19152028172819222, 0.6016664407276142], [77.33618462356849, 0.1997163219370849, 2.462534521666136]], "peak_params_": [[6.704300416182144, 0.17075978925994323, 3.3711940766678734], [9.665943384171154, 0.33801467820642267, 1.5562841504154052], [12.567933230227663, 0.18255354710579308, 0.6654844594699931], [16.906103181580086, 0.12655903518566358, 3.815413725601441], [28.040615162270825, 0.12655965793191637, 0.5000002032404919], [48.75374574992684, 0.11699328481772864, 1.6033141449097053], [60.94222516111662, 0.21519259926131928, 1.0308056438975077], [67.34939890984344, 0.23245509040987766, 0.5473576564081881], [70.88200269282558, 0.19516337981863052, 1.2033328814552284], [77.33618462356849, 0.1978638458307862, 4.925069043332272]], "r_squared_": 0.9882741460888387, "error_": 0.03443531873791155}
{"freq_range": [2.0, 80.0], "freq_res": 1.0, "aperiodic_params_": [0.4957799618808306, 1.1451130990464973], "gaussian_params_": [[5.249680095356142, 0.1745178229374138, 0.8373922602482538], [7.282020133955486, 0.3632959999318208, 0.2712153774183029], [9.48602799284465, 0.3657257782406906, 0.8841811028207998], [12.934272278062782, 0.16294264977784564, 0.7970762940160028], [15.479107804755042, 0.34295197639903513, 0.3098852813719265], [17.640260222558542, 0.13298010211017547, 1.0836688877083138], [28.41411990018667, 0.4242108774130689, 0.2551153434849184], [48.138223639899046, 0.1251357869800571, 1.298847576780665], [51.66630758482682, 0.26189754147082045, 0.2500050422598505], [56.79176174582566, 0.11828462773053032, 1.0703261189526012], [59.015889695756506, 0.1041716567771445, 0.2500433638524374], [60.98945231440961, 0.22673902243470945, 0.7237322549069359], [64.79014697661948, 0.15108686627436343, 0.6406994231813866], [67.28673328102482, 0.32767201675724567, 0.2500052230128622], [71.0120220170304, 0.17009442259108462, 0.553046594186944], [77.23851027155966, 0.2257935540098881, 2.4795106710138066]], "peak_params_": [[5.249680095356142, 0.16693118618753852, 1.6747845204965075], [7.282020133955486, 0.23823866006778846, 0.5424307548366059], [9.48602799284465, 0.3144515030465952, 1.7683622056415995], [12.934272278062782, 0.16253942061700155, 1.5941525880320055], [15.479107804755042, 0.11629917236873921, 0.619770562743853], [17.640260222558542, 0.12585107232299564, 2.1673377754166276], [28.41411990018667, 0.11360590295465167, 0.5102306869698368], [48.138223639899046, 0.12442919165028488, 2.59769515356133], [51.66630758482682, 0.10897813205648488, 0.500010084519701], [56.79176174582566, 0.11606708169802116, 2.1406522379052024], [59.015889695756506, 0.1232265802833914, 0.5000867277048748], [60.98945231440961, 0.22676696523970596, 1.4474645098138719], [64.79014697661948, 0.1431972416173155, 1.2813988463627732], [67.28673328102482, 0.17018683311081295, 0.5000104460257244], [71.0120220170304, 0.17958410694957272, 1.106093188373888], [77.23851027155966, 0.22475133375153145, 4.959021342027613]], "r_squared_": 0.9935836727809155, "error_": 0.023174552418934544}
{"freq_range": [2.0, 80.0], "freq_res": 1.0, "aperiodic_params_": [0.4522722015730758, 1.070783525430356], "gaussian_params_": [[5.1324355307102545, 0.12261102442222889, 1.2002615964464334], [6.975380941142647, 0.17060828936729444, 0.2500000048620534], [9.48079748120421, 0.9179384264573824, 0.2881276237660832], [14.164126197502764, 0.09888563655761917, 4.043975563380877], [48.64988807041853, 0.22550252779356184, 0.42068700028132217], [56.452481513219425, 0.06903707893846883, 5.999999999999999], [61.42061754675389, 0.5205547640712874, 0.2688347475559746], [64.63938331224985, 0.2872542743092593, 0.2984737835910951], [67.0628987549961, 0.17817834292347287, 0.4071638286441498], [71.11345042384802, 0.17309864936649394, 0.5797531795329195], [77.38736203054134, 0.19530720294870654, 2.317601000682708]], "peak_params_": [[5.1324355307102545, 0.1294530229122847, 2.4005231928928668], [6.975380941142647, 0.22691564031946354, 0.5000000097241069], [9.48079748120421, 0.27255387033753786, 0.5762552475321664], [14.164126197502764, 0.0988042292942738, 8.087951126761753], [48.64988807041853, 0.1914172605313218, 0.8413740005626443], [56.452481513219425, 0.06884104364966004, 11.999999999999998], [61.42061754675389, 0.2048748546567314, 0.5376694951119492], [64.63938331224985, 0.16347427007318616, 0.5969475671821902], [67.0628987549961, 0.19079777983340152, 0.8143276572882996], [71.11345042384802, 0.177846765548205, 1.159506359065839], [77.38736203054134, 0.19279423860309897, 4.635202001365416]], "r_squared_": 0.98737139493371, "error_": 0.029703715512369562}
{"freq_range": [2.0, 80.0], "freq_res": 1.0, "aperiodic_params_": [0.402291815965276, 0.9923723508843317], "gaussian_params_": [[6.566928151159149, 0.6218580279025049, 0.26981766057800954], [9.54409007255885, 0.2148150951762288, 0.8200165355143024], [32.92090399536435, 0.14902272251284623, 0.2500001708489945], [46.423256991076315, 0.3965390871143275, 0.269061937169221], [48.680004228950686, 0.21453060985048222, 0.6357052930747676], [59.10519387278878, 0.20313619063149516, 0.7242462671977031], [61.45209709170435, 0.4800268687801022, 0.3214847467154634], [76.58881100383961, 0.17915033125950414, 2.9028305800869627]], "peak_params_": [[6.566928151159149, 0.17325065152035996, 0.5396353211560191], [9.54409007255885, 0.18405280472068158, 1.6400330710286048], [32.92090399536435, 0.14174780241141094, 0.500000341697989], [46.423256991076315, 0.11509247343761575, 0.538123874338442], [48.680004228950686, 0.18900266611335836, 1.2714105861495353], [59.10519387278878, 0.20100473264028507, 1.4484925343954063], [61.45209709170435, 0.1852086879311694, 0.6429694934309268], [76.58881100383961, 0.17736198958070615, 5.805661160173925]], "r_squared_": 0.9856108233153784, "error_": 0.03347476897720175}
{"freq_range": [2.0, 80.0], "freq_res": 1.0, "aperiodic_params_": [0.06818276744383418, 0.8091343577293623], "gaussian_params_": [[6.452034599135944, 0.16499954086113838, 5.06456437808814], [18.432460743775977, 0.12055923185866325, 1.6923060505031766], [32.55453047473092, 0.7954812845277887, 0.25003689926765116], [46.428940035556295, 0.5356301101700786, 0.2505079158452521], [48.884327146575636, 0.13882171156510756, 0.5761095783281748], [58.70006160801737, 0.10382412834377969, 5.999999999999999], [75.87008508063762, 0.1573786687957185, 2.4269978730656128]], "peak_params_": [[6.452034599135944, 0.164343626326529, 10.12912875617628], [18.432460743775977, 0.12894706847775173, 3.3846121010063532], [32.55453047473092, 0.16270493889347337, 0.5000737985353023], [46.428940035556295, 0.1347060274138283, 0.5010158316905042], [48.884327146575636, 0.16415451322072538, 1.1522191566563496], [58.70006160801737, 0.10369448249851776, 11.999999999999998], [75.87008508063762, 0.1587790308376038, 4.8539957461312255]], "r_squared_": 0.9753381668403663, "error_": 0.0377997100235564}
{"freq_range": [2.0, 80.0], "freq_res": 1.0, "aperiodic_params_": [0.14434814154944658, 0.9062965637555301], "gaussian_params_": [[3.00183210911373, 0.13722537974159657, 0.5865098377487094], [9.452523156331576, 0.5845863624781564, 0.2785415547560346], [18.681172863006598, 0.15351479314002053, 1.6921994780319016], [32.78856810089413, 0.1538854522888226, 0.3009224778213191], [34.804309860746464, 0.13852707058088198, 0.6387337588408516], [45.8750331148233, 0.1204468539940426, 0.39503955834950805], [48.99969621862966, 0.19501920033714373, 0.25000000000727707], [58.8700062402708, 0.13400154377156565, 2.49460761729971], [64.58929023480285, 0.29828363724791346, 0.2976710607309733], [66.61658948308695, 0.44054302743527124, 0.2578975167368277], [71.21900767014084, 0.1301668038583373, 0.6823549636802808], [75.89652845873384, 0.17417851338419515, 1.27217658771251]], "peak_params_": [[3.00183210911373, 0.1372247102340847, 1.1730196754974187], [9.452523156331576, 0.15621222566604875, 0.5570831095120692], [18.681172863006598, 0.1508140753582683, 3.3843989560638033], [32.78856810089413, 0.12278955564581961, 0.6018449556426382], [34.804309860746464, 0.1321759329779273, 1.2774675176817032], [45.8750331148233, 0.1145687405915441, 0.7900791166990161], [48.99969621862966, 0.19507249402584947, 0.5000000000145541], [58.8700062402708, 0.13381973051938867, 4.98921523459942], [64.58929023480285, 0.12169068795252813, 0.5953421214619466], [66.61658948308695, 0.14655906727150114, 0.5157950334736554], [71.21900767014084, 0.1237387065029234, 1.3647099273605616], [75.89652845873384, 0.17360334690201062, 2.54435317542502]], "r_squared_": 0.987079925610906, "error_": 0.026371811934123354}
{"freq_range": [2.0, 80.0], "freq_res": 1.0, "aperiodic_params_": [-0.24185871251728844, 0.6089109433643526], "gaussian_params_": [[9.489606705081611, 0.23167073566403348, 0.678542475467389], [20.561991274668973, 0.31895261881904247, 2.319609990847326], [32.558024904432365, 0.5037202856013976, 0.2628879629906643], [36.36187505930139, 0.3567552304371846, 0.2699274499667836], [38.98013817326829, 0.17687232703152866, 0.25002135947600235], [43.545729675638725, 0.19358488069407098, 5.999999999993543], [62.17165941529632, 0.1551149057137097, 1.838563401678763], [67.26666037899399, 0.28230799164681497, 0.2505564771211209]], "peak_params_": [[9.489606705081611, 0.17857390012613628, 1.357084950934778], [20.561991274668973, 0.31348295083939626, 4.639219981694652], [32.558024904432365, 0.16388877166464044, 0.5257759259813286], [36.36187505930139, 0.23302770818321372, 0.5398548999335672], [38.98013817326829, 0.32160351705373325, 0.5000427189520047], [43.545729675638725, 0.1930308351725234, 11.999999999987086], [62.17165941529632, 0.15614896067789386, 3.677126803357526], [67.26666037899399, 0.16526357882286602, 0.5011129542422418]], "r_squared_": 0.9406638871048069, "error_": 0.044079362418423494}
{"freq_range": [2.0, 80.0], "freq_res": 1.0, "aperiodic_params_": [0.13373684108422415, 0.9112115780586517], "gaussian_params_": [[9.43233142645532, 0.29083899101485206, 0.8025458651731219], [16.22427987641568, 0.1390911645329683, 0.7192283820777442], [18.342144044715365, 0.23674340608672728, 0.49241436728953564], [21.149054361830135, 0.23340695194909925, 1.1822820507445826], [32.53112788578287, 0.49295724395560375, 0.2823302411745017], [38.566351198526874, 0.44485591638092925, 0.27803535684836617], [41.89060492563356, 0.08153366882087174, 5.03632282875552], [49.00938352139432, 0.1159482251406772, 0.2500078655862845], [54.563812735762944, 0.12555091864560844, 1.3066454626888053], [60.86767436910733, 0.12623537063411439, 0.7647730461213079], [67.0411890541024, 0.14013405771771878, 0.2500000000002963]], "peak_params_": [[9.43233142645532, 0.25155734981735905, 1.6050917303462438], [16.22427987641568, 0.13251108828153757, 1.4384567641554884], [18.342144044715365, 0.19929554864077192, 0.9848287345790713], [21.149054361830135, 0.23157443761018615, 2.364564101489165], [32.53112788578287, 0.14130677078618348, 0.5646604823490033], [38.566351198526874, 0.2009716042126095, 0.5560707136967323], [41.89060492563356, 0.08151443683291038, 10.07264565751104], [49.00938352139432, 0.14598559349524853, 0.500015731172569], [54.563812735762944, 0.12150136507625353, 2.6132909253776107], [60.86767436910733, 0.12442147080455435, 1.5295460922426158], [67.0411890541024, 0.13824529056174262, 0.5000000000005926]], "r_squared_": 0.9866129943829315, "error_": 0.028221865642259245}
{"freq_range": [2.0, 80.0], "freq_res": 1.0, "aperiodic_params_": [0.379611012282644, 1.0682396122792557], "gaussian_params_": [[7.3361555568327255, 0.1503919734406689, 1.3773173122289395], [9.620510855748647, 0.3506863704329509, 0.6842722818176378], [12.553612276066824, 0.4640813060541165, 0.30164880139207123], [15.937842544092323, 0.05826893592273955, 0.25056814562655627], [17.870124659908637, 0.13611625901074548, 2.061305632391507], [48.98803870128445, 0.1346576901795258, 0.6576667556879318], [60.91535120853118, 0.2051459063457297, 0.6925008389023003], [66.95605567232353, 0.2034371406263517, 0.25000674883621404], [71.44128601593766, 0.45368993076602165, 0.28048274918791116]], "peak_params_": [[7.3361555568327255, 0.1462080788293899, 2.754634624457879], [9.620510855748647, 0.3239627588980079, 1.3685445636352755], [12.553612276066824, 0.16364806241371366, 0.6032976027841425], [15.937842544092323, 0.14669675749141387, 0.5011362912531125], [17.870124659908637, 0.13584634981549848, 4.122611264783014], [48.98803870128445, 0.13463542069599344, 1.3153335113758635], [60.91535120853118, 0.20361899962020025, 1.3850016778046006], [66.95605567232353, 0.200318593871311, 0.5000134976724281], [71.44128601593766, 0.13159953525624957, 0.5609654983758223]], "r_squared_": 0.9884331042062987, "error_": 0.03414498230240529}
{"freq_range": [2.0, 80.0], "freq_res": 1.0, "aperiodic_params_": [0.5137844854363763, 1.1584090561890172], "gaussian_params_": [[6.522148159813911, 0.16266399755647956, 1.293179761765662], [9.571761096726576, 0.38523730841612075, 0.8149523682208513], [12.783869118454954, 0.17306421675368125, 0.8171086749459434], [15.551165832861075, 0.14895709359668835, 0.30998201007412546], [17.38519501125599, 0.16252811021512337, 1.3900615420705207], [48.56081376600607, 0.44784408240648177, 0.29048289048855797], [51.98948281918197, 0.09432793893710092, 0.25000000305387643], [58.701193884078144, 0.09368394241624105, 3.0200927193172804], [60.66026878677325, 0.22701712538728294, 0.27022848834048663], [65.11354143602429, 0.10939874859415667, 0.8019785698600655], [67.32602508563903, 0.3798625738905925, 0.30858584147742785], [71.09352638248625, 0.15459010228056141, 0.6103305534335208], [76.81526966630518, 0.17236028525857527, 2.8363725917803317]], "peak_params_": [[6.522148159813911, 0.15457935119939198, 2.586359523531324], [9.571761096726576, 0.3404530145768425, 1.6299047364417025], [12.783869118454954, 0.16829239791788242, 1.6342173498918868], [15.551165832861075, 0.15121475148277586, 0.6199640201482509], [17.38519501125599, 0.1564092540558516, 2.7801230841410414], [48.56081376600607, 0.14334584503964165, 0.5809657809771159], [51.98948281918197, 0.10223485331359217, 0.5000000061077529], [58.701193884078144, 0.09322652850645663, 6.040185438634561], [60.66026878677325, 0.17312436494231398, 0.5404569766809733], [65.11354143602429, 0.1189812067956817, 1.603957139720131], [67.32602508563903, 0.22685079177400191, 0.6171716829548557], [71.09352638248625, 0.17387863799471726, 1.2206611068670417], [76.81526966630518, 0.17199511497967102, 5.6727451835606635]], "r_squared_": 0.9935885323649971, "error_": 0.025584589628950924}
{"freq_range": [2.0, 80.0], "freq_res": 1.0, "aperiodic_params_": [0.5697528332905615, 1.1765017927562904], "gaussian_params_": [[5.273333630477388, 0.18483173434917355, 0.8184585690232242], [7.29248973287027, 0.3172863155180069, 0.2959161984729647], [9.436950341957651, 0.3548085771312777, 0.7648795389927352], [15.159188826463959, 0.13722860845739293, 3.296133311832319], [28.420594473931974, 0.4488921915723179, 0.2664527555829443], [48.23392026203011, 0.12473578028880762, 0.9651040564421712], [60.4040756483188, 0.08012152849537575, 5.757517541161783], [60.991277840294714, 0.1280564360567081, 0.25000304161229314], [67.38412050456974, 0.3682796922173828, 0.2702446259250844], [71.01768715604415, 0.15014821948697632, 0.5697887257210267], [77.41457637888955, 0.19760886232381025, 2.6880628544541665]], "peak_params_": [[5.273333630477388, 0.17599416323421876, 1.6369171380464484], [7.29248973287027, 0.22326698586105706, 0.5918323969459294], [9.436950341957651, 0.3253418276101058, 1.5297590779854704], [15.159188826463959, 0.13706866110104665, 6.592266623664638], [28.420594473931974, 0.12921745602183576, 0.5329055111658886], [48.23392026203011, 0.1289930581765859, 1.9302081128843425], [60.4040756483188, 0.07997382110938123, 11.515035082323566], [60.991277840294714, 0.20767203129551715, 0.5000060832245863], [67.38412050456974, 0.1757891494185222, 0.5404892518501688], [71.01768715604415, 0.1762706045957747, 1.1395774514420534], [77.41457637888955, 0.19653016822335911, 5.376125708908333]], "r_squared_": 0.9939971943902076, "error_": 0.02462746290819797}
{"freq_range": [2.0, 80.0], "freq_res": 1.0, "aperiodic_params_": [0.5380497841007739, 1.148798732580575], "gaussian_params_": [[6.182706429795653, 0.15504002233321373, 1.2997842542230549], [9.481305507294818, 1.1322851446579596, 0.27435061355843476], [15.29089711736516, 0.12103577865453233, 4.103132717757903], [48.7945162148557, 0.17117659273853494, 0.7094399818683584], [52.372044688703, 0.37898986995781814, 0.2500162515212675], [60.079756025869486, 0.10710692364633112, 4.011786367632652], [67.38321323607694, 0.07920754763963576, 1.6983589836713406], [71.08203016045019, 0.12187691097800499, 0.9981811209544932], [77.25573594978563, 0.22021867020576927, 2.354900548381744]], "peak_params_": [[6.182706429795653, 0.1628386460392966, 2.5995685084461098], [9.481305507294818, 0.29518235367334156, 0.5487012271168695], [15.29089711736516, 0.12073197999881502, 8.206265435515807], [48.7945162148557, 0.16650816460207518, 1.4188799637367169], [52.372044688703, 0.13935037101832393, 0.500032503042535], [60.079756025869486, 0.1070919966024595, 8.023572735265304], [67.38321323607694, 0.10145465582809243, 3.3967179673426813], [71.08203016045019, 0.13876836575969365, 1.9963622419089864], [77.25573594978563, 0.21893863409779502, 4.709801096763488]], "r_squared_": 0.9900580863662181, "error_": 0.03204635185046113}
{"freq_range": [2.0, 80.0], "freq_res": 1.0, "aperiodic_params_": [0.44768095910621863, 1.077420606234438], "gaussian_params_": [[6.329612257202149, 0.15567534631798421, 0.8870561022757205], [9.46538192761968, 0.9892135627544824, 0.2793718416560732], [17.20421375942662, 0.13107640265006507, 3.617945809023681], [28.44544962197424, 0.5294226204745518, 0.27101276980685374], [50.82172295084666, 0.10115568226312842, 3.7173212210516025], [59.3097193355288, 0.11628065885528628, 2.1455486413568683], [61.039578628225904, 0.10869386793416132, 0.2500000605678482], [67.37832414677143, 0.32984688132602097, 0.25097361944831537], [76.41833185163088, 0.14975737371863712, 5.1387470660525265]], "peak_params_": [[6.329612257202149, 0.1463746414477167, 1.774112204551441], [9.46538192761968, 0.258709828220324, 0.5587436833121464], [17.20421375942662, 0.13086776411043444, 7.235891618047362], [28.44544962197424, 0.13866707829183578, 0.5420255396137075], [50.82172295084666, 0.10110445564971182, 7.434642442103205], [59.3097193355288, 0.12454859923013717, 4.291097282713737], [61.039578628225904, 0.1966427143606686, 0.5000001211356964], [67.37832414677143, 0.13401528485891356, 0.5019472388966307], [76.41833185163088, 0.14926196202199282, 10.277494132105053]], "r_squared_": 0.9895522859963228, "error_": 0.03180509531231122}
{"freq_range": [2.0, 80.0], "freq_res": 1.0, "aperiodic_params_": [0.17309215864894, 0.8091227782715555], "gaussian_params_": [[9.322501706018171, 0.40188853165377814, 0.2500023748838084], [17.108856099396025, 0.19071816183920376, 1.7692541191907796], [31.89793308754198, 0.19861665711372425, 1.1732507256667817], [43.53598021657261, 0.5652208116987855, 0.2869228626850501], [50.93359298871207, 0.09274273363711599, 4.328937576535823], [59.18410188956344, 0.12057145945729804, 0.7380594068638285], [60.588191859702505, 0.4242647108824063, 0.2725426388553221], [75.81119004864841, 0.13682144478264585, 1.23101616168145]], "peak_params_": [[9.322501706018171, 0.174890788440474, 0.5000047497676168], [17.108856099396025, 0.19035751990788186, 3.538508238381559], [31.89793308754198, 0.1978730062362204, 2.3465014513335634], [43.53598021657261, 0.1785734731678753, 0.5738457253701001], [50.93359298871207, 0.09273182200864039, 8.657875153071647], [59.18410188956344, 0.13322052891986091, 1.476118813727657], [60.588191859702505, 0.1475337859501129, 0.5450852777106442], [75.81119004864841, 0.13522154248792995, 2.4620323233629]], "r_squared_": 0.980130614120977, "error_": 0.031128901473582816}
{"freq_range": [2.0, 80.0], "freq_res": 1.0, "aperiodic_params_": [-0.05056107110842592, 0.6851145696409588], "gaussian_params_": [[2.9199161120680235, 0.19263953687500254, 0.7574327057028917], [9.37778231748436, 0.5367246267826545, 0.2753778156589054], [18.896232201229967, 0.1340227317384834, 1.551697412288769], [28.01112874499435, 0.15859454873609466, 0.2500006580677213], [32.57062506853312, 0.4198164345570871, 0.3004757844174724], [35.36559838256324, 0.2869670655696773, 0.40200331989046484], [38.4836301158426, 0.16279629325717393, 0.8811699121061444], [44.02074779241695, 0.16185459866900068, 0.851679900915421], [46.38031841525037, 0.3209012998257456, 0.33613241991996134], [48.570688644198555, 0.6147572835727119, 0.29868827161915235], [54.43724419929811, 0.2222121431688808, 0.5852356303568503], [57.97730430327929, 0.16047840652491474, 0.7576594214304521], [61.406622634976586, 0.3184037309115683, 0.29477139303917216], [66.22042519317267, 0.09227376069530256, 2.9534885596140374], [71.81037276096669, 0.05331286663535988, 1.0635635016703173], [75.43562030676956, 0.5424476901006375, 0.28120541543583094]], "peak_params_": [[2.9199161120680235, 0.1915657837433735, 1.5148654114057833], [9.37778231748436, 0.20944742309350856, 0.5507556313178108], [18.896232201229967, 0.13372338526555483, 3.103394824577538], [28.01112874499435, 0.15843749770890125, 0.5000013161354426], [32.57062506853312, 0.15123285370854922, 0.6009515688349448], [35.36559838256324, 0.1898381926369298, 0.8040066397809297], [38.4836301158426, 0.14003347741059635, 1.7623398242122887], [44.02074779241695, 0.16180657923667985, 1.703359801830842], [46.38031841525037, 0.18006663482448815, 0.6722648398399227], [48.570688644198555, 0.21882660848764657, 0.5973765432383047], [54.43724419929811, 0.16811374113640687, 1.1704712607137007], [57.97730430327929, 0.16232464790265055, 1.5153188428609041], [61.406622634976586, 0.14236765621559644, 0.5895427860783443], [66.22042519317267, 0.0920171553643514, 5.906977119228075], [71.81037276096669, 0.06607262482668164, 2.1271270033406346], [75.43562030676956, 0.16510769579274687, 0.5624108308716619]], "r_squared_": 0.982380489296831, "error_": 0.021847930329612252}
{"freq_range": [2.0, 80.0], "freq_res": 1.0, "aperiodic_params_": [-0.6519712153733878, 0.16651512580340677], "gaussian_params_": [[14.882213778432662, 0.20460370374071388, 0.5763336867730052], [20.253640265813452, 0.5320588431029514, 2.4305204868936463], [29.850029328026867, 0.26412744953966766, 1.0773387239052152], [35.41417386301194, 0.27713434756860356, 1.8902875770698881], [38.592657410794494, 0.7960329950507841, 0.25600463710602817], [42.629115959950234, 0.3575949188134119, 2.452247536375492], [56.48397239107714, 0.19320151015864645, 5.857532540479445]], "peak_params_": [[14.882213778432662, 0.25182715545500645, 1.1526673735460105], [20.253640265813452, 0.5291695903842715, 4.861040973787293], [29.850029328026867, 0.2663442378091284, 2.1546774478104305], [35.41417386301194, 0.27362510592976164, 3.7805751541397763], [38.592657410794494, 0.3921839798344162, 0.5120092742120563], [42.629115959950234, 0.36727230062908667, 4.904495072750984], [56.48397239107714, 0.19254329379215718, 11.71506508095889]], "r_squared_": 0.8199283545348314, "error_": 0.05234238379902131}
{"freq_range": [2.0, 80.0], "freq_res": 1.0, "aperiodic_params_": [-0.025112677256930054, 0.8256468291233774], "gaussian_params_": [[9.477951836521468, 0.33095468420053586, 0.7633875570089884], [12.448375334510144, 0.6525010516517507, 0.27804547661414014], [18.21641638957007, 0.2659730873985306, 1.4056195165271193], [20.456717293279524, 0.6025698082926401, 0.2746056838423411], [22.046301594389394, 0.25988647973833784, 1.005160865024428], [30.727256920405043, 0.12943229568454256, 1.815336146299594], [38.59491560613919, 0.4777486419174878, 0.2501839921370585], [41.307998688372386, 0.1952563292155345, 3.3408269354864997], [48.63237861660442, 0.36195105148860274, 0.250003663062007], [54.19005924108185, 0.12245667524200107, 1.8072333286113025]], "peak_params_": [[9.477951836521468, 0.272049775879183, 1.5267751140179768], [12.448375334510144, 0.17921198373896718, 0.5560909532282803], [18.21641638957007, 0.26291790985312624, 2.8112390330542385], [20.456717293279524, 0.30275677429148007, 0.5492113676846822], [22.046301594389394, 0.26671598140821096, 2.010321730048856], [30.727256920405043, 0.12965207714955063, 3.630672292599188], [38.59491560613919, 0.2826088743391659, 0.500367984274117], [41.307998688372386, 0.1944283205892685, 6.681653870972999], [48.63237861660442, 0.1385469046584129, 0.500007326124014], [54.19005924108185, 0.12192476789381068, 3.614466657222605]], "r_squared_": 0.9764820563694698, "error_": 0.04015268986678002}
{"freq_range": [2.0, 80.0], "freq_res": 1.0, "aperiodic_params_": [0.35130831046022615, 1.07505015994458], "gaussian_params_": [[9.36510950246965, 0.37467056614702915, 1.0345241558854845], [12.496402860460696, 0.6405682217198689, 0.2996141926070742], [16.408176422376446, 0.14541887440017487, 0.2868561859341826], [18.364971101451797, 0.14381154494509094, 2.7616393396844674], [59.807660274603776, 0.07656805637657807, 5.423859267290478], [67.3405833649823, 0.39294446367494035, 0.2536789272930973], [71.40102188654909, 0.3717975782807496, 0.2683721141546288], [75.04367666816752, 0.09710418345716866, 0.25000006878598313], [78.03997541222233, 0.11095592720183378, 1.9276353587106496]], "peak_params_": [[9.36510950246965, 0.35250638767194853, 2.069048311770969], [12.496402860460696, 0.1870876005604124, 0.5992283852141485], [16.408176422376446, 0.1525050365336439, 0.5737123718683652], [18.364971101451797, 0.14256116649411876, 5.523278679368935], [59.807660274603776, 0.07651992788420614, 10.847718534580956], [67.3405833649823, 0.19134296203831247, 0.5073578545861946], [71.40102188654909, 0.13099218139591962, 0.5367442283092576], [75.04367666816752, 0.12914374005407114, 0.5000001375719663], [78.03997541222233, 0.11120819027275775, 3.8552707174212992]], "r_squared_": 0.9869864686047485, "error_": 0.036945434412838554}
{"freq_range": [2.0, 80.0], "freq_res": 1.0, "aperiodic_params_": [0.48717449257337075, 1.1392242742577983], "gaussian_params_": [[6.29988062736428, 0.1420450333414396, 0.9258099929735489], [9.506222430019575, 0.4255534265817331, 0.8226511333212103], [12.752215451306963, 0.16933089707795537, 0.8678324112022874], [16.030611115502577, 0.06775097055618158, 0.25060990595164623], [17.546918613639676, 0.1803090958789902, 1.4334194309404549], [28.41813162551747, 0.39752467519063484, 0.2686525481877886], [48.53708038464993, 0.13977863964703333, 0.6794128620347558], [51.99936082678322, 0.08765375823911632, 0.25000000000000017], [55.747189669196025, 0.0681801341192983, 1.4774801464030423], [58.99951478770109, 0.10681030672914246, 0.25067386087764226], [61.112538421864265, 0.19379685382092343, 0.6608027374761521], [64.66878803703857, 0.1804158546208054, 0.3321663500800146], [67.03433883771218, 0.1903777865553783, 0.6201278524831063], [70.99775059936843, 0.12415416704655616, 0.5166826698835346], [77.85957452197508, 0.1583907820564608, 3.863148259440563]], "peak_params_": [[6.29988062736428, 0.13483386588036916, 1.8516199859470979], [9.506222430019575, 0.356560681487874, 1.6453022666424206], [12.752215451306963, 0.1637968894624401, 1.7356648224045748], [16.030611115502577, 0.168122689140353, 0.5012198119032925], [17.546918613639676, 0.17152309881829186, 2.8668388618809098], [28.41813162551747, 0.11839919177785951, 0.5373050963755772], [48.53708038464993, 0.11082558574267232, 1.3588257240695116], [51.99936082678322, 0.09038840500513112, 0.5000000000000003], [55.747189669196025, 0.06718932164805258, 2.9549602928060845], [58.99951478770109, 0.11402220306867616, 0.5013477217552845], [61.112538421864265, 0.1911410090666681, 1.3216054749523043], [64.66878803703857, 0.11124029145884795, 0.6643327001600292], [67.03433883771218, 0.19313269355010165, 1.2402557049662126], [70.99775059936843, 0.15689340314687628, 1.0333653397670692], [77.85957452197508, 0.15828617390568112, 7.726296518881126]], "r_squared_": 0.9950395979684097, "error_": 0.021268367389357366}
{"freq_range": [2.0, 80.0], "freq_res": 1.0, "aperiodic_params_": [0.5762397999119361, 1.1729474946239682], "gaussian_params_": [[6.032212498270562, 0.16283733880109436, 1.0388453923781755], [9.596737919949552, 0.3919690896773207, 0.875276973609553], [12.659926949319258, 0.1555233148428671, 0.5609239998069657], [17.173501305204393, 0.15854218320165245, 2.3504443348946373], [28.459833941811777, 0.4779305843325798, 0.28427940014828024], [51.999773422723415, 0.08348057502176184, 0.25000000000002864], [60.31458187524187, 0.08543125618856585, 5.999689506458974], [60.99636042981725, 0.10957290937716156, 0.2500000000001673], [67.24666333010857, 0.15736180490177767, 0.42383700759434034], [70.64002369788086, 0.3145897922676711, 0.28720585280363276], [73.89005188695305, 1.0548899988870037e-32, 2.259208222672906], [77.38317998701234, 0.1785675386200975, 2.859669722107824]], "peak_params_": [[6.032212498270562, 0.162845468775368, 2.077690784756351], [9.596737919949552, 0.35411711088323655, 1.750553947219106], [12.659926949319258, 0.16239073746494415, 1.1218479996139314], [17.173501305204393, 0.15811083407604787, 4.700888669789275], [28.459833941811777, 0.12918877220058256, 0.5685588002965605], [51.999773422723415, 0.116182735930215, 0.5000000000000573], [60.31458187524187, 0.08535286135250941, 11.999379012917949], [60.99636042981725, 0.19443688864594422, 0.5000000000003346], [67.24666333010857, 0.17901141544257548, 0.8476740151886807], [70.64002369788086, 0.17570163498675062, 0.5744117056072655], [73.89005188695305, 0.09502527061433486, 4.518416445345812], [77.38317998701234, 0.17875877725534295, 5.719339444215648]], "r_squared_": 0.9920727698265495, "error_": 0.028631239341311267}
{"freq_range": [2.0, 80.0], "freq_res": 1.0, "aperiodic_params_": [0.5177378499530334, 1.142609828233562], "gaussian_params_": [[9.47682860743429, 1.3159958965983936, 0.25662769527398216], [13.348386276924586, 0.14152050582208642, 5.9999999999999964], [28.463381952304893, 0.6274362916026974, 0.27459067862068226], [56.90513026957863, 0.10350784451953822, 5.999999999998055], [60.93215000342221, 0.1305113892001092, 0.2502559567869575], [67.24180014038268, 0.18925505501016288, 0.46978366581190595], [70.80468805984599, 0.12891272378522262, 0.6066387016414588], [77.15190750383552, 0.2066994923057255, 3.12910683715777]], "peak_params_": [[9.47682860743429, 0.3430314658908747, 0.5132553905479643], [13.348386276924586, 0.14128214056613775, 11.999999999999993], [28.463381952304893, 0.15824944874378166, 0.5491813572413645], [56.90513026957863, 0.1034949066697799, 11.99999999999611], [60.93215000342221, 0.2078053010612364, 0.500511913573915], [67.24180014038268, 0.19198181673619108, 0.9395673316238119], [70.80468805984599, 0.15888099142251533, 1.2132774032829177], [77.15190750383552, 0.2068356254444148, 6.25821367431554]], "r_squared_": 0.9889982452833022, "error_": 0.03345804784928105}
{"freq_range": [2.0, 80.0], "freq_res": 1.0, "aperiodic_params_": [0.4044144772353222, 1.041715004347407], "gaussian_params_": [[6.464783780413362, 0.5279295746858683, 0.2765528122259108], [9.336847876407909, 0.3648764403732096, 0.5661537324582836], [12.384681478879878, 0.11825745322767728, 1.1677842973292858], [18.059534333092532, 0.13874400201508927, 2.1347531411578027], [28.280039642488866, 0.20475008461357536, 0.5766975304680386], [32.56056818191703, 0.5454915929150944, 0.25005341705980855], [60.90359381892021, 0.19017606966652592, 0.48421426228077824], [66.97183660089668, 0.10034548233634887, 0.25004886772237983], [72.452034599136, 0.053814211707802324, 5.999999999999999], [76.85903895673712, 0.13335327516687634, 1.7818233663642256]], "peak_params_": [[6.464783780413362, 0.12859909451120127, 0.5531056244518217], [9.336847876407909, 0.307476493888347, 1.1323074649165672], [12.384681478879878, 0.11448751362807386, 2.3355685946585716], [18.059534333092532, 0.13869118559864546, 4.269506282315605], [28.280039642488866, 0.18198155145751604, 1.1533950609360772], [32.56056818191703, 0.11645963714419882, 0.5001068341196171], [60.90359381892021, 0.19514996625478465, 0.9684285245615565], [66.97183660089668, 0.13532347380469223, 0.5000977354447597], [72.452034599136, 0.05689896357365676, 11.999999999999998], [76.85903895673712, 0.17331361863706407, 3.563646732728451]], "r_squared_": 0.9872776893268039, "error_": 0.03251292968667964}
{"freq_range": [2.0, 80.0], "freq_res": 1.0, "aperiodic_params_": [0.10847073365306105, 0.7431488511566094], "gaussian_params_": [[9.41084087183318, 0.8621067291980014, 0.272933288605664], [18.578204366385446, 0.25955647261222353, 2.699520171975401], [28.453002590599564, 0.6820979983972943, 0.27129072415865696], [32.48744631255716, 0.27149016451040836, 0.5890562159807594], [35.41126596042534, 0.2296401973334548, 0.7920261823365999], [38.91579093867532, 0.23481120760515006, 0.5097604657299617], [42.92519814886729, 0.12502697487453368, 1.1403615672977387], [53.33804170548603, 0.10694722800318306, 5.999999999999999]], "peak_params_": [[9.41084087183318, 0.27815272626136794, 0.545866577211328], [18.578204366385446, 0.2564073921154708, 5.399040343950802], [28.453002590599564, 0.16979647977948664, 0.5425814483173139], [32.48744631255716, 0.19299342927554264, 1.1781124319615188], [35.41126596042534, 0.20170967145087748, 1.5840523646731999], [38.91579093867532, 0.23812528513715203, 1.0195209314599234], [42.92519814886729, 0.1489971944452927, 2.2807231345954775], [53.33804170548603, 0.10677762520526413, 11.999999999999998]], "r_squared_": 0.9789974069372122, "error_": 0.030565995509464844}
{"freq_range": [2.0, 80.0], "freq_res": 1.0, "aperiodic_params_": [-0.7507354031581506, -0.2778355384176533], "gaussian_params_": [[9.215095572635558, 0.21591737953519083, 0.6235474989374692], [18.724144306969624, 0.17794952294659291, 1.9872479919721855], [22.425413931122904, 0.5416717512199628, 0.25989041668380863], [39.34552282895132, 0.2462998264318733, 0.6767945983924615], [51.452035048063756, 0.11291515772371466, 5.99999999999024], [56.360818623955986, 0.38025699061273865, 0.2524517960767778], [64.89890177670259, 0.17232940752272932, 5.999999999999456], [75.20110438191308, 0.16537403361604813, 1.8611780369706903]], "peak_params_": [[9.215095572635558, 0.2034467955657019, 1.2470949978749384], [18.724144306969624, 0.17624334861278385, 3.974495983944371], [22.425413931122904, 0.1876085330252042, 0.5197808333676173], [39.34552282895132, 0.22932780554103746, 1.353589196784923], [51.452035048063756, 0.12437464598152281, 11.99999999998048], [56.360818623955986, 0.27902020301724645, 0.5049035921535556], [64.89890177670259, 0.18112804817470482, 11.999999999998913], [75.20110438191308, 0.20623734222808926, 3.7223560739413806]], "r_squared_": 0.6844643657425596, "error_": 0.0770814550685822}
{"freq_range": [2.0, 80.0], "freq_res": 1.0, "aperiodic_params_": [-0.5173096123911999, 0.6909731311752245], "gaussian_params_": [[9.423525507528629, 0.4754908479690467, 0.935992347128807], [11.921119760416799, 0.30288351411429204, 0.803073615566516], [52.78492462816484, 0.08742741261813483, 5.9999991851360335], [63.47413410894981, 0.10462246990516184, 2.647516349491563], [71.3821863995882, 0.5604240023185736, 0.25003293224897544], [72.54003180240025, 0.7299161481107977, 0.27468605878519115], [77.3523467956689, 0.16060826477476944, 2.434593858043673]], "peak_params_": [[9.423525507528629, 0.42962797100624006, 1.871984694257614], [11.921119760416799, 0.3121851703812619, 1.606147231133032], [52.78492462816484, 0.08741303715290649, 11.999998370272067], [63.47413410894981, 0.12348088142935199, 5.295032698983126], [71.3821863995882, 0.18229754373101592, 0.5000658644979509], [72.54003180240025, 0.21258698194801373, 0.5493721175703823], [77.3523467956689, 0.15896066295924816, 4.869187716087346]], "r_squared_": 0.9344440806198896, "error_": 0.0502149597588395}
{"freq_range": [2.0, 80.0], "freq_res": 1.0, "aperiodic_params_": [-0.03147477262456509, 0.8686743874247408], "gaussian_params_": [[9.497355943733897, 0.4818814260537736, 1.0766057606293982], [12.260710069912149, 0.355874663790471, 0.6939088076991706], [17.46271421862636, 0.21378343617517584, 1.3215608438034738], [22.21470783412495, 0.15352771275898838, 1.8470452363402101], [75.42771514641075, 0.731643813305277, 0.26936551895352995]], "peak_params_": [[9.497355943733897, 0.4331156018828174, 2.1532115212587963], [12.260710069912149, 0.3639912157705131, 1.3878176153983413], [17.46271421862636, 0.2039264399039422, 2.6431216876069477], [22.21470783412495, 0.1530832751963478, 3.6940904726804202], [75.42771514641075, 0.20739841934329495, 0.5387310379070599]], "r_squared_": 0.9723612320405358, "error_": 0.04765896457526476}
{"freq_range": [2.0, 80.0], "freq_res": 1.0, "aperiodic_params_": [0.3515068142398789, 1.0836384106626002], "gaussian_params_": [[9.484657379863581, 0.46954077506278585, 0.9106933459916314], [12.18471779067455, 0.3118958283956366, 0.7048940192245394], [18.93670734722843, 0.14939056396081596, 4.256864246465564], [59.15036330546952, 0.0963151021412192, 5.999998140490242], [67.39904770700586, 0.4486633424421561, 0.2800808651921816], [71.86010942620257, 0.12650846303377392, 0.9851772165368463], [75.04136395433135, 0.1340281788498724, 0.2501072231404939], [78.27933505966243, 0.16824861152882606, 2.5127233755031897]], "peak_params_": [[9.484657379863581, 0.4173513840319125, 1.8213866919832629], [12.18471779067455, 0.351324689710241, 1.4097880384490789], [18.93670734722843, 0.14937405211264654, 8.513728492931127], [59.15036330546952, 0.09628486242545753, 11.999996280980485], [67.39904770700586, 0.2035383472539647, 0.5601617303843632], [71.86010942620257, 0.1423719753536381, 1.9703544330736926], [75.04136395433135, 0.2077305805950027, 0.5002144462809878], [78.27933505966243, 0.1679048329053039, 5.025446751006379]], "r_squared_": 0.9864719733850998, "error_": 0.03818037621313676}
{"freq_range": [2.0, 80.0], "freq_res": 1.0, "aperiodic_params_": [0.48343444222648285, 1.1537096665789282], "gaussian_params_": [[9.486180690448684, 1.13954681467986, 0.27510011711124766], [10.601219656399682, 0.23206396472096227, 2.4766754847836], [16.123961996394637, 0.09364754634001018, 0.25011817615471066], [17.93181672405761, 0.21582185900298517, 1.2783565100008336], [58.70693517397062, 0.09399560320476032, 5.999999999999999], [60.997653773213, 0.12872795973996598, 0.2500470500835799], [65.07547339725572, 0.1044303284326752, 0.5914241471545404], [67.41756002635637, 0.3613052699031063, 0.2997527478868824], [71.36003429200751, 0.2339607156420042, 0.2518504916204977], [78.47997128937612, 0.1785136197881564, 4.662094405691193]], "peak_params_": [[9.486180690448684, 0.4273617128321885, 0.5502002342224953], [10.601219656399682, 0.22907556810726593, 4.9533509695672], [16.123961996394637, 0.1732891955196043, 0.5002363523094213], [17.93181672405761, 0.21819232016392842, 2.5567130200016672], [58.70693517397062, 0.09391242126688315, 11.999999999999998], [60.997653773213, 0.21625622039452597, 0.5000941001671598], [65.07547339725572, 0.16054293297955402, 1.1828482943090808], [67.41756002635637, 0.18222861203242147, 0.5995054957737648], [71.36003429200751, 0.14501830596243437, 0.5037009832409954], [78.47997128937612, 0.17810453707610852, 9.324188811382387]], "r_squared_": 0.9899859329515222, "error_": 0.03308654209304996}
{"freq_range": [2.0, 80.0], "freq_res": 1.0, "aperiodic_params_": [0.5631827195623029, 1.1732221866119836], "gaussian_params_": [[9.66959101653457, 0.3807578851902336, 0.8750174123629599], [14.802198712763744, 0.15464171443179742, 5.103738349372966], [28.45631655107241, 0.4037820752326539, 0.28459821409765096], [58.536598593870025, 0.08904621478108461, 5.8102931038402605], [60.94309584465092, 0.10997883133579195, 0.2500223819072757], [65.46006013986982, 0.30456340244972946, 0.27541544351484093], [67.4140274924155, 0.4369083169927716, 0.26974542042573535], [70.58870890522518, 0.5463534065678906, 0.2529533411014988], [74.94203845596466, 0.12242502528523645, 2.2607904490762856], [77.47921777964497, 0.49369894540376974, 0.2959924291255347], [79.50312324549755, 0.20743078784286081, 0.6689541957759374]], "peak_params_": [[9.66959101653457, 0.4538879471553656, 1.7500348247259199], [14.802198712763744, 0.154525622361254, 10.207476698745932], [28.45631655107241, 0.11712311885973148, 0.5691964281953019], [58.536598593870025, 0.0887634576064309, 11.620586207680521], [60.94309584465092, 0.18855914385016748, 0.5000447638145514], [65.46006013986982, 0.12343999733920907, 0.5508308870296819], [67.4140274924155, 0.1656101578878404, 0.5394908408514707], [70.58870890522518, 0.18137142953238605, 0.5059066822029976], [74.94203845596466, 0.12399253119138942, 4.521580898152571], [77.47921777964497, 0.21478663916322271, 0.5919848582510694], [79.50312324549755, 0.16754418857826958, 1.3379083915518748]], "r_squared_": 0.9913097333785645, "error_": 0.03154328857548471}
{"freq_range": [2.0, 80.0], "freq_res": 1.0, "aperiodic_params_": [0.49749219313392656, 1.1352741313968633], "gaussian_params_": [[6.257978122914239, 0.13858955210106536, 0.5447579652758529], [9.417278056887229, 0.438691628835103, 0.7543097654203266], [11.960545348458927, 0.14183833004291382, 1.5838419837255753], [18.21812874209757, 0.1583339851592306, 2.2826627593933106], [28.179128636370343, 0.15102727459796766, 0.654703111450843], [56.16039221584717, 0.10788942213174442, 1.2128540497566935], [59.392545637089434, 0.3049686420949391, 0.2721097106587739], [60.995975358317615, 0.1701395248998511, 0.5275014352501554], [64.97967867442968, 0.03843579307221918, 0.2500161531636079], [69.54796540086404, 0.13866311174517304, 5.999999999999999]], "peak_params_": [[6.257978122914239, 0.1240235220361085, 1.0895159305517057], [9.417278056887229, 0.4012184639720856, 1.5086195308406531], [11.960545348458927, 0.14691754667674484, 3.1676839674511506], [18.21812874209757, 0.15771144254486125, 4.565325518786621], [28.179128636370343, 0.14549520964132667, 1.309406222901686], [56.16039221584717, 0.11778509385483549, 2.425708099513387], [59.392545637089434, 0.14439756572308315, 0.5442194213175477], [60.995975358317615, 0.22043263473570707, 1.0550028705003107], [64.97967867442968, 0.14234844388335155, 0.5000323063272158], [69.54796540086404, 0.13827014510439906, 11.999999999999998]], "r_squared_": 0.9834570086951637, "error_": 0.04009800863130218}
{"freq_range": [2.0, 80.0], "freq_res": 1.0, "aperiodic_params_": [0.3988533166231502, 1.0593545225351153], "gaussian_params_": [[6.385979210641862, 0.39874656248861085, 0.2719535711595214], [9.356541337523993, 0.48818006801167535, 0.7815384728522587], [12.483193485107911, 0.1573026731648251, 1.1223604156699027], [18.530502661034983, 0.1720131155350963, 2.2653264957568933], [28.21663717195278, 0.2507169570892682, 0.569141668615602], [51.96982277516606, 0.07002345057336061, 0.2500012943373223], [57.54167417885496, 0.0920616531674236, 4.3750558700045445], [61.05124632366896, 0.11817616964239173, 0.25000919867731985], [67.39244203138598, 0.38526095559230666, 0.2851619155615042], [76.9889314471591, 0.1575782279717044, 3.7677282972685116]], "peak_params_": [[6.385979210641862, 0.14568905959066875, 0.5439071423190428], [9.356541337523993, 0.44123232305843785, 1.5630769457045175], [12.483193485107911, 0.1476783031496084, 2.2447208313398055], [18.530502661034983, 0.16835817766732442, 4.5306529915137865], [28.21663717195278, 0.23322420782765318, 1.138283337231204], [51.96982277516606, 0.11079006728871366, 0.5000025886746446], [57.54167417885496, 0.09155835580614102, 8.750111740009089], [61.05124632366896, 0.18309812814671456, 0.5000183973546397], [67.39244203138598, 0.16303432556339703, 0.5703238311230084], [76.9889314471591, 0.15758221173878262, 7.535456594537023]], "r_squared_": 0.9902773086777048, "error_": 0.028935869779143922}
{"freq_range": [2.0, 80.0], "freq_res": 1.0, "aperiodic_params_": [0.28950125998971926, 0.9441241063083325], "gaussian_params_": [[9.344789086379459, 0.46477814685260044, 0.837789517746378], [17.857934140106874, 0.11133310498593006, 3.6533513374686715], [28.32658933620209, 0.27543708803826455, 0.42269343081600064], [55.45686326101406, 0.39543486623901025, 0.25662888940156636], [58.45203459913595, 0.057606993502954305, 5.999999999997308], [67.34384887920322, 0.29139733204914053, 0.25002245024649883], [72.67523550746509, 0.2688069060519059, 0.2500093565852559], [75.4082998255987, 0.3724700736201097, 0.26730792428023803], [77.3038096332986, 0.1253308331028367, 0.8138213323008915]], "peak_params_": [[9.344789086379459, 0.4329283802127124, 1.675579035492756], [17.857934140106874, 0.1112489603016863, 7.306702674937343], [28.32658933620209, 0.20671944279904808, 0.8453868616320013], [55.45686326101406, 0.12989227857936703, 0.5132577788031327], [58.45203459913595, 0.05744373720185836, 11.999999999994616], [67.34384887920322, 0.13406293443788808, 0.5000449004929977], [72.67523550746509, 0.1186638223863985, 0.5000187131705118], [75.4082998255987, 0.11956580142123285, 0.5346158485604761], [77.3038096332986, 0.11737953689331504, 1.627642664601783]], "r_squared_": 0.987153037804662, "error_": 0.029056478254787712}
{"freq_range": [2.0, 80.0], "freq_res": 1.0, "aperiodic_params_": [0.060360879833510565, 0.8239783610865673], "gaussian_params_": [[2.97158701552779, 0.10569764641818101, 0.5767130449630072], [9.039436258559084, 0.41219857099929097, 0.6916769217856519], [10.526443499041665, 0.17162939279665818, 1.0429424789247232], [13.642820658755248, 0.19921025667058737, 0.5104028764935726], [28.161146174405573, 0.22152733707202443, 0.505226202154457], [43.566658614325334, 0.32996928373246176, 0.29644809158909785], [45.91040684149855, 0.10910089624869142, 0.2501059005596041], [49.65443197154163, 0.21452713460763242, 0.29601388852531646], [52.433380601045684, 0.2742612675220774, 0.31036880492833946], [54.943402970720925, 0.10793322751798883, 0.2501642412527594], [58.62829625854958, 0.23529384203862685, 0.269189428771047], [60.41395279360185, 0.12289842102703438, 3.327737003969943], [67.11507215530742, 0.2283442908103952, 0.7617889090475787], [70.4848254001563, 0.47477443004543035, 0.2629348463254355], [77.18933435517442, 0.15776626489510243, 3.3963436708642285]], "peak_params_": [[2.97158701552779, 0.1055694470254907, 1.1534260899260145], [9.039436258559084, 0.4703375512297787, 1.3833538435713038], [10.526443499041665, 0.16223954428663045, 2.0858849578494465], [13.642820658755248, 0.15661444681534087, 1.0208057529871453], [28.161146174405573, 0.21054065045864823, 1.010452404308914], [43.566658614325334, 0.11336439099993334, 0.5928961831781957], [45.91040684149855, 0.10233106472009723, 0.5002118011192082], [49.65443197154163, 0.10944740235329475, 0.5920277770506329], [52.433380601045684, 0.10848855364928367, 0.6207376098566789], [54.943402970720925, 0.13792412468769943, 0.5003284825055188], [58.62829625854958, 0.20298485322922177, 0.538378857542094], [60.41395279360185, 0.12195219587604744, 6.655474007939886], [67.11507215530742, 0.24484352012600819, 1.5235778180951574], [70.4848254001563, 0.10563869565379647, 0.525869692650871], [77.18933435517442, 0.15752180774761193, 6.792687341728457]], "r_squared_": 0.9862595939104548, "error_": 0.02499172783849919}
{"freq_range": [2.0, 80.0], "freq_res": 1.0, "aperiodic_params_": [-0.0965628145764916, 0.8490190009570341], "gaussian_params_": [[9.182732791118452, 0.5201417229700748, 0.7531439464208897], [11.2708378133221, 0.42717378821936114, 1.2296918866667934], [53.556562402066234, 0.13944672769214234, 4.652281724900421], [63.970805739080156, 0.18712396429570047, 2.644506015180612], [71.40023540941031, 0.6948987928201701, 0.2688468017702812], [72.65755694309892, 0.301833827203415, 0.4720657460795409], [75.25739688329196, 0.26288494503154436, 0.33137284166148673], [78.31040550066257, 0.20736626263802913, 2.352006220985008]], "peak_params_": [[9.182732791118452, 0.5826957749652469, 1.5062878928417793], [11.2708378133221, 0.44524245129331885, 2.459383773333587], [53.556562402066234, 0.1389678974703552, 9.304563449800842], [63.970805739080156, 0.19833731500572838, 5.289012030361224], [71.40023540941031, 0.23732173005822466, 0.5376936035405624], [72.65755694309892, 0.24878883344144387, 0.9441314921590818], [75.25739688329196, 0.27147336398605204, 0.6627456833229735], [78.31040550066257, 0.20556850479224598, 4.704012441970016]], "r_squared_": 0.9607682740949296, "error_": 0.048512926375347036}
{"freq_range": [2.0, 80.0], "freq_res": 1.0, "aperiodic_params_": [0.12743415034798503, 0.9731666658642685], "gaussian_params_": [[9.306727544656768, 0.5969965971642801, 0.8790572617983275], [11.53136517169772, 0.35029028592076533, 1.2282372278403046], [19.40270462596001, 0.1489084854154359, 3.8580483867697857], [71.06193297562075, 0.09150996705878434, 0.25004555844566256], [75.9644198527431, 0.19359801013165032, 5.999999999999999]], "peak_params_": [[9.306727544656768, 0.6075524906161897, 1.758114523596655], [11.53136517169772, 0.3547931232787206, 2.4564744556806093], [19.40270462596001, 0.1480994953517627, 7.716096773539571], [71.06193297562075, 0.22622657884624298, 0.5000911168913251], [75.9644198527431, 0.19359460620606606, 11.999999999999998]], "r_squared_": 0.9689400713124634, "error_": 0.05607406102446159}
{"freq_range": [2.0, 80.0], "freq_res": 1.0, "aperiodic_params_": [0.3430083854900922, 1.1061060851528992], "gaussian_params_": [[9.874254096157165, 0.530785328053218, 1.416201436647235], [17.435062952274407, 0.16251436851112586, 4.711949694963297], [55.53327591030194, 0.09089114743120238, 5.578843208745519], [60.82472907653288, 0.1318416220042627, 0.5832246359146974], [65.88473077374792, 0.1527284112459298, 1.8001397490983355], [71.33308940663518, 0.3773689129045339, 0.25000382285403816], [72.56923290907004, 0.4950176072956213, 0.26179109420759816], [77.54796540086404, 0.20396636336461152, 3.1115818743621446]], "peak_params_": [[9.874254096157165, 0.575495872740008, 2.83240287329447], [17.435062952274407, 0.1618247999312381, 9.423899389926595], [55.53327591030194, 0.0905736758932878, 11.157686417491037], [60.82472907653288, 0.18610278656868395, 1.1664492718293948], [65.88473077374792, 0.16826185132165206, 3.600279498196671], [71.33308940663518, 0.18227058222843584, 0.5000076457080763], [72.56923290907004, 0.19867339147262153, 0.5235821884151963], [77.54796540086404, 0.20185269171897469, 6.223163748724289]], "r_squared_": 0.9864466188696613, "error_": 0.03944649640349581}
{"freq_range": [2.0, 80.0], "freq_res": 1.0, "aperiodic_params_": [0.5341082924617883, 1.1720971637145263], "gaussian_params_": [[9.731882200585297, 0.613821428420863, 1.1318668791517184], [13.08181864357297, 0.18986844173855805, 0.8680156259280262], [17.643747605693708, 0.16933229122660184, 2.439559338489365], [56.128919893128206, 0.14406691372726046, 1.2712876024937074], [59.22358397441381, 0.20539471539899606, 0.2500607665371822], [60.768219825685605, 0.19740282064348663, 0.5697369659888356], [65.76535033313894, 0.13132434037237153, 2.311214349005411], [70.57712102101387, 0.588502064636262, 0.2503971629850217], [77.68232946683962, 0.20779072845271335, 3.1920515346607363]], "peak_params_": [[9.731882200585297, 0.5984370269456942, 2.2637337583034367], [13.08181864357297, 0.22619154070729264, 1.7360312518560523], [17.643747605693708, 0.16753638192895426, 4.87911867697873], [56.128919893128206, 0.14334548816359716, 2.542575204987415], [59.22358397441381, 0.1523739365500718, 0.5001215330743644], [60.768219825685605, 0.197494056017395, 1.1394739319776712], [65.76535033313894, 0.1309057648518892, 4.622428698010822], [70.57712102101387, 0.17471679409320062, 0.5007943259700434], [77.68232946683962, 0.20676439219329024, 6.384103069321473]], "r_squared_": 0.9888732327675622, "error_": 0.03656090590670761}
{"freq_range": [2.0, 80.0], "freq_res": 1.0, "aperiodic_params_": [0.4746178278361832, 1.1320610064609369], "gaussian_params_": [[9.46307533935311, 1.0256732097178998, 0.29145996949220704], [10.067808734517863, 0.3496636429968254, 1.6557275405721161], [13.516942051662577, 0.6273403836984413, 0.2867736446408776], [16.475239362923563, 0.21189767207512283, 0.28667074136332066], [18.534908353063418, 0.14803016285032022, 2.3239775895242705], [56.241521457354914, 0.15691564604961805, 1.0615831003056324], [59.10728640566274, 0.1672616585398944, 0.2500000315193161], [60.92989422646293, 0.1998394384975235, 0.7389784383276227], [67.16206887335736, 0.17417856224854647, 0.765333233168315], [70.59813610581855, 0.4643487696196458, 0.2626230395055719], [77.36687473722397, 0.19856321965328114, 3.4343659976639747]], "peak_params_": [[9.46307533935311, 0.5743511419684585, 0.5829199389844141], [10.067808734517863, 0.5375130523658551, 3.3114550811442323], [13.516942051662577, 0.194729434617951, 0.5735472892817552], [16.475239362923563, 0.13585069013088957, 0.5733414827266413], [18.534908353063418, 0.1450954378017021, 4.647955179048541], [56.241521457354914, 0.15290668493346016, 2.123166200611265], [59.10728640566274, 0.16451367277107964, 0.5000000630386322], [60.92989422646293, 0.19895130514105497, 1.4779568766552453], [67.16206887335736, 0.17240259444580341, 1.53066646633663], [70.59813610581855, 0.17962392638214486, 0.5252460790111438], [77.36687473722397, 0.1974334942977216, 6.868731995327949]], "r_squared_": 0.9873026880416584, "error_": 0.035529915060571016}
{"freq_range": [2.0, 80.0], "freq_res": 1.0, "aperiodic_params_": [0.41639656738324093, 1.1024761840379051], "gaussian_params_": [[6.130266546476693, 0.16163187153963493, 0.2500006810980145], [9.286098093583387, 0.6632371481986153, 0.8056423189801472], [11.048079129857346, 0.2572521558766644, 0.9289899895157021], [13.5237199202594, 0.7496451564888633, 0.29270796276397437], [16.495296493486556, 0.17102442956093541, 0.29265759215862647], [18.713434572382955, 0.1474528120056321, 2.2639851196971432], [28.083021499246893, 0.203523302684457, 0.5486370908680872], [56.186982837993746, 0.1556776194916593, 1.1963701309955854], [59.14582697441448, 0.1615322306549825, 0.25000411978965226], [60.92469600494914, 0.17547897922399866, 0.6478580361525794], [66.0019890931902, 0.11564802284878102, 1.9636031208849063], [70.55526235919841, 0.48231907575497923, 0.2638221567333417], [77.34395096656637, 0.20414222747099806, 3.245016841181436]], "peak_params_": [[6.130266546476693, 0.14127578371435767, 0.500001362196029], [9.286098093583387, 0.6453663718189053, 1.6112846379602943], [11.048079129857346, 0.32636412462365844, 1.8579799790314042], [13.5237199202594, 0.21802961803193743, 0.5854159255279487], [16.495296493486556, 0.1127413408436514, 0.5853151843172529], [18.713434572382955, 0.1462763303069502, 4.5279702393942864], [28.083021499246893, 0.20123912249341402, 1.0972741817361744], [56.186982837993746, 0.15378807394060634, 2.392740261991171], [59.14582697441448, 0.14840088959671904, 0.5000082395793045], [60.92469600494914, 0.1788546892798335, 1.2957160723051588], [66.0019890931902, 0.11610112143653772, 3.9272062417698126], [70.55526235919841, 0.15121366061900976, 0.5276443134666834], [77.34395096656637, 0.20299872784737616, 6.490033682362872]], "r_squared_": 0.9906845272071464, "error_": 0.02965736124825107}
{"freq_range": [2.0, 80.0], "freq_res": 1.0, "aperiodic_params_": [0.3454381262440678, 1.0547666734298191], "gaussian_params_": [[6.024422353633029, 0.12445330778433873, 0.25000000000000033], [9.064891850532648, 0.5630183629302936, 0.7620377466863799], [10.445929395655671, 0.4040683672645415, 1.069119900930997], [13.560610070323161, 0.7027833576219944, 0.2963788712023369], [16.577613372161125, 0.08913470483263362, 0.3526637467142234], [18.515519293785083, 0.1202547024561871, 2.2353718542995695], [28.13042158585152, 0.2583330133691181, 0.5265503695257714], [56.26959265456015, 0.17317762562040653, 1.16106427291092], [59.118702467463294, 0.1689305530281216, 0.2500310337176969], [60.9962470571543, 0.20822893912034937, 0.7095130631144596], [66.74856705926254, 0.14352860858914432, 1.4303399332529716], [70.65290254427646, 0.2561181259824103, 0.27084566644707436], [77.32773194832104, 0.21228984212053564, 3.183328702473297]], "peak_params_": [[6.024422353633029, 0.12410484815409151, 0.5000000000000007], [9.064891850532648, 0.7229022851364165, 1.5240754933727598], [10.445929395655671, 0.6356696278398012, 2.138239801861994], [13.560610070323161, 0.25142560973590034, 0.5927577424046738], [16.577613372161125, 0.13906945299699847, 0.7053274934284468], [18.515519293785083, 0.11746321692508366, 4.470743708599139], [28.13042158585152, 0.25054369816612065, 1.0531007390515428], [56.26959265456015, 0.16857161587642366, 2.32212854582184], [59.118702467463294, 0.16580887295622637, 0.5000620674353938], [60.9962470571543, 0.20831410731300348, 1.4190261262289192], [66.74856705926254, 0.14242792258673753, 2.860679866505943], [70.65290254427646, 0.14384270298731994, 0.5416913328941487], [77.32773194832104, 0.2111677629043356, 6.366657404946594]], "r_squared_": 0.9888413655650902, "error_": 0.03269328807389212}
{"freq_range": [2.0, 80.0], "freq_res": 1.0, "aperiodic_params_": [0.2645628755261736, 1.0051719756303132], "gaussian_params_": [[8.791271946345578, 0.46597645216750394, 0.624474986850134], [10.1790235056721, 0.6500404783340572, 1.0637614836052787], [13.768529162079147, 0.30893033187224994, 0.5223928545763789], [28.275033566385655, 0.3463914604806486, 0.31141822225071336], [44.426069290731085, 0.10544771768499904, 1.2367414977377877], [56.40184459601721, 0.15567781487300486, 1.2721112756535822], [59.33116696692348, 0.32834316997765645, 0.2501773192872563], [61.19430654997268, 0.19053182760636947, 0.7838711891516721], [66.99286550808667, 0.20119820032644373, 0.8712211048364203], [76.52552690585513, 0.17652639248264687, 3.2009036537700273], [78.23598372993204, 0.07152930304891021, 0.69321450682685]], "peak_params_": [[8.791271946345578, 0.7923720987410836, 1.248949973700268], [10.1790235056721, 0.7124845097396489, 2.1275229672105573], [13.768529162079147, 0.28107073913134084, 1.0447857091527577], [28.275033566385655, 0.23452908768361502, 0.6228364445014267], [44.426069290731085, 0.09937214456825827, 2.4734829954755755], [56.40184459601721, 0.14810122494916245, 2.5442225513071643], [59.33116696692348, 0.15984542682479397, 0.5003546385745126], [61.19430654997268, 0.1849951489217716, 1.5677423783033442], [66.99286550808667, 0.20329898976458338, 1.7424422096728407], [76.52552690585513, 0.18919161861506262, 6.401807307540055], [78.23598372993204, 0.22625945650652568, 1.3864290136537]], "r_squared_": 0.9850730557617426, "error_": 0.03704924356047991}
{"freq_range": [2.0, 80.0], "freq_res": 1.0, "aperiodic_params_": [0.1331516594151427, 0.991963256525666], "gaussian_params_": [[9.439415337307432, 1.8528524166169804, 0.26828144088757777], [10.79550181491338, 0.6355147867851046, 1.8026233011898405], [59.48453930698238, 0.1816411275483221, 5.999999999999999], [75.54796540086404, 0.22606768253726692, 3.8312195310551194]], "peak_params_": [[9.439415337307432, 0.8714932627509157, 0.5365628817751555], [10.79550181491338, 0.6314385519991262, 3.605246602379681], [59.48453930698238, 0.18106989378157556, 11.999999999999998], [75.54796540086404, 0.22861071778441988, 7.662439062110239]], "r_squared_": 0.9714886447679352, "error_": 0.05283668943470479}
{"freq_range": [2.0, 80.0], "freq_res": 1.0, "aperiodic_params_": [0.21172566100972096, 0.9869485766153936], "gaussian_params_": [[9.309363373619192, 0.5172963825536295, 0.5387935321921482], [10.886013990891739, 0.5583672544657976, 1.7755498413412143], [71.07766776252875, 0.1023541155804106, 0.2500188921285153], [72.93129496180978, 0.10418933650246788, 0.25003111567399394], [75.27894097234878, 0.1880088874499293, 5.999999999999999]], "peak_params_": [[9.309363373619192, 0.7563062238430962, 1.0775870643842964], [10.886013990891739, 0.5609825069571798, 3.5510996826824286], [71.07766776252875, 0.24332642920895742, 0.5000377842570306], [72.93129496180978, 0.2752539563521179, 0.5000622313479879], [75.27894097234878, 0.18780582208258267, 11.999999999999998]], "r_squared_": 0.9671493195057975, "error_": 0.05785300999635792}
{"freq_range": [2.0, 80.0], "freq_res": 1.0, "aperiodic_params_": [0.38796049495458723, 1.1269992065365144], "gaussian_params_": [[9.400154550728645, 0.6704855192435265, 0.8787044085977979], [11.452034599137486, 0.30636111505069796, 1.553143903316853], [16.816937991018037, 0.13512958819595527, 4.057508622667986], [59.0339967566827, 0.06583123076062519, 0.25000180403638367], [61.012335470924285, 0.07882196066760239, 0.2500739396100305], [62.45203459945993, 0.10848104291985226, 5.999999999999999], [70.98609236713264, 0.11955912119629551, 0.2500044051063679], [78.33081688534409, 0.20582824783639267, 4.132760851750395]], "peak_params_": [[9.400154550728645, 0.7136756025717514, 1.7574088171955957], [11.452034599137486, 0.469823804380896, 3.106287806633706], [16.816937991018037, 0.13551149793358108, 8.115017245335972], [59.0339967566827, 0.15716272799202757, 0.5000036080727673], [61.012335470924285, 0.18410778510123604, 0.500147879220061], [62.45203459945993, 0.10828964706279232, 11.999999999999998], [70.98609236713264, 0.20137794996339964, 0.5000088102127358], [78.33081688534409, 0.2089474611237896, 8.26552170350079]], "r_squared_": 0.9865854101008025, "error_": 0.04408928069748991}
{"freq_range": [2.0, 80.0], "freq_res": 1.0, "aperiodic_params_": [0.5206051231466154, 1.178296476320976], "gaussian_params_": [[9.600231009750757, 0.8456778872783981, 1.092218752028949], [13.096289617311875, 0.338294242197576, 1.4686249381186138], [16.503348165861357, 0.7699415428190027, 0.2876423426854017], [18.51929018333104, 0.5748796112932588, 0.3053783323855235], [58.45203459913595, 0.08760377954238008, 4.208596405500207], [61.05436648021049, 0.09768933909362981, 0.2501217808382154], [67.28383362198508, 0.12248634203728184, 0.25014028809121774], [73.54796540086404, 0.14936547590709479, 5.999999999999999]], "peak_params_": [[9.600231009750757, 0.8275388639778165, 2.184437504057898], [13.096289617311875, 0.34422466319271866, 2.9372498762372277], [16.503348165861357, 0.1833049682370581, 0.5752846853708034], [18.51929018333104, 0.16663790265074319, 0.610756664771047], [58.45203459913595, 0.09230121084572573, 8.417192811000413], [61.05436648021049, 0.18511256311008228, 0.5002435616764308], [67.28383362198508, 0.15782265814768803, 0.5002805761824355], [73.54796540086404, 0.14903743088589283, 11.999999999999998]], "r_squared_": 0.9869371998340868, "error_": 0.04306806976462778}
{"freq_range": [2.0, 80.0], "freq_res": 1.0, "aperiodic_params_": [0.34839896859640634, 1.0444415257261614], "gaussian_params_": [[9.173219495036413, 0.5537734271247301, 0.7533527990408146], [10.40384931033157, 0.5444092952323075, 1.357829614363534], [13.558711239108554, 0.6975296622828593, 0.29804330837091375], [17.424871662873233, 0.16820610362660146, 2.414961732223357], [56.232689531111845, 0.17587556907585972, 0.982235991979667], [59.09626921212334, 0.17965329776799205, 0.25002270392470366], [60.943803075220444, 0.19406079399024243, 0.889101941783407]], "peak_params_": [[9.173219495036413, 0.8587234937926508, 1.5067055980816293], [10.40384931033157, 0.8255888206604384, 2.715659228727068], [13.558711239108554, 0.31094542619314525, 0.5960866167418275], [17.424871662873233, 0.16562703637897214, 4.829923464446714], [56.232689531111845, 0.17100908608321297, 1.964471983959334], [59.09626921212334, 0.1879253121445812, 0.5000454078494073], [60.943803075220444, 0.1936748885445454, 1.778203883566814]], "r_squared_": 0.9762227209520093, "error_": 0.054643386796570215}
{"freq_range": [2.0, 80.0], "freq_res": 1.0, "aperiodic_params_": [0.3257188323804529, 1.015521356206698], "gaussian_params_": [[9.420579291953187, 0.9386133308225074, 1.0133630761602286], [11.43182408683176, 0.31000482628032083, 1.6700045692552015], [16.547961995197777, 0.1678982816723971, 4.337029644866189], [61.54795421993301, 0.11604777027332581, 5.999999999999999]], "peak_params_": [[9.420579291953187, 1.005463042040164, 2.026726152320457], [11.43182408683176, 0.6525000171537216, 3.340009138510403], [16.547961995197777, 0.16818366713173716, 8.674059289732378], [61.54795421993301, 0.11571887851073615, 11.999999999999998]], "r_squared_": 0.973846303858336, "error_": 0.062121838980990975}
{"freq_range": [2.0, 80.0], "freq_res": 1.0, "aperiodic_params_": [0.10669187854512255, 0.841124811780047], "gaussian_params_": [[9.693289591811888, 1.0112531885173135, 1.1608834254905716], [14.394311252201737, 0.19330380126076022, 3.878049800455342]], "peak_params_": [[9.693289591811888, 1.078292800214701, 2.321766850981143], [14.394311252201737, 0.1933452963700616, 7.756099600910684]], "r_squared_": 0.9666544949490994, "error_": 0.06461538876598773}
{"freq_range": [2.0, 80.0], "freq_res": 1.0, "aperiodic_params_": [0.337136342073984, 1.064043704942964], "gaussian_params_": [[9.65093434329845, 0.8321622988642968, 1.1474178145381038], [12.977945496485578, 0.34075575310381634, 3.1669031321205368]], "peak_params_": [[9.65093434329845, 1.0135275852599386, 2.2948356290762075], [12.977945496485578, 0.3525036246793418, 6.3338062642410735]], "r_squared_": 0.9758536634553949, "error_": 0.06498557290177633}
{"freq_range": [2.0, 80.0], "freq_res": 1.0, "aperiodic_params_": [0.4821343127807148, 1.1912234220447249], "gaussian_params_": [[9.461573360973617, 1.7277468660809085, 0.2888317165184106], [10.162128937738201, 0.645523624124576, 1.800971505100458], [15.533720310048194, 0.27718800768781826, 2.6710378013588185], [60.3725615995462, 0.12433448881298813, 5.999999999999999], [77.6727120650759, 0.19568171461828684, 4.052962333292112]], "peak_params_": [[9.461573360973617, 1.0199748167023128, 0.5776634330368212], [10.162128937738201, 0.9793318479232417, 3.601943010200916], [15.533720310048194, 0.2763713597307471, 5.342075602717637], [60.3725615995462, 0.12410957559030589, 11.999999999999998], [77.6727120650759, 0.1967055805977722, 8.105924666584224]], "r_squared_": 0.9893453518830879, "error_": 0.04272584673474151}
{"freq_range": [2.0, 80.0], "freq_res": 1.0, "aperiodic_params_": [0.404576407990056, 1.1143207042788428], "gaussian_params_": [[9.200345863865602, 0.4887861923250678, 0.6152265610567279], [10.134177929714928, 0.7679433630110625, 1.4938825741589405], [13.537682983960385, 0.994948143098394, 0.2554200727673113], [16.321561121299574, 0.18930553827303065, 3.0365641651879605], [56.616169615077816, 0.2170628485787306, 0.6401823266007195], [59.370453740901446, 0.4472903634838407, 0.25799812802827554], [61.29929650472428, 0.22185409772019396, 0.3176424496734743], [69.54796540086404, 0.12831616873907842, 5.999999999999999]], "peak_params_": [[9.200345863865602, 1.0495475968529415, 1.2304531221134558], [10.134177929714928, 0.9965559286663414, 2.987765148317881], [13.537682983960385, 0.36168807440543604, 0.5108401455346226], [16.321561121299574, 0.18859171793024687, 6.073128330375921], [56.616169615077816, 0.1957599206807441, 1.280364653201439], [59.370453740901446, 0.18712214238307556, 0.5159962560565511], [61.29929650472428, 0.1888343817887943, 0.6352848993469487], [69.54796540086404, 0.12795252499019827, 11.999999999999998]], "r_squared_": 0.9840379688191158, "error_": 0.044275171531646326}
{"freq_range": [2.0, 80.0], "freq_res": 1.0, "aperiodic_params_": [-1.1736221154441158, 0.6484975307181055], "gaussian_params_": [[3.0941330104660407, 0.13421013650094615, 0.6240804146705182], [8.605370451170554, 0.4519758645503562, 0.3018629181158306], [10.551542219179817, 0.27101797424794594, 1.1305136247034087], [18.790757706768762, 0.15959184431010898, 0.7527489458594462], [21.93545645605673, 0.21223519290147838, 0.9330252443043597], [41.03424158652728, 0.1720316269817075, 0.2500010752373195], [59.45203783297259, 0.09064727727216233, 5.999999995926018], [74.59120606536639, 0.35089278128358653, 0.29647448700239704], [78.24299847070998, 0.17429665003548056, 0.5867308004152255]], "peak_params_": [[3.0941330104660407, 0.13269207185593634, 1.2481608293410364], [8.605370451170554, 0.29798698295605286, 0.6037258362316612], [10.551542219179817, 0.25051170737453177, 2.2610272494068173], [18.790757706768762, 0.15504833085602243, 1.5054978917188924], [21.93545645605673, 0.21174601811225702, 1.8660504886087195], [41.03424158652728, 0.17122655790030894, 0.500002150474639], [59.45203783297259, 0.09039038223648, 11.999999991852036], [74.59120606536639, 0.13877794344191674, 0.5929489740047941], [78.24299847070998, 0.16073401265482934, 1.173461600830451]], "r_squared_": 0.9771288241833096, "error_": 0.02727488997054675}
{"freq_range": [2.0, 80.0], "freq_res": 1.0, "aperiodic_params_": [-0.3406233768504575, 0.9595830066733464], "gaussian_params_": [[6.588828854524378, 0.41775044096555997, 0.25640714848078955], [9.96573689176554, 0.19513234617345168, 1.3558263996935822], [48.92590996597208, 0.15329051984582845, 0.6172768966116793], [58.66595583948249, 0.15666411489783738, 1.1011805213052421], [61.15224374410558, 0.1464472988018891, 0.734743045268297], [66.91722938212669, 0.18017639703171673, 0.25001683464793517], [71.39173328736761, 0.7207409590288785, 0.25712803517834004], [76.43315834521253, 0.1945561793895006, 1.8432959788667416]], "peak_params_": [[6.588828854524378, 0.13332249500568527, 0.5128142969615791], [9.96573689176554, 0.19507004800492767, 2.7116527993871644], [48.92590996597208, 0.15219029457985545, 1.2345537932233586], [58.66595583948249, 0.15162573336851515, 2.2023610426104843], [61.15224374410558, 0.1599101697746632, 1.469486090536594], [66.91722938212669, 0.17056872233058606, 0.5000336692958703], [71.39173328736761, 0.2283515373644398, 0.5142560703566801], [76.43315834521253, 0.18925787970495134, 3.686591957733483]], "r_squared_": 0.9826151013227277, "error_": 0.03608098728083793}
{"freq_range": [2.0, 80.0], "freq_res": 1.0, "aperiodic_params_": [-0.31660849490809484, 0.8891958761325727], "gaussian_params_": [[6.636382418598688, 0.3170403621048192, 0.31770321979897703], [9.588825577696156, 0.3349117336835027, 0.86509477379534], [32.9863888288576, 0.12592410679238122, 0.2500000012905953], [48.5743076515137, 0.4774509273584832, 0.2866732415640046], [60.871778533686886, 0.1119085177186569, 3.59917071703529], [63.033470995728365, 0.059935648190322634, 0.2502156242657364], [67.32693939621694, 0.34664429725187446, 0.25281148615293797], [71.277319554542, 0.15320597634752195, 0.6695752891405476], [76.23926185755725, 0.1656715278760464, 1.18975823697942]], "peak_params_": [[6.636382418598688, 0.16849495373983114, 0.6354064395979541], [9.588825577696156, 0.2991409256506363, 1.73018954759068], [32.9863888288576, 0.12573761142246886, 0.5000000025811906], [48.5743076515137, 0.15901488495839167, 0.5733464831280092], [60.871778533686886, 0.11183752530494173, 7.19834143407058], [63.033470995728365, 0.15336080780305905, 0.5004312485314728], [67.32693939621694, 0.17648168323456814, 0.5056229723058759], [71.277319554542, 0.1427581055062508, 1.3391505782810953], [76.23926185755725, 0.1623714609234812, 2.37951647395884]], "r_squared_": 0.976748625058135, "error_": 0.03741051851875106}
{"freq_range": [2.0, 80.0], "freq_res": 1.0, "aperiodic_params_": [-0.31833190900139074, 0.7515466677566637], "gaussian_params_": [[3.114792612653145, 0.1570391045856941, 0.9028492258283732], [9.465069989640623, 0.7259329320932616, 0.2796975674527607], [38.68713083790876, 0.32269251185199344, 0.25000726036369453], [45.58828491292622, 0.5641422165792492, 0.25000404582218255], [48.529844593826894, 0.6214519756198527, 0.2598364978377051], [52.94425293738495, 0.10191753096153708, 0.9118155768104037], [57.44309407825077, 0.43023529812754296, 0.2600569174334159], [59.349355194800786, 0.21275666143366304, 0.42839176823883907], [61.19949691366656, 0.15973515230628904, 0.7437188090709145], [66.60713761901711, 0.41896218838593235, 0.2500011217354289], [70.74586092564653, 0.10806921176112864, 0.8308848681622574], [75.57805841483237, 0.11977611906135557, 0.9624443235020268]], "peak_params_": [[3.114792612653145, 0.15577488871668999, 1.8056984516567465], [9.465069989640623, 0.18219396318530845, 0.5593951349055214], [38.68713083790876, 0.14747349666081289, 0.5000145207273891], [45.58828491292622, 0.14536906198286803, 0.5000080916443651], [48.529844593826894, 0.12091851173811263, 0.5196729956754103], [52.94425293738495, 0.10172722907861376, 1.8236311536208074], [57.44309407825077, 0.10077167934980458, 0.5201138348668318], [59.349355194800786, 0.15458473653166704, 0.8567835364776781], [61.19949691366656, 0.15421756695169453, 1.487437618141829], [66.60713761901711, 0.12188758357477703, 0.5000022434708578], [70.74586092564653, 0.10313194426979977, 1.6617697363245147], [75.57805841483237, 0.10880141257942078, 1.9248886470040536]], "r_squared_": 0.9853511726994342, "error_": 0.02511494494350235}
