{"freq_range": [2.0, 80.0], "freq_res": 1.0, "aperiodic_params_": [-0.10027026364656089, 0.7246623638733821], "gaussian_params_": [[7.573992120519116, 0.5916536269840246, 0.29005243778632633], [9.748952480000282, 0.6739112356781144, 0.963070198187799], [19.588217709567182, 0.456562272938837, 3.0039304960051947], [25.91242846942256, 0.19283212258110335, 0.7825445811489349], [30.835337787472106, 0.15630570860438658, 1.6692752804369206], [41.547965400864015, 0.08171647105947426, 5.999999999999765], [45.07052357060438, 0.19845387028684838, 0.25000121185499374], [54.56427947670791, 0.733387405207668, 0.2682450239414382], [67.92647712399508, 0.1488247276962164, 0.2500000156112992]], "peak_params_": [[7.573992120519116, 0.33103567368481474, 0.5801048755726527], [9.748952480000282, 0.6541994940793234, 1.926140396375598], [19.588217709567182, 0.45242198290397206, 6.007860992010389], [25.91242846942256, 0.24362294581818733, 1.5650891622978698], [30.835337787472106, 0.17330889874750488, 3.3385505608738413], [41.547965400864015, 0.08148488933248821, 11.99999999999953], [45.07052357060438, 0.25996449460460624, 0.5000024237099875], [54.56427947670791, 0.2026823935248454, 0.5364900478828764], [67.92647712399508, 0.14253091032610277, 0.5000000312225984]], "r_squared_": 0.9759515962071498, "error_": 0.03885859716765019}
{"freq_range": [2.0, 80.0], "freq_res": 1.0, "aperiodic_params_": [0.06901191898741535, 0.7616960549190543], "gaussian_params_": [[8.67616672250657, 0.4074305594790058, 0.6824314691119387], [10.412275924754468, 1.3491614565494712, 0.29839098065075714], [20.097774452749082, 0.32903534661087036, 3.5678203606296184], [44.517366418663435, 0.09843613179176931, 5.999999999999999], [54.63028977305426, 0.6992153853880537, 0.25000068815170606], [59.47546472465708, 0.16849855383059942, 1.0649304299194577]], "peak_params_": [[8.67616672250657, 0.36667279193057056, 1.3648629382238775], [10.412275924754468, 0.5875034991853989, 0.5967819613015143], [20.097774452749082, 0.32893511753541915, 7.135640721259237], [44.517366418663435, 0.09811818475908063, 11.999999999999998], [54.63028977305426, 0.2556921963266656, 0.5000013763034121], [59.47546472465708, 0.15785965356190967, 2.1298608598389155]], "r_squared_": 0.9582494651898533, "error_": 0.044886574261271545}
{"freq_range": [2.0, 80.0], "freq_res": 1.0, "aperiodic_params_": [-0.1374522022115733, 0.6497419572265396], "gaussian_params_": [[8.69983647389999, 0.4276584329392802, 0.8387623321049675], [10.328723861949017, 0.5204086191661765, 0.5625383972836622], [19.726697209787226, 0.408597172159686, 2.690810974929546], [25.8622637979223, 0.16847338064548176, 0.6775849152695375], [31.473828969182353, 0.14417649617381936, 2.4062082692182423], [39.17323102322257, 0.11021238414963543, 1.177926146839927], [45.297183674414796, 0.16668104498075953, 1.7178910079338257], [54.53210477938651, 0.745358688748214, 0.27226066833255547], [67.6010796679487, 0.5043865847648689, 0.26939873297256334]], "peak_params_": [[8.69983647389999, 0.43325528823437465, 1.677524664209935], [10.328723861949017, 0.5679489271609222, 1.1250767945673243], [19.726697209787226, 0.4064966687097641, 5.381621949859092], [25.8622637979223, 0.20285032514821033, 1.355169830539075], [31.473828969182353, 0.1414711117729831, 4.8124165384364845], [39.17323102322257, 0.11031105193790092, 2.355852293679854], [45.297183674414796, 0.16420606175622154, 3.4357820158676513], [54.53210477938651, 0.1702296179282654, 0.5445213366651109], [67.6010796679487, 0.16850878485183762, 0.5387974659451267]], "r_squared_": 0.9674130830832385, "error_": 0.04031668714107215}
{"freq_range": [2.0, 80.0], "freq_res": 1.0, "aperiodic_params_": [0.03176284666809431, 0.7320704781879155], "gaussian_params_": [[7.552589448807346, 0.6752915135998744, 0.29596653001686796], [9.687438340154694, 0.5953410948444777, 0.906286418411479], [19.82035068213612, 0.3995071189906219, 3.114728292108253], [31.451500387289027, 0.1288500479241659, 4.370893073312796], [43.25336855465028, 0.2883619177443301, 0.25001631697576754], [44.6096890565721, 0.6079149897046403, 0.3187105401906633], [46.804843487530775, 0.18612488890997106, 0.8027818733577349]], "peak_params_": [[7.552589448807346, 0.32089470522689445, 0.5919330600337359], [9.687438340154694, 0.5637411299100069, 1.812572836822958], [19.82035068213612, 0.4030076414572027, 6.229456584216506], [31.451500387289027, 0.1288012744309064, 8.741786146625593], [43.25336855465028, 0.17648792063727625, 0.5000326339515351], [44.6096890565721, 0.3031126988263362, 0.6374210803813266], [46.804843487530775, 0.18093584466865642, 1.6055637467154698]], "r_squared_": 0.9681713903425877, "error_": 0.04515525637870655}
{"freq_range": [2.0, 80.0], "freq_res": 1.0, "aperiodic_params_": [0.12127636501392171, 0.8055995726578773], "gaussian_params_": [[8.722177503709787, 0.4452023568056802, 0.8731070065513331], [10.4367796281432, 1.5314927241200278, 0.27043619810458386], [20.188156064856866, 0.367607132391765, 3.8386817912151], [44.501586102924485, 0.11505251501234551, 5.999999918145974], [54.632867611154154, 0.6835545885277814, 0.25110170136425486]], "peak_params_": [[8.722177503709787, 0.4284831882361173, 1.7462140131026662], [10.4367796281432, 0.5790241871251796, 0.5408723962091677], [20.188156064856866, 0.36719333000278964, 7.6773635824302], [44.501586102924485, 0.1146562419191488, 11.999999836291948], [54.632867611154154, 0.25962858433930824, 0.5022034027285097]], "r_squared_": 0.9579347299352005, "error_": 0.05696000667552031}
{"freq_range": [2.0, 80.0], "freq_res": 1.0, "aperiodic_params_": [-0.11867429588603487, 0.6268683506080096], "gaussian_params_": [[8.71801733784667, 0.39389354262796167, 0.8232919488988437], [10.40642172549971, 1.1984776267722643, 0.29973702444390726], [20.00774210268576, 0.30875214628579334, 2.9156734883506177], [28.09571074050807, 0.06313812425082518, 3.2541470867512117], [45.40581192911672, 0.6657010172276493, 0.2675506809096143], [54.67553780162628, 0.6577846605291252, 0.2500347127799627], [59.75747254522887, 0.22889764000593912, 1.283560367829698]], "peak_params_": [[8.71801733784667, 0.3717220294198148, 1.6465838977976874], [10.40642172549971, 0.5960014841844171, 0.5994740488878145], [20.00774210268576, 0.31161075862227705, 5.831346976701235], [28.09571074050807, 0.07032194790510748, 6.508294173502423], [45.40581192911672, 0.21072429991578123, 0.5351013618192286], [54.67553780162628, 0.283651099090684, 0.5000694255599254], [59.75747254522887, 0.22484787298067466, 2.567120735659396]], "r_squared_": 0.947493344382679, "error_": 0.04635508756899154}
{"freq_range": [2.0, 80.0], "freq_res": 1.0, "aperiodic_params_": [-0.44105475739313327, 0.29439833287080636], "gaussian_params_": [[9.423104999568267, 0.4575405089825752, 1.2134855424044406], [19.981776577166524, 0.29644266938055835, 2.399813037984464], [45.59375969618473, 0.1342187176058013, 1.7644798184913137], [54.75404919083078, 0.25804113044219235, 0.4570227298061769], [67.54847330853906, 0.7335453666198832, 0.2725069940537502]], "peak_params_": [[9.423104999568267, 0.43056567139812113, 2.4269710848088812], [19.981776577166524, 0.2964341224623851, 4.799626075968928], [45.59375969618473, 0.13070818289022057, 3.5289596369826275], [54.75404919083078, 0.22325440366159144, 0.9140454596123538], [67.54847330853906, 0.18589290552331017, 0.5450139881075003]], "r_squared_": 0.8419222721361002, "error_": 0.05098273995495979}
{"freq_range": [2.0, 80.0], "freq_res": 1.0, "aperiodic_params_": [-0.2635395281868722, 0.3548963065410191], "gaussian_params_": [[8.636135926004641, 0.4189406923322761, 0.8285655182547479], [10.438774968327097, 0.8343155698735301, 0.3069423709409046], [20.07217446167029, 0.31458989647848473, 2.743002943398582], [44.56205536268668, 0.22981359329236342, 1.1704323817015816], [47.44848413356141, 0.7590371002041952, 0.2825655085883548], [53.5535699569249, 0.1831721435800137, 1.8039285084799208], [64.4418631210293, 0.7179010133430508, 0.27193383146797756]], "peak_params_": [[8.636135926004641, 0.3805356648104607, 1.6571310365094958], [10.438774968327097, 0.408790543690176, 0.6138847418818092], [20.07217446167029, 0.31448101496042863, 5.486005886797164], [44.56205536268668, 0.21427856446714322, 2.340864763403163], [47.44848413356141, 0.241900932346096, 0.5651310171767095], [53.5535699569249, 0.1776479990894002, 3.6078570169598416], [64.4418631210293, 0.1917504250708133, 0.5438676629359551]], "r_squared_": 0.8277193062006443, "error_": 0.06322077781889761}
{"freq_range": [2.0, 80.0], "freq_res": 1.0, "aperiodic_params_": [-0.0018972373998597078, 0.6286522654678091], "gaussian_params_": [[7.553302332575489, 0.7021843711143282, 0.2900579804381507], [9.584440154109396, 0.5419518021609889, 0.8829746208524696], [19.93059894002103, 0.3980485248137294, 2.8991943197527483], [26.04111017323114, 0.1554357059608811, 0.6271474684473142], [32.16189704722639, 0.16819480677489018, 2.773320107172697], [43.46196636381816, 0.6518130283162932, 0.2875593112025838], [44.69848421417575, 0.7029084518014246, 0.2500064712322125], [47.18234558576388, 0.2475776358424671, 0.9161747367166679], [53.25055156724244, 0.19108332130023933, 1.8428133566553557], [64.37650862990827, 0.5446004941692167, 0.26861320752911594], [67.71106143323648, 0.1981020719122582, 0.5649556792584701]], "peak_params_": [[7.553302332575489, 0.3229223616950743, 0.5801159608763014], [9.584440154109396, 0.48626308563153847, 1.7659492417049392], [19.93059894002103, 0.3979457104453501, 5.798388639505497], [26.04111017323114, 0.2138422366997874, 1.2542949368946283], [32.16189704722639, 0.16797710737400795, 5.546640214345394], [43.46196636381816, 0.1794358094891959, 0.5751186224051676], [44.69848421417575, 0.3541893693252901, 0.500012942464425], [47.18234558576388, 0.24332913666338918, 1.8323494734333359], [53.25055156724244, 0.18932532187153406, 3.6856267133107115], [64.37650862990827, 0.20391536208248362, 0.5372264150582319], [67.71106143323648, 0.17381632139662762, 1.1299113585169402]], "r_squared_": 0.9583789308653621, "error_": 0.041437792803191306}
{"freq_range": [2.0, 80.0], "freq_res": 1.0, "aperiodic_params_": [0.14750688679746723, 0.7718189417853976], "gaussian_params_": [[7.56020460369473, 0.6192113393624169, 0.3109615510051837], [9.552095914656526, 0.6059683639468387, 0.8957943446986155], [20.211561676357583, 0.41539565204323864, 3.624385061486747], [31.66363258086072, 0.2004946272772409, 2.085510604675123], [43.23381097817861, 0.3064783152846818, 0.25003906841551143], [44.602409454429754, 0.7187375576646706, 0.317049380834682], [47.1436227451769, 0.21038131417598813, 1.2560584119827898], [53.01953140963734, 0.1736457821592581, 1.4087998327071447], [64.02490054362637, 0.17442520313515378, 0.255808545334077]], "peak_params_": [[7.56020460369473, 0.3642584529503823, 0.6219231020103674], [9.552095914656526, 0.5426105988587573, 1.791588689397231], [20.211561676357583, 0.41468860628773474, 7.248770122973494], [31.66363258086072, 0.1999990960104907, 4.171021209350246], [43.23381097817861, 0.1988496529432645, 0.5000781368310229], [44.602409454429754, 0.37644437837017874, 0.634098761669364], [47.1436227451769, 0.20902932575540956, 2.5121168239655796], [53.01953140963734, 0.1736330986635699, 2.8175996654142894], [64.02490054362637, 0.17360080224071917, 0.511617090668154]], "r_squared_": 0.9703727128167783, "error_": 0.04420607992594331}
{"freq_range": [2.0, 80.0], "freq_res": 1.0, "aperiodic_params_": [0.20644092642121972, 0.8415780996248025], "gaussian_params_": [[7.54492519924681, 0.8594981414101348, 0.2785188087321753], [9.566736082535114, 0.6366386610094621, 0.8918995022271891], [19.642437663965676, 0.44803794608876657, 3.372235365618485], [25.86553284908907, 0.1719766142313715, 0.6317474212903468], [31.506933628705262, 0.1804469426955664, 2.2258562078938358], [39.418887511379936, 0.40359864239585774, 0.28996717933894045], [43.45567703255871, 0.6934106307251781, 0.27769596727607104], [44.67304552121089, 0.8079342483909131, 0.25000528421207385], [47.0509244010106, 0.2014672901841565, 1.074291893026338], [52.26261111340719, 0.18925581249532095, 0.5101903776081437], [54.48914918607315, 0.765205061815602, 0.2754880752285367]], "peak_params_": [[7.54492519924681, 0.36347020935923824, 0.5570376174643507], [9.566736082535114, 0.5732992653841146, 1.7837990044543781], [19.642437663965676, 0.44552673384678165, 6.74447073123697], [25.86553284908907, 0.252355633349587, 1.2634948425806936], [31.506933628705262, 0.1766172143507161, 4.4517124157876715], [39.418887511379936, 0.14278859163335234, 0.5799343586778809], [43.45567703255871, 0.1805894230896249, 0.5553919345521421], [44.67304552121089, 0.37611404524897585, 0.5000105684241477], [47.0509244010106, 0.20124106661165464, 2.148583786052676], [52.26261111340719, 0.1657789422136775, 1.0203807552162873], [54.48914918607315, 0.158766700343556, 0.5509761504570734]], "r_squared_": 0.9818410964491089, "error_": 0.03888250313657049}
{"freq_range": [2.0, 80.0], "freq_res": 1.0, "aperiodic_params_": [0.25648593703614014, 0.8738750556677634], "gaussian_params_": [[7.572663630855127, 0.6719150130824216, 0.28542782993364235], [9.561819007532403, 0.6142136510872247, 0.9470065191393147], [19.965448175957345, 0.4262301318305526, 3.5936821439565234], [26.292718011927757, 0.31801848076526334, 0.25305664873350964], [30.980332302151613, 0.1725805172281556, 1.6518965899118419], [45.0718985862966, 0.24452139950833585, 0.2500001418813896], [45.45495801037761, 0.14899723500689965, 3.015166611095699], [52.46321463014466, 0.5850097216328178, 0.2777611743805644], [54.53853158107101, 0.7509907217013034, 0.2675451276695093]], "peak_params_": [[7.572663630855127, 0.3783829124402194, 0.5708556598672847], [9.561819007532403, 0.5609777504632054, 1.8940130382786293], [19.965448175957345, 0.4262104318506356, 7.187364287913047], [26.292718011927757, 0.2688010503049254, 0.5061132974670193], [30.980332302151613, 0.17639215767033822, 3.3037931798236837], [45.0718985862966, 0.38192609785759135, 0.5000002837627792], [45.45495801037761, 0.38192609785759135, 6.030333222191398], [52.46321463014466, 0.15975406453028218, 0.5555223487611288], [54.53853158107101, 0.1706679422093378, 0.5350902553390186]], "r_squared_": 0.976547365444482, "error_": 0.04251221587572113}
{"freq_range": [2.0, 80.0], "freq_res": 1.0, "aperiodic_params_": [0.2195410224320649, 0.8424445175102521], "gaussian_params_": [[7.5432603566806975, 1.003630074713795, 0.26725146750305145], [9.616714103180916, 0.6238898749828921, 0.8360527334579327], [19.29536626702578, 0.38336705661758574, 3.203195340305158], [23.501031811447728, 0.15290304409275948, 0.8756422240797059], [25.92314474888, 0.2154195809338476, 0.5722064321801313], [30.787343235110285, 0.16941933313525437, 1.7644445626809535], [45.00864511977742, 0.24381434642245894, 1.7032874319868327], [52.44132579890338, 0.5257270637107979, 0.2886759992797024], [54.56540187574895, 1.0645514318145224, 0.25000917452531185]], "peak_params_": [[7.5432603566806975, 0.32994056012519773, 0.5345029350061029], [9.616714103180916, 0.5673432021571135, 1.6721054669158655], [19.29536626702578, 0.3817409756780537, 6.406390680610316], [23.501031811447728, 0.26122602433602804, 1.7512844481594119], [25.92314474888, 0.2632418297529152, 1.1444128643602627], [30.787343235110285, 0.16867664357417267, 3.528889125361907], [45.00864511977742, 0.2438112059672115, 3.4065748639736655], [52.44132579890338, 0.16344980862347058, 0.5773519985594048], [54.56540187574895, 0.23496004835576456, 0.5000183490506237]], "r_squared_": 0.963666198556715, "error_": 0.047492802860670695}
{"freq_range": [2.0, 80.0], "freq_res": 1.0, "aperiodic_params_": [-0.005913605200950453, 0.6559147941474366], "gaussian_params_": [[7.565795688100407, 0.7128027318994539, 0.2916673671567965], [9.723824316893841, 0.5730373574098305, 0.8049993354661038], [18.32685824419792, 0.2295156904162927, 2.2443272690191374], [22.63857385772789, 0.21601179521927516, 3.2456256422918583], [30.93954885145544, 0.13715274729112584, 0.9196543371852284], [45.08255740816924, 0.3263784188838662, 0.629171091926289], [52.24093407672175, 0.20259370333149793, 0.687851772298544], [54.59054974191394, 0.8150311631061343, 0.2682178263805793], [59.45145534902917, 0.550287075659443, 0.3130646688746199], [66.42021506339714, 0.6708972629345585, 0.26608779383837067], [70.87506474615442, 0.12678017984020234, 1.1150750929734699]], "peak_params_": [[7.565795688100407, 0.2932367440452156, 0.583334734313593], [9.723824316893841, 0.5406324157100266, 1.6099986709322076], [18.32685824419792, 0.304888124412513, 4.488654538038275], [22.63857385772789, 0.2409403535197503, 6.491251284583717], [30.93954885145544, 0.14467842897797467, 1.8393086743704568], [45.08255740816924, 0.3235807393087814, 1.258342183852578], [52.24093407672175, 0.19053918237392042, 1.375703544597088], [54.59054974191394, 0.2542432010270421, 0.5364356527611586], [59.45145534902917, 0.19454897964084983, 0.6261293377492398], [66.42021506339714, 0.19280348758031662, 0.5321755876767413], [70.87506474615442, 0.1259869101003266, 2.2301501859469397]], "r_squared_": 0.9557430695441734, "error_": 0.04095721288381828}
{"freq_range": [2.0, 80.0], "freq_res": 1.0, "aperiodic_params_": [-0.3566324355859025, 0.35284514764382546], "gaussian_params_": [[7.684015826915583, 0.41088230483226656, 0.3143468523954627], [9.715536880971447, 0.5738098133838284, 0.6709201874320999], [18.47577112921303, 0.23635858147330982, 1.7861201659156616], [23.059752960774233, 0.21616154428226003, 1.8179348799776434], [45.15732771399857, 0.31458739483849724, 0.522593668391804], [54.579066153931706, 0.6228573252390202, 0.2927430175578584], [59.467538743358766, 0.29096855689549517, 0.759708521551089], [66.43397893915518, 0.7593172877510103, 0.28307122053377254], [70.23923794430867, 0.21959127469405046, 0.4119440322706234], [71.70568715842516, 0.4049292828073035, 0.250043749995475]], "peak_params_": [[7.684015826915583, 0.2697427397804575, 0.6286937047909253], [9.715536880971447, 0.5244868013331689, 1.3418403748641998], [18.47577112921303, 0.23261461517868354, 3.572240331831323], [23.059752960774233, 0.22560229737503223, 3.6358697599552867], [45.15732771399857, 0.30064971770295645, 1.045187336783608], [54.579066153931706, 0.22152731320762142, 0.5854860351157168], [59.467538743358766, 0.2407707394249935, 1.519417043102178], [66.43397893915518, 0.23444209896783408, 0.5661424410675451], [70.23923794430867, 0.18551405628321294, 0.8238880645412467], [71.70568715842516, 0.20257525494496176, 0.50008749999095]], "r_squared_": 0.8244151028666767, "error_": 0.05039507672607796}
{"freq_range": [2.0, 80.0], "freq_res": 1.0, "aperiodic_params_": [-0.3330159869449099, 0.30717983594784637], "gaussian_params_": [[9.35387521171375, 0.3391982431791333, 1.1991228491862669], [19.544987455041884, 0.313297607084374, 1.8508732338236962], [30.903653711390724, 0.17094610119759612, 0.8903713931259608], [51.08867321797233, 0.18967462807799926, 1.0184534479778196], [56.192746327965715, 0.21247515394110175, 1.0922509506914364], [64.4823091111663, 1.0572325481537146, 0.2806584878688048], [66.47316989484355, 0.30143304483565075, 0.5966180686471454], [68.42094185127203, 0.45267979228674915, 0.2749386781963127]], "peak_params_": [[9.35387521171375, 0.3247447035068297, 2.3982456983725338], [19.544987455041884, 0.30397203944559026, 3.7017464676473923], [30.903653711390724, 0.16994820483311024, 1.7807427862519216], [51.08867321797233, 0.1889596928878543, 2.036906895955639], [56.192746327965715, 0.20919416308115513, 2.184501901382873], [64.4823091111663, 0.2415401773049669, 0.5613169757376096], [66.47316989484355, 0.22009444612340023, 1.1932361372942908], [68.42094185127203, 0.1516142646967531, 0.5498773563926254]], "r_squared_": 0.7938595002435491, "error_": 0.044655172312001196}
{"freq_range": [2.0, 80.0], "freq_res": 1.0, "aperiodic_params_": [-0.3947138284870381, 0.2628104401360492], "gaussian_params_": [[9.17061559444126, 0.45567319514262156, 1.179048279518643], [19.6039842801379, 0.32831282983448, 2.557386550024002], [31.453283960878807, 0.23477390408973137, 3.500337722287173], [44.289910221291535, 0.25951040354280736, 1.2405253475541396], [47.43873208184737, 1.3086223378614519, 0.2542378852940304], [51.844923640953866, 0.201125279887144, 2.983343245340391], [64.4394358507389, 1.2293680119002364, 0.257207445261338]], "peak_params_": [[9.17061559444126, 0.4509878756977045, 2.358096559037286], [19.6039842801379, 0.32551124282957544, 5.114773100048004], [31.453283960878807, 0.23282962049453593, 7.000675444574346], [44.289910221291535, 0.2592386708941037, 2.481050695108279], [47.43873208184737, 0.3729073262096666, 0.5084757705880608], [51.844923640953866, 0.20085375227308178, 5.966686490680782], [64.4394358507389, 0.28570640474698084, 0.514414890522676]], "r_squared_": 0.7704044911721706, "error_": 0.06635839098097047}
{"freq_range": [2.0, 80.0], "freq_res": 1.0, "aperiodic_params_": [-0.05622477213759502, 0.5227896868368201], "gaussian_params_": [[9.12005266701139, 0.4961196698182203, 1.0885124360435268], [20.12041713227014, 0.35036418990388457, 3.44796739017434], [31.59367975608352, 0.2856563379960995, 1.759920509175403], [44.558902037878724, 0.29846083564901643, 1.1520646958017602], [47.44946524228521, 1.4230485878080887, 0.2630626691240732], [52.1123197835989, 0.1831597630922803, 2.7896707208185836], [64.3800638686884, 0.7621235194172102, 0.25000109511655]], "peak_params_": [[9.12005266701139, 0.49504232213922644, 2.1770248720870535], [20.12041713227014, 0.3501505869087855, 6.89593478034868], [31.59367975608352, 0.2790702084019946, 3.519841018350806], [44.558902037878724, 0.2844687413696375, 2.3041293916035204], [47.44946524228521, 0.3963885932753254, 0.5261253382481464], [52.1123197835989, 0.18301136444343447, 5.579341441637167], [64.3800638686884, 0.2399948363625417, 0.5000021902331]], "r_squared_": 0.9131244637258744, "error_": 0.059845812136646366}
{"freq_range": [2.0, 80.0], "freq_res": 1.0, "aperiodic_params_": [0.24920678066907276, 0.8231277073362372], "gaussian_params_": [[9.243896697138313, 0.5792265104298098, 1.0728005019839015], [19.647467711184323, 0.43756257893200695, 3.1091514065474937], [25.767983667866535, 0.1921534355112238, 0.8227552278694304], [31.40627122672601, 0.22519530413361033, 1.7151396712943292], [44.639601029351596, 0.8152298477554695, 0.2500000537703861], [48.040490939122165, 0.16350709174184422, 4.767927419641669]], "peak_params_": [[9.243896697138313, 0.5656921620799578, 2.145601003967803], [19.647467711184323, 0.43475889957600544, 6.218302813094987], [25.767983667866535, 0.240502133125027, 1.645510455738861], [31.40627122672601, 0.21979784503969035, 3.4302793425886584], [44.639601029351596, 0.4218300239770988, 0.5000001075407722], [48.040490939122165, 0.16350119577278366, 9.535854839283338]], "r_squared_": 0.9574425253453118, "error_": 0.056541000336872885}
{"freq_range": [2.0, 80.0], "freq_res": 1.0, "aperiodic_params_": [0.2648098522889941, 0.86368561610091], "gaussian_params_": [[7.554432073617608, 1.0665306165053394, 0.25424292293835865], [9.502074818047538, 0.6415970000816609, 0.8803471945511733], [19.461843746284348, 0.4419036749761366, 3.697571673178899], [25.918247412319445, 0.18887376683487156, 0.6539013097681428], [31.286533399924583, 0.23600139670825726, 1.6610233493989517], [43.341536049181556, 0.489715434334938, 0.2500096142365213], [44.585004666908446, 1.2855386208930655, 0.2716690826354006], [47.01059147461957, 0.256103184930419, 0.8036122135816957], [52.46984912460834, 0.12624066620773328, 2.2417143819023733]], "peak_params_": [[7.554432073617608, 0.3829125067593394, 0.5084858458767173], [9.502074818047538, 0.5634859470615151, 1.7606943891023465], [19.461843746284348, 0.43846997949738836, 7.395143346357798], [25.918247412319445, 0.28144610809669013, 1.3078026195362855], [31.286533399924583, 0.23591139191521626, 3.3220466987979034], [43.341536049181556, 0.19263825544910695, 0.5000192284730426], [44.585004666908446, 0.4119771964658525, 0.5433381652708013], [47.01059147461957, 0.2625131528250797, 1.6072244271633913], [52.46984912460834, 0.12349805313137607, 4.4834287638047465]], "r_squared_": 0.9790629530867645, "error_": 0.043002590874603897}
{"freq_range": [2.0, 80.0], "freq_res": 1.0, "aperiodic_params_": [0.2529949357569, 0.8845375879178182], "gaussian_params_": [[7.553327203912851, 0.8586796867377352, 0.2802769134706836], [9.49271681777414, 0.6742911312818962, 0.8771523536232458], [20.099547112568178, 0.4386868274622639, 4.612587666480168], [31.355338487300873, 0.20503526152311113, 1.546392054948443], [43.38597227123334, 0.2009653636782101, 0.2503493500433015], [44.752183493987374, 0.4092456900862456, 0.2502946740082994], [45.709174684026515, 0.16973509744157095, 3.3086092813810737], [52.38582645866964, 0.4587841075789191, 0.26281434156885153], [54.52926174009107, 0.742864656415942, 0.2697095790529389], [62.03548945545751, 0.15911348265665648, 0.2500003291815693]], "peak_params_": [[7.553327203912851, 0.41370675540160734, 0.5605538269413672], [9.49271681777414, 0.6001312635767372, 1.7543047072464917], [20.099547112568178, 0.43858467658613925, 9.225175332960337], [31.355338487300873, 0.22658312494660027, 3.092784109896886], [43.38597227123334, 0.18262242451463595, 0.500698700086603], [44.752183493987374, 0.41655831573867663, 0.5005893480165988], [45.709174684026515, 0.16908235036184194, 6.617218562762147], [52.38582645866964, 0.18402158514082778, 0.5256286831377031], [54.52926174009107, 0.16525831676000968, 0.5394191581058778], [62.03548945545751, 0.1575192309042477, 0.5000006583631386]], "r_squared_": 0.9772162432647366, "error_": 0.04471646940751669}
{"freq_range": [2.0, 80.0], "freq_res": 1.0, "aperiodic_params_": [0.16797927936014465, 0.7942404780466372], "gaussian_params_": [[7.568659033958109, 0.8676928466392311, 0.26957787851261783], [9.494576388236835, 0.6099169008091915, 0.8214651499780214], [21.26375082169094, 0.33716278086266405, 5.813318503563846], [45.30761190826067, 0.2805825650551135, 2.001491851411544], [51.67899924865804, 0.1922442602106569, 1.200324304893857], [54.58089670609055, 1.128744747687937, 0.25040059314873503]], "peak_params_": [[7.568659033958109, 0.3827347411809684, 0.5391557570252357], [9.494576388236835, 0.5452429603971273, 1.642930299956043], [21.26375082169094, 0.3368159437482091, 11.626637007127693], [45.30761190826067, 0.2773691165207852, 4.002983702823088], [51.67899924865804, 0.18653936279507555, 2.400648609787714], [54.58089670609055, 0.2823400034519796, 0.5008011862974701]], "r_squared_": 0.9538100298089934, "error_": 0.05949585762261026}
{"freq_range": [2.0, 80.0], "freq_res": 1.0, "aperiodic_params_": [-0.18775473847947607, 0.46497670325114776], "gaussian_params_": [[7.598508383563513, 0.865369172320618, 0.27247755019232583], [9.565134683045548, 0.6090169315888913, 0.7033292620731634], [19.6513930343896, 0.2173044008254927, 3.385007718906086], [28.095930801727814, 0.07937215978958594, 5.999999999999971], [44.7611727841513, 0.2288953779521832, 2.7158613046612623], [52.08534623664099, 0.21131666251848644, 1.0138920217683636], [54.64269605597708, 0.5449446731591825, 0.37212818161087663], [66.42112792630762, 0.9435372779892979, 0.25000000000283246]], "peak_params_": [[7.598508383563513, 0.3443164746549495, 0.5449551003846517], [9.565134683045548, 0.5076269341582885, 1.4066585241463267], [19.6513930343896, 0.2480936092791326, 6.770015437812172], [28.095930801727814, 0.08974183056701712, 11.999999999999941], [44.7611727841513, 0.22951200349952705, 5.431722609322525], [52.08534623664099, 0.21715851954694299, 2.027784043536727], [54.64269605597708, 0.34726840323278585, 0.7442563632217533], [66.42112792630762, 0.22834234879843995, 0.5000000000056649]], "r_squared_": 0.8624654576684284, "error_": 0.060484558287095404}
{"freq_range": [2.0, 80.0], "freq_res": 1.0, "aperiodic_params_": [-0.4187436972692903, 0.4020679432167844], "gaussian_params_": [[7.704473782115941, 0.44551683337428105, 0.30457770523413624], [9.696823737110593, 0.6831243219974148, 0.6410395589639796], [19.45047851568438, 0.24666376129706458, 3.74936330047169], [41.856683957751315, 0.18894341432820613, 1.0865261429557411], [45.22639643008674, 0.2900752588660923, 0.6956241153380737], [53.82924856895464, 0.19562260281985844, 1.4289487033882258], [59.49336480087857, 1.2476259687019846, 0.3037023661592714], [61.71169099260968, 0.18229551447146447, 0.6785846970318414], [66.36252989142204, 0.4764550119529464, 0.2500154579965167], [69.67033928194208, 0.48583118652757523, 0.31237302952432805], [71.52242630335559, 0.7663952446981324, 0.28787724347816784]], "peak_params_": [[7.704473782115941, 0.30113597414519694, 0.6091554104682725], [9.696823737110593, 0.6211347225614717, 1.2820791179279591], [19.45047851568438, 0.24488980835107843, 7.49872660094338], [41.856683957751315, 0.18731307275342157, 2.1730522859114823], [45.22639643008674, 0.27798914246555206, 1.3912482306761473], [53.82924856895464, 0.19423093664276903, 2.8578974067764515], [59.49336480087857, 0.33379374575213183, 0.6074047323185428], [61.71169099260968, 0.16656284872289484, 1.3571693940636829], [66.36252989142204, 0.16651409178324927, 0.5000309159930334], [69.67033928194208, 0.2783805378518579, 0.6247460590486561], [71.52242630335559, 0.19357053119522838, 0.5757544869563357]], "r_squared_": 0.8376811844644693, "error_": 0.052229962106483986}
{"freq_range": [2.0, 80.0], "freq_res": 1.0, "aperiodic_params_": [-0.2765218708991433, 0.5609450458070765], "gaussian_params_": [[9.539042986804587, 0.39562309603982615, 1.2075303173866725], [19.408663974288825, 0.29471535004645866, 3.372758904161175], [30.976865642533465, 0.19028633568980477, 1.625465435252168], [38.66598548534798, 0.3174403650855764, 0.27890015924140715], [40.582839789073255, 0.3115858140965984, 0.8931255891535828], [47.47920319503117, 1.595665498412612, 0.2634902718574303], [49.927717789613055, 0.2350040310136986, 1.7645062261695852], [56.17592863414497, 0.20190497203359353, 0.44106828586267594], [74.5013905704505, 1.213763235284152, 0.25758820325303966]], "peak_params_": [[9.539042986804587, 0.37384255747492545, 2.415060634773345], [19.408663974288825, 0.29255988067484784, 6.74551780832235], [30.976865642533465, 0.19106988618020837, 3.250930870504336], [38.66598548534798, 0.2197545454180514, 0.5578003184828143], [40.582839789073255, 0.2793863850777716, 1.7862511783071655], [47.47920319503117, 0.36461648199429675, 0.5269805437148606], [49.927717789613055, 0.23480693420548915, 3.5290124523391704], [56.17592863414497, 0.18709609402385374, 0.8821365717253519], [74.5013905704505, 0.18642782272897973, 0.5151764065060793]], "r_squared_": 0.9381757135575444, "error_": 0.044755537881345}
{"freq_range": [2.0, 80.0], "freq_res": 1.0, "aperiodic_params_": [-0.4192952564026066, 0.2522341747676939], "gaussian_params_": [[9.248669027155378, 0.4553124808192904, 1.1509409207820505], [18.995867134362943, 0.3192607969778529, 2.4432351667717516], [31.20047721526187, 0.41176137780587113, 2.4898764545549468], [37.21825717687098, 0.33907108144145326, 0.2502652970405174], [43.92393811455528, 0.3313179071145707, 1.503242376382845], [47.47325421995329, 2.263943313207897, 0.26655515751911146], [49.4348911278745, 0.9592384659691519, 0.3017086066233868], [52.67327420358977, 0.1847689094063423, 3.763651677862081], [60.33546803563054, 0.3048772222988087, 0.5244829613250422]], "peak_params_": [[9.248669027155378, 0.44488243230077745, 2.301881841564101], [18.995867134362943, 0.3192628571406958, 4.886470333543503], [31.20047721526187, 0.41043065998759015, 4.9797529091098935], [37.21825717687098, 0.2591760161692076, 0.5005305940810348], [43.92393811455528, 0.34387965694927275, 3.00648475276569], [47.47325421995329, 0.5682903886870125, 0.5331103150382229], [49.4348911278745, 0.455301165666372, 0.6034172132467736], [52.67327420358977, 0.18407400282833342, 7.527303355724162], [60.33546803563054, 0.2762568079906105, 1.0489659226500845]], "r_squared_": 0.749169065053226, "error_": 0.0707616944340546}
{"freq_range": [2.0, 80.0], "freq_res": 1.0, "aperiodic_params_": [-0.014609432044451046, 0.6023395896070101], "gaussian_params_": [[9.202938068095925, 0.5557316787660648, 1.141651537491812], [19.52182190508449, 0.39098744454720075, 3.8413965709223437], [31.593741155097227, 0.3586305386319831, 1.876703565037972], [44.66009863999428, 0.3792615888000833, 1.104304422993901], [47.47380150089135, 2.664080696059424, 0.2500000095088298], [49.33008712938905, 0.4829017508867732, 0.27793873736045044], [51.79045481287233, 0.23397490439777152, 1.9125420227586871]], "peak_params_": [[9.202938068095925, 0.5562045084553447, 2.283303074983624], [19.52182190508449, 0.3879699095425991, 7.682793141844687], [31.593741155097227, 0.35232458837855196, 3.753407130075944], [44.66009863999428, 0.36214342008771083, 2.208608845987802], [47.47380150089135, 0.4925162882858858, 0.5000000190176596], [49.33008712938905, 0.3194270896241993, 0.5558774747209009], [51.79045481287233, 0.23257476920233056, 3.8250840455173742]], "r_squared_": 0.9223772410340104, "error_": 0.06727980315947484}
{"freq_range": [2.0, 80.0], "freq_res": 1.0, "aperiodic_params_": [0.17277836488803347, 0.7959914754696874], "gaussian_params_": [[9.216878780259753, 0.6471822229633325, 1.1905788141421714], [18.915388524284253, 0.46593121163315754, 3.4691924041318907], [25.522814218480878, 0.2446467855752307, 0.9387967998553857], [31.472734140982322, 0.2681516465041731, 2.059454574472937], [44.90269820554541, 0.35237948835320076, 0.4645707005296326], [47.31289495776623, 0.4053516903740375, 0.30459871155964385], [49.45203459913595, 0.15274903580636282, 4.82260279405709]], "peak_params_": [[9.216878780259753, 0.6443758360156122, 2.3811576282843427], [18.915388524284253, 0.46579265771912615, 6.938384808263781], [25.522814218480878, 0.28075961249995307, 1.8775935997107713], [31.472734140982322, 0.26236060991025223, 4.118909148945874], [44.90269820554541, 0.44448640337546297, 0.9291414010592652], [47.31289495776623, 0.37340442495340476, 0.6091974231192877], [49.45203459913595, 0.15207958605034166, 9.64520558811418]], "r_squared_": 0.9678856053159679, "error_": 0.052001178843182186}
{"freq_range": [2.0, 80.0], "freq_res": 1.0, "aperiodic_params_": [0.26037675530975146, 0.8743957723205634], "gaussian_params_": [[9.25359633474237, 0.7055228309325887, 1.1668678575269984], [15.740643596860936, 0.28950091532954536, 2.2474687606123918], [20.144611178403938, 0.43298292753901074, 1.938665839249094], [25.584717269883964, 0.35513732492844957, 1.2516909114970647], [31.242407036592496, 0.2374393610677891, 2.1163802349407383], [44.91361026111549, 0.2616210722203007, 0.42832987119358795], [46.76990850138102, 0.15795296723833532, 4.976160543616775]], "peak_params_": [[9.25359633474237, 0.6922798387571433, 2.333735715053997], [15.740643596860936, 0.33163560480310184, 4.4949375212247835], [20.144611178403938, 0.47985023389174425, 3.877331678498188], [25.584717269883964, 0.3517238553203489, 2.5033818229941294], [31.242407036592496, 0.23695921640467354, 4.232760469881477], [44.91361026111549, 0.4046249660637258, 0.8566597423871759], [46.76990850138102, 0.15778604690938125, 9.95232108723355]], "r_squared_": 0.9783913412692863, "error_": 0.04849875534678401}
{"freq_range": [2.0, 80.0], "freq_res": 1.0, "aperiodic_params_": [0.2161352632538521, 0.8637928767958057], "gaussian_params_": [[7.5561872848299005, 0.7731395799781554, 0.29711611833327956], [9.477673164082129, 0.7319607996151545, 0.7940050459380879], [20.12935766786309, 0.42451351456359304, 5.999999999999999], [44.938579969563996, 0.25686009527369497, 0.476220465950918], [45.551506758233835, 0.15821852377549625, 5.999999999999999], [51.989421215319496, 0.12170579162334827, 0.25000028383692746]], "peak_params_": [[7.5561872848299005, 0.4379217948280649, 0.5942322366665591], [9.477673164082129, 0.6867956514375657, 1.5880100918761757], [20.12935766786309, 0.42443311179951104, 11.999999999999998], [44.938579969563996, 0.4123630280323264, 0.952440931901836], [45.551506758233835, 0.17924336350578574, 11.999999999999998], [51.989421215319496, 0.21040145150925316, 0.5000005676738549]], "r_squared_": 0.9660500099101783, "error_": 0.06203838275479456}
{"freq_range": [2.0, 80.0], "freq_res": 1.0, "aperiodic_params_": [0.21954367813890283, 0.8455742973096422], "gaussian_params_": [[9.225979690353128, 0.6464924327017646, 1.0697564467913587], [17.398749703423142, 0.3671211206513044, 3.5933425496044595], [26.96148383648987, 0.19333971907292272, 5.999999999999999], [44.64324664622631, 0.5317725809756827, 0.2587211128478177], [47.04564042325857, 0.21287427137508885, 3.677404349456714], [51.56534234976523, 0.892411676964615, 0.26386040696078017], [54.61383043368344, 0.8026510903519067, 0.2511492515131382]], "peak_params_": [[9.225979690353128, 0.6583245008255895, 2.1395128935827175], [17.398749703423142, 0.4135949209984673, 7.186685099208919], [26.96148383648987, 0.20367580723830458, 11.999999999999998], [44.64324664622631, 0.38998150871736037, 0.5174422256956354], [47.04564042325857, 0.21358947427406516, 7.354808698913428], [51.56534234976523, 0.31571163441468375, 0.5277208139215603], [54.61383043368344, 0.2666370310763624, 0.5022985030262764]], "r_squared_": 0.9627401206755443, "error_": 0.05815717882934875}
{"freq_range": [2.0, 80.0], "freq_res": 1.0, "aperiodic_params_": [-0.1252503776498457, 0.5185661396557845], "gaussian_params_": [[9.218211275356872, 0.5058622367181985, 0.9737592150003845], [16.71809545205399, 0.32337070382924216, 2.5287269162262365], [37.89393528940796, 0.3112306280744095, 1.235619849639281], [45.701374586340215, 0.2804085919199099, 1.4382838896282906], [50.27696151849805, 0.45490017972626506, 1.487044737547163], [54.8887713284318, 0.3786209512790829, 0.7854307042309624], [71.7195716143087, 0.2350962741133966, 1.4128953352501412], [76.33348063743998, 0.26768058692546143, 0.9776222045172708]], "peak_params_": [[9.218211275356872, 0.4963866472455279, 1.947518430000769], [16.71809545205399, 0.32136751298244287, 5.057453832452473], [37.89393528940796, 0.3100862714640308, 2.471239699278562], [45.701374586340215, 0.2817007496349775, 2.876567779256581], [50.27696151849805, 0.4503002996272374, 2.974089475094326], [54.8887713284318, 0.37777684409154877, 1.5708614084619248], [71.7195716143087, 0.23052544115142581, 2.8257906705002824], [76.33348063743998, 0.2549405882464568, 1.9552444090345416]], "r_squared_": 0.8649939172168115, "error_": 0.06546973425712108}
{"freq_range": [2.0, 80.0], "freq_res": 1.0, "aperiodic_params_": [-0.39020632788138354, 0.4860396128859578], "gaussian_params_": [[8.249192984756942, 0.47326832895654547, 0.2500002040716633], [9.62057676939395, 0.6655969989372856, 0.6040703473371758], [17.3042212448502, 0.25083488858394876, 3.1604731394010206], [45.69832776046515, 0.260418771491355, 0.25000001428022145], [48.246697397871905, 0.15682625688016252, 5.6855141418214465], [59.514858001467466, 1.792304303754812, 0.2723678299595101], [62.2754455406847, 0.3089485702436224, 0.8715311199127926], [70.53544572369722, 0.32377312654396484, 1.2888934179056126]], "peak_params_": [[8.249192984756942, 0.30948234269483954, 0.5000004081433266], [9.62057676939395, 0.5637989345288356, 1.2081406946743516], [17.3042212448502, 0.24967554816457038, 6.320946278802041], [45.69832776046515, 0.2707908576197865, 0.5000000285604429], [48.246697397871905, 0.15667869505077303, 11.371028283642893], [59.514858001467466, 0.39557431360380957, 0.5447356599190202], [62.2754455406847, 0.30230699581561216, 1.7430622398255853], [70.53544572369722, 0.3034632767707779, 2.5777868358112253]], "r_squared_": 0.8373924711010496, "error_": 0.06011306782419381}
{"freq_range": [2.0, 80.0], "freq_res": 1.0, "aperiodic_params_": [0.13546484459387712, 0.7743403886874565], "gaussian_params_": [[9.707344209902287, 0.37094199754025875, 0.9750227534448426], [22.006688207282238, 0.17014115467208038, 5.999999329966723], [23.63493978147171, 0.43062305955236635, 0.2738703458441407], [51.23672600955918, 0.3545554165393531, 0.9316243405880527], [55.45378055490653, 0.5300933967140943, 1.0224175770216462], [63.042156776761914, 0.27693051535458074, 0.25000030537334167], [69.15288141694401, 0.7128379935877316, 1.236828187365252]], "peak_params_": [[9.707344209902287, 0.37757815768725866, 1.9500455068896851], [22.006688207282238, 0.1701410568265006, 11.999998659933446], [23.63493978147171, 0.3381271874773215, 0.5477406916882814], [51.23672600955918, 0.3433335326842938, 1.8632486811761053], [55.45378055490653, 0.48047327237491366, 2.0448351540432923], [63.042156776761914, 0.2730241216214695, 0.5000006107466833], [69.15288141694401, 0.7074130694494061, 2.473656374730504]], "r_squared_": 0.9240792837537959, "error_": 0.06454594274059965}
{"freq_range": [2.0, 80.0], "freq_res": 1.0, "aperiodic_params_": [-0.2630866192780185, 0.49935480476842525], "gaussian_params_": [[7.614670328781349, 0.6782753827487017, 0.2625061830947751], [9.727814424675035, 0.6213433097126312, 0.9590815242527109], [18.50589783556632, 0.4052755130111972, 3.2070080230774565], [31.033605226952794, 0.41088606296932795, 2.1919452249885985], [37.43860135435709, 1.1736892961654275, 0.250019093718703], [42.15651449182821, 0.23368741363675932, 2.3719546844792982], [45.409610755504836, 1.7115846880878787, 0.2542995714125056], [47.43936491165364, 0.7891493573102624, 0.6020657963698302], [49.42964117490007, 0.7572439889039727, 0.5145691539261179], [51.56264993218896, 0.7671784859633926, 0.39766719874602585], [56.54475759692912, 1.8672331448535655, 0.25483978361618803]], "peak_params_": [[7.614670328781349, 0.355469808048186, 0.5250123661895502], [9.727814424675035, 0.6088467889200304, 1.9181630485054217], [18.50589783556632, 0.400493965978012, 6.414016046154913], [31.033605226952794, 0.4110465275465487, 4.383890449977197], [37.43860135435709, 0.28404606035010316, 0.500038187437406], [42.15651449182821, 0.23318072835699521, 4.7439093689585965], [45.409610755504836, 0.581876415222323, 0.5085991428250112], [47.43936491165364, 0.6337322413020792, 1.2041315927396603], [49.42964117490007, 0.5654451186698655, 1.0291383078522358], [51.56264993218896, 0.4190791652595789, 0.7953343974920517], [56.54475759692912, 0.37865453509363944, 0.5096795672323761]], "r_squared_": 0.9201077586816284, "error_": 0.05921349668257673}
{"freq_range": [2.0, 80.0], "freq_res": 1.0, "aperiodic_params_": [0.1282404222055094, 0.7748138759553436], "gaussian_params_": [[8.795644806895226, 0.6270370199903631, 0.876430754821037], [10.414045040498292, 0.8952369856396346, 0.3577170512515208], [12.294303341988654, 0.15916354156975393, 0.7404831416428846], [18.493892946262704, 0.5668360009297356, 3.5701018353995466], [31.238408888827056, 0.3004888865691216, 3.0739803033988067], [45.03008130334231, 0.548017127099471, 0.6760683493103063], [47.46132205690419, 1.792737208480428, 0.2902553384525999], [49.34227427836964, 0.46534718169574285, 0.6316418213800159], [51.547225125457416, 1.3330994887404302, 0.2658902859047154]], "peak_params_": [[8.795644806895226, 0.6271053128759851, 1.752861509642074], [10.414045040498292, 0.7368380835732716, 0.7154341025030416], [12.294303341988654, 0.2563005831791331, 1.4809662832857693], [18.493892946262704, 0.5614659307248697, 7.140203670799093], [31.238408888827056, 0.30081345243312174, 6.147960606797613], [45.03008130334231, 0.547488285403508, 1.3521366986206127], [47.46132205690419, 0.5153090750954016, 0.5805106769051998], [49.34227427836964, 0.40180633579573544, 1.2632836427600318], [51.547225125457416, 0.3128121003360116, 0.5317805718094308]], "r_squared_": 0.9618207526707641, "error_": 0.056495006149838226}
{"freq_range": [2.0, 80.0], "freq_res": 1.0, "aperiodic_params_": [0.13565578832838363, 0.8169291596712961], "gaussian_params_": [[7.5146831923883886, 0.7766212541006492, 0.2944853822226511], [9.514426343547298, 0.790144013274638, 0.9944433595289084], [17.441082008255965, 0.5113584420496198, 3.8691716387926114], [20.428894288223436, 0.23907890282619412, 0.508430159206378], [25.560716926720556, 0.28478092507644204, 1.1171243228192225], [31.33934356357148, 0.2896328812358635, 2.2487961729782957], [44.96877002819555, 0.2572587385859714, 0.2500000029995992], [46.53297756127651, 0.23219731823073922, 3.860835491426664], [52.00722231277089, 0.1552574580538375, 0.25000032480779794]], "peak_params_": [[7.5146831923883886, 0.4735826415394905, 0.5889707644453022], [9.514426343547298, 0.7818085442615336, 1.9888867190578168], [17.441082008255965, 0.5080464610771505, 7.738343277585223], [20.428894288223436, 0.5784125269893646, 1.016860318412756], [25.560716926720556, 0.3251549815758523, 2.234248645638445], [31.33934356357148, 0.2875286761760034, 4.497592345956591], [44.96877002819555, 0.46985585172287403, 0.5000000059991984], [46.53297756127651, 0.23050472582416692, 7.721670982853328], [52.00722231277089, 0.24039515205845063, 0.5000006496155959]], "r_squared_": 0.9754477690818399, "error_": 0.050821249850559136}
{"freq_range": [2.0, 80.0], "freq_res": 1.0, "aperiodic_params_": [0.20137962318022845, 0.8567802351412404], "gaussian_params_": [[7.514701339661041, 1.2771416173336012, 0.25903628687570907], [9.54771414661544, 0.9085662880083012, 0.8715403284910278], [17.708763907614852, 0.5032466859529934, 3.9288074775036086], [25.867065807700666, 0.2760992324630445, 1.0011920597052262], [30.917139037373385, 0.23272672793285556, 2.6945880513498377], [44.95346347581873, 0.40961766781561576, 0.7560596207966935], [47.42452532275959, 0.9732497880072098, 0.2668328084948855]], "peak_params_": [[7.514701339661041, 0.4323315320469788, 0.5180725737514181], [9.54771414661544, 0.8675187323928619, 1.7430806569820556], [17.708763907614852, 0.501868290953437, 7.857614955007217], [25.867065807700666, 0.37199172506900424, 2.0023841194104524], [30.917139037373385, 0.234263784744829, 5.389176102699675], [44.95346347581873, 0.40884274142586885, 1.512119241593387], [47.42452532275959, 0.285026347881421, 0.533665616989771]], "r_squared_": 0.9759094934754579, "error_": 0.05282490967106802}
{"freq_range": [2.0, 80.0], "freq_res": 1.0, "aperiodic_params_": [0.34596436765351984, 0.9510476537225854], "gaussian_params_": [[9.455094394770489, 0.8338410087525616, 1.1206628739994275], [15.821951367432293, 0.4281052157648516, 2.2446861854642757], [20.192282556826523, 0.3929367964199746, 1.645769236273549], [25.61432818169638, 0.3212965107499408, 1.4268943307521853], [31.058710886284857, 0.20537801678239542, 1.9263334396298584], [44.911007162915155, 0.2605305190085183, 1.1458297216446893], [48.0444703061813, 0.1191542673762259, 2.5662697604118807], [52.00599328353098, 0.18239054527713577, 0.25002740839748167]], "peak_params_": [[9.455094394770489, 0.7720695012115871, 2.241325747998855], [15.821951367432293, 0.4420821235185912, 4.489372370928551], [20.192282556826523, 0.46613104714984516, 3.291538472547098], [25.61432818169638, 0.3170952341658979, 2.8537886615043706], [31.058710886284857, 0.20554171209751926, 3.8526668792597167], [44.911007162915155, 0.3186975331929436, 2.2916594432893787], [48.0444703061813, 0.1260183013167009, 5.132539520823761], [52.00599328353098, 0.21866413585254874, 0.5000548167949633]], "r_squared_": 0.9764898488913217, "error_": 0.05342866076041874}
{"freq_range": [2.0, 80.0], "freq_res": 1.0, "aperiodic_params_": [0.2346665146823917, 0.8742143824049566], "gaussian_params_": [[7.55208482286694, 0.39702493696212315, 0.2897370747646859], [9.518099957512211, 0.8102173345804039, 1.072163607365119], [16.02089484058445, 0.5107663311913313, 2.4574445476337208], [20.07205417907795, 0.3358590443847387, 1.5121660544607227], [24.237371993264563, 0.24485459876930474, 1.457836641485851], [26.571560238473822, 0.4562488465648133, 0.30251824487615503], [30.74085632428155, 0.23188228548172457, 2.0445128090170477], [44.960721637888916, 0.12491901908375588, 0.2501118863192436], [45.58173752283848, 0.24919434914672692, 1.67338635153858], [51.14697137079574, 0.1905057432271735, 2.145947247506948]], "peak_params_": [[7.55208482286694, 0.420011101497563, 0.5794741495293718], [9.518099957512211, 0.7577691740958324, 2.144327214730238], [16.02089484058445, 0.5196915160617718, 4.9148890952674416], [20.07205417907795, 0.4767515606055048, 3.0243321089214454], [24.237371993264563, 0.25677306102014397, 2.915673282971702], [26.571560238473822, 0.2515313583005887, 0.6050364897523101], [30.74085632428155, 0.23003226993095427, 4.089025618034095], [44.960721637888916, 0.36111939326703546, 0.5002237726384872], [45.58173752283848, 0.25228627734353326, 3.34677270307716], [51.14697137079574, 0.19137761985290958, 4.291894495013896]], "r_squared_": 0.9751017917000663, "error_": 0.05206176448134306}
{"freq_range": [2.0, 80.0], "freq_res": 1.0, "aperiodic_params_": [-0.053397115887011015, 0.711335808927162], "gaussian_params_": [[8.232161813022524, 0.25152447418764584, 0.6314554316730446], [9.73351380267918, 0.684205820870762, 1.0545913533018034], [15.20798871977476, 0.34724898766852763, 1.4998998914629011], [19.038216959099454, 0.44698832921457615, 2.130324358952409], [28.64687674364894, 0.22862796557144593, 3.4983730105104254], [37.7495586371905, 0.2367415990782572, 1.060668338078584], [46.01117152051431, 0.3738291726028826, 1.9246271718730985], [49.57012148977852, 0.5125956662893305, 0.3488085293804122], [51.64838723898136, 0.43410332297340953, 0.7562201053300289], [70.32761260936164, 0.3025099799713562, 0.814610198167731]], "peak_params_": [[8.232161813022524, 0.4122862998104805, 1.2629108633460893], [9.73351380267918, 0.6685944808911439, 2.109182706603607], [15.20798871977476, 0.4181787821332891, 2.9997997829258023], [19.038216959099454, 0.4662344876225022, 4.260648717904818], [28.64687674364894, 0.22747419211954012, 6.996746021020851], [37.7495586371905, 0.23670975729999444, 2.121336676157168], [46.01117152051431, 0.3738239131302883, 3.849254343746197], [49.57012148977852, 0.32385697202531527, 0.6976170587608244], [51.64838723898136, 0.3925784717742071, 1.5124402106600578], [70.32761260936164, 0.27900885128149855, 1.629220396335462]], "r_squared_": 0.9555087281952701, "error_": 0.054804571472933064}
{"freq_range": [2.0, 80.0], "freq_res": 1.0, "aperiodic_params_": [-0.33156667517234395, 0.6198917578318687], "gaussian_params_": [[9.295441375521028, 0.596703036752615, 1.0341527103170014], [17.072857184636, 0.2907505808975369, 3.170648708466138], [29.926347036140537, 0.2793362146043499, 0.6019485555879047], [59.71677740829027, 0.2660657322910534, 0.853911073911419], [62.48241353714365, 0.9341764135596734, 0.2751578890277013], [78.59268361715127, 0.9126096874041317, 0.2500005888689886]], "peak_params_": [[9.295441375521028, 0.5842144036423572, 2.068305420634003], [17.072857184636, 0.29067383029724236, 6.341297416932276], [29.926347036140537, 0.2773244288065031, 1.2038971111758094], [59.71677740829027, 0.25182605815306447, 1.707822147822838], [62.48241353714365, 0.2083480565203606, 0.5503157780554025], [78.59268361715127, 0.24202994309849668, 0.5000011777379773]], "r_squared_": 0.9332797993397596, "error_": 0.05995544865552669}
{"freq_range": [2.0, 80.0], "freq_res": 1.0, "aperiodic_params_": [-0.3596063256573642, 0.5412067246671861], "gaussian_params_": [[7.605143393832647, 0.5224558501110547, 0.28978684942627414], [9.823101202413149, 0.836293071457294, 0.9215917573635618], [18.91774462566373, 0.3967536818367524, 4.022430159837082], [31.598350870020635, 0.27028424807257584, 2.9441705958297684], [41.0729069702056, 0.19588350755208647, 2.000529184767602], [44.996130880179216, 0.3224840910919086, 0.25000000000418665], [48.26008210311936, 0.19439484558669443, 2.0838810853072776], [51.541410560699795, 0.7229592109301094, 0.29912530834393125], [56.52256830435552, 1.1266132553777635, 0.28458508193141585], [75.55216659658004, 0.6077913055143632, 0.3318705305446542]], "peak_params_": [[7.605143393832647, 0.3346522894418853, 0.5795736988525483], [9.823101202413149, 0.8550073658141805, 1.8431835147271236], [18.91774462566373, 0.39669929397394665, 8.044860319674164], [31.598350870020635, 0.26979020058271863, 5.888341191659537], [41.0729069702056, 0.19785351437425436, 4.001058369535204], [44.996130880179216, 0.4081573368580247, 0.5000000000083733], [48.26008210311936, 0.1933747888061239, 4.167762170614555], [51.541410560699795, 0.2620584336433416, 0.5982506166878625], [56.52256830435552, 0.275844646315317, 0.5691701638628317], [75.55216659658004, 0.24453578901307238, 0.6637410610893084]], "r_squared_": 0.9460424280713321, "error_": 0.05130965670061009}
{"freq_range": [2.0, 80.0], "freq_res": 1.0, "aperiodic_params_": [-0.16086441593399461, 0.653087033190315], "gaussian_params_": [[7.566548340177734, 1.0529419535887414, 0.2678524451995662], [9.781092044223948, 0.9908021870592539, 0.918890763441476], [18.70291396514406, 0.5139953309561923, 4.405553441766011], [31.593110753966016, 0.33036916379679465, 2.522437572491827], [41.585687742057885, 0.16300128094605293, 2.8690333322054333], [45.4001823215857, 1.2445078149470066, 0.26955095158720604], [47.315034402879725, 0.45939214328214534, 0.6274834233549366], [49.33229489649879, 0.3785981510950134, 0.6424458760740188], [51.600399942291254, 0.34473632347969174, 0.4243245125523618], [56.54112861950907, 1.1113972747683876, 0.2500125631905916], [62.53201676161252, 0.22686933307385748, 0.7291401412115268]], "peak_params_": [[7.566548340177734, 0.4625717053856656, 0.5357048903991324], [9.781092044223948, 1.03612304988223, 1.837781526882952], [18.70291396514406, 0.5128292649600159, 8.811106883532021], [31.593110753966016, 0.3321176775950946, 5.044875144983654], [41.585687742057885, 0.16137744805300658, 5.738066664410867], [45.4001823215857, 0.494207983974704, 0.5391019031744121], [47.315034402879725, 0.43298391156722615, 1.2549668467098731], [49.33229489649879, 0.34946211554644613, 1.2848917521480376], [51.600399942291254, 0.22155519555843806, 0.8486490251047236], [56.54112861950907, 0.20623978023721468, 0.5000251263811832], [62.53201676161252, 0.18463890213063983, 1.4582802824230536]], "r_squared_": 0.9684874049068547, "error_": 0.04976557222168701}
{"freq_range": [2.0, 80.0], "freq_res": 1.0, "aperiodic_params_": [0.0641641690843281, 0.7913252056608107], "gaussian_params_": [[9.623255597172104, 0.9854402263986672, 1.2909455950250999], [17.99449753896917, 0.5876955189363171, 3.679839905649937], [30.56646704175877, 0.2517433802925072, 4.573463750743347], [45.023501425433295, 0.4521780023266716, 0.735817369434199], [47.449822525532454, 1.9031711205870454, 0.25747160281760556], [49.34178432166122, 0.341472198884587, 0.5724485090750779], [51.69911221807651, 0.34218798277263035, 0.3624192820915429]], "peak_params_": [[9.623255597172104, 0.999862915579421, 2.5818911900501997], [17.99449753896917, 0.5934696775392364, 7.359679811299874], [30.56646704175877, 0.25175451625962186, 9.146927501486694], [45.023501425433295, 0.45367801430338583, 1.471634738868398], [47.449822525532454, 0.4264353067908311, 0.5149432056352111], [49.34178432166122, 0.28579936326565347, 1.1448970181501559], [51.69911221807651, 0.24244489535846103, 0.7248385641830858]], "r_squared_": 0.9739110860923729, "error_": 0.05300347093356559}
{"freq_range": [2.0, 80.0], "freq_res": 1.0, "aperiodic_params_": [0.20661210488079276, 0.8873926009111182], "gaussian_params_": [[7.520895991653663, 1.0846887732353407, 0.267999298562064], [9.690990852174892, 1.0772519118470407, 0.9656611277435388], [17.401387976351643, 0.5478374946316418, 3.9765979580903896], [29.60633123920724, 0.2107433580804265, 4.16089885555126], [39.45328874274053, 0.6894010316475039, 0.26387749372149094], [44.95931861388035, 0.38933803377289355, 0.7139956842824388], [47.422190732745925, 0.9630839984565271, 0.2779814678421013], [51.62710844351214, 0.6527664053228371, 0.2500046916980681]], "peak_params_": [[7.520895991653663, 0.4854521110335438, 0.535998597124128], [9.690990852174892, 1.1204080927524875, 1.9313222554870777], [17.401387976351643, 0.5471943437791156, 7.953195916180779], [29.60633123920724, 0.21342512949590353, 8.32179771110252], [39.45328874274053, 0.1741362222376559, 0.5277549874429819], [44.95931861388035, 0.3889312986966076, 1.4279913685648775], [47.422190732745925, 0.31051988766326166, 0.5559629356842026], [51.62710844351214, 0.21462164587187416, 0.5000093833961362]], "r_squared_": 0.9801225124110962, "error_": 0.049584790105110355}
{"freq_range": [2.0, 80.0], "freq_res": 1.0, "aperiodic_params_": [0.1605182514883081, 0.8618800061066526], "gaussian_params_": [[7.501540040528429, 0.8447598382781784, 0.289900096350917], [9.669184161969014, 1.1327634801388917, 0.9824706978349803], [16.04256529528239, 0.4982785507598356, 2.8453606676234053], [20.011732968485255, 0.12380231493347617, 0.25060364065284946], [20.40859139592577, 0.22068172389719948, 2.357104244060804], [26.21125616605935, 0.13355328873755692, 0.7684994988779995], [29.609490176559824, 0.16407878502748888, 5.999281907179151], [45.014717302722445, 0.31809096804837483, 1.0425321670833592], [47.41532851045276, 0.5609043593303371, 0.2944289604052863]], "peak_params_": [[7.501540040528429, 0.4695843176136714, 0.579800192701834], [9.669184161969014, 1.1233905807206659, 1.9649413956699606], [16.04256529528239, 0.5491255531632765, 5.690721335246811], [20.011732968485255, 0.5759641352150928, 0.5012072813056989], [20.40859139592577, 0.5759641352150928, 4.714208488121608], [26.21125616605935, 0.2798461417896809, 1.536998997755999], [29.609490176559824, 0.16379122629663057, 11.998563814358302], [45.014717302722445, 0.32416806360235917, 2.0850643341667183], [47.41532851045276, 0.2617437494114392, 0.5888579208105726]], "r_squared_": 0.978376258227532, "error_": 0.05245450586300886}
{"freq_range": [2.0, 80.0], "freq_res": 1.0, "aperiodic_params_": [0.29838397458536753, 0.9579151071105316], "gaussian_params_": [[7.534831310491769, 0.79229729073767, 0.2681793956903795], [9.700739627110618, 1.013316037414232, 0.9566864612929886], [17.602231180935174, 0.5751201426663533, 3.615482279949203], [29.28289060265794, 0.19464184234006174, 3.58359099295654], [45.48717613014415, 0.24508648037988492, 2.139311704301511], [49.54796540086405, 0.6999475809495816, 0.2500000000019428], [51.559746139481426, 1.065958833461458, 0.2648863094225801]], "peak_params_": [[7.534831310491769, 0.40161156150608074, 0.536358791380759], [9.700739627110618, 1.027983215153606, 1.9133729225859772], [17.602231180935174, 0.5730198403059804, 7.230964559898406], [29.28289060265794, 0.19803308376184026, 7.16718198591308], [45.48717613014415, 0.23882614688833215, 4.278623408603022], [49.54796540086405, 0.16298725875022235, 0.5000000000038856], [51.559746139481426, 0.2702312249790928, 0.5297726188451602]], "r_squared_": 0.9801690707299705, "error_": 0.054948459791114596}
{"freq_range": [2.0, 80.0], "freq_res": 1.0, "aperiodic_params_": [0.010561279446127178, 0.7974397245845439], "gaussian_params_": [[9.632377567071433, 0.9082285927610783, 1.1699492426786553], [15.168391269635988, 0.10677572021741613, 0.9095348165730803], [18.25988628225766, 0.5142941750115153, 3.7038244470201485], [29.658903804965966, 0.2322773162606825, 2.4416284943396245], [46.16219588746154, 0.253266452759585, 2.383287219916676], [51.42336239140826, 0.23594788772151207, 0.8213110291552403]], "peak_params_": [[9.632377567071433, 0.9072630347010553, 2.3398984853573106], [15.168391269635988, 0.454125300460697, 1.8190696331461607], [18.25988628225766, 0.513871386543663, 7.407648894040297], [29.658903804965966, 0.23340626908380013, 4.883256988679249], [46.16219588746154, 0.25268062260758195, 4.766574439833352], [51.42336239140826, 0.23886669247555936, 1.6426220583104807]], "r_squared_": 0.972481377091137, "error_": 0.054407126541426654}
{"freq_range": [2.0, 80.0], "freq_res": 1.0, "aperiodic_params_": [0.08521936128765785, 0.8418437819156434], "gaussian_params_": [[8.384053863133637, 0.41221274617390724, 0.28489104735926957], [9.721308114231292, 0.6180250441956486, 0.9240020766179391], [18.366520154997, 0.3287299848073422, 3.85747468365212], [29.439169685037303, 0.19857770473598946, 2.113286939490534], [37.25707394876207, 0.3144433647596427, 0.2500095485672527], [38.669124158015244, 0.35885265362994456, 0.2793656429880178], [46.89068127377024, 0.26780078991742573, 2.2882070982336984], [51.5431552052587, 0.4865753119972435, 0.32470277012720605], [56.29517546956984, 0.18559089709145846, 0.846751820674109], [70.36099778253272, 0.23139398719176477, 0.9294812431633283]], "peak_params_": [[8.384053863133637, 0.2840349525036666, 0.5697820947185391], [9.721308114231292, 0.6218289758193107, 1.8480041532358782], [18.366520154997, 0.32724953473462703, 7.71494936730424], [29.439169685037303, 0.20169411311238505, 4.226573878981068], [37.25707394876207, 0.1856880895081363, 0.5000190971345054], [38.669124158015244, 0.17866312685827457, 0.5587312859760356], [46.89068127377024, 0.26749534525717955, 4.576414196467397], [51.5431552052587, 0.20298065985052816, 0.6494055402544121], [56.29517546956984, 0.17474704731503543, 1.693503641348218], [70.36099778253272, 0.2145836996187067, 1.8589624863266565]], "r_squared_": 0.978335661730437, "error_": 0.04136449107352252}
{"freq_range": [2.0, 80.0], "freq_res": 1.0, "aperiodic_params_": [-0.20010093391504652, 0.5638692825922461], "gaussian_params_": [[9.811609055139371, 0.5230545807709761, 1.0485819350290049], [20.59241951524588, 0.22002708694816647, 5.800348570117864], [31.458969050543537, 0.1990348557934573, 2.254049990378031], [37.41382180182517, 0.5053573527152331, 0.27598525182915296], [41.171284130313566, 0.1580176242864584, 1.9079831455901455], [45.542771819142516, 0.20311095476505822, 1.2932081256630235], [59.63311055378597, 0.49047158101956173, 0.252834192083273]], "peak_params_": [[9.811609055139371, 0.5562059035669025, 2.0971638700580097], [20.59241951524588, 0.21948875486373465, 11.600697140235727], [31.458969050543537, 0.23894255132284303, 4.508099980756062], [37.41382180182517, 0.19241185387520865, 0.5519705036583059], [41.171284130313566, 0.1582838982631849, 3.815966291180291], [45.542771819142516, 0.19724485090324717, 2.586416251326047], [59.63311055378597, 0.17114509223195107, 0.505668384166546]], "r_squared_": 0.9590239313684963, "error_": 0.04348483401660075}
{"freq_range": [2.0, 80.0], "freq_res": 1.0, "aperiodic_params_": [-0.2958156393829957, 0.587864851345097], "gaussian_params_": [[9.76426791354787, 1.0782818936345335, 1.158079695192889], [19.38192191933075, 0.5349187311425919, 4.841913486406619], [31.271202015415568, 0.2664940357543703, 2.693032230772667], [44.82248911276217, 0.1907612898555966, 5.369900998355649]], "peak_params_": [[9.76426791354787, 1.1380217247665785, 2.316159390385778], [19.38192191933075, 0.5332673192532148, 9.683826972813238], [31.271202015415568, 0.3021567214873915, 5.386064461545334], [44.82248911276217, 0.1906581439825965, 10.739801996711298]], "r_squared_": 0.9622222420722192, "error_": 0.05944544557842159}
{"freq_range": [2.0, 80.0], "freq_res": 1.0, "aperiodic_params_": [0.20502004292757336, 0.8812557809661876], "gaussian_params_": [[9.765886122166718, 1.0660900919053902, 1.0971142488768837], [19.08172996737415, 0.4914101023567664, 5.03316330233974], [31.803888080068685, 0.2429192470180393, 2.5461969440606933], [45.29022465871048, 0.1914746722958249, 4.619676319539886], [46.9586268318058, 0.08039293626338326, 0.2500552108301973]], "peak_params_": [[9.765886122166718, 1.1385769355825934, 2.1942284977537674], [19.08172996737415, 0.49134612057324945, 10.06632660467948], [31.803888080068685, 0.26349165081489334, 5.092393888121387], [45.29022465871048, 0.1910984031542351, 9.239352639079772], [46.9586268318058, 0.25809977789211125, 0.5001104216603947]], "r_squared_": 0.975430875169693, "error_": 0.05846492061639001}
{"freq_range": [2.0, 80.0], "freq_res": 1.0, "aperiodic_params_": [0.10601793825881818, 0.8430207712829546], "gaussian_params_": [[9.769269836630846, 1.3185061972814582, 1.1947225439874154], [14.354996590074826, 0.2966368170817077, 1.4229423085790238], [18.766151916614724, 0.5047737576726342, 2.678118395681235], [28.512653898787686, 0.22576434786186486, 5.752196851044639], [45.4199189815725, 0.20364537605773037, 3.0731177254036166]], "peak_params_": [[9.769269836630846, 1.3005404956878066, 2.389445087974831], [14.354996590074826, 0.4030026417763702, 2.8458846171580476], [18.766151916614724, 0.5618086310803717, 5.35623679136247], [28.512653898787686, 0.22529627190164236, 11.504393702089278], [45.4199189815725, 0.2054657027724771, 6.146235450807233]], "r_squared_": 0.9803982648994414, "error_": 0.0519523977070616}
{"freq_range": [2.0, 80.0], "freq_res": 1.0, "aperiodic_params_": [0.03938141717914019, 0.7849472867058253], "gaussian_params_": [[9.742872231117072, 1.1640450017218769, 0.9591388544356837], [18.529095747542378, 0.5312853401042449, 5.978639006154132]], "peak_params_": [[9.742872231117072, 1.3150006235857028, 1.9182777088713674], [18.529095747542378, 0.5296398889307337, 11.957278012308263]], "r_squared_": 0.9632025498708564, "error_": 0.07004711649476777}
{"freq_range": [2.0, 80.0], "freq_res": 1.0, "aperiodic_params_": [-0.34087194051416203, 0.5353751549375076], "gaussian_params_": [[9.690902242530155, 1.0487612352680258, 1.149305633825011], [17.42330884789844, 0.48359100993568704, 3.6603408227716043], [26.913507534173043, 0.19766215869485163, 5.9999999999996465]], "peak_params_": [[9.690902242530155, 1.077082742942286, 2.298611267650022], [17.42330884789844, 0.5308487064865668, 7.320681645543209], [26.913507534173043, 0.2134197644019864, 11.999999999999293]], "r_squared_": 0.9579285395931579, "error_": 0.05955624831180927}
{"freq_range": [2.0, 80.0], "freq_res": 1.0, "aperiodic_params_": [-0.7420483961562865, 0.09991543739273238], "gaussian_params_": [[9.585993469055866, 0.813096540539236, 0.28485637092293137], [9.854528308969998, 0.3865009318418904, 1.3223039412878375], [21.29925421764191, 0.21950424423014478, 5.007113695274933], [29.775825944084943, 0.1772804240056317, 0.47119462985106364], [41.458045872558486, 0.08349225951203922, 5.999967071126305], [51.96538302092273, 0.13591892285784063, 0.25000000335305333], [56.734774469379715, 0.21352461004678797, 0.9942898968972727]], "peak_params_": [[9.585993469055866, 0.6841573716039941, 0.5697127418458627], [9.854528308969998, 0.6841573716039941, 2.644607882575675], [21.29925421764191, 0.21936207648511263, 10.014227390549866], [29.775825944084943, 0.22029447762283405, 0.9423892597021273], [41.458045872558486, 0.08334478375320453, 11.99993414225261], [51.96538302092273, 0.15246080720317257, 0.5000000067061067], [56.734774469379715, 0.2089763640025346, 1.9885797937945453]], "r_squared_": 0.801424722900469, "error_": 0.04809514141712008}
{"freq_range": [2.0, 80.0], "freq_res": 1.0, "aperiodic_params_": [-0.06573793668461843, 0.7196339651422858], "gaussian_params_": [[9.860159198040806, 1.0715359216333502, 0.9919087487599147], [19.479694668820223, 0.4468011157216862, 4.894869502714189], [31.441292228170354, 0.25906160615107926, 2.3467945630358096], [43.87504898048266, 0.1695049482101356, 4.508305561615086]], "peak_params_": [[9.860159198040806, 1.1294367771000768, 1.9838174975198295], [19.479694668820223, 0.4446609885488334, 9.789739005428379], [31.441292228170354, 0.2854024397970074, 4.693589126071619], [43.87504898048266, 0.1694416023049532, 9.016611123230172]], "r_squared_": 0.9718907852752167, "error_": 0.053868602782362274}
{"freq_range": [2.0, 80.0], "freq_res": 1.0, "aperiodic_params_": [-0.05136619357552709, 0.7153479441087283], "gaussian_params_": [[9.856602994823959, 0.9714415612086782, 0.9641147321358187], [19.584489125763756, 0.40897008777983646, 5.999999999999999], [38.64389620259212, 0.19886542515410108, 5.999999999999999]], "peak_params_": [[9.856602994823959, 1.0749377890629428, 1.9282294642716373], [19.584489125763756, 0.4095824802986946, 11.999999999999998], [38.64389620259212, 0.20069272147766015, 11.999999999999998]], "r_squared_": 0.9647535816483568, "error_": 0.05900061711311658}
{"freq_range": [2.0, 80.0], "freq_res": 1.0, "aperiodic_params_": [-0.23890070649554956, 0.6009737445949964], "gaussian_params_": [[9.792369712454366, 1.066284024636803, 1.027127311008257], [18.119631459055153, 0.4746347174808013, 4.279362504736508], [30.325360837827162, 0.20442494868498837, 5.999999999999999]], "peak_params_": [[9.792369712454366, 1.1238304981462408, 2.054254622016514], [18.119631459055153, 0.49923524018789994, 8.558725009473015], [30.325360837827162, 0.21418796536553764, 11.999999999999998]], "r_squared_": 0.9556518379047882, "error_": 0.06407807094995206}
{"freq_range": [2.0, 80.0], "freq_res": 1.0, "aperiodic_params_": [-0.9805683938248834, 0.2709581582371709], "gaussian_params_": [[8.621181571364243, 0.485857082328588, 0.8723433874025645], [10.795473049128804, 0.4293526521576787, 0.9788858735638172], [13.444078734079923, 0.8984284345293005, 0.31436687288758525], [17.79148589092149, 0.36367370640074254, 2.6015344855366984], [21.573573117199892, 0.60335027809853, 0.27099984355142165], [29.16023385619072, 0.34140882298372965, 5.851754171825184], [40.968407287847256, 0.22501921298529795, 1.2944653256600007], [45.50768517210588, 0.21737138279718252, 1.7383659125775979], [50.86238775555934, 0.215552105505693, 1.0803778742053407], [57.11519738101394, 0.16348921857798251, 1.513454741430541], [67.88097760869132, 0.17691810294337457, 0.2500004617708648]], "peak_params_": [[8.621181571364243, 0.5240967591160695, 1.744686774805129], [10.795473049128804, 0.4466917927965325, 1.9577717471276344], [13.444078734079923, 0.439497291614377, 0.6287337457751705], [17.79148589092149, 0.41790027859344425, 5.203068971073397], [21.573573117199892, 0.43472008257575445, 0.5419996871028433], [29.16023385619072, 0.34131473302047, 11.703508343650368], [40.968407287847256, 0.27657803738026, 2.5889306513200014], [45.50768517210588, 0.21438575560464157, 3.4767318251551957], [50.86238775555934, 0.2156574420552071, 2.1607557484106814], [57.11519738101394, 0.16302048516083345, 3.026909482861082], [67.88097760869132, 0.15796234983600055, 0.5000009235417296]], "r_squared_": 0.947715092331642, "error_": 0.039181945200548164}
{"freq_range": [2.0, 80.0], "freq_res": 1.0, "aperiodic_params_": [-0.28970187770037437, 0.8081177209703913], "gaussian_params_": [[8.481953408409849, 1.6358962907143544, 0.2500011273792752], [9.989133697165899, 0.5824383346180125, 0.7403266371169006], [19.73551720254819, 0.4177610018265001, 3.213479793111378], [26.043017810630758, 0.24876223218292198, 0.562806271743626], [30.716519037527263, 0.2362444534163368, 1.6365057713095572], [43.958147608280925, 0.13276379915130987, 4.747679773407485], [54.606149311505206, 0.4922038581304328, 0.250002379950868]], "peak_params_": [[8.481953408409849, 0.27141310993606726, 0.5000022547585504], [9.989133697165899, 0.5866204811965346, 1.4806532742338012], [19.73551720254819, 0.4163488358840314, 6.426959586222756], [26.043017810630758, 0.3143271503432701, 1.125612543487252], [30.716519037527263, 0.23682553084329117, 3.2730115426191144], [43.958147608280925, 0.13275864070458177, 9.49535954681497], [54.606149311505206, 0.1511867532145772, 0.500004759901736]], "r_squared_": 0.9731670305412813, "error_": 0.04330106542783661}
{"freq_range": [2.0, 80.0], "freq_res": 1.0, "aperiodic_params_": [-0.411549801268013, 0.5932660319234], "gaussian_params_": [[9.690699266993661, 0.49314310968174063, 1.3420661056362158], [19.41133851189557, 0.3841673270307296, 3.263432986034805], [26.538978737091227, 0.16298758370885563, 1.4432032314911722], [30.154047221954603, 0.1562564103691048, 0.5006188393563767], [32.87338484521872, 0.1602280306915543, 2.722525081910331], [40.719527343990784, 0.11340269550839406, 0.5271110680410037], [45.30534299054219, 0.17491072403136454, 2.8860486142936845], [72.4801239843462, 1.443780222831446, 0.2660476788486838]], "peak_params_": [[9.690699266993661, 0.4862246102471315, 2.6841322112724315], [19.41133851189557, 0.38112829192777886, 6.52686597206961], [26.538978737091227, 0.1962400240131501, 2.8864064629823445], [30.154047221954603, 0.25201284675995694, 1.0012376787127535], [32.87338484521872, 0.16014784784005087, 5.445050163820662], [40.719527343990784, 0.15778357980331137, 1.0542221360820074], [45.30534299054219, 0.17394240197721222, 5.772097228587369], [72.4801239843462, 0.28333564993305704, 0.5320953576973676]], "r_squared_": 0.9697546801794953, "error_": 0.035125020832789684}
{"freq_range": [2.0, 80.0], "freq_res": 1.0, "aperiodic_params_": [-0.3643672841484176, 0.7644024715131242], "gaussian_params_": [[8.549544955594, 1.2535219812014715, 0.30726503120581544], [10.386906361834512, 1.1670316053907397, 0.3366819249662385], [19.783192895845456, 0.3569427485021465, 3.435306596647658], [25.68111996633926, 0.2070402055773861, 0.4633547349311439], [30.48874128051757, 0.17707145107165187, 1.1495360735071105], [39.17107906469944, 0.14481713511441854, 2.4816351708413515], [43.06502320382081, 0.09285597802699251, 0.25178060481543124], [45.58969570858609, 0.1438268497759269, 1.4999333611469612], [54.97903558771939, 0.15768496409157842, 0.25000000000000006], [59.96658729435713, 0.19313181918940464, 0.663668357516434]], "peak_params_": [[8.549544955594, 0.43082541309318734, 0.6145300624116309], [10.386906361834512, 0.6092055420582855, 0.673363849932477], [19.783192895845456, 0.3562325950609724, 6.870613193295316], [25.68111996633926, 0.23288588295123525, 0.9267094698622877], [30.48874128051757, 0.16621076042811844, 2.299072147014221], [39.17107906469944, 0.1444827425944506, 4.963270341682703], [43.06502320382081, 0.16625428962739863, 0.5035612096308625], [45.58969570858609, 0.14182992359818303, 2.9998667222939224], [54.97903558771939, 0.15713150963343914, 0.5000000000000001], [59.96658729435713, 0.19288721170995382, 1.327336715032868]], "r_squared_": 0.9763566885518811, "error_": 0.038778992819749766}
