{"freq_range": [2.0, 80.0], "freq_res": 1.0, "aperiodic_params_": [0.6383878092600992, 1.374395707468744], "gaussian_params_": [[9.03416427836694, 1.141167048762813, 2.2570078706413357], [14.680523368327584, 0.2685007239583987, 1.4287481442742405], [19.338768077436846, 0.35642529175144505, 2.5413001994233855], [71.45203459913596, 0.11043219289049645, 5.999999999999999]], "peak_params_": [[9.03416427836694, 1.1412262601673198, 4.514015741282671], [14.680523368327584, 0.37954742542429554, 2.857496288548481], [19.338768077436846, 0.3561200553010462, 5.082600398846771], [71.45203459913596, 0.11011923173357929, 11.999999999999998]], "r_squared_": 0.9914735418524869, "error_": 0.04946925578357887}
{"freq_range": [2.0, 80.0], "freq_res": 1.0, "aperiodic_params_": [0.5860122242014582, 1.263762762573359], "gaussian_params_": [[8.951277517433242, 1.123940448896482, 2.156939977127533], [14.509713248158583, 0.24721449513490176, 1.487892519594998], [19.354000359371284, 0.3630470001967831, 2.186247187480238], [71.76716854597005, 0.09265233342482486, 5.999999999999999]], "peak_params_": [[8.951277517433242, 1.1239189205032303, 4.313879954255066], [14.509713248158583, 0.30615310189837175, 2.975785039189996], [19.354000359371284, 0.3609429657583211, 4.372494374960476], [71.76716854597005, 0.09258259956881987, 11.999999999999998]], "r_squared_": 0.9905970013993115, "error_": 0.04802748680594534}
{"freq_range": [2.0, 80.0], "freq_res": 1.0, "aperiodic_params_": [0.5970280879178865, 1.3681017975315277], "gaussian_params_": [[8.968433369889745, 1.0593738644169182, 2.164058575847861], [15.73680772926761, 0.3762418839850757, 2.6580523928529836], [19.719906544686253, 0.26784925049172736, 0.6792320059875141], [22.734534573515276, 0.18839913830525604, 1.2247858296720944], [65.10472632317372, 0.17789462531122166, 0.5457787394415519], [73.92743712643878, 0.18220776219986207, 1.2892295469553887]], "peak_params_": [[8.968433369889745, 1.07441740139505, 4.328117151695722], [15.73680772926761, 0.3798033280433848, 5.316104785705967], [19.719906544686253, 0.3655636494401293, 1.3584640119750282], [22.734534573515276, 0.193024674143899, 2.4495716593441887], [65.10472632317372, 0.1746495870932505, 1.0915574788831037], [73.92743712643878, 0.18191938466744118, 2.5784590939107774]], "r_squared_": 0.9912646813328292, "error_": 0.048731981836215923}
{"freq_range": [2.0, 80.0], "freq_res": 1.0, "aperiodic_params_": [0.8485917602692001, 1.4301416412730228], "gaussian_params_": [[8.96286812962781, 1.0685692213647153, 2.247744841032877], [14.472577458374728, 0.23817529223976336, 1.3179576406279763], [18.773893421926676, 0.3329225070762258, 2.991844976556492], [59.580883112323285, 0.6076168007086393, 0.2798715698210324], [73.94461213174917, 0.2336059299093804, 0.7260192538746028]], "peak_params_": [[8.96286812962781, 1.0700692022466494, 4.495489682065754], [14.472577458374728, 0.403314509401135, 2.6359152812559525], [18.773893421926676, 0.33267543056753923, 5.983689953112984], [59.580883112323285, 0.19799504518676536, 0.5597431396420648], [73.94461213174917, 0.2329271091241143, 1.4520385077492055]], "r_squared_": 0.9928813554673295, "error_": 0.04693103936298485}
{"freq_range": [2.0, 80.0], "freq_res": 1.0, "aperiodic_params_": [0.588969262357071, 1.0868561966388404], "gaussian_params_": [[8.810030233348918, 1.0338997214781656, 2.2082627062977664], [15.749893105595481, 0.22451852761697347, 1.8413597012891119], [19.77222738439333, 0.26994442402373814, 1.269721670562516], [52.54796540086405, 0.13217300748066235, 5.9999999999995515]], "peak_params_": [[8.810030233348918, 1.0303522840087147, 4.416525412595533], [15.749893105595481, 0.23088574008395785, 3.6827194025782237], [19.77222738439333, 0.2812845620160418, 2.539443341125032], [52.54796540086405, 0.13179843357923327, 11.999999999999103]], "r_squared_": 0.9801218021039024, "error_": 0.06478962199010677}
{"freq_range": [2.0, 80.0], "freq_res": 1.0, "aperiodic_params_": [0.4913671591610334, 1.057048318983573], "gaussian_params_": [[8.87037671547291, 0.9729796560375484, 2.0150591664313344], [15.684238709412185, 0.17366065935496003, 2.9034547684815126], [20.29538220430867, 0.18841721226941952, 1.80614641295695], [63.05871685382724, 0.1694034860427724, 0.4993037572399282]], "peak_params_": [[8.87037671547291, 0.983238136291521, 4.030118332862669], [15.684238709412185, 0.18563971908859722, 5.806909536963025], [20.29538220430867, 0.24344853407727762, 3.6122928259139], [63.05871685382724, 0.16823617225187526, 0.9986075144798564]], "r_squared_": 0.9872833933340799, "error_": 0.04656483389107931}
{"freq_range": [2.0, 80.0], "freq_res": 1.0, "aperiodic_params_": [0.5257338104578343, 1.2976447800961866], "gaussian_params_": [[9.174436178226808, 0.9665339424127306, 2.2287958818624585], [15.902646316806774, 0.3055969983490846, 2.409294696901761], [19.697303030240423, 0.2217089164945956, 0.5391363097934223], [22.67609293784017, 0.2002880332254961, 1.274622993309983], [74.26924043478411, 0.2505732277471294, 0.7867176741308151]], "peak_params_": [[9.174436178226808, 0.9686219530487683, 4.457591763724917], [15.902646316806774, 0.31423344617446836, 4.818589393803522], [19.697303030240423, 0.2834555271047199, 1.0782726195868446], [22.67609293784017, 0.19791250944926775, 2.549245986619966], [74.26924043478411, 0.23632066387997197, 1.5734353482616301]], "r_squared_": 0.990685140667359, "error_": 0.05053733262436113}
{"freq_range": [2.0, 80.0], "freq_res": 1.0, "aperiodic_params_": [0.6808292695743565, 1.3410278081543503], "gaussian_params_": [[9.07344165608813, 1.003366028752554, 2.359262067468053], [14.891401118508144, 0.22157860798968812, 1.2838865138387403], [19.333580626956767, 0.3102920188374873, 3.6680460511144806]], "peak_params_": [[9.07344165608813, 1.0087523054450578, 4.718524134936106], [14.891401118508144, 0.41797212775736353, 2.5677730276774806], [19.333580626956767, 0.31047881049030157, 7.336092102228961]], "r_squared_": 0.9904409166850793, "error_": 0.052495042797540505}
{"freq_range": [2.0, 80.0], "freq_res": 1.0, "aperiodic_params_": [0.9944200965002572, 1.5291996149568694], "gaussian_params_": [[8.72089039160509, 1.0117670151633549, 2.2385936318184876], [17.20001730714331, 0.4458258004624427, 4.466123236362803], [74.10122857437113, 0.20314405658568183, 1.0136611136822298], [78.15071156635987, 0.16690966971356003, 1.35695911580724]], "peak_params_": [[8.72089039160509, 1.0865649652541127, 4.477187263636975], [17.20001730714331, 0.4464627987957369, 8.932246472725605], [74.10122857437113, 0.20368511266114364, 2.0273222273644596], [78.15071156635987, 0.16600795262351276, 2.71391823161448]], "r_squared_": 0.9914224396193163, "error_": 0.055083473080762974}
{"freq_range": [2.0, 80.0], "freq_res": 1.0, "aperiodic_params_": [1.0038804647902708, 1.5326701977789225], "gaussian_params_": [[8.706019336807769, 1.009425182512821, 2.2297280644464186], [17.14103954958459, 0.44647920934763186, 4.504939022682232], [76.77837047419831, 0.14614873059576275, 3.1365856946772412]], "peak_params_": [[8.706019336807769, 1.0879172831861934, 4.459456128892837], [17.14103954958459, 0.44725939965382555, 9.009878045364465], [76.77837047419831, 0.14578434264975115, 6.2731713893544825]], "r_squared_": 0.9903495654159444, "error_": 0.058029280210557456}
{"freq_range": [2.0, 80.0], "freq_res": 1.0, "aperiodic_params_": [1.0854975038596613, 1.5635902459395903], "gaussian_params_": [[8.713762586941481, 1.0872438714080284, 2.248090993376921], [17.32332369180275, 0.46421573099130903, 4.132840741880263], [59.59687121448183, 0.8332290411912469, 0.2526412257787527], [74.04041916703694, 0.18762533681755658, 0.8781652606640982]], "peak_params_": [[8.713762586941481, 1.1395570920177376, 4.496181986753842], [17.32332369180275, 0.4640168562624326, 8.265681483760526], [59.59687121448183, 0.2332819127159198, 0.5052824515575054], [74.04041916703694, 0.1874267027607721, 1.7563305213281963]], "r_squared_": 0.9920538301953996, "error_": 0.05357460583369794}
{"freq_range": [2.0, 80.0], "freq_res": 1.0, "aperiodic_params_": [1.0356643401811538, 1.5154016020811634], "gaussian_params_": [[8.83804695966695, 1.1315541206202375, 2.317618586697113], [14.435918157239502, 0.17539770875233324, 1.2198506659932722], [18.738548470011075, 0.43278044266069504, 3.4047683448118766], [59.63676763539635, 0.578598987226714, 0.2613939525172967]], "peak_params_": [[8.83804695966695, 1.136043621621132, 4.635237173394226], [14.435918157239502, 0.42358581750450386, 2.4397013319865444], [18.738548470011075, 0.43174204977367586, 6.809536689623753], [59.63676763539635, 0.2203283940462486, 0.5227879050345934]], "r_squared_": 0.9921230701582978, "error_": 0.050286709184870736}
{"freq_range": [2.0, 80.0], "freq_res": 1.0, "aperiodic_params_": [0.8235782040129122, 1.277936760273988], "gaussian_params_": [[8.881109435087764, 1.051384009983323, 2.384222128973339], [14.611233376793693, 0.2510674777161378, 1.234761531059238], [19.138819336535516, 0.35072086946126896, 2.3497384519005404], [59.96820680312414, 0.12851038925231215, 0.2500013776598374], [65.17714895111949, 0.12687612835288195, 2.431967416749278]], "peak_params_": [[8.881109435087764, 1.0501176552775469, 4.768444257946678], [14.611233376793693, 0.3523145726554514, 2.469523062118476], [19.138819336535516, 0.3506917029752409, 4.699476903801081], [59.96820680312414, 0.1406374367204628, 0.5000027553196748], [65.17714895111949, 0.12653997640546, 4.863934833498556]], "r_squared_": 0.9891240624554369, "error_": 0.055025006926075315}
{"freq_range": [2.0, 80.0], "freq_res": 1.0, "aperiodic_params_": [0.7176151517044963, 1.2035796567795802], "gaussian_params_": [[6.503268623562594, 0.5662047185665949, 1.1329418464108547], [7.975327164117607, 0.15406148421684307, 0.25377041916839005], [9.50833749158847, 0.9126282399153663, 1.3092147428964562], [13.822912255343597, 0.2871386705527071, 2.893567910909974], [20.026359062063616, 0.3062206170448177, 2.140491329771059], [59.54202252278131, 0.5227955183723613, 0.286537681377871], [76.9690060435444, 0.14227684867539228, 1.3581978762424831]], "peak_params_": [[6.503268623562594, 0.6778422045347782, 2.2658836928217094], [7.975327164117607, 0.8977965994461933, 0.5075408383367801], [9.50833749158847, 0.9752978644328001, 2.6184294857929125], [13.822912255343597, 0.2949572564951336, 5.787135821819948], [20.026359062063616, 0.33560797384208196, 4.280982659542118], [59.54202252278131, 0.14574885553760142, 0.573075362755742], [76.9690060435444, 0.14223980827723692, 2.7163957524849662]], "r_squared_": 0.9911867251736202, "error_": 0.04663546217406667}
{"freq_range": [2.0, 80.0], "freq_res": 1.0, "aperiodic_params_": [0.5256107339469561, 1.2518209157393494], "gaussian_params_": [[7.0654706615543414, 0.6775106527844467, 1.4542042406637874], [8.567974130096568, 1.3923067393138513, 0.3484702481797466], [10.354086822042339, 1.0993692669938313, 0.6188089070935587], [12.524376535307121, 0.38226979636754305, 0.6322471462849552], [16.73808884577986, 0.3628454474489894, 3.265209823670525], [20.34880151853129, 0.26966444954794516, 0.5295749286062912], [52.07126128322437, 0.17488350098174932, 0.25000000000000006], [66.64296528934182, 0.07913665367266948, 5.999999991115423], [77.14891309976898, 0.10373899835355797, 5.999965412446341]], "peak_params_": [[7.0654706615543414, 0.6811297269187311, 2.908408481327575], [8.567974130096568, 1.0474725780005232, 0.6969404963594932], [10.354086822042339, 1.0653771707034636, 1.2376178141871175], [12.524376535307121, 0.47676016856081116, 1.2644942925699103], [16.73808884577986, 0.36168003709836083, 6.53041964734105], [20.34880151853129, 0.43738058553832415, 1.0591498572125824], [52.07126128322437, 0.17196465712883735, 0.5000000000000001], [66.64296528934182, 0.10380798844559402, 11.999999982230847], [77.14891309976898, 0.12154522144941726, 11.999930824892681]], "r_squared_": 0.9930453162450089, "error_": 0.03680778219711599}
{"freq_range": [2.0, 80.0], "freq_res": 1.0, "aperiodic_params_": [0.38732031470240186, 1.1277556617578026], "gaussian_params_": [[6.4259588687862665, 0.3542803732398773, 1.0237058812141921], [9.62945868322293, 0.8499935737806715, 1.5407710193845634], [15.06676210589742, 0.2512799394609346, 3.62962422423175], [63.415700414413664, 0.2835335282634802, 0.5319710740695796], [65.81776935068831, 0.22854534417972217, 0.5196804395083368], [67.65088756236241, 0.44356152661790405, 0.34067876563137595], [69.76343398847554, 0.24397616335153466, 0.5764577582995062], [73.4610015435708, 0.19522353541978024, 1.2067576430483067], [76.59985510129725, 0.5196629503014445, 0.2981396979445146], [79.36831260973867, 0.3024264482757332, 0.732963883094533]], "peak_params_": [[6.4259588687862665, 0.38902287970590516, 2.0474117624283843], [9.62945868322293, 0.9214085559490792, 3.081542038769127], [15.06676210589742, 0.25319256739551244, 7.2592484484635], [63.415700414413664, 0.20893247093208256, 1.063942148139159], [65.81776935068831, 0.21492305494357122, 1.0393608790166735], [67.65088756236241, 0.2646819290224145, 0.6813575312627519], [69.76343398847554, 0.22746760139290356, 1.1529155165990124], [73.4610015435708, 0.18148573564218706, 2.4135152860966134], [76.59985510129725, 0.21542139831840856, 0.5962793958890292], [79.36831260973867, 0.26656168071807085, 1.465927766189066]], "r_squared_": 0.9891787493305441, "error_": 0.04260733475267853}
{"freq_range": [2.0, 80.0], "freq_res": 1.0, "aperiodic_params_": [0.6756821140150984, 1.3733335987708921], "gaussian_params_": [[9.099451985369535, 0.8725928230230849, 2.3146607732050595], [17.32014529922757, 0.33439120201258976, 4.674264146577105], [72.73345392436394, 0.16357542982846682, 5.999999999999999]], "peak_params_": [[9.099451985369535, 0.9403765126935293, 4.629321546410119], [17.32014529922757, 0.3361839210165649, 9.34852829315421], [72.73345392436394, 0.16341409954219577, 11.999999999999998]], "r_squared_": 0.9888179182283242, "error_": 0.05604131406500768}
{"freq_range": [2.0, 80.0], "freq_res": 1.0, "aperiodic_params_": [1.0000645956316339, 1.5324728511925192], "gaussian_params_": [[9.10882823674008, 1.0118434816644175, 2.4520472037928798], [16.949491791944922, 0.453168124149831, 2.7395271371987464], [23.20601127242082, 0.23216690178700422, 2.442784355895694]], "peak_params_": [[9.10882823674008, 1.0175743052530934, 4.9040944075857595], [16.949491791944922, 0.46800467083752917, 5.479054274397493], [23.20601127242082, 0.27088295633799975, 4.885568711791388]], "r_squared_": 0.9895599873850397, "error_": 0.06139366155210074}
{"freq_range": [2.0, 80.0], "freq_res": 1.0, "aperiodic_params_": [1.1356716696746396, 1.6464142571402023], "gaussian_params_": [[8.843256813557247, 1.1149441205532276, 2.3634618229759354], [17.151103720026487, 0.5271738607290334, 3.465193519393843], [24.49934125097034, 0.14823052908385884, 3.1834840312739705], [76.88830947937473, 0.1503600605303698, 5.99999999999984]], "peak_params_": [[8.843256813557247, 1.1456419314395807, 4.726923645951871], [17.151103720026487, 0.5388079622919627, 6.930387038787686], [24.49934125097034, 0.22117859364385994, 6.366968062547941], [76.88830947937473, 0.1503340112935787, 11.99999999999968]], "r_squared_": 0.9895015745066579, "error_": 0.061924040936655905}
{"freq_range": [2.0, 80.0], "freq_res": 1.0, "aperiodic_params_": [1.184536361747875, 1.6197336943205016], "gaussian_params_": [[8.686542504808964, 1.0768606654468214, 2.2352978369191394], [17.494576703070575, 0.4975609261949423, 4.4688506039338245]], "peak_params_": [[8.686542504808964, 1.1480297908598744, 4.470595673838279], [17.494576703070575, 0.4955909909753831, 8.937701207867649]], "r_squared_": 0.9894270834142903, "error_": 0.06659064400237687}
{"freq_range": [2.0, 80.0], "freq_res": 1.0, "aperiodic_params_": [1.1067496407772186, 1.580038123658888], "gaussian_params_": [[6.052641556809558, 0.44458012820714277, 1.016325371949366], [9.23741887048846, 1.0032007431204124, 1.7893140934871385], [17.083844708476192, 0.4931542684555339, 4.869235173859945]], "peak_params_": [[6.052641556809558, 0.6761773989215417, 2.032650743898732], [9.23741887048846, 1.1253431270736378, 3.578628186974277], [17.083844708476192, 0.49316329123992614, 9.73847034771989]], "r_squared_": 0.9922257858702638, "error_": 0.05310977625452265}
{"freq_range": [2.0, 80.0], "freq_res": 1.0, "aperiodic_params_": [0.9750646300644648, 1.4822864298646679], "gaussian_params_": [[6.119600231149239, 0.4696445993434644, 1.1076743391725559], [9.392801526264023, 1.0369967923124253, 1.7906041187950756], [13.452034599135944, 0.22817110063115695, 1.7401422369981985], [18.71569572517144, 0.4330776652850619, 3.6491168645812335], [74.04562469555354, 0.08594144595381391, 5.9999999999999805]], "peak_params_": [[6.119600231149239, 0.6401954289837124, 2.2153486783451117], [9.392801526264023, 1.049474400953596, 3.5812082375901513], [13.452034599135944, 0.4839192957479789, 3.480284473996397], [18.71569572517144, 0.4331816567981275, 7.298233729162467], [74.04562469555354, 0.08593896131170675, 11.999999999999961]], "r_squared_": 0.9923762860996316, "error_": 0.04955967744817196}
{"freq_range": [2.0, 80.0], "freq_res": 1.0, "aperiodic_params_": [0.6847218179292919, 1.331459920008894], "gaussian_params_": [[6.273507227374725, 0.4481233572871642, 1.1858034645481463], [9.44469685616394, 0.8937155790757632, 1.6255859412190379], [13.466897234693592, 0.362424778049804, 2.8797646094546647], [19.701375972131046, 0.3291271015311608, 2.374912034036525], [72.86304116644963, 0.10042600054037674, 5.999999995767679]], "peak_params_": [[6.273507227374725, 0.5435817247915123, 2.3716069290962927], [9.44469685616394, 1.0016099827731788, 3.2511718824380758], [13.466897234693592, 0.4455890581968243, 5.7595292189093295], [19.701375972131046, 0.35418171611020177, 4.74982406807305], [72.86304116644963, 0.10039984057301843, 11.999999991535358]], "r_squared_": 0.9929768623973849, "error_": 0.04128123233968327}
{"freq_range": [2.0, 80.0], "freq_res": 1.0, "aperiodic_params_": [0.42593099379640786, 1.1656246391314544], "gaussian_params_": [[4.12746885572765, 0.10612624041293034, 0.25059598465449934], [6.153404083285713, 0.31194161997626435, 0.9442777664751523], [9.423165634950632, 0.9408904626067736, 1.8039471708683925], [15.125956732867982, 0.2873524242580007, 3.676302921721257], [17.792151921342775, 0.12845173546153357, 0.27067192087575254], [19.927698771483207, 0.2812050585161468, 0.8294486149187812], [61.465276141406136, 0.827531834500164, 0.25065306667798987], [63.99237256793027, 0.1495792964212431, 0.6647490331089335], [66.51071876963306, 0.32408279389814665, 0.3283446538376421], [68.91501105413806, 0.10418855365206572, 0.25021705680717904], [73.01542378161712, 0.11312984271045985, 5.999999999992678]], "peak_params_": [[4.12746885572765, 0.12961539433808653, 0.5011919693089987], [6.153404083285713, 0.4765044117417445, 1.8885555329503045], [9.423165634950632, 0.9903644888968655, 3.607894341736785], [15.125956732867982, 0.29509485008063596, 7.352605843442514], [17.792151921342775, 0.3262401301342248, 0.5413438417515051], [19.927698771483207, 0.39946204889299697, 1.6588972298375624], [61.465276141406136, 0.1630002040926155, 0.5013061333559797], [63.99237256793027, 0.18615586388928684, 1.329498066217867], [66.51071876963306, 0.17522163156464132, 0.6566893076752842], [68.91501105413806, 0.18878040828512477, 0.5004341136143581], [73.01542378161712, 0.11312946892215892, 11.999999999985356]], "r_squared_": 0.9900119153876307, "error_": 0.04422745717466126}
{"freq_range": [2.0, 80.0], "freq_res": 1.0, "aperiodic_params_": [0.3894338711645029, 1.241617918208635], "gaussian_params_": [[6.547004350781905, 0.49620620371295704, 0.2824755047472392], [9.814219330918554, 0.9250846924476024, 1.5408909826570825], [15.680536662799174, 0.273399710213205, 3.652849193783883], [47.04293057722906, 0.11898798008751209, 0.2500008117884054], [59.649944271188794, 0.12213715091476078, 1.1431117782576012], [62.611929953317876, 0.2914826643692145, 0.32732596384048523], [64.54920525102283, 0.14778744284537168, 0.6578452758225714], [73.0959308017281, 0.19644206041356427, 5.999999999999999]], "peak_params_": [[6.547004350781905, 0.32792394936874264, 0.5649510094944784], [9.814219330918554, 0.9999805868217975, 3.081781965314165], [15.680536662799174, 0.27264906219545737, 7.305698387567766], [47.04293057722906, 0.11726180018614363, 0.5000016235768108], [59.649944271188794, 0.1346871532579088, 2.2862235565152025], [62.611929953317876, 0.20293107679014066, 0.6546519276809705], [64.54920525102283, 0.1959093147321842, 1.3156905516451427], [73.0959308017281, 0.1964169536705198, 11.999999999999998]], "r_squared_": 0.9916004090597776, "error_": 0.03698641283724845}
{"freq_range": [2.0, 80.0], "freq_res": 1.0, "aperiodic_params_": [0.6832308987998577, 1.2561714843172784], "gaussian_params_": [[6.757895196677588, 0.4271818707623269, 1.0928569402122796], [9.150667029345476, 0.5996342912974745, 0.6506599092674005], [10.61467725837858, 0.6280817113403859, 1.2942491291747629], [17.610616790323267, 0.3463548507573761, 4.153948605542971]], "peak_params_": [[6.757895196677588, 0.4453481878000797, 2.1857138804245593], [9.150667029345476, 0.9646832388315967, 1.301319818534801], [10.61467725837858, 0.7092725651846767, 2.5884982583495257], [17.610616790323267, 0.34483656141228847, 8.307897211085942]], "r_squared_": 0.9875145111763597, "error_": 0.05108695295533173}
{"freq_range": [2.0, 80.0], "freq_res": 1.0, "aperiodic_params_": [1.0586228451580972, 1.5897391954890774], "gaussian_params_": [[9.560524369313686, 1.0987949761615476, 2.6440135247100227], [17.792103417624286, 0.628326538417177, 2.235384814928616], [23.352527093690167, 0.41547184103098395, 1.6587180300106854], [76.54796540086271, 0.13403399692669948, 5.999999999999985]], "peak_params_": [[9.560524369313686, 1.0851651808430032, 5.288027049420045], [17.792103417624286, 0.6346305047581244, 4.470769629857232], [23.352527093690167, 0.44784157153299997, 3.317436060021371], [76.54796540086271, 0.13365414904315487, 11.99999999999997]], "r_squared_": 0.9884305713516744, "error_": 0.06405743715878832}
{"freq_range": [2.0, 80.0], "freq_res": 1.0, "aperiodic_params_": [1.1378868537670495, 1.6124885642885634], "gaussian_params_": [[8.870257081009942, 1.0806015637854471, 2.2110420633757997], [17.857327367470965, 0.5575462405797348, 4.919375820263238]], "peak_params_": [[8.870257081009942, 1.1889815108853847, 4.422084126751599], [17.857327367470965, 0.5575262515314804, 9.838751640526477]], "r_squared_": 0.9869137304411806, "error_": 0.06956181628826723}
{"freq_range": [2.0, 80.0], "freq_res": 1.0, "aperiodic_params_": [1.193884306119953, 1.6494839093906304], "gaussian_params_": [[8.794940613322204, 1.1517494734588811, 2.1912546976994767], [17.7799341094821, 0.5767758043658491, 4.561652751838223]], "peak_params_": [[8.794940613322204, 1.2372008516817912, 4.382509395398953], [17.7799341094821, 0.5762746025097422, 9.123305503676447]], "r_squared_": 0.9868102731211111, "error_": 0.07124873551617783}
{"freq_range": [2.0, 80.0], "freq_res": 1.0, "aperiodic_params_": [1.1068036069509, 1.5840834539933255], "gaussian_params_": [[6.057536179400819, 0.5401625745160497, 0.9587235424261177], [9.422678509821052, 1.026288058977263, 1.6360036671673068], [17.02075227287149, 0.5173531157823689, 4.948625566111773]], "peak_params_": [[6.057536179400819, 0.6975612713261435, 1.9174470848522354], [9.422678509821052, 1.136569923768444, 3.2720073343346137], [17.02075227287149, 0.5173711132758839, 9.897251132223547]], "r_squared_": 0.9922292866916295, "error_": 0.05515376735798639}
{"freq_range": [2.0, 80.0], "freq_res": 1.0, "aperiodic_params_": [0.8608748548621729, 1.4432507861085715], "gaussian_params_": [[6.139854068675045, 0.4635084133169558, 1.1256600510198997], [9.980562169425829, 0.9834431699376912, 2.0351455336133273], [17.647965688142392, 0.4883057646088712, 3.623296281947476], [22.32952912471628, 0.33802743569923305, 0.2500062426671337], [23.519943338813658, 0.8635116753078631, 0.29052097075990196], [75.45203459916367, 0.12588110114613563, 5.9999999999669935]], "peak_params_": [[6.139854068675045, 0.6079506982890409, 2.2513201020397995], [9.980562169425829, 1.037322314644879, 4.070291067226655], [17.647965688142392, 0.48642430403633186, 7.246592563894952], [22.32952912471628, 0.3791692193512012, 0.5000124853342675], [23.519943338813658, 0.3255074621918359, 0.5810419415198039], [75.45203459916367, 0.12552435829767106, 11.999999999933987]], "r_squared_": 0.9927002944537403, "error_": 0.04754657470429026}
{"freq_range": [2.0, 80.0], "freq_res": 1.0, "aperiodic_params_": [0.6557358164040759, 1.2563380339845602], "gaussian_params_": [[6.150767096047178, 0.4459390189569814, 1.1015071564706373], [9.98773270205354, 0.9277234418103565, 1.8842077205902779], [17.402816972608157, 0.38727403664024407, 3.5628119464893993], [68.92787086585588, 0.0508857567942037, 0.25011898242177916], [71.64720582411395, 0.1527986079356309, 5.999999999999999], [78.43685182073021, 0.5389509387691864, 0.26751194872933953]], "peak_params_": [[6.150767096047178, 0.5428985019256071, 2.2030143129412747], [9.98773270205354, 0.9734218118083509, 3.7684154411805557], [17.402816972608157, 0.3857184082760836, 7.1256238929787985], [68.92787086585588, 0.1874409057378168, 0.5002379648435583], [71.64720582411395, 0.15253469881790327, 11.999999999999998], [78.43685182073021, 0.2292940737057747, 0.5350238974586791]], "r_squared_": 0.9908681272431852, "error_": 0.04766031232893722}
{"freq_range": [2.0, 80.0], "freq_res": 1.0, "aperiodic_params_": [0.39752132501890375, 1.1419800239302174], "gaussian_params_": [[9.930564286198605, 0.885893023184067, 2.632529786933305], [15.565271434949354, 0.2837983542001779, 0.32857940338540786], [17.12567447597765, 0.07067574933357922, 0.4335374327335929], [19.22029861238095, 0.2939336276848042, 1.9920767734810791], [48.95639625175579, 0.22101963616425355, 0.2500000000000001], [52.41535090618774, 0.7967886930323023, 0.2764337967518998], [66.60346640934499, 0.3874656003794405, 0.28794937457202446], [73.54263371851292, 0.11001775275198983, 5.999999999999999], [77.62501270748723, 0.2858161429353462, 0.2736740090759311]], "peak_params_": [[9.930564286198605, 0.8855914722015422, 5.26505957386661], [15.565271434949354, 0.2623865840177235, 0.6571588067708157], [17.12567447597765, 0.24979779130154622, 0.8670748654671858], [19.22029861238095, 0.29449250571194363, 3.9841535469621583], [48.95639625175579, 0.21770889893023204, 0.5000000000000002], [52.41535090618774, 0.25787224261521247, 0.5528675935037995], [66.60346640934499, 0.2108298433771678, 0.5758987491440489], [73.54263371851292, 0.10969857851496756, 11.999999999999998], [77.62501270748723, 0.1952781587175394, 0.5473480181518622]], "r_squared_": 0.9870115661958396, "error_": 0.0456986545761596}
{"freq_range": [2.0, 80.0], "freq_res": 1.0, "aperiodic_params_": [0.2263537355411281, 1.0418429569138314], "gaussian_params_": [[8.907001808226138, 0.6432764994414722, 0.9356358322364151], [10.88979151935147, 0.6279685350929045, 1.7434229890685393], [17.350864979089742, 0.2722420169129832, 2.7557765243575343], [67.54796540086404, 0.16838525500777393, 5.999999999999999]], "peak_params_": [[8.907001808226138, 0.9918456824810618, 1.8712716644728302], [10.88979151935147, 0.6985394800042494, 3.4868459781370786], [17.350864979089742, 0.27139552402636047, 5.511553048715069], [67.54796540086404, 0.16790805680283327, 11.999999999999998]], "r_squared_": 0.9822716111027076, "error_": 0.05272815885250999}
{"freq_range": [2.0, 80.0], "freq_res": 1.0, "aperiodic_params_": [0.7481001517153202, 1.4217592807879338], "gaussian_params_": [[9.31506716779897, 1.1849664216216496, 1.827161807227966], [14.605858391536895, 0.3444187618888784, 2.9068870516362133], [18.250237828351402, 0.44769787741660017, 1.3976082830490189], [22.61367825431651, 0.25082638919224226, 3.211303836502279]], "peak_params_": [[9.31506716779897, 1.221154260052414, 3.654323614455932], [14.605858391536895, 0.39569032212022515, 5.813774103272427], [18.250237828351402, 0.7041542267722155, 2.7952165660980377], [22.61367825431651, 0.2557334590199082, 6.422607673004558]], "r_squared_": 0.9872010001104676, "error_": 0.063414302323788}
{"freq_range": [2.0, 80.0], "freq_res": 1.0, "aperiodic_params_": [0.9842259261574452, 1.5249039153910782], "gaussian_params_": [[6.1883254271839485, 0.46712590307939483, 0.8565995351207026], [9.178182890695204, 0.8725727492224733, 0.6636656487257939], [10.741240233959605, 0.8909796378790671, 2.4786955354515965], [17.831710544378932, 0.7370566583079995, 1.8358417017174735], [23.050045023653865, 0.3376407455179633, 2.73028495424813]], "peak_params_": [[6.1883254271839485, 0.5989927677223778, 1.7131990702414053], [9.178182890695204, 1.5399897589192326, 1.3273312974515878], [10.741240233959605, 0.9070431328463326, 4.957391070903193], [17.831710544378932, 0.8072343357596009, 3.671683403434947], [23.050045023653865, 0.3516008352268196, 5.46056990849626]], "r_squared_": 0.9932747491375615, "error_": 0.05145645981306454}
{"freq_range": [2.0, 80.0], "freq_res": 1.0, "aperiodic_params_": [1.128957347974537, 1.597131682636764], "gaussian_params_": [[6.16173767480354, 0.5623291081162761, 0.9685554027150773], [9.407315804434132, 1.7040797669710892, 0.2929468272794371], [9.656122532255923, 0.9530532134627254, 1.6355077306732873], [17.883031282252105, 0.6643147133396696, 4.6959912737883105]], "peak_params_": [[6.16173767480354, 0.6599149275476661, 1.9371108054301547], [9.407315804434132, 1.6462327118660138, 0.5858936545588742], [9.656122532255923, 1.3149070103175877, 3.2710154613465745], [17.883031282252105, 0.6641107935691748, 9.391982547576621]], "r_squared_": 0.9927819814529616, "error_": 0.05237089250175253}
{"freq_range": [2.0, 80.0], "freq_res": 1.0, "aperiodic_params_": [1.1621788227431653, 1.6109730621113643], "gaussian_params_": [[6.125376550723957, 0.5606306533119337, 1.0025153405724414], [9.441352502261266, 1.8791406915055693, 0.2914706449313342], [9.50824573519014, 0.9111130658752585, 1.6319379876758198], [17.604256972566688, 0.624607855218224, 5.061072235717908]], "peak_params_": [[6.125376550723957, 0.6917240116261169, 2.005030681144883], [9.441352502261266, 1.6215249732193704, 0.5829412898626684], [9.50824573519014, 1.372418352831746, 3.2638759753516395], [17.604256972566688, 0.6227024767051842, 10.122144471435815]], "r_squared_": 0.9913743356063809, "error_": 0.05971512074019002}
{"freq_range": [2.0, 80.0], "freq_res": 1.0, "aperiodic_params_": [0.9902956665198834, 1.5492857550105548], "gaussian_params_": [[6.075026330259872, 0.5611622638821283, 0.9195774658471441], [9.590688750380226, 1.1471770465156366, 1.4073441039481343], [16.929725186314393, 0.587573756914434, 5.309117915672158], [22.4340843034011, 0.3183058890249407, 0.27276625459671294]], "peak_params_": [[6.075026330259872, 0.6741589293983776, 1.8391549316942881], [9.590688750380226, 1.3504088658429714, 2.8146882078962685], [16.929725186314393, 0.5875233838658666, 10.618235831344316], [22.4340843034011, 0.4621248630120276, 0.5455325091934259]], "r_squared_": 0.9902038680205779, "error_": 0.0636525613622277}
{"freq_range": [2.0, 80.0], "freq_res": 1.0, "aperiodic_params_": [1.0037930312340906, 1.5601268579188692], "gaussian_params_": [[6.092593138361035, 0.5562272090758389, 0.9170109792550999], [9.59855792368952, 1.1354176966110363, 1.3916734081695155], [16.86684440205235, 0.582483698355572, 5.386060233430475], [22.43614902724292, 0.31433058536871855, 0.2707008398796481]], "peak_params_": [[6.092593138361035, 0.6696034680300407, 1.8340219585101998], [9.59855792368952, 1.3476299915996703, 2.783346816339031], [16.86684440205235, 0.5823065400515195, 10.77212046686095], [22.43614902724292, 0.4557111552485178, 0.5414016797592962]], "r_squared_": 0.9904508398831761, "error_": 0.06282086775685314}
{"freq_range": [2.0, 80.0], "freq_res": 1.0, "aperiodic_params_": [0.7152799313516389, 1.339661311983138], "gaussian_params_": [[5.826918714888957, 0.4048917338431725, 0.9391908706199753], [9.97804794883155, 1.0085233246669907, 1.7089840629024755], [17.64128467724835, 0.45995266550181835, 4.230628334046876], [69.03946802406814, 0.13369016185172608, 5.999999999999999], [74.02768593440707, 0.174046398379551, 0.9393042359972917], [78.77079940248068, 0.1444292959126282, 1.8360601202345403]], "peak_params_": [[5.826918714888957, 0.4756711587408559, 1.8783817412399506], [9.97804794883155, 1.0984760851021427, 3.417968125804951], [17.64128467724835, 0.458318815461065, 8.461256668093752], [69.03946802406814, 0.1336874764206779, 11.999999999999998], [74.02768593440707, 0.27389804194867806, 1.8786084719945835], [78.77079940248068, 0.17701116568224573, 3.6721202404690807]], "r_squared_": 0.9899886304861172, "error_": 0.050444684434729485}
{"freq_range": [2.0, 80.0], "freq_res": 1.0, "aperiodic_params_": [0.2628544726366973, 0.8822198285132157], "gaussian_params_": [[5.752031981113553, 0.283082943996956, 0.8862136704125643], [9.961017365126732, 0.874077095119525, 1.6171915149072735], [16.619609961385226, 0.23118528167970206, 2.880815277953739], [48.05927487353026, 0.10440028018179516, 0.9526561258151495], [52.10817701680952, 0.2347001596467222, 0.31069129029882947], [53.70827644607465, 0.20168742548234977, 0.6672137321270896], [57.47522542505873, 0.12138064358952637, 1.7209100430493671], [61.18278758556836, 0.1353446000836582, 1.1751977241044036], [67.27044263984439, 0.1821984445924152, 1.2270235126325564], [70.43211318683446, 0.3736299254246756, 0.30954217465614536], [73.28197738075588, 0.15071422085567354, 1.3146496597668231], [78.07685973419235, 0.23450353594819315, 0.6489626768973888]], "peak_params_": [[5.752031981113553, 0.31601043640962806, 1.7724273408251285], [9.961017365126732, 0.8903237582786336, 3.234383029814547], [16.619609961385226, 0.22924590480399576, 5.761630555907478], [48.05927487353026, 0.10419841932107476, 1.905312251630299], [52.10817701680952, 0.2292930588761053, 0.6213825805976589], [53.70827644607465, 0.19910067815007615, 1.3344274642541791], [57.47522542505873, 0.11708093334405101, 3.4418200860987342], [61.18278758556836, 0.14861773365070396, 2.350395448208807], [67.27044263984439, 0.1778286227115573, 2.4540470252651128], [70.43211318683446, 0.16304477388754246, 0.6190843493122907], [73.28197738075588, 0.14729031506539814, 2.6292993195336463], [78.07685973419235, 0.233105281726657, 1.2979253537947777]], "r_squared_": 0.9901370260251083, "error_": 0.031178207901869422}
{"freq_range": [2.0, 80.0], "freq_res": 1.0, "aperiodic_params_": [0.5838476524062829, 1.2847804896610402], "gaussian_params_": [[8.981441756448252, 1.3504176276365214, 1.4935812583361383], [12.373706101525654, 0.5539876978742378, 1.11878814204102], [18.005493710783902, 0.5160831403337544, 3.2145845789160266], [73.19838926642065, 0.19348561962183713, 5.999999999999999]], "peak_params_": [[8.981441756448252, 1.3663854933751678, 2.9871625166722766], [12.373706101525654, 0.7892481394659823, 2.23757628408204], [18.005493710783902, 0.5160841888629865, 6.429169157832053], [73.19838926642065, 0.19337988095203906, 11.999999999999998]], "r_squared_": 0.9869898599509398, "error_": 0.05902136016109425}
{"freq_range": [2.0, 80.0], "freq_res": 1.0, "aperiodic_params_": [0.8227076851222469, 1.4782886656846252], "gaussian_params_": [[9.156692095416702, 1.5509346965825705, 1.5411165346938027], [11.594852250693185, 0.6288625584296643, 0.3082391338350142], [13.34051237706361, 0.2611367860656904, 0.3004487134904008], [18.04687097251084, 0.7409540270844072, 4.069405068985939], [74.65363056587428, 0.16232024018853677, 5.999999999999999]], "peak_params_": [[9.156692095416702, 1.6055382199052297, 3.0822330693876054], [11.594852250693185, 0.7935451203423536, 0.6164782676700284], [13.34051237706361, 0.5500042531038826, 0.6008974269808016], [18.04687097251084, 0.7409049903137013, 8.138810137971879], [74.65363056587428, 0.16204999527803454, 11.999999999999998]], "r_squared_": 0.9916853425123122, "error_": 0.05477506241738999}
{"freq_range": [2.0, 80.0], "freq_res": 1.0, "aperiodic_params_": [1.0543317008042896, 1.614468719002182], "gaussian_params_": [[9.3922026390599, 1.5628745608663188, 1.872080436571586], [15.258979658294987, 0.325938104740443, 1.8843631479560088], [18.464273753505665, 0.4528198368965099, 1.076333419053382], [20.356259182253897, 0.46789629523654147, 4.58504941730453]], "peak_params_": [[9.3922026390599, 1.552040448679614, 3.744160873143172], [15.258979658294987, 0.5795105747068307, 3.7687262959120176], [18.464273753505665, 0.935806392699464, 2.152666838106764], [20.356259182253897, 0.6438725337995832, 9.17009883460906]], "r_squared_": 0.9903450890907941, "error_": 0.06234622519913708}
{"freq_range": [2.0, 80.0], "freq_res": 1.0, "aperiodic_params_": [1.0963941902628151, 1.60624661538766], "gaussian_params_": [[6.242119608141388, 0.6087042604233227, 0.9381330401613381], [9.333406443702795, 1.0734253996789647, 0.8620134313666115], [10.696788579760431, 0.9003581263378531, 1.995197404673208], [17.78655491856255, 0.7615184673790539, 2.72054031390354], [22.111393314638907, 0.217958344293195, 0.36783975544787406], [23.7319808036433, 0.2460964963876683, 1.3343564678702238], [27.187968930166637, 0.24020674169251846, 1.5543879407181127], [30.459713634283933, 0.540922369099941, 0.31720786402554557]], "peak_params_": [[6.242119608141388, 0.6458120597604903, 1.8762660803226763], [9.333406443702795, 1.6354289911236541, 1.724026862733223], [10.696788579760431, 1.089550353168325, 3.990394809346416], [17.78655491856255, 0.7603116324073985, 5.44108062780708], [22.111393314638907, 0.5446158343046159, 0.7356795108957481], [23.7319808036433, 0.3266076293807302, 2.6687129357404475], [27.187968930166637, 0.25318121941081095, 3.1087758814362254], [30.459713634283933, 0.23605723178005067, 0.6344157280510911]], "r_squared_": 0.9953340311050998, "error_": 0.043678049235372156}
{"freq_range": [2.0, 80.0], "freq_res": 1.0, "aperiodic_params_": [1.0160884255684242, 1.569992447682883], "gaussian_params_": [[6.056589686679581, 0.5227523968908198, 0.840316582080478], [9.659572675808946, 1.4048788771688145, 1.307091525741378], [17.279752766051704, 0.6357107559090635, 5.309671852168488]], "peak_params_": [[6.056589686679581, 0.6160294828462198, 1.680633164160956], [9.659572675808946, 1.6063969012475563, 2.614183051482756], [17.279752766051704, 0.6348292129334222, 10.619343704336975]], "r_squared_": 0.9920893977335149, "error_": 0.05834317107837722}
{"freq_range": [2.0, 80.0], "freq_res": 1.0, "aperiodic_params_": [0.9904806970382264, 1.5951638193333635], "gaussian_params_": [[5.919371216761585, 0.4521946787404648, 0.8459849487106876], [9.712889363294856, 1.3983606289737303, 1.3806834423289664], [17.569330210140272, 0.6601135844420772, 5.120006021724922], [75.54796540086404, 0.11904654678391378, 5.999999999999816]], "peak_params_": [[5.919371216761585, 0.5391445857810188, 1.6919698974213753], [9.712889363294856, 1.589773557664641, 2.761366884657933], [17.569330210140272, 0.6577824642730239, 10.240012043449845], [75.54796540086404, 0.11870917283494742, 11.999999999999632]], "r_squared_": 0.9929018852120937, "error_": 0.054080826393548165}
{"freq_range": [2.0, 80.0], "freq_res": 1.0, "aperiodic_params_": [0.9190124576846581, 1.5144479385178964], "gaussian_params_": [[6.145485692653498, 0.3736444445427251, 0.8052348719113104], [9.367613352954136, 1.3277095749325787, 1.0372615056521077], [11.551624560440445, 0.4956445865953718, 1.2640643353610923], [18.091947290618016, 0.5955827530593278, 4.243570069177821], [73.40424310703456, 0.6069614076637904, 0.2500044701450918], [76.14788341133004, 0.17485529344588602, 5.999999747317239]], "peak_params_": [[6.145485692653498, 0.3847302464160887, 1.6104697438226208], [9.367613352954136, 1.3722070566242464, 2.0745230113042155], [11.551624560440445, 0.7309938667872736, 2.5281286707221846], [18.091947290618016, 0.5954440703555155, 8.487140138355642], [73.40424310703456, 0.31659381459069325, 0.5000089402901836], [76.14788341133004, 0.17480219041742218, 11.999999494634478]], "r_squared_": 0.9904934186875746, "error_": 0.055862766521949256}
{"freq_range": [2.0, 80.0], "freq_res": 1.0, "aperiodic_params_": [0.5225189964546066, 1.1661558570770614], "gaussian_params_": [[9.373644756605678, 0.5223057491232055, 0.8379677930662914], [9.790234446068238, 0.7402529523374092, 2.2036953507259365], [17.778513547834077, 0.41370050339492936, 3.568733304872146], [49.377815504952444, 0.7233099638601016, 0.28215298149513895], [51.98775724383585, 0.3049391510616071, 0.25000000002652806], [75.54796540086404, 0.20641432205619134, 5.9627490321253465]], "peak_params_": [[9.373644756605678, 1.1871165944512148, 1.6759355861325829], [9.790234446068238, 1.1703768214285193, 4.407390701451873], [17.778513547834077, 0.413621640240764, 7.137466609744292], [49.377815504952444, 0.29511111580631955, 0.5643059629902779], [51.98775724383585, 0.30465846730657886, 0.5000000000530561], [75.54796540086404, 0.20582202948003347, 11.925498064250693]], "r_squared_": 0.9866073008483064, "error_": 0.05327422614236665}
{"freq_range": [2.0, 80.0], "freq_res": 1.0, "aperiodic_params_": [-0.180198777320061, 1.4352354449967797], "gaussian_params_": [[9.52779079728203, 1.2468911262000564, 1.9271696517059664], [17.379092744321863, 0.552635708372959, 4.293487692182691], [72.54796540086404, 0.15254284928923073, 5.999999999902576]], "peak_params_": [[9.52779079728203, 1.3362061124272868, 3.854339303411933], [17.379092744321863, 0.5511639377075814, 8.586975384365383], [72.54796540086404, 0.1521105479344813, 11.999999999805151]], "r_squared_": 0.9880013013981965, "error_": 0.06349276970561007}
{"freq_range": [2.0, 80.0], "freq_res": 1.0, "aperiodic_params_": [0.4975969164011443, 1.4377122939974805], "gaussian_params_": [[9.207375429588748, 1.5588608034997973, 1.4598705239537606], [11.806385050531677, 0.33081055851358393, 1.0013588177480617], [18.006737867717128, 0.7283228045487649, 4.697267584169401]], "peak_params_": [[9.207375429588748, 1.6655967926917434, 2.919741047907521], [11.806385050531677, 0.8963735296476856, 2.0027176354961234], [18.006737867717128, 0.728322077582758, 9.394535168338802]], "r_squared_": 0.9908518780101784, "error_": 0.06187187784518223}
{"freq_range": [2.0, 80.0], "freq_res": 1.0, "aperiodic_params_": [1.1529054316862588, 1.7016252205115243], "gaussian_params_": [[9.592042099898093, 1.5854894486215663, 1.6458750445984087], [18.504424930575457, 0.7841460802337039, 5.291097652731811]], "peak_params_": [[9.592042099898093, 1.7530068633909948, 3.2917500891968174], [18.504424930575457, 0.7807142477386293, 10.582195305463623]], "r_squared_": 0.9909843540091314, "error_": 0.06660161695847236}
{"freq_range": [2.0, 80.0], "freq_res": 1.0, "aperiodic_params_": [1.096005718335026, 1.6800032044552087], "gaussian_params_": [[6.083160253561237, 0.37295346462038476, 0.6557765798633074], [9.887444668040631, 1.574001422884453, 1.439932355265132], [18.33861669790204, 0.6594730021255116, 5.251898475056128]], "peak_params_": [[6.083160253561237, 0.4528600857772396, 1.3115531597266148], [9.887444668040631, 1.7561782621226598, 2.879864710530264], [18.33861669790204, 0.6581038997371851, 10.503796950112257]], "r_squared_": 0.9907964810355182, "error_": 0.06687732008950407}
{"freq_range": [2.0, 80.0], "freq_res": 1.0, "aperiodic_params_": [1.0649411106571438, 1.6204823222353124], "gaussian_params_": [[5.9613995679507275, 0.3437673625514353, 0.6472235690546856], [10.010203241192418, 1.5613600052523522, 1.4360636643265607], [18.516025092735653, 0.6735211943142339, 4.996745301859301]], "peak_params_": [[5.9613995679507275, 0.40402897932863274, 1.2944471381093712], [10.010203241192418, 1.7189387946442285, 2.8721273286531215], [18.516025092735653, 0.6703692851892721, 9.993490603718602]], "r_squared_": 0.9904970944401181, "error_": 0.06510226912939492}
{"freq_range": [2.0, 80.0], "freq_res": 1.0, "aperiodic_params_": [0.7301998528029684, 1.371191470281899], "gaussian_params_": [[6.09574452719371, 0.34736090209948606, 0.6316776602698757], [9.407472135219418, 1.2735730215092904, 1.1914219714954537], [11.730807313182273, 0.36065465659488105, 1.714300413503934], [18.139806621704928, 0.6272850570305355, 4.189775421576579]], "peak_params_": [[6.09574452719371, 0.3754945750284111, 1.2633553205397514], [9.407472135219418, 1.3607361693453106, 2.3828439429909074], [11.730807313182273, 0.6899524104247791, 3.428600827007868], [18.139806621704928, 0.6273857519576026, 8.379550843153158]], "r_squared_": 0.9878137832879433, "error_": 0.064219779902522}
{"freq_range": [2.0, 80.0], "freq_res": 1.0, "aperiodic_params_": [0.15247919562478035, 1.2147540711890836], "gaussian_params_": [[9.420249401145677, 1.0903664505734987, 1.5890873470663212], [16.349242366768678, 0.48913790138388047, 4.344293938444306], [62.34457702430365, 0.21951158693937467, 0.995057290308752], [75.54796540086404, 0.19099825160187148, 5.9999999999999645]], "peak_params_": [[9.420249401145677, 1.1698428157748493, 3.1781746941326423], [16.349242366768678, 0.48776626884488905, 8.688587876888612], [62.34457702430365, 0.2216612969884486, 1.990114580617504], [75.54796540086404, 0.19045696891766606, 11.999999999999929]], "r_squared_": 0.9842845824600255, "error_": 0.05798496038702295}
{"freq_range": [2.0, 80.0], "freq_res": 1.0, "aperiodic_params_": [0.5688505969652089, 1.4837704996263992], "gaussian_params_": [[9.689397042434344, 1.5517248871131981, 1.5973037592130777], [18.37330018540688, 0.6514911782457112, 4.489325501600769]], "peak_params_": [[9.689397042434344, 1.6370809859921631, 3.1946075184261553], [18.37330018540688, 0.6492447873602293, 8.978651003201538]], "r_squared_": 0.9927659423718652, "error_": 0.05593960901232985}
{"freq_range": [2.0, 80.0], "freq_res": 1.0, "aperiodic_params_": [0.5823671829431215, 1.4845530737349335], "gaussian_params_": [[5.98301389012629, 0.2904305826536047, 0.5618595928445147], [9.950733510193206, 1.4820490908382344, 1.5162279624851394], [18.39630208662864, 0.5415195057356595, 4.663520238203142]], "peak_params_": [[5.98301389012629, 0.35584731180664014, 1.1237191856890294], [9.950733510193206, 1.5883516578039092, 3.0324559249702787], [18.39630208662864, 0.5395688756089013, 9.327040476406284]], "r_squared_": 0.9902479772406022, "error_": 0.06433320261868387}
{"freq_range": [2.0, 80.0], "freq_res": 1.0, "aperiodic_params_": [0.5618526479905775, 1.388740874703562], "gaussian_params_": [[5.953465454752728, 0.36332354582430376, 0.6578468171959713], [9.889542643488035, 1.3317798288983294, 1.3946435573787888], [17.732302802231896, 0.5567149265485912, 4.591619630751125]], "peak_params_": [[5.953465454752728, 0.4109483161095615, 1.3156936343919425], [9.889542643488035, 1.4624535186680694, 2.7892871147575775], [17.732302802231896, 0.5557696432316, 9.18323926150225]], "r_squared_": 0.9892428012722645, "error_": 0.061257832686232576}
{"freq_range": [2.0, 80.0], "freq_res": 1.0, "aperiodic_params_": [-0.8932356712004101, 1.0677875411193003], "gaussian_params_": [[9.997702077974205, 0.7664983240546528, 1.9554548252473225], [16.20842800337625, 0.35893853229024614, 4.742478988522646]], "peak_params_": [[9.997702077974205, 0.9188608646651069, 3.910909650494645], [16.20842800337625, 0.3654875654256027, 9.484957977045292]], "r_squared_": 0.9761437350441693, "error_": 0.06837975679015881}
{"freq_range": [2.0, 80.0], "freq_res": 1.0, "aperiodic_params_": [0.8524271539159892, 1.06404178531956], "gaussian_params_": [[8.974589517936554, 0.45452016658367816, 1.515732739781629], [13.059275060621022, 0.14885857989902176, 0.2500226244226734], [25.14626638914231, 0.13140206844301425, 0.9670094813663042], [29.693916165094524, 0.12522827621243002, 1.0818163147029332], [38.141748810444604, 0.19744405452779212, 0.5970012441952163], [47.5828220617535, 0.3010268358322157, 0.3166727858979155], [53.89713083163118, 0.09015592174235246, 1.62090667561384], [58.97079765358097, 0.11633313476760379, 0.2500000517950114], [65.18990882082574, 0.17481373624579694, 0.3564177232178852], [69.91372681889038, 0.11521579713077265, 0.8352924719744238], [74.45677525991862, 0.16646952762573775, 1.1207550877260355]], "peak_params_": [[8.974589517936554, 0.4544563000724781, 3.031465479563258], [13.059275060621022, 0.15809966323841032, 0.5000452488453468], [25.14626638914231, 0.1299177161727686, 1.9340189627326083], [29.693916165094524, 0.12031530438457705, 2.1636326294058663], [38.141748810444604, 0.19195628387727703, 1.1940024883904325], [47.5828220617535, 0.12652104819921506, 0.633345571795831], [53.89713083163118, 0.08997454505224634, 3.24181335122768], [58.97079765358097, 0.11617732846467699, 0.5000001035900228], [65.18990882082574, 0.15167938855119556, 0.7128354464357703], [69.91372681889038, 0.11466419539165607, 1.6705849439488476], [74.45677525991862, 0.15320308042046638, 2.241510175452071]], "r_squared_": 0.9902893830253608, "error_": 0.030620607546091482}
{"freq_range": [2.0, 80.0], "freq_res": 1.0, "aperiodic_params_": [0.1723241118241471, 1.287795264118531], "gaussian_params_": [[9.028035072152983, 1.060428976064461, 2.105216887261582], [15.702435243126946, 0.3072888413488181, 3.6565735143346876], [19.551149995485808, 0.9429330002291346, 0.25000123523632267], [22.589192546433917, 0.1858343081892074, 0.9853881133778356], [71.45203459913596, 0.13990136423641755, 5.999999999999999]], "peak_params_": [[9.028035072152983, 1.117610610874247, 4.210433774523164], [15.702435243126946, 0.31067725744199315, 7.313147028669375], [19.551149995485808, 0.34807264212701683, 0.5000024704726453], [22.589192546433917, 0.21230927104433772, 1.9707762267556712], [71.45203459913596, 0.13950488842932085, 11.999999999999998]], "r_squared_": 0.9908273036574671, "error_": 0.04641579327404039}
{"freq_range": [2.0, 80.0], "freq_res": 1.0, "aperiodic_params_": [0.12402585474655535, 1.2691641768826625], "gaussian_params_": [[9.064237282469783, 1.1505914578642533, 2.175762953821208], [13.909541691571711, 0.2798819064617556, 1.5150756220687942], [19.037657784612797, 0.4242319386235535, 2.1382161990281], [73.41429350371742, 0.12225991516392662, 5.999999999999999]], "peak_params_": [[9.064237282469783, 1.151565313764747, 4.351525907642416], [13.909541691571711, 0.3936130479503007, 3.0301512441375884], [19.037657784612797, 0.42519029333021874, 4.2764323980562], [73.41429350371742, 0.12196880974413826, 11.999999999999998]], "r_squared_": 0.9893378079739951, "error_": 0.05090554208282622}
