{"freq_range": [2.0, 80.0], "freq_res": 1.0, "aperiodic_params_": [0.6074320245513548, 1.1981623277134332], "gaussian_params_": [[9.914220189605507, 1.4416754972807735, 1.3105474543372175], [14.452034599135944, 0.3005044116119293, 3.8746212083657077], [19.452590518592768, 0.4606812917468863, 0.9096019685116895], [70.67596880815044, 0.3485701912281256, 5.999999999999999]], "peak_params_": [[9.914220189605507, 1.5938867558769343, 2.621094908674435], [14.452034599135944, 0.3096427187204292, 7.749242416731415], [19.452590518592768, 0.5579370944703721, 1.819203937023379], [70.67596880815044, 0.3480622484832403, 11.999999999999998]], "r_squared_": 0.9689467853093422, "error_": 0.08265216914608799}
{"freq_range": [2.0, 80.0], "freq_res": 1.0, "aperiodic_params_": [0.6276893252356776, 1.2435149939147656], "gaussian_params_": [[10.055107177866962, 1.5792390863608428, 1.5472298538846698], [17.96810583925609, 0.46198208312396605, 2.5123946623859363], [51.970956259034295, 0.16144732869985978, 3.4599393723722005], [62.620715631828745, 0.32007865925008816, 4.3059716616310055], [67.30195065171759, 0.19628437990568556, 0.5115074745368305], [71.53027024926432, 0.27808919185964254, 1.3021807889623462], [78.28217373202736, 0.3895580408984156, 3.04912611212912]], "peak_params_": [[10.055107177866962, 1.5812607704571857, 3.0944597077693397], [17.96810583925609, 0.461947829668465, 5.024789324771873], [51.970956259034295, 0.17672454328390685, 6.919878744744401], [62.620715631828745, 0.3198443976780043, 8.611943323262011], [67.30195065171759, 0.3568128073138921, 1.023014949073661], [71.53027024926432, 0.3370696854265143, 2.6043615779246925], [78.28217373202736, 0.38843824686747297, 6.09825222425824]], "r_squared_": 0.9830454116190742, "error_": 0.057866083598228285}
{"freq_range": [2.0, 80.0], "freq_res": 1.0, "aperiodic_params_": [0.5767829541661478, 1.1529038116726353], "gaussian_params_": [[9.936615626407999, 1.3784510722811105, 1.3013789776481637], [14.452034599135944, 0.27510822977388755, 3.9461571559522843], [19.495644442106077, 0.43249039379346776, 0.8891152045462847], [70.19186160345622, 0.3162957210487375, 5.999999999999999]], "peak_params_": [[9.936615626407999, 1.522400954601463, 2.6027579552963274], [14.452034599135944, 0.28383807973465675, 7.892314311904569], [19.495644442106077, 0.5118541988831113, 1.7782304090925694], [70.19186160345622, 0.31613405234906855, 11.999999999999998]], "r_squared_": 0.9718588161773785, "error_": 0.07673926109260161}
{"freq_range": [2.0, 80.0], "freq_res": 1.0, "aperiodic_params_": [0.7488602541733087, 1.2618573371978992], "gaussian_params_": [[10.052811624119803, 1.4972345108952612, 1.6055965799601206], [18.35358222484874, 0.4725099875317911, 2.4906600927478353], [72.14158617109847, 0.35107120063801484, 5.999999999999999]], "peak_params_": [[10.052811624119803, 1.498129733267461, 3.2111931599202412], [18.35358222484874, 0.4677796828613421, 4.981320185495671], [72.14158617109847, 0.35097346703158383, 11.999999999999998]], "r_squared_": 0.9670709902542108, "error_": 0.09336224954461274}
{"freq_range": [2.0, 80.0], "freq_res": 1.0, "aperiodic_params_": [0.7660762562894978, 1.299834036439697], "gaussian_params_": [[10.065793602726146, 1.5220536660234893, 1.6036013830355667], [18.31649904962536, 0.4989480220280722, 2.1804244934228105], [59.96829233485159, 0.10196920212650326, 0.2500471172183569], [62.032974579928776, 0.04875967654163922, 0.25008582852744676], [62.13775562607489, 0.23092052519090842, 5.999999999999999], [79.57635082638342, 0.3305962004457403, 5.999999999999999]], "peak_params_": [[10.065793602726146, 1.521119092441154, 3.2072027660711333], [18.31649904962536, 0.4937265734409675, 4.360848986845621], [59.96829233485159, 0.3194848022591956, 0.5000942344367137], [62.032974579928776, 0.2837251051089238, 0.5001716570548935], [62.13775562607489, 0.2837251051089238, 11.999999999999998], [79.57635082638342, 0.3325206204296163, 11.999999999999998]], "r_squared_": 0.9823861599643139, "error_": 0.06332715540587311}
{"freq_range": [2.0, 80.0], "freq_res": 1.0, "aperiodic_params_": [0.7718637537373606, 1.2909145510115592], "gaussian_params_": [[10.095112169947903, 1.435946187495908, 1.4922608392935255], [18.365611066179554, 0.4197409106399167, 1.8006505786854141], [52.35610379744822, 0.1176007445289991, 4.443258617355652], [64.72532714657515, 0.2583477493530644, 5.235953513013025], [71.99076089940391, 0.20181193041934614, 1.1416407244716174], [78.38774204552388, 0.3611724503736021, 2.718446528369174]], "peak_params_": [[10.095112169947903, 1.4330410840195138, 2.984521678587051], [18.365611066179554, 0.4111783455947146, 3.6013011573708282], [52.35610379744822, 0.13070015642809807, 8.886517234711304], [64.72532714657515, 0.26004577035488485, 10.47190702602605], [71.99076089940391, 0.323063777304855, 2.2832814489432347], [78.38774204552388, 0.3679033010093209, 5.436893056738348]], "r_squared_": 0.9817026172001903, "error_": 0.057367652367731455}
{"freq_range": [2.0, 80.0], "freq_res": 1.0, "aperiodic_params_": [0.48805174320889705, 1.117864056096303], "gaussian_params_": [[9.898073538797814, 1.4693835326199678, 1.2568566703019557], [13.136854257132889, 0.39496725077871797, 1.3509667898896605], [16.560929278044682, 1.218586922795481, 0.25000000000000006], [19.47323797149642, 0.5116699194749523, 1.1297049318316308], [70.19186160345622, 0.3232077758078052, 5.999999999999999]], "peak_params_": [[9.898073538797814, 1.4912184121058465, 2.5137133406039114], [13.136854257132889, 0.4628467860613636, 2.701933579779321], [16.560929278044682, 0.31385448583580833, 0.5000000000000001], [19.47323797149642, 0.4687210980415852, 2.2594098636632616], [70.19186160345622, 0.323042574139365, 11.999999999999998]], "r_squared_": 0.9667044055607577, "error_": 0.0794137272459561}
{"freq_range": [2.0, 80.0], "freq_res": 1.0, "aperiodic_params_": [0.6633552775224087, 1.2036838210837855], "gaussian_params_": [[9.94492688790541, 1.3208444178876513, 1.3149485186047558], [14.452034599135944, 0.29128483508962355, 4.067257645622465], [19.488998576235797, 0.4289271239993106, 0.8924034088319676], [70.19186160345622, 0.3319363814304182, 5.999999999999999]], "peak_params_": [[9.94492688790541, 1.4796943537136193, 2.6298970372095116], [14.452034599135944, 0.3008620230698402, 8.13451529124493], [19.488998576235797, 0.5250200135843633, 1.7848068176639351], [70.19186160345622, 0.3317667182968773, 11.999999999999998]], "r_squared_": 0.9679606061139511, "error_": 0.08278771464449426}
{"freq_range": [2.0, 80.0], "freq_res": 1.0, "aperiodic_params_": [0.9091165976961476, 1.3555438878858057], "gaussian_params_": [[10.101272306569372, 1.4316424855365355, 1.6142315869313764], [18.449134714476653, 0.47096302639566834, 2.402735517939046], [52.35610379740783, 0.13316847881032398, 2.691555715944139], [63.0292358293449, 0.2798882151032533, 4.521378114788389], [78.78022449044269, 0.36226643011855164, 5.643614106689645]], "peak_params_": [[10.101272306569372, 1.42980022382509, 3.2284631738627527], [18.449134714476653, 0.46281546165599535, 4.805471035878092], [52.35610379740783, 0.14629714260530413, 5.383111431888278], [63.0292358293449, 0.2872021014783648, 9.042756229576778], [78.78022449044269, 0.36253840897017797, 11.28722821337929]], "r_squared_": 0.9851424745281169, "error_": 0.057795022916568704}
{"freq_range": [2.0, 80.0], "freq_res": 1.0, "aperiodic_params_": [0.9869496713417092, 1.398824865734645], "gaussian_params_": [[10.10148340314769, 1.4355097340411056, 1.6356718542364075], [18.454560549903093, 0.4859523404905, 2.3959595749064357], [51.608383009287245, 0.16536433711158072, 2.2842467176981436], [61.007844702060865, 0.298297138809465, 3.516107499586771], [66.61095440548681, 0.2211587297284549, 1.6186429888515863], [71.07316520350872, 0.24664662946400462, 1.170830386634215], [77.86399558687084, 0.40749519796757383, 3.6606517804225347]], "peak_params_": [[10.10148340314769, 1.4337105523655511, 3.271343708472815], [18.454560549903093, 0.47729739672694627, 4.7919191498128715], [51.608383009287245, 0.1741581689809435, 4.568493435396287], [61.007844702060865, 0.29888547502839025, 7.032214999173542], [66.61095440548681, 0.2902478406639024, 3.2372859777031726], [71.07316520350872, 0.32727565408627535, 2.34166077326843], [77.86399558687084, 0.407216589040462, 7.321303560845069]], "r_squared_": 0.986213479843743, "error_": 0.0556101203904151}
{"freq_range": [2.0, 80.0], "freq_res": 1.0, "aperiodic_params_": [1.0135971745402776, 1.4050329536267712], "gaussian_params_": [[10.080017640596962, 1.4377075156068835, 1.6253590230121846], [18.392598260836063, 0.49100543789229834, 2.2631557150653716], [52.20023092195955, 0.14911449406543453, 3.0060764676637004], [60.575512419904875, 0.27125075147179556, 2.5663129900677104], [66.33965736919401, 0.2587885607585489, 1.9428294711528165], [71.19325152819015, 0.19884216042549357, 1.1753123633095588], [78.39407122859781, 0.384819818034655, 4.016290488158369]], "peak_params_": [[10.080017640596962, 1.4364731716751873, 3.250718046024369], [18.392598260836063, 0.4836828289517013, 4.526311430130743], [52.20023092195955, 0.14980427377715055, 6.012152935327401], [60.575512419904875, 0.27557751390860497, 5.132625980135421], [66.33965736919401, 0.2872233080811424, 3.885658942305633], [71.19325152819015, 0.28148961802975236, 2.3506247266191176], [78.39407122859781, 0.38297191805441955, 8.032580976316739]], "r_squared_": 0.9858259526022422, "error_": 0.05912954748421133}
{"freq_range": [2.0, 80.0], "freq_res": 1.0, "aperiodic_params_": [0.9815778345530031, 1.3887726685594077], "gaussian_params_": [[9.879884435746243, 1.3189919508668844, 1.3144585946853893], [13.452034599135944, 0.3132478549609545, 3.7110136686699837], [19.13539562336524, 0.505762837897077, 1.3001258992501863], [52.211682397402505, 0.1677337850377682, 1.3968080026234386], [62.17176282284306, 0.282555907251565, 4.528413524812454], [67.00182491404306, 0.16170794323233662, 0.5920673824317277], [71.22119025161939, 0.2027556351330607, 1.267024732501257], [78.05976963547806, 0.38387713289798964, 3.301281296584067]], "peak_params_": [[9.879884435746243, 1.5167280196758077, 2.6289171893707786], [13.452034599135944, 0.38978021330573903, 7.4220273373399674], [19.13539562336524, 0.6054887075670959, 2.6002517985003726], [52.211682397402505, 0.18849108711714946, 2.7936160052468773], [62.17176282284306, 0.28235551382376234, 9.056827049624909], [67.00182491404306, 0.3239468024115304, 1.1841347648634555], [71.22119025161939, 0.28094471899094353, 2.534049465002514], [78.05976963547806, 0.3844426434828574, 6.602562593168134]], "r_squared_": 0.9891571537343197, "error_": 0.05089904228218987}
{"freq_range": [2.0, 80.0], "freq_res": 1.0, "aperiodic_params_": [0.8579153625993533, 1.322618518284119], "gaussian_params_": [[10.049562648780952, 1.46125580139406, 1.5752544941217284], [18.199661364817697, 0.5065369083489194, 2.3673998190091505], [60.08097137414065, 0.12306734013610406, 0.250102099117999], [62.41253829644064, 0.23014528784165778, 5.999999999999999], [79.99999999999999, 0.36122276421582034, 5.9999999998802105]], "peak_params_": [[10.049562648780952, 1.4617905866860157, 3.1505089882434567], [18.199661364817697, 0.5047429410606747, 4.734799638018301], [60.08097137414065, 0.33045307183105543, 0.500204198235998], [62.41253829644064, 0.23361475366356954, 11.999999999999998], [79.99999999999999, 0.3643577236172475, 11.999999999760421]], "r_squared_": 0.9838970764703319, "error_": 0.06089194391283978}
{"freq_range": [2.0, 80.0], "freq_res": 1.0, "aperiodic_params_": [0.8011146395966375, 1.283995013737543], "gaussian_params_": [[10.051040215890874, 1.4586653360172432, 1.5705384545937744], [18.19410115492821, 0.48088326579616225, 2.333646253053752], [59.81963092995183, 0.19193825178600069, 5.792826166561902], [75.19186160345622, 0.29590112328562107, 5.999999999999999]], "peak_params_": [[10.051040215890874, 1.4589063692802984, 3.141076909187549], [18.19410115492821, 0.4792267360978414, 4.667292506107504], [59.81963092995183, 0.20384121524570653, 11.585652333123804], [75.19186160345622, 0.30194363875018815, 11.999999999999998]], "r_squared_": 0.9804021641880938, "error_": 0.06392947765099666}
{"freq_range": [2.0, 80.0], "freq_res": 1.0, "aperiodic_params_": [0.4037372314364666, 1.0002883050508897], "gaussian_params_": [[10.031272367620376, 1.4004701565910045, 1.5835583870369443], [18.305335216601474, 0.3258158653049203, 1.998818045534779], [57.45203459913595, 0.17602544418676574, 5.999999999999999], [61.723925651419634, 0.1301388391921897, 1.5241464937369855], [67.215541154306, 0.07911897690303721, 1.4692795739926963], [75.54796540086404, 0.36506014494231337, 5.999999999999999]], "peak_params_": [[10.031272367620376, 1.4002551636168439, 3.1671167740738886], [18.305335216601474, 0.3220409455531551, 3.997636091069558], [57.45203459913595, 0.17966498693520783, 11.999999999999998], [61.723925651419634, 0.2887644477110405, 3.048292987473971], [67.215541154306, 0.2605424044840352, 2.9385591479853925], [75.54796540086404, 0.36550621959373664, 11.999999999999998]], "r_squared_": 0.9652717378093805, "error_": 0.06983999699007273}
{"freq_range": [2.0, 80.0], "freq_res": 1.0, "aperiodic_params_": [0.30008791293658177, 0.9483677518871698], "gaussian_params_": [[9.83595424435725, 1.2383660234954252, 1.170514589825314], [12.446930422144451, 0.4895484562707913, 1.8052686459660188], [19.15563218357987, 0.38310077446762253, 1.4160204081021581], [53.49044172942248, 0.11250945883737777, 3.2492382679463985], [59.55371073033929, 0.45738363009964794, 0.2659473570104413], [62.397088483248034, 0.16540634388766567, 0.25000034414877337], [64.54796540086404, 0.20324444554070745, 5.999999999999999]], "peak_params_": [[9.83595424435725, 1.4216302306599486, 2.341029179650628], [12.446930422144451, 0.698970485988709, 3.6105372919320375], [19.15563218357987, 0.3814676355136598, 2.8320408162043162], [53.49044172942248, 0.14312371082187503, 6.498476535892797], [59.55371073033929, 0.27950537714977797, 0.5318947140208826], [62.397088483248034, 0.23621719656031148, 0.5000006882975467], [64.54796540086404, 0.2028805635352644, 11.999999999999998]], "r_squared_": 0.9708332505190685, "error_": 0.06069375289303893}
{"freq_range": [2.0, 80.0], "freq_res": 1.0, "aperiodic_params_": [0.5943408271529629, 1.1755086409484832], "gaussian_params_": [[9.764616930649828, 1.3453318866709554, 1.1946071861271041], [12.591589997763705, 0.5403195477334028, 1.6524367515759544], [16.55290074643292, 1.0183585270900393, 0.2746845488356659], [19.37467939746847, 0.5412665406614521, 1.1122093317389024], [57.749006685146504, 0.2133771479004128, 5.613528976579982], [72.0959308017281, 0.3075372293890901, 5.999999999999999]], "peak_params_": [[9.764616930649828, 1.4774229002029002, 2.3892143722542083], [12.591589997763705, 0.5584258311045099, 3.3048735031519088], [16.55290074643292, 0.34155778467852205, 0.5493690976713318], [19.37467939746847, 0.5117012035270307, 2.2244186634778047], [57.749006685146504, 0.23263522765142985, 11.227057953159964], [72.0959308017281, 0.3160024225427016, 11.999999999999998]], "r_squared_": 0.9792794048216039, "error_": 0.05876944699240109}
{"freq_range": [2.0, 80.0], "freq_res": 1.0, "aperiodic_params_": [0.7964795659845055, 1.2695455135592937], "gaussian_params_": [[9.87726482285119, 1.4846219812724422, 1.2616362844594649], [12.721278534103252, 0.4766816832855375, 0.9918308714389447], [17.32002472956745, 0.3267290408743705, 2.2064836571461486], [19.249487609581237, 0.59716259020116, 0.2500683598081003], [20.42339723370063, 0.7075453489712092, 0.32883754188062186], [55.54796540086405, 0.18722872722198045, 5.999999999999999], [74.73888137436232, 0.33061154891939626, 5.999999999999999]], "peak_params_": [[9.87726482285119, 1.4900002658047558, 2.5232725689189297], [12.721278534103252, 0.5756781334794601, 1.9836617428778893], [17.32002472956745, 0.3233540300551785, 4.412967314292297], [19.249487609581237, 0.6076149352563925, 0.5001367196162007], [20.42339723370063, 0.47173211583344377, 0.6576750837612437], [55.54796540086405, 0.18921727550310874, 11.999999999999998], [74.73888137436232, 0.3312759049710787, 11.999999999999998]], "r_squared_": 0.982522923972477, "error_": 0.058632099243079515}
{"freq_range": [2.0, 80.0], "freq_res": 1.0, "aperiodic_params_": [0.9024652279124701, 1.3283879314690727], "gaussian_params_": [[9.721197360431079, 0.8687134863067482, 0.927815254725886], [10.984540214591508, 0.7751686042319638, 2.384422552857294], [18.966343707722302, 0.576589504449022, 1.6163679973719383], [51.73976682707756, 0.16785551570844745, 2.770501092461456], [60.16173629564863, 0.19962436605447834, 2.4424595147528723], [70.0959308017281, 0.33784301540148653, 5.999999999999999]], "peak_params_": [[9.721197360431079, 1.542192176769006, 1.855630509451772], [10.984540214591508, 1.1111736455782428, 4.768845105714588], [18.966343707722302, 0.5791907672461893, 3.2327359947438765], [51.73976682707756, 0.17144425206415637, 5.541002184922912], [60.16173629564863, 0.2831742307475029, 4.8849190295057445], [70.0959308017281, 0.33785968056916493, 11.999999999999998]], "r_squared_": 0.9754127171079793, "error_": 0.06794969719774953}
{"freq_range": [2.0, 80.0], "freq_res": 1.0, "aperiodic_params_": [1.0198456478770956, 1.393054132001515], "gaussian_params_": [[9.723664862206506, 0.8387116049686121, 0.9048321847106573], [10.831530485665533, 0.7901196653878639, 2.2921994464570994], [18.882240873733156, 0.5673288880247552, 1.6742721521129795], [51.8303815889494, 0.16318562591734323, 2.7295849575492084], [59.87895150130285, 0.19576248682296968, 2.394080521397543], [70.0959308017281, 0.3399417959611625, 5.999999999999999]], "peak_params_": [[9.723664862206506, 1.5403010786512423, 1.8096643694213146], [10.831530485665533, 1.098131003831756, 4.584398892914199], [18.882240873733156, 0.5673080368773821, 3.348544304225959], [51.8303815889494, 0.16734063020275936, 5.459169915098417], [59.87895150130285, 0.279889472318648, 4.788161042795086], [70.0959308017281, 0.3399241044850754, 11.999999999999998]], "r_squared_": 0.9756760621766305, "error_": 0.07251729031644057}
{"freq_range": [2.0, 80.0], "freq_res": 1.0, "aperiodic_params_": [0.9163477273928184, 1.3462253447380772], "gaussian_params_": [[9.89357880212251, 1.5187739741420812, 1.3692511645847207], [12.747418009701853, 0.38647129885949566, 0.7889950591466238], [17.489783593704285, 0.39775077682502563, 2.4397060488379787], [19.33870080009442, 0.3523889588876352, 0.8148997482880543], [52.00383894546576, 0.1535954270058028, 3.01390085703763], [60.25492314159012, 0.19190545584353025, 2.2437143214498705], [70.0959308017281, 0.3400569686073749, 5.999999999999999]], "peak_params_": [[9.89357880212251, 1.5186667274162788, 2.7385023291694415], [12.747418009701853, 0.5561480278881167, 1.5779901182932476], [17.489783593704285, 0.3955526414169721, 4.879412097675957], [19.33870080009442, 0.6516294438180371, 1.6297994965761087], [52.00383894546576, 0.1574163000993467, 6.02780171407526], [60.25492314159012, 0.27777334479468263, 4.487428642899741], [70.0959308017281, 0.34002888429352396, 11.999999999999998]], "r_squared_": 0.9781866168290766, "error_": 0.06375407174228806}
{"freq_range": [2.0, 80.0], "freq_res": 1.0, "aperiodic_params_": [0.7889338360454661, 1.2929949053704306], "gaussian_params_": [[9.71569268462049, 0.9095707381713373, 0.997448431553879], [11.000199594449464, 0.722458127614801, 2.4911033227293635], [18.592821228777115, 0.5964258587124791, 1.7049491100676124], [51.85098074494066, 0.13803430511510434, 3.3786059041232255], [60.38734535797783, 0.26052044468589086, 2.1430059973242503], [65.82834040982486, 0.2765630145787502, 2.2196055976619706], [71.04278671661399, 0.19323905268593872, 1.214558032145742], [78.37243361072082, 0.39588557555008425, 4.099467842187842]], "peak_params_": [[9.71569268462049, 1.5398738700374572, 1.994896863107758], [11.000199594449464, 1.1195229050711861, 4.982206645458727], [18.592821228777115, 0.5838204746389294, 3.409898220135225], [51.85098074494066, 0.13802301322033972, 6.757211808246451], [60.38734535797783, 0.2726469625934158, 4.286011994648501], [65.82834040982486, 0.28839856134728925, 4.439211195323941], [71.04278671661399, 0.2900135561244601, 2.429116064291484], [78.37243361072082, 0.39425529996103736, 8.198935684375684]], "r_squared_": 0.9897259555197843, "error_": 0.04780572478482257}
{"freq_range": [2.0, 80.0], "freq_res": 1.0, "aperiodic_params_": [0.5703303268702236, 1.1790567223041388], "gaussian_params_": [[10.059901364753642, 1.4178486616332846, 1.6673847538247044], [17.842334996107887, 0.47421291238247554, 2.3763867153052343], [57.45203459913595, 0.16754107819617373, 5.999999999999999], [60.40555393876051, 0.5728752195060719, 0.27759388626869114], [72.0959308017281, 0.34957516589525545, 5.999999999999999]], "peak_params_": [[10.059901364753642, 1.4189808373578556, 3.334769507649409], [17.842334996107887, 0.47318723315225003, 4.7527734306104685], [57.45203459913595, 0.18182182736772123, 11.999999999999998], [60.40555393876051, 0.39596159144521903, 0.5551877725373823], [72.0959308017281, 0.3583921849898597, 11.999999999999998]], "r_squared_": 0.9711100450782514, "error_": 0.07053390469121683}
{"freq_range": [2.0, 80.0], "freq_res": 1.0, "aperiodic_params_": [0.3906244099588418, 1.077015018031165], "gaussian_params_": [[9.805738679630103, 1.4187626686290111, 1.3711573464697113], [13.260582232864838, 0.41019626239337015, 1.5209167409497895], [18.571493723213315, 0.423186649696765, 1.5609201636759342], [60.80894924894743, 0.24291479831060261, 5.999999999999999], [77.82190110980842, 0.354740420714602, 5.999999999999999]], "peak_params_": [[9.805738679630103, 1.445803320848482, 2.7423146929394226], [13.260582232864838, 0.4990103619094895, 3.041833481899579], [18.571493723213315, 0.4078689000930109, 3.1218403273518684], [60.80894924894743, 0.2497585056627878, 11.999999999999998], [77.82190110980842, 0.35859139122908723, 11.999999999999998]], "r_squared_": 0.9766432960385105, "error_": 0.061553417465932396}
{"freq_range": [2.0, 80.0], "freq_res": 1.0, "aperiodic_params_": [0.16586588192559754, 0.8994295639989454], "gaussian_params_": [[9.942518154237787, 1.1595231350515915, 1.2732701944692113], [12.744490125503672, 0.6426883712156721, 1.8563234914157212], [19.38606408787358, 0.3617131732300748, 2.2166167606473364], [52.89139512018675, 0.23858301174130278, 0.566967481130922], [71.12575385302885, 0.29775243315646177, 5.999999999999999]], "peak_params_": [[9.942518154237787, 1.37384202467495, 2.5465403889384226], [12.744490125503672, 0.7072202800514749, 3.7126469828314423], [19.38606408787358, 0.3584668211230224, 4.433233521294673], [52.89139512018675, 0.23735123753963694, 1.133934962261844], [71.12575385302885, 0.29768704219387576, 11.999999999999998]], "r_squared_": 0.9613591044405398, "error_": 0.07144557579592785}
{"freq_range": [2.0, 80.0], "freq_res": 1.0, "aperiodic_params_": [0.4145964428881833, 1.0448727333103376], "gaussian_params_": [[9.632408921849242, 0.9050917763728451, 1.0439092400956638], [11.89415546060104, 0.829068887707859, 2.135933131210044], [16.566113691301126, 1.2604676038820153, 0.250744907124978], [18.53877082980541, 2.059293583609514, 0.25002015964185403], [20.28620389742868, 0.4223802340212575, 0.7937444408054599], [55.54796540086405, 0.18671033507600915, 5.999999999999999], [74.72742577806878, 0.32347354706890274, 5.999999999999999]], "peak_params_": [[9.632408921849242, 1.410209483246375, 2.0878184801913275], [11.89415546060104, 0.8971902047921704, 4.271866262420088], [16.566113691301126, 0.32975485347839906, 0.501489814249956], [18.53877082980541, 0.4925167516673057, 0.5000403192837081], [20.28620389742868, 0.3964144808985056, 1.5874888816109198], [55.54796540086405, 0.1886606998458571, 11.999999999999998], [74.72742577806878, 0.3241145135148056, 11.999999999999998]], "r_squared_": 0.9787506673980476, "error_": 0.0560597998088784}
{"freq_range": [2.0, 80.0], "freq_res": 1.0, "aperiodic_params_": [0.6875937921860764, 1.179301439945079], "gaussian_params_": [[9.741343778883717, 1.355907449009137, 1.1921557098755189], [12.62335811590036, 0.7043207908010742, 1.3381303975994858], [16.871941401821974, 0.2976295646742094, 1.169670911578632], [18.821116637913416, 0.24983091973487884, 0.3472189113055058], [19.830964226013045, 0.45962729232190935, 1.0237369818951008], [55.54796540086405, 0.1829370362489517, 5.999999999999999], [74.19533670319328, 0.33507946761728874, 5.999999999999999]], "peak_params_": [[9.741343778883717, 1.4274479113242275, 2.3843114197510378], [12.62335811590036, 0.7105531602448355, 2.6762607951989716], [16.871941401821974, 0.3092430283987826, 2.339341823157264], [18.821116637913416, 0.6062887590468606, 0.6944378226110116], [19.830964226013045, 0.4625190144947346, 2.0474739637902015], [55.54796540086405, 0.1857928364344852, 11.999999999999998], [74.19533670319328, 0.33651847703130455, 11.999999999999998]], "r_squared_": 0.980083639129377, "error_": 0.05932205125629844}
{"freq_range": [2.0, 80.0], "freq_res": 1.0, "aperiodic_params_": [0.7449750160040485, 1.1898647702972918], "gaussian_params_": [[9.633550866586468, 0.7874209285161212, 0.8806450955485049], [11.161452889089217, 0.8847856038239941, 2.3193250507743493], [19.011704481492103, 0.5815641681012316, 1.5149374604412917], [70.66186930340331, 0.3546293701054701, 5.999999999999999]], "peak_params_": [[9.633550866586468, 1.5026361458493938, 1.7612901910970098], [11.161452889089217, 1.1189115321571712, 4.6386501015486985], [19.011704481492103, 0.5844746649980518, 3.0298749208825835], [70.66186930340331, 0.3540666834321826, 11.999999999999998]], "r_squared_": 0.9653412074941963, "error_": 0.0846653461936634}
{"freq_range": [2.0, 80.0], "freq_res": 1.0, "aperiodic_params_": [0.8867137124697498, 1.2955959541917415], "gaussian_params_": [[9.653128890211732, 0.7589100431259181, 0.8688186834525259], [10.95550567968514, 0.9029551318028282, 2.3089909926713967], [18.907962885401794, 0.5925742060292307, 1.6018560490582956], [51.70351328025958, 0.15016951930180775, 2.6631752537144116], [60.76393210318905, 0.21069711427175036, 2.9426972666131452], [72.0959308017281, 0.33142075468668447, 5.999999999999999]], "peak_params_": [[9.653128890211732, 1.5296324871194877, 1.7376373669050518], [10.95550567968514, 1.131001964994313, 4.6179819853427935], [18.907962885401794, 0.5936856954394079, 3.203712098116591], [51.70351328025958, 0.15295464839733364, 5.326350507428823], [60.76393210318905, 0.27030246180476136, 5.8853945332262905], [72.0959308017281, 0.3315222094607293, 11.999999999999998]], "r_squared_": 0.9807946543376748, "error_": 0.0626718534980233}
{"freq_range": [2.0, 80.0], "freq_res": 1.0, "aperiodic_params_": [0.8436038369997076, 1.2917706275995993], "gaussian_params_": [[9.888882814688209, 1.4735931960193813, 1.3848879415732605], [12.677019751577692, 0.47859681695919754, 0.771048638635362], [17.1146829416034, 0.3491590187253828, 2.8305854989082238], [19.215560742642886, 0.4129362839411534, 0.8825482117747485], [51.896399589490095, 0.157975793259601, 2.820527412395437], [60.664005852016516, 0.28583155424820206, 2.572752288584492], [66.326110290417, 0.27604124842721134, 2.000884987411081], [70.92453572646608, 0.2199477706367738, 0.9644491168151356], [77.8779828508092, 0.41355573491562786, 3.914449067712735]], "peak_params_": [[9.888882814688209, 1.4848425294605188, 2.769775883146521], [12.677019751577692, 0.6779548321931795, 1.542097277270724], [17.1146829416034, 0.36655137316278164, 5.6611709978164475], [19.215560742642886, 0.6805001044164953, 1.765096423549497], [51.896399589490095, 0.15885440470425216, 5.641054824790874], [60.664005852016516, 0.2922927703596967, 5.145504577168984], [66.326110290417, 0.30980902545418054, 4.001769974822162], [70.92453572646608, 0.32573467967806957, 1.9288982336302711], [77.8779828508092, 0.41335488358726735, 7.82889813542547]], "r_squared_": 0.9886216244169743, "error_": 0.04701837356785438}
{"freq_range": [2.0, 80.0], "freq_res": 1.0, "aperiodic_params_": [0.6905242375942771, 1.2273722643848692], "gaussian_params_": [[9.89879144544776, 1.4286814073980065, 1.4532787033054642], [12.605079261772095, 0.4706731654713024, 0.5852590868614994], [14.871311861974982, 0.317513371803297, 1.6670049570497874], [18.868865427157633, 0.6072193444257116, 1.465060440734012], [51.29424677163858, 0.1309357154944537, 2.9400299656387987], [60.2354069203444, 0.2059149368073266, 0.27690552709186156], [64.19086100509121, 0.2858799387228707, 5.198888011783822], [71.20470841912505, 0.1620922383007551, 0.9447142947128464], [78.17931745292302, 0.40455447847580056, 3.1924830003459315]], "peak_params_": [[9.89879144544776, 1.4296857050515146, 2.9065574066109283], [12.605079261772095, 0.6907254112410879, 1.1705181737229988], [14.871311861974982, 0.3382738091298875, 3.3340099140995747], [18.868865427157633, 0.6195747244274786, 2.930120881468024], [51.29424677163858, 0.1417175383121103, 5.880059931277597], [60.2354069203444, 0.3516753039056715, 0.5538110541837231], [64.19086100509121, 0.2857199320434525, 10.397776023567644], [71.20470841912505, 0.3118554622258036, 1.8894285894256928], [78.17931745292302, 0.41231443075708096, 6.384966000691863]], "r_squared_": 0.9872971815656028, "error_": 0.04830890851192097}
{"freq_range": [2.0, 80.0], "freq_res": 1.0, "aperiodic_params_": [0.5558555157202133, 1.1903823947420011], "gaussian_params_": [[9.883257308590382, 1.3753943061866343, 1.45903472283178], [12.524195537507136, 1.122187266823094, 0.2902184394530093], [14.549182206384952, 0.3330516445143198, 1.4258675334527795], [18.63320001781461, 0.5269159226796042, 1.5288321168055887], [51.892357864194146, 0.1377099655376737, 3.2613632094864613], [58.72808055387972, 0.18370862194034485, 1.457122538252172], [60.4183396013128, 0.7423099672498109, 0.299104339369977], [62.31035537227436, 0.33552614473681536, 0.6804104854373004], [64.4364976138265, 0.3016900889754753, 0.5678863914140739], [66.80129324776318, 0.27939868474228075, 1.196447781600896], [70.39840130864941, 0.26702460428052965, 0.6558232548624975], [72.47202512644597, 0.37650079734062375, 0.2675544454411402], [78.67726457643818, 0.39344327330770673, 5.007456745430546]], "peak_params_": [[9.883257308590382, 1.373050532254026, 2.91806944566356], [12.524195537507136, 0.6183144715715195, 0.5804368789060186], [14.549182206384952, 0.3510398445359276, 2.851735066905559], [18.63320001781461, 0.5145177878910125, 3.0576642336111775], [51.892357864194146, 0.13763955962396235, 6.522726418972923], [58.72808055387972, 0.19353602651548085, 2.914245076504344], [60.4183396013128, 0.4123292962504075, 0.598208678739954], [62.31035537227436, 0.31992785747688113, 1.3608209708746009], [64.4364976138265, 0.2636871588418328, 1.1357727828281479], [66.80129324776318, 0.3015291202170767, 2.392895563201792], [70.39840130864941, 0.31753396297283265, 1.311646509724995], [72.47202512644597, 0.25469416209019036, 0.5351088908822804], [78.67726457643818, 0.39262695401673486, 10.014913490861092]], "r_squared_": 0.9876605994820398, "error_": 0.04281146964426232}
{"freq_range": [2.0, 80.0], "freq_res": 1.0, "aperiodic_params_": [0.30191468478117955, 1.1001681436577742], "gaussian_params_": [[9.770964022480955, 0.9295655674962122, 1.1462375748957052], [12.216287081407518, 0.5428321920019368, 3.3711580676306507], [12.520129268019417, 0.9784929016496291, 0.2500495511684472], [18.971469007292406, 0.3400933466263751, 1.4148005384777933], [57.45203459913595, 0.14753768389693384, 5.999999999999999], [60.30643361704863, 0.33460528485135316, 0.3292628866833974], [72.0959308017281, 0.31481491825527286, 5.999999999999999]], "peak_params_": [[9.770964022480955, 1.3485259107690468, 2.2924751497914104], [12.216287081407518, 0.7944908885820112, 6.7423161352613015], [12.520129268019417, 0.7011583369496875, 0.5000991023368944], [18.971469007292406, 0.4117008809861701, 2.8296010769555866], [57.45203459913595, 0.16040789323616678, 11.999999999999998], [60.30643361704863, 0.3930727892942185, 0.6585257733667949], [72.0959308017281, 0.3225783467436216, 11.999999999999998]], "r_squared_": 0.9770468145662791, "error_": 0.05786501475890424}
{"freq_range": [2.0, 80.0], "freq_res": 1.0, "aperiodic_params_": [0.04908299908764271, 0.7231081305846848], "gaussian_params_": [[10.683834103964125, 1.0854133706719806, 1.726486237752148], [16.391861346860082, 0.36182478834789766, 3.742570534886614], [21.290023361344634, 0.2495712214662534, 0.5323491121452857], [52.635781145623085, 0.4281796493688992, 0.31615310196565577], [59.73555678489601, 0.13143194211604597, 1.1212658627708665], [62.36421746468393, 0.2878483896939577, 0.25147251141426186], [64.31570114954705, 0.2555515507430701, 0.2976077494474434], [69.54796535015818, 0.20756105767828223, 5.999999999643615]], "peak_params_": [[10.683834103964125, 1.1955374428785563, 3.452972475504296], [16.391861346860082, 0.36932547036264596, 7.485141069773228], [21.290023361344634, 0.3846998200716163, 1.0646982242905714], [52.635781145623085, 0.22514028208275338, 0.6323062039313115], [59.73555678489601, 0.18634091173362433, 2.242531725541733], [62.36421746468393, 0.2120284566233619, 0.5029450228285237], [64.31570114954705, 0.28104137181303, 0.5952154988948868], [69.54796535015818, 0.20697283642140185, 11.99999999928723]], "r_squared_": 0.9683193234850563, "error_": 0.052736821832547555}
{"freq_range": [2.0, 80.0], "freq_res": 1.0, "aperiodic_params_": [0.28518856930361497, 0.8685622054017725], "gaussian_params_": [[9.513874719893243, 0.8161259542549715, 0.959707502185139], [11.989025118295068, 0.9830556408678085, 1.955569744036592], [16.56984369868145, 0.5585837188084734, 0.32764724536461537], [19.264106108511147, 0.46489603105304056, 0.9798252783231689], [21.291594465887652, 0.2942071497516025, 0.36223452984902865], [55.54796540082681, 0.1511541384253141, 5.999999998842376], [71.64389620258626, 0.26618711021602043, 5.999999999999999]], "peak_params_": [[9.513874719893243, 1.3039176826485435, 1.919415004370278], [11.989025118295068, 1.0115205415777828, 3.911139488073184], [16.56984369868145, 0.305029637962804, 0.6552944907292307], [19.264106108511147, 0.44990137350543874, 1.9596505566463378], [21.291594465887652, 0.3095914166597913, 0.7244690596980573], [55.54796540082681, 0.1596177640703309, 11.999999997684752], [71.64389620258626, 0.2692406069808453, 11.999999999999998]], "r_squared_": 0.9742485340679896, "error_": 0.05556975977708795}
{"freq_range": [2.0, 80.0], "freq_res": 1.0, "aperiodic_params_": [0.46912821872129307, 0.9855345287882098], "gaussian_params_": [[9.488032680212486, 0.656711118542701, 0.7916228372790644], [11.50608321246944, 1.0331475307734008, 2.223687435380653], [19.135386642945573, 0.49045319706937707, 1.606877729183578], [55.54796540086405, 0.15812863316142697, 5.9999999999993205], [71.64389620259216, 0.28591585150703397, 5.999999999999999]], "peak_params_": [[9.488032680212486, 1.090524528907644, 1.5832456745581287], [11.50608321246944, 1.012274055384176, 4.447374870761306], [19.135386642945573, 0.492247163190531, 3.213755458367156], [55.54796540086405, 0.16723153274064395, 11.999999999998641], [71.64389620259216, 0.289097138030854, 11.999999999999998]], "r_squared_": 0.9736561043342763, "error_": 0.06251251216951022}
{"freq_range": [2.0, 80.0], "freq_res": 1.0, "aperiodic_params_": [0.6309428006501301, 1.1087172898853312], "gaussian_params_": [[9.536719947896204, 0.663162586445365, 0.8301885089632248], [11.300078325714898, 1.0251798771916756, 2.280778351069476], [19.071512940289985, 0.5690084203524267, 1.5563803596840184], [55.54796540086405, 0.18729201651963956, 5.999999999999999], [74.46830506720137, 0.3404267090006034, 5.999999999999999]], "peak_params_": [[9.536719947896204, 1.438997436310882, 1.6603770179264496], [11.300078325714898, 1.1566290281693077, 4.561556702138952], [19.071512940289985, 0.5718427308739301, 3.112760719368037], [55.54796540086405, 0.18974445152114994, 11.999999999999998], [74.46830506720137, 0.34104637904117263, 11.999999999999998]], "r_squared_": 0.9770386300576114, "error_": 0.06377155169373054}
{"freq_range": [2.0, 80.0], "freq_res": 1.0, "aperiodic_params_": [0.7186671416280901, 1.1604732173271042], "gaussian_params_": [[9.553742439162527, 0.6562236702065828, 0.8811505377737735], [11.226496348764053, 1.0098497335355618, 2.272724814858427], [18.966044724522412, 0.592953289335458, 1.5458015939016978], [55.54796540086405, 0.1820912562614603, 5.999999999999999], [74.55614167660762, 0.33756418189526644, 5.999999999999999]], "peak_params_": [[9.553742439162527, 1.4502437921590032, 1.762301075547547], [11.226496348764053, 1.1754825328110126, 4.545449629716854], [18.966044724522412, 0.5957203211695455, 3.0916031878033956], [55.54796540086405, 0.1844027048182888, 11.999999999999998], [74.55614167660762, 0.3375922591047469, 11.999999999999998]], "r_squared_": 0.977961567840087, "error_": 0.06688939160395396}
{"freq_range": [2.0, 80.0], "freq_res": 1.0, "aperiodic_params_": [0.6555362219094472, 1.1419444989056209], "gaussian_params_": [[9.497223174721992, 0.5668301369694934, 0.876442806454203], [11.15565579139448, 1.048482883222166, 2.2746026819487484], [18.88031754915994, 0.5888831515655405, 1.6566843663187703], [51.65305488447786, 0.15201668495623455, 2.697525354472492], [60.83451177276693, 0.2084973907361351, 2.9528782818363934], [72.09593080096194, 0.3209409937620024, 5.999999999411722]], "peak_params_": [[9.497223174721992, 1.1517355152620636, 1.752885612908406], [11.15565579139448, 1.176369077692378, 4.549205363897497], [18.88031754915994, 0.5900898392497341, 3.3133687326375405], [51.65305488447786, 0.1543143059514256, 5.395050708944984], [60.83451177276693, 0.26659335732488487, 5.905756563672787], [72.09593080096194, 0.32106381049847266, 11.999999998823444]], "r_squared_": 0.9774891664371025, "error_": 0.06324449576077344}
{"freq_range": [2.0, 80.0], "freq_res": 1.0, "aperiodic_params_": [0.5555011508568669, 1.0925351174353988], "gaussian_params_": [[10.061184097100918, 1.3397378934551862, 1.5725921874791207], [12.649281796809372, 0.6249305531263029, 0.5540937925030311], [14.685312447418754, 0.3228345893500615, 1.1491743185299501], [18.84721943973595, 0.5619652187456071, 1.6705787577186433], [55.54796540086405, 0.17742642898099723, 5.999999999999999], [67.45203459913705, 0.6423993003758975, 0.25000000000000006], [74.73982700432028, 0.3359101789032091, 5.999999999999999]], "peak_params_": [[10.061184097100918, 1.3388108470753544, 3.1451843749582413], [12.649281796809372, 0.8565662737303034, 1.1081875850060623], [14.685312447418754, 0.36033299213522196, 2.2983486370599002], [18.84721943973595, 0.5599006306201406, 3.3411575154372866], [55.54796540086405, 0.17948187083971345, 11.999999999999998], [67.45203459913705, 0.3001600616594553, 0.5000000000000001], [74.73982700432028, 0.33652065144429333, 11.999999999999998]], "r_squared_": 0.9757126030905235, "error_": 0.0657180419047736}
{"freq_range": [2.0, 80.0], "freq_res": 1.0, "aperiodic_params_": [0.4422744508411661, 1.0787827085060877], "gaussian_params_": [[10.114283467535204, 1.2728479713862384, 1.6236678478584496], [12.597289085235856, 0.9886107265969099, 0.3391606641519156], [14.722145897418718, 0.3373160882212486, 0.8721164899235369], [18.74865489778505, 0.4697476057341732, 1.8345161664930385], [51.09990569737004, 0.14077447978875907, 2.6896654024641107], [60.335163969017565, 0.22054459833689985, 2.658247945279426], [72.0959308017281, 0.3363853090504308, 5.999999999999999]], "peak_params_": [[10.114283467535204, 1.2697044669227, 3.2473356957168993], [12.597289085235856, 0.8023277303916468, 0.6783213283038312], [14.722145897418718, 0.3926168109586993, 1.7442329798470737], [18.74865489778505, 0.46536172050463726, 3.669032332986077], [51.09990569737004, 0.14183603644828402, 5.379330804928221], [60.335163969017565, 0.2634750017213541, 5.316495890558852], [72.0959308017281, 0.3363568412224507, 11.999999999999998]], "r_squared_": 0.9762984507702289, "error_": 0.059206182819608585}
{"freq_range": [2.0, 80.0], "freq_res": 1.0, "aperiodic_params_": [0.31203372618381836, 1.094252819506769], "gaussian_params_": [[10.220638722735647, 1.2770720121408528, 1.5827483923734162], [12.591660007250587, 0.9559255635691547, 0.3199163627883783], [14.813573848497148, 0.43430677695340997, 1.0307250704111506], [17.197147284421252, 0.2786731207551197, 0.4922778550356049], [19.624060390787623, 0.4369530340054136, 1.5336205579685038], [60.150712188158025, 0.2038101697808578, 3.0548091442463443], [72.64389620259216, 0.2707371029299901, 5.999999999999999]], "peak_params_": [[10.220638722735647, 1.2647314146315092, 3.1654967847468325], [12.591660007250587, 0.7889915194154467, 0.6398327255767566], [14.813573848497148, 0.445283955286937, 2.061450140822301], [17.197147284421252, 0.40420467455261067, 0.9845557100712098], [19.624060390787623, 0.42402150564500096, 3.0672411159370077], [60.150712188158025, 0.23295531632306665, 6.109618288492689], [72.64389620259216, 0.27029001919640283, 11.999999999999998]], "r_squared_": 0.981108739601834, "error_": 0.057166241524707576}
{"freq_range": [2.0, 80.0], "freq_res": 1.0, "aperiodic_params_": [0.08922309131230208, 0.5785295786364026], "gaussian_params_": [[9.796872363264354, 1.2406794177164788, 1.1632802745879511], [13.04929963205238, 0.6518888803903324, 2.4203170748865497], [19.76096998837784, 0.4178658087442035, 1.3038506861082173], [52.67226579525702, 0.23881241342634602, 0.5179264523651975], [66.41950985113075, 0.1299289186819507, 5.999999999999999]], "peak_params_": [[9.796872363264354, 1.5166884626262456, 2.3265605491759023], [13.04929963205238, 0.6797611268047327, 4.840634149773099], [19.76096998837784, 0.4214535122126531, 2.6077013722164346], [52.67226579525702, 0.20613566050716947, 1.035852904730395], [66.41950985113075, 0.12961172319961345, 11.999999999999998]], "r_squared_": 0.9750327282271622, "error_": 0.0517543055404905}
{"freq_range": [2.0, 80.0], "freq_res": 1.0, "aperiodic_params_": [0.20367345807002712, 0.6908220913446804], "gaussian_params_": [[9.573392680794223, 1.0622395611383213, 1.024455594863287], [12.134718287822112, 1.0007005334219425, 1.7546234767270907], [16.74109165461997, 0.2562850366338777, 0.8395740256558133], [19.46604172392224, 0.43977979298509906, 0.870492160586228], [21.426475005321592, 0.5528825715817406, 0.3063364129753609], [51.741775757547806, 0.13370394080189307, 3.454930745652549], [64.16511480218945, 0.24080547172783365, 3.6753916532655135], [71.57213902837405, 0.5503378384317036, 0.27361691375501257], [77.60484223045509, 0.22498679765765867, 3.852234474368481]], "peak_params_": [[9.573392680794223, 1.4514249180504428, 2.048911189726574], [12.134718287822112, 1.06200731903601, 3.5092469534541815], [16.74109165461997, 0.2737531294589797, 1.6791480513116266], [19.46604172392224, 0.3884027111102713, 1.740984321172456], [21.426475005321592, 0.30288210627517553, 0.6126728259507218], [51.741775757547806, 0.13433736258118234, 6.909861491305098], [64.16511480218945, 0.24124981426011327, 7.350783306531027], [71.57213902837405, 0.26494670559627, 0.5472338275100251], [77.60484223045509, 0.22400798138475664, 7.704468948736962]], "r_squared_": 0.9838332588829076, "error_": 0.04134907672473485}
{"freq_range": [2.0, 80.0], "freq_res": 1.0, "aperiodic_params_": [0.30073104084947666, 0.7788444025611994], "gaussian_params_": [[9.456500894103248, 0.7369575524520156, 0.9446746251328009], [11.824607045507747, 1.0863921651561996, 1.9638399603621695], [19.106308211419034, 0.40323214086916964, 1.8298579818928116], [55.54796540086405, 0.1490366581509885, 5.999999999999999], [71.64389620259216, 0.24989072321109038, 5.999999999999999]], "peak_params_": [[9.456500894103248, 1.0419051388921161, 1.8893492502656017], [11.824607045507747, 1.1019277774715344, 3.927679920724339], [19.106308211419034, 0.40392337195224304, 3.659715963785623], [55.54796540086405, 0.1569619031820606, 11.999999999999998], [71.64389620259216, 0.2529235592195238, 11.999999999999998]], "r_squared_": 0.9739813690588349, "error_": 0.05628580804862696}
{"freq_range": [2.0, 80.0], "freq_res": 1.0, "aperiodic_params_": [0.5470022454702802, 0.9905666937815695], "gaussian_params_": [[9.365602834883699, 0.5662265411547708, 0.9767545627788651], [11.495760438380637, 1.1325748265108067, 2.0853652575032835], [18.922236648670793, 0.49904176384295335, 1.7339778290252439], [46.996009446907024, 0.11288942787658864, 0.2500720718067555], [55.54796540086405, 0.17650990203873196, 5.999999999999999], [74.23670337146628, 0.31149897481340094, 5.999999999999999]], "peak_params_": [[9.365602834883699, 1.0813219211554856, 1.9535091255577302], [11.495760438380637, 1.2406684692507621, 4.170730515006567], [18.922236648670793, 0.5002865731025041, 3.4679556580504878], [46.996009446907024, 0.17686403252572225, 0.500144143613511], [55.54796540086405, 0.17908148646950894, 11.999999999999998], [74.23670337146628, 0.31281641285411943, 11.999999999999998]], "r_squared_": 0.9759091548322596, "error_": 0.06210650210001847}
{"freq_range": [2.0, 80.0], "freq_res": 1.0, "aperiodic_params_": [0.4608612083917879, 0.9338086854559805], "gaussian_params_": [[9.34226300248784, 0.5247510018765238, 1.1036840368872525], [11.484207258645407, 1.1187102802223292, 2.122896884352679], [19.051674932780298, 0.5036464108415558, 1.7879974605721618], [71.46445574501438, 0.33600112881083993, 5.999999999999999]], "peak_params_": [[9.34226300248784, 1.0642271948384638, 2.207368073774505], [11.484207258645407, 1.2598556469246838, 4.245793768705358], [19.051674932780298, 0.5055592660966396, 3.5759949211443236], [71.46445574501438, 0.3349959426837015, 11.999999999999998]], "r_squared_": 0.9616948002547951, "error_": 0.0799176226375799}
{"freq_range": [2.0, 80.0], "freq_res": 1.0, "aperiodic_params_": [0.4227660648707035, 0.9054114881759489], "gaussian_params_": [[10.484327748242, 1.4800800676059243, 1.7850244714686991], [13.396380761997625, 1.2856890422661738, 0.2500037779885828], [18.679845884860125, 0.46180692901592507, 2.9347432428865305], [70.75116812858776, 0.3057057389073906, 5.999999999999999]], "peak_params_": [[10.484327748242, 1.4324100967557105, 3.5700489429373983], [13.396380761997625, 0.9850597000705149, 0.5000075559771656], [18.679845884860125, 0.4590840562523396, 5.869486485773061], [70.75116812858776, 0.30544295644264463, 11.999999999999998]], "r_squared_": 0.9665695003360217, "error_": 0.07641906682507521}
{"freq_range": [2.0, 80.0], "freq_res": 1.0, "aperiodic_params_": [0.42792946553512623, 0.926322262581182], "gaussian_params_": [[10.272628865915527, 1.6124637626646674, 1.5151102651666202], [12.60812892635803, 1.513653318703989, 0.2813544494533912], [14.665975779678062, 0.40012664134848247, 0.7808716605835561], [19.37054593523184, 0.5101534686218028, 2.2013341741607757], [71.28017664298947, 0.27938164772599766, 5.999999999999999]], "peak_params_": [[10.272628865915527, 1.5866287444749574, 3.0302205303332403], [12.60812892635803, 0.9417110808343315, 0.5627088989067824], [14.665975779678062, 0.44862503752297134, 1.5617433211671121], [19.37054593523184, 0.502977190839316, 4.402668348321551], [71.28017664298947, 0.2790772141798281, 11.999999999999998]], "r_squared_": 0.9727255756337413, "error_": 0.06996183789649653}
{"freq_range": [2.0, 80.0], "freq_res": 1.0, "aperiodic_params_": [0.4101742449158676, 1.010975120783034], "gaussian_params_": [[10.121715701495962, 1.6375299121264204, 1.4323989649908453], [12.577556167026783, 1.7145129705581996, 0.28656962158485233], [14.865025570026912, 0.4651778509154431, 0.9448032062193159], [17.401476130994624, 0.631002563664864, 0.2843133742913972], [19.713131190565758, 0.5302931680993516, 1.683498590089195], [71.38417523777638, 0.2900086769546572, 5.999999999999999]], "peak_params_": [[10.121715701495962, 1.6316295507206326, 2.8647979299816906], [12.577556167026783, 0.8623965247019731, 0.5731392431697047], [14.865025570026912, 0.47594947454994063, 1.8896064124386318], [17.401476130994624, 0.4137745812342838, 0.5686267485827944], [19.713131190565758, 0.522650091071197, 3.36699718017839], [71.38417523777638, 0.28941480586260027, 11.999999999999998]], "r_squared_": 0.9773234159646085, "error_": 0.06605723457230342}
{"freq_range": [2.0, 80.0], "freq_res": 1.0, "aperiodic_params_": [-0.23766245380135825, 0.2436265716693682], "gaussian_params_": [[10.008877926444304, 1.401935193801331, 1.4590075443540873], [17.33469754342006, 0.24574370173660728, 3.3667744871487244], [61.96459002477429, 0.1337889557429931, 5.999999999999999], [72.08015366436031, 0.16690290772577634, 0.5639266689858295]], "peak_params_": [[10.008877926444304, 1.424811645952422, 2.9180150887081746], [17.33469754342006, 0.24454687348890114, 6.733548974297449], [61.96459002477429, 0.1337866258539887, 11.999999999999998], [72.08015366436031, 0.1982589468395467, 1.127853337971659]], "r_squared_": 0.9367139252320146, "error_": 0.06333131945663369}
{"freq_range": [2.0, 80.0], "freq_res": 1.0, "aperiodic_params_": [-0.11589139534529634, 0.21681797812112696], "gaussian_params_": [[9.681547029448366, 1.2280609676468923, 1.061278788345038], [11.993579119936522, 0.6575698561409891, 1.6285095057268493], [19.664933246433257, 0.29995178855375493, 1.3360510298197061], [62.819908555253015, 0.13061585706451936, 5.999999999999999]], "peak_params_": [[9.681547029448366, 1.484831355355184, 2.122557576690076], [11.993579119936522, 0.7705195383662315, 3.2570190114536985], [19.664933246433257, 0.2906695293103212, 2.6721020596394123], [62.819908555253015, 0.13055703344276126, 11.999999999999998]], "r_squared_": 0.9513969186431517, "error_": 0.05357636689109773}
{"freq_range": [2.0, 80.0], "freq_res": 1.0, "aperiodic_params_": [0.12628757342010044, 0.48825425773219916], "gaussian_params_": [[9.562098054255857, 0.822113547767979, 0.9998040690189874], [11.882934681436419, 1.0291457117534024, 1.7830106669045689], [19.276031698632544, 0.27383608001987436, 1.7667971519681496], [61.45203459913936, 0.15040255006378145, 5.999999999619402], [74.54796540086404, 0.15106905666840856, 5.9999999985911465]], "peak_params_": [[9.562098054255857, 1.3361855659176987, 1.9996081380379749], [11.882934681436419, 1.0690439869033852, 3.5660213338091378], [19.276031698632544, 0.2708714247567539, 3.533594303936299], [61.45203459913936, 0.1617806639292283, 11.999999999238804], [74.54796540086404, 0.16239320168279703, 11.999999997182293]], "r_squared_": 0.9667752817249918, "error_": 0.05066154208183427}
{"freq_range": [2.0, 80.0], "freq_res": 1.0, "aperiodic_params_": [0.19909095334175395, 0.5784729501101916], "gaussian_params_": [[10.992182984236159, 1.3323910158634478, 1.985372377228205], [18.741183447170073, 0.2777001724208724, 2.0773699059216004], [68.82435409981454, 0.2570565815305303, 5.999999999999999]], "peak_params_": [[10.992182984236159, 1.332648729106581, 3.97074475445641], [18.741183447170073, 0.2759440789003881, 4.154739811843201], [68.82435409981454, 0.2569464582290306, 11.999999999999998]], "r_squared_": 0.9510580818640006, "error_": 0.07133047518997974}
{"freq_range": [2.0, 80.0], "freq_res": 1.0, "aperiodic_params_": [0.2212715217971406, 0.5698485414354182], "gaussian_params_": [[10.40129160743579, 1.6631601125927096, 1.502876422739017], [12.611818748220447, 1.0828341845501857, 0.2854628319712771], [14.659371914108196, 0.3275717152660726, 1.1541730929572456], [19.921378763294115, 0.4335094356268965, 1.7798026596402283]], "peak_params_": [[10.40129160743579, 1.6050097691977245, 3.005752845478034], [12.611818748220447, 0.9192878247818738, 0.5709256639425542], [14.659371914108196, 0.3384975817942728, 2.308346185914491], [19.921378763294115, 0.43309402256519564, 3.5596053192804566]], "r_squared_": 0.9554185800869759, "error_": 0.08137547229023409}
{"freq_range": [2.0, 80.0], "freq_res": 1.0, "aperiodic_params_": [0.2468866102731737, 0.5808407197687032], "gaussian_params_": [[9.896487148094826, 1.3500108284648336, 1.1948481465147425], [12.059878637742877, 0.6709302486552609, 2.0780794510256726], [19.755507804316334, 0.5106989557768673, 1.83088451386936]], "peak_params_": [[9.896487148094826, 1.7554584588073272, 2.389696293029485], [12.059878637742877, 0.9573526664707118, 4.156158902051345], [19.755507804316334, 0.5066191327939976, 3.66176902773872]], "r_squared_": 0.9744461981026494, "error_": 0.060208807575944594}
{"freq_range": [2.0, 80.0], "freq_res": 1.0, "aperiodic_params_": [-0.5160784857292863, 0.309456687078601], "gaussian_params_": [[10.230380700957086, 1.5175012920647584, 1.4935349461414522], [19.561923539137187, 0.28218056532600194, 1.4002833903197986], [59.44057656513827, 1.0699219333498318, 0.27620407126765245]], "peak_params_": [[10.230380700957086, 1.4995547953911643, 2.9870698922829044], [19.561923539137187, 0.2687039191930589, 2.8005667806395973], [59.44057656513827, 0.2998100268065802, 0.5524081425353049]], "r_squared_": 0.9299178556694663, "error_": 0.07286623190609942}
{"freq_range": [2.0, 80.0], "freq_res": 1.0, "aperiodic_params_": [-0.2285982853466148, 0.11374376724627035], "gaussian_params_": [[9.823233586360661, 1.2805330671507413, 1.083347808059075], [12.335356417801941, 0.6436913863723389, 1.2620715747436082], [19.88625728903109, 0.23661062233243935, 1.1431590310128672], [63.92850258863103, 0.13789784445980705, 5.999999999999999]], "peak_params_": [[9.823233586360661, 1.379786970945755, 2.16669561611815], [12.335356417801941, 0.7914651081588688, 2.5241431494872164], [19.88625728903109, 0.23544230367455396, 2.2863180620257344], [63.92850258863103, 0.13788805429054796, 11.999999999999998]], "r_squared_": 0.936037412402662, "error_": 0.05100595047178148}
{"freq_range": [2.0, 80.0], "freq_res": 1.0, "aperiodic_params_": [-0.34218337746338007, -0.08388789924882784], "gaussian_params_": [[10.072261107208242, 1.1736517008717153, 1.2097618622488522], [12.580380440452707, 0.49453198495206663, 0.7957177159755094]], "peak_params_": [[10.072261107208242, 1.1741342707273366, 2.4195237244977044], [12.580380440452707, 0.49310309024970606, 1.5914354319510189]], "r_squared_": 0.8900052001636728, "error_": 0.05303381745634131}
{"freq_range": [2.0, 80.0], "freq_res": 1.0, "aperiodic_params_": [-0.2834084250252787, 0.056825115625882196], "gaussian_params_": [[10.21313797279399, 1.4932264072418169, 1.2724636730546346], [12.856342566767998, 0.45001429775128143, 0.6423123509263465], [20.061214763629792, 0.23969388203876626, 1.2261154718876073]], "peak_params_": [[10.21313797279399, 1.472448278377355, 2.544927346109269], [12.856342566767998, 0.5745864706671613, 1.284624701852693], [20.061214763629792, 0.23939533967917465, 2.4522309437752146]], "r_squared_": 0.9253252997446771, "error_": 0.060268347233654346}
{"freq_range": [2.0, 80.0], "freq_res": 1.0, "aperiodic_params_": [-1.047074781294253, 0.21457571682498217], "gaussian_params_": [[10.297657869419751, 0.782432081289777, 1.6113009805168896], [45.29820842978157, 0.201472792945607, 0.535971008003475], [55.0564389891823, 0.1482164525314094, 0.25000000026630126], [60.12499814037001, 0.28046209071020084, 0.8821351464316872], [65.21884142056368, 0.10599116776421615, 1.1693306933153336], [73.91691537830944, 0.12370301477234709, 5.999999999999998]], "peak_params_": [[10.297657869419751, 0.7691948192102727, 3.2226019610337793], [45.29820842978157, 0.172582677542356, 1.07194201600695], [55.0564389891823, 0.1453459749689614, 0.5000000005326025], [60.12499814037001, 0.28606253682793525, 1.7642702928633744], [65.21884142056368, 0.1451506568810832, 2.338661386630667], [73.91691537830944, 0.1236911552209985, 11.999999999999996]], "r_squared_": 0.9026837315672882, "error_": 0.0446228694609803}
{"freq_range": [2.0, 80.0], "freq_res": 1.0, "aperiodic_params_": [-0.22004687663116573, 0.9149437756347858], "gaussian_params_": [[9.966773312693318, 1.5442962449260376, 1.4503283773021631], [18.571310771773863, 0.3408920700849623, 1.666577675115973], [65.0959308017281, 0.31496368272782854, 5.999999999999999]], "peak_params_": [[9.966773312693318, 1.543891645320476, 2.9006567546043263], [18.571310771773863, 0.3297988754077563, 3.333155350231946], [65.0959308017281, 0.3149234280479809, 11.999999999999998]], "r_squared_": 0.9426236479835431, "error_": 0.09496438696814227}
{"freq_range": [2.0, 80.0], "freq_res": 1.0, "aperiodic_params_": [0.018661187277777398, 0.9883863605826063], "gaussian_params_": [[9.935587007711142, 1.4583232788106866, 1.3285269647176343], [14.452034599135944, 0.23963219761589857, 3.6988945274804177], [19.465590008396816, 0.3935407840379875, 0.8034981376213529], [70.19186160345454, 0.3272882602359647, 5.999999999999999]], "peak_params_": [[9.935587007711142, 1.572746459620713, 2.6570539294352686], [14.452034599135944, 0.25138428739616636, 7.397789054960835], [19.465590008396816, 0.445249154838149, 1.6069962752427058], [70.19186160345454, 0.32712097290348696, 11.999999999999998]], "r_squared_": 0.9567653515114898, "error_": 0.08823142609732275}
{"freq_range": [2.0, 80.0], "freq_res": 1.0, "aperiodic_params_": [-0.05974812682027311, 1.0138478459107807], "gaussian_params_": [[9.987862728477786, 1.633516066760662, 1.5535825377822308], [17.736244483011188, 0.41485543857964796, 2.491183590702397], [65.0959308017281, 0.3423771301090037, 5.999999999999999]], "peak_params_": [[9.987862728477786, 1.636806389182331, 3.1071650755644615], [17.736244483011188, 0.4125394924551775, 4.982367181404794], [65.0959308017281, 0.3423333717885513, 11.999999999999998]], "r_squared_": 0.9471025967748575, "error_": 0.10266668446249737}
