{"freq_range": [2.0, 80.0], "freq_res": 1.0, "aperiodic_params_": [-0.06409254180569329, 0.7862249178184897], "gaussian_params_": [[6.643125442452971, 0.4328545587772817, 0.31117292042532496], [8.92648481582526, 1.1620325580180793, 0.7733874935237811], [11.243300774796756, 0.655862527358893, 1.9889672471708517], [17.92242395943977, 0.4011397354007012, 2.522739069796053], [24.160910481114662, 0.2702160724295482, 1.6543213296708041], [27.338653475416756, 0.40208617118698914, 0.3090745153246517], [29.65990655478749, 0.39093507041585157, 0.2681187531000606], [40.7992381519039, 0.23262981815112993, 0.46253774156892663], [43.75696695743055, 0.288553082050016, 0.28749051868279435], [46.20453498826581, 0.20499321596808576, 0.6287829331347966], [56.02200692072942, 0.11571622144882701, 1.4953193319105296], [63.50565254835892, 0.7922881149826616, 0.31881645117656965], [67.49907645856656, 0.7747167880040469, 0.292087954995193], [71.23474810941782, 0.31452851495420836, 0.7075570953014003], [75.61579119319751, 0.23169128921294196, 0.679457806457542], [77.52411526374064, 0.8269452553169638, 0.2885364514567775]], "peak_params_": [[6.643125442452971, 0.34387160501577774, 0.6223458408506499], [8.92648481582526, 1.5047662980864949, 1.5467749870475622], [11.243300774796756, 0.6922081191692976, 3.9779344943417034], [17.92242395943977, 0.4032590962108338, 5.045478139592106], [24.160910481114662, 0.29097041706380344, 3.3086426593416083], [27.338653475416756, 0.2831940576007832, 0.6181490306493034], [29.65990655478749, 0.175411189235108, 0.5362375062001212], [40.7992381519039, 0.21171715735484242, 0.9250754831378533], [43.75696695743055, 0.2022965655865101, 0.5749810373655887], [46.20453498826581, 0.1944297725422861, 1.2575658662695932], [56.02200692072942, 0.11570369028539873, 2.990638663821059], [63.50565254835892, 0.23812378921234956, 0.6376329023531393], [67.49907645856656, 0.17996330270386074, 0.584175909990386], [71.23474810941782, 0.29768568636342896, 1.4151141906028006], [75.61579119319751, 0.1974597620932752, 1.358915612915084], [77.52411526374064, 0.2127134052823194, 0.577072902913555]], "r_squared_": 0.9913985626686546, "error_": 0.027927111776730375}
{"freq_range": [2.0, 80.0], "freq_res": 1.0, "aperiodic_params_": [0.07438808324090061, 0.8517417005209711], "gaussian_params_": [[8.961446274701354, 1.0770339452649358, 0.839665734625226], [11.023107318016075, 0.4016571800862497, 2.0065521409549545], [18.799513125762818, 0.2842500629995343, 5.513594609056015], [46.01960914195246, 0.4116911711417838, 0.7349981071538351], [57.07001403465788, 0.44295104354103987, 0.6036944897043045], [60.29518954735812, 0.7694186491783963, 0.8018215333179226], [70.48298373729357, 1.9470506750541448, 0.30054872661171805], [74.61004437932836, 0.8319512030184794, 0.9983508592628051], [78.2331576276222, 0.5613523288783882, 1.2413078057116884]], "peak_params_": [[8.961446274701354, 1.3760865896521481, 1.679331469250452], [11.023107318016075, 0.5626764648841522, 4.013104281909909], [18.799513125762818, 0.2842108206098404, 11.02718921811203], [46.01960914195246, 0.41154615576886844, 1.4699962143076701], [57.07001403465788, 0.44014758176711566, 1.207388979408609], [60.29518954735812, 0.7190085335255413, 1.6036430666358452], [70.48298373729357, 0.5353242354121129, 0.6010974532234361], [74.61004437932836, 0.7897301534009197, 1.9967017185256102], [78.2331576276222, 0.5541453998262236, 2.482615611423377]], "r_squared_": 0.9478001645040044, "error_": 0.07855381934719323}
{"freq_range": [2.0, 80.0], "freq_res": 1.0, "aperiodic_params_": [-0.11793245556607938, 0.7666577670606658], "gaussian_params_": [[9.220867666114803, 1.1776718363482164, 1.2439444887640014], [16.699694409080557, 0.4174449954163424, 5.632430092370133], [60.23492904963435, 0.7274118135393599, 0.7122381780801075], [67.17547131510283, 0.7709797952609589, 1.0613021954212938], [70.46680133521645, 3.901767387775909, 0.2500148705463394], [73.89325673730966, 1.083782621754346, 0.9471772332668225]], "peak_params_": [[9.220867666114803, 1.3232380148569653, 2.487888977528003], [16.699694409080557, 0.4168520795232211, 11.264860184740266], [60.23492904963435, 0.6888982061739087, 1.424476356160215], [67.17547131510283, 0.7605137512791426, 2.1226043908425876], [70.46680133521645, 0.7053424731865978, 0.5000297410926788], [73.89325673730966, 1.0769221752978646, 1.894354466533645]], "r_squared_": 0.8709666614430976, "error_": 0.12962726491929832}
{"freq_range": [2.0, 80.0], "freq_res": 1.0, "aperiodic_params_": [0.07948229397758816, 0.9525996790093458], "gaussian_params_": [[8.927970444990994, 0.8062311007954485, 0.6072573850211083], [9.904005610357865, 0.8317469152997014, 2.1393556819062], [17.332744813874125, 0.5322723058621328, 3.630277731181964], [26.48304867168286, 0.2859665788636227, 2.707393294358962], [70.98101328454848, 0.3452026976181357, 2.4676633161278523]], "peak_params_": [[8.927970444990994, 1.5994880663277882, 1.2145147700422165], [9.904005610357865, 1.0698374005162568, 4.2787113638124], [17.332744813874125, 0.5340571378978861, 7.260555462363928], [26.48304867168286, 0.31223819825153076, 5.414786588717924], [70.98101328454848, 0.3451924796244208, 4.935326632255705]], "r_squared_": 0.9805254360840947, "error_": 0.061652299546771656}
{"freq_range": [2.0, 80.0], "freq_res": 1.0, "aperiodic_params_": [0.5698615135486865, 1.1044083225074868], "gaussian_params_": [[8.935886694437325, 0.964959475886525, 0.7638671031728875], [10.635962905717788, 0.37911316173566995, 1.6688913737920124], [16.6870343744483, 0.27422198962984257, 4.441478950310115], [49.34594944224851, 0.3149501007415532, 1.6953044986279238], [53.529672788484355, 1.0319456534515121, 0.27984070520350124], [56.481920565442564, 1.1769995563509956, 0.2824581864056172], [63.89521054784384, 0.6062286786846331, 0.6039248526390283], [69.39084204333571, 0.5483577156086668, 0.5906881680053124], [70.5752032347905, 2.1208352708781035, 0.2835906517059862], [77.54796540086404, 0.5733378621081809, 3.054732929856768]], "peak_params_": [[8.935886694437325, 1.2573731503267345, 1.527734206345775], [10.635962905717788, 0.5160628693193007, 3.3377827475840247], [16.6870343744483, 0.27380575552898534, 8.88295790062023], [49.34594944224851, 0.30846034671610445, 3.3906089972558475], [53.529672788484355, 0.25861938766510706, 0.5596814104070025], [56.481920565442564, 0.2747166758732318, 0.5649163728112344], [63.89521054784384, 0.5972018225177674, 1.2078497052780566], [69.39084204333571, 0.45198075606504107, 1.1813763360106249], [70.5752032347905, 0.761727667370471, 0.5671813034119724], [77.54796540086404, 0.5670947353296065, 6.109465859713536]], "r_squared_": 0.95617703834257, "error_": 0.07215112732616866}
{"freq_range": [2.0, 80.0], "freq_res": 1.0, "aperiodic_params_": [0.32012899445836396, 0.888383766547592], "gaussian_params_": [[9.343109725827244, 1.1157350797988013, 1.259392281759214], [50.11502723972522, 0.6127569709449676, 1.0398568704564224], [56.64186438359422, 0.7090275793292306, 0.6899804728501027], [63.916496792190465, 0.8506712344648985, 0.6125049166938847], [70.47469981119498, 0.6855687493049166, 1.5765027021930742], [75.02562551034092, 1.0598660720517041, 0.7209926598215357]], "peak_params_": [[9.343109725827244, 1.07508688567393, 2.518784563518428], [50.11502723972522, 0.6090194412175511, 2.0797137409128448], [56.64186438359422, 0.6196699712733702, 1.3799609457002053], [63.916496792190465, 0.8429515913611618, 1.2250098333877695], [70.47469981119498, 0.6551834966424367, 3.1530054043861484], [75.02562551034092, 1.0703358961656486, 1.4419853196430714]], "r_squared_": 0.7582604302454584, "error_": 0.15283490209357578}
{"freq_range": [2.0, 80.0], "freq_res": 1.0, "aperiodic_params_": [-0.01803488502162979, 0.6838721133881519], "gaussian_params_": [[9.376616883663422, 1.1377469789533936, 1.4570731320475465], [34.47992521365197, 2.494896048707719, 0.28759317961129854], [46.42384252355652, 0.7193915737560607, 0.8205592207029422], [56.097504848450725, 0.7033084890861845, 0.9060687518645858], [60.16751046636818, 1.0216567581086193, 0.8423761203550275], [64.3793967222726, 0.5166875401767659, 1.8538677360394649], [67.49320562121461, 0.9515147673366445, 0.8073589453752337], [70.46701763617618, 3.1558529842118146, 0.3016501287944598], [73.80932105951885, 1.3338976464067007, 1.2113794308129038], [77.77726465292734, 0.9367461067691144, 0.7644885626225132]], "peak_params_": [[9.376616883663422, 1.1003687231689747, 2.914146264095093], [34.47992521365197, 0.6199354129796867, 0.5751863592225971], [46.42384252355652, 0.6295496885538577, 1.6411184414058844], [56.097504848450725, 0.6992717654420274, 1.8121375037291716], [60.16751046636818, 1.0334493085970222, 1.684752240710055], [64.3793967222726, 0.5060946462895347, 3.7077354720789297], [67.49320562121461, 0.9797975169994695, 1.6147178907504673], [70.46701763617618, 0.9743643280035715, 0.6033002575889196], [73.80932105951885, 1.3174801473211766, 2.4227588616258076], [77.77726465292734, 0.9011800315677245, 1.5289771252450264]], "r_squared_": 0.7554464183760816, "error_": 0.15994573412094815}
{"freq_range": [2.0, 80.0], "freq_res": 1.0, "aperiodic_params_": [0.0836401568932672, 0.8462830690198598], "gaussian_params_": [[8.917919982851195, 0.8212552545010671, 0.5875807353738864], [9.932779743243852, 0.6361334038041003, 1.8519951088176432], [18.16250438670689, 0.3208540703835482, 5.8609200090206235], [60.18439882362407, 0.8952328983336171, 0.8047387572080668], [67.74369796439765, 0.6717073774803761, 1.6722388598991231], [73.58283673295635, 0.8789657767546821, 1.237116370192718], [78.16763067332332, 0.7258821855264048, 0.8002695826678661]], "peak_params_": [[8.917919982851195, 1.4681740756926418, 1.1751614707477729], [9.932779743243852, 0.9080419328962563, 3.7039902176352864], [18.16250438670689, 0.32077899101420404, 11.721840018041247], [60.18439882362407, 0.8720511199121751, 1.6094775144161335], [67.74369796439765, 0.6638971283171796, 3.3444777197982463], [73.58283673295635, 0.831001424663338, 2.474232740385436], [78.16763067332332, 0.7116293275983349, 1.6005391653357322]], "r_squared_": 0.9285773928252005, "error_": 0.0961242830096981}
{"freq_range": [2.0, 80.0], "freq_res": 1.0, "aperiodic_params_": [0.386320971611614, 1.1048340112288522], "gaussian_params_": [[9.077118776655956, 1.4368557141232081, 1.0456414979686992], [11.484589934296759, 1.2882440429786877, 0.3089884039883392], [13.393479252527355, 0.4888862828551226, 1.3897645540498538], [17.73067550266203, 0.49471442738943844, 1.6844939518133248], [25.289885622714102, 0.2695071304723568, 4.118785752477558], [60.17934852993738, 0.5333565297880453, 0.593526720029487], [68.02491882104307, 0.6409086182131476, 1.0523396220733487], [71.29924123226577, 0.8316932482341637, 0.5010296285748501], [73.36128445720081, 0.5283512872162884, 0.7881269825080018], [78.09303340857745, 0.45198414411852667, 0.8425091277060666]], "peak_params_": [[9.077118776655956, 1.4363661852944942, 2.0912829959373984], [11.484589934296759, 0.753295934784775, 0.6179768079766784], [13.393479252527355, 0.4836789997764902, 2.7795291080997075], [17.73067550266203, 0.5467207410965492, 3.3689879036266497], [25.289885622714102, 0.26888516251575334, 8.237571504955117], [60.17934852993738, 0.5095538065724607, 1.187053440058974], [68.02491882104307, 0.640728959828905, 2.1046792441466975], [71.29924123226577, 0.7135534890562791, 1.0020592571497002], [73.36128445720081, 0.4782806780884401, 1.5762539650160037], [78.09303340857745, 0.4492369072146307, 1.6850182554121331]], "r_squared_": 0.9798927077087508, "error_": 0.05788262870852742}
{"freq_range": [2.0, 80.0], "freq_res": 1.0, "aperiodic_params_": [0.21954899838603392, 1.0437668179398172], "gaussian_params_": [[9.13648938107697, 1.2092867156432014, 1.2781509251162093], [14.875078579689436, 0.6075203301656108, 4.303964227818927], [25.4088560064029, 0.26424372013736636, 4.7078048326191055], [68.0363089494313, 0.5373070507984045, 1.0918892607471309], [71.3000685169309, 0.7209276222833856, 1.0364363686471747], [78.03185679577713, 0.41189453919988234, 0.9783629909659662]], "peak_params_": [[9.13648938107697, 1.4423199979859962, 2.5563018502324186], [14.875078579689436, 0.6302319146612096, 8.607928455637854], [25.4088560064029, 0.3014302432778494, 9.415609665238211], [68.0363089494313, 0.5415433206243236, 2.1837785214942618], [71.3000685169309, 0.7048404701976265, 2.0728727372943494], [78.03185679577713, 0.4116762441581947, 1.9567259819319325]], "r_squared_": 0.9705616738689966, "error_": 0.07789221994288988}
{"freq_range": [2.0, 80.0], "freq_res": 1.0, "aperiodic_params_": [0.21643968356114396, 1.0059464983171449], "gaussian_params_": [[9.213129442795578, 1.177002615750234, 1.2667003597085704], [16.537069371669922, 0.548289261672922, 5.891636698074481], [56.38805996954029, 0.8176988693980762, 0.2938228950904359], [68.52104094566369, 0.3919158238809474, 1.9598600369477241], [70.99023441556707, 0.639352275188914, 0.7966843360104786], [78.67722610183095, 0.3861161457985853, 1.9882373339700214]], "peak_params_": [[9.213129442795578, 1.4023586531155947, 2.533400719417141], [16.537069371669922, 0.5465993359164301, 11.783273396148962], [56.38805996954029, 0.3418368622553325, 0.5876457901808718], [68.52104094566369, 0.40860985791521665, 3.9197200738954483], [70.99023441556707, 0.8156369634676247, 1.5933686720209572], [78.67722610183095, 0.38106175093288286, 3.976474667940043]], "r_squared_": 0.9605113662836705, "error_": 0.08735391177273995}
{"freq_range": [2.0, 80.0], "freq_res": 1.0, "aperiodic_params_": [0.23471551259019985, 0.954553063203015], "gaussian_params_": [[9.171217135896335, 1.1759176502040276, 1.1772807717257956], [15.790350406132612, 0.5029019970545066, 5.095795946564977], [48.99602802410691, 0.4358789901186944, 0.8875566951551349], [56.401757807946574, 1.5171509431766452, 0.25000249916415845], [66.45203459913596, 0.29834002993486974, 2.543496643319504], [70.45912886203187, 0.8243413402298497, 1.1330915772801657], [77.42717655572157, 0.6256350517770827, 1.3254222279184178], [79.9999999995006, 0.5801114319482951, 0.2500004741782344]], "peak_params_": [[9.171217135896335, 1.3705151818916752, 2.354561543451591], [15.790350406132612, 0.5024766198078284, 10.191591893129955], [48.99602802410691, 0.43587462573399716, 1.7751133903102698], [56.401757807946574, 0.41717033768572653, 0.5000049983283169], [66.45203459913596, 0.2940228789929744, 5.086993286639008], [70.45912886203187, 0.8721401878572899, 2.2661831545603315], [77.42717655572157, 0.5940259038963093, 2.6508444558368356], [79.9999999995006, 0.6751960190645319, 0.5000009483564688]], "r_squared_": 0.9474537844969312, "error_": 0.09273492226036391}
{"freq_range": [2.0, 80.0], "freq_res": 1.0, "aperiodic_params_": [0.48766149644029794, 0.9244341300033474], "gaussian_params_": [[9.450244942832823, 1.042990462684098, 1.3908296649546918], [49.29055868581293, 0.7161656695443248, 1.1550687645714721], [56.45559856379421, 3.1725900863290257, 0.2572336950815405], [64.14814803053153, 0.7162911869698912, 1.5819625423324297], [69.54610404303934, 1.187288166637007, 0.7599817163629253], [71.44077479202629, 3.41961553786295, 0.2739072000367611]], "peak_params_": [[9.450244942832823, 0.9897463485009199, 2.7816593299093837], [49.29055868581293, 0.6938616389611497, 2.3101375291429442], [56.45559856379421, 0.6610473881310206, 0.514467390163081], [64.14814803053153, 0.7131571281571228, 3.1639250846648594], [69.54610404303934, 0.9941113430982259, 1.5199634327258507], [71.44077479202629, 1.1273639517476461, 0.5478144000735222]], "r_squared_": 0.7128951398629065, "error_": 0.18769947610851617}
{"freq_range": [2.0, 80.0], "freq_res": 1.0, "aperiodic_params_": [0.23415359612121073, 0.7045187936973156], "gaussian_params_": [[9.370226226065926, 1.0297894389941185, 1.325856213603101], [35.22818116066689, 0.4384153652291069, 1.089293636069594], [49.36934034608947, 0.9609096149182048, 1.3931791600433816], [56.35245932178546, 1.1032030109318185, 0.4788143051039512], [63.885808499394514, 1.2996409554058939, 1.0144040232404277], [69.51052656439374, 4.3684397790375, 0.2971771363195843], [71.41443042807525, 3.3715879819857886, 0.28868210379578424]], "peak_params_": [[9.370226226065926, 0.990414337373158, 2.651712427206202], [35.22818116066689, 0.428901217841661, 2.178587272139188], [49.36934034608947, 0.9277290510455619, 2.786358320086763], [56.35245932178546, 0.8413930405840794, 0.9576286102079024], [63.885808499394514, 1.2914324534245647, 2.0288080464808553], [69.51052656439374, 1.125237379888385, 0.5943542726391686], [71.41443042807525, 1.203135251994923, 0.5773642075915685]], "r_squared_": 0.5973011036523393, "error_": 0.21025144356572897}
{"freq_range": [2.0, 80.0], "freq_res": 1.0, "aperiodic_params_": [0.40404324873076647, 0.895322448536077], "gaussian_params_": [[9.295158894692484, 1.0665895118186397, 1.2054483709174955], [50.38472284478894, 0.813356015957579, 1.129132991850616], [52.52411015023789, 0.6944580472197031, 0.35383161228795557], [53.678948336228764, 1.0420508053305666, 0.25439235794800913], [56.50115209037689, 0.7279531588640825, 1.1436867703160325], [59.75447277093811, 0.63322116528507, 0.6607292281015964], [64.2774970035094, 0.9643877468183534, 0.7056014244506362], [67.80623776268432, 0.8718623119077971, 0.9746052099451269], [69.76406726961623, 1.1328924982279684, 0.25149498634382017], [72.36188884577409, 0.8750870881309346, 0.5638931610756985], [75.41275980241849, 1.3134054167909486, 0.5614092342861374]], "peak_params_": [[9.295158894692484, 1.0350910948734517, 2.410896741834991], [50.38472284478894, 0.7674877712540942, 2.258265983701232], [52.52411015023789, 0.3730301447732989, 0.7076632245759111], [53.678948336228764, 0.5414920324898933, 0.5087847158960183], [56.50115209037689, 0.6620051437773967, 2.287373540632065], [59.75447277093811, 0.597734150910265, 1.3214584562031928], [64.2774970035094, 0.8930441568608609, 1.4112028489012725], [67.80623776268432, 0.8548017967095262, 1.9492104198902538], [69.76406726961623, 0.7989546289946352, 0.5029899726876403], [72.36188884577409, 0.7123054003714046, 1.127786322151397], [75.41275980241849, 1.002366655494983, 1.1228184685722749]], "r_squared_": 0.7236473583218651, "error_": 0.13169816090776812}
{"freq_range": [2.0, 80.0], "freq_res": 1.0, "aperiodic_params_": [0.04259344970315943, 0.7710378388470364], "gaussian_params_": [[9.042718273857622, 1.0947084722044529, 0.7981025372041093], [13.547965400864056, 0.3059035221686163, 5.107511347423455], [39.4873207612342, 1.533998334607331, 0.28877789809252713], [44.170861457983136, 0.5323241537533856, 0.6031086926756211], [53.50058217154776, 1.6064858933146116, 0.30098698346071606], [56.023836339704765, 0.5395023771060674, 0.5202827914043346], [60.528616086055386, 1.7723662014035624, 0.3032433537806733], [64.52785243940332, 1.9558720582578286, 0.30969895623669574], [68.56043973646635, 0.3786765858768596, 2.1244346232601807], [71.53483177607198, 1.9853440849401824, 0.30066020225117474], [74.57740822680874, 2.5055070113139637, 0.32100010932151785], [76.46706310539146, 3.185372131310787, 0.31292265293899435]], "peak_params_": [[9.042718273857622, 1.2989244983211967, 1.5962050744082186], [13.547965400864056, 0.304707808160941, 10.21502269484691], [39.4873207612342, 0.36935603285348695, 0.5775557961850543], [44.170861457983136, 0.5113850465794891, 1.2062173853512421], [53.50058217154776, 0.40581988518220413, 0.6019739669214321], [56.023836339704765, 0.5389364920216944, 1.0405655828086693], [60.528616086055386, 0.5301428595826888, 0.6064867075613466], [64.52785243940332, 0.7048191039407748, 0.6193979124733915], [68.56043973646635, 0.3706570586163136, 4.2488692465203615], [71.53483177607198, 0.7019706786479487, 0.6013204045023495], [74.57740822680874, 1.0571795581995869, 0.6420002186430357], [76.46706310539146, 1.0466383579338683, 0.6258453058779887]], "r_squared_": 0.9053391613219535, "error_": 0.08451337889992673}
{"freq_range": [2.0, 80.0], "freq_res": 1.0, "aperiodic_params_": [-0.028133966467221147, 0.6780669059797118], "gaussian_params_": [[9.092116171473029, 1.1056532935815473, 0.8638380509263053], [13.547965400864056, 0.34399104903997263, 4.988392673703343], [30.260658285460448, 0.8402444648980462, 0.9190710598161649], [35.540913744349844, 1.87108435596819, 0.2945830380022759], [40.51907632580191, 2.153131991191151, 0.2744891537395067], [48.38465077137111, 1.6608151688861665, 0.28270008548171105], [53.664268333042834, 0.5660710221457264, 0.6633791787399285], [60.27327296716751, 1.421337345801953, 0.8613354363649331], [64.48240027912337, 2.0725978416881055, 0.2915387611318969], [67.48726142693823, 1.1518112141963301, 1.4341459296351178], [71.2138343693723, 1.1984548654442018, 0.718532521827324], [73.55447429028446, 1.028303571266039, 0.9734890486197568], [77.53596097148889, 2.462449147675033, 0.31853988831547425], [78.6559300204506, 2.531537706700415, 0.2500002465647137]], "peak_params_": [[9.092116171473029, 1.3263980824092867, 1.7276761018526106], [13.547965400864056, 0.34258171271612126, 9.976785347406686], [30.260658285460448, 0.8086172722040559, 1.8381421196323298], [35.540913744349844, 0.5555453630195896, 0.5891660760045518], [40.51907632580191, 0.4639643816612711, 0.5489783074790134], [48.38465077137111, 0.6581311063779269, 0.5654001709634221], [53.664268333042834, 0.4980270566907632, 1.326758357479857], [60.27327296716751, 1.351574488805031, 1.7226708727298663], [64.48240027912337, 0.5872343207252906, 0.5830775222637938], [67.48726142693823, 1.0872137460973177, 2.8682918592702356], [71.2138343693723, 1.2367860780011188, 1.437065043654648], [73.55447429028446, 0.9267503317066765, 1.9469780972395136], [77.53596097148889, 0.9332477270277757, 0.6370797766309485], [78.6559300204506, 0.9819848842916886, 0.5000004931294274]], "r_squared_": 0.90207529414026, "error_": 0.09815505069023857}
{"freq_range": [2.0, 80.0], "freq_res": 1.0, "aperiodic_params_": [0.2478435569001687, 0.9445784021508538], "gaussian_params_": [[9.061722915153835, 1.3382678505747707, 0.9101948605253487], [11.476065371534867, 1.6935941808230732, 0.2745517401026845], [13.209504112902424, 0.1523682925660212, 0.9885290755191016], [18.039661622002146, 0.4058002926830064, 5.999999999999999], [48.432200359416306, 1.7331386895553154, 0.25001141183567616], [60.07967353521654, 0.7460595684553726, 0.6995760823338413], [67.89937535287636, 0.9247860588762857, 1.2338144190992375], [71.45276742539707, 3.5482921004824144, 0.2754583451334953], [73.53803550972843, 0.6506654382013259, 0.8420438347285896], [77.85228696902894, 0.6433223397578648, 0.8183700198116296]], "peak_params_": [[9.061722915153835, 1.4656532814912868, 1.8203897210506974], [11.476065371534867, 0.7316720916829786, 0.549103480205369], [13.209504112902424, 0.43427654714482106, 1.9770581510382033], [18.039661622002146, 0.4057926383326207, 11.999999999999998], [48.432200359416306, 0.3889506795132869, 0.5000228236713523], [60.07967353521654, 0.741236824837763, 1.3991521646676826], [67.89937535287636, 0.9217156349653844, 2.467628838198475], [71.45276742539707, 0.9653278357456204, 0.5509166902669906], [73.53803550972843, 0.5597710827114425, 1.6840876694571791], [77.85228696902894, 0.6329283404722538, 1.6367400396232592]], "r_squared_": 0.9377825062819621, "error_": 0.09009808683278889}
{"freq_range": [2.0, 80.0], "freq_res": 1.0, "aperiodic_params_": [0.20497127620414707, 0.9896721741400992], "gaussian_params_": [[9.173044897094252, 1.1869361879665488, 1.2370414419554494], [16.283416122942036, 0.5945752830563046, 5.77350598634333], [30.1875737210956, 0.3129252923139408, 0.6173423604944454], [68.15412321476713, 0.6279788760098133, 1.090420971596221], [71.35275581428813, 0.7425620207811627, 0.9278439495001716], [77.70017559845975, 0.5500136050333965, 0.824796921132523]], "peak_params_": [[9.173044897094252, 1.4436851889809863, 2.474082883910899], [16.283416122942036, 0.5938596180015058, 11.54701197268666], [30.1875737210956, 0.3341726065908518, 1.2346847209888907], [68.15412321476713, 0.6228221384440856, 2.180841943192442], [71.35275581428813, 0.7116265432888685, 1.8556878990003431], [77.70017559845975, 0.5148482332416189, 1.649593842265046]], "r_squared_": 0.9645349242948907, "error_": 0.08392372022524298}
{"freq_range": [2.0, 80.0], "freq_res": 1.0, "aperiodic_params_": [0.2535162883367845, 1.002028896443292], "gaussian_params_": [[9.182299779320347, 1.1948545541990734, 1.2175203828392458], [16.15265977891916, 0.5704460865315121, 5.424982096263792], [69.83314220535837, 0.6750462553262591, 2.0713956011882586], [77.93045229347362, 0.5059912257850679, 1.495849985898103]], "peak_params_": [[9.182299779320347, 1.4207214110273096, 2.4350407656784916], [16.15265977891916, 0.5702204578430021, 10.849964192527583], [69.83314220535837, 0.6728600703675066, 4.142791202376517], [77.93045229347362, 0.50572896465643, 2.991699971796206]], "r_squared_": 0.9412048582816873, "error_": 0.10951839942649734}
{"freq_range": [2.0, 80.0], "freq_res": 1.0, "aperiodic_params_": [0.13721488175067467, 0.8360218876808254], "gaussian_params_": [[9.141948135361666, 1.1832125955685338, 1.1115229399354705], [15.147662276804969, 0.5326322231314896, 4.737678325650036], [48.91016906389726, 0.6007136923186895, 0.8112608113599091], [56.38463886376887, 1.751819169894928, 0.2500000000000001], [69.26849412099321, 0.8293289335735844, 2.4801466949519457], [78.2336419455067, 0.747921928561025, 2.0944192149231995]], "peak_params_": [[9.141948135361666, 1.403110616907197, 2.223045879870941], [15.147662276804969, 0.5323746810741795, 9.475356651300071], [48.91016906389726, 0.5970422404905765, 1.6225216227198183], [56.38463886376887, 0.5363755404261474, 0.5000000000000002], [69.26849412099321, 0.824528425516324, 4.9602933899038915], [78.2336419455067, 0.744970483839874, 4.188838429846399]], "r_squared_": 0.8829187818142964, "error_": 0.12475025613893508}
{"freq_range": [2.0, 80.0], "freq_res": 1.0, "aperiodic_params_": [0.6340647875753231, 0.965240423320754], "gaussian_params_": [[9.514778111732332, 0.9953217637443761, 1.445692740177195], [49.06505796401509, 0.8863749376544104, 0.908081663384188], [56.433130294005856, 2.8198144640746348, 0.2500008322792075], [64.71386764269515, 0.5630775082483837, 3.318812592373528], [70.15844991337211, 1.0746875003141225, 1.4463451581650364], [77.00338024016554, 1.0781420438966902, 1.5957973230699538], [79.9999991620624, 0.8982075159338314, 0.25007796764374196]], "peak_params_": [[9.514778111732332, 0.9408101639230791, 2.89138548035439], [49.06505796401509, 0.8841107082357563, 1.816163326768376], [56.433130294005856, 0.6466105445507568, 0.500001664558415], [64.71386764269515, 0.5628470201927793, 6.637625184747056], [70.15844991337211, 1.2267005729151934, 2.892690316330073], [77.00338024016554, 1.0787497034392743, 3.1915946461399076], [79.9999991620624, 1.0831354666621409, 0.5001559352874839]], "r_squared_": 0.8255123055846841, "error_": 0.14414141771913117}
{"freq_range": [2.0, 80.0], "freq_res": 1.0, "aperiodic_params_": [0.05328001413969587, 0.6818539680239755], "gaussian_params_": [[9.58389684228105, 1.035090973358152, 1.7945860371761166], [51.04874693523014, 0.6697388367258574, 1.032110550659041], [54.243907540173005, 0.888987827122646, 0.8788515813173321], [57.53701589924459, 4.877138944363854, 0.2630884652624359], [60.418042075428865, 3.4533385329389517, 0.2506597918087525], [65.20513813932597, 0.8851304965756904, 1.294516327944391], [67.85871902795287, 1.1475215138087018, 0.9235571916731695], [72.94154428186616, 0.6675673735672139, 1.118619812990053], [75.58163007492064, 3.4253224097596613, 0.25000540774610924], [78.91800659649866, 1.0265562438379159, 1.163039494256397]], "peak_params_": [[9.58389684228105, 1.0076374590041328, 3.5891720743522333], [51.04874693523014, 0.669970561373664, 2.064221101318082], [54.243907540173005, 0.8666338035919157, 1.7577031626346642], [57.53701589924459, 1.036859804756833, 0.5261769305248718], [60.418042075428865, 0.8597927070188561, 0.501319583617505], [65.20513813932597, 0.8836198489536135, 2.589032655888782], [67.85871902795287, 1.2202757823499761, 1.847114383346339], [72.94154428186616, 0.6666591762160947, 2.237239625980106], [75.58163007492064, 0.9044970419227849, 0.5000108154922185], [78.91800659649866, 1.0240086302538907, 2.326078988512794]], "r_squared_": 0.8203820722606613, "error_": 0.13157294157741037}
{"freq_range": [2.0, 80.0], "freq_res": 1.0, "aperiodic_params_": [0.28241864464360644, 0.8475833473686697], "gaussian_params_": [[9.48091031195654, 1.00898061707957, 1.6078492178091948], [53.844819898654876, 0.7886728687920982, 4.272170240873163], [64.52862683086573, 1.9360379341177965, 0.2795140370727192], [67.24512029261399, 0.7512426708849811, 1.5735986410516023], [72.36199576253767, 1.8402649894580505, 0.2501303465954727], [78.54796540086404, 0.7592885367159077, 3.5136960697630673]], "peak_params_": [[9.48091031195654, 0.9648425423181961, 3.2156984356183895], [53.844819898654876, 0.7881527547166078, 8.544340481746326], [64.52862683086573, 0.7650688733283172, 0.5590280741454384], [67.24512029261399, 0.7524956737516467, 3.1471972821032046], [72.36199576253767, 0.7874231230393235, 0.5002606931909453], [78.54796540086404, 0.7530311287413181, 7.0273921395261345]], "r_squared_": 0.7820849873428658, "error_": 0.15336242451583804}
{"freq_range": [2.0, 80.0], "freq_res": 1.0, "aperiodic_params_": [-0.4359711142996062, 0.2761104257275289], "gaussian_params_": [[8.602397940868803, 1.9912718277197132, 0.2824049957016457], [9.773316151534035, 0.6077827931561471, 1.6252580476238334], [18.286816831012402, 0.16916558917260063, 4.543281536576456], [53.41840719513785, 0.9484842134086763, 0.25014124072846555], [55.713347155071105, 0.46088694404136277, 0.5531871132396268], [65.79334802010378, 0.32080884569490575, 0.9785708858867527], [76.24488909268138, 0.3379362779909076, 0.7461218880303395]], "peak_params_": [[8.602397940868803, 1.3027642051234307, 0.5648099914032914], [9.773316151534035, 0.6339639166004998, 3.250516095247667], [18.286816831012402, 0.1688304900450448, 9.086563073152911], [53.41840719513785, 0.23414518789551308, 0.5002824814569311], [55.713347155071105, 0.4029833790032238, 1.1063742264792535], [65.79334802010378, 0.31373463546958125, 1.9571417717735053], [76.24488909268138, 0.32021559433899116, 1.492243776060679]], "r_squared_": 0.8623809540515608, "error_": 0.06293753625909483}
{"freq_range": [2.0, 80.0], "freq_res": 1.0, "aperiodic_params_": [-0.2235540218118464, 0.522462276258638], "gaussian_params_": [[8.726587886797573, 0.9803980672127081, 0.39952239733520434], [9.796721667251504, 0.6344183386695849, 1.7749788044492072], [17.833913117588647, 0.31989520548584194, 5.7899318636076424], [48.46648834425501, 1.513129561531201, 0.2924495236549658], [53.39519077128342, 0.6048101988359655, 1.1196748980854925], [67.78873164834357, 1.1958463946243438, 0.9091312682081282], [71.46153907460433, 2.179071687516041, 0.308531544057664], [74.3276380158577, 0.9583851914273429, 0.8284415740883101]], "peak_params_": [[8.726587886797573, 1.4492312698238303, 0.7990447946704087], [9.796721667251504, 0.7644524786898977, 3.5499576088984144], [17.833913117588647, 0.3197782151535087, 11.579863727215285], [48.46648834425501, 0.42401369383017773, 0.5848990473099316], [53.39519077128342, 0.5682874497652404, 2.239349796170985], [67.78873164834357, 1.1639889437516102, 1.8182625364162563], [71.46153907460433, 0.7144121336090543, 0.617063088115328], [74.3276380158577, 0.8862904549323062, 1.6568831481766202]], "r_squared_": 0.8730615366943155, "error_": 0.10359800656318505}
{"freq_range": [2.0, 80.0], "freq_res": 1.0, "aperiodic_params_": [0.19728613778091733, 0.9195070160469089], "gaussian_params_": [[9.007096253585159, 1.4367530095410075, 1.0320891366858098], [11.5016652704303, 2.3829363590259525, 0.2773084732280917], [13.373920367414158, 0.744668565408973, 0.31229192258218264], [17.49497994221804, 0.5947585593390828, 3.7392891666703685], [26.969833413438522, 0.4343317249323634, 2.11902811563242], [48.43857424495393, 1.8532030251257154, 0.2500202962806001], [53.038890695735404, 0.5039341634769764, 0.8424757757064553], [59.955270030693285, 0.5363995321149332, 0.6607398141309975], [67.99092824555271, 0.9436844274638978, 1.0720831982188748], [71.44773391301277, 2.941508230647896, 0.28477814503679894], [73.91643237956087, 0.5292169896362001, 0.8383331259479847], [77.5166672786237, 2.792864401464663, 0.26227309535870597]], "peak_params_": [[9.007096253585159, 1.4817603453134671, 2.0641782733716196], [11.5016652704303, 0.6976171184933844, 0.5546169464561834], [13.373920367414158, 0.6532070793934551, 0.6245838451643653], [17.49497994221804, 0.58957725547129, 7.478578333340737], [26.969833413438522, 0.4577981776709925, 4.23805623126484], [48.43857424495393, 0.397876510623941, 0.5000405925612001], [53.038890695735404, 0.5033975160633409, 1.6849515514129105], [59.955270030693285, 0.5351718182548525, 1.321479628261995], [67.99092824555271, 0.9436506431963528, 2.1441663964377495], [71.44773391301277, 0.8743097941288893, 0.5695562900735979], [73.91643237956087, 0.5265943136538692, 1.6766662518959694], [77.5166672786237, 0.5112010405557679, 0.5245461907174119]], "r_squared_": 0.9604255367720224, "error_": 0.07814047621947182}
{"freq_range": [2.0, 80.0], "freq_res": 1.0, "aperiodic_params_": [0.27801585179497473, 1.022758868062032], "gaussian_params_": [[6.546464412093967, 1.0648083283993068, 0.30365747535716225], [8.81147471757402, 1.4165682293557231, 0.7091539133875021], [10.797710498854421, 0.7947844797871966, 1.215821932813314], [13.19269844896978, 0.32915191563325646, 0.9965454017600182], [17.640126025486964, 0.6738465309028651, 2.752582129508039], [26.935389697194136, 0.34239724007283917, 3.0406499570714125], [48.45372830416667, 0.9573616860115836, 0.28041917054250837], [52.75904135587195, 0.3072971186344173, 0.6769540510932149], [59.96492682636094, 0.3053273934785315, 0.2500000000005538], [68.16642852488096, 0.612983245405461, 1.045157952313592], [71.29157223478757, 0.7658445611115634, 0.6968605503708638], [77.63790455137539, 0.5661881125623559, 0.6570467679044734]], "peak_params_": [[6.546464412093967, 0.40970683233677074, 0.6073149507143245], [8.81147471757402, 1.6387056061525933, 1.4183078267750042], [10.797710498854421, 0.8619391903130217, 2.431643865626628], [13.19269844896978, 0.6398980226696853, 1.9930908035200363], [17.640126025486964, 0.6726787453693802, 5.505164259016078], [26.935389697194136, 0.34439845781447487, 6.081299914142825], [48.45372830416667, 0.25856860620688527, 0.5608383410850167], [52.75904135587195, 0.28843407431598433, 1.3539081021864299], [59.96492682636094, 0.3023373969093177, 0.5000000000011076], [68.16642852488096, 0.6052716561353603, 2.090315904627184], [71.29157223478757, 0.717194765929996, 1.3937211007417276], [77.63790455137539, 0.486420419034707, 1.3140935358089467]], "r_squared_": 0.9868381825142769, "error_": 0.049579597557002496}
{"freq_range": [2.0, 80.0], "freq_res": 1.0, "aperiodic_params_": [0.32457583494821474, 1.0393948264771238], "gaussian_params_": [[8.872418231900786, 0.8374080547864909, 0.5491859996196244], [9.850944754714174, 0.7249746064571014, 1.8678107876988264], [17.406186071040402, 0.5672188826056317, 4.986980790081853], [56.00243385477677, 0.3673208706889919, 0.250000000439802], [69.61193795421974, 0.5806566145591059, 2.329328567426436], [77.36849028718639, 0.6127243985107589, 1.0084613410183427], [79.99950957327529, 0.4266373684858024, 0.25147025082451785]], "peak_params_": [[8.872418231900786, 1.6056369340095176, 1.0983719992392489], [9.850944754714174, 1.0127091740953587, 3.7356215753976527], [17.406186071040402, 0.565818243496935, 9.973961580163706], [56.00243385477677, 0.3673034863747118, 0.500000000879604], [69.61193795421974, 0.5726542148410791, 4.658657134852872], [77.36849028718639, 0.5769523145175517, 2.0169226820366855], [79.99950957327529, 0.4470199370635459, 0.5029405016490357]], "r_squared_": 0.9562381994183309, "error_": 0.09416713607061758}
{"freq_range": [2.0, 80.0], "freq_res": 1.0, "aperiodic_params_": [0.2600000365092547, 0.931390617993927], "gaussian_params_": [[8.882505545836402, 0.9230426890349434, 0.6458655638029036], [10.324163237528621, 0.6929816977620428, 2.035167119571809], [17.859075693547812, 0.567760552626659, 4.233708612276449], [48.546296473365466, 0.5792197881815104, 0.5219909908921437], [56.00459997936056, 0.4631157580301552, 0.2500000000025911], [67.54796337827717, 0.4400879808666273, 2.20658216971638], [70.82083626407967, 0.6767839961479942, 1.1155429565815758], [78.19270602721646, 0.6784262718739793, 1.985991550856747]], "peak_params_": [[8.882505545836402, 1.5322657706987632, 1.2917311276058072], [10.324163237528621, 0.9922242170373521, 4.070334239143618], [17.859075693547812, 0.5680107963197368, 8.467417224552898], [48.546296473365466, 0.3970038874692918, 1.0439819817842875], [56.00459997936056, 0.4630378659201515, 0.5000000000051822], [67.54796337827717, 0.45861886844434696, 4.41316433943276], [70.82083626407967, 0.7985188186090336, 2.2310859131631515], [78.19270602721646, 0.6752458809836643, 3.971983101713494]], "r_squared_": 0.9396120264833427, "error_": 0.09775081638505732}
{"freq_range": [2.0, 80.0], "freq_res": 1.0, "aperiodic_params_": [0.07662000078417074, 0.6238329626883615], "gaussian_params_": [[12.386667264597552, 0.6825274629358653, 5.051428610563268], [48.66396175001937, 0.7449291932252254, 0.7157135326010455], [73.14199695808556, 0.7180310269094122, 5.999999999999999]], "peak_params_": [[12.386667264597552, 0.680530819581837, 10.102857221126536], [48.66396175001937, 0.6674038067867682, 1.431427065202091], [73.14199695808556, 0.7178299750995306, 11.999999999999998]], "r_squared_": 0.6225934739303499, "error_": 0.19599302744290859}
{"freq_range": [2.0, 80.0], "freq_res": 1.0, "aperiodic_params_": [-0.4281101893959688, 0.1851999213402124], "gaussian_params_": [[9.663798282814959, 0.9872510750293473, 1.8320440035056065], [37.78124611799309, 0.6860414036224555, 0.628871309530243], [48.35916831607095, 1.0225402482814807, 0.5312529207510382], [52.250904523082134, 0.6280909370500318, 0.64260192323242], [56.58441895300493, 0.596404827382412, 1.293620517189942], [59.608458476397296, 1.4106107597019324, 0.3062987549413], [68.11515186652022, 0.6350288626833767, 2.0356503532510386], [71.04532536639174, 0.6339387860058331, 0.6795416114105505]], "peak_params_": [[9.663798282814959, 0.970766626809992, 3.664088007011213], [37.78124611799309, 0.6457662642871116, 1.257742619060486], [48.35916831607095, 0.813629124724702, 1.0625058415020765], [52.250904523082134, 0.5831112015149608, 1.28520384646484], [56.58441895300493, 0.5664098412198108, 2.587241034379884], [59.608458476397296, 0.6416236063258158, 0.6125975098826], [68.11515186652022, 0.6340412690463156, 4.071300706502077], [71.04532536639174, 0.8651708768461469, 1.359083222821101]], "r_squared_": 0.4179244301545104, "error_": 0.20109840025677464}
{"freq_range": [2.0, 80.0], "freq_res": 1.0, "aperiodic_params_": [-0.25087128061126257, 0.5136359657341578], "gaussian_params_": [[10.159447900714294, 0.8757998709064796, 2.4742090861694126], [41.13211927616297, 0.6164248344199782, 0.7506646598891755], [53.01728559827739, 0.7216836326414514, 4.0126042889131455], [65.06679193151511, 0.5249369763241106, 0.9598798443888514], [71.53339016479883, 3.4001206257410574, 0.25000000000000006]], "peak_params_": [[10.159447900714294, 0.8739831472705422, 4.948418172338825], [41.13211927616297, 0.6150919369123684, 1.501329319778351], [53.01728559827739, 0.7216769364014545, 8.025208577826291], [65.06679193151511, 0.532021222037531, 1.9197596887777029], [71.53339016479883, 0.5957284914285647, 0.5000000000000001]], "r_squared_": 0.6222769550583063, "error_": 0.16628526839007332}
{"freq_range": [2.0, 80.0], "freq_res": 1.0, "aperiodic_params_": [-0.2471604068905741, 0.6234783734456568], "gaussian_params_": [[8.915448503636814, 0.8444044116771346, 0.5528142778547414], [9.904271260638074, 0.6166715071446286, 1.7523323080150306], [14.166964545427406, 0.26658078898126003, 2.7805777709998933], [17.920828414235793, 0.3315005239078437, 0.2500127631742251], [19.924476104986383, 0.23149017466843322, 4.4106951297634716], [26.990490657176565, 0.1693148633756152, 0.7894130847365394], [55.52870428497436, 1.7937947713696607, 0.3080849269397674], [76.78031171746498, 0.3090929143215986, 3.965917881536876]], "peak_params_": [[8.915448503636814, 1.4325804516863467, 1.1056285557094827], [9.904271260638074, 0.8441368248114046, 3.504664616030061], [14.166964545427406, 0.4001788896395183, 5.561155541999787], [17.920828414235793, 0.6288583389384672, 0.5000255263484502], [19.924476104986383, 0.2609843290893872, 8.821390259526943], [26.990490657176565, 0.23324279971015438, 1.5788261694730787], [55.52870428497436, 0.5566896040145325, 0.6161698538795348], [76.78031171746498, 0.30861905187716165, 7.931835763073752]], "r_squared_": 0.9474598765636718, "error_": 0.06491305994743758}
{"freq_range": [2.0, 80.0], "freq_res": 1.0, "aperiodic_params_": [-0.05525159315487972, 0.6599577379991896], "gaussian_params_": [[8.84037025187734, 0.9361732840668381, 0.554090749822681], [10.350221541702306, 0.5959313721211866, 1.9504533864333695], [19.212758065497898, 0.480667133740483, 5.628481409530436], [40.17629727674192, 0.47904208243379404, 0.46523345965144014], [53.63204672043558, 0.5924710649381828, 1.417005690949142], [58.047697949509754, 0.4396292126631419, 0.25000072915438953], [60.06512333478749, 0.7491043866121783, 0.9074388551378012], [67.5157935838784, 0.8542370060571384, 0.9872791790230602], [71.49599259346463, 2.178891772770812, 0.302260688619483], [74.53632647209191, 1.6106253266889279, 0.29306172948271314], [77.52794385688222, 1.6294197594265252, 0.28387837211059547]], "peak_params_": [[8.84037025187734, 1.4597430029531835, 1.108181499645362], [10.350221541702306, 0.8170877199089912, 3.900906772866739], [19.212758065497898, 0.4803558095863896, 11.256962819060872], [40.17629727674192, 0.4463777767041728, 0.9304669193028803], [53.63204672043558, 0.5728293730655876, 2.834011381898284], [58.047697949509754, 0.49304308130227303, 0.5000014583087791], [60.06512333478749, 0.7472021777443926, 1.8148777102756024], [67.5157935838784, 0.7574370201801941, 1.9745583580461203], [71.49599259346463, 0.5686105611977627, 0.604521377238966], [74.53632647209191, 0.4606997606671468, 0.5861234589654263], [77.52794385688222, 0.4088676546357505, 0.5677567442211909]], "r_squared_": 0.9290513862365053, "error_": 0.0772274669748802}
{"freq_range": [2.0, 80.0], "freq_res": 1.0, "aperiodic_params_": [0.20652073683300057, 0.9349405055644194], "gaussian_params_": [[8.763043447122962, 0.9638003343679952, 0.4644226412671738], [10.34614676074841, 0.8659312234050377, 2.2469658650614037], [18.445825712121728, 0.7769625436708467, 3.7124031827936417], [27.058377515712838, 0.4282201284443819, 2.5897142558604562], [53.23650226120615, 0.4451976364695293, 0.9225041093640907], [59.94608562221997, 0.452092675174951, 0.568531118064055], [67.85942301175338, 0.7289379412253304, 0.9316464137811993], [71.46296606531808, 3.018001172840269, 0.264500601363438], [74.51467851665137, 1.6793769041831546, 0.2673497502470702], [77.53720967639556, 2.1079605360586124, 0.2552692251771943]], "peak_params_": [[8.763043447122962, 1.6003724524821668, 0.9288452825343476], [10.34614676074841, 0.9418985371218466, 4.4939317301228074], [18.445825712121728, 0.7749417890824503, 7.424806365587283], [27.058377515712838, 0.482747138869718, 5.1794285117209125], [53.23650226120615, 0.43080500133197375, 1.8450082187281813], [59.94608562221997, 0.45006442201710906, 1.13706223612811], [67.85942301175338, 0.7206867409300809, 1.8632928275623986], [71.46296606531808, 0.6547836722673266, 0.529001202726876], [74.51467851665137, 0.32327747408136087, 0.5346995004941404], [77.53720967639556, 0.40751692531002104, 0.5105384503543886]], "r_squared_": 0.9700778565739923, "error_": 0.0711303070920538}
{"freq_range": [2.0, 80.0], "freq_res": 1.0, "aperiodic_params_": [0.3611171873246895, 1.0609451210425538], "gaussian_params_": [[8.742854553115398, 1.0090021486795469, 0.4162865378334863], [10.083142762854466, 0.7059423794147036, 2.00775175823296], [18.887789265498327, 0.6491344788263026, 5.999999999999999], [55.6195190906171, 0.9402900720478884, 0.2500077706416515], [68.22868483116332, 0.43096429806092634, 1.4964124117239397], [71.46389051772401, 1.8874937854225535, 0.2934374903583028], [77.52153732155067, 0.4712022128376871, 0.8033773049359193]], "peak_params_": [[8.742854553115398, 1.6110465503860265, 0.8325730756669726], [10.083142762854466, 0.9325953501919564, 4.01550351646592], [18.887789265498327, 0.6490577542397497, 11.999999999999998], [55.6195190906171, 0.29534218645975385, 0.500015541283303], [68.22868483116332, 0.425961071291298, 2.9928248234478794], [71.46389051772401, 0.6185598382832522, 0.5868749807166056], [77.52153732155067, 0.394626217789922, 1.6067546098718386]], "r_squared_": 0.9721841681595313, "error_": 0.0799126047407389}
{"freq_range": [2.0, 80.0], "freq_res": 1.0, "aperiodic_params_": [0.33499880897286066, 1.061319893450898], "gaussian_params_": [[8.83427420627571, 0.9124101248748118, 0.5050509930286982], [10.00606564075917, 0.7055773923393982, 1.9196679644784058], [18.227895422425537, 0.6413393529910897, 5.713229383854885], [55.992645366843476, 0.3579786667256101, 0.2500391484416843], [68.2656095931447, 0.37349770740400573, 2.264209246701027], [71.37214490414975, 0.572120981254756, 0.5337410524180356], [77.49338299523366, 0.4900420990573536, 1.072436953252045]], "peak_params_": [[8.83427420627571, 1.653643552249103, 1.0101019860573963], [10.00606564075917, 0.9965193959639944, 3.8393359289568116], [18.227895422425537, 0.6409503970008951, 11.42645876770977], [55.992645366843476, 0.35782400106373546, 0.5000782968833686], [68.2656095931447, 0.3709366524937885, 4.528418493402054], [71.37214490414975, 0.6287989344565093, 1.0674821048360712], [77.49338299523366, 0.44105161904186585, 2.14487390650409]], "r_squared_": 0.9702257535708018, "error_": 0.08398596649633563}
{"freq_range": [2.0, 80.0], "freq_res": 1.0, "aperiodic_params_": [0.3649991614470002, 1.029875105008312], "gaussian_params_": [[8.84038087569003, 0.8835977126500797, 0.5723629274081588], [10.263783707028137, 0.712551337877255, 1.9045970078510703], [18.43223096702518, 0.6511961069738523, 5.170618408164961], [55.69005304080198, 0.9789656574212519, 0.25000000000000006], [67.54796540086404, 0.4026252720634145, 2.093497347163435], [70.97613481550094, 0.5798081997464006, 0.9214100617801582], [78.15293849465282, 0.6188918093967578, 1.8598927084434447]], "peak_params_": [[8.84038087569003, 1.5449922467145618, 1.1447258548163175], [10.263783707028137, 0.9914990833989356, 3.8091940157021407], [18.43223096702518, 0.6491111066179278, 10.341236816329921], [55.69005304080198, 0.453937644484141, 0.5000000000000001], [67.54796540086404, 0.396494852057387, 4.18699469432687], [70.97613481550094, 0.6833847978077939, 1.8428201235603163], [78.15293849465282, 0.6168045095459281, 3.7197854168868894]], "r_squared_": 0.9574120196948334, "error_": 0.09164001059149667}
{"freq_range": [2.0, 80.0], "freq_res": 1.0, "aperiodic_params_": [0.22659227739505547, 0.8446087864897438], "gaussian_params_": [[8.804214430692602, 0.8838420240618133, 0.5991863730877807], [10.449368818593442, 0.7433032758264564, 1.884460726311934], [18.727283238836208, 0.6748762790393525, 4.7338747219601505], [48.4726907141851, 0.8992978725242953, 0.3603754934761123], [55.63761527129315, 1.254165182334352, 0.26916737073478153], [64.827065657058, 0.33829936552281853, 0.5266268930669303], [68.89077160070111, 0.6356690895847475, 1.5578275622115163], [71.4088678305096, 0.6116528061503071, 0.5277841840895225]], "peak_params_": [[8.804214430692602, 1.4726100321349997, 1.1983727461755613], [10.449368818593442, 0.9664821156390406, 3.768921452623868], [18.727283238836208, 0.673782439945786, 9.467749443920301], [48.4726907141851, 0.38046195473793976, 0.7207509869522246], [55.63761527129315, 0.5067106325612518, 0.5383347414695631], [64.827065657058, 0.3486422417056413, 1.0532537861338607], [68.89077160070111, 0.6341267865713868, 3.1156551244230326], [71.4088678305096, 0.7072814082531622, 1.055568368179045]], "r_squared_": 0.8734966054513889, "error_": 0.12617654076417126}
{"freq_range": [2.0, 80.0], "freq_res": 1.0, "aperiodic_params_": [-0.06609084018876771, 0.6049779073124887], "gaussian_params_": [[9.092328133741585, 1.4047628932628267, 0.9088196219615068], [11.36175835752919, 0.814449486312045, 0.49848479841255594], [13.341727557591083, 0.43597713347658124, 1.0153290989942474], [18.39082134699808, 0.4741505075272979, 3.123440675027809], [30.682156773261553, 0.5104871486907312, 0.5144034652787818], [48.6789763168521, 0.6463600978336637, 0.944506782238215], [53.07815269335821, 0.49789933043358675, 0.90695411997922], [56.020507118811274, 0.7314964370503704, 0.7314615300546603], [68.36162910910491, 0.9010590985983481, 0.9005018983773252], [71.05706048292987, 0.6052469222300709, 0.6751474039653115]], "peak_params_": [[9.092328133741585, 1.4027544850794347, 1.8176392439230136], [11.36175835752919, 0.8404253874452356, 0.9969695968251119], [13.341727557591083, 0.5227071097151654, 2.030658197988495], [18.39082134699808, 0.47046498213926896, 6.246881350055618], [30.682156773261553, 0.42191265053872185, 1.0288069305575636], [48.6789763168521, 0.6101037845123347, 1.88901356447643], [53.07815269335821, 0.496217665498619, 1.81390823995844], [56.020507118811274, 0.7339850675829263, 1.4629230601093206], [68.36162910910491, 0.8312751363665156, 1.8010037967546504], [71.05706048292987, 0.6154118983036359, 1.350294807930623]], "r_squared_": 0.6778974763317395, "error_": 0.16651512176494332}
{"freq_range": [2.0, 80.0], "freq_res": 1.0, "aperiodic_params_": [-0.36871601071299387, 0.44247308666707197], "gaussian_params_": [[9.316823791070725, 1.0785274099237883, 1.1997188323866477], [14.6803291197004, 0.4269457210912245, 4.2175169937179025], [41.04632806638242, 0.5450693979875124, 0.7791373805871042], [44.4196250081921, 1.0526161795966298, 0.3279711435757188], [49.24194872707344, 0.5715652730651164, 0.9143652895437909], [52.50957327414915, 0.6676115505684594, 0.8001285611806942], [56.19377330062661, 0.7667906838800196, 0.7120245022732905], [68.20002171642042, 0.8190537904563593, 0.6857936555567333], [71.77089150203099, 0.7685065982311883, 0.8587206982288464]], "peak_params_": [[9.316823791070725, 1.2139415135687572, 2.3994376647732953], [14.6803291197004, 0.42573552817629706, 8.435033987435805], [41.04632806638242, 0.5441066833298741, 1.5582747611742085], [44.4196250081921, 0.4647118468433745, 0.6559422871514377], [49.24194872707344, 0.5519460034913228, 1.8287305790875819], [52.50957327414915, 0.5534342507644789, 1.6002571223613884], [56.19377330062661, 0.7389640441840493, 1.424049004546581], [68.20002171642042, 0.7849964898629654, 1.3715873111134667], [71.77089150203099, 0.7416353663976946, 1.717441396457693]], "r_squared_": 0.6539355993976546, "error_": 0.14982890579110084}
{"freq_range": [2.0, 80.0], "freq_res": 1.0, "aperiodic_params_": [0.002564172735659054, 0.8793662183365453], "gaussian_params_": [[9.059552670565454, 0.9494971217382124, 0.5853748721437622], [10.835585316727466, 0.7195189027574899, 2.0701521161477876], [17.97746484508344, 0.5513542350694121, 3.8746507375571833], [29.106312394595015, 0.2042032082648594, 2.2336542701226287], [48.45530071438673, 1.4195054134633458, 0.29040829284801467], [59.248133924865115, 0.4229475516504144, 1.0412586114701299], [66.82598696455945, 0.7201461576353042, 0.8113316207460011], [72.43811509066697, 1.012620936372983, 0.2901418390381591], [75.38825430019487, 1.27388596437064, 0.27920900393235387], [76.65076327801998, 0.46985178863545857, 0.7408619460243487]], "peak_params_": [[9.059552670565454, 1.4678832586220736, 1.1707497442875243], [10.835585316727466, 0.8301116444972658, 4.140304232295575], [17.97746484508344, 0.5531497011582408, 7.7493014751143665], [29.106312394595015, 0.2136126714864519, 4.4673085402452575], [48.45530071438673, 0.4153298260461127, 0.5808165856960293], [59.248133924865115, 0.41110731101893205, 2.0825172229402598], [66.82598696455945, 0.703771489890038, 1.6226632414920021], [72.43811509066697, 0.32383770738372486, 0.5802836780763182], [75.38825430019487, 0.5237028123054182, 0.5584180078647077], [76.65076327801998, 0.4204443215127909, 1.4817238920486975]], "r_squared_": 0.953631286342597, "error_": 0.08212493762881311}
{"freq_range": [2.0, 80.0], "freq_res": 1.0, "aperiodic_params_": [0.1233342414869957, 0.9394315955733369], "gaussian_params_": [[8.900196034444908, 0.8905147585595258, 0.5662855258254929], [10.694859869106521, 0.8849244726334343, 2.264788925209656], [18.538804458774525, 0.6953768449953099, 3.816137123377588], [28.166114050113432, 0.2905553459198351, 2.975297517767643], [53.94314865511857, 0.39222774077703504, 1.1361506910247812], [59.92006933440145, 0.49129840747830256, 0.9822192131220415], [67.0455274747196, 0.7646762165980353, 0.8715242995462139], [71.52931994474297, 1.3888774807565925, 0.2936849293178414], [75.9688784856079, 0.3113041487382284, 1.6786336325650313]], "peak_params_": [[8.900196034444908, 1.5761758368748484, 1.1325710516509857], [10.694859869106521, 0.9766535552744505, 4.529577850419312], [18.538804458774525, 0.6939060572458852, 7.632274246755176], [28.166114050113432, 0.3222746180604088, 5.950595035535286], [53.94314865511857, 0.3917370131861799, 2.2723013820495623], [59.92006933440145, 0.48967459508120914, 1.964438426244083], [67.0455274747196, 0.7636337613090476, 1.7430485990924278], [71.52931994474297, 0.4035360804372943, 0.5873698586356828], [75.9688784856079, 0.31125065201305246, 3.3572672651300626]], "r_squared_": 0.9604549553872329, "error_": 0.08512898638880559}
{"freq_range": [2.0, 80.0], "freq_res": 1.0, "aperiodic_params_": [0.2624561637803788, 1.021981295601289], "gaussian_params_": [[8.827893582895234, 0.9181885297975495, 0.49947916683915244], [10.686388645991356, 0.9705820389280697, 2.3345095009021657], [18.181736646591276, 0.7497655913709569, 3.2958304979513273], [26.88305577630473, 0.3665353444009553, 4.235570966625843], [54.02553170477196, 0.2393795467625714, 1.3976332911339011], [59.72936089890557, 0.6965813223096076, 0.2552108728491579], [67.49153719954886, 0.4671863643953102, 1.0164795888522513], [71.47163141538132, 1.6307591607125733, 0.2946350597249758], [77.52292124890822, 1.033204139491852, 0.32222559425048514]], "peak_params_": [[8.827893582895234, 1.6284779802583063, 0.9989583336783049], [10.686388645991356, 1.0320613037916806, 4.669019001804331], [18.181736646591276, 0.7964460772900535, 6.591660995902655], [26.88305577630473, 0.3873091081621347, 8.471141933251687], [54.02553170477196, 0.23933960851963043, 2.7952665822678022], [59.72936089890557, 0.3970131173205085, 0.5104217456983158], [67.49153719954886, 0.41563569604088024, 2.0329591777045026], [71.47163141538132, 0.4540911689969791, 0.5892701194499516], [77.52292124890822, 0.3452852122251029, 0.6444511885009703]], "r_squared_": 0.9773522143311334, "error_": 0.06919804007101509}
{"freq_range": [2.0, 80.0], "freq_res": 1.0, "aperiodic_params_": [0.3553895509382672, 1.1073739969931256], "gaussian_params_": [[8.901092778585161, 1.0050116481873794, 0.58673152574717], [10.793270238563595, 0.9138230757488437, 2.365979073839178], [18.18190585956708, 0.726039056239857, 2.7444525944425235], [22.563711776108487, 0.3795497305424922, 0.30679154666059333], [26.606012714011175, 0.26381696942790805, 4.295350581112693], [55.651075023609266, 0.8925006216145525, 0.25930598236586344], [65.43861493272144, 0.47894611909795454, 0.42311760157953754], [68.61146316543245, 0.31395332526504544, 1.7211544634502673], [71.3639962353972, 0.4628564896996867, 0.6367312910908948], [77.41496976415118, 0.45914682629480896, 1.2802876808895551]], "peak_params_": [[8.901092778585161, 1.6792589158621762, 1.17346305149434], [10.793270238563595, 0.9360275383259342, 4.731958147678356], [18.18190585956708, 0.7687300928667927, 5.488905188885047], [22.563711776108487, 0.4790313914765615, 0.6135830933211867], [26.606012714011175, 0.2668703764761483, 8.590701162225386], [55.651075023609266, 0.36093314918479025, 0.5186119647317269], [65.43861493272144, 0.31459912797185186, 0.8462352031590751], [68.61146316543245, 0.30652509594969257, 3.4423089269005347], [71.3639962353972, 0.5129421822804803, 1.2734625821817895], [77.41496976415118, 0.43565359606539245, 2.5605753617791103]], "r_squared_": 0.9795848064057969, "error_": 0.06605241563902348}
{"freq_range": [2.0, 80.0], "freq_res": 1.0, "aperiodic_params_": [0.3670032047296935, 1.0841001603770375], "gaussian_params_": [[8.883068384317298, 0.8963670799317146, 0.5933292463171495], [10.372522892458507, 0.7754139257294252, 1.9495473222509203], [18.702395020272895, 0.6784788873661859, 5.454589374206519], [55.73582920012884, 0.7291862173337358, 0.2503901200994086], [67.54796540085792, 0.3681142819739785, 2.184133079416742], [71.21620087718378, 0.4768346468414699, 0.7608527734797786], [77.33213325946878, 0.5992925964623258, 1.0826186595544245], [79.99542962626494, 0.47956072065782007, 0.3619993075985082]], "peak_params_": [[8.883068384317298, 1.623808812357578, 1.186658492634299], [10.372522892458507, 1.10380807461768, 3.8990946445018406], [18.702395020272895, 0.6775131198149571, 10.909178748413037], [55.73582920012884, 0.4179569885638419, 0.5007802401988172], [67.54796540085792, 0.36037711448488574, 4.368266158833484], [71.21620087718378, 0.5635393077422135, 1.5217055469595573], [77.33213325946878, 0.571775283590088, 2.165237319108849], [79.99542962626494, 0.5082953754522901, 0.7239986151970164]], "r_squared_": 0.975469403756209, "error_": 0.0739893883524634}
{"freq_range": [2.0, 80.0], "freq_res": 1.0, "aperiodic_params_": [0.27192662955995217, 0.9743272714510445], "gaussian_params_": [[8.874950329457079, 0.8694609243280813, 0.615405495263941], [10.422260314875192, 0.8552550183896693, 1.9508341265526774], [18.638083992465155, 0.6621328497399791, 5.213457368880889], [56.04977110049664, 0.4826262353498234, 0.42949748889183], [68.3456642024991, 0.37007062049473854, 2.0842666338712275], [71.44204104131789, 0.9692533183118012, 0.28850211382981816]], "peak_params_": [[8.874950329457079, 1.6272510776082603, 1.230810990527882], [10.422260314875192, 1.1667647721759433, 3.901668253105355], [18.638083992465155, 0.6605935271081993, 10.426914737761779], [56.04977110049664, 0.47939658299007193, 0.85899497778366], [68.3456642024991, 0.3650161689073732, 4.168533267742455], [71.44204104131789, 0.4641591060483976, 0.5770042276596363]], "r_squared_": 0.9321958070972963, "error_": 0.11092978845282274}
{"freq_range": [2.0, 80.0], "freq_res": 1.0, "aperiodic_params_": [0.4323619070091098, 1.0704137457061746], "gaussian_params_": [[9.163747707808957, 1.631038679792362, 0.9158199876272338], [11.490216034619305, 2.5377942893770853, 0.30128730638878876], [13.50606443521637, 0.4355173215859278, 0.5501847392105529], [18.323548849879007, 0.5730080805627481, 4.913088035217987], [56.129229863292736, 0.5020428269605511, 0.44024878508220294], [68.79756372739786, 0.368105001716799, 2.2432188807609]], "peak_params_": [[9.163747707808957, 1.6998329002576207, 1.8316399752544676], [11.490216034619305, 1.0826352150403855, 0.6025746127775775], [13.50606443521637, 0.6801107249135974, 1.1003694784211058], [18.323548849879007, 0.5717669124742981, 9.826176070435974], [56.129229863292736, 0.4808729695118088, 0.8804975701644059], [68.79756372739786, 0.3666091409581833, 4.4864377615218]], "r_squared_": 0.925939984845504, "error_": 0.11844327689427106}
{"freq_range": [2.0, 80.0], "freq_res": 1.0, "aperiodic_params_": [0.4113537306212044, 1.0660222316546082], "gaussian_params_": [[9.168016588780064, 1.8369680085050248, 0.901356080733493], [11.474744701512297, 3.2959336340153302, 0.2902928659864834], [13.661408408562252, 0.5782757014518299, 1.045713789954116], [17.88303341923334, 0.4973903661411493, 2.1563884091521888], [24.329655289578795, 0.20515788325912998, 3.9896807118174555], [56.26132960947164, 0.5283888196250585, 0.41372494712680047], [68.09965537257946, 0.47515320468375033, 0.7741469068873758]], "peak_params_": [[9.168016588780064, 1.8055879810315525, 1.802712161466986], [11.474744701512297, 1.12474020527302, 0.5805857319729668], [13.661408408562252, 0.6542368654762412, 2.091427579908232], [17.88303341923334, 0.5550460506761349, 4.3127768183043775], [24.329655289578795, 0.21335848066253704, 7.979361423634911], [56.26132960947164, 0.432828326906189, 0.8274498942536009], [68.09965537257946, 0.47123253386955044, 1.5482938137747515]], "r_squared_": 0.9389268705636794, "error_": 0.10384934680770844}
{"freq_range": [2.0, 80.0], "freq_res": 1.0, "aperiodic_params_": [0.12552313556801734, 1.0131580062577787], "gaussian_params_": [[9.25840495252596, 1.5573290027109292, 0.9506653095310267], [11.619631426196685, 0.8694738377314146, 0.812826154904878], [14.24827714711367, 0.6716729111952853, 1.823403100294152], [18.12847077378682, 0.652681138123177, 0.6506426330733399], [20.43218320135827, 0.6334841164078775, 0.38498435541379367], [22.57621644050302, 0.18767133503835645, 0.7369773083104649], [26.702524256490456, 0.25170486177299206, 5.999999999999999], [65.16130044283227, 0.6833143312571056, 0.7867724712479494], [68.49745868000626, 2.7660331966889875, 0.2610618755005919], [70.52948383332081, 2.4906651961154727, 0.2548028540527771], [76.45361038856828, 0.71643885047107, 0.9407014619738772]], "peak_params_": [[9.25840495252596, 1.5195877849586124, 1.9013306190620534], [11.619631426196685, 1.1302180952421004, 1.625652309809756], [14.24827714711367, 0.7041889727306307, 3.646806200588304], [18.12847077378682, 0.8088843399671446, 1.3012852661466798], [20.43218320135827, 0.4877014465450783, 0.7699687108275873], [22.57621644050302, 0.3671463441161481, 1.4739546166209299], [26.702524256490456, 0.25139569601182776, 11.999999999999998], [65.16130044283227, 0.6691038812091361, 1.5735449424958987], [68.49745868000626, 0.45120644575405744, 0.5221237510011838], [70.52948383332081, 0.45275881827720044, 0.5096057081055542], [76.45361038856828, 0.6378048474724483, 1.8814029239477543]], "r_squared_": 0.9452436888242848, "error_": 0.08879784501027695}
{"freq_range": [2.0, 80.0], "freq_res": 1.0, "aperiodic_params_": [0.38142947742945593, 1.0871113590909125], "gaussian_params_": [[9.09268964339261, 0.9069742202245201, 0.6467598738341067], [11.292083927293218, 1.1054691367121101, 2.286624552174407], [18.051225982992268, 0.6347626052776774, 2.2498070442215714], [22.09767853499966, 0.22412136761010287, 1.209884935022202], [27.577400865526876, 0.27091937590922044, 4.26880256296944], [76.32918444997367, 0.3287221695808199, 1.4237588883911545]], "peak_params_": [[9.09268964339261, 1.5668228549885825, 1.2935197476682134], [11.292083927293218, 1.1130293598459133, 4.573249104348814], [18.051225982992268, 0.6721463644594231, 4.499614088443143], [22.09767853499966, 0.47483851166060365, 2.419769870044404], [27.577400865526876, 0.2696325899902987, 8.53760512593888], [76.32918444997367, 0.3200522789639053, 2.847517776782309]], "r_squared_": 0.9726311651988306, "error_": 0.0841276422721472}
{"freq_range": [2.0, 80.0], "freq_res": 1.0, "aperiodic_params_": [0.44560870920887674, 1.0974544861888291], "gaussian_params_": [[8.900381885775543, 0.8592612235568747, 0.622648732636252], [11.090585291778298, 1.0618562926017068, 2.266397673518568], [18.343338359449703, 0.7374738385680623, 2.6099890299468593], [22.526114423358084, 1.1074862163592019, 0.2587969469738088], [27.41947734382253, 0.30822170641050783, 3.455152392167392], [71.46987313468252, 1.6297015186753718, 0.26320571695532713], [77.51747978946429, 1.1318669222131421, 0.29842663085226895]], "peak_params_": [[8.900381885775543, 1.5434576851168313, 1.245297465272504], [11.090585291778298, 1.0780157166722895, 4.532795347037136], [18.343338359449703, 0.7488016634798145, 5.219978059893719], [22.526114423358084, 0.4932963844844729, 0.5175938939476176], [27.41947734382253, 0.3089712502314669, 6.910304784334784], [71.46987313468252, 0.33119066809510245, 0.5264114339106543], [77.51747978946429, 0.3062716213888148, 0.5968532617045379]], "r_squared_": 0.9793318523322461, "error_": 0.07262348714255104}
{"freq_range": [2.0, 80.0], "freq_res": 1.0, "aperiodic_params_": [0.47042882899180327, 1.1772641312943148], "gaussian_params_": [[8.974819542657302, 1.0263312300290537, 0.7718594931896673], [11.23976383142, 0.9194093204927698, 2.3203323652976815], [18.411858073620742, 0.7130642202276032, 2.35460711533408], [22.5483940545952, 0.7273961873364813, 0.27175590183623993], [26.750909247588318, 0.25847355111696363, 4.9076786419468394], [55.676607162548706, 0.7189071888071648, 0.25000003459049586], [65.5235614136331, 0.33945576352683665, 0.7092436075327627], [70.55397161564204, 0.3343843067345914, 1.729350251157008], [75.74052284147007, 0.3679852976836928, 0.3023215685730443], [77.50740997980017, 1.6937010939360766, 0.28107839238291227]], "peak_params_": [[8.974819542657302, 1.6034053103314432, 1.5437189863793346], [11.23976383142, 0.9538821134606625, 4.640664730595363], [18.411858073620742, 0.7681536779755016, 4.70921423066816], [22.5483940545952, 0.48267284915411757, 0.5435118036724799], [26.750909247588318, 0.2590620079535556, 9.815357283893679], [55.676607162548706, 0.31139714614073966, 0.5000000691809917], [65.5235614136331, 0.28132449552535554, 1.4184872150655254], [70.55397161564204, 0.32344543447958163, 3.458700502314016], [75.74052284147007, 0.2569555757736208, 0.6046431371460886], [77.50740997980017, 0.364719604735636, 0.5621567847658245]], "r_squared_": 0.9836768154386605, "error_": 0.059125155536724525}
{"freq_range": [2.0, 80.0], "freq_res": 1.0, "aperiodic_params_": [0.45606660291898954, 1.1864965141849255], "gaussian_params_": [[8.921282039592645, 0.9421604735043265, 0.8183374532044767], [10.486685221643018, 0.8371710747557921, 1.7880636893338875], [18.61625727986359, 0.6763078452964204, 5.517152742370014], [56.13629005601262, 0.41084625841887656, 0.2526396919267662], [68.92520553225026, 0.3102963341582163, 2.7082075133379684], [78.38227115699016, 0.3929450925912233, 2.0182371945890702]], "peak_params_": [[8.921282039592645, 1.6783928364103946, 1.6366749064089534], [10.486685221643018, 1.401688979161185, 3.576127378667775], [18.61625727986359, 0.674683899534618, 11.034305484740027], [56.13629005601262, 0.35521320392584954, 0.5052793838535324], [68.92520553225026, 0.3101859919776715, 5.416415026675937], [78.38227115699016, 0.38709074649100006, 4.0364743891781405]], "r_squared_": 0.9720636142038641, "error_": 0.08597675814872481}
{"freq_range": [2.0, 80.0], "freq_res": 1.0, "aperiodic_params_": [0.5238839347105799, 1.2281035549322084], "gaussian_params_": [[9.159248568029975, 1.8026000827233648, 0.9397033002322698], [11.500715687411065, 2.1442943891945974, 0.3189005446162685], [13.471480737912579, 0.2900383032206236, 0.730109599090177], [17.93741051684841, 0.5975437491100702, 5.390899613563112], [56.400044746151295, 0.8407867567272619, 0.2659784798980606], [67.86327815204909, 0.23117719443551615, 1.568919849810114], [71.46986167257478, 1.02243679478351, 0.28570506049871075], [79.46595032224306, 0.35642023360361963, 2.3860124393871023]], "peak_params_": [[9.159248568029975, 1.928094186505427, 1.8794066004645396], [11.500715687411065, 1.012061587583319, 0.637801089232537], [13.471480737912579, 0.6287538499129864, 1.460219198180354], [17.93741051684841, 0.5975034781974171, 10.781799227126225], [56.400044746151295, 0.2713083297421799, 0.5319569597961212], [67.86327815204909, 0.2303045185133512, 3.137839699620228], [71.46986167257478, 0.29643592223841764, 0.5714101209974215], [79.46595032224306, 0.34968841804136575, 4.772024878774205]], "r_squared_": 0.9788295759656089, "error_": 0.08014592786790549}
{"freq_range": [2.0, 80.0], "freq_res": 1.0, "aperiodic_params_": [-0.10063406037847678, 1.1178655504633102], "gaussian_params_": [[8.951412964158301, 1.0398983121026824, 0.5586289960836336], [10.044877448543625, 0.9555237670925886, 1.8650099185629276], [17.419166551083908, 0.6298962031169898, 5.098850738067437], [37.3236654040479, 0.37742024549170927, 0.5880726888260881], [65.82140154649078, 0.4472300407752685, 1.030081459686345], [70.85205864669693, 0.5421373456049562, 0.9209998658897758], [77.30431222846678, 0.5865772669728981, 1.2089983150333088], [79.99996892301166, 0.576283286786917, 0.2504914398047391]], "peak_params_": [[8.951412964158301, 2.013861191299014, 1.1172579921672672], [10.044877448543625, 1.3523873343434583, 3.7300198371258553], [17.419166551083908, 0.6286839209225902, 10.197701476134874], [37.3236654040479, 0.3247696604433017, 1.1761453776521762], [65.82140154649078, 0.44055859083589555, 2.06016291937269], [70.85205864669693, 0.5351902317521282, 1.8419997317795516], [77.30431222846678, 0.5682869167856528, 2.4179966300666176], [79.99996892301166, 0.6251234188221979, 0.5009828796094782]], "r_squared_": 0.9729359043275626, "error_": 0.08389939124537908}
{"freq_range": [2.0, 80.0], "freq_res": 1.0, "aperiodic_params_": [0.45455582809832734, 1.1997667623068353], "gaussian_params_": [[6.999599210631181, 0.2515402742497734, 0.47795570960983186], [9.138764442170043, 1.6742978966221391, 0.9389822819251632], [11.588064113659664, 0.9976560339556927, 0.9042377489046272], [14.224617523537573, 0.7202404005757993, 1.9502189924531441], [17.88847276704806, 0.5332402040545512, 0.6068231355008364], [20.131218684516732, 0.4755472756918378, 1.78738797832495], [26.69116828750191, 0.3469802401703513, 5.22561035591691], [65.78499009639295, 0.2914212325660021, 1.1535098214627881], [71.5251022815029, 0.31862640950057, 0.7209827344886449], [75.52793188630805, 0.8651277403449601, 0.3121558971242318], [77.5165112169761, 1.6105910968707, 0.28386965049585927]], "peak_params_": [[6.999599210631181, 0.3776794509281084, 0.9559114192196637], [9.138764442170043, 1.6937881667306551, 1.8779645638503264], [11.588064113659664, 1.2979054267760055, 1.8084754978092543], [14.224617523537573, 0.7634273903340446, 3.9004379849062882], [17.88847276704806, 0.9555144057251911, 1.2136462710016729], [20.131218684516732, 0.6373505368058161, 3.5747759566499], [26.69116828750191, 0.3466701763106719, 10.45122071183382], [65.78499009639295, 0.2864024456476897, 2.3070196429255763], [71.5251022815029, 0.25648993881069915, 1.4419654689772898], [75.52793188630805, 0.2757185703905234, 0.6243117942484636], [77.5165112169761, 0.3776241715333666, 0.5677393009917185]], "r_squared_": 0.9854446787221776, "error_": 0.06273089533304849}
{"freq_range": [2.0, 80.0], "freq_res": 1.0, "aperiodic_params_": [0.35203000787036115, 1.1878107041245518], "gaussian_params_": [[9.174749054921802, 1.4301744784744839, 1.1377836760920375], [11.88134945513084, 0.6392527520989991, 0.9181821597988422], [18.403772890744076, 0.6765514435069291, 5.575036814509953], [65.44324710781082, 0.4371503318625491, 0.8834582799366808], [71.20976378484748, 0.36588240625784274, 1.1154193562133004], [77.12216646766235, 0.4839331592136715, 0.9911648928780783]], "peak_params_": [[9.174749054921802, 1.5811629183556035, 2.275567352184075], [11.88134945513084, 1.0492561185769975, 1.8363643195976844], [18.403772890744076, 0.6747793760876066, 11.150073629019905], [65.44324710781082, 0.3854520262613683, 1.7669165598733616], [71.20976378484748, 0.3594693978780088, 2.2308387124266007], [77.12216646766235, 0.48027166693861933, 1.9823297857561566]], "r_squared_": 0.9761665366079885, "error_": 0.0781824649550967}
{"freq_range": [2.0, 80.0], "freq_res": 1.0, "aperiodic_params_": [0.33056538275121916, 1.188298717718787], "gaussian_params_": [[9.246051285368605, 1.5191287625299155, 1.1228589837936473], [11.821131820411662, 0.5381971289146341, 0.7438382254957241], [18.001797861439794, 0.6569094647223737, 5.350971098621507], [56.19871493389242, 0.45320943635433786, 0.25000000000000006], [65.74078715941445, 0.3451799542090012, 1.1885302668216315], [71.11020514467116, 0.38756309500731356, 0.9046366303426485], [77.60696839303074, 0.4172556350748577, 1.6021266309056228]], "peak_params_": [[9.246051285368605, 1.643072153218635, 2.2457179675872947], [11.821131820411662, 0.9481201187200725, 1.4876764509914482], [18.001797861439794, 0.656909427643921, 10.701942197243014], [56.19871493389242, 0.33044933547876987, 0.5000000000000001], [65.74078715941445, 0.33706751358989306, 2.377060533643263], [71.11020514467116, 0.3848018373864295, 1.809273260685297], [77.60696839303074, 0.40488717084642456, 3.2042532618112456]], "r_squared_": 0.9795034417838214, "error_": 0.07343693132653663}
{"freq_range": [2.0, 80.0], "freq_res": 1.0, "aperiodic_params_": [-1.0286008352714733, 0.7912433941194761], "gaussian_params_": [[9.221072966556308, 1.0502134755970303, 0.7893678402863126], [13.547965400864056, 0.5200535427827149, 4.199481294523284], [48.4252775200007, 2.192046008468842, 0.29909084091686894], [59.97845715976423, 1.1921983146621649, 0.8773487477763143], [63.60635324532688, 0.8467555953103544, 1.1366996217016772], [67.34116497044441, 1.918541832807008, 0.25004386759493735], [68.50750077882996, 4.145472554794017, 0.2848367744536516], [75.90711053010627, 1.09168865211986, 2.1200138840237126]], "peak_params_": [[9.221072966556308, 1.2991357708519067, 1.5787356805726251], [13.547965400864056, 0.5170494657359184, 8.398962589046567], [48.4252775200007, 0.7976657323285643, 0.5981816818337379], [59.97845715976423, 1.1973599130952557, 1.7546974955526287], [63.60635324532688, 0.7975057581688025, 2.2733992434033543], [67.34116497044441, 0.7663328922111456, 0.5000877351898747], [68.50750077882996, 0.9352033042165913, 0.5696735489073032], [75.90711053010627, 1.0906412440007043, 4.240027768047425]], "r_squared_": 0.8714772922102653, "error_": 0.12251461364837107}
{"freq_range": [2.0, 80.0], "freq_res": 1.0, "aperiodic_params_": [-0.6489604793220737, 0.512750790127745], "gaussian_params_": [[9.512604225360192, 1.0873126769687667, 1.62115018088169], [30.973436422751803, 0.6105709617461451, 0.5088239777182566], [48.4709055476867, 4.700361161351706, 0.2516150096027796], [56.000719429599954, 0.472145356643202, 0.25002683379999713], [59.91285453274031, 0.9885366162024539, 0.6269102532033978], [63.565452168871, 0.7002745545336987, 0.2885638161237337], [71.54796540086404, 0.7951648591469176, 5.999999999999999]], "peak_params_": [[9.512604225360192, 1.0392658685277987, 3.24230036176338], [30.973436422751803, 0.6097394886448326, 1.0176479554365132], [48.4709055476867, 0.816085587016106, 0.5032300192055592], [56.000719429599954, 0.49983309668776044, 0.5000536675999943], [59.91285453274031, 1.1037914881139432, 1.2538205064067955], [63.565452168871, 0.5857609936818466, 0.5771276322474674], [71.54796540086404, 0.7929113884175517, 11.999999999999998]], "r_squared_": 0.5774234845800609, "error_": 0.1908522093569531}
{"freq_range": [2.0, 80.0], "freq_res": 1.0, "aperiodic_params_": [-0.5391188569716078, 0.7765603327176511], "gaussian_params_": [[9.2384493759232, 1.2157720631763993, 1.2524906218702816], [16.4411435768964, 0.3756263106961129, 5.149265164555923], [59.19148181340205, 0.5152698302850425, 2.453187123559053], [67.33483838576637, 1.0792138091075067, 0.849973393550191], [70.391115390122, 2.3601329226732264, 0.267459042627893], [74.0753283009727, 1.2655633773394492, 1.0275526988934847], [78.52453069346126, 2.369248088475685, 0.28324236815537585]], "peak_params_": [[9.2384493759232, 1.3261562313944895, 2.504981243740563], [16.4411435768964, 0.3742509436510699, 10.298530329111847], [59.19148181340205, 0.5137025844819216, 4.906374247118106], [67.33483838576637, 1.0018902949043162, 1.699946787100382], [70.391115390122, 0.8186078218252355, 0.534918085255786], [74.0753283009727, 1.2621672976326124, 2.0551053977869693], [78.52453069346126, 0.5790511371059806, 0.5664847363107517]], "r_squared_": 0.870130986560934, "error_": 0.12462924425517402}
{"freq_range": [2.0, 80.0], "freq_res": 1.0, "aperiodic_params_": [-0.48497894016474263, 0.5104851988442204], "gaussian_params_": [[9.362526218272839, 1.0998125373355174, 1.4275993884201241], [48.485116973774346, 2.475630476433187, 0.3107081551002277], [55.925731813668364, 0.8033719557595436, 0.25000011995568255], [60.13060649587376, 0.8050711598141727, 0.2504365958154284], [68.40518659644464, 0.7609089717623034, 3.265530687955583], [77.76606719228161, 1.284464893285532, 1.9600132959764205]], "peak_params_": [[9.362526218272839, 1.0649168201958539, 2.8551987768402483], [48.485116973774346, 0.731706644294262, 0.6214163102004554], [55.925731813668364, 0.7692523824035632, 0.5000002399113651], [60.13060649587376, 0.7304239501827507, 0.5008731916308568], [68.40518659644464, 0.7550792727976245, 6.531061375911166], [77.76606719228161, 1.285503858705768, 3.920026591952841]], "r_squared_": 0.6628780875819252, "error_": 0.17300558745725284}
