{"freq_range": [2.0, 80.0], "freq_res": 1.0, "aperiodic_params_": [-0.25244194890678995, 0.08022376685522005], "gaussian_params_": [[8.36553933861419, 0.7405226255799788, 1.1531496164898554]], "peak_params_": [[8.36553933861419, 0.70423646423365, 2.3062992329797107]], "r_squared_": 0.5340785031129094, "error_": 0.08058638072178244}
{"freq_range": [2.0, 80.0], "freq_res": 1.0, "aperiodic_params_": [-0.1680744788781243, 0.29019587107199646], "gaussian_params_": [[7.298560048043753, 0.605509429058233, 0.28427944071300043], [8.710874886643666, 0.7313158569359783, 1.0108290163794347], [18.902328106456867, 0.25440740818984253, 1.4627301928053627], [36.411163078296795, 0.1725006360844665, 1.445077554046463], [42.35361498362901, 0.1610607214389885, 3.390455357309254], [53.321647549109564, 0.14862828358344338, 2.4282178841983835], [57.41382169113802, 0.4700440392590956, 0.28921528688061027], [66.33928550821359, 0.09668201149738005, 5.999999928613952]], "peak_params_": [[7.298560048043753, 0.5234247561895837, 0.5685588814260009], [8.710874886643666, 0.7020043095146365, 2.0216580327588693], [18.902328106456867, 0.2538408735039468, 2.9254603856107253], [36.411163078296795, 0.19348187372412307, 2.890155108092926], [42.35361498362901, 0.16031320605506483, 6.780910714618508], [53.321647549109564, 0.15666068162376834, 4.856435768396767], [57.41382169113802, 0.2448660181346365, 0.5784305737612205], [66.33928550821359, 0.09652773717006013, 11.999999857227904]], "r_squared_": 0.8987239357090973, "error_": 0.041530413137864486}
{"freq_range": [2.0, 80.0], "freq_res": 1.0, "aperiodic_params_": [-0.004400848594689166, 0.341033953437449], "gaussian_params_": [[8.372257579399303, 0.76331240108414, 1.074751123260238]], "peak_params_": [[8.372257579399303, 0.718871467016791, 2.149502246520476]], "r_squared_": 0.8057154253297936, "error_": 0.07408806525392195}
{"freq_range": [2.0, 80.0], "freq_res": 1.0, "aperiodic_params_": [0.07569764611641101, 0.5252692539264605], "gaussian_params_": [[8.416400771067426, 0.8662897160835263, 1.191334999036984]], "peak_params_": [[8.416400771067426, 0.8149572919435992, 2.382669998073968]], "r_squared_": 0.8743072976959508, "error_": 0.07982042480334567}
{"freq_range": [2.0, 80.0], "freq_res": 1.0, "aperiodic_params_": [-0.20932405403661591, 0.12766981592050589], "gaussian_params_": [[8.26877241105171, 0.7516124335702076, 1.2950772520882794], [18.3099702148356, 0.22244670100253633, 2.1452202112369885], [68.44483975048436, 0.15935330748074109, 5.999999999999999]], "peak_params_": [[8.26877241105171, 0.7356015287860322, 2.590154504176559], [18.3099702148356, 0.22013661964094122, 4.290440422473977], [68.44483975048436, 0.15891594744243281, 11.999999999999998]], "r_squared_": 0.6212057636860278, "error_": 0.08259939451047828}
{"freq_range": [2.0, 80.0], "freq_res": 1.0, "aperiodic_params_": [0.012881575106997003, 0.5785944921071645], "gaussian_params_": [[7.383018528227428, 1.1364968514855844, 0.2627977295938829], [8.839585578090734, 0.6776310467836508, 1.0808633491317443], [22.3985710598809, 0.14999722318783018, 2.923996548940958], [47.48855208663928, 0.5384727737473419, 0.2500909163763911], [52.77931471884002, 0.16529883291731676, 5.999999999999999]], "peak_params_": [[7.383018528227428, 0.5521364838498518, 0.5255954591877658], [8.839585578090734, 0.6702132188451555, 2.1617266982634886], [22.3985710598809, 0.14861048227012075, 5.847993097881916], [47.48855208663928, 0.18383547240489762, 0.5001818327527822], [52.77931471884002, 0.16518705985392346, 11.999999999999998]], "r_squared_": 0.9427591771363006, "error_": 0.05021805387057426}
{"freq_range": [2.0, 80.0], "freq_res": 1.0, "aperiodic_params_": [0.5446868944944336, 1.070105259523611], "gaussian_params_": [[8.342964640270724, 0.8545028920548047, 1.133632862382929]], "peak_params_": [[8.342964640270724, 0.8162787492687147, 2.267265724765858]], "r_squared_": 0.9680912994908161, "error_": 0.06713666674233928}
{"freq_range": [2.0, 80.0], "freq_res": 1.0, "aperiodic_params_": [0.04828613698640376, 0.41434925216795415], "gaussian_params_": [[8.236006111823082, 0.8213211328930038, 1.0324382316577863], [22.322708832486054, 0.4372333628995333, 2.1863849678455254], [44.09557537400274, 0.31286811450885654, 4.108342542478769]], "peak_params_": [[8.236006111823082, 0.8001404331889912, 2.0648764633155725], [22.322708832486054, 0.4324966885306357, 4.372769935691051], [44.09557537400274, 0.3127834636693921, 8.216685084957538]], "r_squared_": 0.8705511551992894, "error_": 0.07282144793304375}
{"freq_range": [2.0, 80.0], "freq_res": 1.0, "aperiodic_params_": [0.15819008265391488, 0.5171165512758792], "gaussian_params_": [[8.279651849001343, 0.8834533375356927, 1.160396796015394]], "peak_params_": [[8.279651849001343, 0.8581670347286408, 2.320793592030788]], "r_squared_": 0.8908124640512087, "error_": 0.06639676645691445}
{"freq_range": [2.0, 80.0], "freq_res": 1.0, "aperiodic_params_": [0.4520287365415948, 0.9404058747595837], "gaussian_params_": [[8.353058323754858, 0.9397231623330402, 1.2904409518285107], [15.39743079475647, 0.2494788679892253, 2.586214949851907], [18.379272224955347, 0.42295245980636775, 0.2680156073736242], [21.555457908766687, 0.23508184462034618, 1.1322863524064326], [72.54285125456347, 0.1846006519471457, 5.999999999999999], [78.89228802431751, 0.1648599901095174, 0.47394589640121443]], "peak_params_": [[8.353058323754858, 0.9093750227248082, 2.5808819036570214], [15.39743079475647, 0.2465520701194474, 5.172429899703814], [18.379272224955347, 0.30745629379329703, 0.5360312147472484], [21.555457908766687, 0.22723268811083963, 2.264572704812865], [72.54285125456347, 0.18406561266819055, 11.999999999999998], [78.89228802431751, 0.2641082697248063, 0.9478917928024289]], "r_squared_": 0.979442599291329, "error_": 0.046491213105376045}
{"freq_range": [2.0, 80.0], "freq_res": 1.0, "aperiodic_params_": [0.5112245619709456, 1.1094196082004342], "gaussian_params_": [[8.330814682586507, 0.9684712404889576, 1.3330638253614389], [16.6529829301346, 0.3407837256361533, 4.27921574278082], [22.590190826444296, 0.4290176405213198, 0.26687952597593345], [74.54796540086404, 0.1286089270958001, 5.999999999999999]], "peak_params_": [[8.330814682586507, 0.9832201155150083, 2.6661276507228777], [16.6529829301346, 0.33966503986911, 8.55843148556164], [22.590190826444296, 0.24540423470977213, 0.5337590519518669], [74.54796540086404, 0.1282444536794869, 11.999999999999998]], "r_squared_": 0.9874793550646477, "error_": 0.0472725981110208}
{"freq_range": [2.0, 80.0], "freq_res": 1.0, "aperiodic_params_": [0.3402052637898138, 0.9303518160772157], "gaussian_params_": [[8.355556150896472, 0.9395090984119199, 1.3905964384684877], [17.362280066755567, 0.32659932639828343, 4.008854976831674], [63.28631773530234, 0.1898443920894887, 0.55770967790151]], "peak_params_": [[8.355556150896472, 0.9306587982261272, 2.7811928769369754], [17.362280066755567, 0.3252684251239554, 8.017709953663347], [63.28631773530234, 0.1664049962418861, 1.11541935580302]], "r_squared_": 0.9782954449333489, "error_": 0.05645488797713539}
{"freq_range": [2.0, 80.0], "freq_res": 1.0, "aperiodic_params_": [0.33889831646095264, 0.928143215852316], "gaussian_params_": [[8.344120599476097, 0.9349546433937231, 1.391672644477428], [17.2715917200875, 0.3271255228744459, 4.1150108094956455], [63.23745288847652, 0.1908397720067163, 0.5527328393685106]], "peak_params_": [[8.344120599476097, 0.9326482055163592, 2.783345288954856], [17.2715917200875, 0.3264138172607808, 8.230021618991291], [63.23745288847652, 0.1740176953524859, 1.1054656787370212]], "r_squared_": 0.9789452221348856, "error_": 0.05435887222041884}
{"freq_range": [2.0, 80.0], "freq_res": 1.0, "aperiodic_params_": [0.35481441987180556, 0.9279702175759996], "gaussian_params_": [[8.511659288647543, 0.7120931178834516, 1.4136085628873756], [65.45203459913596, 0.17403840738689738, 5.999999999999999]], "peak_params_": [[8.511659288647543, 0.6708452476890286, 2.827217125774751], [65.45203459913596, 0.17354518833638166, 11.999999999999998]], "r_squared_": 0.9490129543370577, "error_": 0.07121279906599172}
{"freq_range": [2.0, 80.0], "freq_res": 1.0, "aperiodic_params_": [0.31414409578280433, 0.9225320389280011], "gaussian_params_": [[8.496934171510844, 0.7108296685280208, 1.4045846483547528], [18.938870561683647, 0.19458826238781726, 3.0110775902627256], [58.45203459913595, 0.14006335188066454, 5.999999999999999], [70.54796540086404, 0.11837843164018223, 5.999999999949697]], "peak_params_": [[8.496934171510844, 0.66797076603328, 2.8091692967095057], [18.938870561683647, 0.1945481666520138, 6.022155180525451], [58.45203459913595, 0.15295707051848018, 11.999999999999998], [70.54796540086404, 0.13376822685152723, 11.999999999899394]], "r_squared_": 0.9672189786685003, "error_": 0.05261309282246482}
{"freq_range": [2.0, 80.0], "freq_res": 1.0, "aperiodic_params_": [0.30536682363210077, 0.9744495607461208], "gaussian_params_": [[8.43139420474102, 1.0719615612305464, 1.2614116644787723]], "peak_params_": [[8.43139420474102, 1.0110713713920692, 2.5228233289575446]], "r_squared_": 0.9534946814740656, "error_": 0.07744122566676645}
{"freq_range": [2.0, 80.0], "freq_res": 1.0, "aperiodic_params_": [0.24907173589974596, 0.8428517796614085], "gaussian_params_": [[8.259953938723521, 0.9944082471080368, 1.1074193660422014], [16.756593289421307, 0.2557209607276414, 4.058756097365116]], "peak_params_": [[8.259953938723521, 0.9923327468860595, 2.2148387320844027], [16.756593289421307, 0.25526152465331153, 8.117512194730232]], "r_squared_": 0.9680627659155685, "error_": 0.058824874704449075}
{"freq_range": [2.0, 80.0], "freq_res": 1.0, "aperiodic_params_": [0.3287558317794304, 0.7954734902506176], "gaussian_params_": [[8.218059378017, 0.9504142258340196, 1.131622433445102], [15.573604458906877, 0.2336133427625337, 3.0157568600971385], [21.7600296342364, 0.24559082662861334, 1.2102033416066444]], "peak_params_": [[8.218059378017, 0.9429082979805039, 2.263244866890204], [15.573604458906877, 0.23129286058038095, 6.031513720194277], [21.7600296342364, 0.2649340322952785, 2.420406683213289]], "r_squared_": 0.9670559558174453, "error_": 0.05796865731362475}
{"freq_range": [2.0, 80.0], "freq_res": 1.0, "aperiodic_params_": [0.6186067062911941, 1.1615091423608281], "gaussian_params_": [[8.264202297752627, 0.9884214197697949, 1.2844321366655302], [16.195716448475487, 0.365254403828871, 3.91938081492802], [22.248246731124034, 0.17964806305895653, 1.0861470453427262], [75.09563364283792, 0.15072346678874793, 5.999999999999999], [79.49729839102206, 0.6555237281315872, 0.2654406249054718]], "peak_params_": [[8.264202297752627, 1.0087604052961443, 2.5688642733310605], [16.195716448475487, 0.36479932064555387, 7.83876162985604], [22.248246731124034, 0.29701816694780614, 2.1722940906854524], [75.09563364283792, 0.15070432236962272, 11.999999999999998], [79.49729839102206, 0.23531207641073082, 0.5308812498109436]], "r_squared_": 0.9869806433157855, "error_": 0.04994828481135937}
{"freq_range": [2.0, 80.0], "freq_res": 1.0, "aperiodic_params_": [0.6040545022007173, 1.1761497102756264], "gaussian_params_": [[8.292476829939439, 0.9525478676911501, 1.2899267584948422], [16.929801893140368, 0.37603135869017185, 4.986813381237928]], "peak_params_": [[8.292476829939439, 1.004045715217853, 2.5798535169896843], [16.929801893140368, 0.37599410445022796, 9.973626762475856]], "r_squared_": 0.9865425327659161, "error_": 0.055265240615210674}
{"freq_range": [2.0, 80.0], "freq_res": 1.0, "aperiodic_params_": [0.8319889294723, 1.3140105611038309], "gaussian_params_": [[8.350439352725276, 0.9068789624008383, 1.2708709657037587], [17.562202024565266, 0.31836493122159293, 4.267469783968032], [63.12437509703303, 0.19188296188193574, 0.6480631833000141], [73.3878058110999, 0.2455996771864378, 0.5723045034146298], [77.61411344692125, 0.21844841142214788, 1.742613889840759]], "peak_params_": [[8.350439352725276, 0.8989104372567677, 2.5417419314075174], [17.562202024565266, 0.3166939959752272, 8.534939567936064], [63.12437509703303, 0.18838153006265146, 1.2961263666000282], [73.3878058110999, 0.20177880782793078, 1.1446090068292596], [77.61411344692125, 0.2131575951447895, 3.485227779681518]], "r_squared_": 0.9885579944073624, "error_": 0.049345273981801496}
{"freq_range": [2.0, 80.0], "freq_res": 1.0, "aperiodic_params_": [0.2234160721023334, 0.7322584238411782], "gaussian_params_": [[8.307824802628014, 0.8814852589238862, 1.3449010466862585], [16.102313496127998, 0.23549943591978664, 2.9066959497863905], [17.622916271789517, 0.2680697607638319, 0.41060348038580047], [20.34429269531572, 0.3201849937957405, 0.3013651513552155], [22.369232790757735, 0.18882789682643855, 0.9881604433231005], [46.09368030163004, 0.17311653999078486, 1.1365734108968435], [70.53487519580229, 0.6827464748466613, 0.288543554855202]], "peak_params_": [[8.307824802628014, 0.8635347831127286, 2.689802093372517], [16.102313496127998, 0.23546227616212134, 5.813391899572781], [17.622916271789517, 0.36614439627457485, 0.8212069607716009], [20.34429269531572, 0.2732173784010235, 0.602730302710431], [22.369232790757735, 0.2061583418334404, 1.976320886646201], [46.09368030163004, 0.17252949316368438, 2.273146821793687], [70.53487519580229, 0.1862133339274531, 0.577087109710404]], "r_squared_": 0.9774084425996958, "error_": 0.043762485841310754}
{"freq_range": [2.0, 80.0], "freq_res": 1.0, "aperiodic_params_": [0.2690007948002839, 0.9597173797389663], "gaussian_params_": [[7.4390913456858945, 0.89289748267197, 0.313609372206894], [8.866261958537812, 0.7472202527787504, 1.5304170743985086], [13.947690109139254, 0.13141796459108207, 0.25000690471310977], [16.98016123327379, 0.32726632678070033, 2.6081239427730862], [22.57929094474308, 0.1661130325838024, 1.065964262555937]], "peak_params_": [[7.4390913456858945, 0.6905282529448197, 0.627218744413788], [8.866261958537812, 0.7474101041387801, 3.060834148797017], [13.947690109139254, 0.3016311219683725, 0.5000138094262195], [16.98016123327379, 0.32725759549097755, 5.2162478855461725], [22.57929094474308, 0.17647390519027517, 2.131928525111874]], "r_squared_": 0.9829659567449501, "error_": 0.049926565200503245}
{"freq_range": [2.0, 80.0], "freq_res": 1.0, "aperiodic_params_": [0.10340787658939032, 0.5756635068474205], "gaussian_params_": [[3.2620103803982823, 0.2533043863423655, 0.7571834603412894], [8.23285008488177, 0.7742935118170654, 1.086012624498033], [21.145668243900023, 0.2886936058171509, 2.407916170824622], [41.2764288530383, 0.18222904600677292, 4.07727234374639], [46.4297185263661, 0.5545793327612805, 0.2645698872003214], [59.07553669010507, 0.13794869051441433, 5.999999999999999]], "peak_params_": [[3.2620103803982823, 0.2385912860863344, 1.5143669206825787], [8.23285008488177, 0.7566991066988001, 2.172025248996066], [21.145668243900023, 0.28816659804136396, 4.815832341649244], [41.2764288530383, 0.18328627399902064, 8.15454468749278], [46.4297185263661, 0.25427484364174324, 0.5291397744006427], [59.07553669010507, 0.13795212928889644, 11.999999999999998]], "r_squared_": 0.9464943076051562, "error_": 0.05391918725310719}
{"freq_range": [2.0, 80.0], "freq_res": 1.0, "aperiodic_params_": [0.1434013407978517, 0.9154200473838225], "gaussian_params_": [[8.616151360272804, 1.055079649841367, 1.454588788025385]], "peak_params_": [[8.616151360272804, 1.018975593643104, 2.90917757605077]], "r_squared_": 0.941733882769059, "error_": 0.08854670524346739}
{"freq_range": [2.0, 80.0], "freq_res": 1.0, "aperiodic_params_": [0.0747451274162685, 0.43983960225917385], "gaussian_params_": [[8.33524499092715, 0.9013812358434946, 1.076120615136526], [16.088049964437612, 0.20368738879878917, 1.2803459118237521]], "peak_params_": [[8.33524499092715, 0.8586852965767251, 2.152241230273052], [16.088049964437612, 0.20320630084264613, 2.5606918236475043]], "r_squared_": 0.939081491504445, "error_": 0.05073606702268035}
{"freq_range": [2.0, 80.0], "freq_res": 1.0, "aperiodic_params_": [0.3644777679654238, 0.9566474473292422], "gaussian_params_": [[8.278025978093126, 1.0970698366618052, 1.1938783315118342], [16.232542807342476, 0.38997534517708654, 4.308729478967376]], "peak_params_": [[8.278025978093126, 1.130572379768781, 2.3877566630236684], [16.232542807342476, 0.3894078036847407, 8.617458957934751]], "r_squared_": 0.97881630812662, "error_": 0.06181151849229379}
{"freq_range": [2.0, 80.0], "freq_res": 1.0, "aperiodic_params_": [0.6483801674929661, 1.246796094615971], "gaussian_params_": [[8.319233437724339, 1.1270097560254349, 1.3169836584301264], [15.559216313554257, 0.4641504246334574, 3.05440118120476], [22.936542885159657, 0.1915855327355632, 2.3977665218885624], [76.82940356922224, 0.1656537400968908, 5.999999999998372]], "peak_params_": [[8.319233437724339, 1.1160911251623544, 2.633967316860253], [15.559216313554257, 0.4622602733369028, 6.10880236240952], [22.936542885159657, 0.21539630481710437, 4.795533043777125], [76.82940356922224, 0.16558679467846882, 11.999999999996744]], "r_squared_": 0.9898890296598927, "error_": 0.04761536649740605}
{"freq_range": [2.0, 80.0], "freq_res": 1.0, "aperiodic_params_": [0.8923509191007034, 1.3144974525714515], "gaussian_params_": [[8.239259990944644, 0.9370524244275829, 1.2967502037778926], [15.927647192037558, 0.39534345436941964, 4.177024548478974], [23.099017074655258, 0.1869930871026248, 0.6697341644305108], [26.330532015114365, 0.25938427835004707, 1.1316749108174875], [42.06360243544229, 0.19142467827641546, 0.2500471333207055]], "peak_params_": [[8.239259990944644, 0.9865189525264515, 2.5935004075557853], [15.927647192037558, 0.39528416536080574, 8.354049096957947], [23.099017074655258, 0.2826629694798869, 1.3394683288610216], [26.330532015114365, 0.2701627507924541, 2.263349821634975], [42.06360243544229, 0.1853311925632828, 0.500094266641411]], "r_squared_": 0.9906600279816054, "error_": 0.048268277105307025}
{"freq_range": [2.0, 80.0], "freq_res": 1.0, "aperiodic_params_": [0.5495448981574369, 1.1799623319644281], "gaussian_params_": [[8.34383936560457, 1.1143686993982052, 1.3717931016047804], [16.001040880045178, 0.4362650495537196, 3.427977399989723], [23.75186701533476, 0.17959807116042073, 2.1084566779418625]], "peak_params_": [[8.34383936560457, 1.1085352867702858, 2.743586203209561], [16.001040880045178, 0.4364737196330773, 6.855954799979446], [23.75186701533476, 0.2070270027622766, 4.216913355883725]], "r_squared_": 0.9888950521251901, "error_": 0.05250243033612126}
{"freq_range": [2.0, 80.0], "freq_res": 1.0, "aperiodic_params_": [0.3219681586337095, 1.0197980496702457], "gaussian_params_": [[8.40350463723285, 1.1414450543796784, 1.4400753956870542], [16.700828457856968, 0.47133849837581887, 3.5967653973503353], [22.86621879383215, 0.23108038277443937, 0.7003217750946106]], "peak_params_": [[8.40350463723285, 1.1227757311603956, 2.8801507913741085], [16.700828457856968, 0.46971084197749813, 7.193530794700671], [22.86621879383215, 0.32859698502992507, 1.4006435501892212]], "r_squared_": 0.9888461729113154, "error_": 0.047711750458405415}
{"freq_range": [2.0, 80.0], "freq_res": 1.0, "aperiodic_params_": [0.2928906495215264, 0.9066027309614739], "gaussian_params_": [[8.490095604114686, 0.9338788061640129, 1.463391648497588], [16.834453508318752, 0.2850723062649088, 3.4071164022364413], [60.452034601115834, 0.14273442365400799, 5.999999999999999], [69.37136475998842, 0.14378937220990393, 1.1385262939961749], [78.61684511766443, 0.17832148088203625, 5.9999999999991465]], "peak_params_": [[8.490095604114686, 0.8928335491769718, 2.926783296995176], [16.834453508318752, 0.2847360425356418, 6.814232804472883], [60.452034601115834, 0.14377748101806387, 11.999999999999998], [69.37136475998842, 0.23743388007605715, 2.2770525879923498], [78.61684511766443, 0.17915886813540727, 11.999999999998293]], "r_squared_": 0.9811585486458703, "error_": 0.04710756645936116}
{"freq_range": [2.0, 80.0], "freq_res": 1.0, "aperiodic_params_": [0.5920708789757181, 1.1694403008203653], "gaussian_params_": [[8.6778034472893, 0.8998281624012213, 1.406986211501268], [16.24432497913668, 0.25485696822132364, 1.7437271235071943], [70.79713594426785, 0.22844839200900485, 5.999999999999999]], "peak_params_": [[8.6778034472893, 0.8765868597323537, 2.813972423002536], [16.24432497913668, 0.25236863290826217, 3.4874542470143886], [70.79713594426785, 0.22831785258099546, 11.999999999999998]], "r_squared_": 0.966990175843836, "error_": 0.0722631322493103}
{"freq_range": [2.0, 80.0], "freq_res": 1.0, "aperiodic_params_": [-0.008818195899187984, 0.919297830128508], "gaussian_params_": [[8.538963411017985, 1.0562929144156676, 1.2372832024960578], [13.368699163739015, 0.333914998337794, 3.8726576923139957], [19.075627155208082, 0.21838871907978216, 0.4910408155786261]], "peak_params_": [[8.538963411017985, 1.1621745903857248, 2.4745664049921157], [13.368699163739015, 0.3339934083119862, 7.745315384627991], [19.075627155208082, 0.33182164941707604, 0.9820816311572522]], "r_squared_": 0.9618369097269688, "error_": 0.0773710541102729}
{"freq_range": [2.0, 80.0], "freq_res": 1.0, "aperiodic_params_": [0.09169705264516585, 0.732289466070452], "gaussian_params_": [[8.498212046670854, 1.1575404810148522, 1.2900081709894913], [15.485137339535488, 0.3735300463047795, 2.66747944613092], [18.71341083547119, 0.2683367621353264, 0.45387521396425357]], "peak_params_": [[8.498212046670854, 1.0816395952771412, 2.5800163419789826], [15.485137339535488, 0.3674067346896014, 5.33495889226184], [18.71341083547119, 0.37662233841643283, 0.9077504279285071]], "r_squared_": 0.9582295711759717, "error_": 0.07224893629131884}
{"freq_range": [2.0, 80.0], "freq_res": 1.0, "aperiodic_params_": [0.4803802740329176, 1.1262893209402045], "gaussian_params_": [[8.45803542288503, 1.2776628093220515, 1.3412180248541357], [16.127477681574618, 0.5611901582355099, 3.481273707767194]], "peak_params_": [[8.45803542288503, 1.2420634286602101, 2.6824360497082713], [16.127477681574618, 0.5608142120347386, 6.962547415534388]], "r_squared_": 0.986166430969692, "error_": 0.05952076005169317}
{"freq_range": [2.0, 80.0], "freq_res": 1.0, "aperiodic_params_": [0.596108575692538, 1.248902122238908], "gaussian_params_": [[8.422253520224569, 1.2755572588094322, 1.3348243331840557], [15.837770987886293, 0.5392824380110784, 3.4096284070097993]], "peak_params_": [[8.422253520224569, 1.2517109756125866, 2.6696486663681114], [15.837770987886293, 0.5386724907733262, 6.819256814019599]], "r_squared_": 0.9879005378651748, "error_": 0.05880520978205856}
{"freq_range": [2.0, 80.0], "freq_res": 1.0, "aperiodic_params_": [0.6207910088462091, 1.2526255616953916], "gaussian_params_": [[8.382173009226719, 1.1980476806330511, 1.280889573886778], [15.624092853758686, 0.4811805465767615, 4.478503032085707]], "peak_params_": [[8.382173009226719, 1.2588698293597558, 2.561779147773556], [15.624092853758686, 0.4794885387564709, 8.957006064171415]], "r_squared_": 0.9857852792237162, "error_": 0.06261083022125853}
{"freq_range": [2.0, 80.0], "freq_res": 1.0, "aperiodic_params_": [0.5136726147815093, 1.2052363594740259], "gaussian_params_": [[8.433086727629073, 1.2686099857258402, 1.352435896832629], [16.32017025354775, 0.48470357385203183, 4.311937069351528]], "peak_params_": [[8.433086727629073, 1.2805376848420331, 2.704871793665258], [16.32017025354775, 0.48336944097154677, 8.623874138703057]], "r_squared_": 0.9888856879698509, "error_": 0.05370466978208035}
{"freq_range": [2.0, 80.0], "freq_res": 1.0, "aperiodic_params_": [0.38594621177752314, 1.107347064015001], "gaussian_params_": [[8.547507114748367, 1.3430254785661826, 1.4438805696443016], [16.697663156023285, 0.5465201813963366, 3.7797497859658074], [23.03544329712588, 0.24316497671083748, 0.6639823762643782]], "peak_params_": [[8.547507114748367, 1.3473716978617347, 2.887761139288603], [16.697663156023285, 0.5447746579816898, 7.559499571931615], [23.03544329712588, 0.37892938255276976, 1.3279647525287563]], "r_squared_": 0.9913123549120654, "error_": 0.04676005689447229}
{"freq_range": [2.0, 80.0], "freq_res": 1.0, "aperiodic_params_": [0.2403956207556666, 0.9594602156429626], "gaussian_params_": [[8.615638863849265, 1.264783361386409, 1.372686889524048], [17.111409895543954, 0.4307735471903967, 4.105836717806559]], "peak_params_": [[8.615638863849265, 1.2773594272918396, 2.745373779048096], [17.111409895543954, 0.4306150009904064, 8.211673435613118]], "r_squared_": 0.9834688419756402, "error_": 0.05454990053573328}
{"freq_range": [2.0, 80.0], "freq_res": 1.0, "aperiodic_params_": [0.2404548717119546, 0.9309077522748855], "gaussian_params_": [[8.820977855042036, 1.055664312458318, 1.3743562999971883], [17.220064817555503, 0.20950272088508348, 3.310649818521615], [62.09593080172811, 0.21117586094314186, 5.999999999999999]], "peak_params_": [[8.820977855042036, 1.0563514326074093, 2.7487125999943767], [17.220064817555503, 0.20904040954415448, 6.62129963704323], [62.09593080172811, 0.2111488711118057, 11.999999999999998]], "r_squared_": 0.9492500262124727, "error_": 0.07930341567879433}
{"freq_range": [2.0, 80.0], "freq_res": 1.0, "aperiodic_params_": [0.26319836197823315, 1.1554309238195144], "gaussian_params_": [[8.65203929648007, 1.13372485638809, 1.2605716519613726], [13.990348458701787, 0.38499648158461364, 3.67026590385788], [19.10490101398853, 0.23739997310897787, 0.4960228454976309], [53.073858981031364, 0.12511545347331002, 0.25017902584430796], [60.59626429602542, 0.17065377523785796, 5.999999999998246], [67.91826206711072, 0.09934736607614947, 0.8952025647703904], [76.54796540086404, 0.23599893834873698, 5.999999999999999]], "peak_params_": [[8.65203929648007, 1.2441076740895312, 2.521143303922745], [13.990348458701787, 0.3851351535867745, 7.34053180771576], [19.10490101398853, 0.38382175908822225, 0.9920456909952619], [53.073858981031364, 0.19645670484967437, 0.5003580516886159], [60.59626429602542, 0.17848595676987067, 11.999999999996492], [67.91826206711072, 0.26417876173960764, 1.7904051295407808], [76.54796540086404, 0.23939498491475963, 11.999999999999998]], "r_squared_": 0.9866599859608357, "error_": 0.045458850361491554}
{"freq_range": [2.0, 80.0], "freq_res": 1.0, "aperiodic_params_": [0.27755552168432385, 1.17081298841445], "gaussian_params_": [[8.666955819663967, 1.132347881427382, 1.2876086866470882], [14.38006547646244, 0.38779629112737146, 3.861965517696088], [18.991536080892917, 0.2188836301273836, 0.397646657145146], [48.38243709874379, 0.5528102115768464, 0.2566113065364472], [49.907787220484394, 0.17825718294418563, 0.4695729916855762], [53.0710839848489, 0.18130674643718434, 0.5023259899580759], [55.58248978082492, 0.6673846511743348, 0.25480834947593856], [60.949088951089, 0.16857454629625723, 4.292996811974068], [73.0959308017281, 0.26774564533875345, 5.999999999999999]], "peak_params_": [[8.666955819663967, 1.2420520829482355, 2.5752173732941763], [14.38006547646244, 0.38613617519147136, 7.723931035392176], [18.991536080892917, 0.4084413540483489, 0.795293314290292], [48.38243709874379, 0.1839551213571975, 0.5132226130728944], [49.907787220484394, 0.18153588856160585, 0.9391459833711524], [53.0710839848489, 0.21084064338123376, 1.0046519799161517], [55.58248978082492, 0.2656932989741423, 0.5096166989518771], [60.949088951089, 0.20365327192091898, 8.585993623948136], [73.0959308017281, 0.2709901251379796, 11.999999999999998]], "r_squared_": 0.9856359161104264, "error_": 0.04668768058038179}
{"freq_range": [2.0, 80.0], "freq_res": 1.0, "aperiodic_params_": [0.5691306986734507, 1.252327409830332], "gaussian_params_": [[8.476275144697677, 1.3366950863712632, 1.2158198040728394], [10.512107210716122, 0.6934325937434799, 0.30472689243927303], [12.684248851696875, 0.1431801337711378, 0.48122399040348474], [16.136812642914826, 0.5588315682652474, 3.4469201553960933]], "peak_params_": [[8.476275144697677, 1.2724244442024406, 2.431639608145679], [10.512107210716122, 0.5318952199107945, 0.6094537848785461], [12.684248851696875, 0.48612701101046896, 0.9624479808069695], [16.136812642914826, 0.5583915572697871, 6.893840310792187]], "r_squared_": 0.9900532430702405, "error_": 0.05339142291180299}
{"freq_range": [2.0, 80.0], "freq_res": 1.0, "aperiodic_params_": [0.6258931342392354, 1.297338942487854], "gaussian_params_": [[8.538324139364905, 1.3330695793823018, 1.3250299054623538], [15.686788158823818, 0.5496654306403655, 3.8805847871169963]], "peak_params_": [[8.538324139364905, 1.3791081530847766, 2.6500598109247075], [15.686788158823818, 0.5478781151958865, 7.761169574233993]], "r_squared_": 0.9900637385782863, "error_": 0.05312483524528601}
{"freq_range": [2.0, 80.0], "freq_res": 1.0, "aperiodic_params_": [0.5250875107346161, 1.2538941409949187], "gaussian_params_": [[8.560146267009195, 1.4210258966565212, 1.346974760667578], [16.0898666110585, 0.5660180924263568, 4.1997205248193294]], "peak_params_": [[8.560146267009195, 1.483381481616402, 2.693949521335156], [16.0898666110585, 0.5658888590370496, 8.399441049638659]], "r_squared_": 0.9896543968878218, "error_": 0.05492670566125051}
{"freq_range": [2.0, 80.0], "freq_res": 1.0, "aperiodic_params_": [0.3461471564808815, 1.1985651342737726], "gaussian_params_": [[8.65012289915584, 1.4338204820269371, 1.329790026527098], [16.67682641357316, 0.5525363815935727, 4.528803656755444]], "peak_params_": [[8.65012289915584, 1.516384976685931, 2.659580053054196], [16.67682641357316, 0.5511313644048335, 9.057607313510887]], "r_squared_": 0.9904633012902014, "error_": 0.04967639017599855}
{"freq_range": [2.0, 80.0], "freq_res": 1.0, "aperiodic_params_": [0.2758334707081885, 1.1955834716796545], "gaussian_params_": [[8.725119843869429, 1.403700850400308, 1.3367314959160095], [16.52125462121745, 0.5490928340659433, 4.664810531561046], [57.530928333792765, 0.8430192553126635, 0.2657820686510356]], "peak_params_": [[8.725119843869429, 1.524006310864442, 2.673462991832019], [16.52125462121745, 0.5462087171076923, 9.329621063122092], [57.530928333792765, 0.17761192712067575, 0.5315641373020712]], "r_squared_": 0.9908961255774935, "error_": 0.04985359050633075}
{"freq_range": [2.0, 80.0], "freq_res": 1.0, "aperiodic_params_": [0.2670298244185523, 1.1878098311613936], "gaussian_params_": [[8.728946314260032, 1.394630305784655, 1.3327419815803696], [16.436931474083337, 0.5436307874620465, 4.7195912466134855]], "peak_params_": [[8.728946314260032, 1.523164494989874, 2.665483963160739], [16.436931474083337, 0.5413065951861022, 9.439182493226971]], "r_squared_": 0.9899858076715342, "error_": 0.053511732050142695}
{"freq_range": [2.0, 80.0], "freq_res": 1.0, "aperiodic_params_": [0.28900366414292517, 1.2328859508764336], "gaussian_params_": [[8.804562350599445, 1.0266785831878011, 1.241914076512949], [14.910756466843372, 0.46217943190984523, 3.5964116040770744], [58.264570618752956, 0.27798175072663317, 0.43290632889099145], [72.96895214047169, 0.2669248825863743, 5.999999999999999]], "peak_params_": [[8.804562350599445, 1.133791409079211, 2.483828153025898], [14.910756466843372, 0.462041206767402, 7.192823208154149], [58.264570618752956, 0.2425078068204487, 0.8658126577819829], [72.96895214047169, 0.26692130889547383, 11.999999999999998]], "r_squared_": 0.9859149526277579, "error_": 0.05170713132157396}
{"freq_range": [2.0, 80.0], "freq_res": 1.0, "aperiodic_params_": [0.6025608270315204, 1.3221194326403793], "gaussian_params_": [[8.740696279780074, 1.1560968753294891, 1.1414824241457986], [11.196166063777373, 0.17139882418991897, 2.0490122800283364], [16.012070900406197, 0.4823463468771374, 4.0908086873055955], [74.45203465966318, 0.1481178492183607, 5.999999999999968], [79.32990371506885, 0.4893946762383608, 0.2508065676874733]], "peak_params_": [[8.740696279780074, 1.334160583881096, 2.282964848291597], [11.196166063777373, 0.5613799645551323, 4.098024560056673], [16.012070900406197, 0.49332055813676734, 8.181617374611191], [74.45203465966318, 0.1476980880542076, 11.999999999999936], [79.32990371506885, 0.3171729880204561, 0.5016131353749466]], "r_squared_": 0.9894535957644807, "error_": 0.052442504098303394}
{"freq_range": [2.0, 80.0], "freq_res": 1.0, "aperiodic_params_": [0.6971159535463509, 1.3418990954823966], "gaussian_params_": [[8.743491604068739, 1.2258672066046201, 1.316383342683102], [15.831899764011611, 0.49215720288397513, 3.7769229786105374], [24.095930801615353, 0.05546368636308814, 2.040127507747025], [76.70170898767118, 0.1986256628766261, 1.035338167405697], [79.49288716658828, 0.819644776662808, 0.28877115132090053]], "peak_params_": [[8.743491604068739, 1.2986674513521548, 2.632766685366204], [15.831899764011611, 0.4916914054378416, 7.553845957221075], [24.095930801615353, 0.10288229616614042, 4.08025501549405], [76.70170898767118, 0.19055070944400088, 2.070676334811394], [79.49288716658828, 0.20789282317113544, 0.5775423026418011]], "r_squared_": 0.9917996113963289, "error_": 0.046920311242305515}
{"freq_range": [2.0, 80.0], "freq_res": 1.0, "aperiodic_params_": [0.5284740245538241, 1.2972715627126286], "gaussian_params_": [[8.769059726817334, 1.3520475514015637, 1.3718433438385091], [15.757726967042823, 0.567046096276146, 3.5664058418006266], [24.095930801726272, 0.07389745944247961, 2.6047307628898144]], "peak_params_": [[8.769059726817334, 1.4272088386056705, 2.7436866876770183], [15.757726967042823, 0.5663304500021852, 7.132811683601253], [24.095930801726272, 0.11309454614631465, 5.209461525779629]], "r_squared_": 0.9892920894639541, "error_": 0.060930880138369684}
{"freq_range": [2.0, 80.0], "freq_res": 1.0, "aperiodic_params_": [0.44761189495726517, 1.2379255299601009], "gaussian_params_": [[8.745635303206575, 1.453435800000585, 1.3566345881717476], [12.869984979355197, 0.12562803569849862, 0.2516639460047833], [14.996684920625334, 0.05932746637646138, 0.2500049835036389], [16.561643784185662, 0.551210135561793, 4.242508789894502]], "peak_params_": [[8.745635303206575, 1.5406982798858124, 2.7132691763434953], [12.869984979355197, 0.5080760496988078, 0.5033278920095666], [14.996684920625334, 0.5744617766945697, 0.5000099670072778], [16.561643784185662, 0.5482756265206071, 8.485017579789004]], "r_squared_": 0.9881493527811742, "error_": 0.05707060663211033}
{"freq_range": [2.0, 80.0], "freq_res": 1.0, "aperiodic_params_": [0.5285656774411412, 1.3379566381580557], "gaussian_params_": [[8.6155036976759, 1.5180939643075728, 1.105879598767155], [10.553773600401318, 1.034769975709303, 0.32576827292710364], [12.581298027803653, 0.2858629634866542, 0.8752470851966473], [17.113813213318164, 0.6165194981319639, 3.6654919909399983], [26.66515556302354, 0.4487247503343102, 0.25001161470003364]], "peak_params_": [[8.6155036976759, 1.482338215935766, 2.21175919753431], [10.553773600401318, 0.76276967463983, 0.6515365458542073], [12.581298027803653, 0.5839641217994775, 1.7504941703932946], [17.113813213318164, 0.6162232122385192, 7.330983981879997], [26.66515556302354, 0.19923842979647866, 0.5000232294000673]], "r_squared_": 0.9919477060405975, "error_": 0.05076984233722623}
{"freq_range": [2.0, 80.0], "freq_res": 1.0, "aperiodic_params_": [0.19709383681205286, 1.317872033751376], "gaussian_params_": [[8.797738901340539, 1.2227923191038614, 1.308592977954733], [16.02007727289523, 0.6017931963787512, 4.606399859711261]], "peak_params_": [[8.797738901340539, 1.3966887398327676, 2.617185955909466], [16.02007727289523, 0.601787803493759, 9.212799719422522]], "r_squared_": 0.9874342864681515, "error_": 0.06465979646796881}
{"freq_range": [2.0, 80.0], "freq_res": 1.0, "aperiodic_params_": [0.5552194856182103, 1.3819370804942372], "gaussian_params_": [[8.711501697065419, 1.0872570987117156, 1.3183833473411446], [11.65156492558388, 0.1523231162026415, 2.1084020992471677], [16.526282648886557, 0.5305457048390567, 3.8290479399054433], [76.45203544941465, 0.17931332916604759, 5.999999999999999]], "peak_params_": [[8.711501697065419, 1.207483650930767, 2.636766694682289], [11.65156492558388, 0.4625197435049051, 4.216804198494335], [16.526282648886557, 0.532602384835067, 7.658095879810887], [76.45203544941465, 0.1788051592538591, 11.999999999999998]], "r_squared_": 0.9899706301015992, "error_": 0.05434405165489665}
{"freq_range": [2.0, 80.0], "freq_res": 1.0, "aperiodic_params_": [0.4642040345491186, 1.3324979195332103], "gaussian_params_": [[8.755020086567365, 1.0785931628011647, 1.4952752776943488], [15.954570733284745, 0.531483614465518, 3.7760764746475206], [24.095930711882396, 0.05886911008995737, 3.0232270841984157], [63.68726521005963, 0.18751419899084484, 1.1010513478255912]], "peak_params_": [[8.755020086567365, 1.1616953863352144, 2.9905505553886975], [15.954570733284745, 0.533085613475459, 7.552152949295041], [24.095930711882396, 0.11375939765058618, 6.046454168396831], [63.68726521005963, 0.1801008966603408, 2.2021026956511824]], "r_squared_": 0.9864397074303521, "error_": 0.0638415681168983}
{"freq_range": [2.0, 80.0], "freq_res": 1.0, "aperiodic_params_": [0.48363850564197247, 1.3313722064856783], "gaussian_params_": [[8.837901879637876, 1.2875430199184184, 1.4563275562964972], [12.619590738389576, 0.4750741845192636, 0.2735049728817967], [14.992518096941545, 0.07915543579856582, 0.25000706641064524], [17.01979506902529, 0.5615518420764662, 3.894943190869561], [57.62578526269673, 0.5072899535226814, 0.2521251553736992], [74.45204414116108, 0.12322254306803017, 5.999999999999999]], "peak_params_": [[8.837901879637876, 1.3470096185548661, 2.9126551125929945], [12.619590738389576, 0.5319556565758936, 0.5470099457635934], [14.992518096941545, 0.5701901714605012, 0.5000141328212905], [17.01979506902529, 0.5615447843793131, 7.789886381739122], [57.62578526269673, 0.17148231065762243, 0.5042503107473983], [74.45204414116108, 0.12287331976249471, 11.999999999999998]], "r_squared_": 0.9919492810602222, "error_": 0.04854733160584681}
{"freq_range": [2.0, 80.0], "freq_res": 1.0, "aperiodic_params_": [-0.42589191588327086, 1.0265179481478433], "gaussian_params_": [[8.813643031128125, 0.9725027056072005, 1.6221633286418784]], "peak_params_": [[8.813643031128125, 0.9661063766201844, 3.244326657283757]], "r_squared_": 0.9558217624885263, "error_": 0.08657869683527938}
{"freq_range": [2.0, 80.0], "freq_res": 1.0, "aperiodic_params_": [-0.06879560847089815, 0.6963466029938614], "gaussian_params_": [[8.633502502951039, 0.6935165091777005, 1.2447131591441896], [57.478830332028274, 0.843392813777251, 0.2726447298146119]], "peak_params_": [[8.633502502951039, 0.66409592573272, 2.489426318288379], [57.478830332028274, 0.18041116746335661, 0.5452894596292238]], "r_squared_": 0.9495038955043569, "error_": 0.052706717603561}
{"freq_range": [2.0, 80.0], "freq_res": 1.0, "aperiodic_params_": [-0.004340953190937019, 1.0866238629443394], "gaussian_params_": [[8.006303428033489, 1.050857181771737, 0.9818118881725546], [9.904069198271888, 0.3904960113559854, 0.9506290232265656], [15.728326268186862, 0.258377542363206, 4.04383186975221], [76.45203459913596, 0.1862762142203218, 5.999999999999999]], "peak_params_": [[8.006303428033489, 1.1449754934467986, 1.9636237763451092], [9.904069198271888, 0.6169541012868989, 1.9012580464531312], [15.728326268186862, 0.2577951125596918, 8.08766373950442], [76.45203459913596, 0.1857483136327973, 11.999999999999998]], "r_squared_": 0.9734588707560502, "error_": 0.06575948828233498}
{"freq_range": [2.0, 80.0], "freq_res": 1.0, "aperiodic_params_": [-0.11040416925665292, 1.0374962598331345], "gaussian_params_": [[8.625526397791624, 1.0009624443013414, 1.3537527528666178], [15.660720759351076, 0.25015894230735575, 2.715337797245016], [22.49342377729619, 0.22402125751959795, 0.790750632721569], [50.11541704678339, 0.1216204104728099, 5.692183832099111], [70.54796540086404, 0.14491858191041407, 5.999999999999999]], "peak_params_": [[8.625526397791624, 0.9757379452584992, 2.7075055057332356], [15.660720759351076, 0.248214128560728, 5.430675594490032], [22.49342377729619, 0.20078457347808287, 1.581501265443138], [50.11541704678339, 0.12200689847761548, 11.384367664198223], [70.54796540086404, 0.14465305741627432, 11.999999999999998]], "r_squared_": 0.9786373277900872, "error_": 0.053775131760141474}
