{"freq_range": [2.0, 80.0], "freq_res": 1.0, "aperiodic_params_": [0.29259425923317656, 0.5387702100266787], "gaussian_params_": [[8.215523176030915, 0.6496433725221462, 0.5833492544805545], [9.951865034879186, 0.588235879973858, 0.8073733912183818], [18.300013086620208, 0.24157663275777264, 0.682357075501122], [37.54796540086405, 0.0811755902985046, 5.999999999999999], [45.17960534611758, 0.13963030317916686, 0.6235095195654006]], "peak_params_": [[8.215523176030915, 0.6384387548070678, 1.166698508961109], [9.951865034879186, 0.5932288125653784, 1.6147467824367636], [18.300013086620208, 0.21972210879725879, 1.364714151002244], [37.54796540086405, 0.08094554137899762, 11.999999999999998], [45.17960534611758, 0.17149278470102436, 1.2470190391308011]], "r_squared_": 0.9232693121957901, "error_": 0.05687410405552914}
{"freq_range": [2.0, 80.0], "freq_res": 1.0, "aperiodic_params_": [0.3331874265656496, 0.5547059233891233], "gaussian_params_": [[8.057595166648431, 0.5064996597228932, 0.5419906680807367], [9.80788004054361, 0.7671148848184982, 1.0922650850943363]], "peak_params_": [[8.057595166648431, 0.6986186104703858, 1.0839813361614734], [9.80788004054361, 0.7561631046144408, 2.1845301701886726]], "r_squared_": 0.9316690224262778, "error_": 0.0600314757824941}
{"freq_range": [2.0, 80.0], "freq_res": 1.0, "aperiodic_params_": [0.584289681948011, 0.8074016388303445], "gaussian_params_": [[8.386429181353716, 0.7253056517676977, 0.6580230568297645], [10.433489531523762, 1.293569481604786, 0.30296286900879016], [29.79593068804431, 0.19712766314142038, 0.761555168046039], [44.808768865415885, 0.12249471214354664, 3.3164006635831345], [53.66074437627823, 0.18896472911535886, 0.6456575943608758], [57.45871372162873, 0.4474756249941109, 0.30153277811240703], [60.989098923870266, 0.13667972610595816, 1.462258320535576], [66.11383444163856, 0.16091012365834903, 0.2500003150614459], [68.16473791690935, 0.17909109836102216, 0.5875680673146858], [78.34382808544474, 0.37510511251099315, 0.25087818282573143]], "peak_params_": [[8.386429181353716, 0.6104261288138164, 1.316046113659529], [10.433489531523762, 0.5006347429827546, 0.6059257380175803], [29.79593068804431, 0.19018159331942253, 1.523110336092078], [44.808768865415885, 0.12229123782050555, 6.632801327166269], [53.66074437627823, 0.16723271265387019, 1.2913151887217516], [57.45871372162873, 0.1441311724723986, 0.6030655562248141], [60.989098923870266, 0.13667674519526218, 2.924516641071152], [66.11383444163856, 0.14565206913041073, 0.5000006301228918], [68.16473791690935, 0.17218996782911367, 1.1751361346293716], [78.34382808544474, 0.14665365187774415, 0.5017563656514629]], "r_squared_": 0.9516085144974069, "error_": 0.04711977641542019}
{"freq_range": [2.0, 80.0], "freq_res": 1.0, "aperiodic_params_": [0.5898331785289599, 0.8360335484874424], "gaussian_params_": [[8.480714950064193, 0.7910188845313608, 0.7970881149352046], [10.449353173370973, 1.6725849964768222, 0.3072146873663363], [17.427844324885502, 0.1860191693666271, 1.1363251039973026], [21.880956975435815, 0.1664689257736445, 1.5552439833741627], [45.757484135814906, 0.10348577767499784, 1.8795627328306699], [58.16414191546921, 0.22355924154306595, 1.198171198070714], [61.338140794131164, 0.45663591810951515, 0.25000420662265294], [62.85158312525077, 0.12542891706051995, 0.5338525393680202], [64.76562077631442, 0.14558432152819342, 0.2830085022138888], [67.93249600038145, 0.13210440746009988, 3.9472667809445348], [79.9999999970366, 0.14069983346313553, 5.9999456142589835]], "peak_params_": [[8.480714950064193, 0.6594879922618466, 1.5941762298704092], [10.449353173370973, 0.7024980282073789, 0.6144293747326726], [17.427844324885502, 0.1744995416408348, 2.272650207994605], [21.880956975435815, 0.16603874057939483, 3.1104879667483254], [45.757484135814906, 0.10262796940767327, 3.7591254656613398], [58.16414191546921, 0.22721241016034377, 2.396342396141428], [61.338140794131164, 0.22602852792586559, 0.5000084132453059], [62.85158312525077, 0.1837925536147147, 1.0677050787360405], [64.76562077631442, 0.20978504264325404, 0.5660170044277776], [67.93249600038145, 0.1511260527025774, 7.8945335618890695], [79.9999999970366, 0.1419340280717578, 11.999891228517967]], "r_squared_": 0.9586749394584965, "error_": 0.04580392827824865}
{"freq_range": [2.0, 80.0], "freq_res": 1.0, "aperiodic_params_": [0.4509432897047901, 0.7512910711346541], "gaussian_params_": [[8.049803484614477, 0.6920464628905585, 0.7191949470148578], [9.864517970518133, 0.8851156762053475, 0.9472939840794455], [17.74584670982238, 0.27733840034269364, 0.8016286700511273], [48.0366615670464, 0.17817552933864064, 0.7028282061674681], [54.16074285935212, 0.18710840406696153, 0.8957323183483272], [60.63026161506587, 0.6101396482123885, 0.25001272548589554], [63.53546854263749, 0.7745255183714236, 0.2633393883612209], [66.60596510922365, 0.1279918571079346, 1.2279313217846999], [71.5259993586995, 0.6028584877955125, 0.2588641121196079], [75.31236556638322, 0.11259784110362901, 3.8240405737752017]], "peak_params_": [[8.049803484614477, 0.8179636409015252, 1.4383898940297155], [9.864517970518133, 0.8936262373822708, 1.894587968158891], [17.74584670982238, 0.2637440932355728, 1.6032573401022545], [48.0366615670464, 0.17793328907294625, 1.4056564123349362], [54.16074285935212, 0.18411975132903302, 1.7914646366966545], [60.63026161506587, 0.2045200877127742, 0.5000254509717911], [63.53546854263749, 0.1783126367989991, 0.5266787767224418], [66.60596510922365, 0.13217363039157692, 2.4558626435693998], [71.5259993586995, 0.19014368016422067, 0.5177282242392158], [75.31236556638322, 0.1122228187655574, 7.648081147550403]], "r_squared_": 0.96749526050123, "error_": 0.043156828089004465}
{"freq_range": [2.0, 80.0], "freq_res": 1.0, "aperiodic_params_": [0.19176231826991977, 0.2893993542299737], "gaussian_params_": [[8.501574016829013, 2.718637893904376, 0.27824064892987976], [10.434379476567738, 2.0609581304314912, 0.2753657193386111], [30.25954228881596, 0.38951236749509255, 4.881701945122764]], "peak_params_": [[8.501574016829013, 0.5464706291146864, 0.5564812978597595], [10.434379476567738, 0.5939836299872853, 0.5507314386772222], [30.25954228881596, 0.38896224661126233, 9.763403890245527]], "r_squared_": 0.826571783107084, "error_": 0.06908315846510565}
{"freq_range": [2.0, 80.0], "freq_res": 1.0, "aperiodic_params_": [0.7550514795132741, 1.116541778011857], "gaussian_params_": [[8.016769434946674, 0.7089399177782699, 0.681263371687356], [9.777176340713158, 0.6705423253916453, 1.0438544736422277]], "peak_params_": [[8.016769434946674, 0.8661283802102899, 1.362526743374712], [9.777176340713158, 0.665680031181242, 2.0877089472844554]], "r_squared_": 0.95913021754015, "error_": 0.08166163067688922}
{"freq_range": [2.0, 80.0], "freq_res": 1.0, "aperiodic_params_": [0.37163209556181037, 0.6635498426709708], "gaussian_params_": [[8.00946808678385, 0.6543559592525723, 0.6830555024759912], [10.067912441103571, 0.6080726348855553, 1.1051665058260594], [18.74486059653147, 0.28804372875428425, 1.6687518895253564], [40.76248090510283, 0.20975017942528915, 0.531118895045792], [54.12059819659302, 0.16983326086182987, 0.6803750604415931], [59.263085448219584, 0.174258411584991, 3.0996613690043047], [74.45203459913596, 0.1263551344669358, 5.999999999999999]], "peak_params_": [[8.00946808678385, 0.7599003271653466, 1.3661110049519825], [10.067912441103571, 0.6162957626419137, 2.2103330116521187], [18.74486059653147, 0.2846966617495511, 3.3375037790507127], [40.76248090510283, 0.18979055675851408, 1.062237790091584], [54.12059819659302, 0.20878879678112194, 1.3607501208831863], [59.263085448219584, 0.1782174272926983, 6.199322738008609], [74.45203459913596, 0.12599920003962128, 11.999999999999998]], "r_squared_": 0.9148704908346581, "error_": 0.06144605543623068}
{"freq_range": [2.0, 80.0], "freq_res": 1.0, "aperiodic_params_": [0.4664009253130199, 0.7278453258397647], "gaussian_params_": [[8.370525625538917, 0.802636990247409, 0.7228659194918662], [10.447149403801253, 1.9212462867431337, 0.28747218002253583], [17.807715944821727, 0.20455418805573494, 0.9768212039076746], [20.630221859489094, 0.24055576270936313, 1.1325272896755567], [36.22927844771962, 0.1216690316344295, 4.936135769806756], [57.892513799814864, 0.1115843888849558, 2.229473787361119], [62.553421716897795, 0.17423553260814162, 0.6870203464811614], [65.44043837190232, 0.7377628573162135, 0.2693490179648177], [69.40745698312213, 0.1580757254001482, 1.096915825632931], [72.55876789736993, 0.7867528809236715, 0.2544041974517495]], "peak_params_": [[8.370525625538917, 0.7038280861122023, 1.4457318389837324], [10.447149403801253, 0.6363310469960348, 0.5749443600450717], [17.807715944821727, 0.2169797825303104, 1.9536424078153491], [20.630221859489094, 0.23009282934741548, 2.2650545793511134], [36.22927844771962, 0.12153785149115692, 9.872271539613513], [57.892513799814864, 0.11146204769499357, 4.458947574722238], [62.553421716897795, 0.14914465292067391, 1.3740406929623228], [65.44043837190232, 0.1948229112187796, 0.5386980359296354], [69.40745698312213, 0.14753820365568426, 2.193831651265862], [72.55876789736993, 0.17558345964096644, 0.508808394903499]], "r_squared_": 0.9678808556379201, "error_": 0.03721261523958783}
{"freq_range": [2.0, 80.0], "freq_res": 1.0, "aperiodic_params_": [0.7777805430089996, 1.1404860660392997], "gaussian_params_": [[7.958645760861598, 0.6043928315821023, 0.6301314748628133], [9.817727297094638, 0.9178325865978869, 1.0950541707722485], [17.984726490465416, 0.30013380128120876, 2.7344549025722538], [62.54963047604191, 0.6826572244904947, 0.2836435380250094], [65.84973088138759, 0.19659988860538366, 0.5614097309522351]], "peak_params_": [[7.958645760861598, 0.834912189364299, 1.2602629497256266], [9.817727297094638, 0.9126098817778713, 2.190108341544497], [17.984726490465416, 0.30012911942995313, 5.4689098051445075], [62.54963047604191, 0.19353130220351655, 0.5672870760500188], [65.84973088138759, 0.18968193804958466, 1.1228194619044702]], "r_squared_": 0.9872740097122595, "error_": 0.04496747875727574}
{"freq_range": [2.0, 80.0], "freq_res": 1.0, "aperiodic_params_": [0.7939148346165406, 1.182661466483535], "gaussian_params_": [[7.828665629397129, 0.4723368725552101, 0.5473727342630398], [9.647804816537947, 1.0171762449628194, 1.2745674996104626], [17.744324900107898, 0.3544337074618373, 2.2949420019115787], [59.140444860873444, 0.18649253032166457, 0.5373624674200296], [65.56903127681478, 0.557473511654826, 0.2958530725003644]], "peak_params_": [[7.828665629397129, 0.8908119884150976, 1.0947454685260796], [9.647804816537947, 0.9804488831835544, 2.549134999220925], [17.744324900107898, 0.35224094557909874, 4.589884003823157], [59.140444860873444, 0.18023053037267123, 1.0747249348400592], [65.56903127681478, 0.19294974144533916, 0.5917061450007288]], "r_squared_": 0.9891465476069355, "error_": 0.047091702356074155}
{"freq_range": [2.0, 80.0], "freq_res": 1.0, "aperiodic_params_": [0.8646477278626002, 1.1920375867237625], "gaussian_params_": [[7.86666132310585, 0.49589231230622616, 0.5779141522048523], [9.688630275307615, 1.0167699788146178, 1.2293356155724688], [17.721295828709795, 0.32835924680256967, 2.25916575992957]], "peak_params_": [[7.86666132310585, 0.8787271898942581, 1.1558283044097046], [9.688630275307615, 0.9861730431301778, 2.4586712311449377], [17.721295828709795, 0.3258700534908103, 4.51833151985914]], "r_squared_": 0.9873490633147674, "error_": 0.04862579429489123}
{"freq_range": [2.0, 80.0], "freq_res": 1.0, "aperiodic_params_": [0.5899904546065585, 0.8090344607747016], "gaussian_params_": [[7.898213184180778, 0.5033051094847592, 0.6110844427427023], [9.659437692885469, 0.8959711579236633, 1.1146804218173925], [18.141099247070407, 0.23320572492243008, 1.2621409133030905]], "peak_params_": [[7.898213184180778, 0.7921989497043873, 1.2221688854854047], [9.659437692885469, 0.8564731025034386, 2.229360843634785], [18.141099247070407, 0.2317529889545673, 2.524281826606181]], "r_squared_": 0.9711387967873328, "error_": 0.05195430758147286}
{"freq_range": [2.0, 80.0], "freq_res": 1.0, "aperiodic_params_": [0.3854469876852697, 0.5693120611501968], "gaussian_params_": [[7.799152088411438, 0.49055627787340333, 0.5195184508764253], [9.586219933301356, 0.8087976776902287, 1.0733665794492515], [17.92436867809185, 0.16945653832990884, 1.0465706669356258], [27.918901832755854, 0.081268986702985, 0.2500883408164144], [30.392694314025817, 0.20933460008734003, 3.0622688031665164], [47.45203459913595, 0.09460558052092694, 5.999798942535443], [58.54978425843967, 0.5448982040802337, 0.3102298176568467], [67.42379332232798, 0.09589491397642058, 4.014731535268988], [76.9128528009907, 0.15241001007577598, 0.25001050622691273]], "peak_params_": [[7.799152088411438, 0.7266354734459706, 1.0390369017528507], [9.586219933301356, 0.7509412873618373, 2.146733158898503], [17.92436867809185, 0.16907333637783917, 2.0931413338712517], [27.918901832755854, 0.2318666726759624, 0.5001766816328288], [30.392694314025817, 0.2089965366125372, 6.124537606333033], [47.45203459913595, 0.0943377696603469, 11.999597885070886], [58.54978425843967, 0.2155555342897103, 0.6204596353136934], [67.42379332232798, 0.09583077795650585, 8.029463070537975], [76.9128528009907, 0.14900313935691845, 0.5000210124538255]], "r_squared_": 0.9447954368315405, "error_": 0.04788485719205744}
{"freq_range": [2.0, 80.0], "freq_res": 1.0, "aperiodic_params_": [0.23787659945839965, 0.4338881474169448], "gaussian_params_": [[8.459169686174603, 0.8183230493520475, 0.9244134793395136], [10.47094161637208, 1.8426988186274296, 0.28735755682211594], [26.270572288770378, 0.27211018151890837, 1.1003173474038084], [53.76859796987243, 0.1686439042319992, 5.999999999999999], [66.44062030794277, 0.9026890728052691, 0.2563689856608643], [73.22002180836378, 0.2820106619071904, 0.45826391739348143]], "peak_params_": [[8.459169686174603, 0.7233509263791017, 1.8488269586790271], [10.47094161637208, 0.685081547649429, 0.5747151136442319], [26.270572288770378, 0.2640099972706134, 2.2006346948076168], [53.76859796987243, 0.16851852921725724, 11.999999999999998], [66.44062030794277, 0.22722563867202494, 0.5127379713217286], [73.22002180836378, 0.25230104083862753, 0.9165278347869629]], "r_squared_": 0.8960108154704485, "error_": 0.05690004960614111}
{"freq_range": [2.0, 80.0], "freq_res": 1.0, "aperiodic_params_": [0.5201055461246112, 1.0301439416763987], "gaussian_params_": [[9.03638526226795, 1.1789519212413562, 1.3691264715881735], [15.538122170274896, 0.200105588465719, 0.7934065604865074], [28.195697771843488, 0.18441811510715408, 1.9652146040339327], [57.012737285891355, 0.1135124355054768, 0.25000096522116516], [60.895980260903315, 0.17708085937515136, 5.633805409237451], [65.80979752237961, 0.20506923476782998, 0.26075126531558257], [69.63949591851436, 0.22698866342924018, 0.29805468629027065], [79.99996319912619, 0.16554387598506493, 4.578984968521411]], "peak_params_": [[9.03638526226795, 1.1785356721442413, 2.738252943176347], [15.538122170274896, 0.16891835527642984, 1.5868131209730147], [28.195697771843488, 0.18350600799832606, 3.9304292080678653], [57.012737285891355, 0.25278636107879593, 0.5000019304423303], [60.895980260903315, 0.17708089232943247, 11.267610818474902], [65.80979752237961, 0.27618650860281857, 0.5215025306311651], [69.63949591851436, 0.17246403613505068, 0.5961093725805413], [79.99996319912619, 0.16610787374496638, 9.157969937042822]], "r_squared_": 0.980024132342037, "error_": 0.04654812691620728}
{"freq_range": [2.0, 80.0], "freq_res": 1.0, "aperiodic_params_": [0.5241898567819427, 0.9008289747315531], "gaussian_params_": [[7.992145174140583, 0.34870022059826866, 0.48035153014217236], [9.36311233861015, 0.7008305071992489, 1.2698738747836482], [16.44476300832656, 0.5227110037003077, 0.31143993917681395], [25.399072217915457, 0.19806270350483451, 1.897588837615746], [46.699653662580836, 0.2367655366450938, 0.6074944729215154], [53.354829814917984, 0.24198920765012547, 2.5832766637256164], [58.95782672754505, 0.155437385093358, 1.0543098556967785], [61.917645771228834, 0.17174642291172218, 0.7606734119211191], [65.4382462011273, 0.4909136393274575, 0.30200318797469977], [67.3871315340538, 0.052280033531898716, 1.0132873488566592], [73.92898530258651, 0.19921109803158224, 5.739435018599028]], "peak_params_": [[7.992145174140583, 0.7425733370847813, 0.9607030602843447], [9.36311233861015, 0.7113500746995091, 2.5397477495672964], [16.44476300832656, 0.18854246499999516, 0.6228798783536279], [25.399072217915457, 0.1937308047112376, 3.795177675231492], [46.699653662580836, 0.22127197019980294, 1.2149889458430307], [53.354829814917984, 0.23997533070284183, 5.166553327451233], [58.95782672754505, 0.18440976138881493, 2.108619711393557], [61.917645771228834, 0.19703245943985603, 1.5213468238422383], [65.4382462011273, 0.23400500790009326, 0.6040063759493995], [67.3871315340538, 0.14472428157584316, 2.0265746977133183], [73.92898530258651, 0.19919584963190706, 11.478870037198057]], "r_squared_": 0.9633989242098614, "error_": 0.04571302540837568}
{"freq_range": [2.0, 80.0], "freq_res": 1.0, "aperiodic_params_": [0.6038613929933341, 1.0090075927136732], "gaussian_params_": [[8.036172956027034, 0.644063089666169, 0.5714715382916227], [10.15625870941235, 0.7550020268345963, 1.2144358034374287], [17.50997525781255, 0.34738880523350957, 1.7250051929104395]], "peak_params_": [[8.036172956027034, 0.798871497498854, 1.1429430765832453], [10.15625870941235, 0.7505611116319504, 2.4288716068748575], [17.50997525781255, 0.3336512660495193, 3.450010385820879]], "r_squared_": 0.9779469298973344, "error_": 0.05308332385171961}
{"freq_range": [2.0, 80.0], "freq_res": 1.0, "aperiodic_params_": [0.9726154958686298, 1.255301208169544], "gaussian_params_": [[8.150473130876733, 0.6302742547719867, 0.5581962394508819], [10.03422049577317, 0.8511219179136342, 1.1123870785463092], [17.690324137051597, 0.3383884741401707, 1.6347940070290565]], "peak_params_": [[8.150473130876733, 0.7676749254135135, 1.1163924789017639], [10.03422049577317, 0.8533280524959649, 2.2247741570926185], [17.690324137051597, 0.3323714177215324, 3.269588014058113]], "r_squared_": 0.9817554842433754, "error_": 0.05817973141561746}
{"freq_range": [2.0, 80.0], "freq_res": 1.0, "aperiodic_params_": [0.8713366911474161, 1.221145298631796], "gaussian_params_": [[7.948434570424335, 0.517237569680324, 0.6384220766074735], [9.827679221993337, 1.0492027246937856, 1.3358319724427017], [17.60597948873958, 0.3749575485382762, 2.1962850926311503], [51.377374523327774, 0.3719086264818835, 0.2824464431347712]], "peak_params_": [[7.948434570424335, 0.9270783875729515, 1.276844153214947], [9.827679221993337, 1.0444019505788578, 2.6716639448854034], [17.60597948873958, 0.3689717518646423, 4.392570185262301], [51.377374523327774, 0.15233420941929054, 0.5648928862695424]], "r_squared_": 0.9906252265364205, "error_": 0.044667862166385}
{"freq_range": [2.0, 80.0], "freq_res": 1.0, "aperiodic_params_": [0.9846396289692556, 1.2813479970670116], "gaussian_params_": [[7.946655575472814, 0.48255494982600783, 0.6699466175330318], [9.843638274536882, 1.03599660237247, 1.3600642589905798], [17.65028951696899, 0.36665610246856173, 2.012111531091225], [26.713109861659127, 0.14925782218144762, 2.381457086168402], [51.326949673379694, 0.3184894940029257, 0.28453713391135316], [65.77153011590978, 0.19216873066415252, 0.5581094805892508]], "peak_params_": [[7.946655575472814, 0.8944075567190949, 1.3398932350660635], [9.843638274536882, 1.033841321523473, 2.7201285179811596], [17.65028951696899, 0.3613448531047432, 4.02422306218245], [26.713109861659127, 0.14818619113799136, 4.762914172336804], [51.326949673379694, 0.16458420625286996, 0.5690742678227063], [65.77153011590978, 0.1767231498022208, 1.1162189611785016]], "r_squared_": 0.9889444428001254, "error_": 0.046886520524332564}
{"freq_range": [2.0, 80.0], "freq_res": 1.0, "aperiodic_params_": [0.7488956925971068, 1.0858158241391587], "gaussian_params_": [[7.970814276649714, 0.4690894603085449, 0.660422312892057], [9.82422696604922, 1.0303180700852552, 1.4559207424669518], [17.898288344837308, 0.3983753374473207, 1.5579543325788443], [26.350485098614183, 0.19530092127695806, 2.0977058057373803]], "peak_params_": [[7.970814276649714, 0.9385947552337532, 1.320844625784114], [9.82422696604922, 1.027018351941325, 2.9118414849339036], [17.898288344837308, 0.3975981550364998, 3.1159086651576886], [26.350485098614183, 0.19259440237113978, 4.195411611474761]], "r_squared_": 0.9886650865806341, "error_": 0.04321252133466355}
{"freq_range": [2.0, 80.0], "freq_res": 1.0, "aperiodic_params_": [0.43670623440628553, 0.6428980259227262], "gaussian_params_": [[9.161037191096694, 0.8970329776162884, 1.360412484810037], [22.75077919189469, 0.14101786932106697, 4.982213106715232], [74.36153283408801, 0.4991256193866434, 0.2500000021782796]], "peak_params_": [[9.161037191096694, 0.8938974324380468, 2.720824969620074], [22.75077919189469, 0.1408415513794925, 9.964426213430464], [74.36153283408801, 0.17542470220249962, 0.5000000043565592]], "r_squared_": 0.956224763721667, "error_": 0.05760189714808369}
{"freq_range": [2.0, 80.0], "freq_res": 1.0, "aperiodic_params_": [0.6901217693166425, 0.8616969208788912], "gaussian_params_": [[9.080810016159909, 0.7516430926840563, 1.3934237300878436], [51.162707666157445, 0.22418881167612856, 0.9561266588871772], [61.1421936613271, 0.11578246624320246, 3.168051009462152], [72.12951381763433, 0.13558227012221946, 5.999999999999999]], "peak_params_": [[9.080810016159909, 0.7503801590057526, 2.786847460175687], [51.162707666157445, 0.22192981414655233, 1.9122533177743544], [61.1421936613271, 0.13993530375089414, 6.336102018924304], [72.12951381763433, 0.13587650398499374, 11.999999999999998]], "r_squared_": 0.9326649855573336, "error_": 0.06769699317865388}
{"freq_range": [2.0, 80.0], "freq_res": 1.0, "aperiodic_params_": [0.2889102594307782, 0.93421333137251], "gaussian_params_": [[9.118046890627273, 1.3355793785550136, 1.329277139234814], [17.56174734647836, 0.22784082690606416, 1.8545914354089696], [50.985431099274734, 0.17366566824589255, 0.25013258244618414], [56.73503097618252, 0.1343795426671553, 2.156248053531765], [60.512611251073466, 0.1653585390982724, 0.7510435396936878], [62.55702098503274, 0.23603144045922314, 0.5554128494242713], [66.63146223905319, 0.2515501349979511, 1.569719214452845], [72.90645706663939, 0.2919279769264389, 1.8149338157105577], [78.36213483489783, 0.2574304212887658, 1.4718903461589277]], "peak_params_": [[9.118046890627273, 1.3303286681146433, 2.658554278469628], [17.56174734647836, 0.2215673919768033, 3.7091828708179393], [50.985431099274734, 0.1772815658649003, 0.5002651648923683], [56.73503097618252, 0.13337170370604112, 4.31249610706353], [60.512611251073466, 0.15800508060123608, 1.5020870793873755], [62.55702098503274, 0.19170312479762774, 1.1108256988485425], [66.63146223905319, 0.24617735495155335, 3.13943842890569], [72.90645706663939, 0.29194540763612253, 3.6298676314211153], [78.36213483489783, 0.25544386920358475, 2.9437806923178553]], "r_squared_": 0.9774366236075424, "error_": 0.048070570631835736}
{"freq_range": [2.0, 80.0], "freq_res": 1.0, "aperiodic_params_": [0.18491533000172014, 0.5516638914002253], "gaussian_params_": [[9.384935373670254, 0.9702504426402446, 1.4813186679598622], [66.68875220116816, 0.23638032672490408, 1.5192844266509387], [70.95867305869771, 0.2900437099861118, 0.25042378323673065], [73.21613867975582, 0.3191854060291169, 0.6558288704832853]], "peak_params_": [[9.384935373670254, 0.9380381627325203, 2.9626373359197244], [66.68875220116816, 0.23147162187421255, 3.0385688533018773], [70.95867305869771, 0.2913964178175271, 0.5008475664734613], [73.21613867975582, 0.30235605530898324, 1.3116577409665706]], "r_squared_": 0.8337138573332908, "error_": 0.0893311969534106}
{"freq_range": [2.0, 80.0], "freq_res": 1.0, "aperiodic_params_": [1.0067346450345283, 1.296025243613218], "gaussian_params_": [[8.374017720964028, 0.8075224414253553, 0.6800323078982136], [10.768600816436175, 0.9690708580890763, 1.1082649439712848], [17.80118123714233, 0.34979191544404326, 2.162652756078615], [65.60041725810365, 0.6005179570775488, 0.28629122949036834], [74.70421197715004, 0.11555547416725585, 5.999999999841151]], "peak_params_": [[8.374017720964028, 0.7369612961305425, 1.3600646157964271], [10.768600816436175, 0.9511330832577313, 2.2165298879425697], [17.80118123714233, 0.34831687660612093, 4.32530551215723], [65.60041725810365, 0.2670787405645034, 0.5725824589807367], [74.70421197715004, 0.11541514260586472, 11.999999999682302]], "r_squared_": 0.9735064703644242, "error_": 0.06080814254912718}
{"freq_range": [2.0, 80.0], "freq_res": 1.0, "aperiodic_params_": [0.8316778852450641, 1.1744806165794124], "gaussian_params_": [[9.883295860933208, 1.1883253187057523, 1.6836492621470662], [17.781733243731438, 0.4426493817116922, 2.0608636546184718]], "peak_params_": [[9.883295860933208, 1.1858287705707087, 3.3672985242941325], [17.781733243731438, 0.4401844026617741, 4.1217273092369435]], "r_squared_": 0.9802447806647422, "error_": 0.06027330119314079}
{"freq_range": [2.0, 80.0], "freq_res": 1.0, "aperiodic_params_": [0.8949234242766858, 1.224279617924007], "gaussian_params_": [[8.148453179043583, 0.6134419453912419, 0.6718625619767485], [10.252894191885423, 1.1566539260196567, 1.385527101465665], [17.688329757407754, 0.4264966016789395, 2.0664731370801084]], "peak_params_": [[8.148453179043583, 0.9070306666575946, 1.343725123953497], [10.252894191885423, 1.1517268889268117, 2.77105420293133], [17.688329757407754, 0.42167343384096867, 4.132946274160217]], "r_squared_": 0.9896117878519806, "error_": 0.05068396128270813}
{"freq_range": [2.0, 80.0], "freq_res": 1.0, "aperiodic_params_": [0.8957112970105535, 1.222658202487714], "gaussian_params_": [[8.016937063971815, 0.4012855037506958, 0.6336442758866004], [9.96045227393777, 1.170771733834837, 1.5788199980332092], [17.64736732209917, 0.43492801448110807, 2.0286077955671824], [22.763605739722063, 0.19985285155741658, 0.7089905962178297], [26.162579690831787, 0.16228764836607654, 1.1575028538966121], [28.97834482267565, 0.15217136785934002, 0.2501297564446853], [51.364805275934096, 0.36895192495463264, 0.2758787356144223]], "peak_params_": [[8.016937063971815, 0.9427239462127378, 1.2672885517732009], [9.96045227393777, 1.1737578122357115, 3.1576399960664183], [17.64736732209917, 0.42840907230555547, 4.057215591134365], [22.763605739722063, 0.20631583218352345, 1.4179811924356593], [26.162579690831787, 0.16079125341301204, 2.3150057077932242], [28.97834482267565, 0.1596457070525904, 0.5002595128893706], [51.364805275934096, 0.1539112020378035, 0.5517574712288446]], "r_squared_": 0.9902403348357445, "error_": 0.042686405091733486}
{"freq_range": [2.0, 80.0], "freq_res": 1.0, "aperiodic_params_": [0.7318324174895479, 1.1573383614889083], "gaussian_params_": [[7.919611859327361, 0.5801946937599796, 0.6705159247883206], [9.918144086243409, 1.2410406455874923, 1.3947908556057655], [14.469516822985346, 0.2092547821955734, 2.535326451129851], [18.27853021386499, 0.48093062936948777, 1.264822834355503], [25.695992029986954, 0.24906698937013447, 2.7295938128302777]], "peak_params_": [[7.919611859327361, 1.0661780366361666, 1.3410318495766411], [9.918144086243409, 1.2878582084422678, 2.789581711211531], [14.469516822985346, 0.2244394912547666, 5.070652902259702], [18.27853021386499, 0.5534492244244423, 2.529645668711006], [25.695992029986954, 0.24753376676144, 5.459187625660555]], "r_squared_": 0.9926386592150717, "error_": 0.041162147076010194}
{"freq_range": [2.0, 80.0], "freq_res": 1.0, "aperiodic_params_": [0.5839395787850142, 0.9162714591070045], "gaussian_params_": [[8.037166017387062, 0.5307064393444135, 0.7014073530398777], [10.050551790815003, 1.0290821346921906, 1.3921065246137356], [17.93560997624237, 0.2864238729022283, 1.925635526087714], [71.74013215389152, 0.1641083753600128, 5.999999999999999]], "peak_params_": [[8.037166017387062, 0.8777459863867809, 1.4028147060797553], [10.050551790815003, 1.0390390411275834, 2.7842130492274713], [17.93560997624237, 0.28626387474656695, 3.851271052175428], [71.74013215389152, 0.16395452458465587, 11.999999999999998]], "r_squared_": 0.9703707206218017, "error_": 0.0576934174857993}
{"freq_range": [2.0, 80.0], "freq_res": 1.0, "aperiodic_params_": [0.5263815203348192, 0.886970160250065], "gaussian_params_": [[9.254161133667584, 0.9558137093834534, 1.4734909845369637], [18.594794510694133, 0.25569344763171625, 0.9025364439918718], [49.12032300304679, 0.16872131554565176, 0.6006658167968572], [64.2795801907621, 0.18290692014851728, 3.1546982555914993], [69.37646004834532, 0.3108378346505849, 0.3131230429545093], [72.50347740747108, 0.20009398825066094, 1.453616406582441], [76.02751496009753, 0.17078063617386582, 0.2500352508484012], [78.09971235469695, 0.17038382814447856, 1.627283169729835]], "peak_params_": [[9.254161133667584, 0.9417000302182104, 2.9469819690739274], [18.594794510694133, 0.23117970701624185, 1.8050728879837437], [49.12032300304679, 0.16537142106367342, 1.2013316335937143], [64.2795801907621, 0.18219005029059376, 6.309396511182999], [69.37646004834532, 0.22155868473434515, 0.6262460859090186], [72.50347740747108, 0.19401876928888773, 2.907232813164882], [76.02751496009753, 0.25513452764569067, 0.5000705016968024], [78.09971235469695, 0.17023574292916388, 3.25456633945967]], "r_squared_": 0.9732158255803194, "error_": 0.05068031635076541}
{"freq_range": [2.0, 80.0], "freq_res": 1.0, "aperiodic_params_": [-0.021971219855447383, 0.8888141426593404], "gaussian_params_": [[9.324184484035305, 1.1800483597404579, 1.323746258272906], [17.309587545346314, 0.258690932008595, 2.0867093529490286]], "peak_params_": [[9.324184484035305, 1.1452797924005877, 2.647492516545812], [17.309587545346314, 0.2558595559246999, 4.173418705898057]], "r_squared_": 0.9667265701373509, "error_": 0.06468127400677946}
{"freq_range": [2.0, 80.0], "freq_res": 1.0, "aperiodic_params_": [0.48779285059687416, 1.0657566669574992], "gaussian_params_": [[8.24800564134854, 0.6128057592103048, 0.6932760967980399], [10.360497233685816, 1.0175283151495564, 1.3108689192986167], [17.798935485492287, 0.27332245088700213, 2.405129972164709], [62.05167142825303, 0.1371310918186503, 0.2500779575589767], [70.60079967017838, 0.11882496166551841, 5.999999999999999]], "peak_params_": [[8.24800564134854, 0.7760008532164564, 1.3865521935960798], [10.360497233685816, 1.0063438196992307, 2.6217378385972334], [17.798935485492287, 0.27236908202569154, 4.810259944329418], [62.05167142825303, 0.1767661019260398, 0.5001559151179534], [70.60079967017838, 0.1185622517674092, 11.999999999999998]], "r_squared_": 0.9832930339656597, "error_": 0.048865073173860844}
{"freq_range": [2.0, 80.0], "freq_res": 1.0, "aperiodic_params_": [0.7245801044405754, 1.1538076312863597], "gaussian_params_": [[8.312642981938652, 0.8296225064899417, 0.7534338399341383], [10.800198605577393, 1.1703743665857622, 1.3278081228929202], [17.147157527225918, 0.4563511262866286, 1.843414068579246], [22.4520346547835, 0.17829836731308307, 3.623872343463994]], "peak_params_": [[8.312642981938652, 0.8878927567224574, 1.5068676798682765], [10.800198605577393, 1.1615979584750504, 2.6556162457858403], [17.147157527225918, 0.5124179030395232, 3.686828137158492], [22.4520346547835, 0.19118657615029055, 7.247744686927988]], "r_squared_": 0.9894024188216223, "error_": 0.04537111134755612}
{"freq_range": [2.0, 80.0], "freq_res": 1.0, "aperiodic_params_": [0.9080014695673686, 1.234665884839979], "gaussian_params_": [[8.327480904124098, 0.8385574099175646, 0.732209440944988], [10.625840270126359, 1.32255264687831, 1.2187325157489506], [17.943772749329668, 0.48063502615965514, 3.007891564019081]], "peak_params_": [[8.327480904124098, 0.8906128508494606, 1.464418881889976], [10.625840270126359, 1.2962084487020618, 2.437465031497901], [17.943772749329668, 0.4805510724181729, 6.015783128038162]], "r_squared_": 0.9868125661649381, "error_": 0.059020865785665226}
{"freq_range": [2.0, 80.0], "freq_res": 1.0, "aperiodic_params_": [0.7730740226990593, 1.2047259090422862], "gaussian_params_": [[10.030840667198785, 1.5413496981193409, 1.7298763363875125], [18.181459505490224, 0.5270694824836124, 2.8606690721852512]], "peak_params_": [[10.030840667198785, 1.5499297419680942, 3.459752672775025], [18.181459505490224, 0.5260481432575708, 5.7213381443705025]], "r_squared_": 0.9859387604789056, "error_": 0.06038602766445318}
{"freq_range": [2.0, 80.0], "freq_res": 1.0, "aperiodic_params_": [0.9222702622103462, 1.2414534202216247], "gaussian_params_": [[9.946205533899867, 1.4220058649393585, 1.718588115998133], [18.122557207604487, 0.46170473921422284, 2.320657258428086]], "peak_params_": [[9.946205533899867, 1.4223189881581773, 3.437176231996266], [18.122557207604487, 0.46108554432089516, 4.641314516856172]], "r_squared_": 0.9863505577849294, "error_": 0.05807554443681431}
{"freq_range": [2.0, 80.0], "freq_res": 1.0, "aperiodic_params_": [0.8674126507060734, 1.3046120358228852], "gaussian_params_": [[9.975881171048833, 1.5179645346682298, 1.8182172209326917], [18.16671805400363, 0.5934501358161741, 2.34580319396779], [23.5555864357578, 0.29966129569432076, 0.28989043471105685], [26.340645898498597, 0.23761690945398267, 2.442572012400983]], "peak_params_": [[9.975881171048833, 1.5192161575621723, 3.6364344418653833], [18.16671805400363, 0.5927408827227787, 4.69160638793558], [23.5555864357578, 0.2696181273099677, 0.5797808694221137], [26.340645898498597, 0.23756652704239145, 4.885144024801966]], "r_squared_": 0.990581309707866, "error_": 0.05023725031624051}
{"freq_range": [2.0, 80.0], "freq_res": 1.0, "aperiodic_params_": [0.6666798652947817, 1.1770632169679687], "gaussian_params_": [[9.722969364174823, 1.3610158741301213, 1.6778537338978343], [18.435493697997696, 0.4255632953370271, 4.1658651034849825]], "peak_params_": [[9.722969364174823, 1.3973681028692742, 3.3557074677956686], [18.435493697997696, 0.42325136199349067, 8.331730206969965]], "r_squared_": 0.98502657333999, "error_": 0.0609932144473457}
{"freq_range": [2.0, 80.0], "freq_res": 1.0, "aperiodic_params_": [0.286234089961796, 0.9090878554875452], "gaussian_params_": [[8.409657254348769, 0.6929585515313502, 0.9397073809692026], [10.263260376376198, 0.9465906156672739, 1.5048506748805734], [18.04682993883868, 0.33607642325573694, 2.1458938099962253]], "peak_params_": [[8.409657254348769, 0.9356323488058327, 1.8794147619384052], [10.263260376376198, 1.0980003101946563, 3.009701349761147], [18.04682993883868, 0.33599812937278395, 4.2917876199924505]], "r_squared_": 0.9736695807533815, "error_": 0.06491377206755816}
{"freq_range": [2.0, 80.0], "freq_res": 1.0, "aperiodic_params_": [0.12206413883439327, 0.9514526961501081], "gaussian_params_": [[9.332478587847579, 0.8293520460914839, 1.3398436658531936], [10.774599478850767, 0.5012781061647488, 0.2570780653148531], [15.227316446876399, 0.20537274780882725, 3.0915383931907567], [20.950269262246234, 0.1817313108290959, 0.2500000000025185], [66.45232319405461, 0.13957748439257164, 5.999999999999999]], "peak_params_": [[9.332478587847579, 0.8312138128145508, 2.679687331706387], [10.774599478850767, 0.8042351533275015, 0.5141561306297062], [15.227316446876399, 0.20492631478158063, 6.1830767863815135], [20.950269262246234, 0.21409882017760284, 0.500000000005037], [66.45232319405461, 0.1391814219300056, 11.999999999999998]], "r_squared_": 0.9763561968023854, "error_": 0.05163911109556314}
{"freq_range": [2.0, 80.0], "freq_res": 1.0, "aperiodic_params_": [0.4752447872987305, 1.1249752010369305], "gaussian_params_": [[8.538145871314432, 0.8097958783857894, 0.8216571222180925], [10.74973956114945, 1.0827013808411865, 1.0276064956722986], [16.710950844486415, 0.32572062700886556, 3.2437706983478773]], "peak_params_": [[8.538145871314432, 0.9648269030378804, 1.643314244436185], [10.74973956114945, 1.1293086826396226, 2.055212991344597], [16.710950844486415, 0.3244300225084238, 6.487541396695755]], "r_squared_": 0.9881388034682927, "error_": 0.04580174149379873}
{"freq_range": [2.0, 80.0], "freq_res": 1.0, "aperiodic_params_": [0.6364466923855271, 1.1695019357110672], "gaussian_params_": [[8.381450991634864, 0.9301576314993899, 0.8957035108064115], [10.792161611521774, 1.2954585611477865, 1.1486466133613038], [17.553719801271924, 0.5079861798767664, 2.8776686068835677], [21.478229335714246, 0.6339300729918428, 0.2563943026106817], [24.833640625724755, 0.2049016774230156, 0.5852433573008637]], "peak_params_": [[8.381450991634864, 0.9190762419132554, 1.791407021612823], [10.792161611521774, 1.3253680195627098, 2.2972932267226076], [17.553719801271924, 0.5019139720437247, 5.7553372137671355], [21.478229335714246, 0.3593002205422855, 0.5127886052213634], [24.833640625724755, 0.21464901020041893, 1.1704867146017275]], "r_squared_": 0.992336315292749, "error_": 0.04345689539387129}
{"freq_range": [2.0, 80.0], "freq_res": 1.0, "aperiodic_params_": [0.8885513930995595, 1.3080664905909065], "gaussian_params_": [[10.058047967084583, 1.4798715449516446, 1.7104571714966166], [18.200395539465035, 0.4864050629748362, 2.571695977332676]], "peak_params_": [[10.058047967084583, 1.4820330869384244, 3.420914342993233], [18.200395539465035, 0.4849613721143381, 5.143391954665352]], "r_squared_": 0.9866543920908477, "error_": 0.06372048687138702}
{"freq_range": [2.0, 80.0], "freq_res": 1.0, "aperiodic_params_": [1.2263229961540179, 1.4831010543914336], "gaussian_params_": [[10.129000921648924, 1.407630246154398, 1.662369674954839], [18.622138237871496, 0.40960544354609674, 2.653103997547169]], "peak_params_": [[10.129000921648924, 1.4054827762613713, 3.324739349909678], [18.622138237871496, 0.4054731069673112, 5.306207995094338]], "r_squared_": 0.9908343999979389, "error_": 0.050827286349028}
{"freq_range": [2.0, 80.0], "freq_res": 1.0, "aperiodic_params_": [0.6635894727355257, 1.2509819393240607], "gaussian_params_": [[9.835311675348697, 1.531540438730055, 1.750735034231298], [18.620738097476007, 0.5263287369814449, 5.194500853079686]], "peak_params_": [[9.835311675348697, 1.657574394506672, 3.501470068462596], [18.620738097476007, 0.5249294501437155, 10.389001706159371]], "r_squared_": 0.9882891570482008, "error_": 0.06086623587819936}
{"freq_range": [2.0, 80.0], "freq_res": 1.0, "aperiodic_params_": [0.5894741472568296, 1.2063474713036721], "gaussian_params_": [[9.904062956362916, 1.5929468620903753, 1.854164290468265], [17.954869566261543, 0.6052457285120705, 2.2891824988369955], [25.725219172216523, 0.2155316420418717, 3.3718474860003993]], "peak_params_": [[9.904062956362916, 1.59226474343048, 3.70832858093653], [17.954869566261543, 0.6208635395462072, 4.578364997673991], [25.725219172216523, 0.21607586196347262, 6.743694972000799]], "r_squared_": 0.9906256750104228, "error_": 0.05253076632020677}
{"freq_range": [2.0, 80.0], "freq_res": 1.0, "aperiodic_params_": [0.3397932441831927, 1.0184107624141705], "gaussian_params_": [[8.38391904691497, 0.8348130592110128, 0.9575638771030268], [10.291327101055984, 1.0626138519290425, 1.4530204507023128], [17.596318357770958, 0.4044895456705302, 2.1573715638113704], [65.45203475442699, 0.13154605609686287, 5.999999922162848], [73.41728578242419, 0.37640442143399366, 0.2725252525588981], [77.84847368346833, 0.16598077151068188, 3.421515024580155]], "peak_params_": [[8.38391904691497, 1.0768309373328513, 1.9151277542060536], [10.291327101055984, 1.243237613670939, 2.9060409014046256], [17.596318357770958, 0.3974708138168138, 4.314743127622741], [65.45203475442699, 0.13131712193969003, 11.999999844325696], [73.41728578242419, 0.23700111371879595, 0.5450505051177962], [77.84847368346833, 0.18058710086760366, 6.84303004916031]], "r_squared_": 0.9872576932518525, "error_": 0.04799259289395705}
{"freq_range": [2.0, 80.0], "freq_res": 1.0, "aperiodic_params_": [-0.39254701477529735, 0.9770783002069522], "gaussian_params_": [[9.478008532216435, 1.2066206097105654, 1.3801792088186713], [13.547965400864056, 0.12233085154734424, 3.6591228337951254], [66.45203459913596, 0.1082617234021299, 5.999999999999899], [73.54796540086404, 0.12032995653098054, 5.999999999938461]], "peak_params_": [[9.478008532216435, 1.1928850892571063, 2.7603584176373426], [13.547965400864056, 0.12703171411297598, 7.318245667590251], [66.45203459913596, 0.1624964668249529, 11.999999999999797], [73.54796540086404, 0.16906037165788135, 11.999999999876922]], "r_squared_": 0.9685205928968386, "error_": 0.06319994628312822}
{"freq_range": [2.0, 80.0], "freq_res": 1.0, "aperiodic_params_": [0.37341793112225796, 1.1426317913692297], "gaussian_params_": [[7.589008457402263, 1.3576154683163097, 0.32121132285935494], [8.858151828518684, 0.8005942835899674, 0.2500197317287054], [10.519522725831386, 1.0948907316943388, 0.9441069414885629], [15.543639751000311, 0.20664810981501605, 3.59855077448962], [69.93651990356423, 0.16639009983798936, 5.999999979598595], [76.97290343829204, 0.13333703190369586, 0.25015898771872963]], "peak_params_": [[7.589008457402263, 0.6550775663296536, 0.6424226457187099], [8.858151828518684, 1.021046204892028, 0.5000394634574108], [10.519522725831386, 1.0550193448630871, 1.8882138829771258], [15.543639751000311, 0.20499309091377005, 7.19710154897924], [69.93651990356423, 0.16638078751584606, 11.99999995919719], [76.97290343829204, 0.2157681731621719, 0.5003179754374593]], "r_squared_": 0.9833532727690341, "error_": 0.0512192168694662}
{"freq_range": [2.0, 80.0], "freq_res": 1.0, "aperiodic_params_": [0.5066963658422012, 1.1685303892043166], "gaussian_params_": [[8.287833464416769, 0.8228888094578275, 0.9192935395098345], [10.675986599362542, 1.287326524725735, 1.2952616086631121], [17.425130622260376, 0.41847556230206556, 3.3385183514685908], [21.471843555748883, 0.48012337980426184, 0.2626586198230155]], "peak_params_": [[8.287833464416769, 0.9436563289218666, 1.838587079019669], [10.675986599362542, 1.3239435610959034, 2.5905232173262243], [17.425130622260376, 0.415104907662299, 6.6770367029371815], [21.471843555748883, 0.33150912733302507, 0.525317239646031]], "r_squared_": 0.9907558151697049, "error_": 0.049704914715393636}
{"freq_range": [2.0, 80.0], "freq_res": 1.0, "aperiodic_params_": [0.7319305226490085, 1.3129804735557122], "gaussian_params_": [[9.788003311264376, 1.3823128869990673, 1.751450486818897], [17.542299416247737, 0.45110115758264907, 2.9669324330461104]], "peak_params_": [[9.788003311264376, 1.3900471115867814, 3.502900973637794], [17.542299416247737, 0.4457885013254475, 5.933864866092221]], "r_squared_": 0.9905719019834726, "error_": 0.05189212605656479}
{"freq_range": [2.0, 80.0], "freq_res": 1.0, "aperiodic_params_": [0.8989085435747638, 1.3138675530180781], "gaussian_params_": [[9.878421850655158, 1.3169370032531589, 1.7999073623620736], [17.836904809553307, 0.4812737014748546, 2.6430979348219945], [27.75542033990811, 0.16807180197562033, 2.2612003976947936]], "peak_params_": [[9.878421850655158, 1.3198700578959819, 3.599814724724147], [17.836904809553307, 0.48042351849083215, 5.286195869643989], [27.75542033990811, 0.16738787828045565, 4.522400795389587]], "r_squared_": 0.9895240917801493, "error_": 0.05452766416081893}
{"freq_range": [2.0, 80.0], "freq_res": 1.0, "aperiodic_params_": [0.3474741527381748, 0.9095403170304723], "gaussian_params_": [[8.346304934250238, 0.8363826543298, 0.8598134690775984], [10.31309249134364, 1.0740340769639236, 1.3357834567630194], [17.81932964492144, 0.35185749959944795, 1.843708141926563], [59.94940076040627, 0.1616440988636504, 5.999999999999999], [67.68022615239354, 0.20894688248691998, 0.6814574597427829], [74.35430025514272, 0.24529737246480326, 3.2850869726138323], [77.38312362348513, 0.4615031353722057, 0.2689926286961537], [79.47470742073564, 0.9604268788985454, 0.27006241861784164]], "peak_params_": [[8.346304934250238, 1.0110426348943042, 1.7196269381551967], [10.31309249134364, 1.1765427422298393, 2.6715669135260387], [17.81932964492144, 0.35017224213430437, 3.687416283853126], [59.94940076040627, 0.16165587919237145, 11.999999999999998], [67.68022615239354, 0.2906503959161302, 1.3629149194855659], [74.35430025514272, 0.25429211653617245, 6.570173945227665], [77.38312362348513, 0.34757423412143296, 0.5379852573923074], [79.47470742073564, 0.29618588864062434, 0.5401248372356833]], "r_squared_": 0.9824966053333586, "error_": 0.04509550126001177}
{"freq_range": [2.0, 80.0], "freq_res": 1.0, "aperiodic_params_": [-0.15405767496010156, 0.5622684892170932], "gaussian_params_": [[9.266399654191169, 1.2142585649855766, 1.488655707197873], [17.59189519938934, 0.25031168752277355, 1.2396810134748384]], "peak_params_": [[9.266399654191169, 1.1949705465771008, 2.977311414395746], [17.59189519938934, 0.23710907383988722, 2.479362026949677]], "r_squared_": 0.9413652971628037, "error_": 0.06855018394638215}
{"freq_range": [2.0, 80.0], "freq_res": 1.0, "aperiodic_params_": [0.42304255252902, 1.1840398113038133], "gaussian_params_": [[9.68767676485085, 1.1803410098640048, 1.6168555095899324], [11.110510791599035, 0.11581567656783405, 0.2502626642537154], [69.54796540086404, 0.2280940741802653, 5.999999999999999]], "peak_params_": [[9.68767676485085, 1.1585299639076998, 3.233711019179865], [11.110510791599035, 0.9541508022256496, 0.5005253285074308], [69.54796540086404, 0.22744766317027865, 11.999999999999998]], "r_squared_": 0.965741965599097, "error_": 0.0823435896442273}
{"freq_range": [2.0, 80.0], "freq_res": 1.0, "aperiodic_params_": [0.5111669821482714, 1.1934891423538074], "gaussian_params_": [[9.599034907094447, 1.1814859790549643, 1.5111581006543016], [17.61223726121917, 0.2818869541797584, 2.1730532886577287], [71.45203459913624, 0.16207905267844, 5.999999999999999], [78.34419884019744, 0.14223402094562376, 1.4523877032438137]], "peak_params_": [[9.599034907094447, 1.141229353783138, 3.022316201308603], [17.61223726121917, 0.27743488998642607, 4.3461065773154575], [71.45203459913624, 0.16162012473336662, 11.999999999999998], [78.34419884019744, 0.22764764157978323, 2.9047754064876274]], "r_squared_": 0.9783976977858737, "error_": 0.058858674640232075}
{"freq_range": [2.0, 80.0], "freq_res": 1.0, "aperiodic_params_": [0.402082220599677, 1.0593465943766414], "gaussian_params_": [[8.366408124512265, 0.5683030306318853, 0.873346606520223], [10.197780540043656, 1.086080344432988, 1.3958024297911769], [15.977631477625483, 0.1788890660400509, 2.2958188475314762], [17.880168378361812, 0.28338677204057283, 0.7837827072642582], [19.942403651152215, 0.16849629364863888, 0.25617169694104647], [75.56838778829218, 0.16583145206659858, 5.999999999999999]], "peak_params_": [[8.366408124512265, 0.8352642141052476, 1.746693213040446], [10.197780540043656, 1.1800816951086994, 2.7916048595823537], [15.977631477625483, 0.19502493461384818, 4.5916376950629525], [17.880168378361812, 0.40145647232395154, 1.5675654145285165], [19.942403651152215, 0.21015101094689137, 0.5123433938820929], [75.56838778829218, 0.16540294287681445, 11.999999999999998]], "r_squared_": 0.9854324149926257, "error_": 0.04634603929078588}
{"freq_range": [2.0, 80.0], "freq_res": 1.0, "aperiodic_params_": [-0.3176016413281901, 0.8193617050762892], "gaussian_params_": [[9.110568278300697, 1.2499863828114957, 1.298949564829131], [12.707385149004791, 0.25586876564113525, 1.584743925784349], [15.982519912334656, 0.005479039976861672, 0.25071004652810974], [17.688147089394906, 0.40190787493256697, 1.9192014265460227], [25.897513145614493, 0.18036000152067674, 0.4358638022869089]], "peak_params_": [[9.110568278300697, 1.262060681533688, 2.597899129658262], [12.707385149004791, 0.2860117272931143, 3.169487851568698], [15.982519912334656, 0.30799313768029424, 0.5014200930562195], [17.688147089394906, 0.3976051783736233, 3.8384028530920453], [25.897513145614493, 0.17547634727046435, 0.8717276045738178]], "r_squared_": 0.9822710293706867, "error_": 0.049085883839231445}
{"freq_range": [2.0, 80.0], "freq_res": 1.0, "aperiodic_params_": [0.27907437091568643, 1.146697210036577], "gaussian_params_": [[7.970042526466294, 0.44841662247611674, 0.5499729206244615], [9.818049572520932, 1.0302083096350911, 1.2281667939105032], [17.500025247743825, 0.3019866576894968, 2.8462130723280183], [65.56305001895328, 0.9542464126773718, 0.2618473582839028], [74.45695938795959, 0.7370476206101808, 0.27625862766198783]], "peak_params_": [[7.970042526466294, 0.7933281197733989, 1.099945841248923], [9.818049572520932, 1.02883786552136, 2.4563335878210064], [17.500025247743825, 0.2973631342912204, 5.692426144656037], [65.56305001895328, 0.23712996058534475, 0.5236947165678056], [74.45695938795959, 0.18765949943658966, 0.5525172553239757]], "r_squared_": 0.9849438009618195, "error_": 0.0532212433407167}
{"freq_range": [2.0, 80.0], "freq_res": 1.0, "aperiodic_params_": [0.16953341798945362, 1.0923943945627348], "gaussian_params_": [[9.30895549684738, 1.0425304522606278, 1.4946446069200103], [17.44995624331356, 0.17781451717690594, 2.514270885341585], [60.45203459913595, 0.1121875017612047, 5.1631877518125755], [66.43607319713996, 0.5715422438221981, 0.2634075396262574], [71.87181345345749, 0.139972604435459, 0.9371409066277062], [74.65014539445109, 0.19533511424450842, 0.614885750461604], [77.52942986323085, 1.049641219552885, 0.2619319777476527]], "peak_params_": [[9.30895549684738, 1.0211209343744465, 2.9892892138400207], [17.44995624331356, 0.17499161574063982, 5.02854177068317], [60.45203459913595, 0.11175837059349991, 10.326375503625151], [66.43607319713996, 0.20816505100379046, 0.5268150792525148], [71.87181345345749, 0.14788537909875155, 1.8742818132554124], [74.65014539445109, 0.16879435990134262, 1.229771500923208], [77.52942986323085, 0.2093689034314261, 0.5238639554953054]], "r_squared_": 0.9882707679335978, "error_": 0.03807436127752998}
{"freq_range": [2.0, 80.0], "freq_res": 1.0, "aperiodic_params_": [0.42400854473421606, 0.9366321896603824], "gaussian_params_": [[8.554511963605991, 0.8031120936767039, 0.7892189379965897], [10.436159120038523, 1.224386364397978, 0.3519496329021026], [12.308301059921703, 0.2904038867443575, 0.37886484070506193], [14.575905815251078, 0.13618928011694958, 1.025915936656683], [18.235845131642595, 0.3146822412514912, 0.6029321821585432], [57.54190228896263, 0.08689299000314588, 4.810981201977136], [62.914208292037735, 0.07041843455132374, 0.25000029462810025], [73.4569746986435, 0.06771838136481657, 3.315173627815658]], "peak_params_": [[8.554511963605991, 0.6851349888170077, 1.5784378759931794], [10.436159120038523, 0.7181987480736911, 0.7038992658042053], [12.308301059921703, 0.21449498693274072, 0.7577296814101239], [14.575905815251078, 0.12503643153742716, 2.051831873313366], [18.235845131642595, 0.2920245653779983, 1.2058643643170863], [57.54190228896263, 0.08650125426444655, 9.621962403954273], [62.914208292037735, 0.11251520180138219, 0.5000005892562005], [73.4569746986435, 0.06757601192359752, 6.630347255631316]], "r_squared_": 0.9899232671002791, "error_": 0.03141005955056422}
