{"freq_range": [2.0, 80.0], "freq_res": 1.0, "aperiodic_params_": [-0.2531097399091417, 0.940970625435493], "gaussian_params_": [[8.20000896781603, 1.3546785391618767, 0.9250054951611889], [11.861294950175727, 0.9489161174676525, 2.13890075407269], [17.007263426570344, 0.6740003624486003, 1.34731401625819], [54.658813613763385, 0.4694019735994268, 0.46719783422250044]], "peak_params_": [[8.20000896781603, 1.5093915958743147, 1.8500109903223778], [11.861294950175727, 0.9478912838831351, 4.27780150814538], [17.007263426570344, 0.7269391763169337, 2.69462803251638], [54.658813613763385, 0.3595320224787495, 0.9343956684450009]], "r_squared_": 0.9699854942036501, "error_": 0.08178902387279224}
{"freq_range": [2.0, 80.0], "freq_res": 1.0, "aperiodic_params_": [0.07628059030163666, 0.9672580807221114], "gaussian_params_": [[8.234404694564844, 1.0924616530154192, 0.8995795977624778], [11.933697529993266, 0.7844372032297245, 2.1695789208565395], [16.928989671284103, 0.5282181841745152, 0.925773361759193], [48.67635535558167, 0.2326761736567723, 0.7909693112047133], [54.85190772743407, 0.27001635714888944, 0.6188582612346927], [58.54950284718668, 0.20006202322831293, 1.1919364932010605], [68.54796540086404, 0.29081643027729226, 5.999999999999999]], "peak_params_": [[8.234404694564844, 1.2076005214447414, 1.7991591955249555], [11.933697529993266, 0.7842425620587553, 4.339157841713079], [16.928989671284103, 0.5780077467842427, 1.851546723518386], [48.67635535558167, 0.2154325048300194, 1.5819386224094265], [54.85190772743407, 0.28749294829923233, 1.2377165224693853], [58.54950284718668, 0.2682555683752561, 2.383872986402121], [68.54796540086404, 0.28999226619897556, 11.999999999999998]], "r_squared_": 0.9681460555651497, "error_": 0.06626438759214581}
{"freq_range": [2.0, 80.0], "freq_res": 1.0, "aperiodic_params_": [-0.07821373807670684, 1.0070716261320145], "gaussian_params_": [[8.216421301527808, 1.2803278324080989, 0.8573975062812164], [11.854651945821622, 0.818040062765611, 2.2413341293225453], [16.999336416463233, 0.5800526951894429, 1.1065858311197505], [54.55198809597502, 1.8493138414877361, 0.27123505932793884], [68.54796540086404, 0.24051311822962443, 5.999999999999999]], "peak_params_": [[8.216421301527808, 1.4266123130259343, 1.7147950125624327], [11.854651945821622, 0.816418869401223, 4.4826682586450906], [16.999336416463233, 0.6387195551484403, 2.213171662239501], [54.55198809597502, 0.49148095198066777, 0.5424701186558777], [68.54796540086404, 0.23983151206239461, 11.999999999999998]], "r_squared_": 0.9679479150422133, "error_": 0.07292911928358041}
{"freq_range": [2.0, 80.0], "freq_res": 1.0, "aperiodic_params_": [0.3222511128063585, 1.2126626181583586], "gaussian_params_": [[8.154122825069193, 1.1289187894547852, 0.8345257282349261], [11.853548480818805, 0.785844029984491, 2.346531743788334], [17.058777580832068, 0.5669874375022366, 1.0672796783337284], [43.987048351143045, 0.18106973678501354, 0.25000000000000017], [48.956183317799926, 0.24627537543631386, 0.638217758269067], [54.567500514193064, 0.9924998428299359, 0.30732299388510037], [59.543268640934095, 0.7685309503033895, 0.33893947240459305], [62.19192730106485, 0.22467051730251594, 0.6186625219567179], [69.22647388311157, 0.21914392280373068, 3.218490090515743], [74.36522170495392, 0.5026344522101709, 0.26975801982127184], [78.08134180291405, 0.3519650864990832, 1.6411794701605313]], "peak_params_": [[8.154122825069193, 1.3138654514530226, 1.6690514564698522], [11.853548480818805, 0.7843500915120717, 4.693063487576668], [17.058777580832068, 0.6370558613796921, 2.1345593566674568], [43.987048351143045, 0.180826911107419, 0.5000000000000003], [48.956183317799926, 0.24569565299701068, 1.276435516538134], [54.567500514193064, 0.3687049127776709, 0.6146459877702007], [59.543268640934095, 0.3140182035902557, 0.6778789448091861], [62.19192730106485, 0.23173528672570476, 1.2373250439134358], [69.22647388311157, 0.21860213338757206, 6.436980181031486], [74.36522170495392, 0.2899468364427331, 0.5395160396425437], [78.08134180291405, 0.356867880112407, 3.2823589403210627]], "r_squared_": 0.9913643670650144, "error_": 0.039342873228090075}
{"freq_range": [2.0, 80.0], "freq_res": 1.0, "aperiodic_params_": [0.21372592652893782, 1.1037348211566154], "gaussian_params_": [[8.207317072067033, 1.1682971345242714, 0.9264212002912101], [11.900334865147366, 0.8663811135239786, 2.0030355724293103], [16.860267437695143, 0.5453294637802104, 1.3634684843330729], [54.58963644656324, 1.1011170341304795, 0.2500037417022363], [59.26716892840964, 0.3436717444767112, 0.7997914213870138], [69.52101938941797, 0.8436219268919639, 0.28658682304770894], [72.54265819617265, 0.81230383875786, 0.25000033638836744], [79.0881683329772, 0.24096830426768082, 5.999999999999999]], "peak_params_": [[8.207317072067033, 1.2695335087663577, 1.8528424005824202], [11.900334865147366, 0.8665267115408073, 4.006071144858621], [16.860267437695143, 0.5763709393310756, 2.7269369686661458], [54.58963644656324, 0.28634625773503775, 0.5000074834044727], [59.26716892840964, 0.32590893123192943, 1.5995828427740275], [69.52101938941797, 0.28524594932920966, 0.5731736460954179], [72.54265819617265, 0.2964190210195121, 0.5000006727767349], [79.0881683329772, 0.24094228894365366, 11.999999999999998]], "r_squared_": 0.9842324255336062, "error_": 0.05618811731477099}
{"freq_range": [2.0, 80.0], "freq_res": 1.0, "aperiodic_params_": [0.14024248089545638, 0.9963349526214329], "gaussian_params_": [[8.282632902863156, 1.0109900389948787, 0.9017994401956583], [11.818051812833131, 0.765851505811352, 2.1677977443368786], [16.9295764056201, 0.5029453452563685, 0.9593921585222689], [44.31879442429586, 0.633564850193934, 0.2500012477182812], [55.17365564721314, 0.3293051414288838, 0.40164558169221765], [59.321854813462636, 0.5173323292027543, 0.47199626821207963], [69.58138093135558, 1.3326761210726288, 0.25000500956120125], [72.61936146784032, 1.1271084000579374, 0.2500048623261095], [77.54796540086404, 0.28507393420144783, 5.999999999999999]], "peak_params_": [[8.282632902863156, 1.1249224221484482, 1.8035988803913166], [11.818051812833131, 0.7633661152237505, 4.335595488673757], [16.9295764056201, 0.5455809006431713, 1.9187843170445378], [44.31879442429586, 0.2809935073250003, 0.5000024954365624], [55.17365564721314, 0.3001648875617706, 0.8032911633844353], [59.321854813462636, 0.41241172238543866, 0.9439925364241593], [69.58138093135558, 0.45723139250052247, 0.5000100191224025], [72.61936146784032, 0.5675640507949613, 0.500009724652219], [77.54796540086404, 0.2842660441657672, 11.999999999999998]], "r_squared_": 0.9733613861379383, "error_": 0.059794753666757156}
{"freq_range": [2.0, 80.0], "freq_res": 1.0, "aperiodic_params_": [0.07817112083533294, 1.0213848836281627], "gaussian_params_": [[8.239849301664993, 1.187734713736171, 0.785222646812899], [11.792184602010142, 0.6922235511780284, 2.2794350539628656], [16.936735139150834, 0.4851007400056935, 0.9869446488932238], [48.976024442027736, 0.2851926930742262, 0.2500134650748021], [54.55619244155038, 1.6843790360977142, 0.3063913007165205], [66.00389701833562, 0.28484867300554356, 0.2500097343641586], [70.54796540086404, 0.24800533493545865, 5.999999999999999], [72.00183905778098, 0.07483291815841939, 0.2500128122325366]], "peak_params_": [[8.239849301664993, 1.3070746247605782, 1.570445293625798], [11.792184602010142, 0.6893669129476984, 4.558870107925731], [16.936735139150834, 0.5350116762214499, 1.9738892977864475], [48.976024442027736, 0.28427679402557504, 0.5000269301496042], [54.55619244155038, 0.5986094743484787, 0.612782601433041], [66.00389701833562, 0.47089331491138986, 0.5000194687283172], [70.54796540086404, 0.24732689121984763, 11.999999999999998], [72.00183905778098, 0.31567909429338825, 0.5000256244650731]], "r_squared_": 0.9638776094063723, "error_": 0.07413763880964691}
{"freq_range": [2.0, 80.0], "freq_res": 1.0, "aperiodic_params_": [-0.01493412831785454, 0.9365855934489719], "gaussian_params_": [[8.23261317804816, 1.1901627299861823, 0.7733684949788582], [11.736183380362064, 0.7022967336430221, 2.2072108421819663], [16.93518908967334, 0.4723138605689651, 1.129079504113375], [48.94287401603978, 0.29027509565750026, 0.25000131280364696], [54.55519957289354, 1.4048279136185577, 0.3342615847693231], [65.64170827977125, 0.8733106581438389, 0.2832466710560982], [68.35260285624464, 0.28916191528282686, 1.3744781666402777], [72.31650847077108, 0.5687104502700023, 0.27384871881430295]], "peak_params_": [[8.23261317804816, 1.305148127596627, 1.5467369899577164], [11.736183380362064, 0.6973399371692878, 4.414421684363933], [16.93518908967334, 0.51241697155043, 2.25815900822675], [48.94287401603978, 0.2827950213128294, 0.5000026256072939], [54.55519957289354, 0.5795747674276042, 0.6685231695386462], [65.64170827977125, 0.45921581311053283, 0.5664933421121964], [68.35260285624464, 0.27980179663317606, 2.7489563332805553], [72.31650847077108, 0.3001731480237282, 0.5476974376286059]], "r_squared_": 0.9545379589129463, "error_": 0.0847756350216837}
{"freq_range": [2.0, 80.0], "freq_res": 1.0, "aperiodic_params_": [-0.004170577396903073, 0.9490234270994797], "gaussian_params_": [[8.238862963432892, 1.1737784863130754, 0.7743478683087031], [11.851976154809504, 0.6929120713661233, 2.3862675122560644], [16.96301725502688, 0.4796915746574709, 0.8859398775314998], [48.97419941510118, 0.27732405459379594, 0.2500000000000009], [54.552454285605336, 1.615237484374633, 0.31158191963819304], [65.61101892990365, 0.9765210156433044, 0.284258341431247], [68.465228714265, 0.2959247727222998, 1.2512833152554739], [72.34148362567333, 0.7138002113995184, 0.27088900847343633]], "peak_params_": [[8.238862963432892, 1.3075420650637104, 1.5486957366174061], [11.851976154809504, 0.6915891379209792, 4.772535024512129], [16.96301725502688, 0.5468877977128745, 1.7718797550629997], [48.97419941510118, 0.2758511291756576, 0.5000000000000018], [54.552454285605336, 0.5757441926678222, 0.6231638392763861], [65.61101892990365, 0.42537528394762014, 0.568516682862494], [68.465228714265, 0.27616187213455823, 2.5025666305109477], [72.34148362567333, 0.3279545593685278, 0.5417780169468727]], "r_squared_": 0.9557106334996874, "error_": 0.08228980016220164}
{"freq_range": [2.0, 80.0], "freq_res": 1.0, "aperiodic_params_": [-0.007594879447492459, 0.9534506806572499], "gaussian_params_": [[8.232543841836472, 1.1912385536390595, 0.7745139736379841], [11.779034331535922, 0.7177233811504136, 2.2430507942002467], [16.93428118706692, 0.49441557880453146, 1.0414814288294048], [48.97505908903172, 0.2947731386127312, 0.25000001540647165], [54.55270780313236, 1.560385541014005, 0.3198453713819629], [65.62970308115705, 0.9507007241480264, 0.28887010273912406], [68.19959102666762, 0.2963747934684597, 1.2707375445931366], [72.33492204764832, 0.6700495383438024, 0.26938261806067404]], "peak_params_": [[8.232543841836472, 1.3123544198308894, 1.5490279472759683], [11.779034331535922, 0.7142645336248984, 4.486101588400493], [16.93428118706692, 0.5412396684121494, 2.0829628576588095], [48.97505908903172, 0.2933098759144863, 0.5000000308129433], [54.55270780313236, 0.5868901176182106, 0.6396907427639258], [65.62970308115705, 0.48430126944407736, 0.5777402054782481], [68.19959102666762, 0.292741455437191, 2.541475089186273], [72.33492204764832, 0.31273134829368, 0.5387652361213481]], "r_squared_": 0.9552312578515245, "error_": 0.08459408202314675}
{"freq_range": [2.0, 80.0], "freq_res": 1.0, "aperiodic_params_": [0.42607484866395606, 1.2941510063693136], "gaussian_params_": [[8.086987084847822, 1.0048241675435956, 0.8172787648489394], [11.681222902723793, 0.9102047234849329, 2.6862438373308892], [16.70571332116497, 0.4869739478391826, 0.25001520023565543], [17.42739891780122, 0.39126845980099045, 1.8552241884737155], [54.58648357659494, 1.280059155658701, 0.25425757548901456], [59.3401707540735, 0.3690155676467033, 0.8896147477031935], [65.35041510993017, 0.2991130467365611, 0.39240587857023135], [69.2666329576303, 0.3488682704709205, 1.2190567193864856], [72.48826520284118, 0.9040350264793555, 0.2739856389492231], [77.63236853020996, 0.35179855728423715, 2.7128374947888827]], "peak_params_": [[8.086987084847822, 1.355058430168855, 1.6345575296978787], [11.681222902723793, 0.9092494106588622, 5.3724876746617785], [16.70571332116497, 0.7527880991698399, 0.5000304004713109], [17.42739891780122, 0.7527880991698399, 3.710448376947431], [54.58648357659494, 0.34108517519920034, 0.5085151509780291], [59.3401707540735, 0.34300041496867206, 1.779229495406387], [65.35041510993017, 0.20152907464216474, 0.7848117571404627], [69.2666329576303, 0.3428489027155315, 2.4381134387729713], [72.48826520284118, 0.2537509813850145, 0.5479712778984462], [77.63236853020996, 0.3485830500423708, 5.425674989577765]], "r_squared_": 0.9883358686458517, "error_": 0.04973854356313644}
{"freq_range": [2.0, 80.0], "freq_res": 1.0, "aperiodic_params_": [0.46419838977408234, 1.3318658396312242], "gaussian_params_": [[8.087411950832504, 1.0380723772331857, 0.8390146788516161], [11.650082130832619, 0.9151094123967091, 2.4979635906399302], [16.930473166773417, 0.24692291972464614, 0.3962294602941894], [17.419717870378722, 0.4288916740622105, 2.0106808854152387], [54.55365100146334, 1.5119766133101429, 0.2631887840789306], [59.37288446742557, 0.42850701116342005, 0.741152977536681], [62.27404355264139, 0.21159840291632673, 0.713448751806614], [65.43781765472032, 0.9094880307973062, 0.2707567472025939], [67.81373183099667, 0.21493643304695711, 0.5805447753906106], [69.55316920010719, 0.5310822867224935, 0.5364142442814372], [72.37174212759916, 0.22893686145565845, 0.9701169707146078], [77.81366244363244, 0.3750040289320106, 2.4820777264052203]], "peak_params_": [[8.087411950832504, 1.347110021702232, 1.6780293577032321], [11.650082130832619, 0.9175357017191675, 4.9959271812798605], [16.930473166773417, 0.7551484720582021, 0.7924589205883787], [17.419717870378722, 0.7551484720582021, 4.021361770830477], [54.55365100146334, 0.35891611976826443, 0.5263775681578612], [59.37288446742557, 0.37757159780217053, 1.482305955073362], [62.27404355264139, 0.1973515122876699, 1.426897503613228], [65.43781765472032, 0.24619011904672838, 0.5415134944051878], [67.81373183099667, 0.21234204992719796, 1.1610895507812211], [69.55316920010719, 0.38974546427074497, 1.0728284885628745], [72.37174212759916, 0.23688657619970854, 1.9402339414292156], [77.81366244363244, 0.3739487686967591, 4.964155452810441]], "r_squared_": 0.991508887861095, "error_": 0.04180017032221298}
{"freq_range": [2.0, 80.0], "freq_res": 1.0, "aperiodic_params_": [0.27719637626529664, 1.103970282684002], "gaussian_params_": [[8.153760592887378, 0.9560822106359289, 0.8407994430564542], [11.909190544674255, 0.8555444776446043, 2.6938533116058414], [17.043931031924508, 0.4945119615350677, 0.8237964591152397], [19.432405528127475, 0.5761784827448321, 0.3043077355111682], [54.570037962154444, 1.1751358352772427, 0.26389523503522344], [59.27551332221013, 0.4339490441368365, 0.5935065313615513], [61.62273023159869, 0.09840219038764102, 1.6930699520941346], [72.54796540086151, 0.307171850067203, 5.999999999976675]], "peak_params_": [[8.153760592887378, 1.2387420710197425, 1.6815988861129083], [11.909190544674255, 0.8550858363365632, 5.387706623211683], [17.043931031924508, 0.6372741913518059, 1.6475929182304794], [19.432405528127475, 0.2662294920874815, 0.6086154710223364], [54.570037962154444, 0.3159512939430169, 0.5277904700704469], [59.27551332221013, 0.44326790002472416, 1.1870130627231026], [61.62273023159869, 0.1615063510863377, 3.386139904188269], [72.54796540086151, 0.3063013352892623, 11.99999999995335]], "r_squared_": 0.9784046412770095, "error_": 0.058529859582784616}
{"freq_range": [2.0, 80.0], "freq_res": 1.0, "aperiodic_params_": [0.1870730138184839, 0.9835658650229467], "gaussian_params_": [[8.32890751880639, 0.8442307128894625, 0.8690989352184616], [12.485219433017985, 0.7130666827886989, 3.4216262177932064], [54.849173204516376, 0.4057265891336085, 0.5041779537271968], [59.377097260224005, 0.7393630461157785, 0.5187423855669309], [69.1503145980686, 0.43551713681288506, 1.1649712088326938], [72.57903884116197, 1.5905184424426455, 0.27265360347065964], [79.54796540086151, 0.4244351472583005, 3.4898904053018436]], "peak_params_": [[8.32890751880639, 1.0878859050889083, 1.7381978704369232], [12.485219433017985, 0.7060454677347304, 6.843252435586413], [54.849173204516376, 0.38797192641677625, 1.0083559074543935], [59.377097260224005, 0.5676837384580568, 1.0374847711338617], [69.1503145980686, 0.43631389959807554, 2.3299424176653876], [72.57903884116197, 0.557822661659233, 0.5453072069413193], [79.54796540086151, 0.4208896199669616, 6.979780810603687]], "r_squared_": 0.9488367635176947, "error_": 0.09012356938346863}
{"freq_range": [2.0, 80.0], "freq_res": 1.0, "aperiodic_params_": [0.21053253313017337, 0.9453209621957338], "gaussian_params_": [[8.291589678159454, 0.8587080094619444, 0.9120375878189833], [11.712739346486538, 0.6583212115318986, 2.2972836185885464], [16.76539900223807, 0.41759285126754053, 0.5811354836068796], [37.53525375654281, 1.1191555783142813, 0.2762670913992382], [47.883691041231494, 0.30898647397974305, 0.2503070581792579], [52.61074904977123, 0.19467756287859203, 2.232688186093648], [59.404043363890686, 0.5226868231692281, 0.7824509854855349], [63.63164597210479, 0.6388132705016083, 0.2944815163636531], [66.04073110999009, 0.3664452386607876, 0.2502139220747429], [68.2683257419208, 0.46586673777759036, 0.25122173793794045], [69.5855003225183, 0.9606070959062456, 0.2504657332205378], [75.54796540086404, 0.38150122879846465, 5.547083245883096]], "peak_params_": [[8.291589678159454, 0.9942712204898816, 1.8240751756379665], [11.712739346486538, 0.653415233395253, 4.594567237177093], [16.76539900223807, 0.4314953379487986, 1.1622709672137592], [37.53525375654281, 0.27188304457601586, 0.5525341827984764], [47.883691041231494, 0.30044928044574415, 0.5006141163585158], [52.61074904977123, 0.1918398492297, 4.465376372187296], [59.404043363890686, 0.4651458549720836, 1.5649019709710699], [63.63164597210479, 0.33584889801474715, 0.5889630327273062], [66.04073110999009, 0.4483475759675195, 0.5004278441494858], [68.2683257419208, 0.4145155201393971, 0.5024434758758809], [69.5855003225183, 0.4756054367488065, 0.5009314664410756], [75.54796540086404, 0.3802366114719815, 11.094166491766192]], "r_squared_": 0.9524564272803133, "error_": 0.0680171549296679}
{"freq_range": [2.0, 80.0], "freq_res": 1.0, "aperiodic_params_": [0.23900258380350295, 0.998677901713814], "gaussian_params_": [[8.04798465564954, 0.9944058563857999, 0.645623125660946], [9.490908913807205, 0.5010974763226216, 0.9688020169252552], [12.452941308883375, 0.5419205797370968, 1.7881365273148995], [16.859425296837156, 0.39277040317675493, 0.818620336623275], [44.416790364995826, 0.7905990865793537, 0.2742523977514938], [46.66412670369549, 0.2905879174412078, 0.5214427530904541], [48.713636303957585, 0.4464866989053558, 0.5297114659717128], [54.661554406745005, 0.6552072113987517, 0.6988517680806158], [59.55018349809929, 0.245365287437269, 1.1470538873826635], [68.149371691451, 0.2773409537535876, 3.0405248882668805], [74.47514133449953, 0.6092675755492557, 0.29837010274263664], [77.3044291349082, 0.5503450908182345, 0.47279532557933823], [79.26829721294405, 0.271544997236773, 0.6312313723820011]], "peak_params_": [[8.04798465564954, 1.1693994807312587, 1.291246251321892], [9.490908913807205, 0.8599944257815034, 1.9376040338505105], [12.452941308883375, 0.5423255664393569, 3.576273054629799], [16.859425296837156, 0.4083908050024422, 1.63724067324655], [44.416790364995826, 0.24913616734599398, 0.5485047955029876], [46.66412670369549, 0.2385318001594794, 1.0428855061809081], [48.713636303957585, 0.3857991076219143, 1.0594229319434256], [54.661554406745005, 0.5828247648550293, 1.3977035361612316], [59.55018349809929, 0.23484590431114127, 2.294107774765327], [68.149371691451, 0.2770064804424286, 6.081049776533761], [74.47514133449953, 0.215002718898041, 0.5967402054852733], [77.3044291349082, 0.45174356062462584, 0.9455906511586765], [79.26829721294405, 0.24945467389811582, 1.2624627447640022]], "r_squared_": 0.9783569672386704, "error_": 0.04945996213045128}
{"freq_range": [2.0, 80.0], "freq_res": 1.0, "aperiodic_params_": [0.2522134757982817, 1.0138114648990788], "gaussian_params_": [[8.09083982349944, 1.037062673901597, 0.6559157155202219], [9.633559473982935, 0.49562388189850404, 0.9865985516195528], [12.54976374902005, 0.5358114783715866, 1.6758085367381297], [16.861113184185704, 0.4014105872564911, 0.8981055450483914], [44.38504050546898, 0.7601036609022204, 0.2720048882971744], [46.75223252495645, 0.25422366690904297, 0.6819851461151938], [48.66262486900391, 0.54678976110408, 0.4323658398164659], [54.62606689489702, 0.7192729502604174, 0.6159942185355507], [59.41478907221914, 0.23083203080968076, 1.5671315914240318], [68.36135065853429, 0.27659238767313604, 3.364324534895452], [74.47450074719448, 0.6126736816194979, 0.29126618913234065], [77.2709243685195, 0.4987231351708521, 0.571257494529586], [79.29114275693398, 0.2601151469035971, 0.6641141920905954]], "peak_params_": [[8.09083982349944, 1.166451726523614, 1.3118314310404438], [9.633559473982935, 0.6459812040973006, 1.9731971032391056], [12.54976374902005, 0.5183257717958619, 3.3516170734762594], [16.861113184185704, 0.41240353660446183, 1.7962110900967827], [44.38504050546898, 0.27916638490965573, 0.5440097765943488], [46.75223252495645, 0.2383242670717154, 1.3639702922303876], [48.66262486900391, 0.4043922296616831, 0.8647316796329318], [54.62606689489702, 0.6027090645919443, 1.2319884370711014], [59.41478907221914, 0.22864850475277443, 3.1342631828480636], [68.36135065853429, 0.2750016408087619, 6.728649069790904], [74.47450074719448, 0.2304287630329298, 0.5825323782646813], [77.2709243685195, 0.45658853247286557, 1.142514989059172], [79.29114275693398, 0.2432578335199589, 1.3282283841811908]], "r_squared_": 0.9803593491478165, "error_": 0.04689165927837494}
{"freq_range": [2.0, 80.0], "freq_res": 1.0, "aperiodic_params_": [-0.04034295837036581, 0.9625204638422872], "gaussian_params_": [[8.202738258628143, 1.184788653042957, 0.7944905271154221], [11.78885347954022, 0.7760845140198986, 2.2797047310973926], [17.015624477989878, 0.5007819259786283, 1.2185495911234816], [48.965864550556354, 0.3039033071327026, 0.2500001354760529], [54.63255298909211, 0.7671923034603563, 0.5017919688660262], [65.61348087686072, 0.8580627968842496, 0.29106627477035174], [68.36742526671722, 0.3088717846519799, 1.1052017123699969], [72.3015106460366, 0.5402757013809303, 0.2665562713978041]], "peak_params_": [[8.202738258628143, 1.3418644774769892, 1.5889810542308442], [11.78885347954022, 0.7728806999280703, 4.559409462194785], [17.015624477989878, 0.5576593868081273, 2.437099182246963], [48.965864550556354, 0.3010835379625558, 0.5000002709521058], [54.63255298909211, 0.5867671706995548, 1.0035839377320523], [65.61348087686072, 0.3864458559576338, 0.5821325495407035], [68.36742526671722, 0.2922660346722299, 2.2104034247399937], [72.3015106460366, 0.28635281075523755, 0.5331125427956082]], "r_squared_": 0.9575074085333686, "error_": 0.08390504067579876}
{"freq_range": [2.0, 80.0], "freq_res": 1.0, "aperiodic_params_": [-0.02018729933478053, 0.966386907423903], "gaussian_params_": [[8.201580728646876, 1.1746297777481358, 0.7971670444235062], [11.804169005175783, 0.7602732160173176, 2.269510533575938], [17.04388152075151, 0.4784880035556932, 1.2212750674339474], [37.47384163135246, 0.8628169249679473, 0.2857713687672875], [48.9831946038534, 0.2786563676237057, 0.2500005423318703], [54.55248160483664, 1.6471266386118253, 0.30704530760037524], [60.686121096553514, 0.16290582212195934, 2.534361166028282], [65.93552894202578, 0.3216741757542887, 0.25004881780945243], [68.53516764426875, 0.29504826011076807, 1.305925366042968], [72.27973400004765, 0.49193352735360024, 0.2629162905359376]], "peak_params_": [[8.201580728646876, 1.324245416073452, 1.5943340888470123], [11.804169005175783, 0.7575565577450527, 4.539021067151876], [17.04388152075151, 0.5334911270409395, 2.442550134867895], [37.47384163135246, 0.21822590608344195, 0.571542737534575], [48.9831946038534, 0.27803142811315573, 0.5000010846637406], [54.55248160483664, 0.5825776932760367, 0.6140906152007505], [60.686121096553514, 0.16166124024206097, 5.068722332056564], [65.93552894202578, 0.3740706706501673, 0.5000976356189049], [68.53516764426875, 0.2776876276181912, 2.611850732085936], [72.27973400004765, 0.28805675159237554, 0.5258325810718752]], "r_squared_": 0.9625253485527502, "error_": 0.07347245161030405}
{"freq_range": [2.0, 80.0], "freq_res": 1.0, "aperiodic_params_": [0.5769115763690553, 1.358837608725058], "gaussian_params_": [[8.043173148045708, 0.9491919449062219, 0.7774845448264641], [11.38733272078481, 0.8652734961306472, 2.5400177967590643], [17.057380305833135, 0.3753050257598783, 2.4743461047972684], [17.22757847348462, 0.27431317152937723, 0.4265952771892634], [54.55355621460225, 1.4088992558153166, 0.25000000010463835], [59.41594555001509, 0.2997640907116685, 0.8194613498703984], [70.9040633855088, 0.18581499670902246, 5.999999999999999], [77.57215937105278, 0.23504579578160126, 1.3938151044246834]], "peak_params_": [[8.043173148045708, 1.3037964052746855, 1.5549690896529282], [11.38733272078481, 0.8747081190328209, 5.0800355935181285], [17.057380305833135, 0.6884471304047056, 4.948692209594537], [17.22757847348462, 0.6884471304047056, 0.8531905543785268], [54.55355621460225, 0.29156022512377455, 0.5000000002092767], [59.41594555001509, 0.2894932361270217, 1.6389226997407969], [70.9040633855088, 0.18579473856976558, 11.999999999999998], [77.57215937105278, 0.31656343343300897, 2.7876302088493667]], "r_squared_": 0.9885523930241501, "error_": 0.052007616264248865}
{"freq_range": [2.0, 80.0], "freq_res": 1.0, "aperiodic_params_": [0.5285437324055167, 1.2982536803766571], "gaussian_params_": [[8.097627680130138, 1.0300787363741697, 0.8520859868062333], [11.682521076342589, 0.9005033487742528, 2.2708420811192145], [16.941222248570448, 0.410552158782919, 2.0840691322898808], [17.30109373431211, 0.3708831092706419, 0.2500081103568331], [54.702430898337134, 0.3569726392061171, 0.6343872828314996], [59.43692097532887, 0.4019499439514536, 1.1455769141150192], [62.4890094775363, 0.6663787589260135, 0.28976523098777224], [65.42740285451008, 0.8809354817507437, 0.26609275305924984], [68.42592282460663, 0.24760873003575876, 1.8916164858772169], [69.5241421693107, 0.8136652988056566, 0.2673189920385642], [77.31617228837874, 0.3583352369007062, 3.7188766489015097]], "peak_params_": [[8.097627680130138, 1.26517176650782, 1.7041719736124665], [11.682521076342589, 0.9164743492195206, 4.541684162238429], [16.941222248570448, 0.6480300898540641, 4.1681382645797616], [17.30109373431211, 0.6480300898540641, 0.5000162207136662], [54.702430898337134, 0.32000693444719586, 1.2687745656629992], [59.43692097532887, 0.3737559842043896, 2.2911538282300383], [62.4890094775363, 0.19417395421931394, 0.5795304619755445], [65.42740285451008, 0.29202319224262063, 0.5321855061184997], [68.42592282460663, 0.25695531965737484, 3.7832329717544337], [69.5241421693107, 0.3937508349566916, 0.5346379840771284], [77.31617228837874, 0.35705109261928736, 7.437753297803019]], "r_squared_": 0.9919127907721808, "error_": 0.03988720109500492}
{"freq_range": [2.0, 80.0], "freq_res": 1.0, "aperiodic_params_": [0.24502942033949848, 1.0379010079666198], "gaussian_params_": [[8.142287304255255, 0.9971589835371985, 0.8789955195873519], [11.847570438654294, 0.8888064090684427, 2.2925273644483672], [17.02245922952071, 0.4138497894632226, 1.356689020454867], [54.535558453064475, 1.2572731612389858, 0.27958682688292735], [59.57414368926455, 0.3987127391829323, 1.5679158088809266], [65.1771097924937, 0.30120942339459017, 0.6193115940953413], [69.2703650902592, 0.34862090845836763, 0.8558555491760734], [77.73924945271244, 0.30428914460383105, 5.999999999999999]], "peak_params_": [[8.142287304255255, 1.2015316581716657, 1.7579910391747038], [11.847570438654294, 0.8873468271446985, 4.5850547288967345], [17.02245922952071, 0.4849065371490259, 2.713378040909734], [54.535558453064475, 0.32227163768787914, 0.5591736537658547], [59.57414368926455, 0.3881215559703093, 3.1358316177618533], [65.1771097924937, 0.32208634086310384, 1.2386231881906826], [69.2703650902592, 0.4369957907347637, 1.7117110983521469], [77.73924945271244, 0.304001934720592, 11.999999999999998]], "r_squared_": 0.9769073623874029, "error_": 0.06146201343266651}
{"freq_range": [2.0, 80.0], "freq_res": 1.0, "aperiodic_params_": [0.08145748167408887, 0.9620099244242765], "gaussian_params_": [[8.374511685169326, 0.8078882786749173, 0.940303235179955], [12.402572592376039, 0.7775975703044489, 3.364300804195349], [54.55680681101913, 0.8645624031828085, 0.3225792623942232], [59.526770190357745, 0.3984039765355087, 1.5417477958122798], [69.14815180525808, 0.34940522083119996, 0.9706180399657349], [72.54554778686517, 1.5494375553179802, 0.2504229840099249], [78.89769230261946, 0.34516031102124584, 5.9999999802166535]], "peak_params_": [[8.374511685169326, 1.0765753317343998, 1.88060647035991], [12.402572592376039, 0.7725281883239964, 6.728601608390698], [54.55680681101913, 0.34191246205695247, 0.6451585247884464], [59.526770190357745, 0.3824919488950105, 3.0834955916245597], [69.14815180525808, 0.4338932374823996, 1.9412360799314698], [72.54554778686517, 0.5116240836080423, 0.5008459680198498], [78.89769230261946, 0.34511013763516685, 11.999999960433307]], "r_squared_": 0.950870185621644, "error_": 0.0848182655824014}
{"freq_range": [2.0, 80.0], "freq_res": 1.0, "aperiodic_params_": [0.10857158218457925, 0.9050655045521608], "gaussian_params_": [[8.48487225272388, 0.9116884164533952, 1.0109888864175993], [11.522325517707372, 0.7377132000587111, 1.7878698845186043], [14.625609419891152, 0.4437201559433921, 0.3599556578384416], [16.67943922336669, 0.5390586023537778, 0.6013316537653447], [63.9624888932784, 0.3644936799163899, 0.7353124903316031], [66.34255352774277, 0.6645462479869347, 0.2752122289342912], [68.35386426144538, 0.3755803868387959, 0.6835759117087893], [69.95609575979347, 0.28833387008150785, 0.6218552779079315], [72.72544948308466, 0.5722331199112038, 0.5853475513084186], [75.028329131102, 0.47175998679645964, 0.5435210969334684], [77.14001422538145, 0.5608189630973106, 0.5466510001982086], [79.41908551118928, 0.3898316540990867, 0.8127025708474326]], "peak_params_": [[8.48487225272388, 0.9185795633925027, 2.0219777728351986], [11.522325517707372, 0.7140091155138877, 3.5757397690372086], [14.625609419891152, 0.3805008209041122, 0.7199113156768832], [16.67943922336669, 0.47441065866307874, 1.2026633075306894], [63.9624888932784, 0.3640197077715619, 1.4706249806632061], [66.34255352774277, 0.31511518136436867, 0.5504244578685824], [68.35386426144538, 0.33053035380583196, 1.3671518234175786], [69.95609575979347, 0.3083026942300875, 1.243710555815863], [72.72544948308466, 0.51307479600546, 1.1706951026168373], [75.028329131102, 0.47168449404237944, 1.0870421938669368], [77.14001422538145, 0.5480209935372036, 1.0933020003964171], [79.41908551118928, 0.3430160764996797, 1.6254051416948652]], "r_squared_": 0.9526838841180086, "error_": 0.07238762184666599}
{"freq_range": [2.0, 80.0], "freq_res": 1.0, "aperiodic_params_": [0.12670012650393406, 1.1159464263430419], "gaussian_params_": [[7.8917509537723465, 0.9880577203085111, 0.6923004788355808], [10.032407170423058, 0.9820156988166149, 1.4111001997200925], [12.939220365672908, 0.5623362552853072, 1.0401546338832086], [16.189219401414583, 0.5768415635979943, 2.075843195066265], [48.55618581437657, 1.321075518294701, 0.2711917099644426], [54.51931591522409, 2.0730334177943046, 0.2736693814156856], [59.58230650046859, 0.4168506587764877, 0.944149784904689], [69.56964361265827, 0.2347212540004665, 3.5321854874599636], [74.26354527373594, 0.3532194388724613, 0.2500049257270755], [77.43908607327393, 0.4459695339596918, 1.3182393334782485]], "peak_params_": [[7.8917509537723465, 1.3243609771197509, 1.3846009576711615], [10.032407170423058, 1.008478546054755, 2.822200399440185], [12.939220365672908, 0.8461750294138037, 2.0803092677664172], [16.189219401414583, 0.5819867125010298, 4.15168639013253], [48.55618581437657, 0.3462224030476544, 0.5423834199288852], [54.51931591522409, 0.44334141590053977, 0.5473387628313712], [59.58230650046859, 0.383969682761389, 1.888299569809378], [69.56964361265827, 0.23298558214956544, 7.064370974919927], [74.26354527373594, 0.3243732008105309, 0.500009851454151], [77.43908607327393, 0.4475862727090554, 2.636478666956497]], "r_squared_": 0.9829770100437459, "error_": 0.051868497658934476}
{"freq_range": [2.0, 80.0], "freq_res": 1.0, "aperiodic_params_": [0.1315195274088806, 1.1208850273732955], "gaussian_params_": [[7.882414443854507, 0.9279354424999757, 0.6773106189917131], [10.008973790150952, 0.9785009321778357, 1.5240495083149779], [12.95061044838234, 0.4798917706027664, 0.9804634791441846], [16.063074223621104, 0.5795541587065963, 2.2363423352411638], [48.565792083052, 1.5609440666575676, 0.25295620185236817], [54.52212313069127, 2.3055844255264915, 0.2617909380501549], [59.517976739850475, 1.2404110753183635, 0.289711870480808], [69.45203459913596, 0.21286723419111447, 5.999999999999999], [74.4551302940238, 0.7085653320250576, 0.25016073166652514], [77.44703939311658, 0.3911890758490119, 1.1519573968712542]], "peak_params_": [[7.882414443854507, 1.3253658428226196, 1.3546212379834262], [10.008973790150952, 1.0053528971759262, 3.0480990166299557], [12.95061044838234, 0.8487484668313869, 1.9609269582883693], [16.063074223621104, 0.5835630218132634, 4.4726846704823275], [48.565792083052, 0.3583766282807479, 0.5059124037047363], [54.52212313069127, 0.4474319612470681, 0.5235818761003098], [59.517976739850475, 0.3723263899551037, 0.579423740961616], [69.45203459913596, 0.21226397553938114, 11.999999999999998], [74.4551302940238, 0.2995602327177387, 0.5003214633330503], [77.44703939311658, 0.4593002608396759, 2.3039147937425084]], "r_squared_": 0.9818563199788295, "error_": 0.051894034071998635}
{"freq_range": [2.0, 80.0], "freq_res": 1.0, "aperiodic_params_": [0.13368282421398833, 1.1251852790350965], "gaussian_params_": [[7.866750199189118, 0.9087578059166642, 0.6686135431322703], [9.942363865098669, 0.9805051007812811, 1.5188385776543507], [12.953374314737587, 0.4562700418072608, 0.9890348040314222], [15.971076163287144, 0.5821224851530851, 2.407721542894835], [48.571555806949476, 1.5097845422247702, 0.2551690962954881], [54.519224459254964, 2.7489220637738887, 0.25520170688963445], [59.59057996419732, 0.39198140558169214, 0.9917522008943438], [69.45203459913596, 0.23708836329431726, 4.107209008217837], [74.42236716715126, 0.754811692614271, 0.2500001369620005], [77.47072299385756, 0.4410132862481507, 1.2906552184344695]], "peak_params_": [[7.866750199189118, 1.3261458527200338, 1.3372270862645406], [9.942363865098669, 1.017564916368458, 3.0376771553087014], [12.953374314737587, 0.8568785211439316, 1.9780696080628444], [15.971076163287144, 0.5863946092904221, 4.81544308578967], [48.571555806949476, 0.368744443863416, 0.5103381925909762], [54.519224459254964, 0.46660215651204284, 0.5104034137792689], [59.59057996419732, 0.3767465313776863, 1.9835044017886876], [69.45203459913596, 0.23565678386878064, 8.214418016435674], [74.42236716715126, 0.3214384807854087, 0.500000273924001], [77.47072299385756, 0.4564431859260807, 2.581310436868939]], "r_squared_": 0.978987881966013, "error_": 0.05646376353485864}
{"freq_range": [2.0, 80.0], "freq_res": 1.0, "aperiodic_params_": [0.6013858503826129, 1.3629812019497036], "gaussian_params_": [[8.064423524287959, 0.9312416385215692, 0.7317255775819047], [10.712301214058293, 0.5574230717735068, 2.0297454059067506], [15.207839399346538, 0.5733130021279061, 3.4934282062598787], [49.179749511687874, 0.2207694220815184, 0.407438555873647], [54.655265866316775, 0.848456882139261, 0.2683273222856056], [59.48268298133357, 0.3492435119207532, 0.73689473969628], [67.60984488107562, 0.16161495797343942, 0.27568370857148794], [69.46265657397147, 0.1837893404994049, 3.89842402841809], [77.26139787457254, 0.3829371382144032, 1.098898449294017]], "peak_params_": [[8.064423524287959, 1.224136516577298, 1.4634511551638094], [10.712301214058293, 0.8297047546234644, 4.059490811813501], [15.207839399346538, 0.632167151139833, 6.986856412519757], [49.179749511687874, 0.20029763936721, 0.814877111747294], [54.655265866316775, 0.37190279399244597, 0.5366546445712111], [59.48268298133357, 0.2868270759991569, 1.47378947939256], [67.60984488107562, 0.23066779221264277, 0.5513674171429759], [69.46265657397147, 0.1825000893028501, 7.79684805683618], [77.26139787457254, 0.4006073058617219, 2.197796898588034]], "r_squared_": 0.9925321760805841, "error_": 0.041985844042219576}
{"freq_range": [2.0, 80.0], "freq_res": 1.0, "aperiodic_params_": [0.7072655474243541, 1.4500875520575895], "gaussian_params_": [[8.101610360150618, 0.9882500521793907, 0.8086959934886985], [11.59358706128469, 0.8492622792284346, 2.302507801539993], [16.876464635410233, 0.5051893758556221, 2.255030525453779], [54.61726367095279, 1.0389901218653235, 0.25000266933581405], [59.614394083644136, 0.3296252128795643, 1.3413788154266924], [65.1974924044939, 0.22887413245497998, 0.6444388700483173], [67.63457393074141, 0.361414445075715, 0.35688874160047723], [69.51433950405308, 1.5458351832561705, 0.2790586046657006], [77.34593077343047, 0.299962281813166, 3.328827052966595]], "peak_params_": [[8.101610360150618, 1.2319442412838482, 1.617391986977397], [11.59358706128469, 0.8848971770177475, 4.605015603079986], [16.876464635410233, 0.5583619988886164, 4.510061050907558], [54.61726367095279, 0.3227529996388476, 0.5000053386716281], [59.614394083644136, 0.3162832107130502, 2.6827576308533847], [65.1974924044939, 0.218788438929729, 1.2888777400966347], [67.63457393074141, 0.21981116356846986, 0.7137774832009545], [69.51433950405308, 0.36626490636747877, 0.5581172093314012], [77.34593077343047, 0.2983469542944739, 6.65765410593319]], "r_squared_": 0.9904698490536825, "error_": 0.048451515721816815}
{"freq_range": [2.0, 80.0], "freq_res": 1.0, "aperiodic_params_": [0.5759857922929296, 1.287996501431644], "gaussian_params_": [[8.173812725160989, 0.9592471240527202, 0.8245983531073035], [11.831597460030089, 0.8715259312132904, 2.3598858687481994], [16.9152849922288, 0.4282053645293516, 1.8645363297674078], [54.62782666114123, 0.3362406786559651, 0.46424602198926324], [59.4361867845292, 0.3797349326178801, 1.063104659593251], [62.44206873377855, 0.6531499900786536, 0.27368611123036013], [65.16458083508918, 0.21251416410004878, 0.6070614290220832], [67.71865875373172, 0.2658005992789303, 0.5595067927067902], [69.52397570019086, 1.966702027193566, 0.2613717003744399], [76.80730405204862, 0.31055019723840055, 3.5146440073268885]], "peak_params_": [[8.173812725160989, 1.1714354965169282, 1.649196706214607], [11.831597460030089, 0.8825910852063721, 4.719771737496399], [16.9152849922288, 0.5069624263657785, 3.7290726595348156], [54.62782666114123, 0.2438968633716796, 0.9284920439785265], [59.4361867845292, 0.3490812633712337, 2.126209319186502], [62.44206873377855, 0.1979768824700079, 0.5473722224607203], [65.16458083508918, 0.205948400700239, 1.2141228580441663], [67.71865875373172, 0.24768364026035838, 1.1190135854135803], [69.52397570019086, 0.4221717821679891, 0.5227434007488798], [76.80730405204862, 0.3100837978559967, 7.029288014653777]], "r_squared_": 0.9920591992417342, "error_": 0.03925818567013014}
{"freq_range": [2.0, 80.0], "freq_res": 1.0, "aperiodic_params_": [0.28429323917875754, 1.018330090755288], "gaussian_params_": [[8.2197206261021, 0.8920734026913437, 0.8617668466167819], [12.047178624781381, 0.8673165520777009, 2.508040758552452], [17.11827057648802, 0.30962933212055505, 1.0944099406722134], [54.53932662626615, 0.22290387353127278, 1.418956924315372], [59.39832892541591, 0.4313628852946796, 1.25175032384608], [62.348289487481146, 0.18588305516979378, 0.676535660728453], [65.39581198142578, 0.9542015628252322, 0.25347609253007947], [68.87204565578739, 0.24826792409768805, 2.9853440628141867], [69.51576733046623, 1.063703599751044, 0.26024573132790935], [77.07591987039092, 0.3675783196754619, 2.4038825441564113]], "peak_params_": [[8.2197206261021, 1.099446825249016, 1.7235336932335639], [12.047178624781381, 0.8672277681352992, 5.016081517104904], [17.11827057648802, 0.43123899552430167, 2.188819881344427], [54.53932662626615, 0.21236511174493433, 2.837913848630744], [59.39832892541591, 0.4127079605281587, 2.50350064769216], [62.348289487481146, 0.23011395856364025, 1.353071321456906], [65.39581198142578, 0.38910073070956486, 0.5069521850601589], [68.87204565578739, 0.39859617320118956, 5.9706881256283735], [69.51576733046623, 0.424373305412757, 0.5204914626558187], [77.07591987039092, 0.3734943934212658, 4.807765088312823]], "r_squared_": 0.9790763880939389, "error_": 0.053323857334999065}
{"freq_range": [2.0, 80.0], "freq_res": 1.0, "aperiodic_params_": [-0.036887555044877736, 0.7367197304805617], "gaussian_params_": [[8.366402764029731, 0.9482553270092746, 1.0464590034628019], [11.7503108254497, 0.8231268987832819, 1.841381883426824], [14.5543064457675, 0.5751102574136999, 0.29804967387523496], [16.90847796439426, 0.35870348746726183, 1.1613228842653074], [37.628514696492076, 0.757181623057786, 0.2600430449961152], [51.59363364831214, 0.5048142652002262, 0.31370704942110833], [54.51774748170462, 0.30907256011771006, 1.0138687702129863], [59.40169093421549, 0.41459028246506385, 2.0139334740672044], [64.85011803866358, 0.35227360149457543, 0.8112511691442355], [68.410966563471, 0.34516077079266677, 0.7471719929411564], [69.64184186057415, 0.8664362000190604, 0.29236905615570513], [72.47482963767571, 0.39609862632349374, 0.9137427923205849], [77.36701570087033, 0.32595040842724415, 2.1645564268423927]], "peak_params_": [[8.366402764029731, 0.9953235381204675, 2.0929180069256037], [11.7503108254497, 0.8179262879997663, 3.682763766853648], [14.5543064457675, 0.45441151962277265, 0.5960993477504699], [16.90847796439426, 0.37173331744782845, 2.3226457685306148], [37.628514696492076, 0.2729315796458385, 0.5200860899922304], [51.59363364831214, 0.23279386957304649, 0.6274140988422167], [54.51774748170462, 0.31406121791021824, 2.0277375404259725], [59.40169093421549, 0.4064426276264217, 4.027866948134409], [64.85011803866358, 0.3550257651709132, 1.622502338288471], [68.410966563471, 0.29697050899835986, 1.4943439858823129], [69.64184186057415, 0.4562094160025655, 0.5847381123114103], [72.47482963767571, 0.36114539064101137, 1.8274855846411697], [77.36701570087033, 0.321300326866782, 4.329112853684785]], "r_squared_": 0.9403310940877726, "error_": 0.06573077385557602}
{"freq_range": [2.0, 80.0], "freq_res": 1.0, "aperiodic_params_": [0.16512279105409838, 1.0273263715324745], "gaussian_params_": [[8.7380445931239, 1.036613223007545, 1.1370477776524126], [11.664822712592308, 0.7842619438738491, 1.5322960804826222], [14.557544147384503, 0.933328173007639, 0.31630809745929933], [16.85081732485116, 0.4464402522348948, 0.9588948300524202], [38.63295982187364, 0.2284617784015522, 1.0907712238378255], [49.239694395585296, 0.22078751059878643, 1.660911097842408], [56.2025171509708, 0.4362525633331603, 0.7790625617055417], [58.52314674548786, 0.6439235280324862, 0.3488518059931195], [61.379760722662596, 0.2971136213482313, 0.7654965823318809], [64.13314307777621, 0.23476554146671239, 0.5370139243855108], [65.9146254393897, 0.16142998590046082, 0.43060843805782323], [67.59330505680366, 0.38171276410969873, 0.28496717921528286], [75.59343994022016, 0.3560223908924124, 5.999999999999999], [76.9921587678916, 0.12427545311581814, 0.25000000613683343]], "peak_params_": [[8.7380445931239, 1.1823287659069703, 2.274095555304825], [11.664822712592308, 0.7826470413901964, 3.0645921609652444], [14.557544147384503, 0.4935823482393462, 0.6326161949185987], [16.85081732485116, 0.44289787976257555, 1.9177896601048403], [38.63295982187364, 0.2158867916499949, 2.181542447675651], [49.239694395585296, 0.21851959434452572, 3.321822195684816], [56.2025171509708, 0.42353610865666624, 1.5581251234110833], [58.52314674548786, 0.2638211617517121, 0.697703611986239], [61.379760722662596, 0.2811995776419618, 1.5309931646637618], [64.13314307777621, 0.28356529479334647, 1.0740278487710215], [65.9146254393897, 0.2580066425462504, 0.8612168761156465], [67.59330505680366, 0.2977027574836031, 0.5699343584305657], [75.59343994022016, 0.3552532435652196, 11.999999999999998], [76.9921587678916, 0.4705871533409356, 0.5000000122736669]], "r_squared_": 0.9779482243618001, "error_": 0.05183407900848665}
{"freq_range": [2.0, 80.0], "freq_res": 1.0, "aperiodic_params_": [0.20382325707174045, 1.205930081134408], "gaussian_params_": [[8.375159956437857, 0.8386569932887004, 0.8845656217009619], [10.874225079523683, 0.9606520853381872, 2.0173385071978656], [16.452034599136, 0.38527258796442865, 3.045219846480202], [16.5709283755829, 0.5164465602662401, 0.27582522548454236], [59.46258693713656, 0.5172761677856799, 0.3363091995393894], [63.452034599141015, 0.15266680634804347, 5.999999999990834], [76.09593080172796, 0.247549075567687, 5.996773158137941]], "peak_params_": [[8.375159956437857, 1.1228591860205668, 1.7691312434019237], [10.874225079523683, 1.0466320065784305, 4.034677014395731], [16.452034599136, 0.47975618339242476, 6.090439692960404], [16.5709283755829, 0.542655329922353, 0.5516504509690847], [59.46258693713656, 0.3210414513451523, 0.6726183990787789], [63.452034599141015, 0.17504082193306103, 11.999999999981668], [76.09593080172796, 0.2646577011772173, 11.993546316275882]], "r_squared_": 0.984277162291467, "error_": 0.061888361466271836}
{"freq_range": [2.0, 80.0], "freq_res": 1.0, "aperiodic_params_": [0.22116399550750432, 1.172388182347111], "gaussian_params_": [[8.312055739137369, 1.158500018262407, 0.9590278918064505], [10.45675493185187, 1.384613021037846, 0.32794720346515494], [12.977520585264397, 0.8723386202567921, 2.2126579736780525], [16.5209842193928, 0.5105209356197756, 0.4729223523526472], [18.560181441779232, 0.4327116558941306, 0.473745934105887], [48.77105027854405, 0.17337484304435397, 2.4428039150424343], [54.584916575216624, 1.569046328333591, 0.26506080641182517], [59.709864834833056, 0.34998110127017096, 1.8657811618780673], [66.5645475065515, 0.2647023217655472, 1.9575996676196277], [70.37009447461156, 0.751019548227265, 0.25002404103273324], [76.83445812702725, 0.4103157501266465, 2.0726971315903313]], "peak_params_": [[8.312055739137369, 1.168236400519695, 1.918055783612901], [10.45675493185187, 1.123842109942006, 0.6558944069303099], [12.977520585264397, 0.8723011050563065, 4.425315947356105], [16.5209842193928, 0.47468944057983875, 0.9458447047052944], [18.560181441779232, 0.30269367676919645, 0.947491868211774], [48.77105027854405, 0.17261505628713847, 4.885607830084869], [54.584916575216624, 0.4815622109973492, 0.5301216128236503], [59.709864834833056, 0.34673658276435315, 3.7315623237561346], [66.5645475065515, 0.25840856295165593, 3.9151993352392553], [70.37009447461156, 0.3096484843548857, 0.5000480820654665], [76.83445812702725, 0.4090093373102879, 4.145394263180663]], "r_squared_": 0.9837318018569349, "error_": 0.053800529827329954}
{"freq_range": [2.0, 80.0], "freq_res": 1.0, "aperiodic_params_": [0.39490046829576897, 1.2641954921922296], "gaussian_params_": [[8.106507254751275, 1.1523198832504598, 0.8304086846584592], [10.13432632591693, 0.6663597828861625, 0.7847666859122074], [13.189923998668466, 0.8753897920921865, 2.1479234037789], [16.50115227597459, 1.4074489796638636, 0.27893937118197315], [18.55328035034176, 0.3257690429994991, 0.8671918342132469], [48.81285469488364, 0.23009841220077354, 0.7892725064654643], [54.598146224034195, 1.4371568155327885, 0.2500463439323215], [59.68992484352441, 0.30362988122066314, 1.6154005010835182], [65.0683552661297, 0.22035263788795195, 1.179185577922101], [67.55109276944154, 0.82136744241417, 0.2942727337507937], [69.54242048955201, 1.1259792264162196, 0.2677906724710673], [73.70334422682605, 0.17031863160418373, 1.748379129554778], [77.40817813666882, 0.43545935115696277, 1.1579880461915666]], "peak_params_": [[8.106507254751275, 1.2066361297673975, 1.6608173693169184], [10.13432632591693, 1.0328668264234246, 1.5695333718244149], [13.189923998668466, 0.8728219933212762, 4.2958468075578], [16.50115227597459, 0.5314326830212297, 0.5578787423639463], [18.55328035034176, 0.3078514546178235, 1.7343836684264937], [48.81285469488364, 0.2237202193020229, 1.5785450129309286], [54.598146224034195, 0.39953652141496176, 0.500092687864643], [59.68992484352441, 0.29810898435235833, 3.2308010021670364], [65.0683552661297, 0.2213511006191684, 2.358371155844202], [67.55109276944154, 0.2674311441029382, 0.5885454675015874], [69.54242048955201, 0.27963615804072317, 0.5355813449421346], [73.70334422682605, 0.17361165615544194, 3.496758259109556], [77.40817813666882, 0.43801975972789187, 2.315976092383133]], "r_squared_": 0.9899483377656016, "error_": 0.04338101673286851}
{"freq_range": [2.0, 80.0], "freq_res": 1.0, "aperiodic_params_": [0.5490213713933993, 1.3869563485112284], "gaussian_params_": [[7.762228296415977, 0.5787291276721372, 0.48722209329063804], [8.84879614227875, 0.8170270942603843, 1.2645708688783552], [12.241230126968416, 0.7000574296033895, 2.0030897347456205], [16.452034599135946, 0.5285997847116201, 2.4286429230725246], [48.835846358788125, 0.19950338535359255, 0.8023647508868557], [54.59374284879085, 1.1289837199187027, 0.2500013718104594], [59.69519568119601, 0.2812942186877341, 1.6290035504278824], [65.20407734640712, 0.2531142390210926, 0.6470417894975434], [67.56522320313971, 0.5758634219352801, 0.36670731395809236], [69.5303176921492, 1.1313498647780458, 0.28730545836727617], [76.42958507655864, 0.3227665386172143, 2.9206531709326726]], "peak_params_": [[7.762228296415977, 1.241646300970834, 0.9744441865812761], [8.84879614227875, 1.027991808710758, 2.5291417377567105], [12.241230126968416, 0.8301266692947404, 4.006179469491241], [16.452034599135946, 0.6398916249875451, 4.857285846145049], [48.835846358788125, 0.1953715682259718, 1.6047295017737113], [54.59374284879085, 0.3059056664022244, 0.5000027436209188], [59.69519568119601, 0.2764129866833325, 3.2580071008557647], [65.20407734640712, 0.2423860396229225, 1.2940835789950869], [67.56522320313971, 0.2901869039720302, 0.7334146279161847], [69.5303176921492, 0.3259607148285786, 0.5746109167345523], [76.42958507655864, 0.3192939756180655, 5.841306341865345]], "r_squared_": 0.9914058491853709, "error_": 0.04372348104111189}
{"freq_range": [2.0, 80.0], "freq_res": 1.0, "aperiodic_params_": [0.6651616135219535, 1.4238090550107014], "gaussian_params_": [[8.204793071665671, 1.0060072344670643, 0.8511980346858085], [11.040140778830454, 0.6548617965378447, 2.0305776353616625], [15.568310955127423, 0.5892621768022424, 2.8118051947123406], [54.61884819566415, 0.5895352023042585, 0.28471309658416755], [59.646006437847305, 0.27537816763557604, 1.7050913091183038], [65.00275435196501, 0.21509275539004924, 0.693786738682595], [67.67091700286677, 0.3393360744798406, 0.4902867608172918], [69.58042402180688, 0.7127817752443101, 0.3462327886813826], [76.64064398205593, 0.30838159036426965, 3.262348507913428]], "peak_params_": [[8.204793071665671, 1.2065547929240974, 1.702396069371617], [11.040140778830454, 0.8167577186873938, 4.061155270723325], [15.568310955127423, 0.6155172391220606, 5.623610389424681], [54.61884819566415, 0.24735200575852212, 0.5694261931683351], [59.646006437847305, 0.2695077020248742, 3.4101826182366075], [65.00275435196501, 0.217611716937677, 1.38757347736519], [67.67091700286677, 0.28017990617873556, 0.9805735216345836], [69.58042402180688, 0.38088390965036534, 0.6924655773627652], [76.64064398205593, 0.3065163669272155, 6.524697015826856]], "r_squared_": 0.9923013468652605, "error_": 0.04389481783410579}
{"freq_range": [2.0, 80.0], "freq_res": 1.0, "aperiodic_params_": [0.6249125938363084, 1.4064189507996232], "gaussian_params_": [[8.25560045047107, 1.0239554404150966, 0.8836123461684934], [11.179735589721155, 0.6639723493323189, 1.9789690157962443], [15.380074768239371, 0.6271433612488467, 2.960952276650496], [54.88781300240115, 0.2637679639849094, 0.5997052004026584], [59.82113676449881, 0.3439278004435317, 1.5499528921600132], [64.9723066338345, 0.23727141586965453, 0.6405951100510179], [67.590347484797, 0.3933358769999515, 0.4167546245189664], [69.52272572050529, 1.1796326959031163, 0.30669055300651527], [76.3549325674771, 0.33226515912580573, 3.659789233858145]], "peak_params_": [[8.25560045047107, 1.1926947901402971, 1.7672246923369868], [11.179735589721155, 0.8794588191093353, 3.9579380315924886], [15.380074768239371, 0.7250214222616832, 5.921904553300992], [54.88781300240115, 0.26191873607348426, 1.1994104008053168], [59.82113676449881, 0.3416606810947016, 3.0999057843200264], [64.9723066338345, 0.24104330873836055, 1.2811902201020358], [67.590347484797, 0.26717975597661736, 0.8335092490379328], [69.52272572050529, 0.4250284802993054, 0.6133811060130305], [76.3549325674771, 0.33070627592900204, 7.31957846771629]], "r_squared_": 0.9919531266403389, "error_": 0.046714290168303065}
{"freq_range": [2.0, 80.0], "freq_res": 1.0, "aperiodic_params_": [0.5009482852048305, 1.253042835442862], "gaussian_params_": [[8.342811070016571, 0.9571832852274259, 0.9003572137156102], [11.281283653803735, 0.7798418765166225, 1.9701588714200242], [15.505292472374743, 0.5548742730319548, 2.4015731196240204], [54.82780240465847, 0.22879559554428758, 0.7758347775040885], [59.63261670190135, 0.3731961446716484, 1.575258433078213], [65.10587898880542, 0.25222467176140057, 0.5740723078647431], [69.52248861080191, 0.9130522322191552, 0.3149444346010826], [75.74864537316266, 0.25319414777428234, 5.999999999999999]], "peak_params_": [[8.342811070016571, 1.0892942207061052, 1.8007144274312203], [11.281283653803735, 0.8797245204393551, 3.9403177428400484], [15.505292472374743, 0.5875199014922884, 4.803146239248041], [54.82780240465847, 0.2288116900982211, 1.551669555008177], [59.63261670190135, 0.37126383034731036, 3.150516866156426], [65.10587898880542, 0.29997834571355364, 1.1481446157294861], [69.52248861080191, 0.4492802806641145, 0.6298888692021652], [75.74864537316266, 0.2529720703536249, 11.999999999999998]], "r_squared_": 0.99059546622454, "error_": 0.045818565089828935}
{"freq_range": [2.0, 80.0], "freq_res": 1.0, "aperiodic_params_": [0.3351342201054852, 1.1892948007491735], "gaussian_params_": [[8.58373100806074, 0.9193141424751589, 0.9947281218748292], [12.822784837748456, 0.8522910178056727, 3.2379624824050817], [55.50408861205891, 0.25803809483005863, 2.7400190124888746], [59.75289883453579, 0.33579708940857667, 1.209991428093436], [64.85632161911172, 0.20657717732777964, 0.5412809876927134], [72.54796540086404, 0.3729904861714535, 5.999999999999999]], "peak_params_": [[8.58373100806074, 1.266780436268973, 1.9894562437496583], [12.822784837748456, 0.8510637195565945, 6.475924964810163], [55.50408861205891, 0.2648993541816931, 5.480038024977749], [59.75289883453579, 0.4378949256405966, 2.419982856186872], [64.85632161911172, 0.3691543212492665, 1.0825619753854268], [72.54796540086404, 0.3719334439168567, 11.999999999999998]], "r_squared_": 0.9749320495685, "error_": 0.06951022349397784}
{"freq_range": [2.0, 80.0], "freq_res": 1.0, "aperiodic_params_": [0.26306395979584457, 1.237610033412326], "gaussian_params_": [[8.927729441453039, 1.0779976139419722, 1.2622565705591327], [13.286988723372458, 0.69794530563384, 3.2434143619263125], [50.57194318379947, 0.5219583877662894, 0.3223260287187679], [55.03019609377041, 0.29581126177634753, 0.7919995535782085], [59.35949526255251, 0.31185920958410746, 2.6820744203389975], [64.10514784822189, 0.17339818452075326, 0.6010310407466255], [71.23335513239611, 0.38778801875070174, 3.8836304263103893], [76.9619203663508, 0.43592793915812716, 0.7559380063537926], [79.45188101344931, 0.758180912271376, 0.3568093432712683]], "peak_params_": [[8.927729441453039, 1.36761173743404, 2.5245131411182653], [13.286988723372458, 0.7011407683223039, 6.486828723852625], [50.57194318379947, 0.21852978035873538, 0.6446520574375358], [55.03019609377041, 0.37888451293829384, 1.583999107156417], [59.35949526255251, 0.31178771222205426, 5.364148840677995], [64.10514784822189, 0.3090145282540695, 1.202062081493251], [71.23335513239611, 0.3871139402356867, 7.767260852620779], [76.9619203663508, 0.5641487214752114, 1.5118760127075852], [79.45188101344931, 0.4040156972029698, 0.7136186865425366]], "r_squared_": 0.9831420957498407, "error_": 0.05483622144163884}
{"freq_range": [2.0, 80.0], "freq_res": 1.0, "aperiodic_params_": [0.17066192214516177, 1.1145450380066233], "gaussian_params_": [[8.896784068628648, 1.0629611599271473, 1.3170612053328472], [13.817953702419546, 0.6912806066335199, 3.0431088100667383], [48.068722942322026, 0.17931291700949545, 2.109240066835826], [54.65771335763453, 0.31745160623902396, 0.27544237362224544], [58.9213238120258, 0.24402729075301025, 3.169325310386736], [61.59487643811541, 0.40846944958089815, 0.29827168410964205], [65.28014743244101, 0.20536689378396808, 0.9649579074383736], [67.65603702699505, 0.41460191165800375, 0.4525693499751549], [69.94702030911144, 0.30919626663039823, 0.7603170466955838], [74.1305913416676, 0.1922924356307848, 1.140582044278341], [77.59144101510243, 0.35230577178118, 1.2820090469513916]], "peak_params_": [[8.896784068628648, 1.2571017411442438, 2.6341224106656944], [13.817953702419546, 0.6906287723772702, 6.086217620133477], [48.068722942322026, 0.17986180675211028, 4.218480133671652], [54.65771335763453, 0.2609885052585943, 0.5508847472444909], [58.9213238120258, 0.24395237602894237, 6.338650620773472], [61.59487643811541, 0.31527023491215767, 0.5965433682192841], [65.28014743244101, 0.23567457041278117, 1.9299158148767472], [67.65603702699505, 0.33014650227902753, 0.9051386999503098], [69.94702030911144, 0.3092635030642714, 1.5206340933911675], [74.1305913416676, 0.1980017937216345, 2.281164088556682], [77.59144101510243, 0.33547143137259083, 2.5640180939027832]], "r_squared_": 0.9868422447639584, "error_": 0.04963233803885433}
{"freq_range": [2.0, 80.0], "freq_res": 1.0, "aperiodic_params_": [0.17623918350254206, 1.118290188700134], "gaussian_params_": [[8.868646512296815, 1.0480169507825647, 1.288413426066891], [13.704217933422585, 0.6913297410457936, 3.097557618494405], [45.620121313108825, 0.4323841718667473, 0.28861449318051524], [48.283518664101, 0.20321620183609318, 1.0620069580526483], [59.07028776066497, 0.2629136043797286, 4.120381505766217], [65.27726054999523, 0.2106771258771988, 0.5713562407156092], [67.53876715758128, 0.6821287004116436, 0.34833831061471654], [70.08180331386738, 0.2786005031547295, 0.8011570942756838], [76.88254637557215, 0.3133564583514972, 2.4290522310927374]], "peak_params_": [[8.868646512296815, 1.2607848734905645, 2.576826852133782], [13.704217933422585, 0.6885618207782859, 6.19511523698881], [45.620121313108825, 0.203690920587984, 0.5772289863610305], [48.283518664101, 0.20321994276943256, 2.1240139161052967], [59.07028776066497, 0.2628753539763613, 8.240763011532435], [65.27726054999523, 0.2806226245182373, 1.1427124814312184], [67.53876715758128, 0.31892588041716996, 0.6966766212294331], [70.08180331386738, 0.2906072224341405, 1.6023141885513676], [76.88254637557215, 0.31301067314031616, 4.858104462185475]], "r_squared_": 0.9862623199240088, "error_": 0.050833660172523026}
{"freq_range": [2.0, 80.0], "freq_res": 1.0, "aperiodic_params_": [0.17821631857233058, 1.1259133258777492], "gaussian_params_": [[8.88255345081557, 1.0717164758459823, 1.3148598015834096], [13.799616291447812, 0.7049213532344287, 3.009827621941082], [48.3824850492206, 0.17535522633148679, 2.3812082992043004], [54.967474957898474, 0.18130791514375358, 0.25030731633002806], [58.91321125020614, 0.2661689389788099, 2.7353468484782186], [61.61845728453842, 0.4667123905610375, 0.2808201726326149], [65.2789979648887, 0.24920765263910302, 0.7361137770807532], [67.52076039817445, 0.7825969567539999, 0.3306469933241379], [69.98876065227722, 0.31517281053768564, 0.8279082518735128], [74.20174858202189, 0.20440698012900033, 1.4280829043271828], [77.60868708291692, 0.3791179628898735, 0.9817266490176333]], "peak_params_": [[8.88255345081557, 1.265126715908746, 2.6297196031668193], [13.799616291447812, 0.7039113693585797, 6.019655243882164], [48.3824850492206, 0.17320063816950504, 4.762416598408601], [54.967474957898474, 0.2791332369284092, 0.5006146326600561], [58.91321125020614, 0.2660434426524263, 5.470693696956437], [61.61845728453842, 0.32625745359427527, 0.5616403452652298], [65.2789979648887, 0.2543186403994442, 1.4722275541615064], [67.52076039817445, 0.29271117051687323, 0.6612939866482758], [69.98876065227722, 0.3179118133238723, 1.6558165037470256], [74.20174858202189, 0.2028212067501982, 2.8561658086543655], [77.60868708291692, 0.35611471826890284, 1.9634532980352666]], "r_squared_": 0.9858872200083518, "error_": 0.05074831194827393}
{"freq_range": [2.0, 80.0], "freq_res": 1.0, "aperiodic_params_": [0.5053266503329874, 1.3313320778643911], "gaussian_params_": [[8.453228349225725, 1.1027960800496972, 0.8701430702225385], [10.902013468351182, 0.6719780677290096, 1.8953453568515921], [15.452034980999558, 0.6134085755567807, 2.416606224689298], [54.821696518993015, 0.25223494615887754, 0.5935565927457432], [58.98292286666241, 0.2640207754624983, 1.3988059334782752], [61.95589361595243, 0.13750915506988706, 0.5920178409120858], [64.56279545925996, 0.7520025373455268, 0.25058218345203875], [69.5812812229494, 0.4599263540704957, 0.29924888049941517], [72.54796540086404, 0.27716626597106764, 5.999999999999999]], "peak_params_": [[8.453228349225725, 1.1762933300595535, 1.740286140445077], [10.902013468351182, 0.7986966396916529, 3.7906907137031842], [15.452034980999558, 0.6676687253928208, 4.833212449378596], [54.821696518993015, 0.24953863843806223, 1.1871131854914865], [58.98292286666241, 0.2856590617929018, 2.7976118669565504], [61.95589361595243, 0.2220233888876968, 1.1840356818241715], [64.56279545925996, 0.28978509779342443, 0.5011643669040775], [69.5812812229494, 0.4260692048739003, 0.5984977609988303], [72.54796540086404, 0.2763807860038021, 11.999999999999998]], "r_squared_": 0.9904624708671662, "error_": 0.04772159804590492}
{"freq_range": [2.0, 80.0], "freq_res": 1.0, "aperiodic_params_": [0.5117353482440793, 1.3329191834609677], "gaussian_params_": [[8.452696213927407, 1.110879660574282, 0.8684305287858639], [10.914828329915554, 0.6674790649112494, 1.882560304297528], [15.45203564596419, 0.6110518924915078, 2.421046699964147], [54.72893959002666, 0.24369892322645417, 0.5114760787348683], [59.58555643439345, 0.26593669369693046, 2.3782423885868162], [64.87562161749224, 0.29423515547084567, 0.6526081898235809], [67.58415624042411, 0.39847537902300584, 0.46490127285602795], [69.71281239331596, 0.38279411245742745, 0.7619198573252085], [76.77013914540503, 0.29452993509108566, 3.8762122629471016]], "peak_params_": [[8.452696213927407, 1.176416646651893, 1.7368610575717278], [10.914828329915554, 0.7945063603006634, 3.765120608595056], [15.45203564596419, 0.663866380939726, 4.842093399928294], [54.72893959002666, 0.25321834142650723, 1.0229521574697367], [59.58555643439345, 0.2619545760162665, 4.7564847771736325], [64.87562161749224, 0.311789240821718, 1.3052163796471619], [67.58415624042411, 0.32097480272171985, 0.9298025457120559], [69.71281239331596, 0.4206416700471318, 1.523839714650417], [76.77013914540503, 0.2940125276976402, 7.752424525894203]], "r_squared_": 0.9915009192589187, "error_": 0.04272052980038192}
{"freq_range": [2.0, 80.0], "freq_res": 1.0, "aperiodic_params_": [0.5163213774249108, 1.3493626525135711], "gaussian_params_": [[8.449575774941918, 1.108323182574297, 0.8727070052759287], [10.90468151974826, 0.6687995929526415, 1.887704795766619], [15.452034599144291, 0.6260110722173934, 2.4484046355920124], [54.555987053873174, 1.2013211010249196, 0.25000006923440754], [59.02341326426241, 0.27148666989176234, 1.970776850430346], [64.5765999633348, 0.5771828479140014, 0.2500124827296019], [68.38107531537425, 0.3577201307761655, 0.2529948681773714], [72.54796540086404, 0.3010402525478669, 5.999999999999999]], "peak_params_": [[8.449575774941918, 1.1814112438884985, 1.7454140105518574], [10.90468151974826, 0.8032826934300914, 3.775409591533238], [15.452034599144291, 0.6790050957212926, 4.896809271184025], [54.555987053873174, 0.28610534736205695, 0.5000001384688151], [59.02341326426241, 0.29499042570906964, 3.941553700860692], [64.5765999633348, 0.27675890894712585, 0.5000249654592038], [68.38107531537425, 0.340927579671366, 0.5059897363547428], [72.54796540086404, 0.30018711450097335, 11.999999999999998]], "r_squared_": 0.9894307193154575, "error_": 0.050952410562671455}
{"freq_range": [2.0, 80.0], "freq_res": 1.0, "aperiodic_params_": [0.5109323655721633, 1.3357259875378287], "gaussian_params_": [[8.450696019849692, 1.10927699340147, 0.870264035809998], [10.922598314039103, 0.6706554590457235, 1.8967798806149978], [15.452034599226838, 0.615680153930246, 2.3855065753886553], [54.9626404942879, 0.24561684271430206, 0.8607893470040989], [59.0915137802643, 0.3303965716367626, 1.106578904817568], [61.93422140507558, 0.2068032191717635, 0.9174874980053564], [64.79515034626995, 0.28501920555013416, 0.6733338581749962], [67.56121703833247, 0.7487957599231448, 0.30918336072448993], [69.65583536749901, 0.3801707351733753, 0.6488660973501295], [76.38078143082461, 0.29274252322220295, 3.8940835352609016]], "peak_params_": [[8.450696019849692, 1.1793716155779603, 1.740528071619996], [10.922598314039103, 0.7931932053717443, 3.7935597612299956], [15.452034599226838, 0.6712629288829403, 4.771013150777311], [54.9626404942879, 0.2457408387982163, 1.7215786940081979], [59.0915137802643, 0.3305299699562818, 2.213157809635136], [61.93422140507558, 0.2170893039927908, 1.834974996010713], [64.79515034626995, 0.2769977266842687, 1.3466677163499925], [67.56121703833247, 0.3170807856680655, 0.6183667214489799], [69.65583536749901, 0.40674781805398785, 1.297732194700259], [76.38078143082461, 0.29134628647861294, 7.788167070521803]], "r_squared_": 0.9916809662637488, "error_": 0.042173720794454174}
{"freq_range": [2.0, 80.0], "freq_res": 1.0, "aperiodic_params_": [0.5044545594075699, 1.3382597232513997], "gaussian_params_": [[8.4451556754305, 1.1061988032062429, 0.8741142355693716], [10.881683460024579, 0.6787097944706773, 1.880968466274482], [15.452046932487136, 0.6304751845710208, 2.4053885307245304], [54.89894048524745, 0.24843398085996393, 0.6407521549744992], [59.02916928910753, 0.28251565971233805, 1.2808995641901026], [61.53049727385038, 0.8085588506002906, 0.2531639873964071], [64.658368181309, 0.37701678716564185, 0.25236238811387113], [68.40867889734379, 0.3177309499230398, 0.2983403955802407], [72.54796540086404, 0.2976841223483201, 5.999999999999999]], "peak_params_": [[8.4451556754305, 1.1867611360538288, 1.7482284711387432], [10.881683460024579, 0.8065215978141398, 3.761936932548964], [15.452046932487136, 0.6812028596015423, 4.810777061449061], [54.89894048524745, 0.25150352749197613, 1.2815043099489984], [59.02916928910753, 0.3057030851008513, 2.5617991283802053], [61.53049727385038, 0.22750132194214934, 0.5063279747928142], [64.658368181309, 0.28574109820416416, 0.5047247762277423], [68.40867889734379, 0.34768757127829253, 0.5966807911604814], [72.54796540086404, 0.29684049545938973, 11.999999999999998]], "r_squared_": 0.9886795286719635, "error_": 0.051297781027139486}
{"freq_range": [2.0, 80.0], "freq_res": 1.0, "aperiodic_params_": [-0.06748760131693067, 0.804935630851492], "gaussian_params_": [[8.60820871037907, 1.0868536129359248, 0.9155774938143221], [11.669882193338191, 0.4383780938779308, 1.9903590533083633], [16.895403621440096, 0.5010139886173305, 0.9160308626277488], [59.45203459914177, 0.16732257350728152, 5.999999999979082], [64.75555704040264, 0.11160241757757443, 0.25107597843324203], [70.54796539695798, 0.11525202214479068, 5.9999998241621375]], "peak_params_": [[8.60820871037907, 1.1700515588151843, 1.8311549876286441], [11.669882193338191, 0.43352797825255696, 3.9807181066167265], [16.895403621440096, 0.5099084411770345, 1.8320617252554976], [59.45203459914177, 0.18493118906971873, 11.999999999958163], [64.75555704040264, 0.25375580186355706, 0.5021519568664841], [70.54796539695798, 0.14117796773496094, 11.999999648324275]], "r_squared_": 0.9559935716411045, "error_": 0.06559153555632874}
{"freq_range": [2.0, 80.0], "freq_res": 1.0, "aperiodic_params_": [0.09507683675074212, 0.8003408203220178], "gaussian_params_": [[8.817369135056651, 1.083324791807251, 1.0945965781586404], [14.247556751405089, 0.39047714511062065, 2.9861889344950323], [61.69796692897692, 0.25027769904593916, 5.99999999999243]], "peak_params_": [[8.817369135056651, 1.1517264005465913, 2.189193156317281], [14.247556751405089, 0.3891523525611632, 5.972377868990065], [61.69796692897692, 0.2499607980838019, 11.99999999998486]], "r_squared_": 0.9296992458805107, "error_": 0.08460758528558046}
{"freq_range": [2.0, 80.0], "freq_res": 1.0, "aperiodic_params_": [0.25433740641218516, 1.0033324453859618], "gaussian_params_": [[8.665160800123562, 1.1347355838200974, 0.9737110756584039], [11.814844229772813, 0.522059386646182, 2.0923911670187034], [16.59130475693724, 0.41179565269247104, 1.4840926714544191], [59.452035542016596, 0.2255823715573889, 5.999999999994813], [69.04027755605983, 0.17223757854293972, 1.8649215205003016], [77.11097353220022, 0.24092218983626973, 2.6263542091810272]], "peak_params_": [[8.665160800123562, 1.2808077890398486, 1.9474221513168077], [11.814844229772813, 0.5266777728683939, 4.184782334037407], [16.59130475693724, 0.42069615160019147, 2.9681853429088383], [59.452035542016596, 0.22494316350749477, 11.999999999989626], [69.04027755605983, 0.2378372765223804, 3.729843041000603], [77.11097353220022, 0.24385889300007624, 5.2527084183620545]], "r_squared_": 0.9728928648218268, "error_": 0.06274656839885029}
{"freq_range": [2.0, 80.0], "freq_res": 1.0, "aperiodic_params_": [0.4473032576716618, 1.168360134188263], "gaussian_params_": [[8.541883664419867, 1.1825022955147297, 0.8249002371847205], [10.68479700794517, 0.5547212776612227, 1.6733122974571544], [15.452035961050557, 0.5026399119861508, 2.2290495470773894], [56.64853345054738, 0.17683953779797662, 5.999999999999999], [61.56811521185245, 0.5120607858161348, 0.28836796166153533], [64.73443859599983, 0.2773862812985545, 0.5492191454455937], [68.01316457351994, 0.32618431347375354, 0.7428959509960553], [70.45745415602053, 0.647388063686064, 0.30717697648698267], [76.83662291874836, 0.2585944007102072, 3.47959150333076]], "peak_params_": [[8.541883664419867, 1.355277036684143, 1.649800474369441], [10.68479700794517, 0.6273123574861924, 3.3466245949143087], [15.452035961050557, 0.5123605280254482, 4.458099094154779], [56.64853345054738, 0.1765364210780198, 11.999999999999998], [61.56811521185245, 0.2856553502989836, 0.5767359233230707], [64.73443859599983, 0.31478870170419415, 1.0984382908911874], [68.01316457351994, 0.3659521474833578, 1.4857919019921106], [70.45745415602053, 0.2751144033962427, 0.6143539529739653], [76.83662291874836, 0.25887093086750723, 6.95918300666152]], "r_squared_": 0.9869884366771516, "error_": 0.047459683258175414}
{"freq_range": [2.0, 80.0], "freq_res": 1.0, "aperiodic_params_": [0.36080012581774545, 1.1091424381205444], "gaussian_params_": [[8.689236156678092, 1.2646416215142868, 0.9601019384252623], [13.62468037368395, 0.6216783913292645, 3.237298202901087], [68.44692889859438, 0.2735533361896569, 5.999999999999999]], "peak_params_": [[8.689236156678092, 1.4241859158852184, 1.9202038768505245], [13.62468037368395, 0.6175146433069351, 6.474596405802174], [68.44692889859438, 0.2727954846907319, 11.999999999999998]], "r_squared_": 0.9714180976242853, "error_": 0.07713416353017294}
{"freq_range": [2.0, 80.0], "freq_res": 1.0, "aperiodic_params_": [0.31499036392704477, 1.2004564435932494], "gaussian_params_": [[8.337411321775866, 1.2749548659522656, 0.7020949926892042], [10.079841991348221, 0.644653021945519, 1.2943604739187349], [14.501657799435646, 0.5908682246041138, 2.3782524366836713], [17.372957083410146, 0.3904043344177361, 0.755489657153033], [67.95420944778068, 0.2383641123478319, 0.25293677204008036], [70.0366816324875, 0.1313172325123777, 0.25196850966769724], [72.9040691982719, 0.29745572057624425, 5.999999999999999]], "peak_params_": [[8.337411321775866, 1.3272692119775023, 1.4041899853784083], [10.079841991348221, 0.8191741501961403, 2.5887209478374698], [14.501657799435646, 0.5813207419573047, 4.7565048733673425], [17.372957083410146, 0.6859160057465852, 1.510979314306066], [67.95420944778068, 0.4474785732007469, 0.5058735440801607], [70.0366816324875, 0.3945098964647342, 0.5039370193353945], [72.9040691982719, 0.2974177035429886, 11.999999999999998]], "r_squared_": 0.9760417590902749, "error_": 0.07142747075251163}
{"freq_range": [2.0, 80.0], "freq_res": 1.0, "aperiodic_params_": [0.3215548013080472, 1.2104169122313089], "gaussian_params_": [[8.328025996626303, 1.2613888351002924, 0.7062222119398838], [10.040091563028838, 0.6526157865111932, 1.2635496807831568], [14.282388585720943, 0.5969013169003625, 2.2727044481851664], [17.366526961574465, 0.42948062555287303, 0.8583793198308255], [69.2980497226886, 0.33663389004529665, 5.999999999999941]], "peak_params_": [[8.328025996626303, 1.3227355523127826, 1.4124444238797675], [10.040091563028838, 0.8299416031016744, 2.5270993615663135], [14.282388585720943, 0.5973150234935185, 4.545408896370333], [17.366526961574465, 0.6840814114413707, 1.716758639661651], [69.2980497226886, 0.3362188070952903, 11.999999999999883]], "r_squared_": 0.9783901050434163, "error_": 0.06818531450341057}
{"freq_range": [2.0, 80.0], "freq_res": 1.0, "aperiodic_params_": [0.13119877356606108, 0.8569760731365882], "gaussian_params_": [[8.757223545077315, 1.2443205415470726, 0.9948035735177438], [13.971267835080223, 0.42608833001067203, 3.1002752801269384], [59.45203459913595, 0.17381505237100095, 5.999999999999999], [70.54796540086404, 0.13903446734692165, 5.999999999999999]], "peak_params_": [[8.757223545077315, 1.3256199401404647, 1.9896071470354877], [13.971267835080223, 0.42607119042598424, 6.200550560253877], [59.45203459913595, 0.1951366869102822, 11.999999999999998], [70.54796540086404, 0.16591167082133707, 11.999999999999998]], "r_squared_": 0.9463539059701664, "error_": 0.08027505114448641}
{"freq_range": [2.0, 80.0], "freq_res": 1.0, "aperiodic_params_": [0.23368801798713001, 0.9590249567055494], "gaussian_params_": [[8.585687220031092, 1.2856254712092416, 0.8245187228652511], [11.452035466115074, 0.5386363725874909, 1.9841778256156974], [16.664446220292405, 0.438454994866844, 1.5066549080836105], [59.45203459913595, 0.16747221013377442, 5.999999999999999], [70.54796540086404, 0.1716878244006764, 5.999999999999999]], "peak_params_": [[8.585687220031092, 1.3841446554044563, 1.6490374457305021], [11.452035466115074, 0.542883711373166, 3.968355651231395], [16.664446220292405, 0.43851899158972085, 3.013309816167221], [59.45203459913595, 0.19393506431961383, 11.999999999999998], [70.54796540086404, 0.19747731050925377, 11.999999999999998]], "r_squared_": 0.9657384991005261, "error_": 0.06971758920812372}
{"freq_range": [2.0, 80.0], "freq_res": 1.0, "aperiodic_params_": [0.3677321113263867, 1.126459316506782], "gaussian_params_": [[8.694391899381856, 1.2654732889074292, 0.9652377838318854], [13.646618384748535, 0.6355268416611106, 3.235897289178992], [68.9274474481057, 0.2834771308277492, 5.999999999999999]], "peak_params_": [[8.694391899381856, 1.4302711435434974, 1.9304755676637708], [13.646618384748535, 0.6317487878309808, 6.471794578357984], [68.9274474481057, 0.28345640675817374, 11.999999999999998]], "r_squared_": 0.9700997517000425, "error_": 0.08161394615633213}
{"freq_range": [2.0, 80.0], "freq_res": 1.0, "aperiodic_params_": [-0.28422021293936905, 1.2971899695706712], "gaussian_params_": [[8.305595866119273, 0.8012058386504096, 0.6744459468615762], [10.278343562075994, 0.9448457481358072, 1.5481293624408055], [15.282905705926922, 0.570704348571388, 3.12458944225693], [63.45203466435797, 0.18985704385456023, 5.999999999408702], [70.25555153638142, 0.1583789280412805, 1.0802373185046004], [76.68237312064753, 0.24426061986790704, 3.2661188771369303]], "peak_params_": [[8.305595866119273, 1.080702849146697, 1.3488918937231524], [10.278343562075994, 1.1004992573013153, 3.096258724881611], [15.282905705926922, 0.5773952839440688, 6.24917888451386], [63.45203466435797, 0.18935675930834206, 11.999999998817405], [70.25555153638142, 0.28879606303772043, 2.1604746370092007], [76.68237312064753, 0.25794351061883924, 6.5322377542738606]], "r_squared_": 0.9865978901797734, "error_": 0.05918136442929213}
{"freq_range": [2.0, 80.0], "freq_res": 1.0, "aperiodic_params_": [-0.16879358094870262, 1.1652611398631203], "gaussian_params_": [[8.295999068974014, 1.2102719803011956, 0.9008541974865801], [11.604225711026467, 0.9394665292476159, 2.07565133491283], [16.702344252784094, 0.6109462994937251, 1.2131087982781423], [76.45203479296792, 0.2384285470816498, 5.999999999974544]], "peak_params_": [[8.295999068974014, 1.3547091294825586, 1.8017083949731603], [11.604225711026467, 0.923134555483788, 4.15130266982566], [16.702344252784094, 0.6248527750317391, 2.4262175965562847], [76.45203479296792, 0.23775284794096896, 11.999999999949088]], "r_squared_": 0.9826909659852479, "error_": 0.062148836806022525}
{"freq_range": [2.0, 80.0], "freq_res": 1.0, "aperiodic_params_": [0.09479171907795575, 1.1957336677698684], "gaussian_params_": [[7.617076517781267, 1.6476944646510336, 0.34159241187478956], [8.915259022056773, 1.0122542708029305, 0.7747818774478621], [12.153983674880566, 0.6346338287808505, 1.9322611171995168], [16.838466645686136, 0.52329466435755, 1.009733500832333], [55.43329733714995, 0.18614708881633496, 2.0613443675903067], [60.360426253726175, 0.5946667917298465, 0.25232417189652406], [71.37172955936393, 0.21406411362272026, 5.999999999999997], [75.18910949910736, 0.1349745301501816, 1.2676621259810363], [79.2593290487143, 0.37104456100497757, 0.6329501746062522]], "peak_params_": [[7.617076517781267, 1.4457740462065187, 0.6831848237495791], [8.915259022056773, 1.174156131634228, 1.5495637548957242], [12.153983674880566, 0.63299295420108, 3.8645222343990335], [16.838466645686136, 0.54397535055479, 2.019467001664666], [55.43329733714995, 0.1872534628429463, 4.122688735180613], [60.360426253726175, 0.26591453538359344, 0.5046483437930481], [71.37172955936393, 0.21422769677886722, 11.999999999999995], [75.18910949910736, 0.31177558650110915, 2.5353242519620727], [79.2593290487143, 0.43804397169084774, 1.2659003492125045]], "r_squared_": 0.9879050128170601, "error_": 0.04502033561708963}
{"freq_range": [2.0, 80.0], "freq_res": 1.0, "aperiodic_params_": [0.0621608103028003, 1.2069597676160582], "gaussian_params_": [[8.264631727566417, 1.1199954823245075, 0.8664276967960082], [10.646049280372107, 0.6875928639218678, 1.6014900158332213], [14.399206347235356, 0.5188653523372594, 2.7275906069445752], [16.603472269762314, 1.0506080499344068, 0.28473490407851176], [63.45750922459788, 0.14696130634523838, 5.999999999999999], [75.23177633719806, 0.2150980972493911, 3.019685036649897], [79.4292392890785, 0.5984740199133876, 0.2935861102194446]], "peak_params_": [[8.264631727566417, 1.2776616091173967, 1.7328553935920163], [10.646049280372107, 0.9173488526181379, 3.2029800316664425], [14.399206347235356, 0.5900618358084971, 5.4551812138891504], [16.603472269762314, 0.7279780460328499, 0.5694698081570235], [63.45750922459788, 0.1465935299157919, 11.999999999999998], [75.23177633719806, 0.23756386435400545, 6.039370073299794], [79.4292392890785, 0.3093965054066097, 0.5871722204388892]], "r_squared_": 0.9872150716353035, "error_": 0.05256244130896394}
