{"freq_range": [2.0, 80.0], "freq_res": 1.0, "aperiodic_params_": [0.21280464830873336, 0.9737764142097136], "gaussian_params_": [[10.286140750822234, 0.4615969999209672, 1.1260209263606975], [16.293899256855884, 0.47791303749796166, 2.6633420949706705], [23.470479985262855, 0.432950978754256, 2.157558299442899], [28.250452258119388, 0.18769789917303578, 0.6390726414280649]], "peak_params_": [[10.286140750822234, 0.47621892188858334, 2.252041852721395], [16.293899256855884, 0.4760925295341596, 5.326684189941341], [23.470479985262855, 0.4428533221980281, 4.315116598885798], [28.250452258119388, 0.22165007084577182, 1.2781452828561297]], "r_squared_": 0.9835731535650857, "error_": 0.04668548004686308}
{"freq_range": [2.0, 80.0], "freq_res": 1.0, "aperiodic_params_": [0.015278764219850098, 0.8878192188435802], "gaussian_params_": [[10.053765307675755, 0.43790742126332416, 1.0986925723540775], [16.431324347647763, 0.497471859333366, 2.947285914487337], [23.736973092230436, 0.49065639942272915, 2.0066020139727643], [41.42329756548265, 0.9115517225321538, 0.250012506014838], [66.43306446411718, 0.1945602960808533, 0.6885827821471486]], "peak_params_": [[10.053765307675755, 0.4833870431397413, 2.197385144708155], [16.431324347647763, 0.4924632889519731, 5.894571828974674], [23.736973092230436, 0.5048561814807438, 4.0132040279455286], [41.42329756548265, 0.21742307466136634, 0.500025012029676], [66.43306446411718, 0.15964794410795613, 1.3771655642942973]], "r_squared_": 0.9862198651340066, "error_": 0.03959100622063451}
{"freq_range": [2.0, 80.0], "freq_res": 1.0, "aperiodic_params_": [0.3959523232410423, 1.043394399476076], "gaussian_params_": [[10.347090946117852, 0.43681189368672874, 1.2923724806141235], [16.305482342514882, 0.42106649596398205, 2.590457556833084], [20.561204325345255, 0.7896279247878277, 0.2842172179665184], [22.564647863469578, 1.080487995041762, 0.3001093907783683], [24.9683001619668, 0.3928731557464399, 1.1317906800583797], [28.311210212427476, 0.215745390666082, 0.8298122753309843], [47.64185573039943, 0.4532400912856413, 0.2500421662855936], [52.36776210077625, 0.2149642218167534, 0.6624002204557439]], "peak_params_": [[10.347090946117852, 0.44310455827464507, 2.584744961228247], [16.305482342514882, 0.4181794634246928, 5.180915113666168], [20.561204325345255, 0.3221454187534507, 0.5684344359330368], [22.564647863469578, 0.4788054407796918, 0.6002187815567366], [24.9683001619668, 0.3943014384628447, 2.2635813601167594], [28.311210212427476, 0.21197798364562848, 1.6596245506619687], [47.64185573039943, 0.16249211957458454, 0.5000843325711872], [52.36776210077625, 0.18426043802446435, 1.3248004409114877]], "r_squared_": 0.9859186556384529, "error_": 0.0385767356874534}
{"freq_range": [2.0, 80.0], "freq_res": 1.0, "aperiodic_params_": [0.4170739782168489, 1.1332879936259128], "gaussian_params_": [[10.605351032787006, 0.5931888740230912, 1.4350651084932526], [15.844548467462465, 0.6320582279849523, 2.001012554324667], [23.378373696188035, 0.641947285777529, 3.514306182466841]], "peak_params_": [[10.605351032787006, 0.6062007526183194, 2.8701302169865053], [15.844548467462465, 0.7015059987822417, 4.002025108649334], [23.378373696188035, 0.6392942437487669, 7.028612364933682]], "r_squared_": 0.9881421489162683, "error_": 0.046836581196118075}
{"freq_range": [2.0, 80.0], "freq_res": 1.0, "aperiodic_params_": [0.19682861024225562, 0.9902096700402344], "gaussian_params_": [[9.880891676025293, 0.48630038608380793, 1.0948903930768847], [15.497352568646948, 0.5339177964695446, 2.5938901816358064], [23.387150138213116, 0.5257371905290756, 3.6775568792460964]], "peak_params_": [[9.880891676025293, 0.540638976393652, 2.1897807861537695], [15.497352568646948, 0.5632250687687728, 5.187780363271613], [23.387150138213116, 0.530975037242419, 7.355113758492193]], "r_squared_": 0.9855391203456805, "error_": 0.04928299550988797}
{"freq_range": [2.0, 80.0], "freq_res": 1.0, "aperiodic_params_": [0.04303053465375144, 0.7635066291344738], "gaussian_params_": [[9.712852163762737, 0.4159054621528845, 0.8528258309754301], [14.959364220276136, 0.3104272170051521, 1.3991735520971567], [17.553470217833986, 0.6084005901000061, 0.3098284181754865], [23.120880919151105, 0.3378472675343936, 3.2570104085947857], [56.84976703085325, 0.21991968702541478, 0.5327364239093255], [58.900168759213884, 0.25200718346038864, 0.2500032206264039], [61.691663752727116, 0.23477689902952545, 0.5881377717385106]], "peak_params_": [[9.712852163762737, 0.39366763528239246, 1.7056516619508602], [14.959364220276136, 0.325388648277776, 2.7983471041943133], [17.553470217833986, 0.342784195875277, 0.619656836350973], [23.120880919151105, 0.33761468397973105, 6.5140208171895715], [56.84976703085325, 0.21134666214078224, 1.065472847818651], [58.900168759213884, 0.2327656294248701, 0.5000064412528078], [61.691663752727116, 0.20463178451958441, 1.1762755434770211]], "r_squared_": 0.9515171434707255, "error_": 0.060358400608718006}
{"freq_range": [2.0, 80.0], "freq_res": 1.0, "aperiodic_params_": [0.3727930746996185, 1.048217824083694], "gaussian_params_": [[10.054787812086019, 0.5758313234825984, 1.299040234433152], [15.539979839958074, 0.3996363053655114, 2.2707312884807513], [17.985504607143557, 0.1815556919348504, 0.250033647830115], [24.08334315139823, 0.3951786096836874, 3.1682568283657266], [52.11887305243421, 0.16114046587891656, 3.199638310955106]], "peak_params_": [[10.054787812086019, 0.595716599312713, 2.598080468866304], [15.539979839958074, 0.40678620665447957, 4.541462576961503], [17.985504607143557, 0.4660321981125917, 0.50006729566023], [24.08334315139823, 0.39542872439231047, 6.336513656731453], [52.11887305243421, 0.16102929531218013, 6.399276621910212]], "r_squared_": 0.9787857247537897, "error_": 0.05347834083946339}
{"freq_range": [2.0, 80.0], "freq_res": 1.0, "aperiodic_params_": [0.4823764154432568, 1.1133084853472601], "gaussian_params_": [[10.507408062803318, 0.44248764764148596, 1.1950826231797143], [19.7423945381394, 0.5804700923669237, 5.999999999999999]], "peak_params_": [[10.507408062803318, 0.6072535496786209, 2.3901652463594285], [19.7423945381394, 0.5799353342786618, 11.999999999999998]], "r_squared_": 0.9783258677351032, "error_": 0.06063947507052959}
{"freq_range": [2.0, 80.0], "freq_res": 1.0, "aperiodic_params_": [0.48727463131006127, 1.1665649931137625], "gaussian_params_": [[10.700302489229168, 0.662641977345327, 1.5708562687711327], [15.822129839726399, 0.6962322514086222, 2.093275369080036], [23.42047468367946, 0.7265947517172885, 3.56267992625315]], "peak_params_": [[10.700302489229168, 0.7013836682630431, 3.1417125375422654], [15.822129839726399, 0.7789956750108866, 4.186550738160072], [23.42047468367946, 0.7234995262435174, 7.1253598525063]], "r_squared_": 0.988327511393227, "error_": 0.052857575019694764}
{"freq_range": [2.0, 80.0], "freq_res": 1.0, "aperiodic_params_": [0.5813161281058135, 1.2202900710523252], "gaussian_params_": [[10.403165116680213, 0.5966068960688415, 1.6035579290827575], [15.645603687585604, 0.7033833531996251, 2.0772924865071936], [23.393594298633133, 0.8249634926427665, 3.694788009824507]], "peak_params_": [[10.403165116680213, 0.5967114854381528, 3.207115858165515], [15.645603687585604, 0.8059754123014474, 4.154584973014387], [23.393594298633133, 0.8216306989181587, 7.389576019649014]], "r_squared_": 0.9858211780630973, "error_": 0.06030458115151413}
{"freq_range": [2.0, 80.0], "freq_res": 1.0, "aperiodic_params_": [0.5928038643010136, 1.2309767913973866], "gaussian_params_": [[10.184356485893609, 0.5280016403293588, 1.5180489112029625], [15.599869527299228, 0.6514025389823951, 2.0483231951010303], [23.381405841697475, 0.7913443998596664, 3.7989823704322125]], "peak_params_": [[10.184356485893609, 0.541241890643408, 3.036097822405925], [15.599869527299228, 0.7592701419990275, 4.096646390202061], [23.381405841697475, 0.7883203860067658, 7.597964740864425]], "r_squared_": 0.9871418479117994, "error_": 0.05543729629996173}
{"freq_range": [2.0, 80.0], "freq_res": 1.0, "aperiodic_params_": [0.5106446797752876, 1.1774842586660217], "gaussian_params_": [[9.633692183938779, 0.4076709834268808, 1.2148272297310883], [16.56014314541436, 0.7261809767756356, 3.592333891723226], [24.03192097023831, 0.7187166505253566, 1.8969153799174054], [28.277179626945774, 0.2886392298627063, 0.8455393756124001], [31.590776768778642, 0.18035937775522473, 2.05651871891452], [39.407888467476376, 0.24439770306200834, 0.5818734592261978]], "peak_params_": [[9.633692183938779, 0.5266085484162635, 2.4296544594621765], [16.56014314541436, 0.7215033580727284, 7.184667783446452], [24.03192097023831, 0.8038609890900364, 3.793830759834811], [28.277179626945774, 0.3979777094805752, 1.6910787512248002], [31.590776768778642, 0.17701821955963593, 4.11303743782904], [39.407888467476376, 0.19143221565655666, 1.1637469184523956]], "r_squared_": 0.9927713378939815, "error_": 0.04147879670381583}
{"freq_range": [2.0, 80.0], "freq_res": 1.0, "aperiodic_params_": [0.3878424256403052, 1.0897198709966687], "gaussian_params_": [[9.483626745160523, 0.4496086644711163, 0.6797012291256873], [16.65035771029213, 0.6450555339201488, 4.236323421730457], [24.010947052487133, 0.541070895801085, 1.5166239052664177], [28.12616073893086, 0.3567628438811796, 1.0788061573338612], [31.986585282502972, 0.20022034280617343, 1.417013288869646], [39.17889232817195, 0.2568114654242157, 0.7201104017609259]], "peak_params_": [[9.483626745160523, 0.4753650228476456, 1.3594024582513746], [16.65035771029213, 0.642874621934065, 8.472646843460915], [24.010947052487133, 0.6845139936562417, 3.0332478105328353], [28.12616073893086, 0.393002989281913, 2.1576123146677224], [31.986585282502972, 0.20168678159764086, 2.834026577739292], [39.17889232817195, 0.24900956308344546, 1.4402208035218518]], "r_squared_": 0.9909747436891053, "error_": 0.04050508540673075}
{"freq_range": [2.0, 80.0], "freq_res": 1.0, "aperiodic_params_": [0.0002376182274059591, 0.755873388136537], "gaussian_params_": [[9.466132068584344, 0.5283466722126763, 0.5198005419787813], [19.535009556840233, 0.457620513927044, 5.999999999999999]], "peak_params_": [[9.466132068584344, 0.45138509092726137, 1.0396010839575627], [19.535009556840233, 0.45624834016157445, 11.999999999999998]], "r_squared_": 0.9440569939782542, "error_": 0.06790555538869163}
{"freq_range": [2.0, 80.0], "freq_res": 1.0, "aperiodic_params_": [-0.053184897404741464, 0.8542044613750371], "gaussian_params_": [[9.48688862393387, 0.5379050527508897, 0.8948099891524055], [15.68649918188333, 0.3804207018393946, 3.0442286654862065], [23.115936561210134, 0.19467935113983245, 1.1038516599120582], [25.977606701566792, 0.273680386048579, 3.6798713619567667]], "peak_params_": [[9.48688862393387, 0.49798840481141254, 1.789619978304811], [15.68649918188333, 0.3853405613392762, 6.088457330972413], [23.115936561210134, 0.41211328313109274, 2.2077033198241165], [25.977606701566792, 0.2813117121364943, 7.359742723913533]], "r_squared_": 0.9742676417335888, "error_": 0.050064950460854275}
{"freq_range": [2.0, 80.0], "freq_res": 1.0, "aperiodic_params_": [0.32444349998406374, 0.9545877530107988], "gaussian_params_": [[9.719634481022918, 0.5638883220614703, 1.1127936594067702], [15.253379005287814, 0.27332424445393755, 3.0031439484795452], [18.380513658376703, 0.21847688979505808, 0.2926206207962548], [23.827535264982526, 0.37161828675093356, 2.2205588837213206], [26.693840017238514, 0.24089485712557307, 1.0554109875198392], [43.08480431355247, 0.14884926377251317, 0.2501383513992077], [47.48313847787878, 0.1990545783021042, 0.8649571668091959], [51.7169158159435, 0.2382494238996746, 2.7935623288379414], [62.03021598604847, 0.2332517751851417, 0.6669968309222006], [74.27293239627275, 0.19913292396857837, 0.7027846559727896]], "peak_params_": [[9.719634481022918, 0.6054559111098454, 2.2255873188135404], [15.253379005287814, 0.2724979496806029, 6.0062878969590905], [18.380513658376703, 0.28558155166038324, 0.5852412415925096], [23.827535264982526, 0.38370368256312815, 4.441117767442641], [26.693840017238514, 0.3650281434544922, 2.1108219750396784], [43.08480431355247, 0.1423675312786803, 0.5002767027984154], [47.48313847787878, 0.22757493378557103, 1.7299143336183918], [51.7169158159435, 0.23702954411509225, 5.587124657675883], [62.03021598604847, 0.2332846678620808, 1.3339936618444013], [74.27293239627275, 0.1846683287175237, 1.4055693119455792]], "r_squared_": 0.9856612467260848, "error_": 0.03790393971615387}
{"freq_range": [2.0, 80.0], "freq_res": 1.0, "aperiodic_params_": [0.29718908221667434, 1.0652189516574002], "gaussian_params_": [[10.070590029176971, 0.5633750637581394, 1.2740919316564805], [15.29478513732209, 0.6236105417274707, 2.8686129337902124], [18.37210555813034, 0.35470516644107036, 0.3026736942399583], [23.876416642285864, 0.48397615154614637, 2.827704004325602], [62.77000568000966, 0.15650655766220886, 0.8466635023155067], [74.19092028909871, 0.2824687701763112, 0.6168569464123425], [77.0935905135732, 0.18799853877836567, 0.44918044065993906]], "peak_params_": [[10.070590029176971, 0.676047862579855, 2.548183863312961], [15.29478513732209, 0.6241511817803743, 5.737225867580425], [18.37210555813034, 0.6222072626278363, 0.6053473884799166], [23.876416642285864, 0.48975426837875, 5.655408008651204], [62.77000568000966, 0.1508372791017678, 1.6933270046310134], [74.19092028909871, 0.2692583517256346, 1.233713892824685], [77.0935905135732, 0.18397056798449807, 0.8983608813198781]], "r_squared_": 0.9847583484269874, "error_": 0.048694696427548735}
{"freq_range": [2.0, 80.0], "freq_res": 1.0, "aperiodic_params_": [0.5188849601819511, 1.1777327795177512], "gaussian_params_": [[13.782148857739362, 0.642396792387569, 3.9232037067376146], [22.904069198271888, 0.43126059547809553, 5.6080492661677575], [23.29203516450638, 0.35664926770547095, 0.8338151125155957], [25.484504692710118, 0.9558386196832439, 0.27409260527775237]], "peak_params_": [[13.782148857739362, 0.763681705420205, 7.846407413475229], [22.904069198271888, 0.8072778544420991, 11.216098532335515], [23.29203516450638, 0.8072778544420991, 1.6676302250311914], [25.484504692710118, 0.6570992122184213, 0.5481852105555047]], "r_squared_": 0.9854905280263987, "error_": 0.058354482231975174}
{"freq_range": [2.0, 80.0], "freq_res": 1.0, "aperiodic_params_": [0.6076299799152467, 1.262351695392044], "gaussian_params_": [[10.220698583613977, 0.5264172685987524, 1.7494342676974513], [15.506275419978621, 0.7627020883783328, 2.1558392934678254], [23.77833866978801, 0.876526633927804, 3.9034319320056405]], "peak_params_": [[10.220698583613977, 0.5531988496176492, 3.4988685353949025], [15.506275419978621, 0.86557554806944, 4.311678586935651], [23.77833866978801, 0.875439355504329, 7.806863864011281]], "r_squared_": 0.9837220997760212, "error_": 0.06502284298810222}
{"freq_range": [2.0, 80.0], "freq_res": 1.0, "aperiodic_params_": [0.6917563241557767, 1.2942607814282767], "gaussian_params_": [[9.635244924741288, 0.40812240653574544, 1.4407547277179085], [15.990300932397773, 0.7978127909034048, 2.6981396654863725], [23.85737753510385, 1.0095824046341058, 2.561059956076342], [28.471405438328947, 1.034715586308876, 0.30467749514442594], [35.26189785729429, 0.1331584455999362, 5.999999999999999], [47.674181375983885, 0.34934160361528727, 0.2934166763844122]], "peak_params_": [[9.635244924741288, 0.4631211507666154, 2.881509455435817], [15.990300932397773, 0.8077252745617145, 5.396279330972745], [23.85737753510385, 1.0406258342753827, 5.122119912152684], [28.471405438328947, 0.6495448923353303, 0.6093549902888519], [35.26189785729429, 0.13310994009522958, 11.999999999999998], [47.674181375983885, 0.20256449486921446, 0.5868333527688244]], "r_squared_": 0.9898583829475236, "error_": 0.05130604234060665}
{"freq_range": [2.0, 80.0], "freq_res": 1.0, "aperiodic_params_": [0.5823440064385215, 1.2330350168753514], "gaussian_params_": [[9.575841626321553, 0.45992637822475074, 1.3011894026245225], [12.571348769149738, 0.48466314211994166, 0.3140847926059445], [13.547964846802582, 0.33987357805051227, 1.6329412400837324], [16.383573191265224, 0.5072074062547999, 1.7117813455758502], [23.32941523463099, 0.721211042580132, 4.320353555368236], [28.473270116631184, 0.5227700877220265, 0.28290700649702105], [39.04687341176721, 0.17278161093485625, 0.840418420788105]], "peak_params_": [[9.575841626321553, 0.4748715483534705, 2.602378805249045], [12.571348769149738, 0.6399508012932488, 0.628169585211889], [13.547964846802582, 0.5909743752548758, 3.265882480167465], [16.383573191265224, 0.7757502329625754, 3.4235626911517003], [23.32941523463099, 0.7194067434257957, 8.640707110736471], [28.473270116631184, 0.531059637464436, 0.5658140129940421], [39.04687341176721, 0.17351589667702116, 1.68083684157621]], "r_squared_": 0.9884281244354024, "error_": 0.05234374516161001}
{"freq_range": [2.0, 80.0], "freq_res": 1.0, "aperiodic_params_": [0.3501325814018418, 1.1158466198618535], "gaussian_params_": [[15.870333650925716, 0.7326224233390405, 4.812653573375483], [24.116398317178405, 0.48572642338369676, 2.064732739420503], [28.364649366220412, 0.34584225824523446, 0.9697396655798247], [32.012181614738736, 0.20397137897677123, 1.515341500761133]], "peak_params_": [[15.870333650925716, 0.7325708115897308, 9.625307146750966], [24.116398317178405, 0.6608639273887307, 4.129465478841006], [28.364649366220412, 0.4417717138916013, 1.9394793311596494], [32.012181614738736, 0.20726875987085336, 3.030683001522266]], "r_squared_": 0.9844832941498715, "error_": 0.05213166754494187}
{"freq_range": [2.0, 80.0], "freq_res": 1.0, "aperiodic_params_": [0.05586989276386476, 0.8980487319295263], "gaussian_params_": [[9.461963640192813, 0.5152919418697552, 0.8396004641802008], [16.437256094321857, 0.4925545607404584, 3.5705573149228056], [22.806776885466768, 0.25459138758551114, 0.8256836253314984], [25.980973824726163, 0.2958759457719965, 2.7391904409808947], [31.547965394126685, 0.041082444635084765, 1.7746112614545189], [70.4223827971144, 0.5847094727694759, 0.25937705234201225]], "peak_params_": [[9.461963640192813, 0.49918562329683325, 1.6792009283604017], [16.437256094321857, 0.48926228277477835, 7.141114629845611], [22.806776885466768, 0.502335764636399, 1.6513672506629968], [25.980973824726163, 0.30996490168853774, 5.478380881961789], [31.547965394126685, 0.06627005541899122, 3.5492225229090377], [70.4223827971144, 0.1552736294429815, 0.5187541046840245]], "r_squared_": 0.9790254973110187, "error_": 0.041818488991018116}
{"freq_range": [2.0, 80.0], "freq_res": 1.0, "aperiodic_params_": [-0.07445155938103297, 0.8647248733688059], "gaussian_params_": [[9.424052799644237, 0.6277448965139019, 0.8174802977495249], [12.404323335343193, 0.22222394384788455, 1.5474206182493075], [16.83042399576018, 0.3561253752379293, 2.1395142091311814], [22.847288252454977, 0.3077875197004598, 1.4910632137531772], [27.677846942766056, 0.24673954383860092, 1.7551777237578559], [32.66717471414038, 0.1437371754493246, 1.1063938093230363], [44.433301381464226, 0.11601190847026276, 1.0856151573203716], [79.99999476697363, 0.12426719587170125, 2.973333777384442]], "peak_params_": [[9.424052799644237, 0.5689224453320173, 1.6349605954990498], [12.404323335343193, 0.24699245664882485, 3.094841236498615], [16.83042399576018, 0.3578502139150981, 4.279028418262363], [22.847288252454977, 0.31882510087296667, 2.9821264275063544], [27.677846942766056, 0.24342364056813315, 3.5103554475157117], [32.66717471414038, 0.13986543531923745, 2.2127876186460727], [44.433301381464226, 0.10712973094346001, 2.1712303146407432], [79.99999476697363, 0.1242671958715087, 5.946667554768884]], "r_squared_": 0.9817263942535014, "error_": 0.03572775552018543}
{"freq_range": [2.0, 80.0], "freq_res": 1.0, "aperiodic_params_": [0.13815028596163417, 0.9463782165106253], "gaussian_params_": [[9.28577580685584, 0.651364606027526, 0.7046335554816289], [11.343396482738198, 0.2629616853248572, 1.1323462130906583], [16.056856251766398, 0.2955537752282773, 3.0309767573596993], [23.836468492036854, 0.2917136708769819, 1.5301799473528332], [26.76072038419559, 0.3003178258010574, 0.6139152426654366], [48.54796540086405, 0.1359024390838266, 3.807003613890099], [62.39383200137785, 0.9259754890568265, 0.2502924597786052], [68.3544642903462, 0.2515552632708537, 0.7054377861167583], [70.6774873528234, 0.5424806286192818, 0.25028530608348576], [73.38945093945482, 0.6133502399040264, 0.2850195218092951]], "peak_params_": [[9.28577580685584, 0.650491382230298, 1.4092671109632577], [11.343396482738198, 0.35840789881242724, 2.2646924261813166], [16.056856251766398, 0.2955582963381661, 6.061953514719399], [23.836468492036854, 0.2995994098235427, 3.0603598947056665], [26.76072038419559, 0.3132086004715542, 1.2278304853308732], [48.54796540086405, 0.1349477890494113, 7.614007227780198], [62.39383200137785, 0.2687819018691071, 0.5005849195572104], [68.3544642903462, 0.22172189027983458, 1.4108755722335167], [70.6774873528234, 0.23671859904547032, 0.5005706121669715], [73.38945093945482, 0.24114788545953392, 0.5700390436185901]], "r_squared_": 0.9717255826453389, "error_": 0.05063377780927371}
{"freq_range": [2.0, 80.0], "freq_res": 1.0, "aperiodic_params_": [0.2001254739928699, 1.0442095754716634], "gaussian_params_": [[9.888811134820665, 0.511765150962772, 1.6464393180304373], [15.82510879309567, 0.693322447098258, 3.4402667732977443], [24.758538214166858, 0.3615544293853032, 2.5694154416302974]], "peak_params_": [[9.888811134820665, 0.6759401541958981, 3.2928786360608746], [15.82510879309567, 0.6940327032457655, 6.880533546595489], [24.758538214166858, 0.3797535500697793, 5.138830883260595]], "r_squared_": 0.9831562622559008, "error_": 0.05587996338838282}
{"freq_range": [2.0, 80.0], "freq_res": 1.0, "aperiodic_params_": [0.4226058398914708, 1.172382157917816], "gaussian_params_": [[12.975287379761399, 0.8053211726396242, 3.800661667974836], [22.570180889840614, 0.5975713255583853, 5.126299540763747]], "peak_params_": [[12.975287379761399, 0.9099158149825088, 7.601323335949672], [22.570180889840614, 0.620320929143694, 10.252599081527494]], "r_squared_": 0.9840185113990824, "error_": 0.06438708320267478}
{"freq_range": [2.0, 80.0], "freq_res": 1.0, "aperiodic_params_": [0.4982149948908647, 1.2019797523726565], "gaussian_params_": [[14.29443351882472, 0.8564869433775364, 4.239437513209565], [24.763163099861714, 0.5949890899780564, 3.753198436006974]], "peak_params_": [[14.29443351882472, 0.8641673438561877, 8.47887502641913], [24.763163099861714, 0.6291252880500029, 7.506396872013948]], "r_squared_": 0.9792868955806494, "error_": 0.07210696662420271}
{"freq_range": [2.0, 80.0], "freq_res": 1.0, "aperiodic_params_": [0.5854479566589552, 1.2467091671453059], "gaussian_params_": [[14.698452806645406, 0.7563439150467552, 4.126399977559017], [24.85654483326814, 0.5806185843351802, 3.792161302756779], [28.47290070670459, 0.8066954340857891, 0.2632265778116241]], "peak_params_": [[14.698452806645406, 0.7741373410157883, 8.252799955118034], [24.85654483326814, 0.6137267699008263, 7.584322605513558], [28.47290070670459, 0.5766231640205836, 0.5264531556232482]], "r_squared_": 0.9770988850684795, "error_": 0.0741518148767121}
{"freq_range": [2.0, 80.0], "freq_res": 1.0, "aperiodic_params_": [0.5171332786355172, 1.2035980150342465], "gaussian_params_": [[14.53531403802304, 0.7690386562273497, 4.209874824144432], [23.415432709870373, 0.6253749556309914, 0.2728247945998144], [25.452034599135946, 0.49587225383134903, 4.543851360585338]], "peak_params_": [[14.53531403802304, 0.799556634783846, 8.419749648288864], [23.415432709870373, 0.7267348243066403, 0.5456495891996288], [25.452034599135946, 0.5284358673489687, 9.087702721170675]], "r_squared_": 0.9829978435438388, "error_": 0.0647816583837094}
{"freq_range": [2.0, 80.0], "freq_res": 1.0, "aperiodic_params_": [0.46126882173944267, 1.0929833031324552], "gaussian_params_": [[9.383267267250881, 0.32960464943585266, 1.5599443531954738], [15.660833621157833, 0.6541418062658744, 3.9103583814080967], [25.452034599135953, 0.36794098954604665, 3.9436074084196355]], "peak_params_": [[9.383267267250881, 0.4731925962641734, 3.1198887063909475], [15.660833621157833, 0.6725401693508831, 7.820716762816193], [25.452034599135953, 0.40329365714246634, 7.887214816839271]], "r_squared_": 0.9864834186655574, "error_": 0.05147363213734267}
{"freq_range": [2.0, 80.0], "freq_res": 1.0, "aperiodic_params_": [-0.008465283498522515, 0.874104949395061], "gaussian_params_": [[9.535359613274654, 0.4266667664340179, 0.9757373443935529], [18.198249975187224, 0.46310866288733743, 5.999999999999999]], "peak_params_": [[9.535359613274654, 0.5630173602814683, 1.9514746887871057], [18.198249975187224, 0.4628559320933394, 11.999999999999998]], "r_squared_": 0.9661640251670853, "error_": 0.05765491744114534}
{"freq_range": [2.0, 80.0], "freq_res": 1.0, "aperiodic_params_": [0.18874133275249527, 0.9756130808022621], "gaussian_params_": [[9.463100636029093, 0.49982045534173414, 0.7487901619426672], [13.165729936662668, 0.23658637482260636, 1.5869197191340314], [16.634167978270934, 0.47241465065757254, 0.2888741794431788], [21.210315505209945, 0.17831329207809254, 3.895142938266031], [30.440102146746003, 0.11315573624669054, 2.088885332262183], [46.316526182003365, 0.34505144179541647, 0.26333548028532106]], "peak_params_": [[9.463100636029093, 0.4216702020701592, 1.4975803238853345], [13.165729936662668, 0.25464460463231375, 3.173839438268063], [16.634167978270934, 0.32406188563158345, 0.5777483588863576], [21.210315505209945, 0.17805892010160307, 7.790285876532062], [30.440102146746003, 0.12464982255813117, 4.177770664524366], [46.316526182003365, 0.16755396958207713, 0.5266709605706421]], "r_squared_": 0.9754211761599032, "error_": 0.0492028050516388}
{"freq_range": [2.0, 80.0], "freq_res": 1.0, "aperiodic_params_": [-0.3225790466871503, 0.5705789393450821], "gaussian_params_": [[9.331398217535781, 0.5998308696129899, 0.6340182083439377], [13.688906310423011, 0.3438797945475856, 3.3016461208379018], [24.260843669235143, 0.24473399459618714, 1.89456999522032], [46.360342796672164, 0.27249052569010185, 0.6503333430504133], [62.166039078822315, 0.30900438873862573, 0.4566400586261488], [68.25439072545393, 0.287981336569307, 0.5305784830649363], [70.85753023659029, 0.3221134455572374, 0.5393557992090461], [72.7124949354242, 0.6159389115557806, 0.25000885819686347]], "peak_params_": [[9.331398217535781, 0.6486837540768134, 1.2680364166878755], [13.688906310423011, 0.34235677794432484, 6.6032922416758035], [24.260843669235143, 0.245046721983758, 3.78913999044064], [46.360342796672164, 0.2337135749009258, 1.3006666861008267], [62.166039078822315, 0.28923780800032395, 0.9132801172522976], [68.25439072545393, 0.25671233238461766, 1.0611569661298725], [70.85753023659029, 0.31107005077482497, 1.0787115984180922], [72.7124949354242, 0.31807933624659435, 0.5000177163937269]], "r_squared_": 0.8845674301424359, "error_": 0.06876710756032761}
{"freq_range": [2.0, 80.0], "freq_res": 1.0, "aperiodic_params_": [0.06992175780990298, 1.0329945896347013], "gaussian_params_": [[10.063340356283124, 0.5408447315196526, 1.9071969777032987], [15.733699711471443, 0.7304818231755843, 3.283759020751519], [24.510900119162063, 0.3637150461622809, 2.9088327835012846], [71.51525601396709, 0.12436579525366781, 2.368180092577398], [78.51318226033814, 0.162647061737056, 1.0842106448022686]], "peak_params_": [[10.063340356283124, 0.6996125090267692, 3.8143939554065973], [15.733699711471443, 0.7373731541787117, 6.567518041503038], [24.510900119162063, 0.3722396044019194, 5.817665567002569], [71.51525601396709, 0.12178754620928234, 4.736360185154796], [78.51318226033814, 0.14789351766857317, 2.168421289604537]], "r_squared_": 0.9784492097261565, "error_": 0.06149813072232271}
{"freq_range": [2.0, 80.0], "freq_res": 1.0, "aperiodic_params_": [0.32775560816018173, 1.1115659448264266], "gaussian_params_": [[12.803207523658994, 0.8538412611905364, 3.5948216941072593], [22.316647944378882, 0.5221275961078896, 4.6801785239753135]], "peak_params_": [[12.803207523658994, 0.924554218049477, 7.1896433882145185], [22.316647944378882, 0.5533023184595858, 9.360357047950627]], "r_squared_": 0.9815794233855004, "error_": 0.06901206762352935}
{"freq_range": [2.0, 80.0], "freq_res": 1.0, "aperiodic_params_": [0.4208574904233412, 1.1506195163766497], "gaussian_params_": [[13.202440728285026, 0.8236710516243448, 3.777567550693315], [23.236355965067105, 0.5052101194032108, 4.672791650208843]], "peak_params_": [[13.202440728285026, 0.8683469432510535, 7.55513510138663], [23.236355965067105, 0.5330769477373414, 9.345583300417687]], "r_squared_": 0.9813291777776133, "error_": 0.06542309627110787}
{"freq_range": [2.0, 80.0], "freq_res": 1.0, "aperiodic_params_": [0.4804451436971728, 1.1587489970119766], "gaussian_params_": [[9.87443507641519, 0.4781601498063104, 1.7886113767597946], [15.998311879290975, 0.7792520555723736, 3.3023497938199267], [23.399244403392277, 0.5834368308951455, 0.28100708631409876], [24.80957296807868, 0.4066978211863465, 2.248413368537757], [28.737708479009164, 0.31745421429115916, 0.8805324791920347]], "peak_params_": [[9.87443507641519, 0.6266966073572926, 3.5772227535195893], [15.998311879290975, 0.7807978582891704, 6.604699587639853], [23.399244403392277, 0.5891593223728891, 0.5620141726281975], [24.80957296807868, 0.4242575888777388, 4.496826737075514], [28.737708479009164, 0.375630520258857, 1.7610649583840694]], "r_squared_": 0.987472776823688, "error_": 0.051440376814178}
{"freq_range": [2.0, 80.0], "freq_res": 1.0, "aperiodic_params_": [0.4634271063084498, 1.1367775767027135], "gaussian_params_": [[12.828703585791425, 0.6769652210872379, 3.4812422236101903], [21.940146000100437, 0.43297002976448995, 5.635002009814755], [28.52896591650848, 0.6474744445510144, 0.290168448239621]], "peak_params_": [[12.828703585791425, 0.7991378744222237, 6.962484447220381], [21.940146000100437, 0.4540051148381534, 11.27000401962951], [28.52896591650848, 0.3709182952721727, 0.580336896479242]], "r_squared_": 0.9873277603709798, "error_": 0.05274200769495443}
{"freq_range": [2.0, 80.0], "freq_res": 1.0, "aperiodic_params_": [0.2539158602993264, 1.0470117054063355], "gaussian_params_": [[12.43694185027056, 0.6789222385615449, 3.2998200983380053], [21.30053414389752, 0.4513796206832294, 5.6754300970239], [28.560112746393237, 0.5051589230415453, 0.2919787733616178]], "peak_params_": [[12.43694185027056, 0.7908660794499768, 6.5996401966760105], [21.30053414389752, 0.4741644976899553, 11.3508601940478], [28.560112746393237, 0.34223397625847607, 0.5839575467232356]], "r_squared_": 0.9832603687985197, "error_": 0.057308504702796116}
{"freq_range": [2.0, 80.0], "freq_res": 1.0, "aperiodic_params_": [-0.018770531835930856, 0.8898261645988392], "gaussian_params_": [[9.447501470589533, 0.4282330246590525, 1.1788432881950077], [14.771215641656157, 0.6037440247337467, 3.555459371514646], [22.973264392615285, 0.3276618377802091, 1.531873863733967], [25.85314003510656, 0.19230996562719085, 0.6719804095134638], [28.567305194537592, 0.20763753934752469, 1.176644394123385]], "peak_params_": [[9.447501470589533, 0.5601667124766194, 2.3576865763900154], [14.771215641656157, 0.6025023410127931, 7.110918743029292], [22.973264392615285, 0.36910560792697544, 3.063747727467934], [25.85314003510656, 0.25762968709348955, 1.3439608190269277], [28.567305194537592, 0.1944092226005374, 2.35328878824677]], "r_squared_": 0.9850967649958514, "error_": 0.039738973990016725}
{"freq_range": [2.0, 80.0], "freq_res": 1.0, "aperiodic_params_": [-0.4578630517825857, 0.5480720616109206], "gaussian_params_": [[9.376081444157924, 0.6306148795332789, 0.8997336820488014], [13.283646884965998, 0.26919496297958423, 2.2195644599973297], [21.93195236277552, 0.4185100588028571, 2.4675494240755547], [41.1094281990658, 0.2415731704408403, 0.6633217035827801], [44.56667239045623, 0.283900772344868, 1.21687800991749], [48.43127911468101, 0.5103088425325162, 0.2969903036066348]], "peak_params_": [[9.376081444157924, 0.6196712230674892, 1.7994673640976029], [13.283646884965998, 0.2677927060816454, 4.439128919994659], [21.93195236277552, 0.41847153174595353, 4.935098848151109], [41.1094281990658, 0.2421781476904432, 1.3266434071655602], [44.56667239045623, 0.2664594261912949, 2.43375601983498], [48.43127911468101, 0.183097379933018, 0.5939806072132696]], "r_squared_": 0.9383796148474131, "error_": 0.05275572345575999}
{"freq_range": [2.0, 80.0], "freq_res": 1.0, "aperiodic_params_": [-0.4385153673271464, 0.6689908101223608], "gaussian_params_": [[8.565601214271254, 0.5431840712214427, 0.30892957732397086], [10.094819302308805, 0.3379854978939048, 0.8378695478964767], [14.996406359967114, 0.5238634174872335, 3.8192270126960377], [32.504858423995614, 0.7516409222610578, 0.2869221052676909], [38.64498431291199, 0.47252099905213607, 0.25768587386574887], [44.09740515637157, 0.19915216075220965, 0.7026678396743509], [73.37812233479373, 0.5479723213950487, 0.270121582355522]], "peak_params_": [[8.565601214271254, 0.49877412771879004, 0.6178591546479417], [10.094819302308805, 0.5584681592931846, 1.6757390957929534], [14.996406359967114, 0.5238631977889325, 7.638454025392075], [32.504858423995614, 0.16957309423574007, 0.5738442105353818], [38.64498431291199, 0.18291903325839254, 0.5153717477314977], [44.09740515637157, 0.19724786637367675, 1.4053356793487017], [73.37812233479373, 0.2057111332859518, 0.540243164711044]], "r_squared_": 0.9547661092828629, "error_": 0.05589889658753079}
{"freq_range": [2.0, 80.0], "freq_res": 1.0, "aperiodic_params_": [-0.01019727574368624, 0.8249888465570444], "gaussian_params_": [[13.693527317305959, 0.7141806583319763, 3.703581782467547], [23.464513852308876, 0.21147368726806848, 2.0420042295962264], [73.01229384079222, 0.19068705324600246, 0.48708470531785275]], "peak_params_": [[13.693527317305959, 0.7117441957692106, 7.407163564935094], [23.464513852308876, 0.2364581868545348, 4.084008459192453], [73.01229384079222, 0.1906263253504079, 0.9741694106357055]], "r_squared_": 0.9663358445100463, "error_": 0.06024348357704136}
{"freq_range": [2.0, 80.0], "freq_res": 1.0, "aperiodic_params_": [0.25432954343549313, 1.0040159865251], "gaussian_params_": [[10.491461487084461, 0.5309064357722956, 1.8030177899222457], [15.41597888923953, 0.7025021466674791, 2.8746780578671824], [23.83000890345008, 0.30850668974790646, 3.48470184818467]], "peak_params_": [[10.491461487084461, 0.6307509667484168, 3.6060355798444914], [15.41597888923953, 0.7309249304699231, 5.749356115734365], [23.83000890345008, 0.31627591662101806, 6.96940369636934]], "r_squared_": 0.9817156478751403, "error_": 0.05609328411915722}
{"freq_range": [2.0, 80.0], "freq_res": 1.0, "aperiodic_params_": [0.4220773480623737, 1.069578557306816], "gaussian_params_": [[8.513370273216166, 0.6157077765238944, 0.3086907898609077], [10.68801939795179, 0.41192114231774374, 1.3613126007813752], [15.600312892635953, 0.6626307908088814, 2.936933901732463], [23.96202259204919, 0.3920717984088054, 1.703414515196443], [28.59504325686542, 0.2908969058848957, 0.8243819748342223], [34.06879217116695, 0.12153040276679784, 1.3845857396617374], [39.323776115563945, 0.31564451868392246, 0.2591901485487327], [78.64114111026248, 0.32451326709636363, 0.2787897378235808]], "peak_params_": [[8.513370273216166, 0.42170846461538, 0.6173815797218154], [10.68801939795179, 0.5955568966749378, 2.7226252015627503], [15.600312892635953, 0.6567335079941401, 5.873867803464926], [23.96202259204919, 0.40306796440144566, 3.406829030392886], [28.59504325686542, 0.2629462345977531, 1.6487639496684445], [34.06879217116695, 0.12138050802021394, 2.7691714793234747], [39.323776115563945, 0.14487402508415093, 0.5183802970974654], [78.64114111026248, 0.14172394086726525, 0.5575794756471616]], "r_squared_": 0.9883624379726375, "error_": 0.043994915087578614}
{"freq_range": [2.0, 80.0], "freq_res": 1.0, "aperiodic_params_": [0.30411833182720566, 0.9950502086104348], "gaussian_params_": [[13.747080718042302, 0.8142771414171353, 3.678790172305372], [24.03900443966738, 0.31609615958153126, 2.1109166718267423], [26.02923628028653, 0.11426549801964203, 0.250024431171949], [28.76934971840195, 0.2966975568489075, 0.7412448185200023]], "peak_params_": [[13.747080718042302, 0.8123588878403637, 7.357580344610744], [24.03900443966738, 0.33279419276588995, 4.2218333436534845], [26.02923628028653, 0.3222541365096493, 0.500048862343898], [28.76934971840195, 0.30280023342775353, 1.4824896370400047]], "r_squared_": 0.9790763260976982, "error_": 0.05756522752037863}
{"freq_range": [2.0, 80.0], "freq_res": 1.0, "aperiodic_params_": [0.16903124593801494, 0.8971608947860483], "gaussian_params_": [[13.069833986629297, 0.7689634694952134, 3.1599181473182236], [23.448079247631423, 0.5113584900793843, 0.28103156952244474], [23.452034599135946, 0.1822619607947119, 5.250162293496168]], "peak_params_": [[13.069833986629297, 0.7938990744241703, 6.319836294636447], [23.448079247631423, 0.33055359407171103, 0.5620631390448895], [23.452034599135946, 0.33055359407171103, 10.500324586992337]], "r_squared_": 0.9745663021728203, "error_": 0.05289359176034757}
{"freq_range": [2.0, 80.0], "freq_res": 1.0, "aperiodic_params_": [-0.148213131095931, 0.6967011426629311], "gaussian_params_": [[9.417695908744662, 0.4969932406384053, 1.188963289931221], [13.215384389922217, 0.5968038105441136, 2.0255096899583767], [16.068847646291356, 0.29754042846900075, 0.8330105060379086], [18.534771640667252, 0.25217761406271255, 0.6308281418782538], [22.844613248768514, 0.20924736600912675, 2.142126290815405], [29.032561634194444, 0.14350677184708996, 0.6328313559516013], [67.91510787523306, 0.16715360683212138, 0.4150767626365829]], "peak_params_": [[9.417695908744662, 0.5356940388392526, 2.377926579862442], [13.215384389922217, 0.5990907018371645, 4.051019379916753], [16.068847646291356, 0.5298397508967773, 1.6660210120758172], [18.534771640667252, 0.24465428517964305, 1.2616562837565075], [22.844613248768514, 0.20870268800349756, 4.28425258163081], [29.032561634194444, 0.14668733765519737, 1.2656627119032027], [67.91510787523306, 0.16369397323041968, 0.8301535252731658]], "r_squared_": 0.966460533993142, "error_": 0.043464106642667984}
{"freq_range": [2.0, 80.0], "freq_res": 1.0, "aperiodic_params_": [-0.4000612618080505, 0.5929514459129295], "gaussian_params_": [[9.4045311353569, 0.5326421445619547, 0.9859897422472214], [13.55967522230801, 0.3930927428741878, 2.4270367397703994], [19.208384138733756, 0.12998611975479787, 0.5955809707700729], [23.16532487230295, 0.24410940977700152, 1.5388246664798084], [45.972520356403244, 0.09607806261887714, 2.5925283219884365], [68.25765975385525, 0.13610934555876172, 0.9864581761113356], [70.54500851376481, 0.613940209044528, 0.2692706449790043]], "peak_params_": [[9.4045311353569, 0.5569558465006537, 1.9719794844944427], [13.55967522230801, 0.3866865908644259, 4.854073479540799], [19.208384138733756, 0.16040172090865612, 1.1911619415401458], [23.16532487230295, 0.24290845086547985, 3.077649332959617], [45.972520356403244, 0.09607266555925742, 5.185056643976873], [68.25765975385525, 0.1315446951237309, 1.9729163522226711], [70.54500851376481, 0.15013392670533499, 0.5385412899580087]], "r_squared_": 0.9614339446865513, "error_": 0.03736781833720241}
{"freq_range": [2.0, 80.0], "freq_res": 1.0, "aperiodic_params_": [-1.060732619224349, 0.14283895313279749], "gaussian_params_": [[4.904069198271887, 0.15813100645799588, 5.999999999999999], [44.26334802813672, 0.15040483123373347, 1.5895895310919326], [68.38582913215572, 0.7393962325191238, 0.2500012554542364], [70.51107675470008, 0.7789431795389324, 0.25119341692117425], [73.89069930322262, 0.14339791097193513, 2.191048566348661], [78.69605895009175, 0.25609104267971844, 0.5038430355744361]], "peak_params_": [[4.904069198271887, 0.1581107961499888, 11.999999999999998], [44.26334802813672, 0.14835487143174197, 3.179179062183865], [68.38582913215572, 0.22860079947631085, 0.5000025109084728], [70.51107675470008, 0.1772369462061123, 0.5023868338423485], [73.89069930322262, 0.1432195973499888, 4.382097132697322], [78.69605895009175, 0.22294491528865512, 1.0076860711488722]], "r_squared_": 0.38395885479945385, "error_": 0.06976237692881536}
{"freq_range": [2.0, 80.0], "freq_res": 1.0, "aperiodic_params_": [-0.372554257292766, 0.464554376278981], "gaussian_params_": [[10.112580804217327, 0.288217890950635, 1.393928696269738], [14.77501138698403, 0.35227201693298704, 2.2059397783750465], [68.42668961812927, 0.7496754675235302, 0.2690432700738291]], "peak_params_": [[10.112580804217327, 0.3211187235352412, 2.787857392539476], [14.77501138698403, 0.3510614227865444, 4.411879556750093], [68.42668961812927, 0.2131548900226532, 0.5380865401476582]], "r_squared_": 0.8808100503570047, "error_": 0.05657433545216796}
{"freq_range": [2.0, 80.0], "freq_res": 1.0, "aperiodic_params_": [-0.04318423785644026, 0.6271750794429489], "gaussian_params_": [[8.900812354922797, 0.2751365727264069, 0.8246746605777203], [10.976413144711108, 0.24926843252817865, 0.6355956682721889], [15.031588410288945, 0.40062612353765326, 2.5276906126316763], [23.510709451645734, 1.06141824543602, 0.2616730995934252], [38.82642112563736, 0.14952378455969215, 0.47863736987769545], [57.627900887583806, 0.21054040688827388, 0.403714052234329], [65.54374686227554, 0.8906646021093173, 0.25130294458815544], [68.27657695744581, 0.30011951133801945, 0.250000000576736], [78.58529716243027, 0.23783229362009173, 0.6414704959161658]], "peak_params_": [[8.900812354922797, 0.2983791281274806, 1.6493493211554406], [10.976413144711108, 0.37216313344205776, 1.2711913365443779], [15.031588410288945, 0.4005948416361549, 5.0553812252633525], [23.510709451645734, 0.18552312948959593, 0.5233461991868504], [38.82642112563736, 0.14000766637313156, 0.9572747397553909], [57.627900887583806, 0.1376785436816963, 0.807428104468658], [65.54374686227554, 0.1713754001443717, 0.5026058891763109], [68.27657695744581, 0.16275113617297698, 0.500000001153472], [78.58529716243027, 0.19298115681490713, 1.2829409918323316]], "r_squared_": 0.9587355515711248, "error_": 0.044311594246515505}
{"freq_range": [2.0, 80.0], "freq_res": 1.0, "aperiodic_params_": [0.05855469232742459, 0.7495879472278513], "gaussian_params_": [[10.404808334307127, 0.35654105555703164, 1.5635684695658512], [15.592142089393686, 0.46170047261960084, 2.1046479474625452], [23.5579758108723, 0.21463918615068758, 1.1611228454240712], [28.585778810146937, 0.45370293092416636, 0.28281823757219954], [68.00661189429734, 0.14563886905506906, 0.2500076090617588]], "peak_params_": [[10.404808334307127, 0.35832060519608117, 3.1271369391317023], [15.592142089393686, 0.4537027461256395, 4.2092958949250905], [23.5579758108723, 0.19979436683574192, 2.3222456908481424], [28.585778810146937, 0.15523041436684748, 0.5656364751443991], [68.00661189429734, 0.14558794573450773, 0.5000152181235176]], "r_squared_": 0.9719331076497622, "error_": 0.045122007324398576}
{"freq_range": [2.0, 80.0], "freq_res": 1.0, "aperiodic_params_": [-0.0657815808525326, 0.6299498986933786], "gaussian_params_": [[9.961590359026607, 0.29379926651244764, 1.5005084514819254], [14.371502551990634, 0.4545275819482012, 2.667424890418142], [23.30939557804018, 0.20966366627574476, 0.6211242228208201], [25.639546430341255, 0.3357661180177804, 0.2502162574591752], [47.60591942580307, 0.6614025057374759, 0.25011290586697194], [55.13384867792172, 0.14801880663907555, 0.47920694645139456], [67.73287070911263, 0.1843755294636389, 0.25280901749571244], [75.54796531704815, 0.09163609717729931, 5.999999999917493]], "peak_params_": [[9.961590359026607, 0.41237320978963105, 3.0010169029638507], [14.371502551990634, 0.4579958821278475, 5.334849780836284], [23.30939557804018, 0.18762984892690004, 1.2422484456416403], [25.639546430341255, 0.11901269394610614, 0.5004325149183504], [47.60591942580307, 0.19115807602485646, 0.5002258117339439], [55.13384867792172, 0.14261626986766007, 0.9584138929027891], [67.73287070911263, 0.14703713715106703, 0.5056180349914249], [75.54796531704815, 0.0913764034334903, 11.999999999834985]], "r_squared_": 0.9593633230190248, "error_": 0.03896160622630385}
{"freq_range": [2.0, 80.0], "freq_res": 1.0, "aperiodic_params_": [-0.4578867431813948, 0.41658832909162874], "gaussian_params_": [[9.223831827022032, 0.3217857371556152, 0.8895157941166408], [12.032938901017792, 0.28351016017183645, 1.708622480347279], [15.67687665775739, 0.2266941851140866, 1.26323713343081], [18.826527306416573, 0.15913075524204412, 0.49071858470988106], [22.713365042548485, 0.2072523179459662, 0.2568266558523425], [47.86950518562888, 0.16420945719205898, 0.250279443394802], [54.90800957152263, 0.16420549898198059, 0.8441208132066556], [58.91484342502384, 0.139122256152909, 0.7336639722416857], [61.51039986820836, 0.48381459813538047, 0.3104974577711731], [66.77835254127223, 0.11405132595742112, 1.4073830523776407], [70.49317296173139, 0.5396118235444536, 0.30787165657938564], [73.44253140974318, 0.16012610451403106, 0.7915093837806719]], "peak_params_": [[9.223831827022032, 0.3704201223565923, 1.7790315882332817], [12.032938901017792, 0.2892050938973256, 3.417244960694558], [15.67687665775739, 0.23854026540065387, 2.52647426686162], [18.826527306416573, 0.15668543350860664, 0.9814371694197621], [22.713365042548485, 0.11117858439202011, 0.513653311704685], [47.86950518562888, 0.14333945947742888, 0.500558886789604], [54.90800957152263, 0.16323341413632741, 1.688241626413311], [58.91484342502384, 0.13818957886533, 1.4673279444833713], [61.51039986820836, 0.13994078913404495, 0.6209949155423462], [66.77835254127223, 0.11264566340898963, 2.8147661047552814], [70.49317296173139, 0.1578974645429012, 0.6157433131587713], [73.44253140974318, 0.13696341138661383, 1.5830187675613439]], "r_squared_": 0.8793221350623776, "error_": 0.042067652974310504}
{"freq_range": [2.0, 80.0], "freq_res": 1.0, "aperiodic_params_": [-0.8332536619676016, 0.18817337320624838], "gaussian_params_": [[9.391898465968517, 0.42060346532416365, 0.7910263257778607], [11.761838018268348, 0.23424863127495485, 0.25718924123131665], [14.671023252247164, 0.17795897180778397, 0.6381066701037976], [19.238192210122563, 0.17311941443849335, 0.6404770743441272], [22.627133677648704, 0.23126170103583168, 0.4022177858827736], [31.981734796596722, 0.1595519063573523, 0.8508771645670216], [33.859926272862374, 0.143959999677354, 0.25000248586852014], [43.42576692864671, 0.5031738137059191, 0.26685353429149955], [47.62124654845082, 0.5371248466286851, 0.2500067425399803], [54.45220586440161, 0.25008272055130343, 0.4908732734097856], [61.473144330288555, 0.6481670749531628, 0.2904581372599743], [67.06817737387524, 0.12861658605367923, 1.4795514679881419], [70.51770884878852, 0.6162410290801262, 0.2806993216389973], [75.5798411237746, 0.42495944756567594, 0.26662118140198743]], "peak_params_": [[9.391898465968517, 0.37202642103306294, 1.5820526515557214], [11.761838018268348, 0.15443207264389336, 0.5143784824626333], [14.671023252247164, 0.15581297930213056, 1.2762133402075952], [19.238192210122563, 0.16155207123139925, 1.2809541486882543], [22.627133677648704, 0.15048470657655666, 0.8044355717655473], [31.981734796596722, 0.1595151495942556, 1.7017543291340431], [33.859926272862374, 0.13262348337018792, 0.5000049717370403], [43.42576692864671, 0.14090880328409439, 0.5337070685829991], [47.62124654845082, 0.17048699894255992, 0.5000134850799606], [54.45220586440161, 0.1636061260102577, 0.9817465468195712], [61.473144330288555, 0.17201153472925634, 0.5809162745199486], [67.06817737387524, 0.1284801098774324, 2.9591029359762837], [70.51770884878852, 0.14459791993091264, 0.5613986432779946], [75.5798411237746, 0.1227707961878266, 0.5332423628039749]], "r_squared_": 0.6402038916105076, "error_": 0.046409274746550766}
{"freq_range": [2.0, 80.0], "freq_res": 1.0, "aperiodic_params_": [-0.46977196377949787, 0.22364255178204398], "gaussian_params_": [[12.404206866958514, 0.16083042291875677, 3.0764970460958923], [39.23333597460635, 0.14475444756231348, 0.25476763476219316], [42.452067690842945, 0.0856921697533908, 5.999999999999999], [60.547965400409545, 0.06786807330903696, 5.999999999999768], [68.04717507646411, 0.15737850715461446, 0.2500104109107234], [78.50140751087986, 1.1771745686856783, 0.250016999087895]], "peak_params_": [[12.404206866958514, 0.1594484769656973, 6.1529940921917845], [39.23333597460635, 0.16789416645363486, 0.5095352695243863], [42.452067690842945, 0.08602015915960237, 11.999999999999998], [60.547965400409545, 0.068396551153729, 11.999999999999536], [68.04717507646411, 0.18599480821855519, 0.5000208218214468], [78.50140751087986, 0.16175801732358552, 0.50003399817579]], "r_squared_": 0.4756558195002157, "error_": 0.058468746477194806}
{"freq_range": [2.0, 80.0], "freq_res": 1.0, "aperiodic_params_": [-0.48944126479454025, 0.34357400908257457], "gaussian_params_": [[9.126805714421035, 0.24932697484987773, 0.7656371596550221], [11.424051316647232, 0.4655164685881254, 0.3301628444269596], [15.279501560352859, 0.15305998676080387, 1.7200915886034522], [23.469258500309028, 0.5647453857473858, 0.29846684985871047], [31.544168937810646, 0.49949945533513995, 0.29338104750543914], [38.91257629475372, 0.1296852100368201, 0.25086276058740686], [40.97974448591685, 0.11117235612423497, 0.25000005094687966], [49.580313802422374, 0.08081282329090644, 5.999999999999999], [57.53285642247594, 0.4358212442896733, 0.28707862866260003], [67.9544254515069, 0.16349563742954745, 0.25000003632054074], [78.52701331434781, 0.6597078076336875, 0.28868388463339933]], "peak_params_": [[9.126805714421035, 0.24612611533836815, 1.5312743193100442], [11.424051316647232, 0.22347780454088517, 0.6603256888539192], [15.279501560352859, 0.15105259406711613, 3.4401831772069045], [23.469258500309028, 0.1641019553700388, 0.5969336997174209], [31.544168937810646, 0.1504988708636943, 0.5867620950108783], [38.91257629475372, 0.1391154440968636, 0.5017255211748137], [40.97974448591685, 0.13987526873064393, 0.5000001018937593], [49.580313802422374, 0.08061536923972734, 11.999999999999998], [57.53285642247594, 0.14615596069730508, 0.5741572573252001], [67.9544254515069, 0.16152742668105957, 0.5000000726410815], [78.52701331434781, 0.17235956385782947, 0.5773677692667987]], "r_squared_": 0.7818969793211169, "error_": 0.045233906376546146}
{"freq_range": [2.0, 80.0], "freq_res": 1.0, "aperiodic_params_": [-0.5595348642750689, 0.1796702323528386], "gaussian_params_": [[9.150773163276908, 0.2738852215987508, 0.8481377347838156], [11.491664321257042, 0.647929973021121, 0.3119920134574018], [14.963862484413017, 0.1560001602136653, 1.4905147883087155], [47.609465803348044, 0.6017717402695361, 0.2573177478331168], [51.37589084179748, 0.43234540498979523, 0.26029428627772], [57.241456609893, 0.09011714285943667, 3.3951777961355436], [69.8717753203276, 0.1066325142321312, 3.6561620729410738], [78.20678406615934, 0.14256360264994059, 1.513731297090184]], "peak_params_": [[9.150773163276908, 0.2696436446756936, 1.6962754695676312], [11.491664321257042, 0.21714962049511866, 0.6239840269148036], [14.963862484413017, 0.1559543169939307, 2.981029576617431], [47.609465803348044, 0.19243280834759924, 0.5146354956662336], [51.37589084179748, 0.16903375631039208, 0.52058857255544], [57.241456609893, 0.0901065464630455, 6.790355592271087], [69.8717753203276, 0.10664435362545344, 7.3123241458821475], [78.20678406615934, 0.1502481394987194, 3.027462594180368]], "r_squared_": 0.3977399614125664, "error_": 0.06121418916659707}
{"freq_range": [2.0, 80.0], "freq_res": 1.0, "aperiodic_params_": [-0.7727147794819521, 0.6065087528618418], "gaussian_params_": [[9.393278926704191, 0.4257858152823988, 0.5850020506157021], [11.851812671918989, 0.20921517765218425, 0.5077701928654417], [19.425430054110354, 0.19791952761643425, 0.6703513104393475], [23.551216923187205, 0.2564303086403044, 1.1038064339923939], [27.15356213507438, 0.3304486104543295, 0.8619311773730324], [29.527453987324915, 0.7895681708345529, 0.33669705076857587], [31.960578597972123, 0.3221901117475232, 0.7527920000644783], [36.69053513304839, 0.19673942770790123, 2.7673766286040915], [41.025386101650284, 0.17356384013115694, 0.25000067803612347], [45.12725660232613, 0.20896294956187406, 1.6148693430675884]], "peak_params_": [[9.393278926704191, 0.3396662477583514, 1.1700041012314042], [11.851812671918989, 0.20051354969362079, 1.0155403857308833], [19.425430054110354, 0.16187111313061298, 1.340702620878695], [23.551216923187205, 0.23650281161795106, 2.2076128679847877], [27.15356213507438, 0.3276193997525836, 1.7238623547460648], [29.527453987324915, 0.31773814676079004, 0.6733941015371517], [31.960578597972123, 0.36852938838943916, 1.5055840001289567], [36.69053513304839, 0.1955138058919601, 5.534753257208183], [41.025386101650284, 0.23916590101904944, 0.5000013560722469], [45.12725660232613, 0.21048339458694443, 3.229738686135177]], "r_squared_": 0.9182376150497085, "error_": 0.05432911172144957}
{"freq_range": [2.0, 80.0], "freq_res": 1.0, "aperiodic_params_": [-0.4528828664361007, 0.7745986669782284], "gaussian_params_": [[9.640161661057329, 0.4612493135356204, 0.9855884845216554], [12.845369782322292, 0.26159945897172576, 0.9391140357479519], [15.301175978088985, 0.4196199879131395, 0.2864813804272081], [17.10375611289868, 0.23273705907506756, 1.1751918306240243], [23.27634931367929, 0.18493731543697778, 1.5013968513118106], [24.59441333459708, 0.2179523345509409, 0.2886093753813942], [27.685627626439086, 0.1661789672645707, 1.2026484824449586]], "peak_params_": [[9.640161661057329, 0.4341656171370628, 1.9711769690433107], [12.845369782322292, 0.25998262683675644, 1.8782280714959039], [15.301175978088985, 0.30716887534885373, 0.5729627608544162], [17.10375611289868, 0.23187613793413786, 2.3503836612480487], [23.27634931367929, 0.1819158554956346, 3.002793702623621], [24.59441333459708, 0.19060615288402616, 0.5772187507627884], [27.685627626439086, 0.16190839659903333, 2.405296964889917]], "r_squared_": 0.9596749419794688, "error_": 0.05150073128602064}
{"freq_range": [2.0, 80.0], "freq_res": 1.0, "aperiodic_params_": [0.2838751614202157, 1.1339027272677085], "gaussian_params_": [[8.510381931817719, 2.244650239068119, 0.2693252348901022], [10.094641518694287, 0.5068733620083773, 0.5354525253211965], [12.183668250304846, 0.23847247384588674, 0.8653396254874144], [15.064871866684799, 0.17863901014543382, 0.6223587636494187], [17.34773136642332, 0.21862054403535708, 0.678689616614587], [47.530295047891144, 0.7842588866444871, 0.2682899548789405], [50.86236953016595, 0.14548363445235163, 1.3347547823216948], [55.42014606648642, 0.2925490490655024, 0.25000373476313875], [56.35514450072996, 0.13722615193759896, 1.4465997836228501], [62.475041195210046, 0.5486620434774846, 0.2614973390459804], [69.4753119211075, 0.14106913330806595, 5.999999999999999]], "peak_params_": [[8.510381931817719, 0.4930164283120346, 0.5386504697802044], [10.094641518694287, 0.5088954941163432, 1.070905050642393], [12.183668250304846, 0.2340641349728897, 1.7306792509748288], [15.064871866684799, 0.17941722682051675, 1.2447175272988373], [17.34773136642332, 0.193149995218575, 1.357379233229174], [47.530295047891144, 0.18421705432698987, 0.536579909757881], [50.86236953016595, 0.14608914925266414, 2.6695095646433895], [55.42014606648642, 0.16863288040414925, 0.5000074695262775], [56.35514450072996, 0.1644315170231081, 2.8931995672457003], [62.475041195210046, 0.17035127903224256, 0.5229946780919608], [69.4753119211075, 0.14062718067120694, 11.999999999999998]], "r_squared_": 0.9758858007279543, "error_": 0.04844460708911754}
{"freq_range": [2.0, 80.0], "freq_res": 1.0, "aperiodic_params_": [-0.3256466716457816, 0.8342672871255337], "gaussian_params_": [[9.479974841795139, 0.4853943962418337, 0.806832834096072], [12.693395821001847, 0.212487731275468, 1.548780217541454], [15.023725111163577, 0.20296337166370568, 0.25019120136623413], [17.05316563116839, 0.25465434991624614, 0.9478824075654207], [24.45657985818997, 0.1841665473420969, 3.8827466276723586], [64.28203904345072, 0.0896634827329148, 5.999999999999999]], "peak_params_": [[9.479974841795139, 0.4191146776605468, 1.613665668192144], [12.693395821001847, 0.21079710610850966, 3.097560435082908], [15.023725111163577, 0.3060222095119012, 0.5003824027324683], [17.05316563116839, 0.28783488776656907, 1.8957648151308415], [24.45657985818997, 0.18289762319079683, 7.765493255344717], [64.28203904345072, 0.08956447669292289, 11.999999999999998]], "r_squared_": 0.967727468756072, "error_": 0.04735127755515096}
