{"freq_range": [2.0, 80.0], "freq_res": 1.0, "aperiodic_params_": [0.4393622246613221, 1.1039691516477355], "gaussian_params_": [[58.54299074209159, 0.7585783979456123, 0.26889472043853857], [60.98060878394405, 0.14089286336381476, 0.4819645606272606], [68.51481371433657, 0.9882775345092761, 0.26170950470640614], [75.54796540086404, 0.1710815094626984, 5.999999999999999]], "peak_params_": [[58.54299074209159, 0.18280334525024888, 0.5377894408770771], [60.98060878394405, 0.1498278346036055, 0.9639291212545212], [68.51481371433657, 0.2715489283379049, 0.5234190094128123], [75.54796540086404, 0.1705966701624262, 11.999999999999998]], "r_squared_": 0.9624281445072201, "error_": 0.053325665721381955}
{"freq_range": [2.0, 80.0], "freq_res": 1.0, "aperiodic_params_": [0.4250174976323565, 1.0904465381091857], "gaussian_params_": [[13.734223781046415, 0.1632083821978403, 0.6054758288332193], [20.779681877886016, 0.14130970782773306, 2.046550264756566], [26.285695422170065, 0.199333753359641, 0.5270913522959104], [45.40988723090835, 0.33230961874125453, 0.3429076861968721], [57.470485058240705, 1.0394898214127422, 0.25373514424144744], [64.99950545953634, 0.0807697906736866, 2.57279263380855], [73.67330228821358, 0.14463989542763014, 0.9036555886237235], [77.54796540086404, 0.2843805757078009, 5.940123634787766]], "peak_params_": [[13.734223781046415, 0.14880346602910055, 1.2109516576664385], [20.779681877886016, 0.14049323838811234, 4.093100529513132], [26.285695422170065, 0.1775631533325822, 1.0541827045918208], [45.40988723090835, 0.16266012222281545, 0.6858153723937442], [57.470485058240705, 0.18766521840710704, 0.5074702884828949], [64.99950545953634, 0.11131412811066266, 5.1455852676171], [73.67330228821358, 0.3735879658330936, 1.807311177247447], [77.54796540086404, 0.28356009675801674, 11.880247269575532]], "r_squared_": 0.9620756463561201, "error_": 0.05061871182456715}
{"freq_range": [2.0, 80.0], "freq_res": 1.0, "aperiodic_params_": [0.4578650709733915, 1.093004869358176], "gaussian_params_": [[35.008739014366085, 0.1208773605157434, 0.2500018062597544], [47.612649324777394, 0.5018759383844756, 0.26295038296853257], [53.12653090110193, 0.1681501430958984, 0.7415506005181125], [61.59004322714816, 0.12411430659114069, 2.3070891115720773], [68.54065848538302, 0.5987984535805898, 0.2947934482812198], [78.44361472554037, 0.13617558373238892, 5.999999999999999]], "peak_params_": [[35.008739014366085, 0.12080353254650444, 0.5000036125195088], [47.612649324777394, 0.16958458455112435, 0.5259007659370651], [53.12653090110193, 0.1658582013638692, 1.483101201036225], [61.59004322714816, 0.12535535393257735, 4.614178223144155], [68.54065848538302, 0.2180286331243111, 0.5895868965624396], [78.44361472554037, 0.1358038899701406, 11.999999999999998]], "r_squared_": 0.9761126740924102, "error_": 0.042586611489584855}
{"freq_range": [2.0, 80.0], "freq_res": 1.0, "aperiodic_params_": [0.25992018802278843, 0.883513200109307], "gaussian_params_": [[2.0000524816207443, 0.39624367679538924, 0.5168065460685666], [3.6353946003355673, 0.19013083317395132, 2.6001005982348593], [22.220160106006556, 0.18507430790302015, 2.3140489590361724], [39.66750159024245, 0.15215941371542202, 0.589877635387743], [55.773696773919646, 0.07892796929140046, 4.779780089959167], [58.402688664552414, 0.23215026093177185, 0.2775526106419808], [67.47544171492592, 0.19653487095031485, 0.8072948247616659], [73.42818927581973, 0.7141522811191766, 0.25106594469858895], [79.54796540086404, 0.18468681652573313, 2.6019605711550775]], "peak_params_": [[2.0000524816207443, 0.5522518707234516, 1.0336130921371331], [3.6353946003355673, 0.18849250996568434, 5.200201196469719], [22.220160106006556, 0.18423857809691624, 4.628097918072345], [39.66750159024245, 0.1301497874134716, 1.179755270775486], [55.773696773919646, 0.07883955484502914, 9.559560179918334], [58.402688664552414, 0.15185046856402318, 0.5551052212839616], [67.47544171492592, 0.17024946051099077, 1.6145896495233318], [73.42818927581973, 0.17469737922202522, 0.5021318893971779], [79.54796540086404, 0.18192087931383205, 5.203921142310155]], "r_squared_": 0.9845206433714545, "error_": 0.032457710766577635}
{"freq_range": [2.0, 80.0], "freq_res": 1.0, "aperiodic_params_": [0.4976313106340929, 0.9265410049776055], "gaussian_params_": [[63.95906009449748, 0.20938632502940416, 0.6352312598894372], [68.3185486229745, 0.20154668513591872, 0.9478844417434642], [72.54033155308666, 0.6062813404790848, 0.28469823087259116], [77.54796540086404, 0.2873862118656708, 3.103986324464229]], "peak_params_": [[63.95906009449748, 0.20897915832165137, 1.2704625197788744], [68.3185486229745, 0.19301500266282035, 1.8957688834869284], [72.54033155308666, 0.2629057009953022, 0.5693964617451823], [77.54796540086404, 0.2843548409980674, 6.207972648928458]], "r_squared_": 0.9243458480660509, "error_": 0.06500568038208226}
{"freq_range": [2.0, 80.0], "freq_res": 1.0, "aperiodic_params_": [0.29754239153838413, 0.9992084554928703], "gaussian_params_": [[48.82890618789619, 0.3689519912813841, 1.6562587401644568], [67.83998129568256, 0.2810054806455088, 0.951950693126311]], "peak_params_": [[48.82890618789619, 0.36698865808612147, 3.3125174803289137], [67.83998129568256, 0.2770633308097259, 1.903901386252622]], "r_squared_": 0.8341204472283025, "error_": 0.10338900093134384}
{"freq_range": [2.0, 80.0], "freq_res": 1.0, "aperiodic_params_": [0.4568516868388491, 1.050248697323253], "gaussian_params_": [[13.066690340737521, 0.1231141603642668, 0.25014353557546587], [18.31244738878619, 0.12615821069637753, 0.6462447141401734], [24.010004393069984, 0.10500466893457294, 1.9014393915540921], [35.00076001533871, 0.11849361010779129, 0.2500000040621649], [37.41556976667178, 0.377207945502061, 0.2732965882549064], [47.57453909413721, 0.5087513309481698, 0.2772389415795035], [52.93674417831123, 0.14918237019285022, 0.8125348139945819], [60.91988632073893, 0.21712716447586844, 0.6792192009240795], [64.51995875325358, 0.2084945215929073, 0.652703774815758], [68.56571848869659, 0.5120095621355681, 0.29076140112577975], [75.6314272194618, 0.19503383033636038, 0.7974073770732315]], "peak_params_": [[13.066690340737521, 0.11881552897283454, 0.5002870711509317], [18.31244738878619, 0.11295316483301399, 1.2924894282803467], [24.010004393069984, 0.10500321551123837, 3.8028787831081843], [35.00076001533871, 0.11849306840087337, 0.5000000081243298], [37.41556976667178, 0.11871342505510207, 0.5465931765098128], [47.57453909413721, 0.15671130388408128, 0.554477883159007], [52.93674417831123, 0.14873098563523857, 1.6250696279891639], [60.91988632073893, 0.21562215618969982, 1.358438401848159], [64.51995875325358, 0.15908805888959487, 1.305407549631516], [68.56571848869659, 0.16782493279880017, 0.5815228022515595], [75.6314272194618, 0.17527430147020562, 1.594814754146463]], "r_squared_": 0.9815639089505512, "error_": 0.036145878266555256}
{"freq_range": [2.0, 80.0], "freq_res": 1.0, "aperiodic_params_": [0.13235509742759835, 0.8234653544663746], "gaussian_params_": [[2.0000000000000004, 0.42434637972142775, 2.495911731172941], [23.555244979647245, 0.17096465037072367, 1.740682979805139], [53.24785922347081, 0.27340124789359316, 1.0912185436904025], [62.028549525701926, 0.16004305342008715, 0.6074924375466098], [66.28338091196437, 0.287464726308745, 1.0164638837783981], [68.4170887143347, 0.9694994764529934, 0.28558832209828444]], "peak_params_": [[2.0000000000000004, 0.42434637972142775, 4.991823462345882], [23.555244979647245, 0.1654741754624628, 3.481365959610278], [53.24785922347081, 0.26643870880035636, 2.182437087380805], [62.028549525701926, 0.15990645863438546, 1.2149848750932195], [66.28338091196437, 0.27650750693603277, 2.0329277675567963], [68.4170887143347, 0.4027900339163304, 0.5711766441965689]], "r_squared_": 0.9235903170351958, "error_": 0.06506909585194369}
{"freq_range": [2.0, 80.0], "freq_res": 1.0, "aperiodic_params_": [0.6946491126834571, 1.2210862938004996], "gaussian_params_": [[18.581999106963814, 0.4212339834289194, 0.2782300195773235], [21.570731935764943, 0.4592183879315137, 0.30259652151435495], [24.020053405979137, 0.19417176152370064, 1.4037091590404427], [45.09658064050966, 0.13619021674324266, 0.25004896378245267], [51.71266226180556, 0.12015321252767942, 3.8333536696868022], [67.65499241804467, 0.30724113695533595, 1.2973723201661593], [72.8140798456419, 0.20087374931724358, 0.7420703117921874]], "peak_params_": [[18.581999106963814, 0.1365958591176114, 0.556460039154647], [21.570731935764943, 0.23682888173256667, 0.6051930430287099], [24.020053405979137, 0.19415194826412185, 2.8074183180808854], [45.09658064050966, 0.15233503621406852, 0.5000979275649053], [51.71266226180556, 0.11981614022985032, 7.6667073393736045], [67.65499241804467, 0.29658170874005063, 2.5947446403323187], [72.8140798456419, 0.19473045820621215, 1.4841406235843748]], "r_squared_": 0.9567766769402062, "error_": 0.05601380487689354}
{"freq_range": [2.0, 80.0], "freq_res": 1.0, "aperiodic_params_": [0.9650523197842105, 1.4773741121098682], "gaussian_params_": [[10.590238468577358, 0.4790054245385676, 0.2625899615081341], [22.321756570274577, 0.2433532445881472, 2.47135672186577], [22.87415494912443, 0.02031671259251307, 0.500527904674073], [26.31644463289668, 0.26228935482853954, 0.2500077491430931], [27.810058893742056, 0.15301618450897012, 0.534981666032033], [47.54796540086405, 0.06714064511815403, 2.5875923028644827], [67.92521040821903, 0.32316606036370454, 1.2835449004414214], [72.9006896120878, 0.2696016753468609, 0.8281597872021723], [79.54796540086404, 0.5337057617516263, 2.1547820430513864]], "peak_params_": [[10.590238468577358, 0.14177473240597105, 0.5251799230162681], [22.321756570274577, 0.2457205010559269, 4.94271344373154], [22.87415494912443, 0.25404379033588165, 1.001055809348146], [26.31644463289668, 0.19862329237627807, 0.5000154982861862], [27.810058893742056, 0.16104369900785365, 1.069963332064066], [47.54796540086405, 0.06612393308204911, 5.175184605728965], [67.92521040821903, 0.3226182417012302, 2.567089800882843], [72.9006896120878, 0.2730738793568974, 1.6563195744043446], [79.54796540086404, 0.5220902284703557, 4.309564086102773]], "r_squared_": 0.9848322050460653, "error_": 0.04882103785160516}
{"freq_range": [2.0, 80.0], "freq_res": 1.0, "aperiodic_params_": [1.1670358259743963, 1.5015141875052502], "gaussian_params_": [[7.821062264957947, 0.15788922879915115, 0.25072230432406706], [19.02100959250304, 0.08244401500170648, 0.2500798858248538], [21.319285647823754, 0.3028168528903409, 0.25157962824843916], [22.466283310476342, 0.5268944173565238, 0.2652173667609273], [24.150744138803766, 0.10197054576417196, 5.04344589768307], [48.328235538391716, 0.2424127008576075, 0.40594912631922814], [52.33922776457002, 0.31929196220686584, 0.2518662725992371], [67.95467529474944, 0.1446659557289533, 0.7343515512064739], [75.54796540086404, 0.2576488405729951, 5.680986281006606]], "peak_params_": [[7.821062264957947, 0.12299548560054283, 0.5014446086481341], [19.02100959250304, 0.14268623664583935, 0.5001597716497076], [21.319285647823754, 0.21923354444163567, 0.5031592564968783], [22.466283310476342, 0.21323342351048757, 0.5304347335218546], [24.150744138803766, 0.10192503660960806, 10.08689179536614], [48.328235538391716, 0.17482300710610188, 0.8118982526384563], [52.33922776457002, 0.128955325911434, 0.5037325451984742], [67.95467529474944, 0.25097752265348916, 1.4687031024129478], [75.54796540086404, 0.25683449857161955, 11.361972562013213]], "r_squared_": 0.9806645599980097, "error_": 0.05137919935257121}
{"freq_range": [2.0, 80.0], "freq_res": 1.0, "aperiodic_params_": [0.5580316712796352, 1.1328714914290776], "gaussian_params_": [[3.4520345991359433, 0.24822881685294818, 2.600594002909149], [22.473285836973247, 0.22300385253981472, 3.33264671960704], [47.740729062094424, 0.15809416741387136, 1.7705242669313002], [57.03019391464358, 0.18065058593400074, 0.5878484464804523], [73.0959308017281, 0.4030948380388052, 5.999999999999999]], "peak_params_": [[3.4520345991359433, 0.24450710109280677, 5.201188005818298], [22.473285836973247, 0.22076635313213644, 6.66529343921408], [47.740729062094424, 0.15647219151589287, 3.5410485338626003], [57.03019391464358, 0.1914452071677224, 1.1756968929609046], [73.0959308017281, 0.4030433195478067, 11.999999999999998]], "r_squared_": 0.9437886811715682, "error_": 0.06883288433631267}
{"freq_range": [2.0, 80.0], "freq_res": 1.0, "aperiodic_params_": [0.5278520739632762, 1.1060073640009356], "gaussian_params_": [[3.4520345991359433, 0.2638234312894644, 2.5263027914159535], [22.502352687416217, 0.2076645682453578, 3.4147936684019395], [47.53696780521712, 0.14205731204130537, 1.569138256808219], [57.01490343327121, 0.17592521601804836, 0.4604514889145597], [73.0959308017281, 0.39630458294709575, 5.977057799861237]], "peak_params_": [[3.4520345991359433, 0.25963373404955736, 5.052605582831907], [22.502352687416217, 0.2054710414250358, 6.829587336803879], [47.53696780521712, 0.13606397802837744, 3.138276513616438], [57.01490343327121, 0.18638373913081252, 0.9209029778291195], [73.0959308017281, 0.39625354274705105, 11.954115599722474]], "r_squared_": 0.9401598089684867, "error_": 0.07089573513355234}
{"freq_range": [2.0, 80.0], "freq_res": 1.0, "aperiodic_params_": [0.418496180961752, 0.9147071031283064], "gaussian_params_": [[48.07661662772609, 0.161303753927729, 0.5941513965904758], [61.32752847175598, 0.42906792676352623, 0.2725626832437878], [67.24012745912543, 0.2756767576236551, 0.978918071839202], [68.6046074501766, 0.298582649317848, 0.2999842767729954], [75.73164248999423, 0.6330549534810815, 4.538864907566176]], "peak_params_": [[48.07661662772609, 0.1599682027741024, 1.1883027931809516], [61.32752847175598, 0.21169854328582138, 0.5451253664875756], [67.24012745912543, 0.36700573117765445, 1.957836143678404], [68.6046074501766, 0.3908052082399376, 0.5999685535459908], [75.73164248999423, 0.6319494377554232, 9.077729815132352]], "r_squared_": 0.9089929576280218, "error_": 0.06704517438070755}
{"freq_range": [2.0, 80.0], "freq_res": 1.0, "aperiodic_params_": [-0.06104571899414212, 0.6821151918942243], "gaussian_params_": [[2.4520345991359433, 0.3782821526400748, 2.0550050302329628], [21.840419339559915, 0.11416022171481674, 1.2149130472209564], [27.91334223056689, 0.19850706182499897, 0.3949296367496052], [48.37856112021011, 0.1440038277825442, 1.7765742388440924], [57.24348130156784, 0.27242674692312957, 0.8257897419487428], [64.30962394297146, 0.1244661413195801, 1.539906806539443], [71.52618782643508, 0.3323808632379195, 1.4272150205958622], [75.70012395190462, 0.2990679508259131, 0.6682980110042704]], "peak_params_": [[2.4520345991359433, 0.36924023376361415, 4.1100100604659255], [21.840419339559915, 0.1131796417077463, 2.4298260944419128], [27.91334223056689, 0.19378559511493076, 0.7898592734992104], [48.37856112021011, 0.1407713997898643, 3.5531484776881848], [57.24348130156784, 0.26084147699268934, 1.6515794838974855], [64.30962394297146, 0.12197575697008278, 3.079813613078886], [71.52618782643508, 0.3145605603482604, 2.8544300411917245], [75.70012395190462, 0.27286893705411064, 1.3365960220085409]], "r_squared_": 0.9087922432262007, "error_": 0.05490720162343889}
{"freq_range": [2.0, 80.0], "freq_res": 1.0, "aperiodic_params_": [-0.05131724506123798, 0.8560549252341513], "gaussian_params_": [[4.452034599135944, 0.23626129733713805, 3.161709169373834], [14.945051094276867, 0.14156482889640842, 0.2500000530480836], [23.609946687827215, 0.5026804606065117, 0.2647807713783244], [47.16472486035235, 0.11060678717879086, 2.7753932092267624], [47.99724521373971, 0.12144957395508024, 0.2510875424635472], [50.38447650702275, 0.19449228417650957, 0.6002378937350418], [53.46493291771981, 0.1624035698282159, 1.3965016240114447], [61.01787700285097, 0.10703808140891742, 0.250009254885471], [63.07573877008887, 0.13904391299407864, 2.1066849520070137], [73.1971198157845, 0.2612433391929296, 0.9776198584775758], [77.42339777610447, 0.6210375326476767, 0.2902083475450675], [78.8824191401294, 0.13515117665205234, 0.5724005014186563]], "peak_params_": [[4.452034599135944, 0.23385890100448203, 6.323418338747668], [14.945051094276867, 0.13909109265101638, 0.5000001060961672], [23.609946687827215, 0.16985012535833466, 0.5295615427566488], [47.16472486035235, 0.110461379422923, 5.550786418453525], [47.99724521373971, 0.22730122301972777, 0.5021750849270944], [50.38447650702275, 0.23153713706152823, 1.2004757874700835], [53.46493291771981, 0.16579461105300553, 2.7930032480228895], [61.01787700285097, 0.1923384471120555, 0.500018509770942], [63.07573877008887, 0.13895409294523065, 4.213369904014027], [73.1971198157845, 0.2559885560593249, 1.9552397169551516], [77.42339777610447, 0.2149887272865929, 0.580416695090135], [78.8824191401294, 0.13232986176691663, 1.1448010028373126]], "r_squared_": 0.9673016555002175, "error_": 0.03965631120678815}
{"freq_range": [2.0, 80.0], "freq_res": 1.0, "aperiodic_params_": [0.3308359913373293, 1.0604085167393544], "gaussian_params_": [[22.070760712938558, 0.1354447963512177, 0.7176918284620751], [45.468547367752535, 0.7006391500340291, 0.26962478407194257], [47.67035355575924, 0.29384757904711206, 0.26641968402529154], [53.161175245565026, 0.04853746978586695, 0.8477202903480551], [53.21259363332227, 0.15951487003667497, 2.0801438867225204], [58.47991178247557, 0.5688303227932566, 0.2871744160515], [60.65830215457464, 0.4220826144665462, 0.25610810373743087], [68.37485740308561, 0.255623644881256, 1.266046031602948], [73.28818777042922, 0.18280547769815156, 0.7064276676360071]], "peak_params_": [[22.070760712938558, 0.13478806807559673, 1.4353836569241503], [45.468547367752535, 0.15485447644411487, 0.5392495681438851], [47.67035355575924, 0.143577731864573, 0.5328393680505831], [53.161175245565026, 0.20635203453603834, 1.6954405806961101], [53.21259363332227, 0.20635203453603834, 4.160287773445041], [58.47991178247557, 0.1520695202613509, 0.574348832103], [60.65830215457464, 0.17346868709960672, 0.5122162074748617], [68.37485740308561, 0.244660864152781, 2.532092063205896], [73.28818777042922, 0.16853283613993808, 1.4128553352720141]], "r_squared_": 0.9302135524942106, "error_": 0.06108518556254549}
{"freq_range": [2.0, 80.0], "freq_res": 1.0, "aperiodic_params_": [0.5132542016108533, 1.1825990737088985], "gaussian_params_": [[3.4520345991359433, 0.18543173733481663, 2.9476894530160744], [22.76082425746894, 0.17185764694848926, 3.8248038346797744], [26.006053050120027, 0.13646329322530462, 0.25025303837966184], [52.54796540086388, 0.07706286941157382, 5.495781814211542], [66.47068359216009, 0.20936995195693692, 1.006617395547689], [68.45306554936678, 0.484947419390321, 0.5234948520363721], [73.04142101647716, 0.23409971486380213, 0.6865513754748515]], "peak_params_": [[3.4520345991359433, 0.18326439203231024, 5.895378906032149], [22.76082425746894, 0.17152200398802653, 7.649607669359549], [26.006053050120027, 0.25649199941652534, 0.5005060767593237], [52.54796540086388, 0.07680263468603843, 10.991563628423084], [66.47068359216009, 0.19155019182923994, 2.013234791095378], [68.45306554936678, 0.4009657012144332, 1.0469897040727443], [73.04142101647716, 0.23374983531971671, 1.373102750949703]], "r_squared_": 0.9488150365165898, "error_": 0.062478555476924005}
{"freq_range": [2.0, 80.0], "freq_res": 1.0, "aperiodic_params_": [1.102299780681227, 1.5243546517467286], "gaussian_params_": [[23.48963217903332, 0.2247292685813, 3.977755213878404], [28.72900349568092, 0.05330857379613474, 2.5641401191648225], [49.99452603396107, 0.17592509737764275, 0.250054865047678], [68.19001849050622, 0.32546756130087534, 1.2275807188428176], [72.61215947437542, 0.24805637891272286, 0.5833591693311415], [78.54796540086404, 0.41659705180078715, 2.3268031382915835]], "peak_params_": [[23.48963217903332, 0.22742654694544273, 7.955510427756808], [28.72900349568092, 0.13910003382760683, 5.128280238329645], [49.99452603396107, 0.1758829491971683, 0.500109730095356], [68.19001849050622, 0.32160604400635306, 2.455161437685635], [72.61215947437542, 0.22329698774299978, 1.166718338662283], [78.54796540086404, 0.40880917745245227, 4.653606276583167]], "r_squared_": 0.9835245419856318, "error_": 0.0522792652457563}
{"freq_range": [2.0, 80.0], "freq_res": 1.0, "aperiodic_params_": [1.0118362005548538, 1.4910795921570104], "gaussian_params_": [[18.452034599135946, 0.10656270804098678, 5.999999999999999], [21.956330059211187, 0.2605403525590581, 1.1612038620398533], [26.877787782396457, 0.2347374798646747, 2.2969050378027407], [67.97944976262575, 0.37988024049815206, 1.2190527568350575]], "peak_params_": [[18.452034599135946, 0.10718009797725825, 11.999999999999998], [21.956330059211187, 0.37444572616444793, 2.3224077240797065], [26.877787782396457, 0.2730514719036109, 4.593810075605481], [67.97944976262575, 0.37982626774916883, 2.438105513670115]], "r_squared_": 0.9295407230672981, "error_": 0.10526101801933979}
{"freq_range": [2.0, 80.0], "freq_res": 1.0, "aperiodic_params_": [1.0180052970493367, 1.5354839122740809], "gaussian_params_": [[21.851548748581727, 0.2849206837728765, 3.705807020493766], [27.877792280604577, 0.1584462821595066, 1.5309511365638204], [48.45970691268499, 0.23029014910309936, 1.7688847388336857], [50.00569537403066, 0.1066929986520506, 0.2504931088291515], [70.54796540086404, 0.40752093317610405, 5.999999999999999]], "peak_params_": [[21.851548748581727, 0.2847919511684214, 7.411614040987532], [27.877792280604577, 0.22988272740469018, 3.061902273127641], [48.45970691268499, 0.22299259357468504, 3.5377694776673714], [50.00569537403066, 0.26544761397131733, 0.500986217658303], [70.54796540086404, 0.40636603242319413, 11.999999999999998]], "r_squared_": 0.8975760652132058, "error_": 0.1087780415443322}
{"freq_range": [2.0, 80.0], "freq_res": 1.0, "aperiodic_params_": [0.7146750219083415, 1.273610721868515], "gaussian_params_": [[21.872918627089724, 0.25382430682340745, 4.433207203575045], [48.412335155189815, 0.45625068897699983, 1.5445689667482887], [57.30899679947929, 0.3935930159597808, 0.5886671421906996], [67.73961578481376, 0.2644057694043255, 0.7326718891516567], [77.54796229453912, 0.8034286934402877, 5.2219014299083755]], "peak_params_": [[21.872918627089724, 0.2537200410584395, 8.86641440715009], [48.412335155189815, 0.44027931336249093, 3.0891379334965774], [57.30899679947929, 0.3432879566702909, 1.1773342843813992], [67.73961578481376, 0.39922490062810967, 1.4653437783033134], [77.54796229453912, 0.8004240290468592, 10.443802859816751]], "r_squared_": 0.9463044847273511, "error_": 0.07822396191894278}
{"freq_range": [2.0, 80.0], "freq_res": 1.0, "aperiodic_params_": [0.11375057323707861, 0.7902698260137577], "gaussian_params_": [[41.58663787311695, 0.7028793401425047, 0.3061246409808151], [48.09399565594323, 0.46490066767236676, 1.6150064368607213], [53.92444328426952, 0.2755050284795384, 0.548687812587332], [57.4058498726088, 1.1857149029271046, 0.3366814093691688], [61.33419191285584, 0.5904991734121027, 0.7252943967170389], [63.486608649495594, 1.1195417769588192, 0.3166570015197765], [67.9344729728742, 0.3059597741316585, 0.8610159941999401], [75.83555063972105, 0.75122100974693, 4.471996412698336]], "peak_params_": [[41.58663787311695, 0.282831901720191, 0.6122492819616302], [48.09399565594323, 0.4641139337222586, 3.2300128737214426], [53.92444328426952, 0.27349017722624536, 1.097375625174664], [57.4058498726088, 0.5734900024905241, 0.6733628187383376], [61.33419191285584, 0.5340899773974604, 1.4505887934340778], [63.486608649495594, 0.39821904225238236, 0.633314003039553], [67.9344729728742, 0.4669311316242786, 1.7220319883998803], [75.83555063972105, 0.750713256859572, 8.943992825396672]], "r_squared_": 0.866103607824937, "error_": 0.08606123059286135}
{"freq_range": [2.0, 80.0], "freq_res": 1.0, "aperiodic_params_": [-0.12790845959540326, 0.6891904628466754], "gaussian_params_": [[2.0000000000000004, 0.5635339206450869, 1.221652961684565], [41.1620273148427, 0.17624896146992375, 0.5597148953184171], [46.49446851437942, 0.18667199760338438, 1.1308674809890937], [48.50104999664584, 0.5765423602947268, 0.2652626375753834], [49.594990954901064, 0.6549834677989563, 0.2689899041563784], [51.85320624678738, 0.16462308123461872, 1.1179934758782717], [60.65138691022732, 0.1674144920964415, 0.6741865391290224], [69.41714778068372, 0.19157303312367874, 3.0636644889442137], [72.53917182990915, 0.5532418586763784, 0.25000000000000006], [78.90941166445418, 0.15898257742684666, 0.5552419153800101]], "peak_params_": [[2.0000000000000004, 0.5635339206450869, 2.44330592336913], [41.1620273148427, 0.16901812116435466, 1.1194297906368342], [46.49446851437942, 0.1696540949278551, 2.2617349619781875], [48.50104999664584, 0.17740754433672312, 0.5305252751507668], [49.594990954901064, 0.25403942189050355, 0.5379798083127568], [51.85320624678738, 0.1632114809239953, 2.2359869517565434], [60.65138691022732, 0.15086245255072472, 1.3483730782580448], [69.41714778068372, 0.18980540661507783, 6.1273289778884275], [72.53917182990915, 0.19786289325282258, 0.5000000000000001], [78.90941166445418, 0.15831884685379616, 1.1104838307600202]], "r_squared_": 0.9613336894420568, "error_": 0.04070211048531597}
{"freq_range": [2.0, 80.0], "freq_res": 1.0, "aperiodic_params_": [0.1984251195329421, 1.0480442965950556], "gaussian_params_": [[19.832494967855897, 0.10436628128304246, 2.070129145630845], [42.94900048481351, 0.18255544462565415, 0.25000004743275195], [52.924184974703664, 0.2534901399435324, 0.4567053148824642], [55.215985550792226, 0.21727901434022953, 0.3849641173472938], [60.621443566703874, 0.18295858869049192, 0.9659424561756866], [68.35845323856037, 0.6537917236940141, 0.26915392090499474], [69.6431981481851, 0.2503833236612841, 0.5520619769699499], [72.41493448370997, 0.2423731448216021, 0.7326970757246493], [74.38129773984988, 0.4081751350594057, 0.3132069724770957], [78.45850968166107, 0.20603695163135063, 1.0767682057788281]], "peak_params_": [[19.832494967855897, 0.10402518233267433, 4.14025829126169], [42.94900048481351, 0.1787961511591878, 0.5000000948655039], [52.924184974703664, 0.25002134038880364, 0.9134106297649284], [55.215985550792226, 0.18564501100118425, 0.7699282346945876], [60.621443566703874, 0.16943435684055697, 1.9318849123513733], [68.35845323856037, 0.2723235930173946, 0.5383078418099895], [69.6431981481851, 0.20424953767499532, 1.1041239539398997], [72.41493448370997, 0.20649125577956728, 1.4653941514492985], [74.38129773984988, 0.21793187402075787, 0.6264139449541914], [78.45850968166107, 0.18817908642116632, 2.1535364115576563]], "r_squared_": 0.9648756232261267, "error_": 0.049098461023142304}
{"freq_range": [2.0, 80.0], "freq_res": 1.0, "aperiodic_params_": [0.26176714881173163, 1.0218022301038252], "gaussian_params_": [[17.77198962834609, 0.14050326667511007, 0.7253789122011426], [45.71269733000652, 0.19897360182938836, 0.6085807658054104], [53.55351474792248, 0.676635479946058, 0.250004795369884], [72.8206089323102, 0.17439959564843613, 0.7371458631881926], [76.79801679296683, 0.19613492620833597, 3.3259720619327466]], "peak_params_": [[17.77198962834609, 0.1337307151870878, 1.4507578244022852], [45.71269733000652, 0.1779921419104864, 1.2171615316108209], [53.55351474792248, 0.13733198329656604, 0.500009590739768], [72.8206089323102, 0.2714980116733312, 1.4742917263763853], [76.79801679296683, 0.19577360289909285, 6.651944123865493]], "r_squared_": 0.9712525534452554, "error_": 0.04367343481969884}
{"freq_range": [2.0, 80.0], "freq_res": 1.0, "aperiodic_params_": [0.7422345140363797, 1.3873012682839454], "gaussian_params_": [[21.52278984128195, 0.6094159578851776, 0.33385465539925724], [23.28386118158336, 0.2726871588983785, 0.526933895309643], [26.081404914372975, 0.3130908133589057, 0.8697400522053369], [28.41592416059686, 0.37536901291735436, 0.3234323501881173], [49.91599110640143, 0.17317974944846481, 0.5927688801223251], [52.276639103527096, 0.4006799744315783, 0.2518494283112332], [57.74574667798584, 0.15636273433667863, 1.423101292337216], [65.65365629188346, 0.3772961196407134, 0.29209174047315095], [68.1604526498226, 0.43854572428022875, 0.8965082398851029], [74.64498282730551, 0.2313244869206305, 1.2659989840939505], [79.0959308017281, 0.4535656436171617, 1.4579607749739705]], "peak_params_": [[21.52278984128195, 0.23342435199369616, 0.6677093107985145], [23.28386118158336, 0.23647971373028032, 1.053867790619286], [26.081404914372975, 0.3117228807361614, 1.7394801044106738], [28.41592416059686, 0.19167289060304893, 0.6468647003762346], [49.91599110640143, 0.17144932177046823, 1.1855377602446502], [52.276639103527096, 0.21958250782611466, 0.5036988566224664], [57.74574667798584, 0.15388700104984387, 2.846202584674432], [65.65365629188346, 0.21084249255004428, 0.5841834809463019], [68.1604526498226, 0.43157814547818973, 1.7930164797702057], [74.64498282730551, 0.23117170572817347, 2.531997968187901], [79.0959308017281, 0.45320805546879583, 2.915921549947941]], "r_squared_": 0.9794459974961717, "error_": 0.04702889618668908}
{"freq_range": [2.0, 80.0], "freq_res": 1.0, "aperiodic_params_": [0.9891966138780597, 1.5150917762129041], "gaussian_params_": [[15.625284565140342, 0.12102549208934611, 3.544674382452293], [21.582869274425576, 0.2418150263007098, 0.740799579617337], [23.429760063350386, 0.5636117812723148, 0.32636337863971737], [25.5112513851783, 1.2761826485290224, 0.28509993080646895], [28.178666669699993, 0.2782478733780652, 1.0032499958178565], [67.68295146583522, 0.4300181747858286, 0.5572348532290539], [69.54697613125063, 0.9865600378774615, 0.25456759740234874], [78.54796540086404, 0.459978048552186, 3.2685308308749423]], "peak_params_": [[15.625284565140342, 0.12035114330392882, 7.089348764904586], [21.582869274425576, 0.23042268372454822, 1.481599159234674], [23.429760063350386, 0.2895345629603847, 0.6527267572794347], [25.5112513851783, 0.32159252109871217, 0.5701998616129379], [28.178666669699993, 0.2741434513783554, 2.006499991635713], [67.68295146583522, 0.36827500262651114, 1.1144697064581077], [69.54697613125063, 0.2176327118713104, 0.5091351948046975], [78.54796540086404, 0.45560010353859903, 6.537061661749885]], "r_squared_": 0.9835560410632405, "error_": 0.05014208823081292}
{"freq_range": [2.0, 80.0], "freq_res": 1.0, "aperiodic_params_": [1.0117827442704712, 1.4740885711418104], "gaussian_params_": [[13.951801918616475, 0.11399423981637626, 1.1677325299395984], [24.648461920831807, 0.3186898829872795, 4.160678593787095], [67.54617708073175, 0.9612663300708063, 0.30824309748655704], [69.64837749526264, 0.3679423114925347, 0.4504764339562214]], "peak_params_": [[13.951801918616475, 0.1259486582486965, 2.335465059879197], [24.648461920831807, 0.3175544020286625, 8.32135718757419], [67.54617708073175, 0.32565320372820716, 0.6164861949731141], [69.64837749526264, 0.2713180093028036, 0.9009528679124428]], "r_squared_": 0.9387214478924433, "error_": 0.0935711116711277}
{"freq_range": [2.0, 80.0], "freq_res": 1.0, "aperiodic_params_": [0.9566048261870184, 1.5085425149894756], "gaussian_params_": [[21.88054168551132, 0.2744609662682061, 4.129511658494331], [28.110632547152957, 0.14707848841567991, 1.984015093426736], [48.20066227318601, 0.2694240782746537, 1.6171744028890411], [50.05198323376173, 0.1498539673489401, 0.2513546551484156], [57.49122634462274, 0.7385012172172676, 0.2902598135008877], [70.54796540086404, 0.3671405953177529, 5.999999999999999]], "peak_params_": [[21.88054168551132, 0.27562757920701864, 8.259023316988662], [28.110632547152957, 0.23839389782690812, 3.968030186853472], [48.20066227318601, 0.26767286333260776, 3.2343488057780823], [50.05198323376173, 0.29280778728450785, 0.5027093102968312], [57.49122634462274, 0.20505526304673127, 0.5805196270017754], [70.54796540086404, 0.36610013109754314, 11.999999999999998]], "r_squared_": 0.8914528025587563, "error_": 0.10348579861554358}
{"freq_range": [2.0, 80.0], "freq_res": 1.0, "aperiodic_params_": [0.48456248283288944, 1.063917197465884], "gaussian_params_": [[21.305202973086427, 0.2533526614369273, 4.92286617503394], [48.194151121730975, 0.4780154496741741, 1.383248004863521], [57.42261610956513, 0.39853061513693633, 0.6902139405871549]], "peak_params_": [[21.305202973086427, 0.2528662321833073, 9.84573235006788], [48.194151121730975, 0.47333007035705343, 2.766496009727042], [57.42261610956513, 0.33040869300160103, 1.3804278811743098]], "r_squared_": 0.7236102749522652, "error_": 0.1661721776741544}
{"freq_range": [2.0, 80.0], "freq_res": 1.0, "aperiodic_params_": [0.08764938587187747, 0.7027579837745714], "gaussian_params_": [[42.295748216376666, 0.4865383174606678, 0.7215949374006272], [48.27633478016599, 0.5290894642927997, 1.2931588577032285], [56.81635005103103, 0.5621703433851865, 0.8201228283930225], [64.78058103817722, 0.4551158519540372, 0.9359535058369027]], "peak_params_": [[42.295748216376666, 0.4473470907413888, 1.4431898748012544], [48.27633478016599, 0.5171463369758579, 2.586317715406457], [56.81635005103103, 0.5482506793085095, 1.640245656786045], [64.78058103817722, 0.44277974057951774, 1.8719070116738055]], "r_squared_": 0.5436013276831846, "error_": 0.14239598081173013}
{"freq_range": [2.0, 80.0], "freq_res": 1.0, "aperiodic_params_": [-0.05326986034693929, 0.8448260400894534], "gaussian_params_": [[47.91424031499709, 0.3013296910839778, 1.27373239880016], [55.29025261043993, 0.32859076337741483, 0.835802817693731], [57.78082355254181, 0.3115131300887803, 0.771916534101083], [61.66394398204785, 0.23140993392130504, 1.2544965672724215], [74.54796540086404, 0.17100872924519683, 5.428222147751263]], "peak_params_": [[47.91424031499709, 0.30064855669670343, 2.54746479760032], [55.29025261043993, 0.310097372722433, 1.671605635387462], [57.78082355254181, 0.3058123107273025, 1.543833068202166], [61.66394398204785, 0.2350758226830454, 2.508993134544843], [74.54796540086404, 0.17041680830408623, 10.856444295502525]], "r_squared_": 0.8785664416042039, "error_": 0.06810569828977632}
{"freq_range": [2.0, 80.0], "freq_res": 1.0, "aperiodic_params_": [-0.3943635186591532, 0.6009592800031325], "gaussian_params_": [[11.642872814272822, 0.35008685755400576, 0.25002582571325466], [15.906712173105264, 0.1349855692631854, 0.3531514259627048], [18.236692519763476, 0.13586213810922654, 0.8183597251727472], [20.67438896590924, 0.19322480547240073, 0.7657052645790026], [37.18865701718366, 0.1357009395493727, 1.149885040240654], [41.42664156520459, 0.23201464686920695, 0.6185067748026424], [43.39141840083211, 0.38645943081856693, 0.3812053132265076], [45.63329523434206, 0.23342930618989638, 0.26318446194302053], [51.99041721486101, 0.13371077640275222, 3.500246527291811], [55.59492863147826, 0.40548634581482346, 0.25682669209516584], [59.62507043126118, 0.12747093066504198, 2.026946588913304], [66.73502374520471, 0.12851903642496568, 1.0465755856393713], [72.43059833976912, 0.12750509357373083, 5.862051348624988]], "peak_params_": [[11.642872814272822, 0.12622593610006294, 0.5000516514265093], [15.906712173105264, 0.1336005308340129, 0.7063028519254096], [18.236692519763476, 0.130730302561485, 1.6367194503454945], [20.67438896590924, 0.17697494139852377, 1.5314105291580051], [37.18865701718366, 0.13390071401670922, 2.299770080481308], [41.42664156520459, 0.18441681685296385, 1.2370135496052848], [43.39141840083211, 0.24218827022374811, 0.7624106264530152], [45.63329523434206, 0.11934588734571316, 0.5263689238860411], [51.99041721486101, 0.13411171459752036, 7.000493054583622], [55.59492863147826, 0.21453869074989473, 0.5136533841903317], [59.62507043126118, 0.1485232118165789, 4.053893177826608], [66.73502374520471, 0.20766616578126507, 2.0931511712787425], [72.43059833976912, 0.12716199179581955, 11.724102697249975]], "r_squared_": 0.81442578630783, "error_": 0.06485305499922675}
{"freq_range": [2.0, 80.0], "freq_res": 1.0, "aperiodic_params_": [0.2232445225119831, 1.0456023512443275], "gaussian_params_": [[11.451173548478994, 1.0194214038654508, 0.25092003943121743], [16.547781368415574, 0.09584867378032043, 5.999999999999999], [45.0796825082463, 0.18234043176110606, 0.25000088852440944], [55.452034614962656, 0.10809589139907014, 5.925270649678901], [68.32919854939387, 0.16624283018669894, 1.2060465504926086], [78.54796540086404, 0.2441870342822996, 4.828039470730682]], "peak_params_": [[11.451173548478994, 0.2649496676140778, 0.5018400788624349], [16.547781368415574, 0.09557682100357134, 11.999999999999998], [45.0796825082463, 0.1961214902936761, 0.5000017770488189], [55.452034614962656, 0.10778345458796079, 11.850541299357802], [68.32919854939387, 0.1940973680849476, 2.412093100985217], [78.54796540086404, 0.24315930147368192, 9.656078941461365]], "r_squared_": 0.970323712664915, "error_": 0.04991460867438667}
{"freq_range": [2.0, 80.0], "freq_res": 1.0, "aperiodic_params_": [0.6796714355311596, 1.3387047806627383], "gaussian_params_": [[11.433581111207637, 0.7618409633863031, 0.279438081833151], [15.229893201943, 0.20044098560663262, 2.3218367114016343], [22.09156670277254, 0.22403655144141535, 0.9778341857549803], [26.49371049338839, 0.2607341360498948, 2.307923908021274], [49.59797347702451, 0.4900002885559724, 0.2739312461839921], [52.46713128730009, 0.5845356799209704, 0.30385708655593807], [67.76951715417692, 0.2999020143883387, 0.6618208401689295], [73.4575172622938, 0.16095203790460616, 0.28060554283085204], [78.54796540086404, 0.35414557697653976, 3.5942706043896093]], "peak_params_": [[11.433581111207637, 0.2667335947224596, 0.558876163666302], [15.229893201943, 0.1994619336891591, 4.643673422803269], [22.09156670277254, 0.26508375527883044, 1.9556683715099605], [26.49371049338839, 0.25491637295568137, 4.615847816042548], [49.59797347702451, 0.1669099044255744, 0.5478624923679842], [52.46713128730009, 0.179309351925232, 0.6077141731118761], [67.76951715417692, 0.2870320368052237, 1.323641680337859], [73.4575172622938, 0.1502021201220849, 0.5612110856617041], [78.54796540086404, 0.3513558771780345, 7.188541208779219]], "r_squared_": 0.9801775059941559, "error_": 0.050682489226888554}
{"freq_range": [2.0, 80.0], "freq_res": 1.0, "aperiodic_params_": [0.9015887364474479, 1.460151238994239], "gaussian_params_": [[11.334871319046373, 0.19663831838554266, 0.2512869497412723], [14.211676178854313, 0.11876734270345479, 1.5631628017806831], [14.860257506356998, 0.10584761137428704, 5.999999999440217], [21.775609268738847, 0.20074964435151507, 0.8782866821918329], [26.78607506184596, 0.2723747767981567, 2.503213131114252], [67.85379218992016, 0.21253257196188036, 0.8516686679335718], [69.90549791316327, 0.2071761545135902, 0.2500000000116782], [78.54796540086404, 0.4078070009764626, 3.2365329150997084]], "peak_params_": [[11.334871319046373, 0.18136498070404916, 0.5025738994825446], [14.211676178854313, 0.22244921339815782, 3.1263256035613662], [14.860257506356998, 0.2104081273078261, 11.999999998880433], [21.775609268738847, 0.2902356464468725, 1.7565733643836658], [26.78607506184596, 0.28505120350557145, 5.006426262228504], [67.85379218992016, 0.21143777551541465, 1.7033373358671435], [69.90549791316327, 0.21423904403425187, 0.5000000000233564], [78.54796540086404, 0.4038488551460888, 6.473065830199417]], "r_squared_": 0.9828326845998689, "error_": 0.05443862990494764}
{"freq_range": [2.0, 80.0], "freq_res": 1.0, "aperiodic_params_": [1.0184306732298394, 1.4786210283854493], "gaussian_params_": [[12.663338309911671, 0.15859394618451966, 1.5327930418579216], [15.037105664171996, 0.19163698644615612, 0.2500316671245389], [17.148091563238562, 0.14896307509177553, 0.6389436277993297], [21.377090596054554, 0.20739107432136739, 1.1183552270225758], [26.015702036403987, 0.2884671946406334, 2.736989595853733], [47.47467744490879, 0.5754636092721476, 0.30081187485159083], [49.57254306054633, 0.4615480957377977, 0.3171526974970445], [67.5356770063017, 0.7469096314248281, 0.30922532914808937], [69.57652821020179, 0.7914547031119198, 0.2775409567435762]], "peak_params_": [[12.663338309911671, 0.15481785551215071, 3.0655860837158433], [15.037105664171996, 0.23976840994691462, 0.5000633342490778], [17.148091563238562, 0.14928132423649032, 1.2778872555986593], [21.377090596054554, 0.24973954092592365, 2.2367104540451517], [26.015702036403987, 0.2885028445287505, 5.473979191707466], [47.47467744490879, 0.165695765483717, 0.6016237497031817], [49.57254306054633, 0.1861048222861501, 0.634305394994089], [67.5356770063017, 0.24191602009823, 0.6184506582961787], [69.57652821020179, 0.24711181809545057, 0.5550819134871524]], "r_squared_": 0.9516084732606858, "error_": 0.080262190897956}
{"freq_range": [2.0, 80.0], "freq_res": 1.0, "aperiodic_params_": [0.7177819852319227, 1.350509079876534], "gaussian_params_": [[11.420579319936708, 0.22028355972437205, 0.8523051362377437], [21.703924188600727, 0.25829564526466164, 4.9970837571552895], [27.28503583630507, 0.14165873612264604, 1.5501379799709785], [48.72530894851477, 0.24682519426528363, 1.6991765045665688], [67.5237087155469, 1.027944584387061, 0.31415779304642943], [69.97549783722819, 0.32413789173171403, 0.5521962508656622]], "peak_params_": [[11.420579319936708, 0.22108024698512319, 1.7046102724754875], [21.703924188600727, 0.25826643200783483, 9.994167514310579], [27.28503583630507, 0.2865855543511655, 3.100275959941957], [48.72530894851477, 0.2436209508537006, 3.3983530091331375], [67.5237087155469, 0.3262637945960414, 0.6283155860928589], [69.97549783722819, 0.323818952466737, 1.1043925017313243]], "r_squared_": 0.8837722575409199, "error_": 0.11689916571716123}
{"freq_range": [2.0, 80.0], "freq_res": 1.0, "aperiodic_params_": [0.46814905051261757, 1.1417303233780123], "gaussian_params_": [[11.189617936262556, 0.3207783722547365, 0.5229327860384376], [22.437337142636114, 0.2565472933518044, 5.173432953577781], [48.31681748854678, 0.32202247120702876, 1.5119299634174332]], "peak_params_": [[11.189617936262556, 0.32264478855568124, 1.0458655720768752], [22.437337142636114, 0.2556322601348049, 10.346865907155562], [48.31681748854678, 0.31503093014730266, 3.0238599268348665]], "r_squared_": 0.8137458256552782, "error_": 0.1411310420823262}
{"freq_range": [2.0, 80.0], "freq_res": 1.0, "aperiodic_params_": [0.3520909832117772, 1.089362555762946], "gaussian_params_": [[10.969889165533578, 0.2985497229546698, 0.49439804729078535], [16.702754929968908, 0.19076328067333154, 1.5217429755964351], [18.54809210843673, 0.8841441657753564, 0.2615601921923088], [21.69722388176632, 0.24453364298572983, 0.7182957471098749], [32.375457012726876, 0.8429483069199667, 0.25000050677500507], [47.403567803402304, 0.230818613715826, 1.467096842110592], [55.53270847399123, 0.9075222155167528, 0.27059901233338474], [57.52418806973713, 0.37059209423731365, 0.7658392753747975], [61.2031522661885, 0.4134312809668098, 1.0189465842123844], [67.4684366770221, 0.4575284499162526, 0.6766445113221123], [70.21299583321614, 0.48128083913678005, 0.5939072114509145], [78.54796540086404, 0.7722121345987116, 2.2640248429789764]], "peak_params_": [[10.969889165533578, 0.29816671014656115, 0.9887960945815707], [16.702754929968908, 0.1871585497536753, 3.0434859511928702], [18.54809210843673, 0.26001032620656084, 0.5231203843846176], [21.69722388176632, 0.2241922515147613, 1.4365914942197497], [32.375457012726876, 0.27291665637749607, 0.5000010135500101], [47.403567803402304, 0.2222488946879897, 2.934193684221184], [55.53270847399123, 0.25545860698718714, 0.5411980246667695], [57.52418806973713, 0.30850013112574426, 1.531678550749595], [61.2031522661885, 0.40530786230652605, 2.0378931684247688], [67.4684366770221, 0.3600379156398026, 1.3532890226442247], [70.21299583321614, 0.452341748484993, 1.187814422901829], [78.54796540086404, 0.7569727786123163, 4.528049685957953]], "r_squared_": 0.9495192536365938, "error_": 0.057532939312211734}
{"freq_range": [2.0, 80.0], "freq_res": 1.0, "aperiodic_params_": [-0.008988115656220331, 0.9154644504194505], "gaussian_params_": [[3.4520345991359433, 0.3753655429145908, 2.05659295040689], [11.053006847755137, 0.19304978108156762, 0.4706245974129302], [13.983838845973361, 0.15475409253572567, 0.25000025300312906], [16.463385377441426, 0.5890874895591973, 0.2943580748005614], [21.585678506687323, 0.22134841574870026, 0.8082744982095967], [56.65691733966788, 0.32332790865099664, 0.9881287906477597], [63.84516422418939, 0.11950137129047766, 1.2782424540853292], [66.301488590738, 0.2697289103907374, 0.2989822753611393], [76.0959308017281, 0.278055093986957, 5.926343926051463]], "peak_params_": [[3.4520345991359433, 0.36640702167482997, 4.11318590081378], [11.053006847755137, 0.19227535084498648, 0.9412491948258604], [13.983838845973361, 0.15443180677144253, 0.5000005060062581], [16.463385377441426, 0.1706278774613883, 0.5887161496011228], [21.585678506687323, 0.19409711587615086, 1.6165489964191935], [56.65691733966788, 0.30596224440726383, 1.9762575812955194], [63.84516422418939, 0.15326367775133454, 2.5564849081706584], [66.301488590738, 0.25623941334722233, 0.5979645507222786], [76.0959308017281, 0.2780186677040215, 11.852687852102926]], "r_squared_": 0.9639492824896604, "error_": 0.044981439162596476}
{"freq_range": [2.0, 80.0], "freq_res": 1.0, "aperiodic_params_": [-0.43832008837380126, 0.4020930121680144], "gaussian_params_": [[11.505826795100113, 1.1273814935139643, 0.28178482472687616], [13.530206529806737, 1.2697333734425462, 0.28216484612345305], [57.53783213740759, 0.12563433266998725, 5.999999999999999], [74.04048536583302, 0.17388300422479716, 0.7731298181445339], [76.77231268525969, 0.19110677373281906, 0.9246732672777384]], "peak_params_": [[11.505826795100113, 0.24222782817970978, 0.5635696494537523], [13.530206529806737, 0.3175116831885324, 0.5643296922469061], [57.53783213740759, 0.12526217130560857, 11.999999999999998], [74.04048536583302, 0.1786933158700874, 1.5462596362890677], [76.77231268525969, 0.18616670567626903, 1.8493465345554767]], "r_squared_": 0.6987339664233192, "error_": 0.06858934756064614}
{"freq_range": [2.0, 80.0], "freq_res": 1.0, "aperiodic_params_": [0.21387678450052805, 0.9189944005676163], "gaussian_params_": [[11.006671292453126, 0.31640885080815523, 0.45232510983667007], [13.476177322048677, 0.4035559789966142, 1.6534275726458836], [67.58544506238704, 0.6354340150815191, 0.25249954950954917], [76.4733503330002, 0.6231703360378431, 0.26270563432209837], [77.04316680897873, 0.1912197356103664, 5.999999999999999]], "peak_params_": [[11.006671292453126, 0.4478615108103006, 0.9046502196733401], [13.476177322048677, 0.38718185735980665, 3.306855145291767], [67.58544506238704, 0.22651130136301445, 0.5049990990190983], [76.4733503330002, 0.3112707024390269, 0.5254112686441967], [77.04316680897873, 0.2747593978677887, 11.999999999999998]], "r_squared_": 0.9399325244557563, "error_": 0.0683081549461177}
{"freq_range": [2.0, 80.0], "freq_res": 1.0, "aperiodic_params_": [0.7088713999007029, 1.3217441888832677], "gaussian_params_": [[11.382422807469965, 0.8885848734879986, 0.2673378782314673], [14.025034030466845, 0.3596167128566431, 2.1020508267759084], [67.60046359613881, 0.629573223841853, 0.29144311201971945], [69.9512679855218, 0.22783715695030238, 0.2500000265847135], [76.2453297971226, 0.29392103678076403, 2.175591075112728], [79.51967900643402, 1.1557647374349485, 0.30803603828452436]], "peak_params_": [[11.382422807469965, 0.4470968408749735, 0.5346757564629346], [14.025034030466845, 0.35959121112923204, 4.204101653551817], [67.60046359613881, 0.24623359536060785, 0.5828862240394389], [69.9512679855218, 0.22832274928113616, 0.500000053169427], [76.2453297971226, 0.29205823407097187, 4.351182150225456], [79.51967900643402, 0.4089768971713379, 0.6160720765690487]], "r_squared_": 0.9738185820229875, "error_": 0.06254478446517817}
{"freq_range": [2.0, 80.0], "freq_res": 1.0, "aperiodic_params_": [0.8132404987044284, 1.4219722530095837], "gaussian_params_": [[13.5590913218104, 0.32190975984853504, 2.578176200352769], [21.43201521362334, 0.617618096996405, 0.2590088672515737], [24.48968919505123, 0.225565668456859, 3.3648260513249966], [28.45452964312829, 0.38775053689196265, 0.25924328190789775], [67.54030832184101, 1.0579119242019919, 0.2704610855951018], [70.38146697491615, 0.8349332828862803, 0.25213306231647264]], "peak_params_": [[13.5590913218104, 0.31898620324041993, 5.156352400705538], [21.43201521362334, 0.2904118619858287, 0.5180177345031474], [24.48968919505123, 0.22327798815943578, 6.729652102649993], [28.45452964312829, 0.21427534242476431, 0.5184865638157955], [67.54030832184101, 0.24954309533710384, 0.5409221711902036], [70.38146697491615, 0.2658226663409773, 0.5042661246329453]], "r_squared_": 0.9450234648902993, "error_": 0.08686517495162675}
{"freq_range": [2.0, 80.0], "freq_res": 1.0, "aperiodic_params_": [0.7314316046580822, 1.3698775974926791], "gaussian_params_": [[11.62632803249847, 0.30696181443305876, 1.2779111621578485], [14.973346826497945, 0.20723176262242823, 0.5955103023512379], [22.830538749988104, 0.2289701989459063, 4.76837210046686], [67.73799534379556, 0.28582933415680456, 0.7848431470187426], [70.39411278409402, 0.8865049196741284, 0.2857408444621128]], "peak_params_": [[11.62632803249847, 0.3114753964115263, 2.555822324315697], [14.973346826497945, 0.27589038454120407, 1.1910206047024758], [22.830538749988104, 0.22882565084836526, 9.53674420093372], [67.73799534379556, 0.2703381182328013, 1.5696862940374852], [70.39411278409402, 0.34693190489153447, 0.5714816889242256]], "r_squared_": 0.9225040877512601, "error_": 0.09946783641011885}
{"freq_range": [2.0, 80.0], "freq_res": 1.0, "aperiodic_params_": [0.48335077370065016, 1.217541074305214], "gaussian_params_": [[11.409967753242059, 0.5150437688263585, 0.9817109845263751], [14.957221552622537, 0.22077252858017743, 0.5430315597317206], [16.9225351916042, 0.1424631391966032, 0.2503017498873866], [21.488128800924446, 0.1965038857243993, 5.069177032415554], [70.4267909531628, 1.2359633296847006, 0.2769025504570074]], "peak_params_": [[11.409967753242059, 0.4951465973698193, 1.9634219690527501], [14.957221552622537, 0.3073560709270141, 1.0860631194634411], [16.9225351916042, 0.26877370105041676, 0.5006034997747733], [21.488128800924446, 0.1955949592722428, 10.138354064831107], [70.4267909531628, 0.376831172019775, 0.5538051009140148]], "r_squared_": 0.8986199419458485, "error_": 0.1068258070199727}
{"freq_range": [2.0, 80.0], "freq_res": 1.0, "aperiodic_params_": [0.3394516581296051, 1.1041855010050465], "gaussian_params_": [[11.194342596329127, 0.6174316135879876, 0.7358846424629298], [13.130376444014804, 0.2954796018485904, 0.2500373823955627], [14.537530512776218, 0.767131191701668, 0.28328995924524447], [17.540386965193576, 0.19121475259012133, 1.9433602046954654], [21.559484451679886, 0.537880072194445, 0.2975118350835675], [57.66948401837883, 0.12748883928399404, 3.305355976387859], [67.5343999416134, 0.6882828693837925, 0.30575151257784833], [70.27528836604552, 0.4286786979732426, 0.4795981421408481], [79.99999999999999, 0.5027676142072, 3.7108434494594396]], "peak_params_": [[11.194342596329127, 0.5969348736869597, 1.4717692849258597], [13.130376444014804, 0.3008245668968349, 0.5000747647911254], [14.537530512776218, 0.283747959168664, 0.5665799184904889], [17.540386965193576, 0.18594111076711173, 3.886720409390931], [21.559484451679886, 0.19346962561722125, 0.595023670167135], [57.66948401837883, 0.12685307304978033, 6.610711952775718], [67.5343999416134, 0.21954744670485526, 0.6115030251556967], [70.27528836604552, 0.37700917383952737, 0.9591962842816962], [79.99999999999999, 0.5027676142228503, 7.421686898918879]], "r_squared_": 0.968630188075299, "error_": 0.05601983002704808}
{"freq_range": [2.0, 80.0], "freq_res": 1.0, "aperiodic_params_": [-0.018221515966531626, 0.8347834468453621], "gaussian_params_": [[11.018182497792843, 0.35960534313786036, 0.7269423823336545], [14.476992894216504, 0.20684018922936812, 1.5706852474007054], [17.69832314768762, 0.1734609177960895, 0.766009585927875], [48.98942945426945, 0.20984288756656325, 0.25004144496439074], [52.56077013256867, 0.47655601679557796, 0.2543136584109233], [59.560499748645604, 0.14961141490566232, 4.737918870618401], [68.42858128654076, 0.5610497273365467, 0.2546576002151991], [69.97130277815596, 0.2944042392285615, 0.4825302617365986], [72.47762894781494, 0.30813080347035443, 0.3159840673607401], [78.54796540086404, 0.31691075772563837, 4.191196935644619]], "peak_params_": [[11.018182497792843, 0.3773385127732347, 1.453884764667309], [14.476992894216504, 0.1976002576064153, 3.1413704948014107], [17.69832314768762, 0.17723516926038396, 1.53201917185575], [48.98942945426945, 0.22213351889563704, 0.5000828899287815], [52.56077013256867, 0.164606443721248, 0.5086273168218466], [59.560499748645604, 0.14898681453411933, 9.475837741236802], [68.42858128654076, 0.1801714049876617, 0.5093152004303982], [69.97130277815596, 0.34668877496365025, 0.9650605234731972], [72.47762894781494, 0.19664023568391498, 0.6319681347214802], [78.54796540086404, 0.3151059708910793, 8.382393871289239]], "r_squared_": 0.9070976278385408, "error_": 0.06482179943755076}
{"freq_range": [2.0, 80.0], "freq_res": 1.0, "aperiodic_params_": [-0.523422763793601, 0.1699646247446099], "gaussian_params_": [[11.489026644757104, 0.9502601272212986, 0.2869030337422833], [13.514031436263641, 0.5555373619166858, 0.330578197759007], [41.92015882600235, 0.16942022980658777, 1.0981569209547346], [49.057966297863466, 0.10470963420062444, 1.8395017300950605], [58.468450830351095, 0.12398696786948593, 3.7057465546654558], [68.24494924315486, 0.15805367248219798, 1.0924095448851825], [74.36488400996998, 0.1884006004353462, 0.996486343157026]], "peak_params_": [[11.489026644757104, 0.22231007081770443, 0.5738060674845666], [13.514031436263641, 0.18855751804030463, 0.661156395518014], [41.92015882600235, 0.16904598454628417, 2.196313841909469], [49.057966297863466, 0.10939738280806699, 3.679003460190121], [58.468450830351095, 0.12300103346655256, 7.4114931093309115], [68.24494924315486, 0.1586671420238882, 2.184819089770365], [74.36488400996998, 0.17620336539125492, 1.992972686314052]], "r_squared_": 0.3190426443159441, "error_": 0.06624527132197326}
{"freq_range": [2.0, 80.0], "freq_res": 1.0, "aperiodic_params_": [-0.3066239903545722, 0.3218599187882986], "gaussian_params_": [[11.73601436740623, 0.2378325868057547, 0.852455021139521], [13.555904120853919, 1.0748131063145192, 0.2883726923601289], [41.43764215122952, 0.13123748341431937, 1.2497167324441072], [56.95350341795212, 0.12096781998843321, 5.999999998576102], [67.97663585526877, 0.1455885130854103, 0.939640812645677], [75.76924423604262, 0.14370269767940907, 2.9623413298156662]], "peak_params_": [[11.73601436740623, 0.22669814587353615, 1.704910042279042], [13.555904120853919, 0.33534618899089347, 0.5767453847202578], [41.43764215122952, 0.12695961842530712, 2.4994334648882144], [56.95350341795212, 0.1209641880377379, 11.999999997152203], [67.97663585526877, 0.17236918516178756, 1.879281625291354], [75.76924423604262, 0.1440516981940978, 5.9246826596313324]], "r_squared_": 0.5567739596391373, "error_": 0.07015867637755423}
{"freq_range": [2.0, 80.0], "freq_res": 1.0, "aperiodic_params_": [0.5694916512341622, 1.2341656630336382], "gaussian_params_": [[11.370011564740357, 0.5629435645375902, 0.25167253928296995], [13.420598055484284, 0.39761210134331415, 1.7662550356322646], [55.33089461272275, 0.2466439862161481, 0.25000012314540443], [56.45203459914104, 0.11034322829467619, 4.813993883022319], [70.48854456958365, 3.1326134970104673e-26, 2.676544542995844], [72.54796540086404, 0.26128380239930393, 5.999999999999999]], "peak_params_": [[11.370011564740357, 0.34648734727434083, 0.5033450785659399], [13.420598055484284, 0.3864969580578967, 3.532510071264529], [55.33089461272275, 0.21178561503401538, 0.5000002462908089], [56.45203459914104, 0.12254819370649317, 9.627987766044638], [70.48854456958365, 0.24085845307961762, 5.353089085991688], [72.54796540086404, 0.26084317216588926, 11.999999999999998]], "r_squared_": 0.9611058299082721, "error_": 0.06280095770280848}
{"freq_range": [2.0, 80.0], "freq_res": 1.0, "aperiodic_params_": [0.48287520575178366, 1.2378631320171105], "gaussian_params_": [[13.431397583222733, 0.2865511331520431, 2.158607400472645], [55.480442454828975, 0.6508812953456558, 0.2504712396227377], [61.54796534224033, 0.09935554146641797, 5.999999999999999], [68.132177924561, 0.15133249628615464, 0.25001117144498447], [69.91170414110476, 0.26003799338208794, 0.6312426631252661]], "peak_params_": [[13.431397583222733, 0.28088546657818336, 4.31721480094529], [55.480442454828975, 0.15818019725350596, 0.5009424792454754], [61.54796534224033, 0.09907397109782057, 11.999999999999998], [68.132177924561, 0.18997596242122072, 0.5000223428899689], [69.91170414110476, 0.2943443717362557, 1.2624853262505322]], "r_squared_": 0.92641785654391, "error_": 0.08299972714999744}
{"freq_range": [2.0, 80.0], "freq_res": 1.0, "aperiodic_params_": [0.46247401672997634, 1.2014540470580655], "gaussian_params_": [[11.363489472714598, 0.4379801353096193, 0.8169879145152728], [13.061072152399811, 0.1661601264921981, 0.2515914628666356], [14.552190281519204, 0.5333767505424061, 0.29297957030489674], [19.452105476233367, 0.12388574430608167, 4.1235960628010275], [67.58364393457137, 0.5755783873230713, 0.2989379441479293], [70.1434990445101, 0.39420628617806197, 0.6118621422011479]], "peak_params_": [[11.363489472714598, 0.41186870739718984, 1.6339758290305455], [13.061072152399811, 0.25666852586096867, 0.5031829257332712], [14.552190281519204, 0.23504491528623916, 0.5859591406097935], [19.452105476233367, 0.12314338497555077, 8.247192125602055], [67.58364393457137, 0.21906118447268974, 0.5978758882958586], [70.1434990445101, 0.38351263157142523, 1.2237242844022957]], "r_squared_": 0.9253261943786663, "error_": 0.08399857595370103}
{"freq_range": [2.0, 80.0], "freq_res": 1.0, "aperiodic_params_": [-0.15038358092169776, 0.5596161719664837], "gaussian_params_": [[11.322139122237779, 0.22726549503262253, 1.0209636431251659], [52.511303803576816, 0.6855801653301091, 0.2794231450933379], [57.72386582196283, 0.1177979608092232, 2.400875226984838], [61.23752229954701, 0.18323582255195905, 0.47621830100604345], [64.14765219181012, 0.1577679964395562, 1.0545638169711231], [69.70961107708483, 0.22084438419102204, 1.1856702384327207], [73.19514346104718, 0.2576903097223283, 0.9071540299495111], [75.53555068652908, 0.7489686513571069, 0.2827189515089978], [79.99999999999999, 0.1738609400473702, 2.1196532292004715]], "peak_params_": [[11.322139122237779, 0.21622964974569991, 2.0419272862503317], [52.511303803576816, 0.1655424651576196, 0.5588462901866758], [57.72386582196283, 0.11702141015678325, 4.801750453969676], [61.23752229954701, 0.21006956367571494, 0.9524366020120869], [64.14765219181012, 0.16009713032007067, 2.1091276339422462], [69.70961107708483, 0.21484353691523972, 2.3713404768654414], [73.19514346104718, 0.25723751638245385, 1.8143080598990222], [75.53555068652908, 0.22574814097950968, 0.5654379030179956], [79.99999999999999, 0.17386094004752595, 4.239306458400943]], "r_squared_": 0.768693005224043, "error_": 0.06717309659299078}
{"freq_range": [2.0, 80.0], "freq_res": 1.0, "aperiodic_params_": [-0.3684600142950205, 0.3910968491445828], "gaussian_params_": [[11.409036816689309, 0.1704524757816636, 1.4611621851527317], [14.54501947530577, 0.8216707036778842, 0.2500011876598783], [52.51120156824017, 1.0206286267587155, 0.25433885988366717], [63.219542143514786, 0.114025305245991, 5.999999999999999], [73.68438301778914, 0.24310453309744734, 1.477735913228912], [78.25812205943583, 0.2886137930218904, 0.25000057451280566]], "peak_params_": [[11.409036816689309, 0.16390278848730333, 2.9223243703054633], [14.54501947530577, 0.16517011894909328, 0.5000023753197566], [52.51120156824017, 0.18773830796643898, 0.5086777197673343], [63.219542143514786, 0.11394899915868673, 11.999999999999998], [73.68438301778914, 0.2603204567778601, 2.955471826457824], [78.25812205943583, 0.17827247895120701, 0.5000011490256113]], "r_squared_": 0.6712894594891011, "error_": 0.06569781789704711}
{"freq_range": [2.0, 80.0], "freq_res": 1.0, "aperiodic_params_": [-0.26618979005290144, 0.5088548424012843], "gaussian_params_": [[11.852304088138627, 0.20635365362208752, 0.8326638408537742], [13.5886782215272, 0.8578488455791724, 0.27753156659636685], [57.006495078993474, 0.05981892819725619, 0.25056891887640764], [58.059537340360095, 0.12517449649040308, 5.999999999999999], [73.4279189440605, 0.26405798740984526, 0.27336814028241646], [76.41501161381683, 0.13440031802614827, 5.9999999993366]], "peak_params_": [[11.852304088138627, 0.20313288679498287, 1.6653276817075484], [13.5886782215272, 0.2934604360881722, 0.5550631331927337], [57.006495078993474, 0.18375245690918895, 0.5011378377528153], [58.059537340360095, 0.12640177127797148, 11.999999999999998], [73.4279189440605, 0.197495595897615, 0.5467362805648329], [76.41501161381683, 0.13551170687644043, 11.9999999986732]], "r_squared_": 0.7449069195492022, "error_": 0.07137227045201228}
{"freq_range": [2.0, 80.0], "freq_res": 1.0, "aperiodic_params_": [-0.11035278622896214, 0.7873709285294166], "gaussian_params_": [[11.763681515313504, 0.13369697598354438, 0.8509637573815224], [14.002390009445243, 0.1617922740948997, 0.2501274465158136], [55.026154302658625, 0.13508186676249087, 0.2500477473104175], [56.95657867150718, 0.05223727060318103, 0.2504975691958647], [63.54796540086405, 0.14823135314587432, 5.999999999999999]], "peak_params_": [[11.763681515313504, 0.1286396792558323, 1.7019275147630448], [14.002390009445243, 0.16601584418815785, 0.5002548930316272], [55.026154302658625, 0.18807351819232854, 0.500095494620835], [56.95657867150718, 0.13317651862644153, 0.5009951383917294], [63.54796540086405, 0.14781127042762288, 11.999999999999998]], "r_squared_": 0.8577056426669106, "error_": 0.0819199749294726}
{"freq_range": [2.0, 80.0], "freq_res": 1.0, "aperiodic_params_": [-0.04827786865385036, 0.7469987946593798], "gaussian_params_": [[12.084357212933611, 0.17368410849908464, 1.6063464039011623], [54.976304386213826, 0.15866057938860453, 0.5904275878014161], [60.395174189827095, 0.13958644529752734, 1.6794483126224904], [69.44124314302461, 0.11317220801816388, 1.024988599149082], [76.60471689034864, 0.1528357236856014, 5.999757590637613]], "peak_params_": [[12.084357212933611, 0.1734447787251251, 3.2126928078023247], [54.976304386213826, 0.1595679760003046, 1.1808551756028323], [60.395174189827095, 0.13909424053827135, 3.358896625244981], [69.44124314302461, 0.17160563979128907, 2.049977198298164], [76.60471689034864, 0.15250438450013037, 11.999515181275227]], "r_squared_": 0.8622404934955574, "error_": 0.07000740688107951}
{"freq_range": [2.0, 80.0], "freq_res": 1.0, "aperiodic_params_": [-1.0404753689989472, 0.8279856424558525], "gaussian_params_": [[2.0000000000000004, 0.2860909250724037, 1.9133915202910519], [11.492503505723425, 1.2155981272325547, 0.27360964289816914], [13.870563308837772, 0.3439819504894559, 0.6918738426511312], [57.123030679552656, 0.23802166598345337, 0.5980534944695672], [61.308571293268066, 0.24149632552499017, 0.730264108002772], [68.44158961164172, 0.5552137705667339, 0.29299566949989536], [71.10419449932569, 0.11835223098877674, 0.5232395380429024], [78.54796540086404, 0.2532005907514473, 5.186376368553379]], "peak_params_": [[2.0000000000000004, 0.28609092507240375, 3.8267830405821037], [11.492503505723425, 0.24062293583411165, 0.5472192857963383], [13.870563308837772, 0.33801472970118596, 1.3837476853022623], [57.123030679552656, 0.23308323290474764, 1.1961069889391345], [61.308571293268066, 0.2216986476682936, 1.460528216005544], [68.44158961164172, 0.21033289544596956, 0.5859913389997907], [71.10419449932569, 0.20383810682394987, 1.0464790760858047], [78.54796540086404, 0.25224069185495646, 10.372752737106758]], "r_squared_": 0.9619319594666838, "error_": 0.04585586239519634}
{"freq_range": [2.0, 80.0], "freq_res": 1.0, "aperiodic_params_": [0.10609163986009916, 1.120031896652793], "gaussian_params_": [[10.637899491248607, 0.2884712469212643, 0.5473423145857093], [21.426107010277153, 0.2138105992044639, 0.9557936953052675], [54.395274676914696, 0.4592732571199865, 0.2562636897525996], [57.18502943249907, 0.14250069481266184, 0.4512800100984382], [59.72360354349188, 0.24082546573417202, 0.2621056950420496], [62.14119777401011, 0.2489468263494164, 0.7358061698151598], [65.61083046304505, 0.19351546783591453, 0.609673290403488], [70.33303672842214, 0.28055355071208715, 0.48322342091090664], [76.37230484361447, 0.27731844009999773, 2.6756347726959944]], "peak_params_": [[10.637899491248607, 0.23177422304292028, 1.0946846291714185], [21.426107010277153, 0.19358469913703913, 1.911587390610535], [54.395274676914696, 0.13977931492502638, 0.5125273795051992], [57.18502943249907, 0.13101249110353286, 0.9025600201968764], [59.72360354349188, 0.14171986290251404, 0.5242113900840992], [62.14119777401011, 0.24440533334951176, 1.4716123396303196], [65.61083046304505, 0.1579988417877587, 1.219346580806976], [70.33303672842214, 0.23751141298970357, 0.9664468418218133], [76.37230484361447, 0.2746467136636408, 5.351269545391989]], "r_squared_": 0.9760193512803207, "error_": 0.042362374343787305}
{"freq_range": [2.0, 80.0], "freq_res": 1.0, "aperiodic_params_": [-0.12597052835578185, 1.0845516518365341], "gaussian_params_": [[7.452034599135944, 0.1553028375640273, 5.999999999999999], [53.9515218905582, 0.16069140178372782, 1.048299625083041], [62.206941436574084, 0.27095277767820547, 1.8930628660611095], [68.42992865906345, 0.2927476966605942, 0.5388058452818281], [70.44793545620934, 0.3517588751440653, 0.4296423550946681], [72.72648761295399, 0.3558745428520223, 0.7432965687939505], [76.06342015463777, 0.48328024193917124, 1.505292417657631], [79.4395366367888, 0.7922486432176478, 0.27257348777463064]], "peak_params_": [[7.452034599135944, 0.15486271449443711, 11.999999999999998], [53.9515218905582, 0.16054214504351405, 2.096599250166082], [62.206941436574084, 0.2693386731406189, 3.786125732122219], [68.42992865906345, 0.2154393490675317, 1.0776116905636561], [70.44793545620934, 0.20909561931946108, 0.8592847101893362], [72.72648761295399, 0.3935121242255768, 1.486593137587901], [76.06342015463777, 0.4828733637263336, 3.010584835315262], [79.4395366367888, 0.28795642197439, 0.5451469755492613]], "r_squared_": 0.9689814380721551, "error_": 0.0491416115919114}
{"freq_range": [2.0, 80.0], "freq_res": 1.0, "aperiodic_params_": [0.1350285892674746, 1.112988083506646], "gaussian_params_": [[13.539049851563195, 0.29816455773863765, 0.4600095492566294], [47.91447185517338, 0.1542281258343088, 0.4354603491681045], [55.02576398852366, 0.10804972234425057, 0.250085967137877], [61.81778723614499, 0.1277608099764048, 5.999999999999999], [73.14477545658795, 0.21666158555769574, 0.2509578414063897], [75.59492054574045, 0.22976576787000944, 1.1129236360252817]], "peak_params_": [[13.539049851563195, 0.18047616377690234, 0.9200190985132588], [47.91447185517338, 0.16029187143460066, 0.870920698336209], [55.02576398852366, 0.17446987661252678, 0.500171934275754], [61.81778723614499, 0.12770190898269873, 11.999999999999998], [73.14477545658795, 0.22111000988275742, 0.5019156828127794], [75.59492054574045, 0.2228586952471565, 2.2258472720505633]], "r_squared_": 0.9669078580575357, "error_": 0.0538139719164297}
