{"freq_range": [2.0, 80.0], "freq_res": 1.0, "aperiodic_params_": [-0.21853751342741692, -0.10079689077172532], "gaussian_params_": [[9.490111302542632, 0.3779743136458384, 0.59780593639999], [22.988993471661228, 0.28706612989394475, 3.2685274403710074], [30.79453419730536, 0.25795662025684374, 5.328285408671156], [41.230599502474305, 0.20009550197692286, 1.1784720630248773], [44.8974926224052, 0.24296284573822843, 1.2019892698239907], [47.780999017447435, 0.29422819989679316, 0.39893218973998873], [51.431905720041485, 0.4733780185928752, 0.2962559158606644], [55.52628640223579, 0.13336813571340733, 5.429523452995826]], "peak_params_": [[9.490111302542632, 0.27017860715887676, 1.19561187279998], [22.988993471661228, 0.37554765331198714, 6.537054880742015], [30.79453419730536, 0.2720108858014472, 10.656570817342311], [41.230599502474305, 0.2424927856945832, 2.3569441260497546], [44.8974926224052, 0.27102792121016744, 2.4039785396479814], [47.780999017447435, 0.3141897375918098, 0.7978643794799775], [51.431905720041485, 0.2579762144658023, 0.5925118317213288], [55.52628640223579, 0.13286505725590372, 10.859046905991653]], "r_squared_": 0.6237731194104575, "error_": 0.06557048124865877}
{"freq_range": [2.0, 80.0], "freq_res": 1.0, "aperiodic_params_": [-0.062447409399985276, 0.16008103455527434], "gaussian_params_": [[9.44524351787949, 0.3697647102883619, 0.8017347298550141], [21.1214462623315, 0.358623895037733, 2.0330168546980407], [25.435897790818828, 0.17094441246798936, 1.4106679721749404], [29.32686947332043, 0.29782526362211376, 4.662218402471732], [42.823755950026964, 0.3128281378082417, 4.690847589904365], [50.644301333727974, 0.359993885575084, 0.8403387976632091], [53.4820147855645, 0.6746334209348324, 0.3187056799422402], [55.46746271787234, 0.4103704025762732, 0.3697264602451581], [58.40785607513735, 0.2863302194737807, 0.7534484179178159], [60.82103872404161, 0.2516119622537656, 0.7826423926772832]], "peak_params_": [[9.44524351787949, 0.31694556182724476, 1.6034694597100283], [21.1214462623315, 0.4196429542323892, 4.066033709396081], [25.435897790818828, 0.41493191860079137, 2.821335944349881], [29.32686947332043, 0.30838582064656006, 9.324436804943463], [42.823755950026964, 0.31664638409482165, 9.38169517980873], [50.644301333727974, 0.3976364528103991, 1.6806775953264181], [53.4820147855645, 0.2517840570863777, 0.6374113598844804], [55.46746271787234, 0.19531110887446604, 0.7394529204903162], [58.40785607513735, 0.24935602913864355, 1.5068968358356318], [60.82103872404161, 0.24606133498289312, 1.5652847853545664]], "r_squared_": 0.7583492155140005, "error_": 0.05583158954801142}
{"freq_range": [2.0, 80.0], "freq_res": 1.0, "aperiodic_params_": [-0.19789385419091918, 0.08096348474695667], "gaussian_params_": [[9.26313537541728, 0.4017881013037017, 0.8991484254234194], [22.495287603506636, 0.224916323366056, 2.6242817101515907], [30.330838174559396, 0.23391928240924104, 4.536325228798825], [41.120804414196414, 0.16356062584485742, 1.1341593561082008], [44.480673696895245, 0.6112612266464099, 0.2753142804547012], [50.54796540078241, 0.1596899261954601, 5.999999999999999]], "peak_params_": [[9.26313537541728, 0.384950063096632, 1.7982968508468389], [22.495287603506636, 0.2642699282176715, 5.2485634203031815], [30.330838174559396, 0.23752012987494475, 9.07265045759765], [41.120804414196414, 0.22237327651923366, 2.2683187122164017], [44.480673696895245, 0.23019546732949692, 0.5506285609094024], [50.54796540078241, 0.15924463107718348, 11.999999999999998]], "r_squared_": 0.47496197782301414, "error_": 0.07241829606709596}
{"freq_range": [2.0, 80.0], "freq_res": 1.0, "aperiodic_params_": [-0.26867725672545734, -0.18070726614353325], "gaussian_params_": [[9.412861903367983, 0.2955031052653476, 0.8402537349711754], [26.416676568288054, 0.34595258768727044, 5.4500056248111655], [39.45203459913631, 0.09979353915309834, 4.702676412839079], [43.160665510114804, 0.07459465444759668, 1.7779890338052367], [47.63680649628557, 0.4899986005312135, 0.2678083214959945], [53.54796540086405, 0.12611597182551915, 5.999999999991633]], "peak_params_": [[9.412861903367983, 0.26399653121230393, 1.6805074699423508], [26.416676568288054, 0.3466146921062682, 10.900011249622331], [39.45203459913631, 0.13489810503002617, 9.405352825678158], [43.160665510114804, 0.17963835632312292, 3.5559780676104733], [47.63680649628557, 0.2986973585700095, 0.535616642991989], [53.54796540086405, 0.12659317745346585, 11.999999999983267]], "r_squared_": 0.49941091701276347, "error_": 0.08076034639777883}
{"freq_range": [2.0, 80.0], "freq_res": 1.0, "aperiodic_params_": [-0.10756871897926545, 0.045841091277301446], "gaussian_params_": [[9.434852474062815, 0.27867141411700763, 0.9318367016012375], [21.199637746344795, 0.3378257136769107, 2.554217181021629], [28.538458748392298, 0.22371202411753272, 3.6804445414087255], [36.81754579025002, 0.2315371460911821, 0.5612346648897544], [39.41504442317536, 0.56192599321605, 0.30114887102317683], [41.48319840370053, 0.2462562007704705, 0.7213138718733497], [43.527328028381824, 0.3258488929611542, 0.40703113135300434], [45.93905508154873, 0.13187230526956578, 0.4953418311564264], [52.684642163300964, 0.18645299159417114, 5.157119343366776]], "peak_params_": [[9.434852474062815, 0.24992541121608042, 1.863673403202475], [21.199637746344795, 0.36425462574927686, 5.108434362043258], [28.538458748392298, 0.22515257023904728, 7.360889082817451], [36.81754579025002, 0.2373670393193097, 1.1224693297795088], [39.41504442317536, 0.22761096199193176, 0.6022977420463537], [41.48319840370053, 0.21180464456450976, 1.4426277437466994], [43.527328028381824, 0.21184441632735154, 0.8140622627060087], [45.93905508154873, 0.21136947010439172, 0.9906836623128528], [52.684642163300964, 0.18610471342527335, 10.314238686733551]], "r_squared_": 0.5268191196413494, "error_": 0.05761325074660495}
{"freq_range": [2.0, 80.0], "freq_res": 1.0, "aperiodic_params_": [0.02897806023049393, 0.39730848565615395], "gaussian_params_": [[9.266803168459056, 0.3364637421628249, 0.9251277489302528], [20.158114552545328, 0.20447223172151088, 0.8019938323400873], [24.800819777291757, 0.27237572697726986, 3.9151091882148927], [30.953034132103454, 0.11242689026717859, 0.25000396822050786], [36.045195812510244, 0.21035524132894257, 4.167676991745656], [41.33907454946255, 0.28519628680454195, 0.26001187721867736], [44.28558426994563, 0.2509308276985641, 2.1885267366888264], [50.42038636558705, 0.34064605161615347, 1.0628371427119443], [53.44362813794748, 0.6577219559608861, 0.30957128550302515], [55.3969010891284, 0.4882071276316505, 0.3059038551169292], [59.37257103724558, 0.2002790643889943, 1.6766376932724434]], "peak_params_": [[9.266803168459056, 0.3228375779706908, 1.8502554978605057], [20.158114552545328, 0.3290913970114114, 1.6039876646801745], [24.800819777291757, 0.2783011857312791, 7.8302183764297855], [30.953034132103454, 0.28931554110805097, 0.5000079364410157], [36.045195812510244, 0.21509030015594477, 8.335353983491313], [41.33907454946255, 0.3069835455049706, 0.5200237544373547], [44.28558426994563, 0.2828353119117567, 4.377053473377653], [50.42038636558705, 0.32408920421702875, 2.1256742854238886], [53.44362813794748, 0.25376491315665173, 0.6191425710060503], [55.3969010891284, 0.21712476402706915, 0.6118077102338584], [59.37257103724558, 0.19539490021141198, 3.3532753865448868]], "r_squared_": 0.8164871921780431, "error_": 0.05631345777064723}
{"freq_range": [2.0, 80.0], "freq_res": 1.0, "aperiodic_params_": [0.10829735762933992, 0.6327581764372469], "gaussian_params_": [[7.5468737457038095, 0.8814737515590589, 0.28735140148707344], [9.542590690974434, 0.550090567848511, 0.9344110487233971], [21.710330060847017, 0.11728352746295242, 1.9399846437813055], [25.461281352022844, 0.5407831095190969, 0.28412553247250516], [28.23961238643859, 0.1480947846789144, 0.6900464044576725], [30.88857045270392, 0.1962486270824476, 0.6794792333255495], [34.02420265251364, 0.21324321062322998, 1.262991891093456], [44.48932229202813, 0.08114518402588652, 4.918825701854972], [51.43621984249581, 0.12576722689423878, 1.232955451601374], [55.18591775523105, 0.24971939829220868, 0.5556693148955204], [59.367249657812415, 0.1906931719697485, 0.5170556667495814], [68.51820731747937, 0.7776643348842843, 0.2685601967528477], [71.34119337266557, 0.3963811387324775, 0.2516390629114608]], "peak_params_": [[7.5468737457038095, 0.39504800789592703, 0.5747028029741469], [9.542590690974434, 0.4879777939758757, 1.8688220974467942], [21.710330060847017, 0.1159857055313035, 3.879969287562611], [25.461281352022844, 0.17265133998434745, 0.5682510649450103], [28.23961238643859, 0.14036243976062301, 1.380092808915345], [30.88857045270392, 0.207696899349334, 1.358958466651099], [34.02420265251364, 0.2215614894574759, 2.525983782186912], [44.48932229202813, 0.08074466408082426, 9.837651403709945], [51.43621984249581, 0.15192991220332763, 2.465910903202748], [55.18591775523105, 0.24632994934436792, 1.1113386297910408], [59.367249657812415, 0.14922526123528845, 1.0341113334991627], [68.51820731747937, 0.1555718829347854, 0.5371203935056954], [71.34119337266557, 0.15809020644707394, 0.5032781258229216]], "r_squared_": 0.9517964236493759, "error_": 0.037789893676966155}
{"freq_range": [2.0, 80.0], "freq_res": 1.0, "aperiodic_params_": [-0.15680758061764863, 0.11652676093086015], "gaussian_params_": [[9.353157844468242, 0.42040102781226824, 1.1002506830047334], [24.216211987781524, 0.17138593390139129, 3.482775123060839], [36.09593080172811, 0.12490868723432025, 5.999999999999999]], "peak_params_": [[9.353157844468242, 0.39930981303293234, 2.2005013660094668], [24.216211987781524, 0.18742644905578065, 6.965550246121678], [36.09593080172811, 0.1254526539652923, 11.999999999999998]], "r_squared_": 0.34109620402226953, "error_": 0.07880909487022471}
{"freq_range": [2.0, 80.0], "freq_res": 1.0, "aperiodic_params_": [0.16280784545171556, 0.37144173108289513], "gaussian_params_": [[9.73115975736084, 0.3761074440711057, 1.0019791449284046], [24.046720251806256, 0.19744826035610888, 4.064744195475783], [27.537531888921976, 0.5946410073076737, 0.25000128074547245], [36.09593080172811, 0.131203413232623, 5.999999999999938]], "peak_params_": [[9.73115975736084, 0.36332426015622865, 2.003958289856809], [24.046720251806256, 0.21463065654465965, 8.129488390951567], [27.537531888921976, 0.2832796183513159, 0.5000025614909449], [36.09593080172811, 0.13380240727177373, 11.999999999999876]], "r_squared_": 0.7567751937532654, "error_": 0.07171458085129555}
{"freq_range": [2.0, 80.0], "freq_res": 1.0, "aperiodic_params_": [0.6834617069617834, 0.9694899071129148], "gaussian_params_": [[9.681923648173461, 0.4731019308044559, 1.131401260704112], [40.69701822572139, 0.2400518792947962, 0.4020458534785278], [44.616917302432945, 0.1130273680779401, 1.154689771130157], [54.547965400261084, 0.11357714293637515, 5.9999999999993925]], "peak_params_": [[9.681923648173461, 0.45477029934716856, 2.262802521408224], [40.69701822572139, 0.19042242039031587, 0.8040917069570556], [44.616917302432945, 0.13899389270515528, 2.309379542260314], [54.547965400261084, 0.11325526909490713, 11.999999999998785]], "r_squared_": 0.9642550456647944, "error_": 0.05527454249534507}
{"freq_range": [2.0, 80.0], "freq_res": 1.0, "aperiodic_params_": [0.7510005319171159, 1.0475541357835625], "gaussian_params_": [[9.646534571036236, 0.4812289305018291, 1.1341900630610806], [40.59836907457948, 0.6075762363390986, 0.2500003665182005], [52.27861116720646, 0.12018969949349367, 5.999999999999999]], "peak_params_": [[9.646534571036236, 0.45841807267259294, 2.2683801261221612], [40.59836907457948, 0.18771044459169717, 0.500000733036401], [52.27861116720646, 0.12006019116328748, 11.999999999999998]], "r_squared_": 0.9679657134786523, "error_": 0.05660372847929725}
{"freq_range": [2.0, 80.0], "freq_res": 1.0, "aperiodic_params_": [0.6049434484066644, 0.8979701429038321], "gaussian_params_": [[9.529451889175043, 0.4299400211126969, 1.1887547892287025], [20.42375409627876, 0.3511974111887091, 0.4570258986015004], [49.452034599207906, 0.15066559438005728, 5.999999999999999], [61.4502650213918, 0.5488735940130944, 0.2837306019897761]], "peak_params_": [[9.529451889175043, 0.39754332393166053, 2.377509578457405], [20.42375409627876, 0.22849242908962575, 0.9140517972030008], [49.452034599207906, 0.15023861310308018, 11.999999999999998], [61.4502650213918, 0.1794542205935986, 0.5674612039795522]], "r_squared_": 0.951429636662926, "error_": 0.061488939300646556}
{"freq_range": [2.0, 80.0], "freq_res": 1.0, "aperiodic_params_": [0.2597136068402776, 0.4908202513793702], "gaussian_params_": [[8.51654521634844, 0.9725435929000745, 0.2798155161782564], [10.425771871004754, 0.9690944611409571, 0.2777103796776919], [23.478820483394497, 0.25266390505894326, 4.470767109968099], [28.588699526011485, 0.5778325391511961, 0.25079204364618096], [34.940271992211535, 0.19347378445759414, 1.1763391448275833], [37.59447398585059, 0.651020866098665, 0.29768375080878084], [40.0261484835871, 0.2067780905455114, 0.7544383827334669], [43.397378938980985, 0.28192329763575613, 0.5681227018817235], [46.239157165077145, 0.26242743554785214, 1.1575331076477178], [50.418098100968564, 0.3242528696970998, 0.7471563040143949], [51.94837043999011, 0.16706297486383068, 0.25048364300513465], [55.535232837233615, 0.15954164013164168, 1.674685720775703], [60.31752498162403, 0.4469856323072785, 0.2500155797331452], [64.67479464429067, 0.1675570187188224, 0.9913911820539358]], "peak_params_": [[8.51654521634844, 0.21995508514626047, 0.5596310323565128], [10.425771871004754, 0.30187708108257305, 0.5554207593553838], [23.478820483394497, 0.2512189652385942, 8.941534219936198], [28.588699526011485, 0.2684387180485805, 0.5015840872923619], [34.940271992211535, 0.2023547597945224, 2.3526782896551666], [37.59447398585059, 0.2708816794399625, 0.5953675016175617], [40.0261484835871, 0.20694631444462575, 1.5088767654669337], [43.397378938980985, 0.22608306061973882, 1.136245403763447], [46.239157165077145, 0.2568942312117352, 2.3150662152954355], [50.418098100968564, 0.27927601916326716, 1.4943126080287898], [51.94837043999011, 0.21521364622999783, 0.5009672860102693], [55.535232837233615, 0.1535144793604526, 3.349371441551406], [60.31752498162403, 0.20411463598186008, 0.5000311594662904], [64.67479464429067, 0.15878041486672678, 1.9827823641078717]], "r_squared_": 0.8669374535881812, "error_": 0.04781696128709401}
{"freq_range": [2.0, 80.0], "freq_res": 1.0, "aperiodic_params_": [0.08169352017039157, 0.4625096467941911], "gaussian_params_": [[9.27097613003781, 0.3537645595547617, 1.0873136445348037], [20.18830972786449, 0.27695514112086006, 0.7083606330918644], [26.238035595206327, 0.19452261154282458, 2.766083821099829], [37.996593053889306, 0.17607993241556194, 2.0788885799611245], [45.49209412356801, 0.9730039076030392, 0.2500070628097706], [53.54796540086257, 0.12805411631005978, 5.997946743270714]], "peak_params_": [[9.27097613003781, 0.3429474611759642, 2.1746272890696074], [20.18830972786449, 0.28263615463424613, 1.4167212661837287], [26.238035595206327, 0.19380705023340977, 5.532167642199658], [37.996593053889306, 0.18055168020707485, 4.157777159922249], [45.49209412356801, 0.18721166040148846, 0.5000141256195412], [53.54796540086257, 0.12769096705782879, 11.995893486541428]], "r_squared_": 0.8187699275632271, "error_": 0.057707166300492996}
{"freq_range": [2.0, 80.0], "freq_res": 1.0, "aperiodic_params_": [0.23365328274008154, 0.7624134694672361], "gaussian_params_": [[9.184137850384346, 0.40704932624445905, 1.1512528585245803], [19.95148015914008, 0.2291165177256564, 0.6501097896461264], [38.45203459913595, 0.12108013545534879, 5.999999999656344], [52.54796540086405, 0.09177158994154362, 5.999999999996275]], "peak_params_": [[9.184137850384346, 0.40187650407233894, 2.3025057170491605], [19.95148015914008, 0.2295492728593883, 1.3002195792922528], [38.45203459913595, 0.1255910441296173, 11.999999999312688], [52.54796540086405, 0.0979157657044194, 11.99999999999255]], "r_squared_": 0.9142747215409041, "error_": 0.06218471334619576}
{"freq_range": [2.0, 80.0], "freq_res": 1.0, "aperiodic_params_": [-0.06853378322678723, 0.3341954308037065], "gaussian_params_": [[8.517780128715323, 0.44139586184977636, 0.9516597151935494], [10.449332286252448, 0.8260869202915082, 0.2960631144131797], [22.994373542934266, 0.13588383712319402, 2.591592298413333], [26.564604534809042, 0.5664551585134695, 0.2865691685559908], [29.602184119355172, 0.20983935289845887, 1.2032873151061148], [33.60686717091454, 0.6237579280168821, 0.2825912940504026], [38.169022213094955, 0.21701283186899362, 1.4394056565467508], [42.337979330686885, 0.24308747708860093, 1.0498331984045015], [45.43134917104237, 0.199444277663125, 0.7098678884166583], [48.503253665309984, 0.26371896056899574, 0.9907479494701499], [51.182947794633534, 0.16368313947177854, 0.8114556121870726], [57.47803503388632, 0.15629251820266987, 2.9656794356194958], [64.11658889036237, 0.2926814588301346, 0.8893419549249504], [67.99455670701424, 0.14645488282306912, 0.25000007824339093]], "peak_params_": [[8.517780128715323, 0.38822138154461905, 1.9033194303870988], [10.449332286252448, 0.3923669198978753, 0.5921262288263593], [22.994373542934266, 0.13588357779599636, 5.183184596826666], [26.564604534809042, 0.2400109007050743, 0.5731383371119816], [29.602184119355172, 0.2021980423846973, 2.4065746302122295], [33.60686717091454, 0.2405583556143941, 0.5651825881008052], [38.169022213094955, 0.21556949464364822, 2.8788113130935016], [42.337979330686885, 0.2370980379455877, 2.099666396809003], [45.43134917104237, 0.17611922775389532, 1.4197357768333165], [48.503253665309984, 0.23958733120683817, 1.9814958989402998], [51.182947794633534, 0.1849768282954114, 1.6229112243741453], [57.47803503388632, 0.15427526070922515, 5.9313588712389915], [64.11658889036237, 0.304101094829335, 1.7786839098499008], [67.99455670701424, 0.14673013053775075, 0.5000001564867819]], "r_squared_": 0.8370483782033569, "error_": 0.04158079142015715}
{"freq_range": [2.0, 80.0], "freq_res": 1.0, "aperiodic_params_": [0.336305502108438, 0.7727947312746337], "gaussian_params_": [[9.50406479910673, 0.5452783525899754, 1.2766481125222224]], "peak_params_": [[9.50406479910673, 0.5056492455673597, 2.553296225044445]], "r_squared_": 0.9439726142543645, "error_": 0.05886158027178324}
{"freq_range": [2.0, 80.0], "freq_res": 1.0, "aperiodic_params_": [0.6757113601014003, 0.9780208418854539], "gaussian_params_": [[9.827367418780577, 0.4582471301474636, 1.058446922493195], [22.547965400864054, 0.10188946787222058, 5.9999999999704245], [59.22473331458909, 0.22301494312848244, 0.6887266591370675]], "peak_params_": [[9.827367418780577, 0.4636318324655704, 2.11689384498639], [22.547965400864054, 0.10160071651350322, 11.999999999940849], [59.22473331458909, 0.2114528586112019, 1.377453318274135]], "r_squared_": 0.9656338768292931, "error_": 0.054515858681591}
{"freq_range": [2.0, 80.0], "freq_res": 1.0, "aperiodic_params_": [0.9219661980419803, 1.1915409171282558], "gaussian_params_": [[9.810586268553779, 0.4679936501905839, 1.184214669801793], [19.41107454829644, 0.12285027206950949, 3.645456769190081]], "peak_params_": [[9.810586268553779, 0.4664323660806696, 2.368429339603586], [19.41107454829644, 0.12207169151982583, 7.290913538380162]], "r_squared_": 0.980000297430093, "error_": 0.050907078096335906}
{"freq_range": [2.0, 80.0], "freq_res": 1.0, "aperiodic_params_": [1.0259420506582857, 1.2809309378222664], "gaussian_params_": [[9.6610125885053, 0.4603001032920509, 1.1929844381314711], [44.408259340914725, 0.4643774862045181, 0.27256519942352675], [54.54796540079879, 0.09891245417752029, 5.999999999991702]], "peak_params_": [[9.6610125885053, 0.4420875120586282, 2.3859688762629423], [44.408259340914725, 0.17234343310692257, 0.5451303988470535], [54.54796540079879, 0.09863213957639116, 11.999999999983403]], "r_squared_": 0.9775186239368793, "error_": 0.0571941965462126}
{"freq_range": [2.0, 80.0], "freq_res": 1.0, "aperiodic_params_": [0.9394092437606806, 1.213363790848598], "gaussian_params_": [[9.617188932111441, 0.45089235689463614, 1.2681486564454487], [37.70671733397821, 0.21557293052448734, 0.5228817184826812], [49.91286933735912, 0.16938183365131715, 0.291117736399013], [51.64411399282626, 0.22464101852260857, 0.6591066073446732]], "peak_params_": [[9.617188932111441, 0.4308099615546063, 2.5362973128908974], [37.70671733397821, 0.1841953141804703, 1.0457634369653623], [49.91286933735912, 0.17197029689029475, 0.582235472798026], [51.64411399282626, 0.1941691159789678, 1.3182132146893464]], "r_squared_": 0.9798079813053087, "error_": 0.05089898807707547}
{"freq_range": [2.0, 80.0], "freq_res": 1.0, "aperiodic_params_": [0.6762381631908532, 1.0100806034259728], "gaussian_params_": [[9.574153736322392, 0.41310456061510753, 1.2905731618758718], [18.728336839663413, 0.14971692808301829, 3.9491776820021958], [26.391200560347993, 0.23001283779675494, 0.47621668533348893], [28.5144607563051, 0.9986231069698706, 0.27588261378983125], [37.589863634473915, 0.12982424187047129, 4.274755013200552], [45.11697301286149, 0.13768976463391724, 1.6479626403605507], [50.40739015049011, 0.6965898408458584, 0.258529102423187], [51.97372858890422, 0.22694703421038026, 0.735756025178104], [54.96239188808648, 0.19161576848645173, 0.8277969663969489]], "peak_params_": [[9.574153736322392, 0.4042346925097497, 2.5811463237517436], [18.728336839663413, 0.14937327014161622, 7.8983553640043915], [26.391200560347993, 0.19491239326404286, 0.9524333706669779], [28.5144607563051, 0.23455463046934433, 0.5517652275796625], [37.589863634473915, 0.12924136723832924, 8.549510026401103], [45.11697301286149, 0.16624017418675507, 3.2959252807211015], [50.40739015049011, 0.21110519664881933, 0.517058204846374], [51.97372858890422, 0.22758453284667612, 1.471512050356208], [54.96239188808648, 0.19149869774739814, 1.6555939327938978]], "r_squared_": 0.9670015479299674, "error_": 0.050767727771587015}
{"freq_range": [2.0, 80.0], "freq_res": 1.0, "aperiodic_params_": [0.2830689609237506, 0.6714347278458797], "gaussian_params_": [[9.52348896640378, 0.3858351251568781, 1.361237880246389], [20.191503770844022, 0.11688222599082987, 5.22499989470651], [28.500475271046056, 0.7352996585224432, 0.27260777132155894], [38.319136819936574, 0.4271938423887158, 0.25113982614317454], [43.85748332333459, 0.2450480631068311, 0.5902066372374514], [66.15143222217762, 0.21647420904939751, 0.4725957069167003]], "peak_params_": [[9.52348896640378, 0.3803467910287796, 2.722475760492778], [20.191503770844022, 0.11680374676249616, 10.44999978941302], [28.500475271046056, 0.16542392310077592, 0.5452155426431179], [38.319136819936574, 0.19088492000016077, 0.5022796522863491], [43.85748332333459, 0.23801076959332612, 1.1804132744749027], [66.15143222217762, 0.20564159421667894, 0.9451914138334006]], "r_squared_": 0.9067865749609224, "error_": 0.05641649386346538}
{"freq_range": [2.0, 80.0], "freq_res": 1.0, "aperiodic_params_": [0.0645713518788681, 0.6331331066823637], "gaussian_params_": [[9.034284446571311, 0.5092677743446684, 1.1748775562646954], [38.71740630003174, 0.10006491349212748, 3.574761020809215], [44.61950290508383, 0.21843224640296238, 0.8842530983507269], [50.05855526873533, 0.22639242481647948, 0.9491254790117313], [54.47705377521452, 0.18284217399651748, 1.2632718790542412]], "peak_params_": [[9.034284446571311, 0.509050987552439, 2.3497551125293907], [38.71740630003174, 0.09975273433442589, 7.14952204161843], [44.61950290508383, 0.2204759998998156, 1.7685061967014537], [50.05855526873533, 0.22699186964607665, 1.8982509580234626], [54.47705377521452, 0.17031033650484817, 2.5265437581084824]], "r_squared_": 0.8834334910598379, "error_": 0.0593182854034485}
{"freq_range": [2.0, 80.0], "freq_res": 1.0, "aperiodic_params_": [0.04771368898513313, 0.6941331354857185], "gaussian_params_": [[8.16204211794704, 0.5450922330182697, 0.889219891412289], [10.16768198387037, 0.6987294700549094, 0.7311465718661148], [74.23573369121472, 0.1589421698278599, 1.0749721324621946]], "peak_params_": [[8.16204211794704, 0.5447384719945855, 1.778439782824578], [10.16768198387037, 0.7449763006546439, 1.4622931437322295], [74.23573369121472, 0.1551660369285648, 2.149944264924389]], "r_squared_": 0.9356741989734875, "error_": 0.0628000640737411}
{"freq_range": [2.0, 80.0], "freq_res": 1.0, "aperiodic_params_": [0.46396503136558276, 0.9762484110130103], "gaussian_params_": [[9.667962419289765, 0.5899343243568096, 1.2668127340123108]], "peak_params_": [[9.667962419289765, 0.5700144875667231, 2.5336254680246215]], "r_squared_": 0.9678304731787893, "error_": 0.05507736719057404}
{"freq_range": [2.0, 80.0], "freq_res": 1.0, "aperiodic_params_": [0.7790835968886652, 1.1593423669578549], "gaussian_params_": [[9.765752418330207, 0.5173554681329737, 1.3093990931762236], [58.781013325571315, 0.22165201949199337, 0.5268544840502027]], "peak_params_": [[9.765752418330207, 0.5091425964650894, 2.618798186352447], [58.781013325571315, 0.20330890465261375, 1.0537089681004055]], "r_squared_": 0.9770552109567711, "error_": 0.05334598201616143}
{"freq_range": [2.0, 80.0], "freq_res": 1.0, "aperiodic_params_": [1.0210492777268587, 1.3072511707882755], "gaussian_params_": [[9.734091869335096, 0.4697970612247697, 1.3336734458102448], [58.56902588925357, 0.5697161832439359, 0.2914540188524774]], "peak_params_": [[9.734091869335096, 0.46055145050473373, 2.6673468916204897], [58.56902588925357, 0.19092031172861512, 0.5829080377049548]], "r_squared_": 0.9792182204538964, "error_": 0.057103633656758905}
{"freq_range": [2.0, 80.0], "freq_res": 1.0, "aperiodic_params_": [1.0599093884290751, 1.34297128730362], "gaussian_params_": [[2.6137690272607936, 0.2105808749379493, 0.77148472583609], [9.647423282441787, 0.44258631968597795, 1.325638939864045], [15.964487668969902, 0.18607512363226095, 0.6086061254887338], [44.22063739573858, 0.176520836875173, 0.6252598988280426], [58.579576924894205, 0.5411673507486239, 0.25000068777275336], [65.46574611374437, 0.08175434083739053, 5.999999999999998]], "peak_params_": [[2.6137690272607936, 0.1857796270371327, 1.54296945167218], [9.647423282441787, 0.4272059409074676, 2.65127787972809], [15.964487668969902, 0.1857631877685083, 1.2172122509774677], [44.22063739573858, 0.1660017115776823, 1.2505197976560851], [58.579576924894205, 0.1773350756937051, 0.5000013755455067], [65.46574611374437, 0.08150840447002827, 11.999999999999996]], "r_squared_": 0.9855486485314638, "error_": 0.049172873972549}
{"freq_range": [2.0, 80.0], "freq_res": 1.0, "aperiodic_params_": [0.9475919974306315, 1.2852146638660693], "gaussian_params_": [[2.5080828831904802, 0.26333428879021675, 0.7110096555633366], [9.641290176045787, 0.4580204878289633, 1.3881424063360492], [15.470296447846474, 0.14125284729366716, 1.4206778344969446], [37.529219315878095, 0.7332430605525685, 0.2660559159603747], [44.24983169758329, 0.1925931784796188, 0.5608991290377577], [51.013684959897425, 0.17861672235154558, 1.0489625375404976], [55.42939398047635, 0.6580172995061827, 0.25000053033211], [58.55381830224119, 0.5933034320735099, 0.2515937699072303], [66.83616051490326, 0.07729968433804327, 5.617749093468747]], "peak_params_": [[2.5080828831904802, 0.20728917081189957, 1.4220193111266732], [9.641290176045787, 0.4430658545640102, 2.7762848126720985], [15.470296447846474, 0.1339874582777144, 2.8413556689938892], [37.529219315878095, 0.15323122494686203, 0.5321118319207494], [44.24983169758329, 0.17442557669450653, 1.1217982580755155], [51.013684959897425, 0.1800557094121651, 2.0979250750809952], [55.42939398047635, 0.15906598497747781, 0.50000106066422], [58.55381830224119, 0.15234355038424408, 0.5031875398144606], [66.83616051490326, 0.07726681674884195, 11.235498186937495]], "r_squared_": 0.9893210584584129, "error_": 0.03931919718802503}
{"freq_range": [2.0, 80.0], "freq_res": 1.0, "aperiodic_params_": [0.8121010309571686, 1.2087828424144327], "gaussian_params_": [[9.564010727496534, 0.5122510264369293, 1.486653695984729], [14.884279676271351, 0.18913837326617539, 2.2299437556420543], [28.528232194581886, 0.8467921509149612, 0.27460858755757805], [37.55301363792483, 0.6870863214346281, 0.28292929751244006], [44.23024091173895, 0.19439909687458445, 0.7141533053427704], [50.3460195092057, 0.45933229925382896, 0.25000280585600076], [51.5271361166466, 0.498540832770627, 0.31572267001211196], [55.44181760677933, 0.5664055559512405, 0.27841996916123557], [58.548861191190056, 0.4739654924331096, 0.2957379031037794], [65.19098568715968, 0.1686168109508657, 0.7827506752093295]], "peak_params_": [[9.564010727496534, 0.5078693376847329, 2.973307391969458], [14.884279676271351, 0.18952387736936172, 4.4598875112841085], [28.528232194581886, 0.19359227199630702, 0.5492171751151561], [37.55301363792483, 0.19725436076722813, 0.5658585950248801], [44.23024091173895, 0.18455422460763093, 1.4283066106855409], [50.3460195092057, 0.17626400675038356, 0.5000056117120015], [51.5271361166466, 0.16240678374689477, 0.6314453400242239], [55.44181760677933, 0.16081018348743004, 0.5568399383224711], [58.548861191190056, 0.14805853266462976, 0.5914758062075588], [65.19098568715968, 0.16367167789062886, 1.565501350418659]], "r_squared_": 0.9828110107897705, "error_": 0.04403342558327387}
{"freq_range": [2.0, 80.0], "freq_res": 1.0, "aperiodic_params_": [0.42870689255630284, 0.961126087858265], "gaussian_params_": [[9.211667776164358, 0.5602022301683521, 1.2563495667698628], [13.512883026059056, 0.19555771008482087, 2.653701064593582], [44.30403250800424, 0.231892913277527, 0.61125682305791], [55.326295756376595, 0.2882146715772758, 0.44590133950369826]], "peak_params_": [[9.211667776164358, 0.5983627053058426, 2.5126991335397255], [13.512883026059056, 0.19268336442943024, 5.307402129187164], [44.30403250800424, 0.2049114027686334, 1.22251364611582], [55.326295756376595, 0.22051469367769072, 0.8918026790073965]], "r_squared_": 0.9562900265126499, "error_": 0.061463496214854675}
{"freq_range": [2.0, 80.0], "freq_res": 1.0, "aperiodic_params_": [0.1535609950821617, 0.7872567513196663], "gaussian_params_": [[7.553919670055434, 0.8378768087690396, 0.31132361561492605], [9.58705102055142, 0.6906793817463195, 0.8923794993317432], [28.558861603147207, 0.648578920625513, 0.26013793881901814], [50.770972844317825, 0.17105789339550004, 0.991999988146883], [55.420195963765266, 0.5638476565897041, 0.2727369218119781], [69.51178963984438, 0.5497964356630847, 0.30736562596156297], [74.89323186123522, 0.14828123157616604, 1.6405952392450445]], "peak_params_": [[7.553919670055434, 0.4422254621210706, 0.6226472312298521], [9.58705102055142, 0.6205503547807749, 1.7847589986634864], [28.558861603147207, 0.15399772328946837, 0.5202758776380363], [50.770972844317825, 0.16655916974390572, 1.983999976293766], [55.420195963765266, 0.17209965785966452, 0.5454738436239562], [69.51178963984438, 0.15745977727523308, 0.6147312519231259], [74.89323186123522, 0.1479675587607332, 3.281190478490089]], "r_squared_": 0.9440550608920305, "error_": 0.05430288547972298}
{"freq_range": [2.0, 80.0], "freq_res": 1.0, "aperiodic_params_": [-0.08085699247886628, 0.598462765408079], "gaussian_params_": [[7.6059775821176965, 0.7510430959563708, 0.29744558710557606], [9.740737948123009, 0.7610175874643179, 0.9853253031095055], [51.099983307326134, 0.2243085788622149, 0.4953411127912045], [69.44360592657706, 0.760986277305889, 0.26494582554187834], [74.33331894356233, 0.28656291858538224, 0.5667339603126416]], "peak_params_": [[7.6059775821176965, 0.4721607746200439, 0.5948911742111521], [9.740737948123009, 0.7351242491108857, 1.970650606219011], [51.099983307326134, 0.2197853756702819, 0.990682225582409], [69.44360592657706, 0.18734091220482518, 0.5298916510837567], [74.33331894356233, 0.2410498503447005, 1.1334679206252831]], "r_squared_": 0.9121858278416399, "error_": 0.06782830367826755}
{"freq_range": [2.0, 80.0], "freq_res": 1.0, "aperiodic_params_": [0.6158407263734121, 1.1463946586358054], "gaussian_params_": [[7.628571355248314, 0.5767332718718505, 0.2779174006540057], [9.795161455087396, 0.7391934617234601, 0.9579590265819489], [37.55039270066401, 0.19055025644374854, 0.6409403686233854], [44.43281551836312, 0.7147042815584863, 0.25141903737702626], [50.96898407346242, 0.17512009571179807, 1.0300836893604928], [58.540236236873355, 0.6569972220424652, 0.2578633653563981], [64.75964885270695, 0.11234788530222795, 5.999999999999999]], "peak_params_": [[7.628571355248314, 0.36381650588250186, 0.5558348013080114], [9.795161455087396, 0.7224862943742657, 1.9159180531638977], [37.55039270066401, 0.14899526633105498, 1.2818807372467709], [44.43281551836312, 0.1626892514061382, 0.5028380747540525], [50.96898407346242, 0.18314219995477377, 2.0601673787209855], [58.540236236873355, 0.20491638280016855, 0.5157267307127962], [64.75964885270695, 0.11225777994973085, 11.999999999999998]], "r_squared_": 0.9821044645532604, "error_": 0.04522786051674817}
{"freq_range": [2.0, 80.0], "freq_res": 1.0, "aperiodic_params_": [0.9000127561225476, 1.2865802818315912], "gaussian_params_": [[8.346670957511764, 0.5051489194260446, 0.3037524821392283], [9.894534100578916, 0.6461552309073902, 0.916131024963707], [13.09837925745247, 0.1664238808656106, 0.745334849791823], [16.48591702780096, 0.15887030346978642, 1.095626090472891], [58.599430428523895, 0.559915007449354, 0.2505696446941818], [65.68640719173243, 0.10945379387021079, 5.999999999999999], [69.62307004214851, 0.16608746198069202, 0.3375393666416327]], "peak_params_": [[8.346670957511764, 0.3395305101691593, 0.6075049642784566], [9.894534100578916, 0.6419173051466391, 1.832262049927414], [13.09837925745247, 0.168053424544519, 1.490669699583646], [16.48591702780096, 0.1440744887413864, 2.191252180945782], [58.599430428523895, 0.2148417590132865, 0.5011392893883636], [65.68640719173243, 0.10930439959444516, 11.999999999999998], [69.62307004214851, 0.17355987660604777, 0.6750787332832654]], "r_squared_": 0.9837880878353349, "error_": 0.04889458478086296}
{"freq_range": [2.0, 80.0], "freq_res": 1.0, "aperiodic_params_": [0.9190899587967855, 1.2962594697938645], "gaussian_params_": [[2.689702092987388, 0.19789182805652186, 0.7416513427769096], [7.978975006939572, 0.297358310163703, 0.4764369137272919], [9.877949975393951, 0.5821955416666307, 0.9068777264159883], [13.044225184912358, 0.16471006138375954, 0.971559792355276], [16.03636836185225, 0.20152769501590867, 0.5008467296968062], [44.22545650106584, 0.18739735558598541, 0.5710418182232985], [50.85370428885419, 0.1611945195491193, 1.0153777356885498], [58.617952837892865, 0.4022124076980114, 0.2723471984251354], [65.6819368478265, 0.11998681798623806, 5.999999591111889], [75.11634081753853, 0.13200316787026026, 0.5033496655409652]], "peak_params_": [[2.689702092987388, 0.18130784072300388, 1.4833026855538192], [7.978975006939572, 0.36528850165416704, 0.9528738274545838], [9.877949975393951, 0.5781992963287875, 1.8137554528319766], [13.044225184912358, 0.1660936671926984, 1.943119584710552], [16.03636836185225, 0.20260735351632253, 1.0016934593936124], [44.22545650106584, 0.1735215014806677, 1.142083636446597], [50.85370428885419, 0.1655405171772284, 2.0307554713770997], [58.617952837892865, 0.21490357260157444, 0.5446943968502708], [65.6819368478265, 0.11981834791963286, 11.999999182223778], [75.11634081753853, 0.16444985570005022, 1.0066993310819303]], "r_squared_": 0.9874291922354913, "error_": 0.04117706133255091}
{"freq_range": [2.0, 80.0], "freq_res": 1.0, "aperiodic_params_": [0.9063369263388212, 1.2752284145654529], "gaussian_params_": [[2.652628991592828, 0.24070899070857193, 0.8685939538895443], [9.631550380190475, 0.5013499359308485, 1.5691463474498897], [15.916538091949064, 0.20780225013851508, 0.5508771788793924], [44.46052544536218, 0.6775952596580153, 0.27623325613763267], [55.424305667174245, 0.6858871464545697, 0.25041847432807285], [58.56793447184273, 0.6621189074821345, 0.2531689217803784], [66.0659399032425, 0.11831369677370343, 5.999999999999999], [69.48413784382588, 0.42466342337983104, 0.2550063880575046]], "peak_params_": [[2.652628991592828, 0.2222755437136993, 1.7371879077790886], [9.631550380190475, 0.48771767746052613, 3.1382926948997794], [15.916538091949064, 0.2055637336202616, 1.1017543577587847], [44.46052544536218, 0.16895737023443336, 0.5524665122752653], [55.424305667174245, 0.1848405346318691, 0.5008369486561457], [58.56793447184273, 0.21347893355946468, 0.5063378435607568], [66.0659399032425, 0.11830655204034501, 11.999999999999998], [69.48413784382588, 0.17502171879377215, 0.5100127761150092]], "r_squared_": 0.9829759075234542, "error_": 0.053456095656085646}
{"freq_range": [2.0, 80.0], "freq_res": 1.0, "aperiodic_params_": [0.8377357207810301, 1.240136898060903], "gaussian_params_": [[2.6759691537839214, 0.26919886432245144, 0.7942891680764622], [9.630638558601333, 0.5399759190679702, 1.5251238172529529], [15.270999006713247, 0.1852603735519537, 1.5524839732462046], [28.524219687732963, 0.6374926435224307, 0.28301642952178824], [44.333834776807905, 0.18549775113526168, 0.6901524183542642], [50.91950907494851, 0.20068121853546936, 1.1058756119659392], [55.41814591270669, 0.6303700857423089, 0.2760428548805587], [58.56044706954652, 0.5338966483128823, 0.2827825455764244], [65.74697475063324, 0.11993691482133441, 4.732270687752902], [74.64465075398611, 0.10605760855405356, 1.3916217161395221]], "peak_params_": [[2.6759691537839214, 0.24774744426509154, 1.5885783361529244], [9.630638558601333, 0.5249517867829683, 3.0502476345059057], [15.270999006713247, 0.18355803365727363, 3.104967946492409], [28.524219687732963, 0.1551645024771372, 0.5660328590435765], [44.333834776807905, 0.16502106599534572, 1.3803048367085284], [50.91950907494851, 0.2010840877045752, 2.2117512239318784], [55.41814591270669, 0.2094619141512537, 0.5520857097611174], [58.56044706954652, 0.20292249205672896, 0.5655650911528488], [65.74697475063324, 0.1197655980171708, 9.464541375505805], [74.64465075398611, 0.12038752754110482, 2.7832434322790442]], "r_squared_": 0.9878270300025819, "error_": 0.042472665937884777}
{"freq_range": [2.0, 80.0], "freq_res": 1.0, "aperiodic_params_": [0.7824040016918982, 1.207638154891648], "gaussian_params_": [[2.5226298942251337, 0.9410274628520798, 0.2711329171506298], [9.449428694700444, 0.5756177282332725, 1.3968408619472317], [14.659252157366323, 0.21530609714102633, 2.296969325799707], [28.533823667454445, 1.0506927233100782, 0.2506221380647033], [44.48567002009059, 0.20570059494620604, 0.6557088739534253], [50.91533465292632, 0.1936120819037617, 1.0880222295932431], [55.43958602991282, 1.0946180954388312, 0.2500097089521112], [58.53928271074079, 0.9158159074483686, 0.2559741895769743], [63.96372849185991, 0.14319026134527765, 2.7508590089339133], [69.71149880751402, 0.18478862519711645, 0.6680275930698847], [75.4708567174891, 0.11165066727089715, 2.7220235464843183]], "peak_params_": [[2.5226298942251337, 0.19975646642505174, 0.5422658343012596], [9.449428694700444, 0.5569308566974635, 2.7936817238944633], [14.659252157366323, 0.21316446881258255, 4.593938651599414], [28.533823667454445, 0.18628221303465198, 0.5012442761294066], [44.48567002009059, 0.15635338660365705, 1.3114177479068505], [50.91533465292632, 0.19302893307143054, 2.1760444591864863], [55.43958602991282, 0.23419282008693165, 0.5000194179042224], [58.53928271074079, 0.20939688668678658, 0.5119483791539486], [63.96372849185991, 0.1431933611658971, 5.501718017867827], [69.71149880751402, 0.19604246985402418, 1.3360551861397694], [75.4708567174891, 0.11003847516536669, 5.444047092968637]], "r_squared_": 0.9890510789331037, "error_": 0.038084053894898835}
{"freq_range": [2.0, 80.0], "freq_res": 1.0, "aperiodic_params_": [0.5533887805325336, 1.0831999491088125], "gaussian_params_": [[9.051007130070174, 0.6291993288880742, 1.2123303709515485], [12.538958709202921, 0.21471620515335677, 1.9279065573903582], [16.543558412145305, 0.1546453525282928, 1.2192961129041218], [28.562065313933807, 0.6922514128001942, 0.2743033061624639], [44.51071297477737, 0.7094971805010414, 0.30845890785669333], [50.85032114123934, 0.19634300422725545, 0.9592014890571596], [55.42303481990331, 0.5558467455313368, 0.2758873031165818], [58.54894244379615, 0.6537417660417679, 0.2804423947182726], [67.54796539729927, 0.10611467795760618, 5.999999999999999]], "peak_params_": [[9.051007130070174, 0.6684684588738165, 2.424660741903097], [12.538958709202921, 0.21405402991543887, 3.8558131147807164], [16.543558412145305, 0.15894434745824138, 2.4385922258082435], [28.562065313933807, 0.19354073977425656, 0.5486066123249278], [44.51071297477737, 0.2017327281707164, 0.6169178157133867], [50.85032114123934, 0.19633313556502374, 1.9184029781143193], [55.42303481990331, 0.18348412998544839, 0.5517746062331635], [58.54894244379615, 0.21780063880276335, 0.5608847894365452], [67.54796539729927, 0.10581395248948589, 11.999999999999998]], "r_squared_": 0.9791663630350453, "error_": 0.0461638183853591}
{"freq_range": [2.0, 80.0], "freq_res": 1.0, "aperiodic_params_": [0.1336561277920201, 0.8589547584157444], "gaussian_params_": [[9.187503463055773, 0.7513202414254071, 1.2977870015316713], [55.090137554170646, 0.1376163202891551, 0.2501156828470729], [62.09581988961078, 0.1261888367120861, 5.999999999999999]], "peak_params_": [[9.187503463055773, 0.7435193826789279, 2.5955740030633425], [55.090137554170646, 0.1916702350365458, 0.5002313656941458], [62.09581988961078, 0.12617274611787965, 11.999999999999998]], "r_squared_": 0.9474130723371521, "error_": 0.06522949267552475}
{"freq_range": [2.0, 80.0], "freq_res": 1.0, "aperiodic_params_": [0.0923845253516267, 0.7913950476223929], "gaussian_params_": [[7.6693053681279855, 0.44625053670229164, 0.30448624980035494], [9.56815490756417, 0.7724982006153138, 1.0221698818826475], [37.27844352157154, 0.1377690480787515, 5.999999999999999], [37.404601122860576, 0.28212334436723546, 0.25063132031007995], [50.931874832198, 0.18345536647941513, 0.7177690343628054], [52.93001861483951, 0.15666419783467042, 0.25001601313081234], [61.36734205205102, 0.13102623301155128, 5.9999999994777555]], "peak_params_": [[7.6693053681279855, 0.48555823760462147, 0.6089724996007099], [9.56815490756417, 0.7065485010947747, 2.044339763765295], [37.27844352157154, 0.21431029572616678, 11.999999999999998], [37.404601122860576, 0.21431029572616678, 0.5012626406201599], [50.931874832198, 0.22215809788061502, 1.4355380687256107], [52.93001861483951, 0.20753491546608238, 0.5000320262616247], [61.36734205205102, 0.13083648114046342, 11.999999998955511]], "r_squared_": 0.9561406560426872, "error_": 0.05384811919469551}
{"freq_range": [2.0, 80.0], "freq_res": 1.0, "aperiodic_params_": [0.6078005526482848, 1.1466847638912374], "gaussian_params_": [[8.07825184806931, 0.33947770746549855, 0.5513195112385663], [9.813130189550064, 0.7847651002811724, 0.9271186273222016], [12.572164677733918, 0.5795597821212205, 0.27659334975229694], [50.78737157514127, 0.18915194881510244, 0.6944815628431761], [58.913767782278825, 0.1527472290379143, 0.250020679436283], [61.48346054192685, 0.10537136159080174, 5.999999225185003], [69.76109893414578, 0.16198695370104949, 0.6341099804096905], [74.33964382558499, 0.14605870766327933, 0.9640970341426184]], "peak_params_": [[8.07825184806931, 0.45201602424116255, 1.1026390224771325], [9.813130189550064, 0.7697654203173874, 1.8542372546444033], [12.572164677733918, 0.17734031323128946, 0.5531866995045939], [50.78737157514127, 0.20338928077013607, 1.3889631256863522], [58.913767782278825, 0.24064797091682189, 0.500041358872566], [61.48346054192685, 0.10502984835446494, 11.999998450370006], [69.76109893414578, 0.18937384340592356, 1.268219960819381], [74.33964382558499, 0.1492309886411083, 1.9281940682852368]], "r_squared_": 0.9830362040104904, "error_": 0.04626355202943466}
{"freq_range": [2.0, 80.0], "freq_res": 1.0, "aperiodic_params_": [0.8250990829112169, 1.2632563176732414], "gaussian_params_": [[8.300824251843787, 0.47189751404535385, 0.4733869625185321], [9.927742467843919, 0.7436930335695879, 0.8287690154844239], [12.784483247233572, 0.23288472330929944, 0.7039631077617439], [16.40057800642039, 0.16250841755351575, 0.9553578892652521], [44.4340727804609, 0.577765332324631, 0.2766642692631881], [50.94881856769744, 0.1818046060631004, 1.097675673474174], [55.40350171966306, 0.5121536472413561, 0.265065411706107], [58.55903766147984, 0.8032801271043836, 0.282028015012318], [62.34044350801227, 0.1536995246740258, 1.0821868990986425], [66.03667235394762, 0.15129093365393345, 1.0908016546425163], [69.8302896314851, 0.2003248987697942, 0.8771375410270618], [74.63617752484048, 0.1366785824422817, 1.3572968567297246]], "peak_params_": [[8.300824251843787, 0.43533936269467327, 0.9467739250370641], [9.927742467843919, 0.7417169921273253, 1.6575380309688479], [12.784483247233572, 0.22328249192241745, 1.4079262155234877], [16.40057800642039, 0.14883989978901369, 1.9107157785305042], [44.4340727804609, 0.1687407662839333, 0.5533285385263762], [50.94881856769744, 0.18160708398280434, 2.195351346948348], [55.40350171966306, 0.16096931030970252, 0.530130823412214], [58.55903766147984, 0.23791183012525963, 0.564056030024636], [62.34044350801227, 0.1464398286297779, 2.164373798197285], [66.03667235394762, 0.15172518775025923, 2.1816033092850327], [69.8302896314851, 0.19721591105566016, 1.7542750820541235], [74.63617752484048, 0.13185553417208773, 2.714593713459449]], "r_squared_": 0.9891703207390466, "error_": 0.03930163702237066}
{"freq_range": [2.0, 80.0], "freq_res": 1.0, "aperiodic_params_": [0.9024756134196985, 1.2848579726064784], "gaussian_params_": [[8.131282668154917, 0.40809569701004145, 0.5017295509283723], [9.86753185916119, 0.6264794515423301, 0.8655621769060048], [12.894182029316324, 0.21190017880978543, 0.9681895321520037], [15.865806485988667, 0.217126225373279, 0.6880811938003076], [44.35026771863375, 0.211480723496974, 0.6764207363671038], [50.903730667177285, 0.2105438052520699, 1.1295654442601162], [55.3903203495705, 0.7112318370962994, 0.2566865215655395], [58.55875757755209, 0.7997514610811014, 0.2670035804845657], [63.696833780043036, 0.15297209604633435, 3.119057065043586], [69.52803023559869, 0.40041128101645823, 0.29953681178508224], [75.35271172317384, 0.11360952341745117, 5.239259140355213]], "peak_params_": [[8.131282668154917, 0.4554622324745854, 1.0034591018567447], [9.86753185916119, 0.6220130293953389, 1.7311243538120096], [12.894182029316324, 0.2115727070211738, 1.9363790643040073], [15.865806485988667, 0.2142708635837003, 1.3761623876006153], [44.35026771863375, 0.1849457229558935, 1.3528414727342075], [50.903730667177285, 0.2098214234438356, 2.2591308885202324], [55.3903203495705, 0.22731581264812428, 0.513373043131079], [58.55875757755209, 0.25423881903832735, 0.5340071609691314], [63.696833780043036, 0.16311176631010826, 6.238114130087172], [69.52803023559869, 0.20298330933930897, 0.5990736235701645], [75.35271172317384, 0.11356759113374637, 10.478518280710427]], "r_squared_": 0.9849867628431227, "error_": 0.044255546067015705}
{"freq_range": [2.0, 80.0], "freq_res": 1.0, "aperiodic_params_": [0.7538659597756322, 1.1702718536760641], "gaussian_params_": [[2.9946708465252407, 0.20848551602083512, 0.7697611632832732], [9.42778598599047, 0.5871295290029566, 1.3436671283739396], [14.367207685261754, 0.1842538925119442, 2.0937590931004135], [50.908940071384336, 0.20086817569285928, 1.1338221700589037], [55.37352795104712, 0.6114794982450871, 0.2506396221661598], [58.561402814497384, 0.9027267837988259, 0.25029100812176497], [67.52734591569643, 0.14222259554209818, 5.9999999999863585], [69.59185560406942, 0.29714705972442684, 0.25000548938025]], "peak_params_": [[2.9946708465252407, 0.20848689463983217, 1.5395223265665463], [9.42778598599047, 0.5650095371066763, 2.6873342567478793], [14.367207685261754, 0.1832382143636716, 4.187518186200827], [50.908940071384336, 0.20342284788339593, 2.2676443401178075], [55.37352795104712, 0.21780063926078452, 0.5012792443323196], [58.561402814497384, 0.24623026497544176, 0.5005820162435299], [67.52734591569643, 0.1417819910886664, 11.999999999972717], [69.59185560406942, 0.20902892313036658, 0.5000109787605]], "r_squared_": 0.9807181187004137, "error_": 0.052045646663902025}
{"freq_range": [2.0, 80.0], "freq_res": 1.0, "aperiodic_params_": [0.6575891692882228, 1.0996808447897228], "gaussian_params_": [[2.950656699441797, 0.1874354613985216, 0.6926695740486363], [8.186315128339187, 0.28416682546670013, 0.4594477441221301], [9.727448732095088, 0.5245849486609033, 1.2040442829779827], [14.341143682276503, 0.17904632809802848, 2.160740776849634], [28.540454791169854, 0.8652326153963646, 0.2521513954691397], [44.544618388258144, 0.22531685593530365, 0.6266436415546223], [50.85204491034583, 0.2130082064575391, 1.1082121230669417], [55.394088943787445, 0.7467541375039521, 0.2601837375925922], [58.5448210674228, 0.852445444217776, 0.2672115367762781], [61.291105455582375, 0.22301506621969122, 0.2518120775208426], [67.54796473941576, 0.13823489514009613, 5.999999986601649], [69.760139380661, 0.14604423374395997, 0.25004066265777336]], "peak_params_": [[2.950656699441797, 0.1869607554383096, 1.3853391480972725], [8.186315128339187, 0.4515830685226663, 0.9188954882442602], [9.727448732095088, 0.5352264341966153, 2.4080885659559654], [14.341143682276503, 0.1777958663232173, 4.321481553699268], [28.540454791169854, 0.16439143682494328, 0.5043027909382795], [44.544618388258144, 0.17314816282354573, 1.2532872831092445], [50.85204491034583, 0.21420061137151958, 2.2164242461338834], [55.394088943787445, 0.25285175273814087, 0.5203674751851844], [58.5448210674228, 0.2498927751283413, 0.5344230735525562], [61.291105455582375, 0.1905296139800603, 0.5036241550416852], [67.54796473941576, 0.13784314090685346, 11.999999973203298], [69.760139380661, 0.21934491736626915, 0.5000813253155467]], "r_squared_": 0.9846643237553981, "error_": 0.040851106535079264}
{"freq_range": [2.0, 80.0], "freq_res": 1.0, "aperiodic_params_": [0.2953814070461192, 0.8483801922321509], "gaussian_params_": [[2.6433312416907095, 0.2899653669055733, 0.9162040071947503], [9.073458758185708, 0.5900349160471593, 1.2478644597866642], [13.515944973018543, 0.1582960704826242, 2.3658217290702632], [28.574739057827003, 0.5228861047421306, 0.2784624120127217], [44.626611285215056, 0.25822098950172706, 0.5541708117520343], [50.767813711554176, 0.18577908385767378, 1.0633429342884977], [55.365267173225305, 0.5266330629572082, 0.275364144676034], [58.57841046732582, 0.5744968644051324, 0.2884277176189061], [66.22357184054742, 0.11904950144751696, 5.999999999999999], [69.54522234939976, 0.25895588587906676, 0.3021089376768438]], "peak_params_": [[2.6433312416907095, 0.2688179021710296, 1.8324080143895005], [9.073458758185708, 0.6146150903554296, 2.4957289195733283], [13.515944973018543, 0.15526056102569563, 4.7316434581405264], [28.574739057827003, 0.1629154472793818, 0.5569248240254434], [44.626611285215056, 0.20601240250288044, 1.1083416235040686], [50.767813711554176, 0.18616469151044157, 2.1266858685769954], [55.365267173225305, 0.23924959680975377, 0.550728289352068], [58.57841046732582, 0.2550757569463551, 0.5768554352378122], [66.22357184054742, 0.11896688271119182, 11.999999999999998], [69.54522234939976, 0.18105563809748149, 0.6042178753536877]], "r_squared_": 0.9756546878427296, "error_": 0.0429295657770694}
{"freq_range": [2.0, 80.0], "freq_res": 1.0, "aperiodic_params_": [-0.01023450132292855, 0.6392492268241263], "gaussian_params_": [[9.00026173401836, 0.6469963880100129, 1.2075407640748215], [41.087865589062645, 0.19416052808558634, 0.4606421960187081], [44.55269548742715, 0.5945563104379639, 0.31200478203410625], [55.00469415658805, 0.11767480842567565, 0.2500012659723419], [58.181799124899705, 0.1283316517951168, 5.999999999999772], [65.42558396650435, 0.4016613875007728, 0.28458734589958223], [67.42656628785765, 0.3748499055881644, 0.3042642311927743], [69.97892694182919, 0.1677861375594463, 0.711897438165244]], "peak_params_": [[9.00026173401836, 0.6469963728119377, 2.415081528149643], [41.087865589062645, 0.19278667501897517, 0.9212843920374162], [44.55269548742715, 0.22424350817232752, 0.6240095640682125], [55.00469415658805, 0.22915232548771924, 0.5000025319446838], [58.181799124899705, 0.12827275587798992, 11.999999999999543], [65.42558396650435, 0.19857959814759596, 0.5691746917991645], [67.42656628785765, 0.1839065426999661, 0.6085284623855486], [69.97892694182919, 0.18615700325989226, 1.423794876330488]], "r_squared_": 0.9134588720328594, "error_": 0.05916580151569382}
{"freq_range": [2.0, 80.0], "freq_res": 1.0, "aperiodic_params_": [-0.3955269384510558, 0.746321440062338], "gaussian_params_": [[7.927523867870547, 0.4559452149645824, 0.48878589891625207], [9.669321744245147, 0.8559921678489694, 1.051286311652027], [50.45203459913595, 0.13352828644555884, 5.999999999999999], [58.507833973504226, 0.6575289188718527, 0.2502173987445375], [65.54796538615213, 0.09730162875969943, 5.999994894163859]], "peak_params_": [[7.927523867870547, 0.6935986878380916, 0.9775717978325041], [9.669321744245147, 0.8147337372946697, 2.102572623304054], [50.45203459913595, 0.13653814604803127, 11.999999999999998], [58.507833973504226, 0.1970554605994772, 0.500434797489075], [65.54796538615213, 0.10167567800813115, 11.999989788327717]], "r_squared_": 0.950712406185333, "error_": 0.05744854701380162}
{"freq_range": [2.0, 80.0], "freq_res": 1.0, "aperiodic_params_": [0.23636365141334875, 0.9219380171790189], "gaussian_params_": [[7.95716428474692, 0.3591269295595324, 0.4574394567010512], [9.642796546633928, 0.8476231773477708, 1.0763187621200987], [49.96017552088457, 0.10634758077479424, 5.999999999999999], [52.99611376968799, 0.13992627854828985, 0.2500010425971893], [58.570913347969054, 0.6836850525723434, 0.27965427355190237], [62.60430888025489, 0.49769804798111594, 0.27725138373385844], [70.60856452542657, 0.09216116971762138, 5.999999999976529]], "peak_params_": [[7.95716428474692, 0.6219984563904565, 0.9148789134021024], [9.642796546633928, 0.8022229162075497, 2.1526375242401974], [49.96017552088457, 0.10659801414689962, 11.999999999999998], [52.99611376968799, 0.23469027845303603, 0.5000020851943786], [58.570913347969054, 0.2590538874707238, 0.5593085471038047], [62.60430888025489, 0.23101683892096814, 0.5545027674677169], [70.60856452542657, 0.09219253930643045, 11.999999999953058]], "r_squared_": 0.9702760970159077, "error_": 0.05111338238055465}
{"freq_range": [2.0, 80.0], "freq_res": 1.0, "aperiodic_params_": [0.6562226874988802, 1.130791797517694], "gaussian_params_": [[7.861389971347173, 0.4724495178624267, 0.26275587210863394], [9.674302958829806, 0.7593589172739389, 0.846380923280092], [12.0284733964424, 0.15943788004087942, 2.533811041428383], [50.82111200344534, 0.19321510113182394, 1.2998206930607623], [55.39093797664025, 0.564146782257121, 0.27051993423910237], [58.59273730092485, 0.7371023119587421, 0.29756727225791463], [62.2246080284531, 0.17345451437189058, 1.3576923855818184], [65.75452127659031, 0.13076701235136068, 1.1592161095408329], [69.85092283360015, 0.22439134407758868, 0.921986461176909]], "peak_params_": [[7.861389971347173, 0.5634557309063714, 0.5255117442172679], [9.674302958829806, 0.8208905694345477, 1.692761846560184], [12.0284733964424, 0.17684112016689263, 5.067622082856766], [50.82111200344534, 0.1913939258666113, 2.5996413861215246], [55.39093797664025, 0.19966356931091034, 0.5410398684782047], [58.59273730092485, 0.29925065533699646, 0.5951345445158293], [62.2246080284531, 0.17178670497047688, 2.7153847711636367], [65.75452127659031, 0.13153568496026735, 2.3184322190816657], [69.85092283360015, 0.22163711764138938, 1.843972922353818]], "r_squared_": 0.980890756621093, "error_": 0.0496790452215168}
{"freq_range": [2.0, 80.0], "freq_res": 1.0, "aperiodic_params_": [0.7391036332444838, 1.1371845767843702], "gaussian_params_": [[8.087157878557537, 0.30541432923463674, 0.2500298989530713], [9.726654298683048, 0.6552870928430251, 1.241010328119315], [50.712791363407476, 0.20914204947055295, 1.1332816535722985], [55.34122233080958, 0.5409522678475517, 0.2540283508416371], [58.571951789399854, 0.6973662252433763, 0.2718098324218005], [66.41293527654618, 0.1348307427729503, 5.999999999999999], [69.54844811096417, 0.417203157383274, 0.2836070067984434]], "peak_params_": [[8.087157878557537, 0.5363413052158188, 0.5000597979061426], [9.726654298683048, 0.6395827940305094, 2.48202065623863], [50.712791363407476, 0.20750828519168807, 2.266563307144597], [55.34122233080958, 0.24171037187106403, 0.5080567016832742], [58.571951789399854, 0.26465814046069425, 0.543619664843601], [66.41293527654618, 0.13451180479252112, 11.999999999999998], [69.54844811096417, 0.23022154491343438, 0.5672140135968868]], "r_squared_": 0.9743404514311997, "error_": 0.05445414306226703}
{"freq_range": [2.0, 80.0], "freq_res": 1.0, "aperiodic_params_": [0.5508277294419802, 0.9672822151114369], "gaussian_params_": [[8.388916579882189, 0.8804139944994563, 0.2644882785334691], [9.758679445227465, 0.5172121640210902, 1.3688308761406551], [50.60111932728413, 0.208721639003981, 1.1890474215035245], [55.38102403236166, 0.7217466528546937, 0.250007415305771], [58.56519448333568, 0.7481402183450305, 0.2691707968916147], [65.69196264878973, 0.13703002735213707, 5.999999999999999], [69.53841001994965, 0.4957358415837878, 0.26945440435356754]], "peak_params_": [[8.388916579882189, 0.5252315572305608, 0.5289765570669382], [9.758679445227465, 0.5092366772654778, 2.7376617522813103], [50.60111932728413, 0.2041378860903762, 2.378094843007049], [55.38102403236166, 0.2541783358664774, 0.500014830611542], [58.56519448333568, 0.2765088126709476, 0.5383415937832294], [65.69196264878973, 0.1368495578305695, 11.999999999999998], [69.53841001994965, 0.22018654718380049, 0.5389088087071351]], "r_squared_": 0.9563924098629394, "error_": 0.06001720092318652}
{"freq_range": [2.0, 80.0], "freq_res": 1.0, "aperiodic_params_": [-0.12633718319973541, 0.4226135607549601], "gaussian_params_": [[2.538116617099818, 0.36746749587606775, 1.1398254867642628], [8.193277722508585, 0.5467191099891696, 0.6608164867413808], [10.005086481241857, 0.41749037497133135, 0.7742695398016535], [41.002946111632546, 0.22458418820290274, 0.5138076143245686], [44.78498904355533, 0.23732357422941344, 0.806285645788289], [50.481506700806044, 0.20849814443795067, 1.3644236420048719], [55.38086223873645, 0.5766878769077135, 0.26950405925265764], [58.5505177015043, 0.869324962709902, 0.26542708989695724], [64.7448908315776, 0.13096861391718087, 4.795890284715086]], "peak_params_": [[2.538116617099818, 0.3385027008024609, 2.2796509735285255], [8.193277722508585, 0.5384324793516634, 1.3216329734827617], [10.005086481241857, 0.43049959121676795, 1.548539079603307], [41.002946111632546, 0.22458501007288656, 1.0276152286491371], [44.78498904355533, 0.2291260816677252, 1.612571291576578], [50.481506700806044, 0.1970713693467836, 2.7288472840097437], [55.38086223873645, 0.2299429147839569, 0.5390081185053153], [58.5505177015043, 0.27114882003641605, 0.5308541797939145], [64.7448908315776, 0.1307834553907975, 9.591780569430172]], "r_squared_": 0.912099063185105, "error_": 0.04693642387836306}
{"freq_range": [2.0, 80.0], "freq_res": 1.0, "aperiodic_params_": [-0.6169924201448651, -0.043635148660947996], "gaussian_params_": [[7.970925561022946, 0.36754131920638927, 0.4037626679081192], [9.455156764676104, 0.3405534542010159, 0.524301895515986], [14.674252885074985, 0.31798583794468305, 0.6423881113790892], [25.085780582699297, 0.20830240534526867, 0.31930688463683643], [28.65148780507013, 0.23828870860435955, 1.660577370818187], [32.73246095388357, 0.24573359874516532, 1.382194775077098], [36.830115740582286, 0.17583480327204695, 1.849436591009761], [40.884339579296324, 0.27993462334119595, 0.6167070395193849], [44.84580273864543, 0.3010082798988754, 1.1021062447644079], [50.33647339436978, 0.2660845799701034, 1.489022154638542], [55.4259002993316, 0.8706933129362929, 0.2637323538224422], [58.57753929065731, 0.31705521758142213, 0.43527722737054847], [63.61428012256212, 0.11517965563203068, 4.002508870502718]], "peak_params_": [[7.970925561022946, 0.37382588529790695, 0.8075253358162384], [9.455156764676104, 0.24791427236508967, 1.048603791031972], [14.674252885074985, 0.2796217718894797, 1.2847762227581785], [25.085780582699297, 0.22215887559572756, 0.6386137692736729], [28.65148780507013, 0.23953283974127415, 3.321154741636374], [32.73246095388357, 0.2694964564816307, 2.764389550154196], [36.830115740582286, 0.17718683509289668, 3.698873182019522], [40.884339579296324, 0.28958034210129463, 1.2334140790387698], [44.84580273864543, 0.29852145006414005, 2.2042124895288158], [50.33647339436978, 0.2597365271424511, 2.978044309277084], [55.4259002993316, 0.2496941561059745, 0.5274647076448844], [58.57753929065731, 0.2572261700281552, 0.8705544547410969], [63.61428012256212, 0.11464605384940174, 8.005017741005435]], "r_squared_": 0.6680363754575213, "error_": 0.04846504071296673}
{"freq_range": [2.0, 80.0], "freq_res": 1.0, "aperiodic_params_": [0.3488657434928421, 0.8781114891861411], "gaussian_params_": [[8.018176089001077, 0.3588261736266933, 0.2508861877486414], [9.672437102506676, 0.8579484163203414, 1.1071907697453915], [41.01536249198296, 0.17964452053883112, 0.2500003872235855], [55.0708066790996, 0.15294619673015175, 5.999999999999999], [58.949328413444505, 0.18115570390881403, 0.2500000629019338]], "peak_params_": [[8.018176089001077, 0.6320436103648474, 0.5017723754972828], [9.672437102506676, 0.8212111229295576, 2.214381539490783], [41.01536249198296, 0.18908487107756522, 0.500000774447171], [55.0708066790996, 0.15293554697759837, 11.999999999999998], [58.949328413444505, 0.3009010306089571, 0.5000001258038675]], "r_squared_": 0.9598305610339253, "error_": 0.05981041160740254}
{"freq_range": [2.0, 80.0], "freq_res": 1.0, "aperiodic_params_": [0.3161885099412515, 0.7827270670818803], "gaussian_params_": [[7.728512558761198, 0.5159529011688309, 0.26005113128362795], [9.58399703312734, 0.7526268626539848, 1.1648644211942762], [43.64873717611979, 0.1270164657933352, 5.999999999999999], [55.02778110681432, 0.15459573653880226, 0.2500051941062823], [61.54796540086401, 0.1675176973199098, 5.999999999999999]], "peak_params_": [[7.728512558761198, 0.5977638332083405, 0.5201022625672559], [9.58399703312734, 0.7061306177378166, 2.3297288423885525], [43.64873717611979, 0.12912526061912333, 11.999999999999998], [55.02778110681432, 0.267209873336973, 0.5000103882125646], [61.54796540086401, 0.1682246784834338, 11.999999999999998]], "r_squared_": 0.9345214040870194, "error_": 0.06564912995545517}
{"freq_range": [2.0, 80.0], "freq_res": 1.0, "aperiodic_params_": [0.13330519701539398, 0.5710862676577073], "gaussian_params_": [[8.444958697300088, 0.688111097923706, 0.7468861637009311], [10.41957722818038, 0.7918113374063884, 0.37716959385595406], [40.760514037238885, 0.22512219516719764, 0.5283964319606287], [44.77944092049429, 0.25356345653992646, 0.9578844426308053], [50.439234101170534, 0.23123922331847382, 1.1998681520492145], [55.02962690205466, 0.16798728466644045, 0.2500006177804746], [61.54796540086405, 0.14562699465114795, 5.999999999651458]], "peak_params_": [[8.444958697300088, 0.5762204225527926, 1.4937723274018622], [10.41957722818038, 0.5052491578385323, 0.7543391877119081], [40.760514037238885, 0.203666896824372, 1.0567928639212574], [44.77944092049429, 0.25018518941569146, 1.9157688852616106], [50.439234101170534, 0.23910180087290345, 2.399736304098429], [55.02962690205466, 0.24726276886403464, 0.5000012355609492], [61.54796540086405, 0.14521429259808938, 11.999999999302917]], "r_squared_": 0.8765700244518861, "error_": 0.0669995548242421}
{"freq_range": [2.0, 80.0], "freq_res": 1.0, "aperiodic_params_": [-0.964888979888373, 0.5062310525566048], "gaussian_params_": [[9.059064136262952, 0.3530756014542861, 1.1025870794784856], [33.19335125452284, 0.2420036258444509, 5.999999999999999], [44.177469966555705, 0.15217702956229343, 1.9398209590497717], [51.23767583066574, 0.223448241657219, 1.288802152039204], [60.32240742013388, 0.15439548077304396, 4.912101714578948]], "peak_params_": [[9.059064136262952, 0.35264069911898965, 2.205174158956971], [33.19335125452284, 0.24187804134841207, 11.999999999999998], [44.177469966555705, 0.1999562481438415, 3.8796419180995434], [51.23767583066574, 0.24845222510638743, 2.577604304078408], [60.32240742013388, 0.15407447433708832, 9.824203429157896]], "r_squared_": 0.8971838851203369, "error_": 0.05044275910760257}
{"freq_range": [2.0, 80.0], "freq_res": 1.0, "aperiodic_params_": [0.09168356395460592, 0.8380525607984304], "gaussian_params_": [[8.443207572604686, 0.3268772485439817, 0.7121596939056152], [10.415288738681028, 0.8935322949097232, 0.28965747563919614], [28.233577648728524, 0.19411354864031005, 1.456765680934219], [31.456118037389988, 0.9044977907124484, 0.2514319844713033], [33.528869515774325, 1.0141176330221249, 0.26991340427473504], [37.741753502175456, 0.14504796025638986, 2.118423763816233], [43.061040461373224, 0.14058645100822187, 1.136396784348788], [45.36265906001246, 0.6138527591916829, 0.25194817475797376], [51.223254470628866, 0.21082468885788136, 1.631927323933821], [55.44951327620601, 0.9319297109602488, 0.25001150062145794], [59.56249959711412, 0.1255873789195225, 1.7652173067929808], [64.55197174212304, 0.7933418390298925, 0.2568790837153358]], "peak_params_": [[8.443207572604686, 0.2693278291063834, 1.4243193878112304], [10.415288738681028, 0.34967735319536514, 0.5793149512783923], [28.233577648728524, 0.19163800757243166, 2.913531361868438], [31.456118037389988, 0.2074048957411685, 0.5028639689426067], [33.528869515774325, 0.25161477223482576, 0.5398268085494701], [37.741753502175456, 0.1439811211455606, 4.236847527632466], [43.061040461373224, 0.14704716146111707, 2.272793568697576], [45.36265906001246, 0.2511954589519463, 0.5038963495159475], [51.223254470628866, 0.20886203535454673, 3.263854647867642], [55.44951327620601, 0.20403595336427127, 0.5000230012429159], [59.56249959711412, 0.12178888324563375, 3.5304346135859617], [64.55197174212304, 0.1744361891925852, 0.5137581674306716]], "r_squared_": 0.9707697699821106, "error_": 0.04100733567732533}
{"freq_range": [2.0, 80.0], "freq_res": 1.0, "aperiodic_params_": [-0.12823804662113636, 0.7151568961021714], "gaussian_params_": [[2.5363585613396222, 0.8240536008657867, 0.2754873172143057], [7.543343006410238, 1.699769003131622, 0.26207122886646445], [9.524501842866869, 0.5100756395377996, 0.8053035349916898], [28.447822010594162, 0.21950915095103016, 1.3453837890153386], [31.47419065900495, 1.0824886576460147, 0.2578297646175984], [33.61336187843959, 0.34986338777630305, 0.5334383191856925], [37.84603694676594, 0.2553949324894339, 1.6416386460859078], [42.30129200525831, 0.17327822292324788, 1.1530469350856118], [44.94777360095093, 0.2083285203229199, 0.7805619022552065], [51.41436643546501, 0.2058668184603417, 1.6915165722516865], [55.44249716898034, 0.7964695936317272, 0.25001366535630215], [58.6250208756106, 0.5232833602725196, 0.27871159322128747], [61.163532161388424, 0.17544133269363713, 0.48083448771644643], [64.59326437783403, 0.6864984701332942, 0.2552978255689836]], "peak_params_": [[2.5363585613396222, 0.19993929196178484, 0.5509746344286114], [7.543343006410238, 0.45745531046702825, 0.5241424577329289], [9.524501842866869, 0.4284776272447325, 1.6106070699833797], [28.447822010594162, 0.20767963040061388, 2.6907675780306772], [31.47419065900495, 0.23584467763115957, 0.5156595292351968], [33.61336187843959, 0.2855064448639696, 1.066876638371385], [37.84603694676594, 0.25443900563603794, 3.2832772921718156], [42.30129200525831, 0.17802509270557243, 2.3060938701712237], [44.94777360095093, 0.2192373069956779, 1.561123804510413], [51.41436643546501, 0.19978163221692968, 3.383033144503373], [55.44249716898034, 0.18809220942616456, 0.5000273307126043], [58.6250208756106, 0.21169465724260395, 0.5574231864425749], [61.163532161388424, 0.1655826686402846, 0.9616689754328929], [64.59326437783403, 0.1929616163391914, 0.5105956511379672]], "r_squared_": 0.974648780196658, "error_": 0.03117551649402793}
{"freq_range": [2.0, 80.0], "freq_res": 1.0, "aperiodic_params_": [-0.03217710623528261, 0.7876758783560389], "gaussian_params_": [[7.596589420511351, 1.0002041930841057, 0.2736811768907959], [9.533642395920092, 0.5205401000621506, 0.6954781683011407], [28.528516909057537, 1.210949821061661, 0.26794968985038214], [31.461314144192407, 0.9747802394433684, 0.2585472914651683], [33.50022293632528, 0.8581768938299633, 0.2731664044394098], [38.58367804582361, 0.1992573231934849, 2.5469848067518934], [44.54934628125774, 0.22482454195363297, 0.9468434550238736], [50.452533673135605, 0.20852030625208784, 1.1408360341015806], [52.46196915498016, 0.43430941554936814, 0.2790546979511232], [55.23036684199727, 0.2314089200458231, 0.5498335213832518], [61.31840269644598, 0.3898528281588839, 0.2500000310249059], [64.79249507509391, 0.18170412369553338, 0.6947028219569567]], "peak_params_": [[7.596589420511351, 0.3832745768730691, 0.5473623537815918], [9.533642395920092, 0.41573320734919095, 1.3909563366022815], [28.528516909057537, 0.2576813321935123, 0.5358993797007643], [31.461314144192407, 0.20079619940273585, 0.5170945829303366], [33.50022293632528, 0.20041627428201525, 0.5463328088788196], [38.58367804582361, 0.1966131416027932, 5.093969613503787], [44.54934628125774, 0.20909433061193328, 1.8936869100477471], [50.452533673135605, 0.19275277640053634, 2.2816720682031613], [52.46196915498016, 0.19343073241262032, 0.5581093959022464], [55.23036684199727, 0.21203786939612135, 1.0996670427665036], [61.31840269644598, 0.17324861482798326, 0.5000000620498118], [64.79249507509391, 0.17377650725836657, 1.3894056439139133]], "r_squared_": 0.9616116342888966, "error_": 0.03963147835977175}
