{"freq_range": [2.0, 80.0], "freq_res": 1.0, "aperiodic_params_": [0.03511401066099885, 0.9149889442803086], "gaussian_params_": [[8.518145207921775, 1.5195969289744524, 0.2856102243054324], [10.970843920020306, 0.20917615535132308, 0.555339018643192], [22.506807643573172, 0.5564624350057659, 2.308651933658864], [25.51130492743238, 0.2346371100338911, 0.27816718694885717], [69.59731896087264, 0.15254888514192172, 5.590574318940202], [71.92125087026128, 0.08751732774905555, 0.25000266958509193], [74.45223025511247, 0.636984285282026, 0.27412196059719496], [76.39086996579502, 0.12136572049598468, 0.7806361906407333]], "peak_params_": [[8.518145207921775, 0.36653279873614686, 0.5712204486108649], [10.970843920020306, 0.20889031138813274, 1.110678037286384], [22.506807643573172, 0.5439086099704126, 4.617303867317728], [25.51130492743238, 0.2272687303516998, 0.5563343738977143], [69.59731896087264, 0.15215367745537556, 11.181148637880405], [71.92125087026128, 0.2223730818838574, 0.5000053391701839], [74.45223025511247, 0.27634536707708546, 0.5482439211943899], [76.39086996579502, 0.18624287726132782, 1.5612723812814666]], "r_squared_": 0.971941326380939, "error_": 0.04439909929548791}
{"freq_range": [2.0, 80.0], "freq_res": 1.0, "aperiodic_params_": [0.015773822838687793, 0.8350899259747095], "gaussian_params_": [[8.55932878936207, 0.6126222984122901, 0.5408519705061943], [22.82336830882263, 0.5152075767361726, 2.2418616821103217], [41.49393509489792, 0.6100087874507765, 0.2898416253042409], [46.71427536320075, 0.1682246079297639, 1.3563442661936165], [48.54463507147029, 0.6383124387638699, 0.29146961177493197], [52.43252233855717, 0.1898384750560234, 1.1255170060722568], [56.92922033302789, 0.1996314411418846, 1.2898371905491581], [63.36080363323229, 0.15499137260274728, 1.49445141352125], [68.19378034501213, 0.1821430765888256, 0.6132472798994361], [73.96088982760469, 0.19585112328546622, 5.99999274011718]], "peak_params_": [[8.55932878936207, 0.43958084127208424, 1.0817039410123885], [22.82336830882263, 0.513610969582689, 4.483723364220643], [41.49393509489792, 0.14281729647983, 0.5796832506084818], [46.71427536320075, 0.16454332967126528, 2.712688532387233], [48.54463507147029, 0.23088571132678903, 0.5829392235498639], [52.43252233855717, 0.17678685805938432, 2.2510340121445136], [56.92922033302789, 0.20300302971489925, 2.5796743810983163], [63.36080363323229, 0.18746151607253037, 2.9889028270425], [68.19378034501213, 0.2940891545020061, 1.2264945597988721], [73.96088982760469, 0.1958469625576249, 11.99998548023436]], "r_squared_": 0.9691162430340858, "error_": 0.041512523403326965}
{"freq_range": [2.0, 80.0], "freq_res": 1.0, "aperiodic_params_": [-0.0678855910280719, 0.8020658754474754], "gaussian_params_": [[8.513576961881741, 1.6120815555761059, 0.2665366954440555], [10.69070846079286, 0.21380993680589638, 0.690692823994576], [22.570537010465237, 0.4808617249147875, 2.0987410028562277], [54.489718888119995, 1.1253182888502014, 0.2912913008788461], [56.862945739491344, 0.17112630627117315, 0.6601164253797821], [60.54689521909701, 0.5427585808938479, 0.28313454044000863], [69.42225737873574, 0.6188870377365826, 0.25000468050959884], [71.7002307872419, 0.2981217269078782, 0.5460883436330539], [75.40664368964265, 0.21416719120728794, 0.8607543221600081]], "peak_params_": [[8.513576961881741, 0.31559684963870394, 0.533073390888111], [10.69070846079286, 0.19341267869995404, 1.381385647989152], [22.570537010465237, 0.4708988279896309, 4.197482005712455], [54.489718888119995, 0.2738707243173064, 0.5825826017576922], [56.862945739491344, 0.16747743159347772, 1.3202328507595642], [60.54689521909701, 0.15083080529834803, 0.5662690808800173], [69.42225737873574, 0.1486471925720687, 0.5000093610191977], [71.7002307872419, 0.25650964659315756, 1.0921766872661078], [75.40664368964265, 0.19155276415432065, 1.7215086443200163]], "r_squared_": 0.964130247863344, "error_": 0.042833511713164366}
{"freq_range": [2.0, 80.0], "freq_res": 1.0, "aperiodic_params_": [0.17050765504218407, 1.0102902947088788], "gaussian_params_": [[8.504425903345052, 2.49811296209842, 0.2595204673234109], [10.853321340220809, 0.24704841566802554, 0.7301548514710468], [22.659775108328066, 0.6651938084347093, 2.547306126977718], [24.67560537219315, 0.23350849904587634, 0.25001328988584187]], "peak_params_": [[8.504425903345052, 0.41330674460975914, 0.5190409346468218], [10.853321340220809, 0.24213224183270543, 1.4603097029420935], [22.659775108328066, 0.6592870027304794, 5.094612253955436], [24.67560537219315, 0.5368160457060513, 0.5000265797716837]], "r_squared_": 0.9753265389053616, "error_": 0.057614109130377074}
{"freq_range": [2.0, 80.0], "freq_res": 1.0, "aperiodic_params_": [0.13785099579484272, 0.8486751768718792], "gaussian_params_": [[8.515898466860694, 1.815203516375528, 0.2891161476657918], [22.91398567848105, 0.5769450051496829, 2.0519757043413334], [47.96996747806585, 0.15866846527365674, 1.1407422050590594], [55.09354836118358, 0.1277705786582509, 3.4807214788929075], [64.50863614216358, 0.16993338877067288, 1.7985426210994608], [67.53550335652392, 0.5230687419619688, 0.28728237633454584], [74.01215970403858, 0.1665339803134367, 4.9267103769355804]], "peak_params_": [[8.515898466860694, 0.44680112962629054, 0.5782322953315836], [22.91398567848105, 0.5764383519748948, 4.103951408682667], [47.96996747806585, 0.1746299692816704, 2.281484410118119], [55.09354836118358, 0.1278218114992078, 6.961442957785815], [64.50863614216358, 0.19718774140364492, 3.5970852421989217], [67.53550335652392, 0.24658707873840635, 0.5745647526690917], [74.01215970403858, 0.16653367552547294, 9.853420753871161]], "r_squared_": 0.9670968184775651, "error_": 0.04618458074019479}
{"freq_range": [2.0, 80.0], "freq_res": 1.0, "aperiodic_params_": [0.06455321773032986, 0.8917463563024202], "gaussian_params_": [[8.51587087315737, 1.6850924322074075, 0.2933564430803553], [23.02660936522889, 0.5243662781428512, 2.2259132583461803], [52.59240547731672, 0.601529207691341, 0.29235982543748595], [68.50284363234587, 0.8149874461422691, 0.26554582089773626], [75.34151345409833, 0.14989199096997968, 5.999999999999999]], "peak_params_": [[8.51587087315737, 0.43173580607363693, 0.5867128861607106], [23.02660936522889, 0.5243288117571673, 4.4518265166923605], [52.59240547731672, 0.2277583229691924, 0.5847196508749719], [68.50284363234587, 0.22700397062707034, 0.5310916417954725], [75.34151345409833, 0.14964938031974984, 11.999999999999998]], "r_squared_": 0.9501173918206471, "error_": 0.06383826276696067}
{"freq_range": [2.0, 80.0], "freq_res": 1.0, "aperiodic_params_": [0.0749981038087586, 0.9812841760161408], "gaussian_params_": [[9.0019880172716, 0.4159182691235681, 1.1307765486665513], [19.48466906409939, 0.6121913392684718, 0.3093683622547563], [22.093902647152465, 0.46201429713934894, 0.8741420379243704], [24.644809754837674, 0.3646748555536707, 1.2341422343845574], [54.63602248349622, 0.5731519292227776, 0.6712213252245633], [56.958928824864195, 0.262992171531055, 0.2500018833073456], [62.56317910017271, 0.13796137128176386, 1.0832475352725237], [76.00434058919377, 0.5254031075917153, 1.0258010508171813]], "peak_params_": [[9.0019880172716, 0.4159176263405624, 2.2615530973331026], [19.48466906409939, 0.18033439110487448, 0.6187367245095126], [22.093902647152465, 0.4960536799846871, 1.7482840758487408], [24.644809754837674, 0.3517195130063726, 2.468284468769115], [54.63602248349622, 0.49478683527992007, 1.3424426504491267], [56.958928824864195, 0.26062827012529355, 0.5000037666146911], [62.56317910017271, 0.12718820910707662, 2.1664950705450474], [76.00434058919377, 0.5253984039764841, 2.0516021016343626]], "r_squared_": 0.9773448541533133, "error_": 0.04328519524339591}
{"freq_range": [2.0, 80.0], "freq_res": 1.0, "aperiodic_params_": [0.06763188972433176, 0.9000092139579766], "gaussian_params_": [[8.809619090379973, 0.46174595953610503, 0.8888269501880316], [22.49084572199038, 0.5282084430806643, 2.225583153375609], [24.901147604664555, 0.17264591860121006, 0.6295838987816479], [53.94942931803914, 0.11192815919507523, 4.300103523563986], [62.546958024920826, 0.8584331197713555, 0.2641847510089483], [65.42702657810645, 0.7382698321299369, 0.25567863616235054], [68.55340938397889, 0.6740738306723171, 0.25000617383426404], [74.58581354953294, 0.2024212171861667, 5.999999999999999], [75.57944867985083, 0.608190230175904, 0.25554768039064]], "peak_params_": [[8.809619090379973, 0.4512743476939576, 1.7776539003760632], [22.49084572199038, 0.5155213377240812, 4.451166306751218], [24.901147604664555, 0.4502985356526904, 1.2591677975632958], [53.94942931803914, 0.11248288614287372, 8.600207047127972], [62.546958024920826, 0.24089299786384522, 0.5283695020178966], [65.42702657810645, 0.24363027809649784, 0.5113572723247011], [68.55340938397889, 0.26819257898465376, 0.5000123476685281], [74.58581354953294, 0.24845450470317765, 11.999999999999998], [75.57944867985083, 0.3538919397772784, 0.51109536078128]], "r_squared_": 0.9553416351431172, "error_": 0.056601802314376136}
{"freq_range": [2.0, 80.0], "freq_res": 1.0, "aperiodic_params_": [0.4409514506201747, 1.2177009484906836], "gaussian_params_": [[8.511772717605442, 2.428567785635595, 0.2706534799102667], [10.664736536606359, 0.2590067178020327, 0.6250717236841676], [22.904962560907343, 0.7912126002590111, 2.7720551484523166], [71.54796540086404, 0.10743109972932183, 5.117606345090674]], "peak_params_": [[8.511772717605442, 0.48472771194274533, 0.5413069598205335], [10.664736536606359, 0.2243846098528136, 1.2501434473683353], [22.904962560907343, 0.790747741191996, 5.544110296904633], [71.54796540086404, 0.10701282386524102, 10.235212690181347]], "r_squared_": 0.9878744324044848, "error_": 0.04619478068648679}
{"freq_range": [2.0, 80.0], "freq_res": 1.0, "aperiodic_params_": [0.45604484126991895, 1.2223385154376065], "gaussian_params_": [[8.513136075507925, 2.610503007499681, 0.2624020792015122], [10.757270200599871, 0.2389450938448898, 0.7340977035343806], [22.90313065107695, 0.7823211747688482, 2.778092043865789], [67.89413520042321, 0.14849263513065408, 1.4204078250994199], [74.14440569962565, 0.13993331056720376, 1.6168361317454951]], "peak_params_": [[8.513136075507925, 0.4804737385883881, 0.5248041584030244], [10.757270200599871, 0.2263144996481865, 1.4681954070687613], [22.90313065107695, 0.7818457272478042, 5.556184087731578], [67.89413520042321, 0.14818307620320836, 2.8408156501988397], [74.14440569962565, 0.13939072752378734, 3.2336722634909902]], "r_squared_": 0.9889051967254381, "error_": 0.044106330353392134}
{"freq_range": [2.0, 80.0], "freq_res": 1.0, "aperiodic_params_": [0.5414705727421399, 1.2467609906479016], "gaussian_params_": [[8.515433458312723, 2.357694809118175, 0.27771652040951456], [10.779839729005374, 0.2795130169727855, 0.5413351984760066], [22.77668849988401, 0.8103058297032202, 2.6552652743123337], [70.59849854747806, 0.11614058938088216, 4.0701171807854415]], "peak_params_": [[8.515433458312723, 0.5157768593617189, 0.5554330408190291], [10.779839729005374, 0.25737019068707057, 1.0826703969520133], [22.77668849988401, 0.8074452266718772, 5.3105305486246674], [70.59849854747806, 0.1155768760089626, 8.140234361570883]], "r_squared_": 0.9889693506647865, "error_": 0.04420301394949366}
{"freq_range": [2.0, 80.0], "freq_res": 1.0, "aperiodic_params_": [0.5669598020298455, 1.2405192114364225], "gaussian_params_": [[8.514723803161742, 3.0129278469575036, 0.25908700844577903], [10.798739500691871, 0.24485344002725604, 0.4560340512293402], [22.831833651559222, 0.8507668113313346, 2.5196599280071648], [71.54796540085881, 0.08470823054592848, 4.8375390097095545]], "peak_params_": [[8.514723803161742, 0.5215238629563024, 0.5181740168915581], [10.798739500691871, 0.22214650280919168, 0.9120681024586804], [22.831833651559222, 0.8488740697313338, 5.0393198560143295], [71.54796540085881, 0.08433921698113611, 9.675078019419109]], "r_squared_": 0.9900953199408283, "error_": 0.04026460192055331}
{"freq_range": [2.0, 80.0], "freq_res": 1.0, "aperiodic_params_": [0.36288755378802545, 1.0527268936521974], "gaussian_params_": [[8.515942282686158, 2.1262814838279023, 0.28174749775167124], [10.92695674171584, 0.21903137220855992, 0.25030594954793395], [22.93690486574061, 0.7567609272185883, 2.309703762200282], [28.001156774113674, 0.052773579834442995, 0.9948393086361869], [52.02699411424349, 0.1908711501914228, 0.45700485556917825], [72.17217605139024, 0.10045665560980069, 5.99999999999996]], "peak_params_": [[8.515942282686158, 0.4860314609486225, 0.5634949955033425], [10.92695674171584, 0.20990235023563752, 0.5006118990958679], [22.93690486574061, 0.7564787885138421, 4.619407524400564], [28.001156774113674, 0.12124399894451199, 1.9896786172723737], [52.02699411424349, 0.1908912548989421, 0.9140097111383565], [72.17217605139024, 0.10041530305903734, 11.99999999999992]], "r_squared_": 0.9818146201289416, "error_": 0.04492522934214974}
{"freq_range": [2.0, 80.0], "freq_res": 1.0, "aperiodic_params_": [0.15912459573599788, 0.8826138444411098], "gaussian_params_": [[8.505255711857277, 2.4152625648124815, 0.2631276055784487], [21.90261946298824, 0.23347849712709257, 0.8319254746741617], [23.771728319353997, 0.4546935141098275, 2.2324983943625547], [65.15980228515066, 0.25508346923425895, 0.699270641422069], [67.52214921110887, 1.030651475682917, 0.28593273471112723], [69.97637049987787, 0.20233404034566763, 0.5696322840341609], [77.18481218035238, 0.21544228820343767, 0.5129490035268857], [79.47532713217281, 0.6344533965287852, 0.32710850564327093]], "peak_params_": [[8.505255711857277, 0.4123626581602124, 0.5262552111568974], [21.90261946298824, 0.5637456514458414, 1.6638509493483233], [23.771728319353997, 0.4620514890706703, 4.464996788725109], [65.15980228515066, 0.24850886187846855, 1.398541282844138], [67.52214921110887, 0.2556170563673461, 0.5718654694222545], [69.97637049987787, 0.2021600312315439, 1.1392645680683218], [77.18481218035238, 0.20190299806989254, 1.0258980070537713], [79.47532713217281, 0.22115186530681785, 0.6542170112865419]], "r_squared_": 0.9597335902551756, "error_": 0.0566393895877278}
{"freq_range": [2.0, 80.0], "freq_res": 1.0, "aperiodic_params_": [0.11746794232841175, 0.9651349418297541], "gaussian_params_": [[8.53236295296057, 0.8436929078141354, 0.41787390012512854], [23.281571226751886, 0.4675349313526295, 2.5048601951688405], [41.58895740430441, 0.7293193330301753, 0.25136704770605645], [59.6993502990306, 0.4130496252161573, 0.2553051038511417], [61.76045698513898, 0.23216772869014726, 0.8132086167306607], [68.78966562030291, 0.3001961793144274, 0.4984987309056777], [76.77884190681561, 0.3908914955460956, 0.4674202882526684], [79.43261217756925, 0.8822750750151265, 0.30224777237563455]], "peak_params_": [[8.53236295296057, 0.4510649535822719, 0.8357478002502571], [23.281571226751886, 0.4645903577261826, 5.009720390337681], [41.58895740430441, 0.19154548983674569, 0.5027340954121129], [59.6993502990306, 0.2287681337481311, 0.5106102077022834], [61.76045698513898, 0.22231065045929754, 1.6264172334613214], [68.78966562030291, 0.2746290700510756, 0.9969974618113554], [76.77884190681561, 0.34949749479675285, 0.9348405765053368], [79.43261217756925, 0.31677319802276216, 0.6044955447512691]], "r_squared_": 0.9659489290476232, "error_": 0.05496296920593487}
{"freq_range": [2.0, 80.0], "freq_res": 1.0, "aperiodic_params_": [0.005342977178626418, 0.9212226179456371], "gaussian_params_": [[9.159678972270072, 0.33916203612225304, 1.1792970185225038], [22.470585479859484, 0.30914456841217747, 1.669416985682903], [25.488113170986065, 0.6040195189567763, 0.31320095841435525], [54.692057682281835, 0.3806736863001267, 0.8761340538899485], [56.973755025897695, 0.19421160005204488, 0.25000023413379474], [62.97700128620626, 0.23006228377380192, 0.6731911974191288], [71.22685054371946, 0.19494522479376344, 0.38593716296171715], [75.84821824440507, 0.5082172017267711, 1.0670076703757354]], "peak_params_": [[9.159678972270072, 0.3360672028035122, 2.3585940370450076], [22.470585479859484, 0.2971030753301279, 3.338833971365806], [25.488113170986065, 0.27742308995632325, 0.6264019168287105], [54.692057682281835, 0.3578714915691643, 1.752268107779897], [56.973755025897695, 0.20499459683326182, 0.5000004682675895], [62.97700128620626, 0.22992806324215942, 1.3463823948382576], [71.22685054371946, 0.1640335719539261, 0.7718743259234343], [75.84821824440507, 0.5031012282232612, 2.134015340751471]], "r_squared_": 0.9720202513261008, "error_": 0.04538404218899619}
{"freq_range": [2.0, 80.0], "freq_res": 1.0, "aperiodic_params_": [0.23314920861449082, 1.097902973107985], "gaussian_params_": [[8.516433608947708, 1.810506046746992, 0.28288858740770917], [10.58565591842023, 0.22909600936185687, 0.7680389642890647], [23.170025824012264, 0.5100791215790661, 2.6221638471091495], [25.482156922376763, 0.5885357976810023, 0.2849876569201084], [54.51617775733568, 1.0079084788095107, 0.2794585914357094], [63.344277284892264, 0.43883354386899376, 0.25426480799215095], [75.7051602771062, 0.3042728714966319, 1.416840811505937], [76.9672347479166, 0.10382531199107177, 0.2500000000173232]], "peak_params_": [[8.516433608947708, 0.4472364027647645, 0.5657771748154183], [10.58565591842023, 0.1980806444998241, 1.5360779285781294], [23.170025824012264, 0.5090079445165008, 5.244327694218299], [25.482156922376763, 0.5405068533173358, 0.5699753138402168], [54.51617775733568, 0.22519353021516464, 0.5589171828714188], [63.344277284892264, 0.1754664061011224, 0.5085296159843019], [75.7051602771062, 0.2978138688896341, 2.833681623011874], [76.9672347479166, 0.303339448139442, 0.5000000000346464]], "r_squared_": 0.9838291442440417, "error_": 0.04191362137664752}
{"freq_range": [2.0, 80.0], "freq_res": 1.0, "aperiodic_params_": [0.4798779361941497, 1.2142849992665996], "gaussian_params_": [[8.51884345253278, 2.0057785013181175, 0.2845583759978001], [10.941837119067904, 0.34806472112897086, 0.6463584301055585], [23.011202024849457, 0.6723796411545072, 2.924801394776766], [25.33594989449478, 0.17980629800710105, 0.6047639668334857], [28.0054492795333, 0.09424694138345928, 0.25000000002614553], [68.56569766441092, 0.625904736762262, 0.2703589250165891], [74.46751845144867, 0.17992047588419693, 1.4475610255170983]], "peak_params_": [[8.51884345253278, 0.484039976589501, 0.5691167519956002], [10.941837119067904, 0.34680474119152066, 1.292716860211117], [23.011202024849457, 0.6724782403785816, 5.849602789553532], [25.33594989449478, 0.6876935348394033, 1.2095279336669713], [28.0054492795333, 0.25121858070571657, 0.5000000000522911], [68.56569766441092, 0.17239433162965434, 0.5407178500331782], [74.46751845144867, 0.17077727402850473, 2.8951220510341966]], "r_squared_": 0.9874667754398877, "error_": 0.04630917671433981}
{"freq_range": [2.0, 80.0], "freq_res": 1.0, "aperiodic_params_": [0.5670258985433384, 1.2462427516921848], "gaussian_params_": [[8.514937327329056, 3.0170548354648634, 0.25770423049064667], [10.83795309593761, 0.24063258110145783, 0.6162759531702083], [23.07354104180284, 0.7960473861745576, 2.9230363534867925], [67.56892506792916, 0.1546420491768968, 1.3492257137314418]], "peak_params_": [[8.514937327329056, 0.5159979290300315, 0.5154084609812933], [10.83795309593761, 0.23261314361869523, 1.2325519063404167], [23.07354104180284, 0.7957954843435885, 5.846072706973585], [67.56892506792916, 0.1469472379052843, 2.6984514274628837]], "r_squared_": 0.9868515199753782, "error_": 0.04790044418805692}
{"freq_range": [2.0, 80.0], "freq_res": 1.0, "aperiodic_params_": [0.6479427661081822, 1.265757211163226], "gaussian_params_": [[8.55435069026048, 0.8123615242028387, 0.4839178887652927], [22.83235634259122, 0.8279525130442795, 2.763554409175036], [67.91649509033299, 0.16754404593706196, 1.366907209387865]], "peak_params_": [[8.55435069026048, 0.5316072517966669, 0.9678357775305854], [22.83235634259122, 0.8264305147438862, 5.527108818350072], [67.91649509033299, 0.16723169715395492, 2.73381441877573]], "r_squared_": 0.9850942465370522, "error_": 0.05032918572036992}
{"freq_range": [2.0, 80.0], "freq_res": 1.0, "aperiodic_params_": [0.6417599523869492, 1.2665712802390927], "gaussian_params_": [[8.512526246937647, 3.291156572421082, 0.2567005914752068], [10.772826726436316, 0.22182185408527938, 0.39740152110602006], [22.867302255945948, 0.8842899013455434, 2.593661689230028], [46.68570104187849, 0.22379747161700167, 0.5611908127795762], [66.55542787728722, 0.66375674730618, 0.26695456510744064], [68.76387898314036, 0.1682140143986029, 0.644277284355897], [74.54842397519012, 0.720553708225012, 0.25891668210034685]], "peak_params_": [[8.512526246937647, 0.5423542057934049, 0.5134011829504136], [10.772826726436316, 0.1884095635755476, 0.7948030422120401], [22.867302255945948, 0.8831333073715321, 5.187323378460056], [46.68570104187849, 0.1913127382065165, 1.1223816255591523], [66.55542787728722, 0.16983857450346296, 0.5339091302148813], [68.76387898314036, 0.15728818528032473, 1.288554568711794], [74.54842397519012, 0.1574458084717123, 0.5178333642006937]], "r_squared_": 0.9912114782495344, "error_": 0.03895215779294719}
{"freq_range": [2.0, 80.0], "freq_res": 1.0, "aperiodic_params_": [0.4863019177860885, 1.1665796844336151], "gaussian_params_": [[8.509352478017943, 3.0838341381765795, 0.2625607563861442], [11.423670485340319, 0.8400260169945851, 0.2535901466839256], [23.09119866388179, 0.7227428661237529, 2.6305503595890114], [46.50420937859192, 1.178119278599791, 0.25424968111384966], [68.54383698064767, 0.14679744050966673, 2.039823073763411]], "peak_params_": [[8.509352478017943, 0.5380267137092183, 0.5251215127722884], [11.423670485340319, 0.2080795203989516, 0.5071802933678512], [23.09119866388179, 0.7223086489104553, 5.261100719178023], [46.50420937859192, 0.17598449682453188, 0.5084993622276993], [68.54383698064767, 0.14317229698532596, 4.079646147526822]], "r_squared_": 0.9889427277667419, "error_": 0.04106261155118445}
{"freq_range": [2.0, 80.0], "freq_res": 1.0, "aperiodic_params_": [0.3256178570827203, 1.1121357273159742], "gaussian_params_": [[8.511316256169762, 2.07386009674628, 0.2919580298983968], [10.90541498270693, 0.1928788389496567, 0.5124264033120348], [23.379232754281364, 0.5310513946468018, 2.7498106216549822], [46.47033360431767, 0.862914845095976, 0.27549397117201097], [51.66133313458071, 0.17664943180475123, 1.3868776017252895], [60.004507982791445, 0.16515563234634723, 0.25000000000000017], [67.4234128918674, 0.10238041638688451, 1.447413385611979], [71.54796540086404, 0.10451039492944444, 5.737673122434438]], "peak_params_": [[8.511316256169762, 0.511176548015428, 0.5839160597967936], [10.90541498270693, 0.18964200481004745, 1.0248528066240696], [23.379232754281364, 0.5260250848204133, 5.4996212433099645], [46.47033360431767, 0.2009836748456162, 0.5509879423440219], [51.66133313458071, 0.1717755751138561, 2.773755203450579], [60.004507982791445, 0.17891829127708903, 0.5000000000000003], [67.4234128918674, 0.17442786903797458, 2.894826771223958], [71.54796540086404, 0.10487719907529502, 11.475346244868875]], "r_squared_": 0.9889167963814511, "error_": 0.035284643352561734}
{"freq_range": [2.0, 80.0], "freq_res": 1.0, "aperiodic_params_": [0.02776071493847621, 0.9378042699197552], "gaussian_params_": [[8.50641353920249, 3.342762622436238, 0.2500000439255332], [10.5538373521347, 1.0934777303124212, 0.2500000000000001], [22.865824046283873, 0.3295324108630159, 2.659389406636063], [24.587197252944485, 0.4292950467426431, 0.2500002891569075], [66.75818134816744, 0.4074282584773661, 0.9808064101525092], [79.54796540086294, 0.2217959596412305, 5.999999999999958]], "peak_params_": [[8.50641353920249, 0.47605513710487146, 0.5000000878510664], [10.5538373521347, 0.222449480897976, 0.5000000000000002], [22.865824046283873, 0.3291132540652175, 5.318778813272126], [24.587197252944485, 0.34863580298784125, 0.500000578313815], [66.75818134816744, 0.4201329237716147, 1.9616128203050185], [79.54796540086294, 0.22116739727809764, 11.999999999999917]], "r_squared_": 0.9622687002683811, "error_": 0.05593494661712196}
{"freq_range": [2.0, 80.0], "freq_res": 1.0, "aperiodic_params_": [-0.20797471002560552, 0.7193924679644413], "gaussian_params_": [[9.455559599317613, 0.27247208871543754, 1.5453318714154347], [22.573266182960225, 0.21991018254860628, 2.8852259172284125], [64.32246031873055, 0.1291342545798229, 1.7644293837879759], [70.88007528652723, 0.16209204922292603, 0.4682847159925173], [75.47680880273461, 0.32550689378749653, 0.8646297952875721]], "peak_params_": [[9.455559599317613, 0.2608894236495196, 3.0906637428308694], [22.573266182960225, 0.21751798579505033, 5.770451834456825], [64.32246031873055, 0.1269956319049892, 3.5288587675759517], [70.88007528652723, 0.15696363856551998, 0.9365694319850346], [75.47680880273461, 0.27959148180425064, 1.7292595905751442]], "r_squared_": 0.9485944506661667, "error_": 0.05390957204038198}
{"freq_range": [2.0, 80.0], "freq_res": 1.0, "aperiodic_params_": [0.18926368617676473, 1.0502632746841203], "gaussian_params_": [[8.51776717523195, 2.0389449859577087, 0.26965566369923943], [11.012616905624776, 0.5444462489246779, 0.607606565510647], [22.396403185854144, 0.5174449876763959, 4.337868886296049], [25.449333804785415, 0.25362714429328187, 0.5071155304826835], [77.32124641443922, 0.1704095881200511, 5.999999999999999]], "peak_params_": [[8.51776717523195, 0.41869428968794176, 0.5393113273984789], [11.012616905624776, 0.5607380669656489, 1.215213131021294], [22.396403185854144, 0.5152889851419801, 8.675737772592099], [25.449333804785415, 0.6034368094314106, 1.014231060965367], [77.32124641443922, 0.17016551109377342, 11.999999999999998]], "r_squared_": 0.9755020857444814, "error_": 0.054335921797553}
{"freq_range": [2.0, 80.0], "freq_res": 1.0, "aperiodic_params_": [0.4298631901741583, 1.1691911119612877], "gaussian_params_": [[8.520632955797023, 2.756958832377316, 0.26027749841579795], [11.088065455035206, 0.840143222811291, 0.6236253089232338], [22.57802433323101, 0.71006598969478, 4.336847160813109]], "peak_params_": [[8.520632955797023, 0.5140267747255237, 0.5205549968315959], [11.088065455035206, 0.8519284657134325, 1.2472506178464675], [22.57802433323101, 0.7067127252546703, 8.673694321626218]], "r_squared_": 0.9794301650048003, "error_": 0.06138102537448615}
{"freq_range": [2.0, 80.0], "freq_res": 1.0, "aperiodic_params_": [0.5025151700968772, 1.1691267759795665], "gaussian_params_": [[8.525316624226907, 1.9863103278276288, 0.29960344616289103], [10.979921708151334, 0.6298993014023572, 0.5707780387143307], [22.261379945583755, 0.6378306278114533, 3.0456810707411623], [25.52469507317373, 0.896632730244166, 0.2913333353765952], [28.674391260701825, 0.18427510110469142, 1.0488704587758377]], "peak_params_": [[8.525316624226907, 0.5677672970501088, 0.5992068923257821], [10.979921708151334, 0.6301951663041242, 1.1415560774286615], [22.261379945583755, 0.6354861204943721, 6.091362141482325], [25.52469507317373, 0.5443420398489554, 0.5826666707531905], [28.674391260701825, 0.23077833160544237, 2.0977409175516755]], "r_squared_": 0.9834162155544234, "error_": 0.052731479422799515}
{"freq_range": [2.0, 80.0], "freq_res": 1.0, "aperiodic_params_": [0.6024805297034913, 1.2303912703256747], "gaussian_params_": [[8.516119634510623, 2.9632760629765684, 0.2691190549511527], [22.923040046658674, 0.801988276899596, 2.980277676389709], [67.98095712518928, 0.15140577271971034, 1.3770946094641396]], "peak_params_": [[8.516119634510623, 0.5885399409557742, 0.5382381099023054], [22.923040046658674, 0.8017209259333744, 5.960555352779418], [67.98095712518928, 0.15139129736732215, 2.7541892189282793]], "r_squared_": 0.9851136900048217, "error_": 0.052293233731277936}
{"freq_range": [2.0, 80.0], "freq_res": 1.0, "aperiodic_params_": [0.5883203465137457, 1.2196157085424892], "gaussian_params_": [[8.51019640446559, 3.03108187956366, 0.2697265924110624], [18.180491836694586, 0.2076306908290712, 0.9216192809376719], [22.89557010287798, 0.712626939748259, 2.6839334810715334], [67.95300353679174, 0.17436588927555932, 1.2320894456307458]], "peak_params_": [[8.51019640446559, 0.5828225073646762, 0.5394531848221248], [18.180491836694586, 0.33870632408584767, 1.8432385618753437], [22.89557010287798, 0.7120879490717962, 5.367866962143067], [67.95300353679174, 0.17423908921783315, 2.4641788912614917]], "r_squared_": 0.9851150689571194, "error_": 0.04919442698032452}
{"freq_range": [2.0, 80.0], "freq_res": 1.0, "aperiodic_params_": [0.4780537943946595, 1.1598743551825843], "gaussian_params_": [[8.503367524040751, 3.821040838332852, 0.25000078143202614], [12.08399406378132, 0.3255408316304275, 1.3622927667041802], [18.034649829130565, 0.2699276720916332, 1.0525004221607355], [22.761231537885756, 0.7530701257146423, 2.7284251918891598], [68.28503669741477, 0.12760852770697603, 2.0874703956080456]], "peak_params_": [[8.503367524040751, 0.5563071217915266, 0.5000015628640523], [12.08399406378132, 0.32523807724369075, 2.7245855334083604], [18.034649829130565, 0.4340860539117387, 2.105000844321471], [22.761231537885756, 0.7501960037655432, 5.4568503837783195], [68.28503669741477, 0.12642442920564623, 4.174940791216091]], "r_squared_": 0.9880337861600318, "error_": 0.04405022781951309}
{"freq_range": [2.0, 80.0], "freq_res": 1.0, "aperiodic_params_": [0.15170968550076175, 0.8999362093439013], "gaussian_params_": [[8.503858250412073, 3.1796356930461664, 0.2543710595614034], [22.186506597908455, 0.4734379364757565, 2.8816953295820116], [46.333446665815714, 0.1607825829251971, 1.1372670718119977], [67.75392260081048, 0.07782460538633008, 1.4491805144781345], [69.9803049390965, 0.1247693261566383, 5.999999999999999]], "peak_params_": [[8.503858250412073, 0.4745628793337482, 0.5087421191228068], [22.186506597908455, 0.4724473996694707, 5.763390659164023], [46.333446665815714, 0.15406047729047412, 2.2745341436239954], [67.75392260081048, 0.19486597449913745, 2.898361028956269], [69.9803049390965, 0.14818350875744501, 11.999999999999998]], "r_squared_": 0.9753284422419558, "error_": 0.04583244656092776}
{"freq_range": [2.0, 80.0], "freq_res": 1.0, "aperiodic_params_": [-0.3430723205919035, 0.5230513545164127], "gaussian_params_": [[8.499867180934904, 2.16768537289005, 0.269629945485848], [21.696672850952563, 0.2482531120573077, 2.1618894596585743], [46.8196542209078, 0.1915470152428382, 0.6342758238475654], [49.98719580672783, 0.2000332799638862, 0.5379843385939838], [58.34269366068294, 0.16105229687156716, 0.8195109449609019], [67.50034057919989, 0.19172477471580204, 2.9516002510784687], [74.03141710812079, 0.16093739352971606, 1.4398030082673507], [77.447416634714, 1.1796261512793838, 0.27071196359516037]], "peak_params_": [[8.499867180934904, 0.3887517939021777, 0.539259890971696], [21.696672850952563, 0.2458215537613445, 4.3237789193171485], [46.8196542209078, 0.18395860828832622, 1.2685516476951308], [49.98719580672783, 0.19997730259673552, 1.0759686771879675], [58.34269366068294, 0.14864810523422722, 1.6390218899218039], [67.50034057919989, 0.18902211411264447, 5.903200502156937], [74.03141710812079, 0.17786969504821393, 2.8796060165347015], [77.447416634714, 0.3213114557060692, 0.5414239271903207]], "r_squared_": 0.8806935010942422, "error_": 0.05101735074273776}
{"freq_range": [2.0, 80.0], "freq_res": 1.0, "aperiodic_params_": [-0.35795581854678493, 0.5588037082201708], "gaussian_params_": [[2.0000000000000004, 0.2094958240115442, 1.2222874423248857], [8.510363942163323, 1.2648113326801416, 0.27298034498940904], [10.779654782891646, 0.3380965951745928, 0.4978880676406593], [20.12860057156187, 0.23797360577783772, 1.4894808337145877], [22.41138963223919, 0.4972627169737574, 0.25000446399650755], [24.360475761305526, 0.18484956105753786, 1.035509729183898], [65.04583897637848, 0.2121282293908074, 0.6090603889559468], [69.34737851417647, 0.41619504032953886, 0.2500029679778392], [75.38159423096226, 0.25614109816265407, 0.5674345244846579]], "peak_params_": [[2.0000000000000004, 0.2094958240115442, 2.4445748846497715], [8.510363942163323, 0.25373717262598494, 0.5459606899788181], [10.779654782891646, 0.30655650067522555, 0.9957761352813186], [20.12860057156187, 0.2371143572989065, 2.9789616674291755], [22.41138963223919, 0.2502465345331384, 0.5000089279930151], [24.360475761305526, 0.1821018722641229, 2.071019458367796], [65.04583897637848, 0.21152829642090554, 1.2181207779118937], [69.34737851417647, 0.1585075557708484, 0.5000059359556784], [75.38159423096226, 0.20430354119238303, 1.1348690489693158]], "r_squared_": 0.9623919915372404, "error_": 0.03608383738918648}
{"freq_range": [2.0, 80.0], "freq_res": 1.0, "aperiodic_params_": [0.11937524687759304, 0.9750246478225641], "gaussian_params_": [[8.514068250872766, 2.6580481019852504, 0.25000106193035654], [11.039473656162022, 0.61218724592041, 0.5301665422161397], [21.856152832626798, 0.5322151612150767, 4.311638575518124], [65.35843079677257, 0.4594172737987536, 0.25934283942068], [68.55230385545771, 0.7403398209684868, 0.25429651187931634], [77.00517781418841, 0.11534226094285072, 5.65291952479271]], "peak_params_": [[8.514068250872766, 0.4085682534060723, 0.5000021238607131], [11.039473656162022, 0.6328512930110338, 1.0603330844322794], [21.856152832626798, 0.531919050356131, 8.623277151036248], [65.35843079677257, 0.18887357816141526, 0.51868567884136], [68.55230385545771, 0.19949622298000658, 0.5085930237586327], [77.00517781418841, 0.11534221255841381, 11.30583904958542]], "r_squared_": 0.9809568839523399, "error_": 0.045929493843876665}
{"freq_range": [2.0, 80.0], "freq_res": 1.0, "aperiodic_params_": [0.39319128774763823, 1.136103928815018], "gaussian_params_": [[8.52420042110067, 2.4365720482296007, 0.2750166422568512], [10.988468721922384, 0.8172300203523659, 0.5482302932370046], [12.560257238978432, 0.9883979957909556, 0.26419124237149316], [22.096415617398367, 0.7506030773191171, 4.533490232566227], [74.86852339665003, 0.21368610130207832, 0.6142648771750588]], "peak_params_": [[8.52420042110067, 0.5582395997884582, 0.5500332845137024], [10.988468721922384, 0.8545879698874549, 1.0964605864740091], [12.560257238978432, 0.3486011279882175, 0.5283824847429863], [22.096415617398367, 0.7504333465253914, 9.066980465132454], [74.86852339665003, 0.20884697105601013, 1.2285297543501177]], "r_squared_": 0.9861912078642027, "error_": 0.051265334959528674}
{"freq_range": [2.0, 80.0], "freq_res": 1.0, "aperiodic_params_": [0.43425704822555933, 1.1458316678961975], "gaussian_params_": [[8.523549777430294, 3.0167282530282367, 0.2670603408843905], [10.62604209777516, 1.5291711948142794, 0.2937991536233102], [12.675059967908197, 0.2619217156375174, 0.6749520817175869], [17.561064770075266, 0.9787744521196223, 0.2500120238740954], [22.086736457138876, 0.6668650041548573, 3.0778086886952805], [25.523795754917977, 1.168749568405654, 0.2677106318702432], [28.627131300473113, 0.2102865556463797, 0.9047735656714349]], "peak_params_": [[8.523549777430294, 0.6143914527571723, 0.534120681768781], [10.62604209777516, 0.6932852208168998, 0.5875983072466204], [12.675059967908197, 0.2417986142350741, 1.3499041634351738], [17.561064770075266, 0.48576615358024433, 0.5000240477481908], [22.086736457138876, 0.6666002505870892, 6.155617377390561], [25.523795754917977, 0.540509829419413, 0.5354212637404864], [28.627131300473113, 0.24668148047595229, 1.8095471313428697]], "r_squared_": 0.9859375406980856, "error_": 0.04634270639873855}
{"freq_range": [2.0, 80.0], "freq_res": 1.0, "aperiodic_params_": [0.47858859016552674, 1.1808551914722654], "gaussian_params_": [[8.514156929818284, 4.075466865182022, 0.254414261176633], [10.749314966301412, 0.3009552092729795, 0.490935998772268], [22.82858571667979, 0.6266604012462176, 3.3651097414818527], [68.02671669979071, 0.15623765915642512, 1.6243392953934495], [74.62212488180768, 0.1613107691166737, 1.004309214709543]], "peak_params_": [[8.514156929818284, 0.65875857445808, 0.508828522353266], [10.749314966301412, 0.26546993225693216, 0.981871997544536], [22.82858571667979, 0.6258479148152981, 6.730219482963705], [68.02671669979071, 0.15621652731835, 3.248678590786899], [74.62212488180768, 0.15030292856584393, 2.008618429419086]], "r_squared_": 0.9863447811492047, "error_": 0.04508390021046003}
{"freq_range": [2.0, 80.0], "freq_res": 1.0, "aperiodic_params_": [0.46991419492055253, 1.1784866349592784], "gaussian_params_": [[8.50868728645217, 2.556218619572226, 0.29168704818542485], [11.911131772193235, 0.15378965158101274, 1.5648859969484974], [19.42319829144965, 0.44975563119140965, 1.9239316651854093], [23.250171657977624, 0.6784514275563361, 1.4747899306809986], [26.07326063276322, 0.13122437457197098, 0.25078452058307366], [27.6604734727046, 0.21298882315435524, 1.4051955580241775], [35.150301809571395, 0.1742744842512038, 0.5927248518083766], [67.92603278531523, 0.12718298776158962, 1.8908932397513094], [74.58990122249114, 0.413615935308801, 0.29784716195266586]], "peak_params_": [[8.50868728645217, 0.6460119172147043, 0.5833740963708497], [11.911131772193235, 0.15380509838309608, 3.129771993896995], [19.42319829144965, 0.4496782785376854, 3.8478633303708185], [23.250171657977624, 0.7495132053015612, 2.9495798613619972], [26.07326063276322, 0.35229511889816045, 0.5015690411661473], [27.6604734727046, 0.2106771519504811, 2.810391116048355], [35.150301809571395, 0.1687607832162883, 1.1854497036167533], [67.92603278531523, 0.1270857180983842, 3.781786479502619], [74.58990122249114, 0.1604156295241772, 0.5956943239053317]], "r_squared_": 0.9903465882342982, "error_": 0.038711479770291685}
{"freq_range": [2.0, 80.0], "freq_res": 1.0, "aperiodic_params_": [0.4079433462622896, 1.1075096888986289], "gaussian_params_": [[8.50117728507532, 3.1910575557791225, 0.2658980040400643], [11.980129276070846, 0.29893146762752115, 1.3063466731100533], [17.618486969938072, 0.17217480896644902, 1.2457577422030106], [22.23157693183982, 0.7648159719125426, 2.900275101597494]], "peak_params_": [[8.50117728507532, 0.5713632374113582, 0.5317960080801286], [11.980129276070846, 0.30042082888905264, 2.6126933462201065], [17.618486969938072, 0.4281117489645909, 2.491515484406021], [22.23157693183982, 0.7627364634474616, 5.800550203194988]], "r_squared_": 0.9866291963183546, "error_": 0.04639404953615967}
{"freq_range": [2.0, 80.0], "freq_res": 1.0, "aperiodic_params_": [0.17603822759617613, 0.9268231772930452], "gaussian_params_": [[8.500568909663757, 2.225493545587767, 0.2885949196677618], [11.895029704990558, 0.21216627390354698, 0.9543106792747786], [21.89145468771753, 0.5814143047928462, 2.7746131136788277], [69.9575665610104, 0.1503573581523731, 4.502319635219948], [71.00263248186684, 0.056715577341147926, 0.25000000000000017]], "peak_params_": [[8.500568909663757, 0.49999873917476284, 0.5771898393355236], [11.895029704990558, 0.21189760085777642, 1.9086213585495573], [21.89145468771753, 0.5809695641314293, 5.549226227357655], [69.9575665610104, 0.1503689206421106, 9.004639270439895], [71.00263248186684, 0.20309319619648347, 0.5000000000000003]], "r_squared_": 0.9833728017438967, "error_": 0.042437449332684826}
{"freq_range": [2.0, 80.0], "freq_res": 1.0, "aperiodic_params_": [-0.3417585828017136, 0.5786961368359135], "gaussian_params_": [[8.487725483293557, 1.8642070439395118, 0.26221403798837317], [21.55393973880014, 0.32410942948517546, 2.4203166827314533], [64.54635556210734, 0.9116470034430765, 0.25494525944755253], [76.91916279729058, 0.1183952644262687, 5.999999999999999]], "peak_params_": [[8.487725483293557, 0.330543714492581, 0.5244280759767463], [21.55393973880014, 0.31865157725641036, 4.840633365462907], [64.54635556210734, 0.20365527385631177, 0.5098905188951051], [76.91916279729058, 0.11838451946928918, 11.999999999999998]], "r_squared_": 0.9023851785364485, "error_": 0.057583237392215506}
{"freq_range": [2.0, 80.0], "freq_res": 1.0, "aperiodic_params_": [-0.2229519688177324, 0.7289422139502048], "gaussian_params_": [[8.518126495307087, 1.4788696355089053, 0.27995167899605555], [10.728961795307084, 0.4425772278291514, 0.6314816107107353], [17.55464315677098, 0.2633743263873126, 0.9789648999707101], [19.841302589766627, 0.29615883350077715, 0.7537242901026735], [21.543325000297795, 0.9726284393166073, 0.2974707104602544], [24.14724917244204, 0.268031782586978, 1.2419313314016727], [43.150212426395186, 0.19206043288383745, 0.25000000544445367], [65.20535931434776, 0.18902915600058545, 0.49293225139614494], [75.41772995744549, 0.29570464982511924, 0.6925461345659961]], "peak_params_": [[8.518126495307087, 0.3466057090929838, 0.5599033579921111], [10.728961795307084, 0.4036323243398817, 1.2629632214214705], [17.55464315677098, 0.25246765299058826, 1.9579297999414202], [19.841302589766627, 0.3023161428375205, 1.507448580205347], [21.543325000297795, 0.3643808772903422, 0.5949414209205088], [24.14724917244204, 0.26615452161080133, 2.4838626628033453], [43.150212426395186, 0.1603405355373697, 0.5000000108889073], [65.20535931434776, 0.1733166603820322, 0.9858645027922899], [75.41772995744549, 0.24652122931637988, 1.3850922691319922]], "r_squared_": 0.9693514612687175, "error_": 0.041177190328731954}
{"freq_range": [2.0, 80.0], "freq_res": 1.0, "aperiodic_params_": [0.16049131246043782, 1.000549871942244], "gaussian_params_": [[8.51384243917595, 2.398033386285355, 0.2621364400966807], [10.91837390408394, 0.560905329739015, 0.6019811267393065], [21.25381045334274, 0.4814817855409881, 4.466883246191636], [67.2722749371502, 0.13899612840901904, 1.8030560327077954], [75.46431911466583, 0.21822018761832096, 0.8976342604057078]], "peak_params_": [[8.51384243917595, 0.4441839845149592, 0.5242728801933614], [10.91837390408394, 0.5903141930311201, 1.203962253478613], [21.25381045334274, 0.4807051644441229, 8.933766492383272], [67.2722749371502, 0.1374203464845074, 3.6061120654155907], [75.46431911466583, 0.19090869376469333, 1.7952685208114156]], "r_squared_": 0.9791701189662578, "error_": 0.05222762803130651}
{"freq_range": [2.0, 80.0], "freq_res": 1.0, "aperiodic_params_": [0.3773689887505652, 1.14404615293941], "gaussian_params_": [[8.523144328121246, 2.630306509738452, 0.26940082714190206], [11.039884240536896, 0.600678727239232, 0.5713699160429424], [21.521375111415136, 0.5763418077918984, 4.679421995797042], [73.50018841377087, 0.10268509884685198, 5.64755802469351]], "peak_params_": [[8.523144328121246, 0.5662006087727071, 0.5388016542838041], [11.039884240536896, 0.6452322356812108, 1.1427398320858848], [21.521375111415136, 0.5733348946627939, 9.358843991594084], [73.50018841377087, 0.10228375319908767, 11.29511604938702]], "r_squared_": 0.9840337674197289, "error_": 0.05069984442631961}
{"freq_range": [2.0, 80.0], "freq_res": 1.0, "aperiodic_params_": [0.39056931974538384, 1.1570439830302786], "gaussian_params_": [[8.513366005031989, 3.965991206227314, 0.2567854697209257], [10.903426506333988, 0.321431886866734, 0.6307203016617935], [21.80632622367239, 0.43373469986026214, 3.9726989717230397], [68.50163769151779, 0.13565144028925452, 2.426765015582782], [75.01783706719172, 0.20448737488773636, 0.7837114762430787]], "peak_params_": [[8.513366005031989, 0.6641852489366453, 0.5135709394418514], [10.903426506333988, 0.3284137045693192, 1.261440603323587], [21.80632622367239, 0.43321958215312084, 7.945397943446079], [68.50163769151779, 0.13282097061275144, 4.853530031165564], [75.01783706719172, 0.20819590569162227, 1.5674229524861574]], "r_squared_": 0.9866615061813948, "error_": 0.04559985134130949}
{"freq_range": [2.0, 80.0], "freq_res": 1.0, "aperiodic_params_": [0.360147842016789, 1.1151935003676807], "gaussian_params_": [[8.531596110768051, 1.0208475962057326, 0.4803509972728789], [20.975511942445323, 0.3797891942946982, 4.604015405861475], [23.031779030510837, 0.29014102664545094, 1.1132802696437913]], "peak_params_": [[8.531596110768051, 0.6474659300221906, 0.9607019945457578], [20.975511942445323, 0.43465481636119274, 9.20803081172295], [23.031779030510837, 0.6348138683017073, 2.2265605392875827]], "r_squared_": 0.9819818874469889, "error_": 0.05164544294659045}
{"freq_range": [2.0, 80.0], "freq_res": 1.0, "aperiodic_params_": [0.3615930937329121, 1.1262925071056973], "gaussian_params_": [[8.501329108768836, 2.1222963515655535, 0.3012790661242829], [11.681329753560542, 0.20296010639810813, 1.7228714931738722], [16.91903799202768, 0.21656951056038098, 1.169203477726452], [22.270918099479882, 0.5952842535220101, 2.7732706372250977], [68.16933900599973, 0.11750154435055003, 2.4814172961275345], [74.82767119858607, 0.18566632090005655, 0.5759817329396236]], "peak_params_": [[8.501329108768836, 0.5998576351076501, 0.6025581322485658], [11.681329753560542, 0.20017444132551776, 3.4457429863477445], [16.91903799202768, 0.31557538709893074, 2.338406955452904], [22.270918099479882, 0.5924677527246419, 5.546541274450195], [68.16933900599973, 0.11722825516740354, 4.962834592255069], [74.82767119858607, 0.18019787873843107, 1.1519634658792473]], "r_squared_": 0.9876835944176432, "error_": 0.041596735770644586}
{"freq_range": [2.0, 80.0], "freq_res": 1.0, "aperiodic_params_": [0.23512717005946132, 1.0681703015969441], "gaussian_params_": [[8.487908526726887, 1.5839713384186553, 0.3119910276719553], [11.10177284927519, 0.2257191550553413, 1.6632103912777676], [16.87976019620982, 0.2549346338933375, 1.249817005688119], [22.42067095943909, 0.5542423982031313, 2.4904226363023922], [64.67683362601029, 0.3528227529821388, 0.26100222294793346], [69.15758550085647, 0.1045893017183027, 2.701165569297834], [75.07992593660295, 0.16087759868735652, 0.46049733583527946]], "peak_params_": [[8.487908526726887, 0.5059777596418125, 0.6239820553439106], [11.10177284927519, 0.2253159921230029, 3.326420782555535], [16.87976019620982, 0.30604977376310105, 2.499634011376238], [22.42067095943909, 0.5464493829815106, 4.9808452726047845], [64.67683362601029, 0.1959204871838467, 0.5220044458958669], [69.15758550085647, 0.10441146645251065, 5.402331138595668], [75.07992593660295, 0.16855629031829555, 0.9209946716705589]], "r_squared_": 0.9876924356338638, "error_": 0.03983075953794468}
{"freq_range": [2.0, 80.0], "freq_res": 1.0, "aperiodic_params_": [-0.028491550438691258, 0.9291890423554807], "gaussian_params_": [[8.959569855901584, 0.3686866186908408, 0.9901494144798143], [17.884303319033787, 0.1775191526890614, 3.578451671488363], [23.011236098365426, 0.37204464822224725, 1.6687285403970584], [47.4097444596858, 0.5978290498075348, 0.2615150988530344], [62.45435688041938, 0.64214893893918, 0.2678861773172198], [64.57529026467768, 0.6452569185962108, 0.2707032128169457], [67.29456422213407, 0.3579120608379225, 0.2500023791357512], [68.54165875416652, 0.6941115633838353, 0.26926984415868127], [75.16724472536923, 0.09239533916846876, 3.606693985567544]], "peak_params_": [[8.959569855901584, 0.37652209931311476, 1.9802988289596286], [17.884303319033787, 0.18152206161203366, 7.156903342976726], [23.011236098365426, 0.4359300910362961, 3.337457080794117], [47.4097444596858, 0.17518772777912472, 0.5230301977060688], [62.45435688041938, 0.15251252715046593, 0.5357723546344396], [64.57529026467768, 0.19020156527304177, 0.5414064256338914], [67.29456422213407, 0.185894765631049, 0.5000047582715024], [68.54165875416652, 0.18444867713297897, 0.5385396883173625], [75.16724472536923, 0.09229605662411955, 7.213387971135088]], "r_squared_": 0.9817529405846069, "error_": 0.03957078775660542}
{"freq_range": [2.0, 80.0], "freq_res": 1.0, "aperiodic_params_": [-0.6582441811452829, 0.8945913676118092], "gaussian_params_": [[8.519904089700475, 0.5394692055118698, 0.29853980081629566], [10.735726659638209, 0.43877573147388277, 0.5851267858401538], [17.422723171571008, 0.2302710969630548, 0.8794644556619706], [21.899071204495204, 0.3756257422548534, 2.2132338726437424], [65.01211084771869, 0.14149451188744203, 0.25000005807369713], [68.07432068975454, 0.17899634280751675, 1.1302274460844064], [71.74943410255773, 0.16984008269859013, 0.9029787297414064], [75.28298434864438, 0.22583131409133075, 1.3126082580270872]], "peak_params_": [[8.519904089700475, 0.15343323734343373, 0.5970796016325913], [10.735726659638209, 0.3962316673467843, 1.1702535716803075], [17.422723171571008, 0.23756812394775384, 1.7589289113239412], [21.899071204495204, 0.3752356755064108, 4.426467745287485], [65.01211084771869, 0.1457564574633312, 0.5000001161473943], [68.07432068975454, 0.17864044111854138, 2.260454892168813], [71.74943410255773, 0.17374992043462356, 1.8059574594828127], [75.28298434864438, 0.22090431395619037, 2.6252165160541745]], "r_squared_": 0.9793216706405893, "error_": 0.03887521988856001}
{"freq_range": [2.0, 80.0], "freq_res": 1.0, "aperiodic_params_": [0.050121192940819764, 0.9850174140781958], "gaussian_params_": [[8.505355566362898, 1.8027698773593823, 0.2637111965499346], [10.662279054335123, 0.471202230368109, 0.6886163488748037], [19.97240390025719, 0.368874501550575, 3.720246816729645], [21.86461081289074, 0.17349977198190378, 0.4745522474245567], [40.38536669038959, 0.5500737924273579, 0.25738497208441125], [42.89618697947433, 0.1772337675517923, 0.6841015953488703], [68.25773909359117, 0.1619532858922064, 1.1980940698837785], [71.38648560639506, 0.5637605788308595, 0.250001149140653]], "peak_params_": [[8.505355566362898, 0.340767577489859, 0.5274223930998692], [10.662279054335123, 0.43793730401443864, 1.3772326977496074], [19.97240390025719, 0.36894141629498245, 7.44049363345929], [21.86461081289074, 0.4845434640825259, 0.9491044948491134], [40.38536669038959, 0.17934631625290853, 0.5147699441688225], [42.89618697947433, 0.17520477396663936, 1.3682031906977405], [68.25773909359117, 0.1582488371041444, 2.396188139767557], [71.38648560639506, 0.18245718558982027, 0.500002298281306]], "r_squared_": 0.9795796250299856, "error_": 0.047403219285056634}
{"freq_range": [2.0, 80.0], "freq_res": 1.0, "aperiodic_params_": [0.2973804081092369, 1.117126443709049], "gaussian_params_": [[8.518541548899076, 2.110673709070971, 0.2922209009624852], [10.684246840709179, 0.5403505266923946, 0.5028665281665089], [13.240394863255329, 0.21075662487702845, 1.7347766939668963], [17.12918331180763, 0.174636812641855, 0.7365212699346539], [21.404293286057655, 0.4232006537493387, 3.3189912897312053], [33.41594131022374, 0.5728799761993071, 0.2691448590873566], [66.85992427766436, 0.1526354250281214, 1.4190104942956157], [68.58948666803164, 0.41850675767912937, 0.2687728726544364], [75.13059172202796, 0.17026507394327006, 0.7472417094328544]], "peak_params_": [[8.518541548899076, 0.5562085521554532, 0.5844418019249704], [10.684246840709179, 0.5383204730388779, 1.0057330563330178], [13.240394863255329, 0.22590401891333278, 3.4695533879337925], [17.12918331180763, 0.36755894670051803, 1.4730425398693079], [21.404293286057655, 0.420082215159856, 6.6379825794624105], [33.41594131022374, 0.1745052620498544, 0.5382897181747132], [66.85992427766436, 0.15189357505617296, 2.8380209885912313], [68.58948666803164, 0.17930695110687367, 0.5375457453088728], [75.13059172202796, 0.1676846509603349, 1.4944834188657088]], "r_squared_": 0.9908522580635023, "error_": 0.034086377982163754}
{"freq_range": [2.0, 80.0], "freq_res": 1.0, "aperiodic_params_": [0.31644354486727355, 1.1323660609444417], "gaussian_params_": [[8.512646694561626, 3.3152508710701283, 0.26070632599584254], [10.8540087038696, 0.37761213786293385, 0.8622350420183164], [13.596920897783018, 0.17405273829697157, 0.6172045694217365], [17.62727430254293, 0.32923329094228226, 2.086246133637782], [23.052763911869047, 0.3993631180975477, 1.7253637014265228], [64.66147362689883, 0.29319407994453706, 0.2500000293428875], [68.597155488462, 0.1632749074286888, 1.8364139642460509], [74.96246966649807, 0.20751592034378014, 0.6904946172831373]], "peak_params_": [[8.512646694561626, 0.6151716484289101, 0.5214126519916851], [10.8540087038696, 0.3743824719567132, 1.7244700840366327], [13.596920897783018, 0.2137364232850314, 1.234409138843473], [17.62727430254293, 0.3295041723938803, 4.172492267275564], [23.052763911869047, 0.41112558531439136, 3.4507274028530457], [64.66147362689883, 0.1411925598567101, 0.500000058685775], [68.597155488462, 0.15939332337471246, 3.6728279284921017], [74.96246966649807, 0.2075838979748026, 1.3809892345662746]], "r_squared_": 0.9910040538378185, "error_": 0.033309260373776996}
{"freq_range": [2.0, 80.0], "freq_res": 1.0, "aperiodic_params_": [0.2776517111298201, 1.101928255256484], "gaussian_params_": [[8.82422018736495, 0.5875797406989701, 0.8841115233025009], [17.829582669408687, 0.2941374483094507, 4.587151807168665], [23.026232605183196, 0.3609629692404553, 1.176759102060741], [68.18958210707613, 0.15321129003556627, 2.2866474836491375], [74.82605050507316, 0.19024064046255815, 0.6103184669539918]], "peak_params_": [[8.82422018736495, 0.6222130176006101, 1.7682230466050017], [17.829582669408687, 0.2939739728755697, 9.17430361433733], [23.026232605183196, 0.51671041041103, 2.353518204121482], [68.18958210707613, 0.15268562277222175, 4.573294967298275], [74.82605050507316, 0.18448439180349463, 1.2206369339079837]], "r_squared_": 0.9864677864598373, "error_": 0.04056330373028835}
{"freq_range": [2.0, 80.0], "freq_res": 1.0, "aperiodic_params_": [0.056821148580048435, 0.9739338963114917], "gaussian_params_": [[9.668124103227154, 0.44730479950915075, 1.4462010275852568], [17.26714249964658, 0.25995554644466407, 2.1500750634000365], [22.87940743281444, 0.4431796631668826, 1.439332207310618], [26.419007938071207, 0.14123380229281518, 0.2890151730356439], [64.89819776963589, 0.20828327264974658, 0.2506378745446598], [67.44838129290811, 0.49604781465994296, 0.2870853944074419], [69.31006565499447, 0.06111390868318969, 1.2144910484190843], [75.16062395790061, 0.121269746511868, 5.99999999961628]], "peak_params_": [[9.668124103227154, 0.43654001920387603, 2.8924020551705136], [17.26714249964658, 0.25806342057643206, 4.300150126800073], [22.87940743281444, 0.44905888257011717, 2.878664414621236], [26.419007938071207, 0.0916984616890435, 0.5780303460712878], [64.89819776963589, 0.22081342497519185, 0.5012757490893196], [67.44838129290811, 0.20459842366471737, 0.5741707888148838], [69.31006565499447, 0.13073971963554487, 2.4289820968381686], [75.16062395790061, 0.12122734598440132, 11.99999999923256]], "r_squared_": 0.982057886280701, "error_": 0.04060996022722311}
{"freq_range": [2.0, 80.0], "freq_res": 1.0, "aperiodic_params_": [-0.44643073826791274, 0.7269404955636681], "gaussian_params_": [[9.424681172120257, 0.2003217297174116, 0.7620017298115287], [11.374197331899898, 0.26110334752854564, 0.3213425302100926], [22.492550206274526, 0.2781476102880035, 1.3818249470889077], [46.631919617045746, 0.323241040841441, 0.25496120864798827], [55.16932779114646, 0.11819270942071224, 1.1985848453072356], [57.38824807246623, 0.159387249134565, 0.3258323021634374], [62.10200084199933, 0.12310409595703463, 1.2878522357385291], [65.07631666189585, 0.15048228939237368, 0.5306377118665931], [67.4597319466689, 0.4864709518832651, 0.3091112694207867], [73.11892697105253, 0.14101848418067864, 5.999999999265076], [75.00068109129413, 0.09767561699896816, 0.25000679413187876]], "peak_params_": [[9.424681172120257, 0.17150633410278793, 1.5240034596230574], [11.374197331899898, 0.15618386649479166, 0.6426850604201853], [22.492550206274526, 0.2610270333790514, 2.7636498941778154], [46.631919617045746, 0.11402282665131214, 0.5099224172959765], [55.16932779114646, 0.11849500073974473, 2.3971696906144713], [57.38824807246623, 0.11905228331483197, 0.6516646043268748], [62.10200084199933, 0.1480438087376037, 2.5757044714770583], [65.07631666189585, 0.21517367115555452, 1.0612754237331863], [67.4597319466689, 0.2451022596656205, 0.6182225388415734], [73.11892697105253, 0.14099078533911125, 11.999999998530152], [75.00068109129413, 0.23193093357023775, 0.5000135882637575]], "r_squared_": 0.9608690897831348, "error_": 0.03802514339965842}
{"freq_range": [2.0, 80.0], "freq_res": 1.0, "aperiodic_params_": [-0.0008401063338224716, 0.9560215733487613], "gaussian_params_": [[8.518024072564907, 1.7188766046356458, 0.27399320273524974], [10.662963139515654, 0.4718589323623242, 0.5081956893430383], [18.40963422515995, 0.24630625769254938, 3.039292248514611], [22.62995372242992, 0.24909140889377399, 1.2914390944730658], [54.83899385882826, 0.15884300115689765, 0.548892434351222], [65.04694231502914, 0.1852982624960246, 0.38584095490767406], [67.38912842221872, 0.24243857542771755, 0.4940045428260924], [68.65322941676156, 0.40415812078938423, 0.26566889878550104], [71.07753720649804, 0.12301062026827618, 0.8570454617559722], [75.14854006554253, 0.2077347966039746, 2.036787231648857]], "peak_params_": [[8.518024072564907, 0.37013174086644285, 0.5479864054704995], [10.662963139515654, 0.3913200023166098, 1.0163913786860765], [18.40963422515995, 0.244482297867206, 6.078584497029222], [22.62995372242992, 0.3178017698857497, 2.5828781889461316], [54.83899385882826, 0.1521543263249867, 1.097784868702444], [65.04694231502914, 0.1839348234384608, 0.7716819098153481], [67.38912842221872, 0.1778451428092107, 0.9880090856521848], [68.65322941676156, 0.18230772411120544, 0.5313377975710021], [71.07753720649804, 0.1486092264547585, 1.7140909235119444], [75.14854006554253, 0.20718658240142096, 4.073574463297714]], "r_squared_": 0.985490410329038, "error_": 0.031976919478913964}
{"freq_range": [2.0, 80.0], "freq_res": 1.0, "aperiodic_params_": [-0.07593330615576613, 0.9490673821076698], "gaussian_params_": [[8.512710153459828, 2.316952604188704, 0.2666858149754719], [10.63324492152946, 0.35268552936127634, 0.6041577223768149], [17.156014148647575, 0.20057188274577592, 2.7505509820575784], [22.777421393544454, 0.32633148832953396, 1.216744544938947], [64.56562065297841, 0.6921200264028722, 0.2600389208487282], [67.50877874217365, 0.2750883437760961, 0.9085905934021911], [71.38572608051399, 0.17102589949374916, 1.5406701122479056], [75.06648123592349, 0.2811345897289825, 0.7932781716753537]], "peak_params_": [[8.512710153459828, 0.44804880160213767, 0.5333716299509438], [10.63324492152946, 0.3097258093186881, 1.2083154447536297], [17.156014148647575, 0.20025364257941014, 5.501101964115157], [22.777421393544454, 0.34190762058750357, 2.433489089877894], [64.56562065297841, 0.17761063359427154, 0.5200778416974564], [67.50877874217365, 0.25297440267755733, 1.8171811868043821], [71.38572608051399, 0.16592066581956022, 3.0813402244958112], [75.06648123592349, 0.29106438223373865, 1.5865563433507075]], "r_squared_": 0.9839705475206996, "error_": 0.034445372137495045}
{"freq_range": [2.0, 80.0], "freq_res": 1.0, "aperiodic_params_": [0.019096044196112598, 0.9383140946498175], "gaussian_params_": [[9.383931945575272, 0.3666249434793507, 1.4315972133755752], [16.692955630613977, 0.1954619623625368, 1.7914908337198332], [22.661444304993925, 0.3275745032296907, 1.153822065848749], [62.90406919827189, 0.061140151039989196, 5.999999999999999], [72.94348522177644, 0.16857081016789463, 5.7414785962330495]], "peak_params_": [[9.383931945575272, 0.35369419788814116, 2.8631944267511504], [16.692955630613977, 0.19261432603255202, 3.5829816674396664], [22.661444304993925, 0.3141701043049052, 2.307644131697498], [62.90406919827189, 0.0987574549485164, 11.999999999999998], [72.94348522177644, 0.18340529168662445, 11.482957192466099]], "r_squared_": 0.9778633688149916, "error_": 0.04016974984041918}
{"freq_range": [2.0, 80.0], "freq_res": 1.0, "aperiodic_params_": [-1.2494330631478856, 0.7560910296749016], "gaussian_params_": [[10.643898949280329, 0.7124698442704501, 0.25000258577106726], [23.087868240703667, 0.17823747317432936, 3.055266445230849], [24.858655621472494, 0.1324504435943113, 0.49863365345140054], [64.62029267506085, 0.12774923776421623, 0.6188284044799156], [72.47439388684408, 0.13681560675161977, 5.999999999999999], [75.24365795774297, 0.26600790191600826, 0.42801206388492685]], "peak_params_": [[10.643898949280329, 0.2584158584685099, 0.5000051715421345], [23.087868240703667, 0.17829111508733453, 6.110532890461698], [24.858655621472494, 0.2737710525792689, 0.9972673069028011], [64.62029267506085, 0.16880200300728632, 1.2376568089598312], [72.47439388684408, 0.1363886314495919, 11.999999999999998], [75.24365795774297, 0.35143141103944897, 0.8560241277698537]], "r_squared_": 0.9510178929827051, "error_": 0.04509642267475464}
{"freq_range": [2.0, 80.0], "freq_res": 1.0, "aperiodic_params_": [-0.6129500200884904, 0.9858528718321782], "gaussian_params_": [[8.51188598088638, 1.6049141851623403, 0.29123901313542083], [10.629171188826698, 0.7516658771996948, 0.27981457447634894], [22.413275794776318, 0.45282583794748277, 2.6596137519883856], [24.972115302468797, 0.13336842364236853, 0.25000000000000155], [46.54362622006818, 0.5669555900055072, 0.2924097207514202], [67.89729977781587, 0.18245648297739375, 1.9882170631480507], [75.5962406478338, 0.14190846977056318, 3.197133846766611]], "peak_params_": [[8.51188598088638, 0.3940019535409198, 0.5824780262708417], [10.629171188826698, 0.312396101406037, 0.5596291489526979], [22.413275794776318, 0.44739177034569266, 5.319227503976771], [24.972115302468797, 0.4147193950282482, 0.5000000000000031], [46.54362622006818, 0.16772667787087236, 0.5848194415028404], [67.89729977781587, 0.19065005033611415, 3.9764341262961014], [75.5962406478338, 0.14082649635626998, 6.394267693533222]], "r_squared_": 0.978735788518617, "error_": 0.044590962224682965}
{"freq_range": [2.0, 80.0], "freq_res": 1.0, "aperiodic_params_": [-0.29146357210357077, 1.0317793663986454], "gaussian_params_": [[9.276649937316845, 0.38101072127740626, 1.2123126005733553], [22.63169327833588, 0.49714609088288286, 2.2266352768973774], [25.48760641415468, 0.40943303464501135, 0.28687977342704923], [54.52537496988444, 0.3001119525555228, 0.7277329737517544], [57.245840503892644, 0.2932544924739362, 0.25002118611897955], [63.388711232648575, 0.3869410200723775, 0.26196043380719786], [66.79046216409792, 0.1418197557818231, 2.30598711298483], [71.45048341167113, 0.6110912463773549, 0.27541309006869064], [75.8696864990515, 0.3364996993385134, 1.635297524791845]], "peak_params_": [[9.276649937316845, 0.37121813927475755, 2.4246252011467107], [22.63169327833588, 0.4903913618782312, 4.453270553794755], [25.48760641415468, 0.37894770601659666, 0.5737595468540985], [54.52537496988444, 0.24261517722896908, 1.4554659475035088], [57.245840503892644, 0.18178454401564648, 0.5000423722379591], [63.388711232648575, 0.16541433552945883, 0.5239208676143957], [66.79046216409792, 0.14123561248151706, 4.61197422596966], [71.45048341167113, 0.19117310567275103, 0.5508261801373813], [75.8696864990515, 0.3354817572569875, 3.27059504958369]], "r_squared_": 0.9760513475729194, "error_": 0.045638921558423404}
{"freq_range": [2.0, 80.0], "freq_res": 1.0, "aperiodic_params_": [-0.3011689875934798, 1.0593278115660436], "gaussian_params_": [[8.51219217387502, 2.2981207974710576, 0.2659611624592521], [10.585614815140561, 1.1727499335510574, 0.25014064401558755], [22.85916505753136, 0.5172521290397457, 2.8224835476879186], [46.52737416495671, 0.8788405578734617, 0.2592629405026569], [67.87219071726918, 0.15802219730093564, 2.879448196741983], [74.23452038710741, 0.1565068949620614, 0.7037822942223696], [76.9222282841165, 0.174504226764526, 0.7601328608804448]], "peak_params_": [[8.51219217387502, 0.4274487207412936, 0.5319223249185042], [10.585614815140561, 0.2974319627705708, 0.5002812880311751], [22.85916505753136, 0.5166086120758202, 5.644967095375837], [46.52737416495671, 0.16683626112442074, 0.5185258810053138], [67.87219071726918, 0.15786660773674832, 5.758896393483966], [74.23452038710741, 0.16457867597571862, 1.4075645884447392], [76.9222282841165, 0.17470177803567077, 1.5202657217608897]], "r_squared_": 0.9830721652760046, "error_": 0.041362584572292325}
