{"freq_range": [2.0, 80.0], "freq_res": 1.0, "aperiodic_params_": [-0.3356371980352703, -0.0019812317519446454], "gaussian_params_": [[9.451530143532597, 0.7690941268245591, 0.28156039880666994], [14.35614076838995, 0.05760798357054721, 2.7455410381694603], [24.872560654667065, 0.3267835539942566, 4.412837348924195], [34.685399009953926, 0.23115262479759197, 0.843629514920136], [38.79752683502141, 0.19513942136076207, 0.8696442892487987], [46.84926404692532, 0.21022803421783615, 5.999999999999999], [47.34305498975867, 1.4241522418788153e-38, 0.8370871569980637]], "peak_params_": [[9.451530143532597, 0.2216813878816084, 0.5631207976133399], [14.35614076838995, 0.07283113020898585, 5.4910820763389205], [24.872560654667065, 0.3269561271413447, 8.82567469784839], [34.685399009953926, 0.2690198537960807, 1.687259029840272], [38.79752683502141, 0.28120910628336593, 1.7392885784975973], [46.84926404692532, 0.2101628356521069, 11.999999999999998], [47.34305498975867, 0.2101628356521069, 1.6741743139961274]], "r_squared_": 0.6917466880466491, "error_": 0.050186416476449704}
{"freq_range": [2.0, 80.0], "freq_res": 1.0, "aperiodic_params_": [-0.20851492831365606, 0.4554921920982506], "gaussian_params_": [[9.270011092256379, 0.5034251474851178, 0.6477246586589652], [12.330843045656831, 0.19442378261663515, 1.638569544250367], [21.33773872088369, 0.21390209682989217, 4.091971249405238], [26.117433131345948, 0.1207567327054159, 0.25122819978830213], [30.561235176059103, 0.1198477348758686, 2.2222129303841918], [36.43218082495432, 0.149011424346023, 2.352503939097015], [40.9994292043841, 0.21804148981537552, 0.7674955684131943], [44.403302232638794, 0.4162446882238658, 0.2927446699056988]], "peak_params_": [[9.270011092256379, 0.48843106158721056, 1.2954493173179304], [12.330843045656831, 0.20639957328211755, 3.277139088500734], [21.33773872088369, 0.2131863604359716, 8.183942498810476], [26.117433131345948, 0.23461773747891435, 0.5024563995766043], [30.561235176059103, 0.14106213375310983, 4.4444258607683835], [36.43218082495432, 0.15286317032903096, 4.70500787819403], [40.9994292043841, 0.24066815777339734, 1.5349911368263887], [44.403302232638794, 0.1620925992669231, 0.5854893398113976]], "r_squared_": 0.9028943134487089, "error_": 0.050387434917948434}
{"freq_range": [2.0, 80.0], "freq_res": 1.0, "aperiodic_params_": [0.983836146252435, 0.7171529002109389], "gaussian_params_": [[24.511459587572826, 0.19623376412620427, 2.1491004844640607], [34.02571513197765, 0.15476368427210585, 0.2500019981254975], [39.16736320978171, 0.11536918900369014, 0.2799606355370614], [46.912716948821995, 0.16770992908757484, 5.1619296538758235], [59.232567510417354, 0.10550428435959358, 2.987970528464861], [69.78789157244795, 0.14714091645415156, 1.295460160323647], [75.49289904246508, 0.6753803160881489, 0.3029344567809534]], "peak_params_": [[24.511459587572826, 0.19124891931152554, 4.298200968928121], [34.02571513197765, 0.1612991523367177, 0.500003996250995], [39.16736320978171, 0.14828865492994117, 0.5599212710741228], [46.912716948821995, 0.16771015519055102, 10.323859307751647], [59.232567510417354, 0.11599701822812375, 5.975941056929722], [69.78789157244795, 0.14534912445462003, 2.590920320647294], [75.49289904246508, 0.17979724106787204, 0.6058689135619068]], "r_squared_": 0.7808343677537303, "error_": 0.08279536432299256}
{"freq_range": [2.0, 80.0], "freq_res": 1.0, "aperiodic_params_": [0.05541885761459028, 0.624513671738556], "gaussian_params_": [[9.949699516929892, 0.43437061630543117, 1.088360325143654], [17.73161177414023, 0.31092769732387304, 4.204086806738822], [22.899361066379527, 0.21468027594592917, 0.6865851450270137], [31.547965400819226, 0.15647620036709872, 5.999999999935317]], "peak_params_": [[9.949699516929892, 0.49146429215130955, 2.176720650287308], [17.73161177414023, 0.3225216028691955, 8.408173613477643], [22.899361066379527, 0.4108948073835428, 1.3731702900540275], [31.547965400819226, 0.15701311771969895, 11.999999999870633]], "r_squared_": 0.9403066430473709, "error_": 0.05957803048190848}
{"freq_range": [2.0, 80.0], "freq_res": 1.0, "aperiodic_params_": [-0.11725957577673302, 0.49777714196637096], "gaussian_params_": [[9.320759487878181, 0.5394507935081737, 0.5066917906418146], [11.128215487680414, 0.19362213483395677, 1.1995125924035883], [20.81623410503519, 0.27426900369694723, 5.396641572513286], [36.98366774753618, 0.11455765348166648, 0.2500001280485388], [39.35538661153673, 0.15816800808966444, 5.999999998084472], [50.21618180609722, 0.2412660276282186, 1.320729639342957]], "peak_params_": [[9.320759487878181, 0.5065776015563246, 1.0133835812836292], [11.128215487680414, 0.24719201700371374, 2.3990251848071766], [20.81623410503519, 0.2755784922453092, 10.793283145026573], [36.98366774753618, 0.26380908725697794, 0.5000002560970777], [39.35538661153673, 0.15883019359113482, 11.999999996168944], [50.21618180609722, 0.2708395927017816, 2.641459278685914]], "r_squared_": 0.9058877996533713, "error_": 0.05656700624986551}
{"freq_range": [2.0, 80.0], "freq_res": 1.0, "aperiodic_params_": [-0.08406839297069146, 0.6362687443082973], "gaussian_params_": [[9.224062789536934, 0.5984364916815241, 0.8344464428900638], [11.55958681035699, 0.7731060380574998, 0.31546054397866724], [14.19106283121466, 0.19567234067349082, 1.6229947563425562], [17.60168818322984, 0.2450737960111004, 0.25758491247533344], [22.35854295462173, 0.2718159257221518, 4.629241970524632], [34.989419672199055, 0.1581300853703291, 0.25000027699275823], [44.30983850625919, 0.15479124798854962, 0.8289750437617694], [50.07761194651793, 0.1803873229619367, 0.8731717702647995], [55.63747687395993, 0.36330001163838516, 0.2741558748791056], [72.50313139454565, 0.7317910862544224, 0.3002268844900906]], "peak_params_": [[9.224062789536934, 0.5826490685782499, 1.6688928857801275], [11.55958681035699, 0.395005832451554, 0.6309210879573345], [14.19106283121466, 0.24757322759984524, 3.2459895126851124], [17.60168818322984, 0.2610971848282364, 0.5151698249506669], [22.35854295462173, 0.27100370481178515, 9.258483941049263], [34.989419672199055, 0.1645193799961424, 0.5000005539855165], [44.30983850625919, 0.14435313266673855, 1.657950087523539], [50.07761194651793, 0.17967615321312702, 1.746343540529599], [55.63747687395993, 0.1515563445974375, 0.5483117497582112], [72.50313139454565, 0.18605094681825252, 0.6004537689801812]], "r_squared_": 0.960656640839331, "error_": 0.04213974322830235}
{"freq_range": [2.0, 80.0], "freq_res": 1.0, "aperiodic_params_": [0.022904803082082346, 0.4821546508469688], "gaussian_params_": [[9.68145044967823, 0.4377911614197658, 0.8627952451423123], [12.453988379968877, 0.2123620981749245, 1.8580465377674273], [20.333370504246083, 0.11174178489242051, 0.34868551664625885], [22.286263212200925, 0.23361846816545104, 5.999999999999483]], "peak_params_": [[9.68145044967823, 0.5264300333066239, 1.7255904902846246], [12.453988379968877, 0.2716912221975786, 3.7160930755348547], [20.333370504246083, 0.28806476426598543, 0.6973710332925177], [22.286263212200925, 0.23335434355023493, 11.999999999998966]], "r_squared_": 0.907536743108392, "error_": 0.059024478292698114}
{"freq_range": [2.0, 80.0], "freq_res": 1.0, "aperiodic_params_": [-0.2841931353237061, 0.025112836776974], "gaussian_params_": [[9.48826749848593, 0.8959707101913088, 0.30504356275983935], [12.031015346613305, 0.3061843765681421, 1.5833412641745297], [22.0775606135123, 0.31330639673410227, 4.446772240102599], [35.83973390513725, 0.17685078098209195, 0.33681059867134544], [37.77597643550116, 0.23163296013615664, 0.6753976685009218], [44.520027438236525, 0.13561460294444966, 0.30114528800843965], [47.206139247010384, 0.15001694789815292, 5.999999999999999]], "peak_params_": [[9.48826749848593, 0.30200638908685934, 0.6100871255196787], [12.031015346613305, 0.33015328717472625, 3.1666825283490594], [22.0775606135123, 0.3132808132340316, 8.893544480205199], [35.83973390513725, 0.19377436492433447, 0.6736211973426909], [37.77597643550116, 0.2659798773843496, 1.3507953370018435], [44.520027438236525, 0.17829144008493675, 0.6022905760168793], [47.206139247010384, 0.14992848343933365, 11.999999999999998]], "r_squared_": 0.5777954079370378, "error_": 0.05848764188961725}
{"freq_range": [2.0, 80.0], "freq_res": 1.0, "aperiodic_params_": [-0.06858514814611155, 0.4296642270421276], "gaussian_params_": [[9.462722820502938, 0.4352694287665863, 0.6352639909500531], [11.904069844010474, 0.2779089087189543, 1.6430524502473853], [20.591501466226457, 0.3455630307638857, 4.4443734191909385], [33.64389620259217, 0.1368611402389731, 5.999999999999999]], "peak_params_": [[9.462722820502938, 0.4036787972324318, 1.2705279819001063], [11.904069844010474, 0.3311304003970922, 3.2861049004947707], [20.591501466226457, 0.3589650564253852, 8.888746838381877], [33.64389620259217, 0.14026820011465557, 11.999999999999998]], "r_squared_": 0.8848069720803513, "error_": 0.06562438618080338}
{"freq_range": [2.0, 80.0], "freq_res": 1.0, "aperiodic_params_": [0.20781867544671567, 0.7308461700802702], "gaussian_params_": [[9.447060946654842, 0.9779411495612609, 0.31913429863296866], [10.955860528188127, 0.2517867025372199, 1.0990813910287318], [16.9569898236533, 0.2933055116602523, 3.0044096057282563], [22.833232799640196, 0.25847714418749124, 1.9897326964678357], [28.547872564227227, 0.12157672180399468, 5.999999993344895], [43.54795688463215, 0.13299917633879388, 5.999999999999999], [44.038123205603625, 0.08752149806472742, 0.2500010212924695]], "peak_params_": [[9.447060946654842, 0.4276762932570357, 0.6382685972659373], [10.955860528188127, 0.294361154988187, 2.1981627820574636], [16.9569898236533, 0.31587521260572193, 6.008819211456513], [22.833232799640196, 0.37603326655626623, 3.9794653929356714], [28.547872564227227, 0.1304830922735083, 11.99999998668979], [43.54795688463215, 0.2235439950611916, 11.999999999999998], [44.038123205603625, 0.2235439950611916, 0.500002042584939]], "r_squared_": 0.952207996727548, "error_": 0.05584106419381099}
{"freq_range": [2.0, 80.0], "freq_res": 1.0, "aperiodic_params_": [0.04662793404031585, 0.6538851636612116], "gaussian_params_": [[9.532159162908547, 0.4884471819051103, 0.8683302651980321], [16.47194705561747, 0.3468522116423113, 3.866228420194081], [22.962784002175923, 0.3062447403847088, 1.6544668012380774], [26.257686541680677, 0.32184381250823296, 0.26068192902255966], [28.58463380021631, 0.13430222547213924, 0.760323599005032], [35.18773444332824, 0.13701737984548673, 5.99996651443212], [40.41881452371765, 0.12512235572674296, 0.9826524975624963], [44.34080181699635, 0.32034687197354317, 0.28537266982796333], [50.34797120852142, 0.16961354278765733, 1.2005204287708637]], "peak_params_": [[9.532159162908547, 0.5079174969675454, 1.7366605303960643], [16.47194705561747, 0.34514542245860097, 7.732456840388162], [22.962784002175923, 0.40695732327650525, 3.308933602476155], [26.257686541680677, 0.3137254932331649, 0.5213638580451193], [28.58463380021631, 0.19840346430283806, 1.520647198010064], [35.18773444332824, 0.1369539302367042, 11.99993302886424], [40.41881452371765, 0.21359062130531137, 1.9653049951249926], [44.34080181699635, 0.20377026923636954, 0.5707453396559267], [50.34797120852142, 0.1691427616447625, 2.4010408575417275]], "r_squared_": 0.9628270342628664, "error_": 0.04692096247130184}
{"freq_range": [2.0, 80.0], "freq_res": 1.0, "aperiodic_params_": [0.058417467039903415, 0.6307613385204899], "gaussian_params_": [[9.267853672412562, 0.5027148446153363, 0.6180601410577196], [11.105993289728234, 0.19099106275849945, 1.1735727329590393], [15.6881947396336, 0.3123046811133361, 2.7220820040581732], [22.41530008944182, 0.3983432543568075, 2.193609858593644], [26.03310239457547, 0.16212656757729216, 0.25000295132713957], [30.452034799119467, 0.14117257767382094, 3.849768997487949], [37.39828992400739, 0.4302533060038333, 0.2809891377450242], [39.386007862252924, 0.2473746487439571, 0.5591056122212915], [41.23904833746109, 0.240496435826288, 0.48692182631439684], [43.87528394540069, 0.20905944568290283, 0.6559071086492051], [56.42050354548762, 0.4577970420875826, 0.29790416681148774]], "peak_params_": [[9.267853672412562, 0.5110903729181613, 1.2361202821154391], [11.105993289728234, 0.2709881678883745, 2.3471454659180786], [15.6881947396336, 0.3159510510092708, 5.4441640081163465], [22.41530008944182, 0.425182936080682, 4.387219717187288], [26.03310239457547, 0.33808822632390495, 0.5000059026542791], [30.452034799119467, 0.14121279624862848, 7.699537994975898], [37.39828992400739, 0.19081524862684607, 0.5619782754900484], [39.386007862252924, 0.20692395605131464, 1.118211224442583], [41.23904833746109, 0.22035030524882515, 0.9738436526287937], [43.87528394540069, 0.20560295229640646, 1.3118142172984102], [56.42050354548762, 0.1690515748025655, 0.5958083336229755]], "r_squared_": 0.9613172825591968, "error_": 0.04396133427349536}
{"freq_range": [2.0, 80.0], "freq_res": 1.0, "aperiodic_params_": [-0.2540872542784991, 0.18283692076213612], "gaussian_params_": [[9.456176884268569, 1.1930136327671599, 0.30563625017916435], [12.710491748682848, 0.26631964801934155, 1.9386845644676185], [17.560734953944852, 0.6183863458015497, 0.2666793506561665], [21.581583715019992, 0.2741307531185147, 3.078843167424309], [25.591425250888097, 0.5277329368764593, 0.26830710301860705], [28.80801634222258, 0.126956743667482, 2.306483332866186], [39.54796540069266, 0.18639525686631173, 5.999999999999989]], "peak_params_": [[9.456176884268569, 0.4343778371303936, 0.6112725003583287], [12.710491748682848, 0.26901299063107714, 3.877369128935237], [17.560734953944852, 0.3053468033791079, 0.533358701312333], [21.581583715019992, 0.275830562633438, 6.157686334848618], [25.591425250888097, 0.3384931480171712, 0.5366142060372141], [28.80801634222258, 0.18130858546639395, 4.612966665732372], [39.54796540069266, 0.1858680024846674, 11.999999999999979]], "r_squared_": 0.7360862448100831, "error_": 0.05868992941370713}
{"freq_range": [2.0, 80.0], "freq_res": 1.0, "aperiodic_params_": [-0.270196390611815, 0.22289172348008723], "gaussian_params_": [[9.328133910339892, 0.607456774961393, 0.5410322416656997], [11.508850773222004, 0.7736160642121067, 0.29668868104229745], [19.981697073123435, 0.2902149012347734, 4.899437348119317], [35.7258666288591, 0.1867646612166674, 2.0319734162431575], [40.32299005128796, 0.5773446851023821, 0.2549127179936233], [42.522022263971046, 0.23480539457781954, 1.0939483862349346], [48.95992648547562, 0.15909096781823218, 1.9401308107691762], [54.09825638971487, 0.16373800486840173, 1.4926611445920914], [58.820580946952006, 0.21442124367577986, 0.6245533925079775]], "peak_params_": [[9.328133910339892, 0.5289446740175914, 1.0820644833313995], [11.508850773222004, 0.273524682025014, 0.5933773620845949], [19.981697073123435, 0.2902128761795766, 9.798874696238634], [35.7258666288591, 0.18645827748325483, 4.063946832486315], [40.32299005128796, 0.29569281046303847, 0.5098254359872466], [42.522022263971046, 0.2151621794484817, 2.1878967724698692], [48.95992648547562, 0.15953668842435614, 3.8802616215383523], [54.09825638971487, 0.1688313309174041, 2.985322289184183], [58.820580946952006, 0.2064992251394241, 1.249106785015955]], "r_squared_": 0.7473625380131437, "error_": 0.057254055774500115}
{"freq_range": [2.0, 80.0], "freq_res": 1.0, "aperiodic_params_": [-0.06999077706266754, 0.5897739907996845], "gaussian_params_": [[9.171508861522867, 0.5380983638649265, 0.7827220346220858], [11.746224145443001, 0.2861956383614998, 0.6551209480591662], [20.388223088888118, 0.3040278584582686, 5.999999999999999], [34.71827634319862, 0.1989030705208469, 0.5461625742084953]], "peak_params_": [[9.171508861522867, 0.5755696470918622, 1.5654440692441716], [11.746224145443001, 0.38071296763637574, 1.3102418961183324], [20.388223088888118, 0.30339210441382847, 11.999999999999998], [34.71827634319862, 0.18979682431506506, 1.0923251484169907]], "r_squared_": 0.9287994543491247, "error_": 0.05953781776565771}
{"freq_range": [2.0, 80.0], "freq_res": 1.0, "aperiodic_params_": [-0.0299979163326953, 0.5958360026618377], "gaussian_params_": [[9.53256127690239, 0.600073901283241, 0.7827740476939523], [12.52293493249308, 0.27785530108173756, 1.940624031356248], [20.96064906888472, 0.2618203292779074, 3.9292439889160984], [33.54796520377782, 0.166958530048763, 5.999999999802981]], "peak_params_": [[9.53256127690239, 0.6268474547425559, 1.5655480953879046], [12.52293493249308, 0.3037187649824475, 3.881248062712496], [20.96064906888472, 0.2805720373939832, 7.858487977832197], [33.54796520377782, 0.16754859965360802, 11.999999999605961]], "r_squared_": 0.9314237518338933, "error_": 0.06565630839983372}
{"freq_range": [2.0, 80.0], "freq_res": 1.0, "aperiodic_params_": [-0.1849574844617446, 0.28679589018307616], "gaussian_params_": [[9.493467220158205, 0.5619932102532359, 0.5939246893861478], [12.452034606886844, 0.2561995244407709, 1.9360765143036192], [22.118124521957213, 0.4323938262961741, 3.910959951326502], [27.196912555288158, 0.10062475582190038, 1.2571455938537788], [31.453747904231143, 0.3882748329761339, 0.3518635711069382], [41.66259395175961, 0.2087220406197264, 5.999999999999999]], "peak_params_": [[9.493467220158205, 0.45177827706195806, 1.1878493787722957], [12.452034606886844, 0.264610006240261, 3.8721530286072383], [22.118124521957213, 0.43318929047606974, 7.821919902653004], [27.196912555288158, 0.30833241360448793, 2.5142911877075576], [31.453747904231143, 0.24593048796188482, 0.7037271422138764], [41.66259395175961, 0.20839333742222976, 11.999999999999998]], "r_squared_": 0.8937071865706184, "error_": 0.05078311388662384}
{"freq_range": [2.0, 80.0], "freq_res": 1.0, "aperiodic_params_": [0.04730694049831383, 0.5861991284901868], "gaussian_params_": [[9.756579627224774, 0.5147572414137944, 1.0062494607539292], [14.956056141585686, 0.34190934826961655, 2.9385105107517706], [21.4096660660026, 0.38890480490769724, 2.134282325507277], [23.66767295672893, 0.3504568848897187, 0.3178814854927373], [25.95124695140347, 0.21868403886824597, 0.2506409680013795], [29.777791356567192, 0.19873691068769966, 5.159829026855541], [39.60631899622311, 0.24130672134300246, 1.8641046852953773], [44.81026769956044, 0.20728688829372655, 1.3316227617410517], [50.4387386475571, 0.20738770054299563, 1.4071729259768682], [58.480559242511326, 0.6462667729915658, 0.2958762902702394]], "peak_params_": [[9.756579627224774, 0.5824974784999915, 2.0124989215078584], [14.956056141585686, 0.34944029935595416, 5.877021021503541], [21.4096660660026, 0.46980019961501784, 4.268564651014554], [23.66767295672893, 0.49828039054021217, 0.6357629709854746], [25.95124695140347, 0.4053821942048915, 0.501281936002759], [29.777791356567192, 0.19867186048547336, 10.319658053711082], [39.60631899622311, 0.26421557582820077, 3.7282093705907546], [44.81026769956044, 0.21154208460719726, 2.6632455234821033], [50.4387386475571, 0.1977447149656928, 2.8143458519537363], [58.480559242511326, 0.17281422858321538, 0.5917525805404787]], "r_squared_": 0.9554654462800574, "error_": 0.04716157452474592}
{"freq_range": [2.0, 80.0], "freq_res": 1.0, "aperiodic_params_": [0.1472897088633636, 0.6761990723709239], "gaussian_params_": [[9.318579626188418, 0.4897881019348185, 0.7410919647246282], [11.772129400112577, 0.23107484212630194, 1.5936167636048566], [15.480527362382471, 0.3556469866420525, 0.7702518895383232], [17.517005008326823, 0.4636284573011895, 0.4873605242406289], [19.53480592996024, 0.45225325766343977, 0.5644601114155716], [21.604958196723167, 0.4386006497861898, 0.6909944076496306], [23.564005839754362, 0.6544793954115238, 0.4231794856356839], [25.602868456043772, 0.7068961625692014, 0.29522228174104304], [36.452034850226674, 0.14308917743534005, 5.999999999999999], [44.37814526086498, 0.35754655417084663, 0.27985044429648187]], "peak_params_": [[9.318579626188418, 0.49746017873233467, 1.4821839294492565], [11.772129400112577, 0.22947658135247362, 3.187233527209713], [15.480527362382471, 0.322704558555039, 1.5405037790766465], [17.517005008326823, 0.29800808611384566, 0.9747210484812578], [19.53480592996024, 0.3549162009900948, 1.1289202228311432], [21.604958196723167, 0.3810813265783289, 1.3819888152992612], [23.564005839754362, 0.4026338647104128, 0.8463589712713678], [25.602868456043772, 0.3174137119682668, 0.5904445634820861], [36.452034850226674, 0.14268366702194513, 11.999999999999998], [44.37814526086498, 0.2083582788927788, 0.5597008885929637]], "r_squared_": 0.9502422811753624, "error_": 0.05268188828516845}
{"freq_range": [2.0, 80.0], "freq_res": 1.0, "aperiodic_params_": [0.16688005863236727, 0.7054132213256952], "gaussian_params_": [[9.329006684247345, 0.4490022025804174, 0.7498751424051154], [18.033214301642797, 0.3332356292791893, 5.147529523821519], [22.519520640559954, 0.32403071124200405, 0.31292493022287693], [23.62358570073995, 0.49089693568468035, 0.27450016981844105], [26.00337927094481, 0.1847056063322107, 0.25001508335940487], [38.45203459913595, 0.1421784855710429, 5.999999999999999], [44.00227901791363, 0.1067886506590522, 0.25003874427052913]], "peak_params_": [[9.329006684247345, 0.4792567219225643, 1.4997502848102309], [18.033214301642797, 0.33365506534006595, 10.295059047643038], [22.519520640559954, 0.35124350350795097, 0.6258498604457539], [23.62358570073995, 0.36975133423984274, 0.5490003396368821], [26.00337927094481, 0.3017945280159351, 0.5000301667188097], [38.45203459913595, 0.1419556808051513, 11.999999999999998], [44.00227901791363, 0.1995052190852109, 0.5000774885410583]], "r_squared_": 0.9606107983262808, "error_": 0.04931466158870633}
{"freq_range": [2.0, 80.0], "freq_res": 1.0, "aperiodic_params_": [0.13188471103419905, 0.6707967712412582], "gaussian_params_": [[9.275174062415457, 0.531604132489568, 0.6900678839637862], [13.98904741702839, 0.1979009055473409, 2.350576341106749], [21.5619794281081, 0.32353577403264555, 5.999989788306229], [23.569268303132727, 0.49019705741155645, 0.28327250461500925], [25.979545683489242, 0.06669437078074243, 0.2500042504025929], [43.88091043456343, 0.1986512159433707, 0.6976049559256623]], "peak_params_": [[9.275174062415457, 0.5479290599406741, 1.3801357679275723], [13.98904741702839, 0.344115674613543, 4.701152682213498], [21.5619794281081, 0.3232695588637668, 11.999979576612459], [23.569268303132727, 0.4522007634635328, 0.5665450092300185], [25.979545683489242, 0.31257560833388287, 0.5000085008051858], [43.88091043456343, 0.1960748171366058, 1.3952099118513246]], "r_squared_": 0.9482498626810069, "error_": 0.055303526758914055}
{"freq_range": [2.0, 80.0], "freq_res": 1.0, "aperiodic_params_": [-0.00326682942340345, 0.5536052566325156], "gaussian_params_": [[9.3505377032532, 0.5229401646805452, 0.6064609591109855], [14.632039898310978, 0.3803232272471076, 2.887873834428876], [22.862342604286905, 0.4932547802063373, 2.708762842018626], [29.74327860170664, 0.191175527771778, 1.4948122231647945], [33.387516331430064, 0.39845602861563983, 0.3376084478209614], [36.60002442738524, 0.25862624860348243, 0.6980082934041937], [40.005372582124686, 0.2746095687453374, 1.6637450950931625], [43.90266776366886, 0.21926189203983923, 0.6510574086019801], [55.81116621487714, 0.22122771352232673, 0.6988922497895025]], "peak_params_": [[9.3505377032532, 0.4992798641213932, 1.212921918221971], [14.632039898310978, 0.3845538218265128, 5.775747668857752], [22.862342604286905, 0.49833954933832214, 5.417525684037252], [29.74327860170664, 0.20370000300507374, 2.989624446329589], [33.387516331430064, 0.22449862296981915, 0.6752168956419228], [36.60002442738524, 0.27319216803578183, 1.3960165868083874], [40.005372582124686, 0.2746099635099579, 3.327490190186325], [43.90266776366886, 0.23220402365326154, 1.3021148172039603], [55.81116621487714, 0.21329820217975448, 1.397784499579005]], "r_squared_": 0.9455842400875921, "error_": 0.048891389171052145}
{"freq_range": [2.0, 80.0], "freq_res": 1.0, "aperiodic_params_": [-0.05382412642997525, 0.6029469926314519], "gaussian_params_": [[9.282478091657108, 0.5269020766763827, 0.7016387816000842], [11.595819043791314, 0.4232099938039793, 0.34709548228374576], [15.992196119913695, 0.2987126098902073, 3.0694594222570033], [21.52931768271855, 0.44256516071661944, 0.3085989947138461], [23.663440031187378, 0.3306116661036511, 1.8858865874620274], [28.04682149419812, 0.13833298256401427, 0.2501032773492766], [36.126752020391066, 0.10564555315737606, 5.9999999997073665], [40.613871234696354, 0.32951985259286626, 0.29002410838801185], [44.37342394342517, 0.3740001543690237, 0.2923481057639992]], "peak_params_": [[9.282478091657108, 0.5081951954313363, 1.4032775632001684], [11.595819043791314, 0.343371466764444, 0.6941909645674915], [15.992196119913695, 0.2991780373792505, 6.138918844514007], [21.52931768271855, 0.4129676789762768, 0.6171979894276922], [23.663440031187378, 0.3490298658775287, 3.771773174924055], [28.04682149419812, 0.20179165455386772, 0.5002065546985532], [36.126752020391066, 0.10562198239252973, 11.999999999414733], [40.613871234696354, 0.21178806676048034, 0.5800482167760237], [44.37342394342517, 0.21008085129225273, 0.5846962115279984]], "r_squared_": 0.9528242108993975, "error_": 0.04772801424242474}
{"freq_range": [2.0, 80.0], "freq_res": 1.0, "aperiodic_params_": [-0.23379013554642267, 0.5258145965899509], "gaussian_params_": [[9.25454426322674, 0.56799971192433, 0.8316151840408249], [12.11879209526851, 0.38489957251660656, 0.8334714702298887], [14.478844421676108, 0.5823006785921429, 0.33196919834790617], [16.810958314684918, 0.26224453435285205, 1.1185122234524545], [22.08195980737241, 0.27093385884924, 2.4288105182847977], [27.826978489574472, 0.14538922808307508, 0.511318239948189], [35.85989089282638, 0.07554534132067858, 3.6071592441064557], [40.93646334298223, 0.14142274357357884, 0.4609058579034816], [44.36344214131394, 0.4702082671327851, 0.2637273286237621], [50.81509033999013, 0.18102699572093997, 0.6940177511690726], [63.21204671569509, 0.20356979317853122, 0.5657037480367596], [72.56017410016929, 0.5153117675905461, 0.255966422580556]], "peak_params_": [[9.25454426322674, 0.5423568004154511, 1.6632303680816498], [12.11879209526851, 0.3835258706169582, 1.6669429404597773], [14.478844421676108, 0.24810814555287697, 0.6639383966958123], [16.810958314684918, 0.2888782151093757, 2.237024446904909], [22.08195980737241, 0.27083223373925935, 4.857621036569595], [27.826978489574472, 0.15825394102626889, 1.022636479896378], [35.85989089282638, 0.07548839534397789, 7.214318488212911], [40.93646334298223, 0.1674556370682494, 0.9218117158069632], [44.36344214131394, 0.18784663060213647, 0.5274546572475242], [50.81509033999013, 0.1747257077061095, 1.3880355023381452], [63.21204671569509, 0.18975950526442387, 1.1314074960735192], [72.56017410016929, 0.1177428170680157, 0.511932845161112]], "r_squared_": 0.9558669211854501, "error_": 0.033819725811815846}
{"freq_range": [2.0, 80.0], "freq_res": 1.0, "aperiodic_params_": [-0.24170812337701142, 0.40239479337683814], "gaussian_params_": [[9.505708169119634, 0.6502144742746654, 0.7301845752507761], [12.752581208533316, 0.19725902886790322, 1.7554828678202148], [19.741782020980207, 0.18843272527977034, 3.268897071026466], [29.669525361007803, 0.15699051978002776, 5.684128709646555], [41.04532989640071, 0.10692566288879723, 0.25021503728808425], [44.1837278210724, 0.14998099430731815, 4.7466419731221885], [58.45580473570251, 0.7551434801953949, 0.2817500074217904]], "peak_params_": [[9.505708169119634, 0.5773830562528417, 1.4603691505015521], [12.752581208533316, 0.21991183214755627, 3.5109657356404296], [19.741782020980207, 0.22482328246440952, 6.537794142052932], [29.669525361007803, 0.15982167872151587, 11.36825741929311], [41.04532989640071, 0.24648483791744147, 0.5004300745761685], [44.1837278210724, 0.15640985499956406, 9.493283946244377], [58.45580473570251, 0.2062123614235014, 0.5635000148435808]], "r_squared_": 0.8969575466022385, "error_": 0.05078678253503989}
{"freq_range": [2.0, 80.0], "freq_res": 1.0, "aperiodic_params_": [-0.07213445683040277, 0.5643789970050765], "gaussian_params_": [[9.419289429359772, 0.6895438181894532, 0.7284459038912074], [13.363557473997297, 0.21444784989873533, 2.317415195008448], [20.744067752346844, 0.32597233820590804, 3.945890299650943], [27.754137224731313, 0.1559090573362663, 1.1766359076780448], [31.09347147658031, 0.17145575609634572, 0.6711434600500349], [39.998951207964666, 0.17006256376990075, 5.1670722074803885], [40.96887658699, 0.06184302967586581, 0.25041426053440374], [49.0959307957418, 0.06450846440436675, 1.7931642882101406], [58.44845240876285, 0.7503145547617908, 0.28575804023159473], [72.43245832297944, 0.5948998334170067, 0.2877794738382812]], "peak_params_": [[9.419289429359772, 0.6245923554495932, 1.456891807782415], [13.363557473997297, 0.25934112367182405, 4.634830390016896], [20.744067752346844, 0.326425164239264, 7.891780599301886], [27.754137224731313, 0.22412424289455546, 2.3532718153560896], [31.09347147658031, 0.22171711979895048, 1.3422869201000698], [39.998951207964666, 0.1700996478565654, 10.334144414960777], [40.96887658699, 0.2282710321401329, 0.5008285210688075], [49.0959307957418, 0.1017120411682827, 3.5863285764202812], [58.44845240876285, 0.2193943645723776, 0.5715160804631895], [72.43245832297944, 0.19234221973034837, 0.5755589476765623]], "r_squared_": 0.9482490315917437, "error_": 0.04653779674786878}
{"freq_range": [2.0, 80.0], "freq_res": 1.0, "aperiodic_params_": [0.08528362670166818, 0.6206692222809154], "gaussian_params_": [[9.365348202102385, 0.6499133145866368, 0.8405438199888609], [16.16475605858706, 0.28997896281932006, 3.0308187182868074], [22.372118787064405, 0.2596657218798806, 2.1552962962734536], [26.34277769463722, 0.5824329658909977, 0.2500030120937496], [28.19377136089968, 0.21287666546880182, 0.6840037357439599], [31.33287513505594, 0.1743795885559486, 1.0444676470755079], [37.60698902079007, 0.17158967565561095, 2.219867337735903], [40.58824124533082, 0.589300130845356, 0.2663684356251714], [44.018909855831836, 0.1630070492463452, 0.9062458609336231], [50.15233713279342, 0.19914417181118602, 0.9405673371870461], [58.46078410074383, 0.7408901184385452, 0.2692670517382802]], "peak_params_": [[9.365348202102385, 0.6090675805022367, 1.6810876399777217], [16.16475605858706, 0.29283452450884095, 6.061637436573615], [22.372118787064405, 0.301265128335382, 4.310592592546907], [26.34277769463722, 0.293243650720195, 0.5000060241874992], [28.19377136089968, 0.21431964281054605, 1.3680074714879198], [31.33287513505594, 0.16792574421125595, 2.0889352941510158], [37.60698902079007, 0.16892147958958648, 4.439734675471806], [40.58824124533082, 0.23241236661100773, 0.5327368712503427], [44.018909855831836, 0.16568489107176954, 1.8124917218672463], [50.15233713279342, 0.19654927871362216, 1.8811346743740922], [58.46078410074383, 0.1713414911143194, 0.5385341034765604]], "r_squared_": 0.968288740436979, "error_": 0.038785478952716924}
{"freq_range": [2.0, 80.0], "freq_res": 1.0, "aperiodic_params_": [-0.02786603130929599, 0.5763543198784361], "gaussian_params_": [[9.27777667837813, 0.6490024140802376, 0.8238981638780526], [17.64168370657213, 0.32572061656304196, 3.9138414814987907], [23.574054565167373, 0.6457278582207137, 0.2904532749610304], [25.97869506696094, 0.17943844136684958, 0.2500000041398535], [30.289014697228986, 0.1617174213169745, 2.5035229037466253], [36.837882531965334, 0.1776726140148126, 1.0133743722347985], [39.46795953938752, 0.5784931710311034, 0.30770599156926703], [41.1452443594213, 0.2025959630115551, 0.5356334757534447], [43.988346276513425, 0.22899954909967324, 0.8203532779971]], "peak_params_": [[9.27777667837813, 0.6416037522815442, 1.6477963277561052], [17.64168370657213, 0.32435939119994023, 7.8276829629975815], [23.574054565167373, 0.3142602552340906, 0.5809065499220608], [25.97869506696094, 0.24936807456840404, 0.500000008279707], [30.289014697228986, 0.16287081126916458, 5.007045807493251], [36.837882531965334, 0.17986552158393798, 2.026748744469597], [39.46795953938752, 0.2006915197075625, 0.6154119831385341], [41.1452443594213, 0.19564180273726384, 1.0712669515068893], [43.988346276513425, 0.22897663108471, 1.6407065559942]], "r_squared_": 0.9375085369283168, "error_": 0.051300317133738116}
{"freq_range": [2.0, 80.0], "freq_res": 1.0, "aperiodic_params_": [0.04298210405849654, 0.6282628018858026], "gaussian_params_": [[9.296919237186087, 0.6326780665733032, 0.7750345142985215], [17.636339649868862, 0.3372799455660226, 4.258125000532148], [23.698796519442723, 0.2598974910397308, 0.5331090081119363], [25.92148899155085, 0.16614592055282423, 0.2500001704078298], [29.77593740502216, 0.13724128980262695, 2.068588943479282], [38.9795511448522, 0.14902678281969242, 3.301896790309672], [40.99762786723378, 0.06660838096151263, 0.2522818367082098], [44.16860881495242, 0.17689636113367435, 0.550681109449555], [50.62957825788989, 0.16307620579546692, 0.9090573563330199]], "peak_params_": [[9.296919237186087, 0.6310372706755196, 1.550069028597043], [17.636339649868862, 0.3360521688495667, 8.516250001064297], [23.698796519442723, 0.33475299080781223, 1.0662180162238726], [25.92148899155085, 0.233185931478874, 0.5000003408156596], [29.77593740502216, 0.14511182903677722, 4.137177886958564], [38.9795511448522, 0.1490316823860831, 6.603793580619344], [40.99762786723378, 0.19018846122203625, 0.5045636734164196], [44.16860881495242, 0.2157046841244682, 1.10136221889911], [50.62957825788989, 0.1502818678657034, 1.8181147126660397]], "r_squared_": 0.9544591894318177, "error_": 0.044281567056922745}
{"freq_range": [2.0, 80.0], "freq_res": 1.0, "aperiodic_params_": [0.0024480018121579225, 0.5969633571623313], "gaussian_params_": [[9.225251024812055, 0.6711135962454211, 0.7545554567700453], [15.438068669787604, 0.35698489277605816, 2.9203077790467065], [21.79581913366351, 0.28075016419573756, 1.9139773992778217], [23.61561123510394, 0.4784141162944831, 0.2642917293620581], [29.211743188307167, 0.12669070850984857, 3.459031177287224], [38.605646420587775, 0.1657604549511968, 2.0199875958121485], [41.0965696471651, 0.11015292644254775, 0.485342477444362], [43.88490433902067, 0.20917912113129916, 0.7306969214228896], [50.7951849634068, 0.17916828221436437, 0.7484461680035401], [56.320920370169084, 0.302206329687711, 0.2774902521522233], [72.45451926431616, 0.5925311581382618, 0.27394497222689335]], "peak_params_": [[9.225251024812055, 0.6732915578391654, 1.5091109135400906], [15.438068669787604, 0.35353202975235537, 5.840615558093413], [21.79581913366351, 0.3221669702200022, 3.8279547985556435], [23.61561123510394, 0.3563645920894696, 0.5285834587241162], [29.211743188307167, 0.12669843754589727, 6.918062354574448], [38.605646420587775, 0.16495294550328488, 4.039975191624297], [41.0965696471651, 0.19056926499928806, 0.970684954888724], [43.88490433902067, 0.21130077773782308, 1.4613938428457791], [50.7951849634068, 0.1725836993532539, 1.4968923360070803], [56.320920370169084, 0.15483372674453588, 0.5549805043044466], [72.45451926431616, 0.14960419704665961, 0.5478899444537867]], "r_squared_": 0.9658712616706412, "error_": 0.03554340145978995}
{"freq_range": [2.0, 80.0], "freq_res": 1.0, "aperiodic_params_": [-0.05300758023313733, 0.5711327813688803], "gaussian_params_": [[9.264311933240194, 0.6007750721205223, 0.6833795206436872], [13.97593678763379, 0.30654065775273465, 2.5383831131796177], [22.108520741150457, 0.3591332426422228, 4.232858663365188], [38.747574184773676, 0.11869395917677374, 3.4929380026466985], [43.65553292174584, 0.25529521827128354, 0.32673720073261725], [50.90697689217042, 0.1710554416543863, 0.7152961620134324]], "peak_params_": [[9.264311933240194, 0.6053290338353952, 1.3667590412873745], [13.97593678763379, 0.3638615907139199, 5.0767662263592355], [22.108520741150457, 0.361089653650088, 8.465717326730376], [38.747574184773676, 0.11850952469265585, 6.985876005293397], [43.65553292174584, 0.18476986734735035, 0.6534744014652345], [50.90697689217042, 0.16986771378469323, 1.4305923240268648]], "r_squared_": 0.9569145823859957, "error_": 0.04620930446562387}
{"freq_range": [2.0, 80.0], "freq_res": 1.0, "aperiodic_params_": [-0.23383614667932076, 0.47937326931185453], "gaussian_params_": [[9.386991525376764, 0.523188550754035, 0.676551228859204], [11.584326404057569, 0.5661482190596188, 0.30538122819619], [16.01303745837807, 0.3053020190283601, 2.8391393029423146], [22.856830814072858, 0.24484803606094496, 2.259176157406255], [28.173962979902022, 0.1369258228000459, 0.4797814731005347], [36.70480029259474, 0.17798929805007976, 0.28730627340633885], [40.278989245603384, 0.12256235407402212, 1.629943341551413], [44.112418998434144, 0.17479521548789953, 0.645379639118506], [50.779590458987386, 0.19281381938809028, 0.6262778165728345]], "peak_params_": [[9.386991525376764, 0.4586794363771035, 1.353102457718408], [11.584326404057569, 0.3369219874415742, 0.61076245639238], [16.01303745837807, 0.30774543774376373, 5.678278605884629], [22.856830814072858, 0.2591354522190781, 4.51835231481251], [28.173962979902022, 0.1465987116371683, 0.9595629462010694], [36.70480029259474, 0.12119236034204095, 0.5746125468126777], [40.278989245603384, 0.12078005782015133, 3.259886683102826], [44.112418998434144, 0.18121356949396805, 1.290759278237012], [50.779590458987386, 0.18123520773791713, 1.252555633145669]], "r_squared_": 0.9508448155416864, "error_": 0.03447836181306058}
{"freq_range": [2.0, 80.0], "freq_res": 1.0, "aperiodic_params_": [-0.41023411644782426, 0.39576409335181045], "gaussian_params_": [[9.42512191411601, 0.45804390548293233, 0.6242929459873553], [12.187354429790206, 0.2673361777244549, 0.9115545278744775], [18.547137628854728, 0.21266007129339476, 4.374406011993564], [38.45203460207442, 0.13755017913894804, 4.872141195652735], [44.008057541772246, 0.13896862915902444, 0.6415041565009085], [50.774288327618976, 0.23526606361233204, 0.689255789935536]], "peak_params_": [[9.42512191411601, 0.3834971984317497, 1.2485858919747106], [12.187354429790206, 0.3312251677574516, 1.823109055748955], [18.547137628854728, 0.21157107144021547, 8.748812023987128], [38.45203460207442, 0.13697023482650872, 9.74428239130547], [44.008057541772246, 0.2108850094382011, 1.283008313001817], [50.774288327618976, 0.22797398665065272, 1.378511579871072]], "r_squared_": 0.8693431319837739, "error_": 0.052851452190340605}
{"freq_range": [2.0, 80.0], "freq_res": 1.0, "aperiodic_params_": [-0.33455841714510176, 0.32311778456470364], "gaussian_params_": [[9.438964225199113, 0.5733782228392101, 0.781932895766082], [19.095930801727715, 0.1572816513959887, 5.999999999999999], [58.47909495883795, 1.239980167852623, 0.25000000000003875]], "peak_params_": [[9.438964225199113, 0.5279690092386505, 1.563865791532164], [19.095930801727715, 0.15726154964181838, 11.999999999999998], [58.47909495883795, 0.1976691806852191, 0.5000000000000775]], "r_squared_": 0.7822194512206941, "error_": 0.07003148524185501}
{"freq_range": [2.0, 80.0], "freq_res": 1.0, "aperiodic_params_": [-0.18225320453833144, 0.47178710056806256], "gaussian_params_": [[9.242116290824931, 0.7682215502030357, 0.8244657586623462], [16.809666004513854, 0.34821322354014206, 3.998562407371853], [28.05321241500691, 0.11654936521148002, 2.5323490562895605], [40.328824033654605, 0.14262705519993976, 5.999999999999999], [58.4658260465462, 0.9744967621785009, 0.2571381259288816], [72.42118072453106, 0.7250500876460912, 0.25449082066830536]], "peak_params_": [[9.242116290824931, 0.7875015849603357, 1.6489315173246923], [16.809666004513854, 0.3479018347549305, 7.997124814743706], [28.05321241500691, 0.14073254060016138, 5.064698112579121], [40.328824033654605, 0.1424147569005667, 11.999999999999998], [58.4658260465462, 0.1907258830616141, 0.5142762518577632], [72.42118072453106, 0.1843321377486702, 0.5089816413366107]], "r_squared_": 0.9401920443520565, "error_": 0.0469017547078115}
{"freq_range": [2.0, 80.0], "freq_res": 1.0, "aperiodic_params_": [-0.09250004516106854, 0.521427447835727], "gaussian_params_": [[9.180092790195264, 0.8474876001518569, 0.8229529354643238], [16.848357523876665, 0.33271532064258624, 3.5367878308657947], [28.750035431020343, 0.10612547501568412, 2.998118209647692], [38.967587568707565, 0.09451436310958013, 3.0425562266322093], [43.54796540086405, 0.06850979912210547, 5.999999999999999], [58.458515745571404, 0.7307181507190633, 0.2632284606307697]], "peak_params_": [[9.180092790195264, 0.855800910496649, 1.6459058709286476], [16.848357523876665, 0.332462518714163, 7.0735756617315895], [28.750035431020343, 0.11073181005484023, 5.996236419295384], [38.967587568707565, 0.14621957691087384, 6.0851124532644185], [43.54796540086405, 0.09238383708891473, 11.999999999999998], [58.458515745571404, 0.16404808345093225, 0.5264569212615394]], "r_squared_": 0.9453838898155325, "error_": 0.04914326029614873}
{"freq_range": [2.0, 80.0], "freq_res": 1.0, "aperiodic_params_": [-0.04669958395734573, 0.5412018347241738], "gaussian_params_": [[9.159592130381686, 0.8519686053145087, 0.847814381850389], [16.81956228718536, 0.3086218318317495, 3.484004581775284], [29.828423062571453, 0.11152773171569964, 3.5499036392714585], [36.52876739820758, 0.5401814082280283, 0.2671846858040375], [39.885870203182705, 0.15109295255124008, 1.5846782042118177], [43.95826316216849, 0.1851074834832474, 0.8694335336714003], [50.31955970501862, 0.15935142292280058, 1.0408783639564076], [58.46118893383713, 0.7225192573747647, 0.26603676875794]], "peak_params_": [[9.159592130381686, 0.8618709141234699, 1.695628763700778], [16.81956228718536, 0.3083710031960678, 6.968009163550568], [29.828423062571453, 0.11163830998503221, 7.099807278542917], [36.52876739820758, 0.15731746474502384, 0.534369371608075], [39.885870203182705, 0.15254653307528532, 3.1693564084236354], [43.95826316216849, 0.19012840685306853, 1.7388670673428006], [50.31955970501862, 0.15201581779546514, 2.0817567279128153], [58.46118893383713, 0.1607966383732754, 0.53207353751588]], "r_squared_": 0.9499877388761945, "error_": 0.04361441906990618}
{"freq_range": [2.0, 80.0], "freq_res": 1.0, "aperiodic_params_": [0.24038582411152046, 0.6939337019868231], "gaussian_params_": [[9.209550217230422, 0.7703138029816269, 0.7544570917750918], [14.977018362799505, 0.16472385120180966, 2.100813060257587], [17.390563607559333, 0.5764470840434139, 0.25001381432180364], [20.18766562851486, 0.14903276884997957, 1.7511351424987225], [41.45203636208191, 0.10882338393863737, 3.436644821344292], [50.79517789331347, 0.1691044593179041, 0.6675636704708866], [57.48811427048339, 0.11268798606983546, 1.3753122910681326]], "peak_params_": [[9.209550217230422, 0.7440443372429687, 1.5089141835501836], [14.977018362799505, 0.16656566028623643, 4.201626120515174], [17.390563607559333, 0.30219010428824755, 0.5000276286436073], [20.18766562851486, 0.15762832753093026, 3.502270284997445], [41.45203636208191, 0.10788605382865524, 6.873289642688584], [50.79517789331347, 0.16362491775812327, 1.3351273409417732], [57.48811427048339, 0.1058135565324757, 2.750624582136265]], "r_squared_": 0.9575135814179963, "error_": 0.047060389321860345}
{"freq_range": [2.0, 80.0], "freq_res": 1.0, "aperiodic_params_": [-0.06677224196830017, 0.5219010186642593], "gaussian_params_": [[9.186423987407036, 0.8707766197327136, 0.8441172338977786], [12.34838768802785, 0.18200348991206144, 0.3602402361192574], [14.539137191831209, 0.2889463237588344, 1.4890550555825477], [17.09991278006649, 0.29809051690888216, 0.7686646380302783], [20.501176409139763, 0.25822395577399204, 1.5427764389684582], [23.4962276502635, 0.4614043725199776, 0.3248571066269326], [28.42258418164125, 0.20704665212212023, 0.5230886192483544], [37.01505448837773, 0.06793685198627272, 0.2501135295496225], [38.285501718803836, 0.10725045941816638, 4.215477814256442], [43.81565515963247, 0.13410852661658634, 0.8534674553910115], [50.55077814028063, 0.164723411462293, 0.8763828572134377], [63.50387609914797, 0.5782389008074876, 0.29287823223228193]], "peak_params_": [[9.186423987407036, 0.8500831366575647, 1.6882344677955572], [12.34838768802785, 0.18490731624856127, 0.7204804722385147], [14.539137191831209, 0.28302153375021366, 2.9781101111650954], [17.09991278006649, 0.3889933718654899, 1.5373292760605566], [20.501176409139763, 0.24512142340515797, 3.0855528779369163], [23.4962276502635, 0.21338792918931193, 0.6497142132538652], [28.42258418164125, 0.1548670441760609, 1.0461772384967087], [37.01505448837773, 0.17019172891394174, 0.500227059099245], [38.285501718803836, 0.10703391459718414, 8.430955628512883], [43.81565515963247, 0.17380800751729408, 1.706934910782023], [50.55077814028063, 0.14557946806581457, 1.7527657144268753], [63.50387609914797, 0.13772204743622107, 0.5857564644645639]], "r_squared_": 0.9549031917522084, "error_": 0.03782714358865055}
{"freq_range": [2.0, 80.0], "freq_res": 1.0, "aperiodic_params_": [-0.2649145427840267, 0.3835477180170103], "gaussian_params_": [[9.218476731155064, 0.7676127873063157, 0.7297896732680278], [16.935880974957183, 0.3215963711383468, 5.260727067511785], [50.74370963157682, 0.1963604178373126, 0.5759279745977965]], "peak_params_": [[9.218476731155064, 0.8370529745076298, 1.4595793465360556], [16.935880974957183, 0.32157248492572404, 10.52145413502357], [50.74370963157682, 0.17784946120056333, 1.151855949195593]], "r_squared_": 0.9071456829511847, "error_": 0.05450159227367559}
{"freq_range": [2.0, 80.0], "freq_res": 1.0, "aperiodic_params_": [-0.4561790021332784, 0.2726490663976126], "gaussian_params_": [[9.249780253260134, 0.6556229617745759, 0.6551668719287158], [12.00298282636902, 0.2676735224763513, 1.4645245464766625], [16.747406849161212, 0.2676597498022639, 1.857508146439933], [22.28491826204278, 0.18299839377339908, 1.6111871195063023], [37.37510832152115, 0.3462883181023945, 0.28695353568190685], [42.13025309245465, 0.14164028858299824, 2.1561246055559873], [50.799263373551604, 0.18875233192950608, 0.8573645753835235]], "peak_params_": [[9.249780253260134, 0.6424156961806752, 1.3103337438574316], [12.00298282636902, 0.27798391698741004, 2.929049092953325], [16.747406849161212, 0.2668334462294216, 3.715016292879866], [22.28491826204278, 0.18507090367976298, 3.2223742390126047], [37.37510832152115, 0.15571169962743658, 0.5739070713638137], [42.13025309245465, 0.1413820690999783, 4.312249211111975], [50.799263373551604, 0.18367904009657254, 1.714729150767047]], "r_squared_": 0.8648293825325798, "error_": 0.0437467636148177}
{"freq_range": [2.0, 80.0], "freq_res": 1.0, "aperiodic_params_": [-0.6568348146309438, 0.1538216881981332], "gaussian_params_": [[9.486368180063243, 1.4607581272741095, 0.2992288460771132], [11.93401116609952, 0.26389892655600033, 0.9112072156209283], [16.265998573163348, 0.17054598931725487, 2.2010026704036405], [22.783941750799862, 0.14329516324408434, 0.7790064305664252], [37.422586697294975, 0.16803097748382748, 0.8481131392257814], [41.397082515428714, 0.4900622264212452, 0.2583842103520619], [43.166954143511695, 0.1560166585547571, 1.0907926114459308], [50.89973281359299, 0.20068319174956928, 0.6938137921260977], [62.3664560887591, 0.07680892344875682, 5.999990286764983]], "peak_params_": [[9.486368180063243, 0.39205403264780514, 0.5984576921542264], [11.93401116609952, 0.28927512882726203, 1.8224144312418566], [16.265998573163348, 0.1693175929425954, 4.402005340807281], [22.783941750799862, 0.13947041320585063, 1.5580128611328503], [37.422586697294975, 0.1484252624729142, 1.6962262784515627], [41.397082515428714, 0.17230090826335864, 0.5167684207041238], [43.166954143511695, 0.15461969898391326, 2.1815852228918615], [50.89973281359299, 0.2113662135006824, 1.3876275842521955], [62.3664560887591, 0.07666579712267829, 11.999980573529966]], "r_squared_": 0.667776420081526, "error_": 0.046213962018308415}
{"freq_range": [2.0, 80.0], "freq_res": 1.0, "aperiodic_params_": [-0.4734535735300774, 0.19630127857824803], "gaussian_params_": [[9.25869490624081, 0.8125679503952246, 0.8071420875237822], [15.417813649264374, 0.1564516338969332, 2.932805272053057], [33.98582640625151, 0.078050901451613, 0.25001522078110644], [36.02888756257749, 0.10000491142685156, 0.2500181216323407], [38.659735585079524, 0.13461188021683002, 5.999999999999999], [50.624452046457414, 0.2028569317166295, 0.8273194893040998]], "peak_params_": [[9.25869490624081, 0.7861609990448055, 1.6142841750475645], [15.417813649264374, 0.15492859833677408, 5.865610544106114], [33.98582640625151, 0.17749193915006467, 0.5000304415622129], [36.02888756257749, 0.22135448361813093, 0.5000362432646814], [38.659735585079524, 0.13439559102313559, 11.999999999999998], [50.624452046457414, 0.1992358226972012, 1.6546389786081996]], "r_squared_": 0.8190739026496495, "error_": 0.05322678718070484}
{"freq_range": [2.0, 80.0], "freq_res": 1.0, "aperiodic_params_": [-0.3354388570931826, 0.30373934128404056], "gaussian_params_": [[9.179602823244288, 0.9894365055608143, 0.8616491267440943], [16.102825100268895, 0.2806901111380733, 3.106052206506493], [38.36075298635187, 0.14931972328496565, 5.999999999999999], [50.56741712375658, 0.21584123778294748, 0.5899624333955771], [58.49054075572526, 0.9998597225437638, 0.26050390019461517]], "peak_params_": [[9.179602823244288, 0.9887194513087303, 1.7232982534881887], [16.102825100268895, 0.28068027967773906, 6.212104413012986], [38.36075298635187, 0.14905006603582516, 11.999999999999998], [50.56741712375658, 0.18120112360503382, 1.1799248667911542], [58.49054075572526, 0.1705148032525151, 0.5210078003892303]], "r_squared_": 0.9026375087559312, "error_": 0.05057275276941255}
{"freq_range": [2.0, 80.0], "freq_res": 1.0, "aperiodic_params_": [-0.12351284471874756, 0.44178323705629624], "gaussian_params_": [[9.123559376375285, 1.004215414509152, 0.8012539867149219], [12.776483932596397, 0.17312231236060935, 1.9140682716353357], [17.0857766454852, 0.32729081940951904, 1.3376487591548165], [19.95782870285063, 0.2011002505868299, 0.5838833646972552], [35.43767495927197, 0.08786725346929818, 5.5988215951427085], [39.3444847239319, 0.2181344069819914, 0.27728885012231697], [42.64551470246773, 0.10313830428468525, 1.8639603753604892], [50.38188532098253, 0.17947298034778153, 0.9357100243927605], [58.46384062526462, 0.5402034889775771, 0.28714807103960843]], "peak_params_": [[9.123559376375285, 1.017067118856572, 1.6025079734298437], [12.776483932596397, 0.1750662196990661, 3.8281365432706713], [17.0857766454852, 0.3421804651725208, 2.675297518309633], [19.95782870285063, 0.23317733065701252, 1.1677667293945104], [35.43767495927197, 0.087622097122244, 11.197643190285417], [39.3444847239319, 0.18782795194584634, 0.5545777002446339], [42.64551470246773, 0.13658108878406627, 3.7279207507209784], [50.38188532098253, 0.16815863910025808, 1.871420048785521], [58.46384062526462, 0.14656500940484107, 0.5742961420792169]], "r_squared_": 0.9387855507285398, "error_": 0.04321793698119351}
{"freq_range": [2.0, 80.0], "freq_res": 1.0, "aperiodic_params_": [-0.21232689840559774, 0.4064846058255281], "gaussian_params_": [[9.1788614862248, 1.058246750415036, 0.8424938186090192], [16.434749119234205, 0.29731405386974197, 2.8773242401978822], [39.20534999094687, 0.11819066339149278, 5.475837998066669], [50.689918690471025, 0.16959790072129, 0.6750918289116358]], "peak_params_": [[9.1788614862248, 1.0452190633844987, 1.6849876372180383], [16.434749119234205, 0.2939544480748689, 5.7546484803957645], [39.20534999094687, 0.11810758488382944, 10.951675996133337], [50.689918690471025, 0.16423699753099497, 1.3501836578232715]], "r_squared_": 0.9204488841347744, "error_": 0.05153110633690774}
{"freq_range": [2.0, 80.0], "freq_res": 1.0, "aperiodic_params_": [-0.2799791454925551, 0.3454902141638493], "gaussian_params_": [[9.169526390476278, 1.035110058103911, 0.8192950685442804], [12.484001673167114, 0.46828567298280316, 0.26882503770173516], [16.690077242927675, 0.29116777148256673, 3.1316869070402324], [36.58296019200773, 0.5123807687194548, 0.2698990814980878], [41.983696072395915, 0.16647162626758777, 2.3935726804866158], [50.55926609248797, 0.1789918922818245, 0.9541407809486592], [63.47389534861279, 0.7215089437627966, 0.27097135545917683]], "peak_params_": [[9.169526390476278, 1.027468355516259, 1.6385901370885607], [12.484001673167114, 0.1901169000748778, 0.5376500754034703], [16.690077242927675, 0.2897454405491672, 6.263373814080465], [36.58296019200773, 0.17434284873395178, 0.5397981629961756], [41.983696072395915, 0.16646776440846855, 4.7871453609732315], [50.55926609248797, 0.16101777771071846, 1.9082815618973183], [63.47389534861279, 0.15634433186407304, 0.5419427109183537]], "r_squared_": 0.895995602126845, "error_": 0.05244579964477006}
{"freq_range": [2.0, 80.0], "freq_res": 1.0, "aperiodic_params_": [-0.36062509564280293, 0.2677398443023183], "gaussian_params_": [[9.214184548202219, 0.9582701753557549, 0.7831437946820844], [12.450830666741718, 0.3287302632579191, 0.2882790984517536], [16.06523046160385, 0.22460231522877505, 3.1802206972341844], [40.87569786244977, 0.1286163314441122, 3.5987304939689513], [50.66529309035668, 0.15652231608516162, 0.9996890234066907]], "peak_params_": [[9.214184548202219, 0.9421334442045288, 1.5662875893641688], [12.450830666741718, 0.19770702670689727, 0.5765581969035072], [16.06523046160385, 0.22455507359702898, 6.360441394468369], [40.87569786244977, 0.1285396314834636, 7.197460987937903], [50.66529309035668, 0.15044909136643214, 1.9993780468133815]], "r_squared_": 0.868344344559156, "error_": 0.05138483119021021}
{"freq_range": [2.0, 80.0], "freq_res": 1.0, "aperiodic_params_": [-0.5389281636726386, 0.12680759144782522], "gaussian_params_": [[9.254791289856467, 0.8648065104352981, 0.6886507668271362], [13.37361435938561, 0.18708166026218911, 2.183006498500009], [17.131050511387155, 0.16788056578306798, 0.5671939324519037], [39.972432968247084, 0.12505495370246414, 5.077075417474669], [50.713195264469036, 0.16955373185539074, 1.006347172659918], [62.67039711952754, 0.08933929730076816, 5.7474209826041145]], "peak_params_": [[9.254791289856467, 0.83273804937014, 1.3773015336542724], [13.37361435938561, 0.18436212389561957, 4.366012997000018], [17.131050511387155, 0.2105395997387065, 1.1343878649038075], [39.972432968247084, 0.1250904802106818, 10.154150834949338], [50.713195264469036, 0.18599600154549012, 2.012694345319836], [62.67039711952754, 0.08919677503910306, 11.494841965208229]], "r_squared_": 0.7534486715822641, "error_": 0.05060349856100269}
{"freq_range": [2.0, 80.0], "freq_res": 1.0, "aperiodic_params_": [-0.8941455459010407, -0.15081575155793234], "gaussian_params_": [[9.370555218064894, 0.7701798595656851, 0.6294235886360094], [40.45203459913595, 0.15422448131656516, 5.999999999996379], [51.70852105050868, 0.13140086311672403, 1.9098989080474038]], "peak_params_": [[9.370555218064894, 0.6476353513230798, 1.258847177272019], [40.45203459913595, 0.15378741517987354, 11.999999999992758], [51.70852105050868, 0.15407699329036884, 3.8197978160948076]], "r_squared_": 0.497312891142699, "error_": 0.07100663781412507}
{"freq_range": [2.0, 80.0], "freq_res": 1.0, "aperiodic_params_": [-0.8399495842582495, -0.2251636447172749], "gaussian_params_": [[9.366204992199679, 0.714731428321416, 0.6544241601887734], [29.998775420767576, 0.15605250161104076, 2.340439275177561], [33.59940765709627, 0.4798631467598563, 0.3155052243655781], [36.13720304973172, 0.22420473721789574, 0.6452700071692009], [40.23503360559668, 0.23713406260646638, 2.5574284896335335], [49.68120433532842, 0.15757536186228355, 3.81699586381609], [50.6405420752052, 0.3276394189021307, 0.25002539129248763], [59.18634425080714, 0.16366017357999424, 1.2977359141401215], [63.56221703256387, 0.5382412852493228, 0.28256841369892693]], "peak_params_": [[9.366204992199679, 0.6111485006421029, 1.3088483203775467], [29.998775420767576, 0.15613163621974668, 4.680878550355122], [33.59940765709627, 0.2636134301825607, 0.6310104487311562], [36.13720304973172, 0.28546736194571326, 1.2905400143384018], [40.23503360559668, 0.24246958419542047, 5.114856979267067], [49.68120433532842, 0.16949631875155718, 7.63399172763218], [50.6405420752052, 0.26504336393209105, 0.5000507825849753], [59.18634425080714, 0.1699836733455456, 2.595471828280243], [63.56221703256387, 0.16239557240000874, 0.5651368273978539]], "r_squared_": 0.6387458988245913, "error_": 0.058840946961974595}
{"freq_range": [2.0, 80.0], "freq_res": 1.0, "aperiodic_params_": [-0.45647027852757416, 0.10378707622455723], "gaussian_params_": [[9.292158608523966, 1.0194406110210206, 0.8657049614513211], [33.59412854264341, 0.45557548676784115, 0.252686822380174], [36.36517983177869, 0.3573812444266115, 0.2500000364131971], [40.84900883555394, 0.1476305428756782, 5.9999999999999964], [50.658017102025774, 0.24397935875352952, 0.5937278774003506]], "peak_params_": [[9.292158608523966, 0.9630091204086056, 1.7314099229026423], [33.59412854264341, 0.2023629511775218, 0.505373644760348], [36.36517983177869, 0.22947153768935913, 0.5000000728263942], [40.84900883555394, 0.14758380402457383, 11.999999999999993], [50.658017102025774, 0.24197460677057725, 1.1874557548007012]], "r_squared_": 0.7713068182755342, "error_": 0.05938942584654929}
{"freq_range": [2.0, 80.0], "freq_res": 1.0, "aperiodic_params_": [-0.3816367007878689, 0.2381382999990264], "gaussian_params_": [[9.239950083058222, 1.1535213679213583, 0.9061477026984607], [16.159026406748474, 0.24121356631089821, 2.478910838178456], [39.347768558246436, 0.13552103939276, 5.788710248485142], [41.41303955941401, 0.052022537433136194, 0.2761200701757708], [50.620978631290875, 0.18101486531159403, 0.7577428362865805]], "peak_params_": [[9.239950083058222, 1.1175062022480389, 1.8122954053969214], [16.159026406748474, 0.2407574922555098, 4.957821676356912], [39.347768558246436, 0.13527669525491692, 11.577420496970284], [41.41303955941401, 0.147105824678194, 0.5522401403515416], [50.620978631290875, 0.17760055182837542, 1.515485672573161]], "r_squared_": 0.8840549304700289, "error_": 0.05365802709187283}
{"freq_range": [2.0, 80.0], "freq_res": 1.0, "aperiodic_params_": [-0.393419154537929, 0.23438901812463567], "gaussian_params_": [[9.28492769337368, 1.1597363356405914, 0.8740063370490171], [15.829322287617373, 0.21128918805248512, 2.338416479046042], [20.005388642322934, 0.16135844285836165, 0.25003821024565415], [39.74071717826674, 0.13943627373293044, 5.064147843836391], [50.60634769077853, 0.17090327680251896, 1.0452399243451835]], "peak_params_": [[9.28492769337368, 1.102688424906384, 1.7480126740980342], [15.829322287617373, 0.2107294883146582, 4.676832958092084], [20.005388642322934, 0.20445572898862174, 0.5000764204913083], [39.74071717826674, 0.13925363372198984, 10.128295687672782], [50.60634769077853, 0.17097806467862753, 2.090479848690367]], "r_squared_": 0.8665722014096522, "error_": 0.05556982681044935}
{"freq_range": [2.0, 80.0], "freq_res": 1.0, "aperiodic_params_": [-0.44040674025825777, 0.1526374792741175], "gaussian_params_": [[9.284786210558961, 1.0494968845710233, 0.7713520199080283], [14.947487941648133, 0.1306943938500834, 2.2734843378184952], [36.87257275703152, 0.10503420079218515, 3.513466672691257], [43.019259545101995, 0.17358360055170152, 1.1718624885110114], [53.54796494253063, 0.09872229256804628, 5.999999303359983], [63.467796310407444, 0.49803750211963616, 0.3034022868329627]], "peak_params_": [[9.284786210558961, 0.984618418649366, 1.5427040398160565], [14.947487941648133, 0.1306595363040466, 4.5469686756369905], [36.87257275703152, 0.10716675820446209, 7.026933345382514], [43.019259545101995, 0.21756832730434683, 2.3437249770220228], [53.54796494253063, 0.09844324256452097, 11.999998606719966], [63.467796310407444, 0.18026613050494122, 0.6068045736659254]], "r_squared_": 0.8053577921275611, "error_": 0.0529644814288806}
{"freq_range": [2.0, 80.0], "freq_res": 1.0, "aperiodic_params_": [-0.7391616128075279, -0.14758914419968455], "gaussian_params_": [[9.349379243175685, 0.9400362845920969, 0.6736418722800703], [32.53233558300058, 0.14646564271013343, 2.513097550787644], [36.63371469906677, 0.32721036996061875, 0.31055347352860674], [38.674128536708245, 0.1961797985553415, 0.671511358185562], [42.512445423221095, 0.2772757921431468, 1.3383074410991405], [44.93709848048185, 0.16340727897311538, 0.25009306963996236], [50.65857148111873, 0.1827590768422718, 1.779985527739063], [61.46647047393699, 0.1175405461961815, 5.848943759081285]], "peak_params_": [[9.349379243175685, 0.8217395544762895, 1.3472837445601407], [32.53233558300058, 0.1439522788244344, 5.026195101575288], [36.63371469906677, 0.20221856969451946, 0.6211069470572135], [38.674128536708245, 0.18865529302889578, 1.343022716371124], [42.512445423221095, 0.260320260192061, 2.676614882198281], [44.93709848048185, 0.2110049306632089, 0.5001861392799247], [50.65857148111873, 0.2031328612329844, 3.559971055478126], [61.46647047393699, 0.1171673383389562, 11.69788751816257]], "r_squared_": 0.702773609936456, "error_": 0.056770112543829646}
{"freq_range": [2.0, 80.0], "freq_res": 1.0, "aperiodic_params_": [-0.9253801705210745, -0.260687761344536], "gaussian_params_": [[9.47377705513636, 0.8400369983396718, 0.4956223946775585], [28.10382539976307, 0.19268754992942502, 0.4852400200289814], [32.4524223660216, 0.22168612834219936, 2.0582941998596933], [37.41702269677839, 0.22193796144651406, 1.283048126163082], [42.351185317389124, 0.29869590497537424, 1.8578646079685557], [50.56523335090427, 0.189800941595874, 2.013453957202375], [60.497492053503024, 0.12945772728420873, 5.969445335431302]], "peak_params_": [[9.47377705513636, 0.5319508739743015, 0.991244789355117], [28.10382539976307, 0.20968922604787332, 0.9704800400579628], [32.4524223660216, 0.21642642069174234, 4.116588399719387], [37.41702269677839, 0.23460198648320685, 2.566096252326164], [42.351185317389124, 0.29487480674246824, 3.7157292159371114], [50.56523335090427, 0.2219468083315584, 4.02690791440475], [60.497492053503024, 0.1290121702479876, 11.938890670862603]], "r_squared_": 0.7141844778642094, "error_": 0.062151364054116046}
{"freq_range": [2.0, 80.0], "freq_res": 1.0, "aperiodic_params_": [-0.5433446055898359, 0.020503152381147305], "gaussian_params_": [[9.34675860386347, 1.070409438561535, 0.8686592703614998], [30.107156304265597, 0.15351428347473092, 0.7109581001054723], [33.664207922685534, 0.20137344009696437, 0.5961487457294948], [36.45604529406364, 0.8054492314183317, 0.26073253069269026], [40.833777297627975, 0.20609064145574651, 2.959301644944113], [51.182043452193206, 0.16123786183993574, 2.9031040063481828], [58.50200428040319, 0.5603564059652235, 0.3121831821182613]], "peak_params_": [[9.34675860386347, 0.988433003038033, 1.7373185407229996], [30.107156304265597, 0.15203385229943334, 1.4219162002109447], [33.664207922685534, 0.18615818081433805, 1.1922974914589897], [36.45604529406364, 0.2288482192470973, 0.5214650613853805], [40.833777297627975, 0.206109592864606, 5.918603289888226], [51.182043452193206, 0.16148529468811418, 5.8062080126963656], [58.50200428040319, 0.16129085969536128, 0.6243663642365226]], "r_squared_": 0.7895642404588469, "error_": 0.05085944655006592}
{"freq_range": [2.0, 80.0], "freq_res": 1.0, "aperiodic_params_": [-0.5772580351410384, 0.033758929000011074], "gaussian_params_": [[9.4256515622785, 1.1018972848174777, 0.8338608386482038], [35.555015953292816, 0.150521149279096, 4.29016918428534], [42.39423070492462, 0.16549826500345652, 1.5791943899340466], [53.3051315334259, 0.12699374799218555, 5.999997748409488], [63.46737877060354, 0.547273954653992, 0.2952937013965009]], "peak_params_": [[9.4256515622785, 0.9672961546754469, 1.6677216772964076], [35.555015953292816, 0.15174272727660687, 8.58033836857068], [42.39423070492462, 0.23064331755693407, 3.158388779868093], [53.3051315334259, 0.12686828627385605, 11.999995496818975], [63.46737877060354, 0.1908178583388665, 0.5905874027930018]], "r_squared_": 0.7682932589250752, "error_": 0.055626885552282505}
{"freq_range": [2.0, 80.0], "freq_res": 1.0, "aperiodic_params_": [-0.6485428593409481, -0.0823429875438624], "gaussian_params_": [[9.387062465063666, 1.0027023132282202, 0.7449921535855275], [32.223092403651144, 0.14149506686574764, 2.649400348758965], [37.940879835141665, 0.1625835057803141, 1.6433350050397242], [42.872176419907625, 0.26854659129967123, 1.6220543188924232], [50.51653907511739, 0.1900074273878194, 1.5688660774597556], [60.670147577785514, 0.12087294736670083, 5.999999986648288]], "peak_params_": [[9.387062465063666, 0.8761055694817377, 1.489984307171055], [32.223092403651144, 0.1412317743089565, 5.29880069751793], [37.940879835141665, 0.17865678188346734, 3.2866700100794484], [42.872176419907625, 0.27075577265861356, 3.2441086377848465], [50.51653907511739, 0.21417956069991168, 3.137732154919511], [60.670147577785514, 0.12069042849241396, 11.999999973296577]], "r_squared_": 0.6966589845449903, "error_": 0.058207742170427804}
{"freq_range": [2.0, 80.0], "freq_res": 1.0, "aperiodic_params_": [-1.3466656442838827, 0.6938490434124893], "gaussian_params_": [[9.561288068570782, 0.5619996662234201, 0.9387668745552826], [17.724732867276195, 0.36342888828998815, 5.241450688484121], [31.18490041116046, 0.22419650341105454, 0.47933851669427313]], "peak_params_": [[9.561288068570782, 0.6265418532018083, 1.8775337491105653], [17.724732867276195, 0.362928052057367, 10.482901376968242], [31.18490041116046, 0.22282700101920705, 0.9586770333885463]], "r_squared_": 0.9533350194588054, "error_": 0.05841237179025245}
{"freq_range": [2.0, 80.0], "freq_res": 1.0, "aperiodic_params_": [-0.13299986161449226, 0.5753855246311125], "gaussian_params_": [[9.392894306456958, 0.4153444409971707, 0.6732902261837406], [12.246114835568038, 0.17770358162021074, 1.0238978357482589], [19.043944833658717, 0.15400313590568418, 1.6733047928589495], [22.90810008575252, 0.17850652804281292, 0.9613222287081131], [26.552203372686176, 0.20236015115278372, 0.7251318707598334], [30.45340853249109, 0.09618108972365777, 1.3156855960412406], [35.39727926122953, 0.2672372856573036, 0.2911769741195082], [42.444196552811036, 0.11244036962510727, 5.999999806937679], [50.29057776190589, 0.2201699872336907, 0.25792155207061657], [62.48765055428876, 0.22296813015921754, 1.1325078022598996], [69.50639120614343, 0.5606848712098077, 0.3004457430775519]], "peak_params_": [[9.392894306456958, 0.3514869785594165, 1.3465804523674811], [12.246114835568038, 0.17289592133085951, 2.0477956714965178], [19.043944833658717, 0.15405045125125016, 3.346609585717899], [22.90810008575252, 0.18769751268452206, 1.9226444574162262], [26.552203372686176, 0.17441666027551583, 1.4502637415196669], [30.45340853249109, 0.10372551781006323, 2.631371192082481], [35.39727926122953, 0.15768122089874748, 0.5823539482390164], [42.444196552811036, 0.11213265706459052, 11.999999613875358], [50.29057776190589, 0.16760099219836055, 0.5158431041412331], [62.48765055428876, 0.2037818001688596, 2.265015604519799], [69.50639120614343, 0.14541383333696278, 0.6008914861551038]], "r_squared_": 0.9374420081075321, "error_": 0.03809457788563964}
{"freq_range": [2.0, 80.0], "freq_res": 1.0, "aperiodic_params_": [-0.27267984484149155, 0.5991444828226912], "gaussian_params_": [[9.551189000086834, 0.5425413489862664, 0.9167716272962609], [13.446982395407412, 0.2510791583304609, 2.5051869995679223], [21.01503616979853, 0.2545847768149045, 1.2226018856565606], [22.777855869414065, 0.2639619756231477, 0.27231179610318884], [28.547965400842177, 0.181070614140553, 5.999999999999999], [43.672435555062094, 0.4085355291309178, 0.29169815118626263], [56.210993065052286, 0.326339270810532, 0.28266001472348995]], "peak_params_": [[9.551189000086834, 0.5802277276930565, 1.8335432545925219], [13.446982395407412, 0.25387816760427473, 5.010373999135845], [21.01503616979853, 0.3393053838571468, 2.445203771313121], [22.777855869414065, 0.3756536135610795, 0.5446235922063777], [28.547965400842177, 0.18055746726143496, 11.999999999999998], [43.672435555062094, 0.22404164553993433, 0.5833963023725253], [56.210993065052286, 0.24699316416593797, 0.5653200294469799]], "r_squared_": 0.9294538315378543, "error_": 0.059510227083770816}
{"freq_range": [2.0, 80.0], "freq_res": 1.0, "aperiodic_params_": [-0.5456766086108233, 0.5637047625193385], "gaussian_params_": [[9.02147515713898, 0.5834201047951526, 0.7508274189940204], [11.607399092770928, 0.3426499629010204, 1.1758857461599692], [14.76348150474616, 0.24561842722688423, 1.089812816549055], [17.633473939082872, 0.2339909584956511, 0.6684964727248601], [21.644906253778633, 0.32083655971087693, 1.9363444911766465], [27.419679633355297, 0.18855910297325293, 2.093954691865468], [34.945479924701935, 0.15709751595924096, 2.4970484457600706], [40.973866637183484, 0.2368148018016361, 0.882371306510123], [44.39762110837401, 0.6771658893592554, 0.25823663607906566], [62.62144757800334, 0.32211814273800543, 0.3093063445949952]], "peak_params_": [[9.02147515713898, 0.612502510713419, 1.5016548379880408], [11.607399092770928, 0.3341617682875937, 2.3517714923199384], [14.76348150474616, 0.24622789558441038, 2.17962563309811], [17.633473939082872, 0.25888872317531164, 1.3369929454497202], [21.644906253778633, 0.32210574595002517, 3.872688982353293], [27.419679633355297, 0.1928100197935716, 4.187909383730936], [34.945479924701935, 0.15732904873599352, 4.994096891520141], [40.973866637183484, 0.24502007324698383, 1.764742613020246], [44.39762110837401, 0.20783397038515306, 0.5164732721581313], [62.62144757800334, 0.15231989786120637, 0.6186126891899904]], "r_squared_": 0.950799538507858, "error_": 0.04282820634165106}
