{"freq_range": [2.0, 80.0], "freq_res": 1.0, "aperiodic_params_": [0.4272179852114537, 0.8050639989849802], "gaussian_params_": [[9.082693235536997, 1.3377962282029592, 1.219886434200547], [13.17425232643444, 0.3575524850119085, 2.2079452447761994], [16.565146934877177, 0.6276982408032449, 0.3072651544296395], [19.14487856945484, 0.21160870045368887, 1.9604285093525322], [24.797311096484634, 0.2659394754901698, 0.6103246067225973]], "peak_params_": [[9.082693235536997, 1.394596299450078, 2.439772868401094], [13.17425232643444, 0.3657096539437585, 4.415890489552399], [16.565146934877177, 0.4265777998487001, 0.614530308859279], [19.14487856945484, 0.22203654417255825, 3.9208570187050644], [24.797311096484634, 0.2541179867935864, 1.2206492134451945]], "r_squared_": 0.9797808275851598, "error_": 0.05275157909020047}
{"freq_range": [2.0, 80.0], "freq_res": 1.0, "aperiodic_params_": [0.44143799351197927, 0.805561544193554], "gaussian_params_": [[9.0700462295213, 1.4174899485683141, 1.191044962594608], [13.115811437417369, 0.34665419077113613, 1.7553418542345944], [16.51481137947022, 1.53373932647529, 0.27525936393839534], [18.49522836077241, 1.3059090645407834, 0.26631903642167537]], "peak_params_": [[9.0700462295213, 1.4372261788363925, 2.382089925189216], [13.115811437417369, 0.35202942183611424, 3.510683708469189], [16.51481137947022, 0.35436867792097704, 0.5505187278767907], [18.49522836077241, 0.2389895364145525, 0.5326380728433507]], "r_squared_": 0.9771997245433242, "error_": 0.05488875149718318}
{"freq_range": [2.0, 80.0], "freq_res": 1.0, "aperiodic_params_": [0.5058493396204392, 0.8729198782407506], "gaussian_params_": [[9.149421240774805, 1.230141752345868, 1.293265393469953], [15.155149782730945, 0.3288985754444162, 3.704968872391127], [25.670526112831087, 0.16050807563490374, 5.999998377149767]], "peak_params_": [[9.149421240774805, 1.3080847926715384, 2.586530786939906], [15.155149782730945, 0.36166926753142054, 7.409937744782254], [25.670526112831087, 0.16480098541998645, 11.999996754299534]], "r_squared_": 0.9794292508909321, "error_": 0.05731487116780619}
{"freq_range": [2.0, 80.0], "freq_res": 1.0, "aperiodic_params_": [0.7537674242180304, 1.1852540364790758], "gaussian_params_": [[9.154978616607684, 1.3130353544724302, 1.3247164536403755], [15.498446349790093, 0.5667347975052056, 4.194065768105429], [24.700743339955395, 0.44500916583661476, 1.3003742556700653]], "peak_params_": [[9.154978616607684, 1.4747129470809965, 2.649432907280751], [15.498446349790093, 0.5628243047418973, 8.388131536210858], [24.700743339955395, 0.47692083439686034, 2.6007485113401305]], "r_squared_": 0.9879351369735448, "error_": 0.05399929122364616}
{"freq_range": [2.0, 80.0], "freq_res": 1.0, "aperiodic_params_": [0.46474844805488624, 0.7593891167879897], "gaussian_params_": [[9.006837222674383, 1.3634241037778223, 1.174582907713894], [12.51625662328018, 0.37020959732787795, 1.9014565922629147], [16.78177475488821, 0.3976879922589724, 0.9823133660113431], [24.852134978087026, 0.23985625545666855, 0.697134837642694]], "peak_params_": [[9.006837222674383, 1.4303692260361949, 2.349165815427788], [12.51625662328018, 0.36287771015805825, 3.8029131845258295], [16.78177475488821, 0.4109568891541936, 1.9646267320226862], [24.852134978087026, 0.23452114996760315, 1.394269675285388]], "r_squared_": 0.9759217887636165, "error_": 0.056522017134493445}
{"freq_range": [2.0, 80.0], "freq_res": 1.0, "aperiodic_params_": [0.43935991749782216, 0.819690351288323], "gaussian_params_": [[8.95264735968094, 1.3711001154515081, 1.116216422057229], [12.233014002210698, 0.34349930869007256, 1.7433066398669717], [16.934228118551918, 0.3744042934125075, 0.987870605296869]], "peak_params_": [[8.95264735968094, 1.43139813881331, 2.232432844114458], [12.233014002210698, 0.37345296746752815, 3.4866132797339433], [16.934228118551918, 0.38174624422118564, 1.975741210593738]], "r_squared_": 0.9789432500058473, "error_": 0.05482556435104402}
{"freq_range": [2.0, 80.0], "freq_res": 1.0, "aperiodic_params_": [0.5060871488617582, 0.8757628261734339], "gaussian_params_": [[9.14472968890488, 1.2322906567857692, 1.2911768648907411], [15.027269604960173, 0.32775024879393605, 3.648175902443723], [25.19630430818994, 0.16291483071986151, 5.999995081835893]], "peak_params_": [[9.14472968890488, 1.3125562846664591, 2.5823537297814823], [15.027269604960173, 0.36622994723109425, 7.296351804887446], [25.19630430818994, 0.1706416041663854, 11.999990163671786]], "r_squared_": 0.9816637763623708, "error_": 0.05312263280064703}
{"freq_range": [2.0, 80.0], "freq_res": 1.0, "aperiodic_params_": [0.7365990934763715, 1.2086315210651521], "gaussian_params_": [[9.180268630187651, 1.3295723675759459, 1.388379233671007], [15.514500197055645, 0.6248797466378667, 3.723379334712519], [24.69663309803577, 0.417206554215722, 2.331329894306834]], "peak_params_": [[9.180268630187651, 1.453641571166961, 2.776758467342014], [15.514500197055645, 0.6199946662216925, 7.446758669425038], [24.69663309803577, 0.43803967904796837, 4.662659788613668]], "r_squared_": 0.9897677912952909, "error_": 0.052216184869940625}
{"freq_range": [2.0, 80.0], "freq_res": 1.0, "aperiodic_params_": [0.9562521345742334, 1.3651523341504854], "gaussian_params_": [[9.186075292364512, 1.3544451176379662, 1.389664003206004], [15.541604816762643, 0.6866232325705581, 3.6507331717738007], [24.691125050743768, 0.561647614866775, 2.0837622415109975]], "peak_params_": [[9.186075292364512, 1.4802401409582508, 2.779328006412008], [15.541604816762643, 0.6813337657348333, 7.3014663435476015], [24.691125050743768, 0.5794525435134158, 4.167524483021995]], "r_squared_": 0.9906893654267274, "error_": 0.05547464457170236}
{"freq_range": [2.0, 80.0], "freq_res": 1.0, "aperiodic_params_": [0.9530716605239682, 1.3621201739922322], "gaussian_params_": [[9.182913264940376, 1.3585994292586119, 1.3929003515150153], [15.524379876075542, 0.6867894768788438, 3.6196301031383817], [24.713101878035875, 0.5725483310192333, 2.0909655200403074]], "peak_params_": [[9.182913264940376, 1.4822399167878098, 2.7858007030300307], [15.524379876075542, 0.6809915915590778, 7.2392602062767635], [24.713101878035875, 0.5895040856850454, 4.181931040080615]], "r_squared_": 0.9906725269641101, "error_": 0.05456112754554751}
{"freq_range": [2.0, 80.0], "freq_res": 1.0, "aperiodic_params_": [0.9892277316122211, 1.4219798588841503], "gaussian_params_": [[9.267651523687455, 1.5387849341729025, 1.47606193717754], [13.18257013236031, 0.3027430616401006, 0.7283379325378933], [16.53736546523786, 0.6899161695213443, 2.9160944257788435], [24.598677963000465, 0.598500712612881, 1.943630805415364]], "peak_params_": [[9.267651523687455, 1.5381315709696872, 2.95212387435508], [13.18257013236031, 0.686873010428363, 1.4566758650757865], [16.53736546523786, 0.6815773467311272, 5.832188851557687], [24.598677963000465, 0.596110656196081, 3.887261610830728]], "r_squared_": 0.9911571794524577, "error_": 0.05605412730801045}
{"freq_range": [2.0, 80.0], "freq_res": 1.0, "aperiodic_params_": [0.9289979005314468, 1.3665894819532927], "gaussian_params_": [[9.104201617014551, 1.4036251197317327, 1.3228094046646635], [15.521062110165008, 0.6877426026101804, 4.0089699472187394], [24.824687014012728, 0.5383129577737829, 1.652473601726696]], "peak_params_": [[9.104201617014551, 1.5824574604490385, 2.645618809329327], [15.521062110165008, 0.6828543595350468, 8.017939894437479], [24.824687014012728, 0.5773119722896684, 3.304947203453392]], "r_squared_": 0.9906134454228889, "error_": 0.05796194922523991}
{"freq_range": [2.0, 80.0], "freq_res": 1.0, "aperiodic_params_": [0.32600842840556193, 1.0181783955881347], "gaussian_params_": [[9.003258761895335, 1.6627100799521748, 1.304006432372703], [12.372388514794332, 0.35824455762903173, 1.1341994894223544], [16.64782484555748, 0.5062768636531575, 3.263437590292549], [25.71001825360414, 0.19278080995479832, 1.6797137718093837]], "peak_params_": [[9.003258761895335, 1.6995101572904976, 2.608012864745406], [12.372388514794332, 0.6416486949149366, 2.2683989788447088], [16.64782484555748, 0.503424702045512, 6.526875180585098], [25.71001825360414, 0.19826745891308972, 3.3594275436187675]], "r_squared_": 0.9892135498787689, "error_": 0.05303329962430022}
{"freq_range": [2.0, 80.0], "freq_res": 1.0, "aperiodic_params_": [0.32533516977680516, 1.0125922297992165], "gaussian_params_": [[9.009332729063937, 1.661899726836366, 1.308638803377678], [12.407946346862547, 0.3527511930344109, 1.1316091562512447], [16.65238036811211, 0.5050891202198692, 3.2546389321673157], [25.78977654815784, 0.18473754286414745, 1.781264597292801]], "peak_params_": [[9.009332729063937, 1.6974784043875766, 2.617277606755356], [12.407946346862547, 0.634426045958295, 2.2632183125024894], [16.65238036811211, 0.5023109832869189, 6.509277864334631], [25.78977654815784, 0.19162391682316893, 3.562529194585602]], "r_squared_": 0.9892235681670185, "error_": 0.050937121025586306}
{"freq_range": [2.0, 80.0], "freq_res": 1.0, "aperiodic_params_": [0.31273592262406075, 1.0129939733566435], "gaussian_params_": [[8.99783642957453, 1.666580804189955, 1.304230209126832], [12.367958413312262, 0.36387668227613207, 1.1663018935432174], [16.680724151216626, 0.5128863446518961, 3.2845455384366145], [25.837117980092735, 0.1817616898325875, 1.724854637637334]], "peak_params_": [[8.99783642957453, 1.705515428356929, 2.608460418253664], [12.367958413312262, 0.6498330790242832, 2.332603787086435], [16.680724151216626, 0.5106060428809231, 6.569091076873229], [25.837117980092735, 0.19011345567597182, 3.449709275274668]], "r_squared_": 0.9886452270859035, "error_": 0.05451919534936908}
{"freq_range": [2.0, 80.0], "freq_res": 1.0, "aperiodic_params_": [0.518917007195915, 1.2043514101593729], "gaussian_params_": [[9.107031998873879, 1.284935861707076, 1.6225992568559522], [15.40334500112298, 0.6965642835393145, 3.8210303089143167], [25.382044209840664, 0.32728512496443757, 3.9178180914586935], [71.2424427888681, 0.20622574840114996, 0.530905367304303]], "peak_params_": [[9.107031998873879, 1.4532497951876164, 3.2451985137119044], [15.40334500112298, 0.7042247193028895, 7.642060617828633], [25.382044209840664, 0.355465612090896, 7.835636182917387], [71.2424427888681, 0.18580591280441894, 1.061810734608606]], "r_squared_": 0.9922818990994992, "error_": 0.050293528815995726}
{"freq_range": [2.0, 80.0], "freq_res": 1.0, "aperiodic_params_": [0.7340829413967443, 1.2854578644828198], "gaussian_params_": [[8.443506434502655, 1.4994682324089763, 0.27176108440963664], [9.483259199048916, 1.1906212645512222, 1.5428320870011818], [16.085704536822373, 0.785728019802107, 3.9118420453722975], [24.731758507815933, 0.5151367201000958, 1.6503817828746834], [29.0100018797208, 0.23591805548136224, 1.249988527314644]], "peak_params_": [[8.443506434502655, 1.2387296062835191, 0.5435221688192733], [9.483259199048916, 1.4702092041037134, 3.0856641740023636], [16.085704536822373, 0.7856989743268957, 7.823684090744595], [24.731758507815933, 0.5683171789220048, 3.300763565749367], [29.0100018797208, 0.2574656552109005, 2.499977054629288]], "r_squared_": 0.9943377706079404, "error_": 0.04237885415013164}
{"freq_range": [2.0, 80.0], "freq_res": 1.0, "aperiodic_params_": [0.928482806306443, 1.3772425803763644], "gaussian_params_": [[9.22604717933601, 1.3502051905156447, 1.4357543641481532], [15.81574852151352, 0.7777141701911391, 3.852675535957545], [24.760401134663606, 0.660113007320438, 1.69087868276425], [29.012263602506945, 0.22919090207120532, 0.9568437481448687]], "peak_params_": [[9.22604717933601, 1.4962095365113415, 2.8715087282963063], [15.81574852151352, 0.776846080434573, 7.70535107191509], [24.760401134663606, 0.6989285715693092, 3.3817573655285], [29.012263602506945, 0.2598753609172576, 1.9136874962897374]], "r_squared_": 0.9932709688743185, "error_": 0.046497268552201196}
{"freq_range": [2.0, 80.0], "freq_res": 1.0, "aperiodic_params_": [1.0307572132803116, 1.452683887905733], "gaussian_params_": [[9.203305584435457, 1.399721105742403, 1.4278921311147965], [15.759134906307544, 0.7859442997345528, 3.7284525907107353], [24.857855542346897, 0.6524041537569009, 1.9898646538249634]], "peak_params_": [[9.203305584435457, 1.5375726340727798, 2.855784262229593], [15.759134906307544, 0.7843552866534732, 7.456905181421471], [24.857855542346897, 0.6871746937388737, 3.9797293076499267]], "r_squared_": 0.9915747640748017, "error_": 0.055331894119354484}
{"freq_range": [2.0, 80.0], "freq_res": 1.0, "aperiodic_params_": [1.0386224290088553, 1.466247488705822], "gaussian_params_": [[9.331013570926501, 1.5965244756944423, 1.5286441459457076], [13.180207740724471, 0.37737196564414577, 0.7949461642456601], [16.62205973460569, 0.7684126173619474, 2.5931978837568237], [24.55158998637415, 0.6636087123359011, 2.234601139338718]], "peak_params_": [[9.331013570926501, 1.5697537255875518, 3.0572882918914153], [13.180207740724471, 0.7470925845229553, 1.5898923284913202], [16.62205973460569, 0.762502008364095, 5.186395767513647], [24.55158998637415, 0.654541429930596, 4.469202278677436]], "r_squared_": 0.9919062846439466, "error_": 0.05523344264781286}
{"freq_range": [2.0, 80.0], "freq_res": 1.0, "aperiodic_params_": [0.9611525839033844, 1.4183937838692644], "gaussian_params_": [[9.132085869588035, 1.451546902363039, 1.3833912081093749], [15.568705121143369, 0.78445821939423, 3.9653523196232046], [24.83421127316189, 0.5153343997779393, 1.9687962854645533], [70.9572853281248, 0.1923826282715555, 0.6025514051559399]], "peak_params_": [[9.132085869588035, 1.6438760902660152, 2.7667824162187498], [15.568705121143369, 0.7798601742375239, 7.930704639246409], [24.83421127316189, 0.5598752642043456, 3.9375925709291066], [70.9572853281248, 0.19189984046351327, 1.2051028103118797]], "r_squared_": 0.9917451073617815, "error_": 0.0562887766942888}
{"freq_range": [2.0, 80.0], "freq_res": 1.0, "aperiodic_params_": [0.8035379791500187, 1.2991917640839363], "gaussian_params_": [[9.115266094930952, 1.4438326649108604, 1.3923080863095607], [15.219270806862507, 0.7546850449748401, 3.8356102251619872], [24.104757243674012, 0.3269988060225687, 2.7729186988062837]], "peak_params_": [[9.115266094930952, 1.6415963460969434, 2.7846161726191214], [15.219270806862507, 0.755134521476917, 7.6712204503239745], [24.104757243674012, 0.381688571640339, 5.545837397612567]], "r_squared_": 0.9912126784735851, "error_": 0.05587620757797646}
{"freq_range": [2.0, 80.0], "freq_res": 1.0, "aperiodic_params_": [0.4275116526523161, 1.0648227920760531], "gaussian_params_": [[9.134561634384934, 1.4263825648902622, 1.3825548353288106], [16.018341404606147, 0.6244521118727724, 4.825433934970465]], "peak_params_": [[9.134561634384934, 1.6364838872262057, 2.7651096706576213], [16.018341404606147, 0.6244539054553084, 9.65086786994093]], "r_squared_": 0.9871873522163845, "error_": 0.05575148704646883}
{"freq_range": [2.0, 80.0], "freq_res": 1.0, "aperiodic_params_": [0.33154983432904134, 1.0307687273832564], "gaussian_params_": [[9.045359426389407, 1.6683964476876796, 1.3440672386761883], [12.580550661334527, 0.3708960780661771, 0.989764614645943], [16.711478130990912, 0.5191982474871775, 3.2095076582221584], [25.74985303302497, 0.19661745010487472, 1.8267906717163627]], "peak_params_": [[9.045359426389407, 1.696937394992128, 2.6881344773523765], [12.580550661334527, 0.62708469254439, 1.979529229291886], [16.711478130990912, 0.5171240492118412, 6.419015316444317], [25.74985303302497, 0.2026639356992893, 3.6535813434327253]], "r_squared_": 0.989301557675686, "error_": 0.05316073849726238}
{"freq_range": [2.0, 80.0], "freq_res": 1.0, "aperiodic_params_": [0.5291571418733814, 1.2461138283857771], "gaussian_params_": [[8.676372270206725, 1.0118195853134977, 1.3818729519901696], [11.61612780668913, 0.8542816295691499, 2.149241631670806], [17.232267324522486, 0.6357721333812916, 2.0747144233262786], [23.602234280375995, 0.3451307228381273, 3.810649365983746], [30.21209716167385, 0.13006458958901065, 0.4111922508796382], [73.54796450103646, 0.1001713478676306, 5.999989937996655]], "peak_params_": [[8.676372270206725, 1.3921670436264633, 2.763745903980339], [11.61612780668913, 0.9266492944462149, 4.298483263341612], [17.232267324522486, 0.7458065705556036, 4.149428846652557], [23.602234280375995, 0.34636526607605744, 7.621298731967492], [30.21209716167385, 0.19817703139724885, 0.8223845017592764], [73.54796450103646, 0.0998874635243936, 11.99997987599331]], "r_squared_": 0.9946003878789523, "error_": 0.041523164741351426}
{"freq_range": [2.0, 80.0], "freq_res": 1.0, "aperiodic_params_": [0.725931504966346, 1.2903569726334676], "gaussian_params_": [[9.493494833556593, 1.1665657164449619, 1.664601897315358], [18.103251199257766, 0.8577802392580162, 5.999999999999999]], "peak_params_": [[9.493494833556593, 1.387754429898263, 3.329203794630716], [18.103251199257766, 0.8576557299942419, 11.999999999999998]], "r_squared_": 0.9883167356362479, "error_": 0.062483593128529205}
{"freq_range": [2.0, 80.0], "freq_res": 1.0, "aperiodic_params_": [0.9241181870158902, 1.3904293156067586], "gaussian_params_": [[9.01276786063661, 1.3064863086156284, 1.330741065125582], [12.435467410300493, 0.7882157727397145, 2.2575358723919106], [17.19019544550865, 0.7430884912381992, 1.7183428303898378], [23.980667610352533, 0.616510834262756, 3.6470460671737346]], "peak_params_": [[9.01276786063661, 1.5541818803540934, 2.661482130251164], [12.435467410300493, 0.8894133980701393, 4.515071744783821], [17.19019544550865, 0.939343557141784, 3.4366856607796756], [23.980667610352533, 0.6167925875836939, 7.294092134347469]], "r_squared_": 0.9939157819063478, "error_": 0.04873243334084959}
{"freq_range": [2.0, 80.0], "freq_res": 1.0, "aperiodic_params_": [0.9896828038368495, 1.4577836764284438], "gaussian_params_": [[9.156391944654182, 1.5882344202466374, 1.4139852645678568], [12.349546093765065, 0.47006780039936075, 1.540315133522892], [16.87906222815491, 0.8673481341073012, 2.6350435399341454], [24.474591695026767, 0.49267563284517085, 1.7373676587870233], [26.452034599135946, 0.23313014578818622, 3.7014951892088828]], "peak_params_": [[9.156391944654182, 1.6326667167689881, 2.8279705291357136], [12.349546093765065, 0.8246745856163716, 3.080630267045784], [16.87906222815491, 0.8803582144030894, 5.270087079868291], [24.474591695026767, 0.6843431383604446, 3.4747353175740465], [26.452034599135946, 0.5686617226603425, 7.4029903784177655]], "r_squared_": 0.9942135263634075, "error_": 0.04837020102908198}
{"freq_range": [2.0, 80.0], "freq_res": 1.0, "aperiodic_params_": [0.9767053237728525, 1.4395656173392353], "gaussian_params_": [[9.402278201043002, 1.7190147341942303, 1.5862387022635118], [13.18509567626982, 0.437665412133795, 0.8314574888475229], [16.707748138769293, 0.8613594293611632, 2.3680624068277027], [24.64021598291962, 0.682086127713614, 2.6301713137920246]], "peak_params_": [[9.402278201043002, 1.668927844899827, 3.1724774045270236], [13.18509567626982, 0.811121076138056, 1.6629149776950458], [16.707748138769293, 0.8648897478658143, 4.7361248136554055], [24.64021598291962, 0.6776073705421076, 5.260342627584049]], "r_squared_": 0.9935079129458751, "error_": 0.05134377704395614}
{"freq_range": [2.0, 80.0], "freq_res": 1.0, "aperiodic_params_": [0.9694161354752073, 1.4376592174107776], "gaussian_params_": [[9.20693252033172, 1.5376334593951422, 1.4550903007707188], [15.781898300480998, 0.8496244745478223, 3.8433894202448613], [24.78986961308811, 0.4295262651630519, 2.449400051706643]], "peak_params_": [[9.20693252033172, 1.7012648392052925, 2.9101806015414375], [15.781898300480998, 0.8489724462460772, 7.686778840489723], [24.78986961308811, 0.4758220053468848, 4.898800103413286]], "r_squared_": 0.9932270528647981, "error_": 0.0504126884331247}
{"freq_range": [2.0, 80.0], "freq_res": 1.0, "aperiodic_params_": [0.8202015517102984, 1.355639346626694], "gaussian_params_": [[9.206994695630632, 1.530673349523449, 1.5119190105845897], [14.578686745809277, 0.6603742699118115, 3.4546279371732607], [21.111044319690297, 0.49818246014220546, 4.870714927865178]], "peak_params_": [[9.206994695630632, 1.7183120767296263, 3.0238380211691793], [14.578686745809277, 0.8832346738765929, 6.909255874346521], [21.111044319690297, 0.6154214758007701, 9.741429855730356]], "r_squared_": 0.9922841667656749, "error_": 0.056267186140152685}
{"freq_range": [2.0, 80.0], "freq_res": 1.0, "aperiodic_params_": [0.4444081250776129, 1.077350356330345], "gaussian_params_": [[9.209097108386208, 1.490189356533612, 1.521094280966284], [16.35536532082254, 0.7976739307472874, 4.226752449105249], [25.430112663376114, 0.2343066390606464, 1.8804987173651029]], "peak_params_": [[9.209097108386208, 1.651662723436779, 3.042188561932568], [16.35536532082254, 0.7949304867113143, 8.453504898210499], [25.430112663376114, 0.32677534736212377, 3.7609974347302058]], "r_squared_": 0.9904969815335208, "error_": 0.053934149000038116}
{"freq_range": [2.0, 80.0], "freq_res": 1.0, "aperiodic_params_": [0.4426186693749439, 1.1737451991278585], "gaussian_params_": [[9.167707342538888, 1.2860626821013208, 1.4767994504296238], [15.779251735818903, 0.6395478720540264, 4.323329348778262], [25.44914162190774, 0.20119923114130686, 1.2693689580251168], [65.68115364227772, 0.10111995949915036, 1.36893910700989], [73.71254477896201, 0.1344241512730908, 5.999993288609796]], "peak_params_": [[9.167707342538888, 1.4648420569524763, 2.9535989008592476], [15.779251735818903, 0.6387436719439873, 8.646658697556523], [25.44914162190774, 0.25477405233800066, 2.5387379160502337], [65.68115364227772, 0.1572550823805252, 2.73787821401978], [73.71254477896201, 0.13426996906240696, 11.999986577219593]], "r_squared_": 0.9909235169918555, "error_": 0.04841908480993753}
{"freq_range": [2.0, 80.0], "freq_res": 1.0, "aperiodic_params_": [0.5566744309608825, 1.252519084073638], "gaussian_params_": [[9.643181474963145, 1.150455185537083, 1.7331509954455897], [16.945179079958834, 0.7563238302501603, 5.172558533418832]], "peak_params_": [[9.643181474963145, 1.4333928535347051, 3.4663019908911794], [16.945179079958834, 0.7564220572153765, 10.345117066837664]], "r_squared_": 0.9884300984472927, "error_": 0.06225513261822214}
{"freq_range": [2.0, 80.0], "freq_res": 1.0, "aperiodic_params_": [0.7969695134368269, 1.3558505957438802], "gaussian_params_": [[9.559316437221753, 1.1601123807100553, 1.655954603020135], [17.518441049000778, 0.9355970904450216, 5.774886782291621]], "peak_params_": [[9.559316437221753, 1.5206414831468011, 3.31190920604027], [17.518441049000778, 0.9323524848965005, 11.549773564583242]], "r_squared_": 0.9890792292017162, "error_": 0.06526232668997178}
{"freq_range": [2.0, 80.0], "freq_res": 1.0, "aperiodic_params_": [0.9169577682081413, 1.4200103477581802], "gaussian_params_": [[9.450478567768993, 1.281908863235905, 1.5328118427212771], [17.629156638199262, 0.9345344799275288, 5.932307928006555]], "peak_params_": [[9.450478567768993, 1.5521709241727404, 3.0656236854425543], [17.629156638199262, 0.9327104952790318, 11.86461585601311]], "r_squared_": 0.9887851148285952, "error_": 0.06722395818945807}
{"freq_range": [2.0, 80.0], "freq_res": 1.0, "aperiodic_params_": [0.9550749944651272, 1.4484127338057555], "gaussian_params_": [[9.088769678257206, 1.5795585634200187, 1.3798747013899386], [12.396555550293472, 0.768000685071736, 1.938776651377563], [17.10248072505219, 0.8732538869503766, 1.8854804181721283], [23.916559492691427, 0.5318438453927028, 3.641381525900102]], "peak_params_": [[9.088769678257206, 1.742037742957299, 2.7597494027798772], [12.396555550293472, 0.9476467442654709, 3.877553302755126], [17.10248072505219, 1.005361717364803, 3.7709608363442566], [23.916559492691427, 0.532788516892361, 7.282763051800204]], "r_squared_": 0.9940549376739825, "error_": 0.052405195986575004}
{"freq_range": [2.0, 80.0], "freq_res": 1.0, "aperiodic_params_": [0.9344836644302893, 1.442498208290926], "gaussian_params_": [[9.34293562799581, 1.7021764388479586, 1.559675798465753], [16.088473623327616, 0.9219286948801166, 3.603367873339528], [25.237452808544603, 0.4523206401625471, 2.8239285492412303]], "peak_params_": [[9.34293562799581, 1.7946858172731952, 3.119351596931506], [16.088473623327616, 0.9239865661689092, 7.206735746679056], [25.237452808544603, 0.49403210913832196, 5.6478570984824605]], "r_squared_": 0.9922873079494267, "error_": 0.05636314236798461}
{"freq_range": [2.0, 80.0], "freq_res": 1.0, "aperiodic_params_": [0.8775161761990317, 1.4245210041598928], "gaussian_params_": [[9.366293046545989, 1.7696088423567538, 1.5837420634770314], [16.407460466374005, 1.0091276651316223, 3.918678315506243], [25.49628398000463, 0.3072921992504741, 3.2914943307998996]], "peak_params_": [[9.366293046545989, 1.8919638077925547, 3.167484126954063], [16.407460466374005, 1.0087484470428618, 7.837356631012486], [25.49628398000463, 0.39499984955697776, 6.582988661599799]], "r_squared_": 0.9925805397161669, "error_": 0.05873487605760938}
{"freq_range": [2.0, 80.0], "freq_res": 1.0, "aperiodic_params_": [0.8984518375686495, 1.4190327178835158], "gaussian_params_": [[9.343734999694538, 1.7118371075217722, 1.5671877218151649], [16.383802658391396, 0.9867892081933494, 3.881768069950468], [25.61478061430795, 0.309497584169797, 3.607586114986957]], "peak_params_": [[9.343734999694538, 1.8327924972428495, 3.1343754436303297], [16.383802658391396, 0.9910613744814721, 7.763536139900936], [25.61478061430795, 0.3536175823925778, 7.215172229973914]], "r_squared_": 0.9933682210506881, "error_": 0.0554670782947351}
{"freq_range": [2.0, 80.0], "freq_res": 1.0, "aperiodic_params_": [0.7492928755390271, 1.3740566446502083], "gaussian_params_": [[8.995244995024622, 1.5777486393182927, 1.3441758856809334], [11.662127122394187, 0.7583233336133224, 1.9523991709754471], [17.22887373325369, 0.9536585961420431, 2.688965236483609], [24.476802725733652, 0.40959655282312746, 3.6998911223186712]], "peak_params_": [[8.995244995024622, 1.8859530865488339, 2.6883517713618668], [11.662127122394187, 1.022123475685845, 3.9047983419508943], [17.22887373325369, 1.0214314652177934, 5.377930472967218], [24.476802725733652, 0.44624839686661044, 7.3997822446373425]], "r_squared_": 0.9935346584262791, "error_": 0.05499113754917153}
{"freq_range": [2.0, 80.0], "freq_res": 1.0, "aperiodic_params_": [0.3986068558359273, 1.248605723075384], "gaussian_params_": [[9.032983748014477, 1.782804228295856, 1.4209223725156346], [12.18534831709752, 0.6947356295239944, 1.883675047110478], [17.517089705432745, 0.9542719222392881, 2.4864662685803482], [24.56045730684324, 0.36284194197920333, 3.7205452012782154]], "peak_params_": [[9.032983748014477, 1.951376190023829, 2.841844745031269], [12.18534831709752, 0.975508808601199, 3.767350094220956], [17.517089705432745, 1.0190253272647571, 4.9729325371606965], [24.56045730684324, 0.37062272790770323, 7.441090402556431]], "r_squared_": 0.991992940244789, "error_": 0.05788249051527447}
{"freq_range": [2.0, 80.0], "freq_res": 1.0, "aperiodic_params_": [0.6898712752518764, 1.3307320268886609], "gaussian_params_": [[9.339047084637194, 1.5399654915841767, 1.4033291838613162], [16.862769493129367, 0.918008380630159, 5.211281911747288]], "peak_params_": [[9.339047084637194, 1.789785161920427, 2.8066583677226324], [16.862769493129367, 0.9176906615955415, 10.422563823494576]], "r_squared_": 0.9893459083676391, "error_": 0.06730164718378724}
{"freq_range": [2.0, 80.0], "freq_res": 1.0, "aperiodic_params_": [0.8623993775769347, 1.410339619463871], "gaussian_params_": [[9.494995385873551, 1.4500486098319672, 1.4791770822167947], [17.20408814012989, 0.949307542286098, 5.466422331669347]], "peak_params_": [[9.494995385873551, 1.6789060569759995, 2.9583541644335893], [17.20408814012989, 0.9486498833691052, 10.932844663338694]], "r_squared_": 0.9891310970027205, "error_": 0.07020196561132996}
{"freq_range": [2.0, 80.0], "freq_res": 1.0, "aperiodic_params_": [0.9235071815965675, 1.4383690124488508], "gaussian_params_": [[9.47464102473015, 1.5749855772026031, 1.5848614355954918], [15.639174618956869, 0.8676464920306683, 3.5728275398177307], [23.26316144927327, 0.4115934643917631, 5.011815270684419]], "peak_params_": [[9.47464102473015, 1.6674437906791866, 3.1697228711909835], [15.639174618956869, 1.0075787428512684, 7.145655079635461], [23.26316144927327, 0.5149361977242354, 10.023630541368838]], "r_squared_": 0.9932481438983962, "error_": 0.05473956568369718}
{"freq_range": [2.0, 80.0], "freq_res": 1.0, "aperiodic_params_": [0.930812815631087, 1.4549812242453222], "gaussian_params_": [[9.481427314087851, 1.8393807851505304, 1.6123120250851066], [16.06713127236612, 0.9008342824876309, 3.548469618454754], [24.45203495548927, 0.32145693548208343, 3.894909675214615]], "peak_params_": [[9.481427314087851, 1.8832820104946375, 3.2246240501702133], [16.06713127236612, 0.9317117354838638, 7.096939236909508], [24.45203495548927, 0.3933258746198752, 7.78981935042923]], "r_squared_": 0.9928869041588022, "error_": 0.058547408290872724}
{"freq_range": [2.0, 80.0], "freq_res": 1.0, "aperiodic_params_": [0.7134418236372725, 1.3757567616772104], "gaussian_params_": [[9.527478172777286, 1.8505266716955595, 1.5894609553277976], [17.84880161632878, 0.8439025327347921, 5.223048878652806]], "peak_params_": [[9.527478172777286, 2.0433909790473472, 3.1789219106555953], [17.84880161632878, 0.8435502612555341, 10.446097757305612]], "r_squared_": 0.991448127868743, "error_": 0.06420283152542068}
{"freq_range": [2.0, 80.0], "freq_res": 1.0, "aperiodic_params_": [0.7283120852853633, 1.3899034867587858], "gaussian_params_": [[9.530227045742366, 1.8555616930235597, 1.5888067135135413], [17.866693859626032, 0.8405089269850572, 5.17707777445979]], "peak_params_": [[9.530227045742366, 2.041145318931224, 3.1776134270270826], [17.866693859626032, 0.8402315849137415, 10.35415554891958]], "r_squared_": 0.9912093999188083, "error_": 0.06442105568034065}
{"freq_range": [2.0, 80.0], "freq_res": 1.0, "aperiodic_params_": [0.7219233636633859, 1.381019045692821], "gaussian_params_": [[9.528018783463239, 1.855468723096521, 1.5865540163322698], [17.875598194130394, 0.841838192966745, 5.194356254018218]], "peak_params_": [[9.528018783463239, 2.041870118054822, 3.1731080326645396], [17.875598194130394, 0.8415979922124026, 10.388712508036436]], "r_squared_": 0.991329909431314, "error_": 0.06324556245805442}
{"freq_range": [2.0, 80.0], "freq_res": 1.0, "aperiodic_params_": [0.7775319640416952, 1.454664119405751], "gaussian_params_": [[9.337431823370881, 2.1093541041371227, 1.5631872146395343], [17.614725347498503, 1.078083880235436, 3.8279670066659337], [27.222670978497906, 0.3123489830373218, 2.2945390693049865]], "peak_params_": [[9.337431823370881, 2.1464594035101756, 3.1263744292790685], [17.614725347498503, 1.0727346446670751, 7.655934013331867], [27.222670978497906, 0.3642578839081678, 4.589078138609973]], "r_squared_": 0.9910731190423031, "error_": 0.06940079670466279}
{"freq_range": [2.0, 80.0], "freq_res": 1.0, "aperiodic_params_": [0.36066998587493015, 1.1753190979391377], "gaussian_params_": [[9.287558461667581, 2.004486138636104, 1.3639167846916762], [12.633287616009426, 0.4179955959196645, 0.7533520276073691], [17.82611780130374, 0.7767141280054187, 3.2281657625557343], [65.85976277748888, 0.1934050338266063, 0.5095156660721248], [72.85198302927466, 0.17903045624215794, 5.999999999999999]], "peak_params_": [[9.287558461667581, 1.9789247739862406, 2.7278335693833524], [12.633287616009426, 0.6746931431680406, 1.5067040552147382], [17.82611780130374, 0.775588191856669, 6.456331525111469], [65.85976277748888, 0.27948434467758276, 1.0190313321442497], [72.85198302927466, 0.17897598699520345, 11.999999999999998]], "r_squared_": 0.989575837340429, "error_": 0.055895152793843134}
{"freq_range": [2.0, 80.0], "freq_res": 1.0, "aperiodic_params_": [0.8858567044307496, 1.4464632720555481], "gaussian_params_": [[9.401647080904564, 1.9637906271469836, 1.4944431938500247], [17.203229842847776, 1.0044601858234137, 3.9791936190102564], [26.872876937063868, 0.25473088522186843, 2.9032890959774624]], "peak_params_": [[9.401647080904564, 2.014102843768995, 2.9888863877000493], [17.203229842847776, 1.003941004228378, 7.958387238020513], [26.872876937063868, 0.3029830608242208, 5.806578191954925]], "r_squared_": 0.9906417244118844, "error_": 0.06517028661851786}
{"freq_range": [2.0, 80.0], "freq_res": 1.0, "aperiodic_params_": [0.9068553306342947, 1.4447091176016789], "gaussian_params_": [[9.564057296181046, 1.811404226009498, 1.5806124117953086], [15.933177202490747, 0.8127041744330009, 3.77161334426219], [23.45207654264301, 0.33644799556464666, 5.094910874166195]], "peak_params_": [[9.564057296181046, 1.9899187900862834, 3.1612248235906173], [15.933177202490747, 0.9284735705310729, 7.54322668852438], [23.45207654264301, 0.47559920056323923, 10.18982174833239]], "r_squared_": 0.9927447388604671, "error_": 0.05705816864101446}
{"freq_range": [2.0, 80.0], "freq_res": 1.0, "aperiodic_params_": [0.8904193126361465, 1.441473893506599], "gaussian_params_": [[8.447566788822543, 0.6545234259159205, 0.7404597588421565], [10.03395232846733, 1.548362630266607, 1.60775649967577], [17.52321284725952, 0.8073052189313713, 5.256103723881431]], "peak_params_": [[8.447566788822543, 1.3971968333756146, 1.480919517684313], [10.03395232846733, 1.910544922715402, 3.21551299935154], [17.52321284725952, 0.8039978098848163, 10.512207447762862]], "r_squared_": 0.9922553689873505, "error_": 0.058420725185625064}
{"freq_range": [2.0, 80.0], "freq_res": 1.0, "aperiodic_params_": [0.7133107724508717, 1.3786466746596282], "gaussian_params_": [[9.534785308838817, 1.8572162336216156, 1.5897680920396908], [17.883641948161532, 0.8423532202087098, 5.180068725345503]], "peak_params_": [[9.534785308838817, 2.043938979083764, 3.1795361840793817], [17.883641948161532, 0.8421420277866242, 10.360137450691006]], "r_squared_": 0.9913364642077714, "error_": 0.06484334916929847}
{"freq_range": [2.0, 80.0], "freq_res": 1.0, "aperiodic_params_": [0.8859879806746634, 1.4779973594760494], "gaussian_params_": [[9.474329766523725, 2.05707465450447, 1.5631655859858347], [18.487004745092758, 0.9455550805645843, 5.252335905261045]], "peak_params_": [[9.474329766523725, 2.149545930851975, 3.1263311719716693], [18.487004745092758, 0.9414999142610699, 10.50467181052209]], "r_squared_": 0.9904907571921784, "error_": 0.07222133535684915}
{"freq_range": [2.0, 80.0], "freq_res": 1.0, "aperiodic_params_": [0.4096451030170054, 1.266165378147874], "gaussian_params_": [[8.864097376626678, 1.2280744325806618, 1.0641306799832797], [10.529047787566352, 1.163305318126795, 1.6463857899201113], [17.53395005714947, 0.776540062432956, 1.9735378649971151], [21.140143409297465, 0.43894608260607954, 1.0446650251776932], [25.908393794176604, 0.18284934884256104, 3.919302769749947]], "peak_params_": [[8.864097376626678, 1.9739646369358717, 2.1282613599665594], [10.529047787566352, 1.2838667685398464, 3.2927715798402226], [17.53395005714947, 0.7838931969654416, 3.9470757299942303], [21.140143409297465, 0.6845862559775236, 2.0893300503553864], [25.908393794176604, 0.18288655271747478, 7.838605539499894]], "r_squared_": 0.9926551256349655, "error_": 0.05199088626869053}
{"freq_range": [2.0, 80.0], "freq_res": 1.0, "aperiodic_params_": [0.8396538727260929, 1.4243980089873445], "gaussian_params_": [[9.18491918912453, 1.7353635083803685, 1.2267640800735042], [11.787369976591403, 0.9163867781493209, 1.9001534968052702], [18.155864336317467, 0.8947821180741103, 2.4040426320188195], [25.04066794348303, 0.2900143900317862, 3.5290460071558374]], "peak_params_": [[9.18491918912453, 2.028874871801852, 2.4535281601470085], [11.787369976591403, 1.0694277506497902, 3.8003069936105405], [18.155864336317467, 0.9369148548658085, 4.808085264037639], [25.04066794348303, 0.30554545787439935, 7.058092014311675]], "r_squared_": 0.9932383287035805, "error_": 0.05367126373213989}
{"freq_range": [2.0, 80.0], "freq_res": 1.0, "aperiodic_params_": [0.7421453146242702, 1.375570711116521], "gaussian_params_": [[8.675070200261741, 0.9225491402092801, 0.93007341044244], [10.421786308461106, 1.2072721876967438, 1.6096516764352244], [18.038296834831286, 0.6466615367933372, 5.22674056289857]], "peak_params_": [[8.675070200261741, 1.8302370643247325, 1.86014682088488], [10.421786308461106, 1.6991657236630706, 3.219303352870449], [18.038296834831286, 0.6466627443409093, 10.45348112579714]], "r_squared_": 0.9926796417138628, "error_": 0.05218764036106085}
{"freq_range": [2.0, 80.0], "freq_res": 1.0, "aperiodic_params_": [0.7235764340918167, 1.3863152423571052], "gaussian_params_": [[9.559908252330457, 1.859845463362901, 1.6068894486544605], [18.06959317306339, 0.8137945630373268, 5.1149082780143935]], "peak_params_": [[9.559908252330457, 2.025824674593715, 3.213778897308921], [18.06959317306339, 0.8137211411213059, 10.229816556028787]], "r_squared_": 0.99181568857867, "error_": 0.058876849196290014}
{"freq_range": [2.0, 80.0], "freq_res": 1.0, "aperiodic_params_": [-0.5932290963866408, 0.9058232583411137], "gaussian_params_": [[9.413264662624213, 1.0338674798776173, 1.6727618242139304], [9.506353049796418, 0.6749194082982736, 0.28232482156976907], [16.537050153824104, 0.556994601284996, 3.3071884098184645], [25.204963203607612, 0.2052106354557257, 1.27380911656449], [71.01596902295294, 0.1696912515776532, 0.2500475480379123], [77.22314290730397, 0.1071025661339159, 5.999999999999998]], "peak_params_": [[9.413264662624213, 1.1794225615146219, 3.3455236484278608], [9.506353049796418, 1.1974964380838171, 0.5646496431395381], [16.537050153824104, 0.5515993254952738, 6.614376819636929], [25.204963203607612, 0.2236534030413555, 2.54761823312898], [71.01596902295294, 0.23189171518442464, 0.5000950960758246], [77.22314290730397, 0.10702852323883594, 11.999999999999996]], "r_squared_": 0.9895491048808911, "error_": 0.041561837759657015}
{"freq_range": [2.0, 80.0], "freq_res": 1.0, "aperiodic_params_": [0.1023912804774675, 0.9986790963755802], "gaussian_params_": [[9.012954048321415, 1.5390675849606879, 1.1873967743271432], [12.435183772036726, 0.3789816287781226, 1.2741443222366138], [16.819461987766694, 0.406029151982432, 1.9119356888212755]], "peak_params_": [[9.012954048321415, 1.549075743449926, 2.3747935486542864], [12.435183772036726, 0.43946725379461526, 2.5482886444732276], [16.819461987766694, 0.40484166964713486, 3.823871377642551]], "r_squared_": 0.982458037230117, "error_": 0.06116173664702176}
{"freq_range": [2.0, 80.0], "freq_res": 1.0, "aperiodic_params_": [0.1284931957477738, 1.0473370928483523], "gaussian_params_": [[8.937081837143603, 1.4909639918600934, 1.3603487540823689], [12.66553712714343, 0.40547673693120273, 1.7249759511839386], [17.370252442327008, 0.46912294559171064, 2.7365725357646924], [25.516928347258414, 0.18870131060310238, 2.153124310363494]], "peak_params_": [[8.937081837143603, 1.5361393648048136, 2.7206975081647378], [12.66553712714343, 0.5462279501693775, 3.4499519023678773], [17.370252442327008, 0.4821786766846179, 5.473145071529385], [25.516928347258414, 0.1872611716104018, 4.306248620726988]], "r_squared_": 0.9877536047272799, "error_": 0.052802995437810064}
{"freq_range": [2.0, 80.0], "freq_res": 1.0, "aperiodic_params_": [0.09412161788911967, 1.080125568468604], "gaussian_params_": [[9.028661408317761, 1.6993162710593326, 1.238323011921262], [12.605921058588157, 0.5309369107936253, 1.2650224604336628], [16.9146355294005, 0.5429840353617126, 1.6430781505293668], [21.097942349765944, 0.23522862733196528, 0.7434492634903044]], "peak_params_": [[9.028661408317761, 1.708000332377336, 2.476646023842524], [12.605921058588157, 0.5475015276946769, 2.5300449208673257], [16.9146355294005, 0.5435255406598245, 3.2861563010587336], [21.097942349765944, 0.2578754969172299, 1.4868985269806088]], "r_squared_": 0.9846074946082081, "error_": 0.06077278012318641}
