{"freq_range": [2.0, 80.0], "freq_res": 1.0, "aperiodic_params_": [0.1739715603112042, 0.9107419923524351], "gaussian_params_": [[9.270351781717157, 0.201712728013296, 0.5206843209068786], [17.567111956157973, 0.2904298562779424, 4.042037978191944], [23.80630415409296, 0.1951055900597762, 0.539381787695276], [31.0748878039033, 0.2086011577865331, 0.7881475259048738], [34.237906165379144, 0.2750455345371803, 1.1075288150486853], [60.598955300795545, 0.5296877520966653, 0.25003422631150707], [66.62871314693376, 0.0958532207772743, 2.323372353312138], [71.37733988366908, 0.1528280067550149, 0.574716268702061]], "peak_params_": [[9.270351781717157, 0.20700470552106054, 1.041368641813757], [17.567111956157973, 0.2887690577173958, 8.084075956383888], [23.80630415409296, 0.2647759631915658, 1.078763575390552], [31.0748878039033, 0.21265455435742564, 1.5762950518097476], [34.237906165379144, 0.269060283828775, 2.2150576300973706], [60.598955300795545, 0.15143654988966326, 0.5000684526230141], [66.62871314693376, 0.0946370671072414, 4.646744706624276], [71.37733988366908, 0.13952399083482092, 1.149432537404122]], "r_squared_": 0.98238437487571, "error_": 0.03622992178910125}
{"freq_range": [2.0, 80.0], "freq_res": 1.0, "aperiodic_params_": [0.10173330882459705, 0.6810094987920181], "gaussian_params_": [[13.480753819055023, 0.8865425042083122, 0.27608857973125706], [16.800034370744836, 0.20820540421887573, 1.2722242982696572], [20.368785246009992, 0.21931226349326852, 0.46555621625302734], [22.30908094807413, 0.38792713078421376, 0.5141789994496387], [24.652208327051518, 0.39728900911710624, 0.2651726801985328], [30.089057929658914, 0.20325532920458006, 4.016960780621249], [38.93081431774483, 0.151819579713767, 0.2500010131446931], [41.57065819831232, 0.6407873577862647, 0.2721344741940353], [51.33261781740331, 0.24543190466108342, 0.2514008004641724], [52.45203459913595, 0.12453750207331231, 5.999999999999999], [64.94779641058169, 0.15365558744342978, 1.5744743044822516]], "peak_params_": [[13.480753819055023, 0.1970905197795585, 0.5521771594625141], [16.800034370744836, 0.2066551159569492, 2.5444485965393144], [20.368785246009992, 0.17774822792747436, 0.9311124325060547], [22.30908094807413, 0.3510900133794253, 1.0283579988992775], [24.652208327051518, 0.2592038985693472, 0.5303453603970656], [30.089057929658914, 0.2033187978588118, 8.033921561242497], [38.93081431774483, 0.17356006976244476, 0.5000020262893862], [41.57065819831232, 0.21441048172909039, 0.5442689483880706], [51.33261781740331, 0.22323033909227508, 0.5028016009283448], [52.45203459913595, 0.1314232180681033, 11.999999999999998], [64.94779641058169, 0.16755329958493625, 3.148948608964503]], "r_squared_": 0.9541301713384741, "error_": 0.040782479328800636}
{"freq_range": [2.0, 80.0], "freq_res": 1.0, "aperiodic_params_": [0.28942634353508684, 1.0337396342526413], "gaussian_params_": [[9.3792385402746, 0.26381820682114576, 0.838973927397508], [15.93011473586933, 0.3505130868038977, 2.794778015946707], [23.71515201101302, 0.19635626781757906, 2.808120750641027], [34.65953672049911, 0.1435491953522289, 1.2177740306473672], [60.64262688713355, 0.26372021455594874, 0.25735838747348183], [69.18175508703534, 0.10062950946344877, 5.999999999999999], [74.01999408684945, 0.10156118949043583, 0.25002037071203304]], "peak_params_": [[9.3792385402746, 0.2543970393737947, 1.677947854795016], [15.93011473586933, 0.3549108666633263, 5.589556031893414], [23.71515201101302, 0.20077143033421163, 5.616241501282054], [34.65953672049911, 0.13810834964410934, 2.4355480612947344], [60.64262688713355, 0.1402742458129178, 0.5147167749469637], [69.18175508703534, 0.10058334940163283, 11.999999999999998], [74.01999408684945, 0.17413109881416156, 0.5000407414240661]], "r_squared_": 0.9810850507801009, "error_": 0.04321058800728014}
{"freq_range": [2.0, 80.0], "freq_res": 1.0, "aperiodic_params_": [0.5684820865790914, 1.149587930011913], "gaussian_params_": [[9.2002972730243, 0.2653993747168291, 0.9748460166263097], [15.96780837390932, 0.3582460479940834, 2.883717388308247], [23.945025423141214, 0.2465091433865809, 2.816274865207672], [68.60594090432556, 0.08706654369620379, 5.999999999999999]], "peak_params_": [[9.2002972730243, 0.2791940951178152, 1.9496920332526193], [15.96780837390932, 0.36283297155361827, 5.767434776616494], [23.945025423141214, 0.2538668040678804, 5.632549730415344], [68.60594090432556, 0.0868789694184231, 11.999999999999998]], "r_squared_": 0.9868465251204243, "error_": 0.042015195158238844}
{"freq_range": [2.0, 80.0], "freq_res": 1.0, "aperiodic_params_": [0.32631769257566856, 0.7578179854383904], "gaussian_params_": [[13.505046565547062, 0.7968912027781397, 0.2763072343685034], [15.623910144788852, 0.4750339186553474, 0.308890800637689], [17.44643645859677, 0.2387163385747493, 0.7446657410335181], [22.34411710471084, 0.30278236205054015, 0.9347421143795929], [24.518759714209253, 0.636168208964189, 0.2866557541267446], [27.356976463605488, 0.37361566067834984, 0.2587744792817235], [31.20999149702446, 0.15086878570634027, 0.5617536466721199], [41.96027339753426, 0.23334355234355594, 0.48300788632890856], [45.50288943011278, 0.09012703565554452, 1.7979992884681766], [56.54796540086405, 0.09074041440604327, 5.999999999999999]], "peak_params_": [[13.505046565547062, 0.16018810037114828, 0.5526144687370068], [15.623910144788852, 0.26256189125662255, 0.617781601275378], [17.44643645859677, 0.19947425885598774, 1.4893314820670362], [22.34411710471084, 0.28294437319667515, 1.8694842287591857], [24.518759714209253, 0.16078751275270997, 0.5733115082534892], [27.356976463605488, 0.14427845235676595, 0.517548958563447], [31.20999149702446, 0.14069810883339184, 1.1235072933442398], [41.96027339753426, 0.2508653851341073, 0.9660157726578171], [45.50288943011278, 0.10609807517782732, 3.595998576936353], [56.54796540086405, 0.09048325921270195, 11.999999999999998]], "r_squared_": 0.9649283872012864, "error_": 0.040027103941508275}
{"freq_range": [2.0, 80.0], "freq_res": 1.0, "aperiodic_params_": [0.08611973557010166, 0.5716873427016618], "gaussian_params_": [[20.315023578173463, 0.19702678516533298, 0.4789149508197332], [22.405772263544765, 0.6832671214629711, 0.3149851863234207], [25.44430498675312, 0.5868915110877889, 0.2840151950055071], [29.798124244854083, 0.27490891387900473, 3.9814750317400054], [38.58271487040441, 0.43643582520405616, 0.26816733763417105], [44.0362517764059, 0.14277501552245844, 0.25000122466147234], [50.944744146981414, 0.12242742714323399, 4.859533849016276], [57.470285326745504, 0.42228715081756635, 0.2773634015802429], [64.57910389636551, 0.22344651978323343, 1.2839071137003522]], "peak_params_": [[20.315023578173463, 0.17200514695007163, 0.9578299016394664], [22.405772263544765, 0.3387944986454995, 0.6299703726468414], [25.44430498675312, 0.3056331796439878, 0.5680303900110142], [29.798124244854083, 0.274567089036638, 7.962950063480011], [38.58271487040441, 0.1550503473496796, 0.5363346752683421], [44.0362517764059, 0.1858520163271561, 0.5000024493229447], [50.944744146981414, 0.1224197042570625, 9.719067698032552], [57.470285326745504, 0.15663428441136817, 0.5547268031604858], [64.57910389636551, 0.21362451516397196, 2.5678142274007043]], "r_squared_": 0.9254865424436169, "error_": 0.04161388327578616}
{"freq_range": [2.0, 80.0], "freq_res": 1.0, "aperiodic_params_": [0.35959674004758413, 1.07202769105921], "gaussian_params_": [[9.451430833164046, 0.3266522036495222, 0.9801176926780132], [15.787221919112142, 0.364004466363466, 2.7525272542971337], [23.503301064677892, 0.26925189960192564, 0.9883489626000043], [26.466968658948606, 0.7094002930279985, 0.25976930215852545], [70.09244052838957, 0.10926379018050378, 5.999999999999999]], "peak_params_": [[9.451430833164046, 0.31118824246111043, 1.9602353853560264], [15.787221919112142, 0.3629184945198274, 5.5050545085942675], [23.503301064677892, 0.24155545380913523, 1.9766979252000085], [26.466968658948606, 0.15244082170696793, 0.5195386043170509], [70.09244052838957, 0.10925082308134804, 11.999999999999998]], "r_squared_": 0.9846496793933306, "error_": 0.04008305521551066}
{"freq_range": [2.0, 80.0], "freq_res": 1.0, "aperiodic_params_": [0.5744567049864477, 1.1540893451581804], "gaussian_params_": [[9.122053750772285, 0.2601661450598567, 0.9179142805706979], [15.938832783264738, 0.35248837224878077, 2.983632733461017], [24.060219433958927, 0.2508051064782315, 2.8175438622622595], [35.99694230090821, 0.14652127600578754, 0.250000602308053], [69.54794542764719, 0.0854638792442856, 5.999999999999999]], "peak_params_": [[9.122053750772285, 0.28146440651550764, 1.8358285611413958], [15.938832783264738, 0.3566047273945951, 5.967265466922034], [24.060219433958927, 0.25991076400107793, 5.635087724524519], [35.99694230090821, 0.14654194420741407, 0.500001204616106], [69.54794542764719, 0.08522165608316223, 11.999999999999998]], "r_squared_": 0.9872995262029735, "error_": 0.040310689495080564}
{"freq_range": [2.0, 80.0], "freq_res": 1.0, "aperiodic_params_": [0.5788413065809906, 1.1536922574693544], "gaussian_params_": [[9.238333309474829, 0.2551071507465513, 0.9125247393870565], [16.081898372079873, 0.3515533799494771, 2.9212198494976422], [24.101062676191244, 0.2466820744677939, 2.627535226694922], [57.219899884288616, 0.16397186492151677, 0.2500000000003081], [69.54796540086326, 0.083156917327113, 5.999999999999999]], "peak_params_": [[9.238333309474829, 0.2651639168562613, 1.825049478774113], [16.081898372079873, 0.35354332614165, 5.8424396989952845], [24.101062676191244, 0.25542444532326525, 5.255070453389844], [57.219899884288616, 0.12070503924323406, 0.5000000000006162], [69.54796540086326, 0.08292125339279055, 11.999999999999998]], "r_squared_": 0.9879199301273357, "error_": 0.03859350849592794}
{"freq_range": [2.0, 80.0], "freq_res": 1.0, "aperiodic_params_": [0.7575974481306335, 1.2959386523729992], "gaussian_params_": [[9.087919578332857, 0.29608541784405945, 1.0036971720708134], [16.362276010829575, 0.3675118690471157, 3.4338616744452626], [24.58162836107492, 0.2522473002324305, 2.802553578824699], [47.05736581319677, 0.17731334012854053, 0.612444553937669], [57.44850307207208, 0.1843361500410669, 0.520482229908566], [74.25324346438525, 0.10721646784696823, 5.999999999999999]], "peak_params_": [[9.087919578332857, 0.33185644241580947, 2.007394344141627], [16.362276010829575, 0.3677938657963234, 6.867723348890525], [24.58162836107492, 0.26498571152835404, 5.605107157649398], [47.05736581319677, 0.17654076404907548, 1.224889107875338], [57.44850307207208, 0.1288826295744383, 1.040964459817132], [74.25324346438525, 0.10712100990056861, 11.999999999999998]], "r_squared_": 0.9906422603282541, "error_": 0.03711336935861816}
{"freq_range": [2.0, 80.0], "freq_res": 1.0, "aperiodic_params_": [0.7501713604752986, 1.2910657259794112], "gaussian_params_": [[9.114538155997135, 0.2968140364991813, 1.0455603121422257], [16.31823811635324, 0.37047116170931665, 3.325338453023317], [24.526496342874186, 0.2510581752824496, 2.84407263345157], [47.18527750518173, 0.18524459066623605, 0.4971083590302548], [52.46255290639014, 0.7208111510689996, 0.25010375083873554], [57.43848037846164, 0.6270776117190164, 0.2536421520873677], [66.18372297978667, 0.12709897752836447, 1.3269469647310288], [75.50871097867314, 0.11572608780315093, 3.2116278764055624]], "peak_params_": [[9.114538155997135, 0.3279270688580941, 2.0911206242844513], [16.31823811635324, 0.371584409678547, 6.650676906046634], [24.526496342874186, 0.2598666599239501, 5.68814526690314], [47.18527750518173, 0.172814800727896, 0.9942167180605096], [52.46255290639014, 0.1303411751593464, 0.5002075016774711], [57.43848037846164, 0.14072475423745612, 0.5072843041747354], [66.18372297978667, 0.12733185431013605, 2.6538939294620576], [75.50871097867314, 0.1143799585397931, 6.423255752811125]], "r_squared_": 0.9939899064693026, "error_": 0.029916486443319013}
{"freq_range": [2.0, 80.0], "freq_res": 1.0, "aperiodic_params_": [0.5635527621107305, 1.0673900548318378], "gaussian_params_": [[9.021092389303172, 0.2196329422752546, 0.854046133196347], [16.399645418048824, 0.28176179248552313, 2.9942099287291257], [23.523035948409248, 0.28071832111956285, 0.26452466499886773], [25.266845745122794, 0.20546523807347286, 2.7928776863199785], [65.85958119346401, 0.11487685382934969, 1.389445420099003], [76.21250268882655, 0.12884172654602905, 2.0624579806887873]], "peak_params_": [[9.021092389303172, 0.23286054378332707, 1.708092266392694], [16.399645418048824, 0.2800989383658, 5.9884198574582514], [23.523035948409248, 0.2518629528214352, 0.5290493299977355], [25.266845745122794, 0.2090832285990627, 5.585755372639957], [65.85958119346401, 0.11429232211823437, 2.778890840198006], [76.21250268882655, 0.12815965005805374, 4.1249159613775745]], "r_squared_": 0.9858836273891743, "error_": 0.03974488609960136}
{"freq_range": [2.0, 80.0], "freq_res": 1.0, "aperiodic_params_": [0.5576774878181012, 1.0607555272159914], "gaussian_params_": [[9.05534163055268, 0.20962088659322703, 0.9226184429851056], [16.57615918145489, 0.2826121369199528, 3.0482665400291236], [23.527733132798065, 0.45396219123329734, 0.2590352769224424], [25.624546050714265, 0.19657843068904926, 2.5688739793744566], [66.18510727220493, 0.12798440486129073, 1.4979571671116219], [74.42218963714963, 0.510587282109645, 0.25962669162668084], [77.3690432164344, 0.1198117483245829, 1.6070241858518426]], "peak_params_": [[9.05534163055268, 0.22212148071859983, 1.8452368859702113], [16.57615918145489, 0.2805947701613185, 6.096533080058247], [23.527733132798065, 0.2616575724353286, 0.5180705538448848], [25.624546050714265, 0.19686564767763837, 5.137747958748913], [66.18510727220493, 0.12701094437182237, 2.9959143342232437], [74.42218963714963, 0.14940884635847795, 0.5192533832533617], [77.3690432164344, 0.11669382200451439, 3.214048371703685]], "r_squared_": 0.986533742562129, "error_": 0.03712186455147648}
{"freq_range": [2.0, 80.0], "freq_res": 1.0, "aperiodic_params_": [0.21633982957605272, 0.7303025961070564], "gaussian_params_": [[13.566268589682513, 0.9818470778445256, 0.2500039407318116], [16.375010892287364, 0.21354727452995437, 0.6055521614914233], [23.015395215049523, 0.16152497878693386, 0.7867753580654948], [24.190910783438305, 0.22547505703585655, 3.987825568639836], [41.69600480439241, 0.1377005838473281, 0.6534502210912159], [47.003510021984134, 0.137816652468889, 4.541630124971781], [63.50244779827529, 0.12571403387400681, 1.3380420715822534], [66.3842082206207, 0.502699871801212, 0.25000350084209605]], "peak_params_": [[13.566268589682513, 0.22670835409425572, 0.5000078814636232], [16.375010892287364, 0.20363672385338283, 1.2111043229828466], [23.015395215049523, 0.377135745588089, 1.5735507161309896], [24.190910783438305, 0.2990353419130694, 7.975651137279672], [41.69600480439241, 0.19870558845633013, 1.3069004421824317], [47.003510021984134, 0.13781662905890757, 9.083260249943562], [63.50244779827529, 0.11744157477907946, 2.676084143164507], [66.3842082206207, 0.17637302677433597, 0.5000070016841921]], "r_squared_": 0.9489772086684695, "error_": 0.0481016118863584}
{"freq_range": [2.0, 80.0], "freq_res": 1.0, "aperiodic_params_": [0.22141880997181063, 0.7321049003420148], "gaussian_params_": [[13.582453188787659, 0.8453538682662705, 0.250002625463251], [16.41172408363823, 0.21062904708844882, 0.6533446432608491], [23.11302457489991, 0.1522891594708572, 0.9355797325571397], [24.381992504749444, 0.22230689880002577, 3.8553159885148074], [42.972548498916176, 0.17760836531123375, 1.7284926850008926], [46.67438805502179, 0.2397821038951256, 0.6686611698695215], [63.45203459913595, 0.07494346690536492, 5.999955208941535]], "peak_params_": [[13.582453188787659, 0.21571319275347006, 0.500005250926502], [16.41172408363823, 0.19361468477383725, 1.3066892865216981], [23.11302457489991, 0.35965514408790705, 1.8711594651142793], [24.381992504749444, 0.3183806375876292, 7.710631977029615], [42.972548498916176, 0.17781267749467955, 3.456985370001785], [46.67438805502179, 0.22648304631863203, 1.337322339739043], [63.45203459913595, 0.07473107644944998, 11.99991041788307]], "r_squared_": 0.9487846770868726, "error_": 0.047840248808838276}
{"freq_range": [2.0, 80.0], "freq_res": 1.0, "aperiodic_params_": [0.33380554526785383, 1.0443478292756825], "gaussian_params_": [[9.419194339429728, 0.3226565176104194, 0.9900325744746429], [15.715078839951081, 0.3553738927466416, 2.659911664379156], [23.83148244827896, 0.2005543790243419, 1.7076477172060915], [64.48535806026203, 0.8112738405520017, 0.26737220178797416], [67.2727732738977, 0.14990916741282667, 0.8069952045104143]], "peak_params_": [[9.419194339429728, 0.3096721658224674, 1.9800651489492858], [15.715078839951081, 0.3533463827256864, 5.319823328758312], [23.83148244827896, 0.20236000795067166, 3.415295434412183], [64.48535806026203, 0.1562136138605814, 0.5347444035759483], [67.2727732738977, 0.14158550845011475, 1.6139904090208286]], "r_squared_": 0.9829288688278476, "error_": 0.04504598776741517}
{"freq_range": [2.0, 80.0], "freq_res": 1.0, "aperiodic_params_": [0.3133947569481871, 0.8862899992679495], "gaussian_params_": [[2.542507322264771, 0.26604622889838625, 0.9540334231929556], [9.226579423154428, 0.21717529974943126, 0.9978978624577154], [15.826578521543098, 0.2853890475426659, 2.6930385158923222], [24.226490438858598, 0.2516375105195013, 2.256570261341879], [27.749611829604035, 0.1374643625590416, 1.1087068224066943], [49.30886027889821, 0.1870077795265669, 2.099030929167817], [54.5231308083548, 1.0424302777582708, 0.25156581480663137], [57.20424608717115, 0.1829640012422037, 1.0526055817945683], [72.72118552074411, 0.1347700432371434, 5.99999946370636]], "peak_params_": [[2.542507322264771, 0.23715343145709822, 1.9080668463859112], [9.226579423154428, 0.22313313378872546, 1.9957957249154308], [15.826578521543098, 0.2851251488574159, 5.3860770317846445], [24.226490438858598, 0.25367702731425357, 4.513140522683758], [27.749611829604035, 0.19617964453072811, 2.2174136448133885], [49.30886027889821, 0.18504859285936737, 4.198061858335634], [54.5231308083548, 0.199769970424033, 0.5031316296132627], [57.20424608717115, 0.18413200183996414, 2.1052111635891366], [72.72118552074411, 0.13462461217836674, 11.99999892741272]], "r_squared_": 0.9803737075462144, "error_": 0.038924505892848404}
{"freq_range": [2.0, 80.0], "freq_res": 1.0, "aperiodic_params_": [0.5875290791300412, 1.1706986524502037], "gaussian_params_": [[9.193974669636374, 0.2632375466469067, 0.9545397606841646], [15.882268199263436, 0.3590733240389982, 2.863699606054756], [23.988347590507427, 0.2551890999750016, 2.9454916182793927], [35.901365193107715, 0.13057904892867, 0.2500317738997081], [46.26533705031978, 0.10034687575114927, 1.5104664996811528], [67.29886977677748, 0.08983500880733943, 5.999999999999999], [75.52444601523499, 0.27902174900305393, 0.3232997283850923]], "peak_params_": [[9.193974669636374, 0.27785703256468963, 1.9090795213683291], [15.882268199263436, 0.36522188814945267, 5.727399212109512], [23.988347590507427, 0.26164796073179264, 5.890983236558785], [35.901365193107715, 0.12086641468707926, 0.5000635477994162], [46.26533705031978, 0.09897535474837649, 3.0209329993623055], [67.29886977677748, 0.08972362866928596, 11.999999999999998], [75.52444601523499, 0.1259701203425596, 0.6465994567701846]], "r_squared_": 0.9903899967951489, "error_": 0.03419859653042109}
{"freq_range": [2.0, 80.0], "freq_res": 1.0, "aperiodic_params_": [0.7679529254472021, 1.3134363167554115], "gaussian_params_": [[9.206474588300468, 0.3151982150884467, 1.0664162383705704], [16.569935734759838, 0.4190872108266945, 3.3528349927692784], [24.746071190329697, 0.32048970379486424, 2.3509002377497206], [65.27657264227952, 0.1339613868846088, 0.8490895491635617], [75.52885160171051, 0.08597429626877938, 5.999999209217352]], "peak_params_": [[9.206474588300468, 0.3421087541087414, 2.132832476741141], [16.569935734759838, 0.41706086790237296, 6.705669985538557], [24.746071190329697, 0.3363901079525089, 4.701800475499441], [65.27657264227952, 0.14547722897110416, 1.6981790983271234], [75.52885160171051, 0.08570963988252833, 11.999998418434703]], "r_squared_": 0.9889589683907855, "error_": 0.045326403353371236}
{"freq_range": [2.0, 80.0], "freq_res": 1.0, "aperiodic_params_": [0.8355854865317687, 1.3614748943854011], "gaussian_params_": [[9.12315692811145, 0.29124869892272726, 1.0263396190280274], [16.802815365934876, 0.40811972738551333, 3.6403164466071605], [25.097581885538627, 0.2742597011484548, 2.2703510678267707], [57.42088495326676, 0.6863778090882282, 0.25001753706033136], [66.04389670278783, 0.12130288246091424, 1.225688950695757], [77.54796535414509, 0.10734227263567081, 3.9874816971336933]], "peak_params_": [[9.12315692811145, 0.3301926693940191, 2.052679238056055], [16.802815365934876, 0.40799547886025045, 7.280632893214321], [25.097581885538627, 0.30634660440098416, 4.540702135653541], [57.42088495326676, 0.1664133864748225, 0.5000350741206627], [66.04389670278783, 0.12284516198490203, 2.451377901391514], [77.54796535414509, 0.10665474166266242, 7.9749633942673865]], "r_squared_": 0.9914302501717618, "error_": 0.04044467866861998}
{"freq_range": [2.0, 80.0], "freq_res": 1.0, "aperiodic_params_": [0.7149321416725289, 1.2457656921205311], "gaussian_params_": [[9.189326376802004, 0.2603910749612026, 1.0285410747506325], [17.0060502718959, 0.37826671565610703, 3.8490652049451137], [25.307354067260796, 0.262241195861091, 2.110998700847816], [57.086552193619326, 0.15438409879498494, 0.7153296752364623]], "peak_params_": [[9.189326376802004, 0.29950125428063357, 2.057082149501265], [17.0060502718959, 0.3783799794701233, 7.6981304098902275], [25.307354067260796, 0.3032458032611878, 4.221997401695632], [57.086552193619326, 0.15325812654250615, 1.4306593504729246]], "r_squared_": 0.9863295033275623, "error_": 0.04843940407996521}
{"freq_range": [2.0, 80.0], "freq_res": 1.0, "aperiodic_params_": [0.5678627990834807, 1.073295524454722], "gaussian_params_": [[9.493865751800241, 0.2236653001228937, 1.1796898199144823], [13.591130623090198, 0.33590657997941464, 0.6361890884796924], [16.221122557211523, 0.3224316287542529, 0.8353045917834636], [18.934402368554696, 0.192596929920863, 0.9017143576456099], [24.568442016749053, 0.25940974389475097, 4.389087999660243]], "peak_params_": [[9.493865751800241, 0.20538047436809304, 2.3593796398289646], [13.591130623090198, 0.29706829802004564, 1.2723781769593847], [16.221122557211523, 0.3511387250786323, 1.6706091835669272], [18.934402368554696, 0.30936392919673483, 1.8034287152912198], [24.568442016749053, 0.2581588030814693, 8.778175999320487]], "r_squared_": 0.9813258027720203, "error_": 0.044878240670315615}
{"freq_range": [2.0, 80.0], "freq_res": 1.0, "aperiodic_params_": [0.2811736436743549, 0.8532542140153536], "gaussian_params_": [[9.597720897277028, 0.2399547475261672, 1.3795557597617747], [13.686511847003803, 0.36384770292459717, 0.6645748511579856], [16.324391981902412, 0.36386002023344, 0.7521435709919592], [19.2905146194209, 0.19147310337551682, 1.0236597424581784], [22.559924390539564, 0.43080344872533716, 0.32582358479967855], [24.154003931709134, 0.15375027558867357, 0.8502954275411531], [26.219654881091163, 0.1906095634623308, 2.0675385485505355], [52.24188798172371, 0.195888533935646, 2.046366164721354], [67.10819575194307, 0.11678575945389065, 5.999999999999999], [74.88154861775601, 0.14838849505482699, 0.3851423885320273]], "peak_params_": [[9.597720897277028, 0.22996687269423116, 2.7591115195235494], [13.686511847003803, 0.3300835118460708, 1.3291497023159713], [16.324391981902412, 0.33349346657751056, 1.5042871419839183], [19.2905146194209, 0.18499458063112972, 2.0473194849163567], [22.559924390539564, 0.29121883968105733, 0.6516471695993571], [24.154003931709134, 0.2583982931990696, 1.7005908550823061], [26.219654881091163, 0.20410300248090607, 4.135077097101071], [52.24188798172371, 0.19942903981669247, 4.092732329442708], [67.10819575194307, 0.11676677306010208, 11.999999999999998], [74.88154861775601, 0.1907063846821413, 0.7702847770640546]], "r_squared_": 0.9711490240597845, "error_": 0.03851750862645497}
{"freq_range": [2.0, 80.0], "freq_res": 1.0, "aperiodic_params_": [0.3259344103261554, 1.0856751711162644], "gaussian_params_": [[10.09112690064306, 0.2951735885925288, 1.4481411772508102], [13.526359439157812, 0.8179128227639755, 0.28331788535714447], [16.148629044454452, 0.3501285993647378, 2.1282100770680286], [22.462859955875736, 0.5768888232196964, 0.27529092405363204], [24.529811068567458, 0.2495034221574411, 1.8708408375931334], [52.66750408021218, 0.3514346052503229, 0.25001340862753263], [56.870383977623966, 0.17836588086517818, 0.6004141378085989], [72.94030636642836, 0.10951768237407988, 5.999999999999999]], "peak_params_": [[10.09112690064306, 0.2999812764601854, 2.8962823545016203], [13.526359439157812, 0.4202731323397093, 0.5666357707142889], [16.148629044454452, 0.34935502183881917, 4.256420154136057], [22.462859955875736, 0.24835318800621042, 0.5505818481072641], [24.529811068567458, 0.24180809225495659, 3.7416816751862667], [52.66750408021218, 0.14557639693826618, 0.5000268172550653], [56.870383977623966, 0.17747009938318548, 1.2008282756171977], [72.94030636642836, 0.10951226240221423, 11.999999999999998]], "r_squared_": 0.9864222750707493, "error_": 0.03725427632798189}
{"freq_range": [2.0, 80.0], "freq_res": 1.0, "aperiodic_params_": [0.33087234711428787, 1.107323692075682], "gaussian_params_": [[9.848907858140453, 0.2989596742314747, 0.7322075446083726], [16.480139622815116, 0.5261356514462022, 3.3535827796049915], [23.739677232952037, 0.18387885932823847, 0.7357983559054199], [57.408856031442895, 0.6024644316924137, 0.2577626709490129], [70.51832692287454, 0.15861332700440783, 5.999999858883907], [72.43932992066586, 0.3159301592904229, 0.25001826310911607]], "peak_params_": [[9.848907858140453, 0.3740038163874304, 1.4644150892167451], [16.480139622815116, 0.520770758036071, 6.707165559209983], [23.739677232952037, 0.2153092533333174, 1.4715967118108397], [57.408856031442895, 0.18377118931401637, 0.5155253418980258], [70.51832692287454, 0.15810306255542517, 11.999999717767814], [72.43932992066586, 0.22131850821160337, 0.5000365262182321]], "r_squared_": 0.9803010957165011, "error_": 0.04919062363422366}
{"freq_range": [2.0, 80.0], "freq_res": 1.0, "aperiodic_params_": [0.5504402430643939, 1.1942807143669036], "gaussian_params_": [[9.481869420248932, 0.2543818727384948, 1.0985242914359807], [16.197597343168585, 0.5658443748201278, 2.8597326856119305], [19.558958101781602, 0.557043045075616, 0.2908751124585796], [24.0737577775429, 0.3370390844898087, 2.1688670383276105], [57.798871616452004, 0.07910752271242358, 2.027252200225495], [64.60414582945431, 0.31939899136325967, 0.29727198030176105], [71.54796540054251, 0.10431422749474369, 5.999999904605955], [75.48386666289348, 0.5233630374982354, 0.27835363636964755]], "peak_params_": [[9.481869420248932, 0.254879691806988, 2.1970485828719615], [16.197597343168585, 0.5648252642910122, 5.719465371223861], [19.558958101781602, 0.46799397968178713, 0.5817502249171592], [24.0737577775429, 0.3505295641397397, 4.337734076655221], [57.798871616452004, 0.086870132597344, 4.05450440045099], [64.60414582945431, 0.18925961836462868, 0.5945439606035221], [71.54796540054251, 0.10401860443995181, 11.99999980921191], [75.48386666289348, 0.20391786660426447, 0.5567072727392951]], "r_squared_": 0.9896173480419177, "error_": 0.03881438910762142}
{"freq_range": [2.0, 80.0], "freq_res": 1.0, "aperiodic_params_": [0.7353806619011631, 1.3078276981577657], "gaussian_params_": [[9.463667975242684, 0.26190537463557634, 1.0888197338487977], [16.578612587708122, 0.5011277603388253, 3.377780410410533], [24.18905217819952, 0.40963676952687966, 1.7689843617476664], [27.535142763353207, 0.16217156905018612, 1.0399302950645957], [66.08910779064635, 0.11495296834282853, 1.5086453215740916], [75.00368269552301, 0.11586976004977666, 4.272230599923362]], "peak_params_": [[9.463667975242684, 0.2796436332020212, 2.1776394676975954], [16.578612587708122, 0.49734949307261195, 6.755560820821066], [24.18905217819952, 0.45265024709932034, 3.5379687234953328], [27.535142763353207, 0.18863635054469519, 2.0798605901291913], [66.08910779064635, 0.12732761937224346, 3.017290643148183], [75.00368269552301, 0.11586972005455642, 8.544461199846724]], "r_squared_": 0.9892812681443057, "error_": 0.04357671444280067}
{"freq_range": [2.0, 80.0], "freq_res": 1.0, "aperiodic_params_": [0.7924446863845767, 1.3410375480485464], "gaussian_params_": [[9.308073903441754, 0.3113768010999321, 1.060699418896367], [16.5614213630535, 0.4607075899732717, 3.379887881896344], [24.62273135695473, 0.38711993960080293, 1.934413285688233], [27.475751926113354, 0.138054934243128, 0.84829794951782], [73.3185817687245, 0.09878398939965534, 5.99999003531748]], "peak_params_": [[9.308073903441754, 0.33623954412587215, 2.121398837792734], [16.5614213630535, 0.4570095854402316, 6.759775763792688], [24.62273135695473, 0.40218858196756735, 3.868826571376466], [27.475751926113354, 0.30379958883848945, 1.69659589903564], [73.3185817687245, 0.09864483681412217, 11.99998007063496]], "r_squared_": 0.9883060112951293, "error_": 0.04752874032484385}
{"freq_range": [2.0, 80.0], "freq_res": 1.0, "aperiodic_params_": [0.8133258873625917, 1.349406064564909], "gaussian_params_": [[9.288459788154015, 0.3097891137332933, 1.0747121810879228], [16.30154733028889, 0.42935190448583216, 3.206931447146171], [24.589170378793092, 0.3696479599526352, 2.315692651200986], [27.270872798684934, 0.11999947311554175, 0.7730293790077178], [74.86138116678153, 0.14615817193243608, 2.2786762030285526]], "peak_params_": [[9.288459788154015, 0.330977205205948, 2.1494243621758455], [16.30154733028889, 0.42783853287795465, 6.413862894292342], [24.589170378793092, 0.3763258980062869, 4.631385302401972], [27.270872798684934, 0.3294959092615207, 1.5460587580154357], [74.86138116678153, 0.1458879810940774, 4.557352406057105]], "r_squared_": 0.9881003913838925, "error_": 0.049508282608988756}
{"freq_range": [2.0, 80.0], "freq_res": 1.0, "aperiodic_params_": [0.7723531131934165, 1.3121042397903153], "gaussian_params_": [[9.338764268405098, 0.26494187901523275, 1.05143409538979], [16.368945386208498, 0.41480179203713163, 3.48442311319974], [25.173792169805115, 0.38281569965221324, 2.2753793833432217], [76.10051047659849, 0.11732279327057092, 3.2517241946814845]], "peak_params_": [[9.338764268405098, 0.29586652893495413, 2.10286819077958], [16.368945386208498, 0.4125960706177874, 6.96884622639948], [25.173792169805115, 0.4009974596993211, 4.550758766686443], [76.10051047659849, 0.11726676026363281, 6.503448389362969]], "r_squared_": 0.9881296494541973, "error_": 0.046989056861719856}
{"freq_range": [2.0, 80.0], "freq_res": 1.0, "aperiodic_params_": [0.6589659350228212, 1.2390733195417514], "gaussian_params_": [[9.100403866775787, 0.2563132294802437, 1.0333180963237623], [15.990116325778155, 0.4371193033619995, 3.243326718592925], [25.226220306569633, 0.3830362729637949, 2.4597691221869873], [75.54796540083551, 0.1178698726764364, 5.9999999999184475]], "peak_params_": [[9.100403866775787, 0.29795574853192797, 2.0666361926475245], [15.990116325778155, 0.43745473621365505, 6.48665343718585], [25.226220306569633, 0.39064216729913825, 4.919538244373975], [75.54796540083551, 0.11753583338265261, 11.999999999836895]], "r_squared_": 0.98557778199543, "error_": 0.049773038175204884}
{"freq_range": [2.0, 80.0], "freq_res": 1.0, "aperiodic_params_": [0.41578321668500595, 1.1273546284880174], "gaussian_params_": [[9.249559174813319, 0.23911082665766123, 1.091904342087273], [16.052939040132348, 0.5010001903852922, 3.1557473806897938], [24.974298533555235, 0.36364287247380117, 2.2322987576245086]], "peak_params_": [[9.249559174813319, 0.27417393485765446, 2.183808684174546], [16.052939040132348, 0.5010421964086252, 6.3114947613795875], [24.974298533555235, 0.3726215148578893, 4.464597515249017]], "r_squared_": 0.9809399432852095, "error_": 0.05623419795071224}
{"freq_range": [2.0, 80.0], "freq_res": 1.0, "aperiodic_params_": [0.18701324062131283, 0.9953811435577894], "gaussian_params_": [[9.692540171178935, 0.2952053608622422, 1.0796968960540998], [16.05624606868133, 0.48939773585260227, 2.9039224811724527], [22.530668412129376, 1.0182713194631752, 0.27368102763236024], [24.850473418398895, 0.24851769421524983, 0.6369106923025436], [57.18510110262337, 0.2057451179795996, 0.46184651548325534], [60.80748578411218, 0.20399921145138097, 0.8157320721524035], [65.18215809563168, 0.14588731621600412, 1.8639207434503229], [74.58361067279573, 0.17197293643156897, 4.225992936301922]], "peak_params_": [[9.692540171178935, 0.33908963313188095, 2.1593937921081996], [16.05624606868133, 0.489305955170001, 5.807844962344905], [22.530668412129376, 0.2657396598782662, 0.5473620552647205], [24.850473418398895, 0.2460270092984883, 1.2738213846050872], [57.18510110262337, 0.18991026701333613, 0.9236930309665107], [60.80748578411218, 0.2111492405159181, 1.631464144304807], [65.18215809563168, 0.15833621622305483, 3.7278414869006458], [74.58361067279573, 0.17114031759844672, 8.451985872603844]], "r_squared_": 0.9838938719208917, "error_": 0.03884690194140318}
{"freq_range": [2.0, 80.0], "freq_res": 1.0, "aperiodic_params_": [0.2176488210947069, 0.8805840760560312], "gaussian_params_": [[10.05816314855665, 0.3006631573173722, 0.6614846660659939], [14.84223070376836, 0.27830501624102977, 1.7430701655785554], [18.570521894153107, 0.43227042475512406, 2.705900899811678], [35.36998951632996, 0.5518040677922842, 0.2500168969864529], [64.52578510566087, 0.7341113134050006, 0.2832416078338216], [67.79846993359718, 0.10242248629331209, 1.450251341087213], [71.9873950612893, 0.15235226913289854, 0.6674344824144978], [78.54796540060485, 0.11969056502277992, 5.999999997215837]], "peak_params_": [[10.05816314855665, 0.3082408775596295, 1.3229693321319878], [14.84223070376836, 0.458162357577622, 3.486140331157111], [18.570521894153107, 0.44304105706317554, 5.411801799623356], [35.36998951632996, 0.18460218168381692, 0.5000337939729058], [64.52578510566087, 0.2060193335145568, 0.5664832156676431], [67.79846993359718, 0.12696281218307925, 2.900502682174426], [71.9873950612893, 0.21985017639143112, 1.3348689648289955], [78.54796540060485, 0.119351365946881, 11.999999994431674]], "r_squared_": 0.9731853660813834, "error_": 0.044823091700829994}
{"freq_range": [2.0, 80.0], "freq_res": 1.0, "aperiodic_params_": [0.6115906789992094, 1.2073835716805943], "gaussian_params_": [[8.391874502688443, 0.16389274938577642, 0.6455809752831816], [10.474819651975398, 1.0884739376228096, 0.27430284281351297], [15.488858077777447, 0.430903043307853, 0.28246646948620413], [18.312265650959265, 0.8653508437878652, 3.936851108052409], [72.32296171923414, 0.1795569531809297, 0.7485196141686983], [75.52201994464426, 0.743912771330164, 0.26801616013248575]], "peak_params_": [[8.391874502688443, 0.1643237771261355, 1.2911619505663632], [10.474819651975398, 0.34381899176325786, 0.5486056856270259], [15.488858077777447, 0.7037846673514386, 0.5649329389724083], [18.312265650959265, 0.8626329669710691, 7.873702216104818], [72.32296171923414, 0.16359771224372643, 1.4970392283373966], [75.52201994464426, 0.15166476321542022, 0.5360323202649715]], "r_squared_": 0.9903102851900722, "error_": 0.04382456829864872}
{"freq_range": [2.0, 80.0], "freq_res": 1.0, "aperiodic_params_": [0.7852878449078529, 1.3103173420202001], "gaussian_params_": [[9.706540884166818, 0.17210228608972147, 0.9965298981355902], [18.83162438536759, 0.6976233249725736, 4.90909792476721], [75.50488557455085, 0.5575943713528975, 0.32545570635155274]], "peak_params_": [[9.706540884166818, 0.30309891985068227, 1.9930597962711805], [18.83162438536759, 0.6972131036080849, 9.81819584953442], [75.50488557455085, 0.17529340789923986, 0.6509114127031055]], "r_squared_": 0.9886773531743733, "error_": 0.05006865203717389}
{"freq_range": [2.0, 80.0], "freq_res": 1.0, "aperiodic_params_": [0.7452797216682333, 1.299471401599216], "gaussian_params_": [[9.510149859999292, 0.3093900970426857, 1.1467902312565728], [16.924301743277724, 0.5606611395735664, 3.3960348813558987], [24.959626613665304, 0.3919516435860115, 2.3254562899452678], [75.32048423942453, 0.20365004235098882, 0.50109343170667]], "peak_params_": [[9.510149859999292, 0.3525535928666451, 2.2935804625131455], [16.924301743277724, 0.5616418171754474, 6.792069762711797], [24.959626613665304, 0.42506522185562146, 4.6509125798905355], [75.32048423942453, 0.16598181933054823, 1.00218686341334]], "r_squared_": 0.9884996084535299, "error_": 0.04873498760334948}
{"freq_range": [2.0, 80.0], "freq_res": 1.0, "aperiodic_params_": [0.7672274025300851, 1.3381947331088881], "gaussian_params_": [[8.517611857584214, 1.1111524123932273, 0.2880364607519963], [10.457394961190287, 1.0790152277408098, 0.2876282619147072], [16.507292234250887, 0.5300389383680462, 3.0848017308677322], [24.396635127609493, 0.40345395690470903, 2.22267595511579], [27.120754720714444, 0.16718087881172738, 0.8013599354743284], [75.00414855494398, 0.09179867220518446, 5.999999999999999]], "peak_params_": [[8.517611857584214, 0.30078642868418287, 0.5760729215039926], [10.457394961190287, 0.36200469263313867, 0.5752565238294144], [16.507292234250887, 0.5249097102971118, 6.1696034617354645], [24.396635127609493, 0.4249136429696351, 4.44535191023158], [27.120754720714444, 0.3701083867253774, 1.6027198709486568], [75.00414855494398, 0.09179865026210665, 11.999999999999998]], "r_squared_": 0.9890421693158515, "error_": 0.04617236899558216}
{"freq_range": [2.0, 80.0], "freq_res": 1.0, "aperiodic_params_": [0.7595627615023924, 1.3180723081054952], "gaussian_params_": [[8.507480788499974, 1.103706709631313, 0.2777817938292956], [10.447559680569128, 0.9217455965955903, 0.2876152412706283], [16.873770597914323, 0.5282461320172486, 3.342736364332012], [24.591702769446826, 0.374952021720657, 1.690173128081712], [27.45147816399022, 0.2306163150499331, 0.9278351419195353], [75.48373077768748, 0.14629409772745774, 1.7267446606481185]], "peak_params_": [[8.507480788499974, 0.2621648750554351, 0.5555635876585912], [10.447559680569128, 0.3384334614977976, 0.5752304825412566], [16.873770597914323, 0.5278852248425049, 6.685472728664024], [24.591702769446826, 0.3987131743769028, 3.380346256163424], [27.45147816399022, 0.34610433871014834, 1.8556702838390706], [75.48373077768748, 0.14066478775006486, 3.453489321296237]], "r_squared_": 0.9909070300341256, "error_": 0.04269483296138552}
{"freq_range": [2.0, 80.0], "freq_res": 1.0, "aperiodic_params_": [0.7633867453634541, 1.3210226699715073], "gaussian_params_": [[9.575346183215807, 0.30277542449913136, 1.419763960662899], [17.050166396257872, 0.6436809893592302, 3.0697221955194043], [25.306779238506582, 0.4064899189853297, 2.409800586804637], [57.35540227600341, 0.41552074604200606, 0.25000024634797835], [77.54796540086403, 0.12345431726412531, 5.999999999994021]], "peak_params_": [[9.575346183215807, 0.33558543185666817, 2.839527921325798], [17.050166396257872, 0.6446640151639802, 6.139444391038809], [25.306779238506582, 0.425715367906201, 4.819601173609274], [57.35540227600341, 0.15161781626982584, 0.5000004926959567], [77.54796540086403, 0.12310445184040986, 11.999999999988042]], "r_squared_": 0.9904554986961004, "error_": 0.043403710856766496}
{"freq_range": [2.0, 80.0], "freq_res": 1.0, "aperiodic_params_": [0.6385203499143595, 1.2970435121699577], "gaussian_params_": [[11.093020915600876, 0.31197046282046237, 2.171826911025554], [17.464112950835457, 0.8151311985389104, 2.3371285207094523], [24.367180810844708, 0.4155842401852209, 2.6969124625105763], [72.4520345991364, 0.1134098391596356, 5.999999999999999]], "peak_params_": [[11.093020915600876, 0.32947262566192154, 4.343653822051108], [17.464112950835457, 0.8168991138796222, 4.674257041418905], [24.367180810844708, 0.42808049281686444, 5.3938249250211525], [72.4520345991364, 0.11308843945235592, 11.999999999999998]], "r_squared_": 0.9895035156193852, "error_": 0.04917247429192478}
{"freq_range": [2.0, 80.0], "freq_res": 1.0, "aperiodic_params_": [0.43530485606551816, 1.151186435423538], "gaussian_params_": [[9.849131691033458, 0.29985338193437, 1.0619934054472797], [12.840722505210575, 0.19918127787442727, 0.9620679324476665], [17.27049578019067, 0.6510082452211945, 2.5304397547464665], [22.501913195346955, 0.5795357064936244, 0.3057217609802125], [25.043480195234327, 0.1896764204433527, 1.5073752916029233], [64.38690443042395, 0.3046548606696259, 0.28245852213716083], [66.94723743484559, 0.08719944053477131, 0.9901738345928995], [75.54796540086404, 0.1223417350482319, 5.999996781369133]], "peak_params_": [[9.849131691033458, 0.30988427401799684, 2.1239868108945594], [12.840722505210575, 0.3568635904999478, 1.924135864895333], [17.27049578019067, 0.6473168703842598, 5.060879509492933], [22.501913195346955, 0.27953737516403465, 0.611443521960425], [25.043480195234327, 0.1957275852857654, 3.0147505832058465], [64.38690443042395, 0.13946246986043387, 0.5649170442743217], [66.94723743484559, 0.13142019160971263, 1.980347669185799], [75.54796540086404, 0.12199502227401204, 11.999993562738267]], "r_squared_": 0.9903566236573912, "error_": 0.0369056813569321}
{"freq_range": [2.0, 80.0], "freq_res": 1.0, "aperiodic_params_": [0.45589299545500933, 1.0462244074984202], "gaussian_params_": [[10.009517065298043, 0.3384129058121744, 1.1890205627096262], [15.688468906297647, 0.7283001466904553, 2.022914658357376], [19.817532495311614, 0.613388434401862, 1.4520290888368765], [23.6800770179375, 0.21108795118533255, 1.2645559707965595], [64.85061219601721, 0.14297214658435053, 5.999999999999999], [72.32697709056988, 0.22093524628157926, 0.49531508384356465], [75.48568840398686, 0.6691431230250792, 0.29183907804040027]], "peak_params_": [[10.009517065298043, 0.3523732303259966, 2.3780411254192524], [15.688468906297647, 0.7390700950193946, 4.045829316714752], [19.817532495311614, 0.6867654295986938, 2.904058177673753], [23.6800770179375, 0.2142816241385188, 2.529111941593119], [64.85061219601721, 0.14292783860715064, 11.999999999999998], [72.32697709056988, 0.24797634957601544, 0.9906301676871293], [75.48568840398686, 0.20172062258622403, 0.5836781560808005]], "r_squared_": 0.9854350827436433, "error_": 0.04200288350427516}
{"freq_range": [2.0, 80.0], "freq_res": 1.0, "aperiodic_params_": [0.43248322433697134, 1.0278194440743702], "gaussian_params_": [[9.95713907470059, 0.33675078088665855, 1.340354403160396], [15.624035489903354, 0.7308647743042481, 1.9716708469356332], [19.754635348419452, 0.6349104047783156, 1.4539533106647031], [23.600189138763128, 0.22525745988514825, 1.3018938097016626], [64.2265443843464, 0.17661986253158865, 0.6457013015375224], [71.62194667742473, 0.15648117758182228, 5.999999999999999]], "peak_params_": [[9.95713907470059, 0.34908298876523874, 2.680708806320792], [15.624035489903354, 0.7403385896345276, 3.9433416938712664], [19.754635348419452, 0.6931153543206481, 2.9079066213294062], [23.600189138763128, 0.22391105983422477, 2.603787619403325], [64.2265443843464, 0.23590774410102622, 1.2914026030750447], [71.62194667742473, 0.15617086116718704, 11.999999999999998]], "r_squared_": 0.9835815877824219, "error_": 0.04462677747567896}
{"freq_range": [2.0, 80.0], "freq_res": 1.0, "aperiodic_params_": [0.7503110465541964, 1.2949468811616838], "gaussian_params_": [[9.7233752330052, 0.27325079188057383, 1.2611892364184798], [15.471277696826172, 0.1710725530166584, 0.7417717898685054], [18.451842892509806, 0.80896375516241, 3.9094625174049678], [24.372116126349013, 0.4451822144910054, 0.25000000341336875], [57.28677796273152, 0.25713869439566406, 0.25001780894565684], [66.34378575012536, 0.10816138684367496, 2.395692673042617], [72.2493508115105, 0.15221281929262168, 0.8071118294649818], [75.48418155782569, 0.875772359063369, 0.26939385496647206]], "peak_params_": [[9.7233752330052, 0.34492447544181704, 2.5223784728369596], [15.471277696826172, 0.6876755886704774, 1.483543579737011], [18.451842892509806, 0.8040910949036553, 7.8189250348099355], [24.372116126349013, 0.4425648248951154, 0.5000000068267375], [57.28677796273152, 0.13324378882050847, 0.5000356178913137], [66.34378575012536, 0.10705343246562382, 4.791385346085234], [72.2493508115105, 0.1517818310514547, 1.6142236589299637], [75.48418155782569, 0.17477360501540584, 0.5387877099329441]], "r_squared_": 0.9920151706611017, "error_": 0.04061285294796302}
{"freq_range": [2.0, 80.0], "freq_res": 1.0, "aperiodic_params_": [0.7038438802317017, 1.2953653551566255], "gaussian_params_": [[9.729600236224512, 0.38015323432083825, 1.3091032279142893], [16.10233467690936, 0.71038051135822, 2.055529472762051], [19.704434121647793, 0.437389326549915, 1.0578430619462966], [24.164019756951777, 0.3694743951037173, 2.622959544421962], [75.48545224716685, 0.35305591493500416, 0.4427234504873759]], "peak_params_": [[9.729600236224512, 0.3807930442415372, 2.6182064558285787], [16.10233467690936, 0.713365278045206, 4.111058945524102], [19.704434121647793, 0.6431240870271819, 2.1156861238925933], [24.164019756951777, 0.36931013257494905, 5.245919088843924], [75.48545224716685, 0.19353444338265247, 0.8854469009747518]], "r_squared_": 0.989478839426866, "error_": 0.04801919473127665}
{"freq_range": [2.0, 80.0], "freq_res": 1.0, "aperiodic_params_": [0.703658317802478, 1.2770764305163937], "gaussian_params_": [[9.580196195465165, 0.3045205776824198, 1.1805391452209186], [17.534400548305445, 0.74574158732814, 3.0922717137869142], [25.178390599460975, 0.28524075358978074, 2.1810164994303842], [75.3836095463648, 0.24977350052464425, 0.6888230313064465]], "peak_params_": [[9.580196195465165, 0.3241857110357589, 2.3610782904418373], [17.534400548305445, 0.738603412138674, 6.1845434275738285], [25.178390599460975, 0.32473605679660145, 4.3620329988607685], [75.3836095463648, 0.2138944074615159, 1.377646062612893]], "r_squared_": 0.9872595861314345, "error_": 0.053403230772781474}
{"freq_range": [2.0, 80.0], "freq_res": 1.0, "aperiodic_params_": [0.7200139201295394, 1.3058905038998656], "gaussian_params_": [[9.866714976902829, 0.3347200771637311, 1.3419671510911702], [13.246874223316688, 0.17205335145611644, 0.5358547194973625], [17.84240508735739, 0.8918202560927169, 2.7493086791357193], [23.005551186498835, 0.21921030143699197, 0.8950254112987227], [25.936385966655816, 0.26464919669057957, 1.863871203839659], [75.47909472724456, 0.2362455099911756, 0.6295757445941198]], "peak_params_": [[9.866714976902829, 0.34832785521368437, 2.6839343021823403], [13.246874223316688, 0.3657277668471873, 1.071709438994725], [17.84240508735739, 0.8903869337620685, 5.498617358271439], [23.005551186498835, 0.44920873559591445, 1.7900508225974454], [25.936385966655816, 0.27623599090100104, 3.727742407679318], [75.47909472724456, 0.17685427114196894, 1.2591514891882396]], "r_squared_": 0.9917102030062147, "error_": 0.044091011568932685}
{"freq_range": [2.0, 80.0], "freq_res": 1.0, "aperiodic_params_": [0.7049419527939724, 1.284310279967639], "gaussian_params_": [[10.704643902131586, 0.2688024661357734, 2.0311308772407424], [17.848403560105986, 0.8864689205519652, 2.6009996087738294], [22.85000657839077, 0.19348084130385798, 0.8603592820841907], [25.330882831650708, 0.22731297695709915, 1.9395299027762856], [75.54108809180045, 0.1489737473080427, 2.008725481924999]], "peak_params_": [[10.704643902131586, 0.2936615637488576, 4.062261754481485], [17.848403560105986, 0.8855688604545074, 5.201999217547659], [22.85000657839077, 0.42566000002821847, 1.7207185641683813], [25.330882831650708, 0.2527833457474705, 3.879059805552571], [75.54108809180045, 0.14513629760714664, 4.017450963849998]], "r_squared_": 0.9907047958804609, "error_": 0.04734672658538837}
{"freq_range": [2.0, 80.0], "freq_res": 1.0, "aperiodic_params_": [0.5728451452226223, 1.18570967801949], "gaussian_params_": [[9.75263484477731, 0.19533287884810344, 0.9852629653781174], [12.73652884959338, 0.2862859972176272, 0.7369542367436086], [17.453984647129538, 0.6898896005169713, 2.878735647289631], [22.535045962211065, 0.6117887147465405, 0.30290570482902696], [25.206454731193347, 0.17729469060275582, 1.0074410500333302], [56.923698863069085, 0.14476662982560642, 0.4206040444395742], [72.96414735763183, 0.09809877086494263, 0.2500095521106706], [75.44584351856933, 0.41831691063833004, 0.26737554040393774], [76.45203459913596, 0.1162187024227639, 5.999999999999999]], "peak_params_": [[9.75263484477731, 0.2137113978902817, 1.9705259307562348], [12.73652884959338, 0.4778496607478897, 1.4739084734872172], [17.453984647129538, 0.6813638988818934, 5.757471294579262], [22.535045962211065, 0.31231055196445445, 0.6058114096580539], [25.206454731193347, 0.19582942931727543, 2.0148821000666604], [56.923698863069085, 0.14301069134496425, 0.8412080888791484], [72.96414735763183, 0.1955863427675455, 0.5000191042213412], [75.44584351856933, 0.21703158342127526, 0.5347510808078755], [76.45203459913596, 0.16472452115285963, 11.999999999999998]], "r_squared_": 0.9907094260377215, "error_": 0.036704811698629984}
{"freq_range": [2.0, 80.0], "freq_res": 1.0, "aperiodic_params_": [0.1362100383961219, 0.7479921289906692], "gaussian_params_": [[9.976267184022287, 0.2948030822988493, 0.6424911194084937], [16.435601311504147, 0.632072494013866, 2.978518146696695], [63.865050515378485, 0.15690635534366265, 5.999999999893634], [71.81546353755475, 0.19066369056138588, 0.2500100743381324], [77.1250256312157, 0.12961282705347804, 2.416614162974298]], "peak_params_": [[9.976267184022287, 0.35583904819824413, 1.2849822388169874], [16.435601311504147, 0.625349006414751, 5.95703629339339], [63.865050515378485, 0.156866724131824, 11.999999999787269], [71.81546353755475, 0.22146102809364754, 0.5000201486762648], [77.1250256312157, 0.14372779976790118, 4.833228325948596]], "r_squared_": 0.9651539106120157, "error_": 0.04566105124518366}
{"freq_range": [2.0, 80.0], "freq_res": 1.0, "aperiodic_params_": [0.3569753347131779, 0.9090333344086008], "gaussian_params_": [[9.82663582081897, 0.2947251116370424, 0.7790577366511556], [16.752536627577413, 0.7401876978335289, 3.4321246896259385], [20.401448327573277, 0.4444299853835618, 0.2500000000063393], [63.53169187927655, 0.17755785108015332, 5.999999999999999], [71.90896656551318, 0.18846939560456455, 0.6434616485034949], [75.52416047476812, 0.19973214747722984, 1.3423204066215038], [79.19308276409136, 0.1865474741572668, 0.7268526816613206]], "peak_params_": [[9.82663582081897, 0.39437229608051344, 1.5581154733023113], [16.752536627577413, 0.73826618501594, 6.864249379251877], [20.401448327573277, 0.595503907807652, 0.5000000000126786], [63.53169187927655, 0.17701783151194017, 11.999999999999998], [71.90896656551318, 0.25853748074337446, 1.2869232970069897], [75.52416047476812, 0.20807511244375698, 2.6846408132430075], [79.19308276409136, 0.1934687050338233, 1.453705363322641]], "r_squared_": 0.9751061219915849, "error_": 0.04817366358696955}
{"freq_range": [2.0, 80.0], "freq_res": 1.0, "aperiodic_params_": [0.6508650470728385, 1.209781083237508], "gaussian_params_": [[9.82734051294694, 0.337708391779996, 1.423287771521886], [15.898924506118563, 0.7159132890715831, 1.965668550721486], [19.864088732059695, 0.6795793520534945, 1.5466762463231598], [23.781448252899306, 0.3360618134144758, 0.8567765634084077], [26.42888879034755, 0.5565226875495155, 0.2618682646773894], [57.463764202480604, 0.7595069739801376, 0.26136489381704503], [64.43388419953493, 0.5592975973361912, 0.27178925106697766], [72.16660050919793, 0.13245881608993287, 5.999999999999999], [75.47269630467326, 0.4159855333819726, 0.253954234651996]], "peak_params_": [[9.82734051294694, 0.34316243914287425, 2.846575543043772], [15.898924506118563, 0.7449796994741967, 3.931337101442972], [19.864088732059695, 0.7581977137700366, 3.0933524926463196], [23.781448252899306, 0.3444837591657406, 1.7135531268168154], [26.42888879034755, 0.15757000108766184, 0.5237365293547788], [57.463764202480604, 0.16277123555593453, 0.5227297876340901], [64.43388419953493, 0.20885904263430488, 0.5435785021339553], [72.16660050919793, 0.13240776355457973, 11.999999999999998], [75.47269630467326, 0.19206122838343864, 0.507908469303992]], "r_squared_": 0.9910023725562763, "error_": 0.03775100815853786}
{"freq_range": [2.0, 80.0], "freq_res": 1.0, "aperiodic_params_": [0.6282271861481715, 1.2281049758979843], "gaussian_params_": [[9.726266303358138, 0.36509454112234213, 1.3294967741517718], [16.2076606138973, 0.7284236556568877, 2.001784733937344], [19.871859523050635, 0.5800979033827472, 1.4586250996069614], [23.7782031063394, 0.32320573196752844, 0.8791559127654381], [26.42063598361156, 0.7719910077270831, 0.2501072358879097], [72.4520345991378, 0.15393823110291047, 5.999999999999907]], "peak_params_": [[9.726266303358138, 0.3633826843278394, 2.6589935483035436], [16.2076606138973, 0.7416379040434604, 4.003569467874688], [19.871859523050635, 0.6989638622666495, 2.917250199213923], [23.7782031063394, 0.3240282385715034, 1.7583118255308763], [26.42063598361156, 0.2010268746656142, 0.5002144717758193], [72.4520345991378, 0.15350197528258192, 11.999999999999813]], "r_squared_": 0.9861995507790764, "error_": 0.048752849752340864}
{"freq_range": [2.0, 80.0], "freq_res": 1.0, "aperiodic_params_": [0.6711080626418467, 1.2509706071494766], "gaussian_params_": [[9.537785101714487, 0.3065018626740898, 1.1097270017561771], [17.72648599594796, 0.8737728085134054, 2.828930576316948], [24.369091112055813, 0.2089497869097739, 1.5796209884135188], [72.45203459913743, 0.1132542453260718, 5.999999999999999]], "peak_params_": [[9.537785101714487, 0.3020037257323813, 2.2194540035123542], [17.72648599594796, 0.8697599950142808, 5.657861152633896], [24.369091112055813, 0.2780532493380391, 3.1592419768270377], [72.45203459913743, 0.11293328656653334, 11.999999999999998]], "r_squared_": 0.9883668193138205, "error_": 0.04727539841347945}
{"freq_range": [2.0, 80.0], "freq_res": 1.0, "aperiodic_params_": [0.49239699418319866, 1.0614035438901883], "gaussian_params_": [[16.95349884742644, 0.6730462468167182, 4.07094135026335], [72.45203459913606, 0.1665249843187289, 5.999999999999999]], "peak_params_": [[16.95349884742644, 0.673002339339124, 8.1418827005267], [72.45203459913606, 0.16605305805896786, 11.999999999999998]], "r_squared_": 0.9812081082638705, "error_": 0.049852696501095986}
{"freq_range": [2.0, 80.0], "freq_res": 1.0, "aperiodic_params_": [0.2826131227150819, 0.9398982618907441], "gaussian_params_": [[15.906677777453263, 0.5922990874443204, 3.6796929254906714], [58.03948927019513, 0.1289350386797235, 2.230768489350594], [62.969992512206304, 0.15059717327124356, 0.9992780621771697], [67.45414392394889, 0.18662930357040494, 1.6293055223586537], [76.43184136611215, 0.17254120163151068, 4.34618984026315]], "peak_params_": [[15.906677777453263, 0.5921086342653901, 7.359385850981343], [58.03948927019513, 0.12893693712067433, 4.461536978701188], [62.969992512206304, 0.1673121811620728, 1.9985561243543395], [67.45414392394889, 0.1959801831288881, 3.2586110447173073], [76.43184136611215, 0.1716917842435799, 8.6923796805263]], "r_squared_": 0.9795358970543291, "error_": 0.045511723202093346}
{"freq_range": [2.0, 80.0], "freq_res": 1.0, "aperiodic_params_": [0.3569728482683859, 0.9216401704232835], "gaussian_params_": [[2.537962550534591, 0.4866263017955789, 0.28693542913245645], [9.843267663062104, 0.31672643698897623, 1.055073548098391], [16.059143862685605, 0.6810379539355707, 2.1987906209825168], [19.978531593951914, 0.41192399071935304, 1.3456523506259261], [23.601767183718337, 0.2612950987479181, 0.5018850016889403], [57.56398986399855, 0.10722903670660254, 5.398017003201006], [66.80211831762239, 0.16799078991166191, 3.708999564946679], [72.11115848055837, 0.19662679160543056, 0.7431637618241098], [74.62017415342287, 0.3916124776199681, 0.3655682225008435], [76.49570346981311, 0.22135243487937956, 0.7731050680292624], [78.95585271087829, 0.21178422353409512, 0.76986322436154]], "peak_params_": [[2.537962550534591, 0.1330927014881694, 0.5738708582649129], [9.843267663062104, 0.32853420923298793, 2.110147096196782], [16.059143862685605, 0.6859993999081255, 4.3975812419650335], [19.978531593951914, 0.5485290957353021, 2.6913047012518523], [23.601767183718337, 0.19646707008024533, 1.0037700033778807], [57.56398986399855, 0.11693331724732903, 10.796034006402012], [66.80211831762239, 0.19102095747308723, 7.417999129893358], [72.11115848055837, 0.2603637978426512, 1.4863275236482196], [74.62017415342287, 0.27761985507975084, 0.731136445001687], [76.49570346981311, 0.18874705568989114, 1.5462101360585248], [78.95585271087829, 0.2133951633845632, 1.53972644872308]], "r_squared_": 0.9833448519589802, "error_": 0.039026296430453786}
{"freq_range": [2.0, 80.0], "freq_res": 1.0, "aperiodic_params_": [0.3942675543534217, 1.008718188289133], "gaussian_params_": [[2.5106473326532077, 0.7788757497841313, 0.27396328067036474], [8.472335033810134, 0.7992853837904844, 0.26530364906795917], [10.007813118411201, 0.317109359828983, 0.6927854036363247], [16.677122581351874, 0.6394646231663307, 2.4746676866298243], [20.0566210471729, 0.2769652448184146, 1.2837129921511967], [23.558069481136954, 0.4518006681584956, 0.3401124026350132], [57.4743121593786, 0.11259167771126861, 4.5622714123196655], [63.52953796991124, 0.150477813161269, 0.5062276415051957], [69.82343970403949, 0.1827651822386874, 4.941047060589239], [75.42074188599335, 0.6678146388622611, 0.26087997882678243], [76.99022863318463, 0.14337572652001068, 0.546468941425832], [79.26357315068331, 0.1872394905217879, 0.6611534634389875]], "peak_params_": [[2.5106473326532077, 0.15800091219017556, 0.5479265613407295], [8.472335033810134, 0.16996344950978437, 0.5306072981359183], [10.007813118411201, 0.3338747840361522, 1.3855708072726494], [16.677122581351874, 0.6503116344016097, 4.949335373259649], [20.0566210471729, 0.5362936550233313, 2.5674259843023934], [23.558069481136954, 0.2047316643798589, 0.6802248052700264], [57.4743121593786, 0.1182841692651102, 9.124542824639331], [63.52953796991124, 0.22944290872540418, 1.0124552830103914], [69.82343970403949, 0.18524694540949516, 9.882094121178477], [75.42074188599335, 0.2877366044406422, 0.5217599576535649], [76.99022863318463, 0.2075491493016206, 1.092937882851664], [79.26357315068331, 0.20568037000051032, 1.322306926877975]], "r_squared_": 0.9862804774466809, "error_": 0.03544040758537433}
{"freq_range": [2.0, 80.0], "freq_res": 1.0, "aperiodic_params_": [0.46609733506704615, 1.0882307140504663], "gaussian_params_": [[9.39089228209073, 0.25030667306899573, 1.0117521098265212], [17.486027106288496, 0.7399748125807355, 3.254187426749309], [24.062564629587445, 0.0999150117883726, 0.25046154492195316], [61.77668425984476, 0.1312744542218026, 4.801077306145558], [66.10473776712371, 0.13843385235219138, 0.25009670895742925], [68.2161074732433, 0.2091825951503719, 0.6927268239765697], [72.0658974261696, 0.19942436765668276, 0.9841795754659212], [75.81172581841518, 0.2896536127086527, 1.0695058803931756], [78.84002678474617, 0.2086541338518456, 0.6278882807855429]], "peak_params_": [[9.39089228209073, 0.25699794374144896, 2.0235042196530424], [17.486027106288496, 0.7317674593112936, 6.508374853498618], [24.062564629587445, 0.19664645032296524, 0.5009230898439063], [61.77668425984476, 0.1311325234326961, 9.602154612291116], [66.10473776712371, 0.21722114685580896, 0.5001934179148585], [68.2161074732433, 0.2559527024650765, 1.3854536479531394], [72.0658974261696, 0.21308456684921429, 1.9683591509318423], [75.81172581841518, 0.28690593528347286, 2.1390117607863512], [78.84002678474617, 0.20560654277100499, 1.2557765615710859]], "r_squared_": 0.9852768509765141, "error_": 0.042252488523497285}
{"freq_range": [2.0, 80.0], "freq_res": 1.0, "aperiodic_params_": [-0.8169627404582765, 1.0370574730823807], "gaussian_params_": [[9.64421211952729, 0.36605312246460536, 0.7422584909202962], [15.115479336437854, 0.543803916292736, 2.7541192969495123], [19.915654887995927, 0.12322622533045886, 0.4765415586180229], [23.323552281459417, 0.14575654899867788, 1.2918499175879046], [29.006345333357192, 0.18110400599242982, 0.25000001339278627], [59.97835328712936, 0.13204116109621017, 0.2500502337794315], [65.26334465103756, 0.21691490532935775, 0.49551601485547253], [72.87574540824626, 0.10355471403996248, 3.783914787154628], [77.45530231316312, 0.2809277005482445, 0.29066557670386606]], "peak_params_": [[9.64421211952729, 0.4232225218631873, 1.4845169818405923], [15.115479336437854, 0.5433260962096125, 5.508238593899025], [19.915654887995927, 0.2394664097654906, 0.9530831172360458], [23.323552281459417, 0.15028771773431782, 2.583699835175809], [29.006345333357192, 0.181056681868784, 0.5000000267855725], [59.97835328712936, 0.13186417563061248, 0.500100467558863], [65.26334465103756, 0.20021667990892222, 0.9910320297109451], [72.87574540824626, 0.1034988972307831, 7.567829574309256], [77.45530231316312, 0.13954891971620365, 0.5813311534077321]], "r_squared_": 0.9877544421737964, "error_": 0.036150807657287405}
{"freq_range": [2.0, 80.0], "freq_res": 1.0, "aperiodic_params_": [-0.36892248089394103, 0.8391384920050126], "gaussian_params_": [[10.354324781517077, 0.21153912230573046, 1.5057182002279723], [13.51835103665876, 1.2855131288172632, 0.27484341221773584], [16.502069704758423, 0.4117067796952791, 1.9276692533560884], [22.485712477719215, 0.2608571567338271, 1.713899151324023]], "peak_params_": [[10.354324781517077, 0.20715574663955705, 3.0114364004559446], [13.51835103665876, 0.4654230043523001, 0.5496868244354717], [16.502069704758423, 0.3997660690805549, 3.855338506712177], [22.485712477719215, 0.25763960076480896, 3.427798302648046]], "r_squared_": 0.978983070501987, "error_": 0.03937138270106773}
{"freq_range": [2.0, 80.0], "freq_res": 1.0, "aperiodic_params_": [0.07175128515870272, 1.079031397758306], "gaussian_params_": [[8.492353236106803, 0.7867668980223098, 0.30740611829019454], [10.124078286581598, 0.3985622015579738, 0.799350032257549], [13.201751346488052, 0.3053319826993312, 0.64683958539435], [16.357825053444536, 0.43633177878150003, 2.0859899313705466], [23.11863272306246, 0.26006998356592653, 1.2550038969202701], [28.955997452724628, 0.11938764175522958, 0.2500000000429976], [67.45576653645341, 0.29556675492081824, 0.28420425990982573], [74.0270635513283, 0.08484301788010976, 5.999999999999999]], "peak_params_": [[8.492353236106803, 0.2299942404681341, 0.6148122365803891], [10.124078286581598, 0.39798957521092526, 1.598700064515098], [13.201751346488052, 0.4108935739754763, 1.2936791707887], [16.357825053444536, 0.4299856193041296, 4.171979862741093], [23.11863272306246, 0.2616532035427537, 2.5100077938405403], [28.955997452724628, 0.11755703290247776, 0.5000000000859952], [67.45576653645341, 0.12443155427734864, 0.5684085198196515], [74.0270635513283, 0.08484215480026958, 11.999999999999998]], "r_squared_": 0.990304722073212, "error_": 0.03226499167672468}
{"freq_range": [2.0, 80.0], "freq_res": 1.0, "aperiodic_params_": [-0.11195624431848149, 1.0562782490725005], "gaussian_params_": [[8.930012097700768, 0.21271143558930383, 0.7562905035255357], [11.066168494301174, 0.2877605136968663, 1.0692318343953529], [13.517525540276147, 1.6963874392129454, 0.2697642577818701], [16.286961426659865, 0.42793048384292687, 1.501855823698046], [22.759518807201268, 0.29415160921893185, 2.3097536206537685], [57.014066665406375, 0.12359832073696313, 0.6179742520164697], [67.54796540086404, 0.0802520176601821, 5.999999999999999]], "peak_params_": [[8.930012097700768, 0.2562872759857685, 1.5125810070510715], [11.066168494301174, 0.29310673176454793, 2.1384636687907057], [13.517525540276147, 0.4838332162883907, 0.5395285155637402], [16.286961426659865, 0.42425946632247735, 3.003711647396092], [22.759518807201268, 0.29258124372026173, 4.619507241307537], [57.014066665406375, 0.14068035943261492, 1.2359485040329394], [67.54796540086404, 0.08002458611477437, 11.999999999999998]], "r_squared_": 0.9873996260419076, "error_": 0.03870965225336071}
