{"freq_range": [2.0, 80.0], "freq_res": 1.0, "aperiodic_params_": [0.2159814370566711, 0.8125748712503582], "gaussian_params_": [[8.505302374829018, 0.5096372148381842, 0.3134014793361103], [11.67580811141671, 0.667007931819262, 1.061858771426337], [20.89335534542796, 0.4978637866733373, 1.3979623239734011], [23.996677676711762, 0.21285341627346133, 0.8512730663429265], [26.906394874954252, 0.15036010464146307, 0.7794501291009066], [64.7200042826742, 0.26154085214190015, 0.2650237145632206], [69.04045429863078, 0.13211028275305503, 1.594159025963211], [71.41720665470073, 0.22774201443594552, 0.2862714599611491], [73.01288021381842, 0.15188468006270445, 0.3789184600181857], [74.74543154108045, 0.14696791636688192, 0.2500877679875615], [78.34981807417306, 0.1441212478705396, 2.4611980294012055]], "peak_params_": [[8.505302374829018, 0.17450482177064575, 0.6268029586722206], [11.67580811141671, 0.6366347193997308, 2.123717542852674], [20.89335534542796, 0.49685092502606815, 2.7959246479468023], [23.996677676711762, 0.2551396765290863, 1.702546132685853], [26.906394874954252, 0.1497374712120616, 1.5589002582018132], [64.7200042826742, 0.15500156230671958, 0.5300474291264412], [69.04045429863078, 0.1321736664561597, 3.188318051926422], [71.41720665470073, 0.14247878524839708, 0.5725429199222982], [73.01288021381842, 0.17141612615012725, 0.7578369200363714], [74.74543154108045, 0.1447440515949756, 0.500175535975123], [78.34981807417306, 0.1426728350280686, 4.922396058802411]], "r_squared_": 0.9807948772453497, "error_": 0.03448144447349467}
{"freq_range": [2.0, 80.0], "freq_res": 1.0, "aperiodic_params_": [-0.0005598676287392051, 0.5849993666331498], "gaussian_params_": [[8.270335478812223, 0.1851369742922003, 0.5778411933595983], [11.541533440281434, 0.5538618132924622, 1.2345320534887625], [21.345898675516974, 0.3822702050879331, 2.262322527140802], [69.52118786403861, 0.11118730491467142, 5.999999999999999], [71.07883823600358, 0.07661246298594204, 0.25007535254651764]], "peak_params_": [[8.270335478812223, 0.17498983520737188, 1.1556823867191965], [11.541533440281434, 0.5170313060438351, 2.469064106977525], [21.345898675516974, 0.3778280516175971, 4.524645054281604], [69.52118786403861, 0.11084079307525962, 11.999999999999998], [71.07883823600358, 0.18075928853134982, 0.5001507050930353]], "r_squared_": 0.9447533242548825, "error_": 0.04757149363231608}
{"freq_range": [2.0, 80.0], "freq_res": 1.0, "aperiodic_params_": [0.2517698585920123, 0.8366167846923843], "gaussian_params_": [[11.680339164309379, 0.6326240315784122, 1.0133767238178955], [21.2698167520639, 0.4233042277695934, 1.9798752125875998], [59.53332831129745, 0.6922599227452769, 0.27027453139137875], [65.00337979155591, 0.13749816148738017, 0.2500199020740083], [74.880470937288, 0.12623418961531488, 5.999999999999998]], "peak_params_": [[11.680339164309379, 0.601927447954343, 2.026753447635791], [21.2698167520639, 0.4193915876069459, 3.9597504251751996], [59.53332831129745, 0.16173975200163726, 0.5405490627827575], [65.00337979155591, 0.1700185685534168, 0.5000398041480166], [74.880470937288, 0.12620914303496167, 11.999999999999996]], "r_squared_": 0.9711900087488303, "error_": 0.044577535397717805}
{"freq_range": [2.0, 80.0], "freq_res": 1.0, "aperiodic_params_": [0.2898078222750715, 0.6891809074818005], "gaussian_params_": [[8.749371829919996, 0.2352459516053658, 0.8474125674216638], [11.705403674407533, 0.6462711770379149, 0.9345478412983299], [17.027785429995777, 0.1527788124785964, 0.25000853533656703], [21.350707336515356, 0.4429035090808146, 1.499075033945587], [25.567397424712716, 0.17756678506574575, 0.9534826948155279], [58.23811971988956, 0.13843904189213144, 0.5440735698101784], [60.41676158664778, 0.38960662770771026, 0.3352693294089262], [64.79784135627371, 0.12418524747500581, 1.6532488630527564], [67.73287571732251, 0.15586327048420517, 0.3362061795304247], [69.55990692442755, 0.29240916340976586, 0.2583867740245463], [76.54796540086404, 0.12825414428691437, 5.299988745643919]], "peak_params_": [[8.749371829919996, 0.2349659599478473, 1.6948251348433276], [11.705403674407533, 0.6150961773041116, 1.8690956825966598], [17.027785429995777, 0.15840351321858825, 0.5000170706731341], [21.350707336515356, 0.43094915706284664, 2.998150067891174], [25.567397424712716, 0.1638103727408987, 1.9069653896310559], [58.23811971988956, 0.12610276991161484, 1.0881471396203568], [60.41676158664778, 0.18347670930979643, 0.6705386588178524], [64.79784135627371, 0.13520495233246144, 3.306497726105513], [67.73287571732251, 0.16763702666955893, 0.6724123590608494], [69.55990692442755, 0.12922423978779463, 0.5167735480490926], [76.54796540086404, 0.12778850961647847, 10.599977491287838]], "r_squared_": 0.9728727770504706, "error_": 0.03517630590130225}
{"freq_range": [2.0, 80.0], "freq_res": 1.0, "aperiodic_params_": [0.12404776657293151, 0.3875572234299622], "gaussian_params_": [[11.290658447872417, 0.40218286955192944, 1.3498897554319764], [21.391854106036316, 0.28767621931876924, 2.332882488339336], [41.55389902212888, 0.8723609395178886, 0.25000000000000006], [66.0055770542042, 0.10520859409104018, 5.999999999999999]], "peak_params_": [[11.290658447872417, 0.3929810761899885, 2.699779510863953], [21.391854106036316, 0.283646476219099, 4.665764976678672], [41.55389902212888, 0.17756782399211268, 0.5000000000000001], [66.0055770542042, 0.10520854864161888, 11.999999999999998]], "r_squared_": 0.849294707209663, "error_": 0.05213877516228209}
{"freq_range": [2.0, 80.0], "freq_res": 1.0, "aperiodic_params_": [0.06353727633317696, 0.7563899386689081], "gaussian_params_": [[8.345963806931339, 0.23425844758017342, 0.490137431729921], [11.470587732215035, 0.6031588616371834, 1.0373253018211552], [13.580454016118594, 0.5012891559395228, 0.26643015829037087], [21.426673510068735, 0.4256519776067631, 2.34277698494625], [30.66584587801936, 0.3848410390459556, 0.25208699360398945], [68.57682682841164, 0.3406916665207141, 0.2605926095874994], [72.45203462365377, 0.12185545708603214, 5.999999999999999]], "peak_params_": [[8.345963806931339, 0.1848400391495948, 0.980274863459842], [11.470587732215035, 0.5442009118892668, 2.0746506036423105], [13.580454016118594, 0.17874286653433347, 0.5328603165807417], [21.426673510068735, 0.4186510135821102, 4.6855539698925], [30.66584587801936, 0.15995903613003004, 0.5041739872079789], [68.57682682841164, 0.19441490354010083, 0.5211852191749988], [72.45203462365377, 0.12151012274140705, 11.999999999999998]], "r_squared_": 0.9634626976078301, "error_": 0.04780721019532644}
{"freq_range": [2.0, 80.0], "freq_res": 1.0, "aperiodic_params_": [0.2982888735876276, 0.8089528952306858], "gaussian_params_": [[11.697605826025693, 0.5899727853329553, 0.8482457297399942], [21.148162906739493, 0.3878827092660498, 1.4961702948731177], [27.400509376056895, 0.104990999625743, 1.1602438098856094], [43.3158854559813, 0.25631617579490434, 0.2663608179582264], [59.672841203896, 0.18993573075108164, 0.5880913721506369], [64.94359396845496, 0.1448158384603836, 0.2500579253878101], [68.1932097907415, 0.1330479152134663, 1.368853109888887], [77.28391887936628, 0.09838813684720028, 4.041863800094485]], "peak_params_": [[11.697605826025693, 0.5536499186210659, 1.6964914594799885], [21.148162906739493, 0.3859854917519083, 2.9923405897462354], [27.400509376056895, 0.09910326009700487, 2.3204876197712188], [43.3158854559813, 0.1268741943331423, 0.5327216359164528], [59.672841203896, 0.16271695646178963, 1.1761827443012738], [64.94359396845496, 0.15090575591073918, 0.5001158507756202], [68.1932097907415, 0.1387645605807306, 2.737706219777774], [77.28391887936628, 0.09814569808033546, 8.08372760018897]], "r_squared_": 0.9770935332452771, "error_": 0.03714344546703487}
{"freq_range": [2.0, 80.0], "freq_res": 1.0, "aperiodic_params_": [0.10666391730119759, 0.449847885697695], "gaussian_params_": [[8.546661824454949, 0.23216539415802548, 0.5855518836556443], [11.66618052595261, 0.5664137668705619, 0.8742567429963544], [21.34246549691838, 0.33088678698626534, 1.6588907277239477], [27.028093040232683, 0.16604545480022762, 0.8473033097705336], [40.6390155037431, 0.08360147138201188, 1.477758689154177], [47.455012472275826, 0.11418675265361149, 2.580705751417409], [55.481066044515586, 0.5946783393724624, 0.27125318960163225], [59.98597592630965, 0.15663305999978563, 0.698723644679877], [63.57371351670765, 0.3967868346053008, 0.3000242434799121], [65.49060826335557, 0.34409620329220286, 0.3037825912694537], [67.70065909586039, 0.18653197194020382, 1.0926294934995793], [77.57527948118091, 0.5851721730327495, 0.26029967997594083]], "peak_params_": [[8.546661824454949, 0.17745907532079636, 1.1711037673112885], [11.66618052595261, 0.5265924892948411, 1.7485134859927087], [21.34246549691838, 0.3239104333140537, 3.3177814554478955], [27.028093040232683, 0.16694055842247402, 1.6946066195410672], [40.6390155037431, 0.08614523451389, 2.955517378308354], [47.455012472275826, 0.11243357158967249, 5.161411502834818], [55.481066044515586, 0.1249841442620857, 0.5425063792032645], [59.98597592630965, 0.15660235796143662, 1.397447289359754], [63.57371351670765, 0.1452093160728224, 0.6000484869598242], [65.49060826335557, 0.10219033994798177, 0.6075651825389073], [67.70065909586039, 0.17966150987621332, 2.1852589869991585], [77.57527948118091, 0.15458580222156015, 0.5205993599518817]], "r_squared_": 0.9360658318997276, "error_": 0.03455802244954055}
{"freq_range": [2.0, 80.0], "freq_res": 1.0, "aperiodic_params_": [0.48160517669035663, 0.880913536767899], "gaussian_params_": [[9.20745068167909, 0.3005017410660618, 1.8083157656591766], [11.534371223452967, 2.142828456795617, 0.2838679902192829], [13.35281013556157, 0.29018160699106793, 0.8027529394835393], [21.182549192647468, 0.4422856105624447, 2.335369776179472], [26.519657192266127, 0.9639635868387519, 0.25109840965950975], [59.63484173010534, 0.09567286980434297, 3.701290115227055], [65.46287627027581, 0.4410370937394845, 0.26580916873537697], [68.53005163885321, 0.8242708992791171, 0.25250354258885477], [77.54796540086404, 0.1057944284249757, 5.3764642925766335]], "peak_params_": [[9.20745068167909, 0.29853148122521095, 3.6166315313183532], [11.534371223452967, 0.7196653316986952, 0.5677359804385658], [13.35281013556157, 0.2977449407453798, 1.6055058789670786], [21.182549192647468, 0.440936467348015, 4.670739552358944], [26.519657192266127, 0.1745492344832167, 0.5021968193190195], [59.63484173010534, 0.09572274653693746, 7.40258023045411], [65.46287627027581, 0.1372313203363994, 0.5316183374707539], [68.53005163885321, 0.17963455607900192, 0.5050070851777095], [77.54796540086404, 0.10542159627394287, 10.752928585153267]], "r_squared_": 0.9833913942617012, "error_": 0.03705683782330567}
{"freq_range": [2.0, 80.0], "freq_res": 1.0, "aperiodic_params_": [0.7073365136472269, 1.0965715483418337], "gaussian_params_": [[5.981388093223264, 0.20924559057649464, 0.5035807496173991], [8.763015995892195, 0.2857658424718274, 0.9697818025198888], [11.65798112785444, 0.6026782070784235, 0.662762547759076], [12.521756380631983, 0.2845034130995769, 2.371954407880695], [21.25605055205159, 0.5155946646576512, 2.366163762382824], [26.775203938479137, 0.18847181049198683, 0.7179280731047882], [59.6981991765554, 0.43623417664293646, 0.2543796564920329], [65.27073910477473, 0.15922141291002676, 0.4604646106180842], [68.56254668012488, 0.13758248528815606, 0.842935032374035], [77.02289874650633, 0.09049169307019864, 5.9999946164467115]], "peak_params_": [[5.981388093223264, 0.22053167211040225, 1.0071614992347981], [8.763015995892195, 0.3720453512047253, 1.9395636050397775], [11.65798112785444, 0.8065788272717753, 1.325525095518152], [12.521756380631983, 0.35754989563868766, 4.74390881576139], [21.25605055205159, 0.5130630400043359, 4.732327524765648], [26.775203938479137, 0.20653704263322314, 1.4358561462095765], [59.6981991765554, 0.21742391708821862, 0.5087593129840658], [65.27073910477473, 0.1461183277508089, 0.9209292212361684], [68.56254668012488, 0.1572617287544642, 1.68587006474807], [77.02289874650633, 0.0904910340498355, 11.999989232893423]], "r_squared_": 0.9893187953102337, "error_": 0.034709176702930014}
{"freq_range": [2.0, 80.0], "freq_res": 1.0, "aperiodic_params_": [0.7613161677750079, 1.13505680593856], "gaussian_params_": [[9.284276616777467, 0.32233728119256827, 1.7679737358717218], [11.526300627399705, 1.5599038811109476, 0.3046690300025795], [13.273503574504288, 0.2977622493018818, 1.2986517079632034], [17.134732224008832, 0.15612861960354843, 0.7157676250035463], [20.465837295002306, 0.32210248049152085, 0.29157356592172995], [21.625764488751912, 0.4918597658059809, 2.2359890564814227], [27.03205706000435, 0.1563410503485711, 0.7645170207988227], [30.654361525135986, 0.1533341400724437, 0.6620471934361051], [59.66877569825637, 0.319197206370409, 0.2510297102374229], [70.0362663791869, 0.10514115096490544, 5.999999999999999]], "peak_params_": [[9.284276616777467, 0.3195228748420016, 3.5359474717434436], [11.526300627399705, 0.7489812011737438, 0.609338060005159], [13.273503574504288, 0.32694520612624045, 2.597303415926407], [17.134732224008832, 0.21613612917991165, 1.4315352500070926], [20.465837295002306, 0.4675542239655959, 0.5831471318434599], [21.625764488751912, 0.48501900861562625, 4.471978112962845], [27.03205706000435, 0.1835819602781278, 1.5290340415976453], [30.654361525135986, 0.13387416863413415, 1.3240943868722101], [59.66877569825637, 0.15961647659846712, 0.5020594204748458], [70.0362663791869, 0.10513923033069705, 11.999999999999998]], "r_squared_": 0.9895646409067552, "error_": 0.03546369769570615}
{"freq_range": [2.0, 80.0], "freq_res": 1.0, "aperiodic_params_": [0.6688633187599676, 1.0472314305892534], "gaussian_params_": [[9.313182691251015, 0.3351706194829266, 1.7333869046611614], [11.531705996187918, 1.4973335307499214, 0.3230864446699975], [13.483575107966443, 0.2933679440347139, 0.903440504354972], [17.352779245598224, 0.22994823176546658, 0.6223704237155092], [20.25899251303781, 0.3736546206822013, 1.0654446229617525], [22.778685638798247, 0.3750254579209086, 1.7221700889708367], [27.10016179175013, 0.1758398831215622, 0.7458371943958574], [30.703347088486566, 0.18508015122054453, 0.5280413895505873], [68.13457050245827, 0.13756892337342294, 4.832554993429655], [78.29275635405189, 0.16823163394175697, 0.9353069262860124]], "peak_params_": [[9.313182691251015, 0.3297456709516374, 3.466773809322323], [11.531705996187918, 0.7007455791845065, 0.646172889339995], [13.483575107966443, 0.28917024895040194, 1.806881008709944], [17.352779245598224, 0.2008102697938528, 1.2447408474310184], [20.25899251303781, 0.46484070782749276, 2.130889245923505], [22.778685638798247, 0.38559633233006485, 3.4443401779416734], [27.10016179175013, 0.19285653595076746, 1.4916743887917148], [30.703347088486566, 0.15806528465460168, 1.0560827791011747], [68.13457050245827, 0.13751559574236083, 9.66510998685931], [78.29275635405189, 0.1773111447738751, 1.8706138525720248]], "r_squared_": 0.9864743342417887, "error_": 0.03637468162855611}
{"freq_range": [2.0, 80.0], "freq_res": 1.0, "aperiodic_params_": [0.5452863111034705, 0.9212484016159248], "gaussian_params_": [[9.247516477047968, 0.3122614251611258, 1.7587207625085153], [11.530327547190494, 1.4453947837783556, 0.3270939105987203], [13.573868709612332, 0.27243950492620556, 0.7722697013783232], [17.443547735230435, 0.27524967806134526, 0.44478150837122765], [20.572132387782815, 0.4010800952105796, 1.2018632818081734], [23.367979207698752, 0.27860047519408215, 1.7233495030979564], [27.34301113211296, 0.16396502006451713, 0.5019735135978983], [30.766508168036438, 0.1543376112655315, 0.5175158823953818], [63.40069435956719, 0.2538602148598782, 0.27739933740799005], [68.80096867359788, 0.1342742444130542, 5.808855358892991], [78.10213787685758, 0.18673750760767588, 0.9171114921645355]], "peak_params_": [[9.247516477047968, 0.3091842434694724, 3.5174415250170306], [11.530327547190494, 0.6414603256464867, 0.6541878211974406], [13.573868709612332, 0.24207476320818055, 1.5445394027566464], [17.443547735230435, 0.1725876593445656, 0.8895630167424553], [20.572132387782815, 0.4848454918949115, 2.4037265636163467], [23.367979207698752, 0.32445358423980103, 3.446699006195913], [27.34301113211296, 0.1600578595671278, 1.0039470271957966], [30.766508168036438, 0.13941732498986803, 1.0350317647907636], [63.40069435956719, 0.1709895527159484, 0.5547986748159801], [68.80096867359788, 0.13419544971175768, 11.617710717785982], [78.10213787685758, 0.22390237939895874, 1.834222984329071]], "r_squared_": 0.9814185411053999, "error_": 0.03599972909852966}
{"freq_range": [2.0, 80.0], "freq_res": 1.0, "aperiodic_params_": [-0.08896240542036155, 0.13980400341728702], "gaussian_params_": [[11.381898611890927, 0.33736698417117683, 0.8738769275596091], [20.58897424055748, 0.2159498631217414, 0.5897708797866444], [25.82168209434051, 0.3407269409135291, 3.9019359253625154], [32.44342602553963, 0.4235104668236401, 0.28619553818469523], [34.59727850282278, 0.63560038006314, 0.26738841050596523], [37.687852499402695, 0.12901267409083464, 0.776243591201822], [42.17170795119524, 0.19066490412258655, 3.091127049018409], [48.33460035591169, 0.18469665982738948, 1.3652704974110617], [51.03796171887433, 0.2321296116891823, 0.7348737793224748], [53.51257875019305, 0.731407423868429, 0.2908475586210583], [56.95442471496864, 0.17650104076416598, 1.4598818554899216], [60.67729766716603, 0.1053731657054865, 0.8907005368475115]], "peak_params_": [[11.381898611890927, 0.30689231840036485, 1.7477538551192182], [20.58897424055748, 0.3281788328103018, 1.1795417595732889], [25.82168209434051, 0.34037154369686756, 7.803871850725031], [32.44342602553963, 0.22564243143990265, 0.5723910763693905], [34.59727850282278, 0.2391272804660886, 0.5347768210119305], [37.687852499402695, 0.19830046549342453, 1.552487182403644], [42.17170795119524, 0.19043790589827292, 6.182254098036818], [48.33460035591169, 0.21151012235156266, 2.7305409948221233], [51.03796171887433, 0.26255949350942354, 1.4697475586449495], [53.51257875019305, 0.20259708997369671, 0.5816951172421166], [56.95442471496864, 0.17643793815445485, 2.919763710979843], [60.67729766716603, 0.10247430699870225, 1.781401073695023]], "r_squared_": 0.7140219712117477, "error_": 0.043301065656259206}
{"freq_range": [2.0, 80.0], "freq_res": 1.0, "aperiodic_params_": [0.057334605440842804, 0.5882388318278544], "gaussian_params_": [[8.440659696954212, 0.5492582478855833, 0.27219186776450505], [11.402405938466773, 0.48415161199775447, 1.0854158890225236], [20.47704038802966, 0.3208795827421641, 0.8569678389298936], [24.02958152037814, 0.19139705781498492, 3.4520235679762763], [34.610490234453934, 0.22633531917437838, 0.554865878224549], [43.048313454521725, 0.16147403205249589, 0.7961736279123585], [47.845002407517505, 0.17381214666518607, 0.5668592839687385], [61.58300835366376, 0.4319570694182474, 0.28210659472878097], [67.07276736364108, 0.10073713150633296, 2.322524790175539]], "peak_params_": [[8.440659696954212, 0.1516941314122976, 0.5443837355290101], [11.402405938466773, 0.4521507743986673, 2.1708317780450472], [20.47704038802966, 0.3716622601403202, 1.7139356778597872], [24.02958152037814, 0.19145866731934513, 6.904047135952553], [34.610490234453934, 0.17813389544575997, 1.109731756449098], [43.048313454521725, 0.16117705965048512, 1.592347255824717], [47.845002407517505, 0.16743454747246522, 1.133718567937477], [61.58300835366376, 0.15415111712431284, 0.5642131894575619], [67.07276736364108, 0.10068769980325964, 4.645049580351078]], "r_squared_": 0.9474363028275167, "error_": 0.04115140535006052}
{"freq_range": [2.0, 80.0], "freq_res": 1.0, "aperiodic_params_": [0.0621990133292933, 0.4708416258443486], "gaussian_params_": [[11.707383258329633, 0.5387448909871275, 0.6586721313076627], [21.304558995775885, 0.2862267964614134, 1.7946876779622363], [35.612357071569626, 0.44272352066963394, 0.2502045297932055], [42.94827399329953, 0.17664228197251555, 0.4553229787068918], [51.001654859146534, 0.1407259343993957, 0.5936115031877275], [56.79877703851212, 0.19907891472290132, 0.7297921985216472], [59.82153616234614, 0.1866530238715231, 0.5653156485785291], [67.90123468452788, 0.1150597420450557, 1.4964485329777226], [70.55656312289997, 0.448422081746683, 0.2873674158336217]], "peak_params_": [[11.707383258329633, 0.48812077744460103, 1.3173442626153253], [21.304558995775885, 0.28213492083769376, 3.5893753559244725], [35.612357071569626, 0.133322861820253, 0.500409059586411], [42.94827399329953, 0.1755061128518315, 0.9106459574137836], [51.001654859146534, 0.1407253875587955, 1.187223006375455], [56.79877703851212, 0.1916541755222405, 1.4595843970432945], [59.82153616234614, 0.1775933940340455, 1.1306312971570582], [67.90123468452788, 0.11480941608920892, 2.9928970659554452], [70.55656312289997, 0.14982379520387112, 0.5747348316672434]], "r_squared_": 0.9504165924455393, "error_": 0.030863696896780885}
{"freq_range": [2.0, 80.0], "freq_res": 1.0, "aperiodic_params_": [0.2692987565814247, 0.7182568375933612], "gaussian_params_": [[8.789416950927286, 0.25987049427520553, 1.6304703111345227], [11.840497317206426, 0.6959031519885018, 0.7817423753165902], [21.001893255607943, 0.40716307473961716, 2.0703673249260452]], "peak_params_": [[8.789416950927286, 0.25865750977195245, 3.2609406222690454], [11.840497317206426, 0.7189922890688822, 1.5634847506331804], [21.001893255607943, 0.4071629044996395, 4.1407346498520905]], "r_squared_": 0.9703483829432668, "error_": 0.0439485018274998}
{"freq_range": [2.0, 80.0], "freq_res": 1.0, "aperiodic_params_": [0.6259824680319022, 0.9938115609566225], "gaussian_params_": [[10.623128947615982, 0.3677821233717879, 2.6113630239341625], [11.802092627117355, 0.5384507921227376, 0.5627713203200043], [21.199626680033465, 0.4596303889325782, 2.676627724898718], [59.75159125690655, 0.3178414366784576, 0.25000000000000006]], "peak_params_": [[10.623128947615982, 0.5592989451058282, 5.222726047868325], [11.802092627117355, 0.8274689790148811, 1.1255426406400086], [21.199626680033465, 0.45849083974130594, 5.353255449797436], [59.75159125690655, 0.19400761336932104, 0.5000000000000001]], "r_squared_": 0.9816796996917734, "error_": 0.05006597860625142}
{"freq_range": [2.0, 80.0], "freq_res": 1.0, "aperiodic_params_": [0.8459223514816443, 1.1699062059073597], "gaussian_params_": [[8.864137208322724, 0.24591314970019584, 1.7893434223133462], [11.715494768818228, 0.6284192212053379, 0.5542570000914026], [12.56051738342332, 0.26572567645878525, 2.4076396763407666], [21.232341017185174, 0.5261954586062885, 2.3099591436537947], [26.77416801359626, 0.20350946801585965, 0.5720122431397358], [30.305924456929002, 0.15598426320106432, 0.9693255825685393], [59.99761498743631, 0.17016644963891875, 0.25001816842558455], [65.3109767615023, 0.18026217766241065, 0.26110570861191845], [71.29833305185635, 0.10399359733912135, 5.999999941803207]], "peak_params_": [[8.864137208322724, 0.33424003517135414, 3.5786868446266924], [11.715494768818228, 0.8625992021994466, 1.108514000182805], [12.56051738342332, 0.3221144082594791, 4.815279352681533], [21.232341017185174, 0.5241110673464638, 4.6199182873075895], [26.77416801359626, 0.2120172785189679, 1.1440244862794715], [30.305924456929002, 0.1487975929100952, 1.9386511651370786], [59.99761498743631, 0.18782008623298663, 0.5000363368511691], [65.3109767615023, 0.14863386010449453, 0.5222114172238369], [71.29833305185635, 0.10386512534746761, 11.999999883606414]], "r_squared_": 0.991402063988357, "error_": 0.03582526971824951}
{"freq_range": [2.0, 80.0], "freq_res": 1.0, "aperiodic_params_": [0.8533543616193673, 1.1591632101316944], "gaussian_params_": [[9.34719764516748, 0.36342138765224113, 1.911773490881768], [11.54298172710274, 1.632768845940257, 0.3050896558460578], [13.321557457196567, 0.27649970749533204, 1.1727353128633664], [21.238281767741185, 0.5234903246523042, 2.646293939740453], [27.184986834069555, 0.14530734890444996, 0.7411969356096298], [30.631167850357738, 0.20666051075271297, 0.7423056849156402], [59.62989209787024, 0.6049849111655018, 0.2500156826896616]], "peak_params_": [[9.34719764516748, 0.35780032335397255, 3.823546981763536], [11.54298172710274, 0.8181765098622082, 0.6101793116921156], [13.321557457196567, 0.3290007467824145, 2.345470625726733], [21.238281767741185, 0.5213724343614231, 5.292587879480906], [27.184986834069555, 0.1897758864160588, 1.4823938712192597], [30.631167850357738, 0.18324281953143884, 1.4846113698312804], [59.62989209787024, 0.20224950660764263, 0.5000313653793232]], "r_squared_": 0.9863864385202643, "error_": 0.047506372349033495}
{"freq_range": [2.0, 80.0], "freq_res": 1.0, "aperiodic_params_": [0.8140733270615393, 1.1326803106687264], "gaussian_params_": [[9.171081424869582, 0.3996452175577093, 1.5857901326143615], [11.535452578107037, 1.6752548413512127, 0.30761230889135316], [13.330514278985765, 0.2957188153113662, 1.111093650105989], [17.380526611382113, 0.2472652515691866, 0.6446677496403409], [20.638825679315943, 0.5098160257525267, 1.3384861416335616], [23.530187287951076, 0.3234147232589514, 1.2205752791879383], [26.937176085765724, 0.19432106303466956, 0.9088782473140796], [30.66276294108246, 0.25272116566247693, 0.5121571341292309], [59.63461095838244, 0.4969305194709016, 0.25375853772639156], [69.48677029471203, 0.12702465616640868, 4.203839556805307], [78.59369351050955, 0.12966298774461243, 1.0647027709727912]], "peak_params_": [[9.171081424869582, 0.39747492683751623, 3.171580265228723], [11.535452578107037, 0.7613913634302013, 0.6152246177827063], [13.330514278985765, 0.30460399002154404, 2.222187300211978], [17.380526611382113, 0.22166344652185443, 1.2893354992806818], [20.638825679315943, 0.5293165850097126, 2.676972283267123], [23.530187287951076, 0.3231527075520488, 2.4411505583758766], [26.937176085765724, 0.1995512368186787, 1.8177564946281592], [30.66276294108246, 0.20347498535212993, 1.0243142682584618], [59.63461095838244, 0.18618340026593172, 0.5075170754527831], [69.48677029471203, 0.12617594681440725, 8.407679113610614], [78.59369351050955, 0.130371307075122, 2.1294055419455824]], "r_squared_": 0.9904166537416684, "error_": 0.03326940468341118}
{"freq_range": [2.0, 80.0], "freq_res": 1.0, "aperiodic_params_": [0.5718895755798883, 0.9466240063625029], "gaussian_params_": [[9.11780967378261, 0.4139596133805285, 1.361361891882549], [11.54275978157345, 1.6634571090399894, 0.32299626691076366], [13.508776099055343, 0.34855987070284006, 0.5618153934716172], [17.416530689930372, 0.24968500071202382, 0.7127004011005982], [20.472994149347265, 0.44430815693785, 1.1025746475322666], [23.243791597392068, 0.3212220983061813, 1.4274979513199462], [26.952538014224693, 0.20975920071228216, 0.7243628730932692], [30.55975967891786, 0.6855403333828147, 0.2873340815330045], [59.59781469297327, 0.46535329555456173, 0.27656807454892096], [67.83192881516216, 0.15929998320263944, 3.0832544001122133], [73.89648946533119, 0.11214225709636892, 1.074260377865191], [78.2346644310225, 0.19478737145984673, 0.9346817513445308]], "peak_params_": [[9.11780967378261, 0.41241247247791735, 2.722723783765098], [11.54275978157345, 0.6642204178724308, 0.6459925338215273], [13.508776099055343, 0.23850178310068026, 1.1236307869432345], [17.416530689930372, 0.21362070980606906, 1.4254008022011964], [20.472994149347265, 0.42989528633929736, 2.2051492950645333], [23.243791597392068, 0.34871113020124955, 2.8549959026398923], [26.952538014224693, 0.21938588733623532, 1.4487257461865384], [30.55975967891786, 0.21197297046603036, 0.574668163066009], [59.59781469297327, 0.16797796343117966, 0.5531361490978419], [67.83192881516216, 0.15906351548548314, 6.166508800224427], [73.89648946533119, 0.13316674608729717, 2.148520755730382], [78.2346644310225, 0.18951294653347328, 1.8693635026890616]], "r_squared_": 0.9861043432874868, "error_": 0.03349828552577328}
{"freq_range": [2.0, 80.0], "freq_res": 1.0, "aperiodic_params_": [0.20079738684870888, 0.672539872661923], "gaussian_params_": [[9.286036800176836, 0.32374971162840604, 1.3477857159292523], [11.526397879331817, 1.7732259437732025, 0.2968572403450507], [13.516332584831465, 1.0460642859724667, 0.2617867284010041], [21.237881329883212, 0.3659524828956661, 2.316185280030949], [26.963964833830236, 0.1665644888756158, 0.7234743120194809], [30.545480330426223, 0.8450652945145828, 0.25504886755767786], [59.613717889826844, 0.4781175057284349, 0.25000391540324834], [66.97727340167134, 0.15564744419061274, 2.9213802782450973], [77.83888039506377, 0.20386739618180297, 0.7562187992217612]], "peak_params_": [[9.286036800176836, 0.31654060602406703, 2.6955714318585047], [11.526397879331817, 0.5394300123311218, 0.5937144806901014], [13.516332584831465, 0.19330160120103979, 0.5235734568020082], [21.237881329883212, 0.364027512380716, 4.632370560061898], [26.963964833830236, 0.18293510937374513, 1.4469486240389617], [30.545480330426223, 0.17274015509337892, 0.5100977351153557], [59.613717889826844, 0.15390456117161433, 0.5000078308064967], [66.97727340167134, 0.1556427344378053, 5.8427605564901945], [77.83888039506377, 0.19941840488392715, 1.5124375984435223]], "r_squared_": 0.9616381657459513, "error_": 0.041882114998708454}
{"freq_range": [2.0, 80.0], "freq_res": 1.0, "aperiodic_params_": [-0.17786580815539946, 0.31022163159825045], "gaussian_params_": [[11.012625465927595, 0.4133429931155197, 1.560892601738984], [21.238450994675873, 0.3267349459260748, 2.3309157940817133], [30.767361062471043, 0.2509096792091494, 0.43295654504811926], [38.129585959498115, 0.2688498575374569, 0.6489357580980345], [42.183871773440686, 0.27181120273560927, 0.871701026854446], [44.4211075629251, 0.4756614108907463, 0.2982760306340797], [49.26382598509184, 0.19801220780369205, 1.9916604107965517], [68.83732744861598, 0.13518643744382838, 1.8016465340486005]], "peak_params_": [[11.012625465927595, 0.4133505882770164, 3.121785203477968], [21.238450994675873, 0.325029747903384, 4.661831588163427], [30.767361062471043, 0.21723226258978545, 0.8659130900962385], [38.129585959498115, 0.263545327704152, 1.297871516196069], [42.183871773440686, 0.2660871205953095, 1.743402053708892], [44.4211075629251, 0.21263098265640473, 0.5965520612681594], [49.26382598509184, 0.19628253972723264, 3.9833208215931033], [68.83732744861598, 0.134636507129699, 3.603293068097201]], "r_squared_": 0.7734623193627298, "error_": 0.05911364048207032}
{"freq_range": [2.0, 80.0], "freq_res": 1.0, "aperiodic_params_": [-0.26884750535370316, 0.05675261895808415], "gaussian_params_": [[11.549224458920373, 2.3645563222880166, 0.2537317076107625], [17.866284715624122, 0.2450880206410091, 0.8235560752340757], [20.292292274204527, 0.41190443190984743, 0.724225168740631], [22.64010478711405, 0.32569968542261474, 0.760431321351655], [42.94264941421532, 0.10648198021087617, 5.999999999999999]], "peak_params_": [[11.549224458920373, 0.4879542982660663, 0.507463415221525], [17.866284715624122, 0.24464770710172556, 1.6471121504681514], [20.292292274204527, 0.3890892879140001, 1.448450337481262], [22.64010478711405, 0.2919957782096032, 1.52086264270331], [42.94264941421532, 0.10647711603332272, 11.999999999999998]], "r_squared_": 0.6199197971546024, "error_": 0.05318581272256526}
{"freq_range": [2.0, 80.0], "freq_res": 1.0, "aperiodic_params_": [0.24721798265128578, 0.6735432965167287], "gaussian_params_": [[9.434004247293425, 0.3033391232683075, 1.4374880198482534], [11.862738975020356, 0.6989603366157426, 0.6082985650813854], [20.967440502482248, 0.35682562427946585, 2.0508089377093848], [57.02385069359119, 0.16815939695224422, 1.3112013019225344], [60.31753358346476, 0.44905188273597224, 0.2522011783302314]], "peak_params_": [[9.434004247293425, 0.28983490362436903, 2.8749760396965067], [11.862738975020356, 0.7430759688449083, 1.2165971301627707], [20.967440502482248, 0.3567806562707358, 4.1016178754187695], [57.02385069359119, 0.16813157942613033, 2.6224026038450687], [60.31753358346476, 0.21606385506113313, 0.5044023566604628]], "r_squared_": 0.9682304840142105, "error_": 0.044208912399897306}
{"freq_range": [2.0, 80.0], "freq_res": 1.0, "aperiodic_params_": [0.6029717631977176, 0.9751031362038461], "gaussian_params_": [[10.433317127211218, 0.4097518010444655, 2.354596134350834], [11.814167202019139, 0.6346967110197956, 0.5198587839082528], [21.1336610259546, 0.47105865863539165, 2.5003348394323703], [30.115308948795043, 0.15273483893653214, 0.810457999538129], [59.62280786712861, 0.590246699615667, 0.2500000000364738]], "peak_params_": [[10.433317127211218, 0.4043340854899778, 4.709192268701668], [11.814167202019139, 0.9243960189887706, 1.0397175678165056], [21.1336610259546, 0.4704034234294221, 5.000669678864741], [30.115308948795043, 0.15207285169965956, 1.620915999076258], [59.62280786712861, 0.18911387445726813, 0.5000000000729476]], "r_squared_": 0.9857721546294212, "error_": 0.04275498898456109}
{"freq_range": [2.0, 80.0], "freq_res": 1.0, "aperiodic_params_": [0.7853158297072893, 1.1091838688698166], "gaussian_params_": [[10.816093150526571, 0.4463034146702553, 2.527801185253568], [11.68467315206826, 0.7516354892507461, 0.42025254035437626], [21.144243204491733, 0.529292340916857, 2.44712732676822], [29.631327175109643, 0.15879036292509602, 1.7944987285139788], [59.986788588507736, 0.1950319837805852, 0.2500358893179772]], "peak_params_": [[10.816093150526571, 0.6445823947104842, 5.055602370507136], [11.68467315206826, 0.9676593116325654, 0.8405050807087525], [21.144243204491733, 0.5285085533652434, 4.89425465353644], [29.631327175109643, 0.15623282540928107, 3.5889974570279577], [59.986788588507736, 0.1947599226528105, 0.5000717786359544]], "r_squared_": 0.9854318182993672, "error_": 0.050582752474740277}
{"freq_range": [2.0, 80.0], "freq_res": 1.0, "aperiodic_params_": [0.9198340944123079, 1.1763333619703786], "gaussian_params_": [[9.628480561476186, 0.40307690584848316, 1.8811900017982914], [11.622592239270825, 0.8688294431269855, 0.4278225502805168], [13.310650670554367, 0.24557480588305544, 1.2111721119061432], [21.201193500828055, 0.5410644042671618, 2.6047597993087064], [30.150206235880667, 0.20370865376784356, 2.096988890021402], [59.788164226311224, 0.2579742969498268, 0.2549761610823658]], "peak_params_": [[9.628480561476186, 0.40185628770544113, 3.762380003596583], [11.622592239270825, 0.9086643403969906, 0.8556451005610336], [13.310650670554367, 0.3272014750171911, 2.4223442238122863], [21.201193500828055, 0.5394677299433569, 5.209519598617413], [30.150206235880667, 0.20498745688439224, 4.193977780042804], [59.788164226311224, 0.18268082247688278, 0.5099523221647316]], "r_squared_": 0.9879217964551494, "error_": 0.04843020036835531}
{"freq_range": [2.0, 80.0], "freq_res": 1.0, "aperiodic_params_": [0.4775039473410706, 0.8059650956628682], "gaussian_params_": [[9.116964517646576, 0.6262666761253893, 0.9375131471682852], [11.938306541185385, 0.9459318957919615, 0.9097695725946688], [18.001363649802872, 0.3056354171084735, 1.0128510543070048], [21.04959880215316, 0.5077283722407137, 0.9669883976344112], [23.584952540667373, 0.3990154385375562, 0.8857636318449168], [30.65131326052983, 0.6119842428556383, 0.2881097231780886], [59.7414888931529, 0.2959163572897963, 0.2500190253479624]], "peak_params_": [[9.116964517646576, 0.6265493216028046, 1.8750262943365703], [11.938306541185385, 0.949295985037061, 1.8195391451893377], [18.001363649802872, 0.30915003860581797, 2.0257021086140097], [21.04959880215316, 0.5165238145311442, 1.9339767952688225], [23.584952540667373, 0.36236174863125037, 1.7715272636898336], [30.65131326052983, 0.2942253073251561, 0.5762194463561772], [59.7414888931529, 0.17338841663904536, 0.5000380506959248]], "r_squared_": 0.9762862167874022, "error_": 0.04747281577365003}
{"freq_range": [2.0, 80.0], "freq_res": 1.0, "aperiodic_params_": [0.49359435054229484, 0.8581561523808333], "gaussian_params_": [[9.148053918212055, 0.6033884552279766, 1.0059192588100119], [11.533796537118842, 2.5257304903747713, 0.2917527804282233], [13.302135949708756, 0.32456569494188003, 0.7217313986230665], [17.607164834325204, 0.22407474854168508, 0.821309688469052], [20.517998969107595, 0.6790298996216699, 0.27994495443877865], [21.929052193787182, 0.3782429152392223, 2.241623224914234], [30.582513554677305, 1.0044149751175238, 0.25000185530385793], [59.64235520259752, 0.4596903709644261, 0.2500008812398527]], "peak_params_": [[9.148053918212055, 0.5968882247090788, 2.0118385176200237], [11.533796537118842, 0.7791761978328067, 0.5835055608564466], [13.302135949708756, 0.2978751581240924, 1.443462797246133], [17.607164834325204, 0.2812598517944902, 1.642619376938104], [20.517998969107595, 0.5013828603524779, 0.5598899088775573], [21.929052193787182, 0.37805420819713725, 4.483246449828468], [30.582513554677305, 0.24919706281063936, 0.5000037106077159], [59.64235520259752, 0.16522066785873002, 0.5000017624797054]], "r_squared_": 0.9787760147956274, "error_": 0.046791102597916474}
{"freq_range": [2.0, 80.0], "freq_res": 1.0, "aperiodic_params_": [0.03191241750679687, 0.383711853585563], "gaussian_params_": [[9.137972519913328, 0.4509528842952517, 0.8896608223641047], [11.65641442629524, 0.5842927893151609, 0.7531911285558911], [18.06698988927881, 0.197790775479442, 0.6620613374639647], [20.51445762272131, 0.9247652120340291, 0.3055070625048064], [22.869240576130654, 0.19646326807374478, 1.398403224432601], [30.61314808426068, 0.6119877270189211, 0.2500150496936352]], "peak_params_": [[9.137972519913328, 0.44672534117604257, 1.7793216447282094], [11.65641442629524, 0.5291066624506799, 1.5063822571117822], [18.06698988927881, 0.19723848838360802, 1.3241226749279293], [20.51445762272131, 0.3419614960045729, 0.6110141250096128], [22.869240576130654, 0.19560626264462483, 2.796806448865202], [30.61314808426068, 0.1848641387917564, 0.5000300993872704]], "r_squared_": 0.8739822008506767, "error_": 0.058409353690838266}
{"freq_range": [2.0, 80.0], "freq_res": 1.0, "aperiodic_params_": [-0.4616308389261554, -0.030893963464739334], "gaussian_params_": [[9.32010092042161, 0.23552646363528396, 1.0395944438998646], [11.65688653474927, 0.6064486396349564, 0.4744013579498811], [19.653707791747532, 0.32118315878705267, 2.5978231128783684], [37.94888381125713, 0.21714230355477515, 0.635176971365185], [61.18983498519246, 0.1476360673936457, 1.142838732250898]], "peak_params_": [[9.32010092042161, 0.22469370058930424, 2.079188887799729], [11.65688653474927, 0.47955894283550177, 0.9488027158997622], [19.653707791747532, 0.3183422242583098, 5.195646225756737], [37.94888381125713, 0.21644030063641465, 1.27035394273037], [61.18983498519246, 0.14561326824861964, 2.285677464501796]], "r_squared_": 0.40540491809566415, "error_": 0.06782485064054349}
{"freq_range": [2.0, 80.0], "freq_res": 1.0, "aperiodic_params_": [-0.163104448916529, 0.2527250572760858], "gaussian_params_": [[9.500323760941482, 1.2281203662385751, 0.2726186108421602], [11.71210494934761, 0.6602404278041729, 0.5585836840306032], [17.419352903476984, 0.7500279202061092, 0.25000293852798916], [21.317720083120218, 0.2259402106310987, 1.801590728637385], [33.221141556640646, 0.12477378420042748, 5.999999999999999], [36.35790465343671, 0.12200991771943707, 0.5719026485572937], [43.576784947078195, 0.38846621336156556, 0.30106717383023823], [50.425908162582076, 0.8387378563212926, 0.25617460252123214]], "peak_params_": [[9.500323760941482, 0.23504488817192504, 0.5452372216843204], [11.71210494934761, 0.5783618733123677, 1.1171673680612064], [17.419352903476984, 0.19971203877143184, 0.5000058770559783], [21.317720083120218, 0.23812954474441905, 3.60318145727477], [33.221141556640646, 0.12468906871449653, 11.999999999999998], [36.35790465343671, 0.2123958837038088, 1.1438052971145873], [43.576784947078195, 0.16948070992688458, 0.6021343476604765], [50.425908162582076, 0.21307246737098484, 0.5123492050424643]], "r_squared_": 0.8462394081349932, "error_": 0.04591627000844269}
{"freq_range": [2.0, 80.0], "freq_res": 1.0, "aperiodic_params_": [0.2787845078468277, 0.659782298860857], "gaussian_params_": [[10.432343098863198, 0.42886874739485564, 1.718195820315071], [12.06480420515554, 0.623688393479396, 0.4973397418201861], [21.6560637455576, 0.35194622816610316, 2.5241531686114986], [29.863357931727425, 0.17008540738444988, 0.6124470101003593], [58.12447725056629, 0.12904636234528394, 1.3577436256397237]], "peak_params_": [[10.432343098863198, 0.41562531914173334, 3.436391640630142], [12.06480420515554, 0.9015028629815015, 0.9946794836403722], [21.6560637455576, 0.3486941829954628, 5.048306337222997], [29.863357931727425, 0.1673960638612373, 1.2248940202007186], [58.12447725056629, 0.1285051746115391, 2.7154872512794475]], "r_squared_": 0.9721470581532897, "error_": 0.04153631724872198}
{"freq_range": [2.0, 80.0], "freq_res": 1.0, "aperiodic_params_": [0.6016549065517275, 0.9422693738671752], "gaussian_params_": [[10.749093019054342, 0.5351011689980228, 2.031504645446262], [11.996944106165618, 0.6270103146137357, 0.4888724504603274], [21.239486567457316, 0.462344797439235, 2.5876409926037325], [23.59247515194956, 0.5000115335179455, 0.2589991155927185], [30.066075542272337, 0.16541470827294125, 0.7895205494039342], [59.575612057809174, 0.6577002051192012, 0.2506396926592891]], "peak_params_": [[10.749093019054342, 0.6096055327309821, 4.063009290892524], [11.996944106165618, 1.0704802461037068, 0.9777449009206548], [21.239486567457316, 0.460370500297496, 5.175281985207465], [23.59247515194956, 0.4067205054277115, 0.517998231185437], [30.066075542272337, 0.1663363812569043, 1.5790410988078685], [59.575612057809174, 0.15684429584492288, 0.5012793853185782]], "r_squared_": 0.9865114819812391, "error_": 0.041161913125644496}
{"freq_range": [2.0, 80.0], "freq_res": 1.0, "aperiodic_params_": [0.7852779416354233, 1.0758891937889736], "gaussian_params_": [[10.866006331727977, 0.5358398698083091, 2.1141494940747463], [11.886666731525088, 0.6594607065535735, 0.49428874384394805], [21.38673308063345, 0.5207657390696809, 2.585547405711366], [59.63220548549161, 0.5298397971555525, 0.25001050795263163]], "peak_params_": [[10.866006331727977, 0.6668907082926341, 4.228298988149493], [11.886666731525088, 1.1071127127492004, 0.9885774876878961], [21.38673308063345, 0.5149782344734248, 5.171094811422732], [59.63220548549161, 0.17955529642303225, 0.5000210159052633]], "r_squared_": 0.985124706026426, "error_": 0.049605841518912716}
{"freq_range": [2.0, 80.0], "freq_res": 1.0, "aperiodic_params_": [0.8367342860566183, 1.099606256535473], "gaussian_params_": [[9.964820653339839, 0.5249536988651663, 1.634261916446856], [12.020083103178136, 0.9131681224467857, 0.6921780471328094], [14.42670887474091, 0.5284245305235027, 0.30913800654346113], [20.865409184393357, 0.5674977972126427, 2.475500476995388], [23.594052792432706, 0.6402580504894652, 0.28281750404110056], [29.48336529101278, 0.20220617846784214, 2.0692386179303153], [30.705844457926055, 0.1964724043667066, 0.25245866904465786], [59.670798552925135, 0.39926057205017834, 0.25000864661242406]], "peak_params_": [[9.964820653339839, 0.5377826427389881, 3.268523832893712], [12.020083103178136, 1.1554635896483452, 1.3843560942656188], [14.42670887474091, 0.2561279465279054, 0.6182760130869223], [20.865409184393357, 0.5667049431143959, 4.951000953990776], [23.594052792432706, 0.4891461016449767, 0.5656350080822011], [29.48336529101278, 0.19932951830710155, 4.1384772358606305], [30.705844457926055, 0.2543615171865241, 0.5049173380893157], [59.670798552925135, 0.1677853516072617, 0.5000172932248481]], "r_squared_": 0.9893508478698807, "error_": 0.0439246062770297}
{"freq_range": [2.0, 80.0], "freq_res": 1.0, "aperiodic_params_": [0.6564422011001747, 0.962557836214471], "gaussian_params_": [[9.24123383435102, 0.5741502156171531, 1.0191445075602643], [11.912452802979839, 1.055563879696714, 0.8333293435765582], [21.21746260689966, 0.4932880393120752, 2.7717696171182564], [30.721130915637506, 0.28695124518549425, 0.3742130839640788], [59.5823559707737, 0.7001983684938751, 0.25012726621129805]], "peak_params_": [[9.24123383435102, 0.5606690779328452, 2.0382890151205286], [11.912452802979839, 1.066431056587561, 1.6666586871531164], [21.21746260689966, 0.4917721853292211, 5.543539234236513], [30.721130915637506, 0.21835176415007562, 0.7484261679281576], [59.5823559707737, 0.17370718274517694, 0.5002545324225961]], "r_squared_": 0.9808131254442409, "error_": 0.05195898817201814}
{"freq_range": [2.0, 80.0], "freq_res": 1.0, "aperiodic_params_": [0.7725567637556573, 1.0829471945540692], "gaussian_params_": [[9.181871745257322, 0.5243828041713489, 1.0698263987924725], [11.538539655407476, 1.920770527118394, 0.3245170971983107], [13.112630272579281, 0.3298346026371245, 0.920395238955896], [17.47879199097289, 0.427541917281597, 0.3027572295055504], [20.557489976551715, 0.3525407796991726, 0.31142909459692525], [21.644827418754772, 0.43336845167629684, 2.7723943688684325], [30.70894359814893, 0.27819370884071326, 0.46557857656781226], [59.95685378158809, 0.17704976933216762, 0.2500000000000001], [72.38028243047691, 0.11466014326927672, 5.999999999999999]], "peak_params_": [[9.181871745257322, 0.5168882561386496, 2.139652797584945], [11.538539655407476, 0.8750510676924993, 0.6490341943966214], [13.112630272579281, 0.3317027456436943, 1.840790477911792], [17.47879199097289, 0.22897739706499326, 0.6055144590111008], [20.557489976551715, 0.5502722829915597, 0.6228581891938505], [21.644827418754772, 0.42983445608253357, 5.544788737736865], [30.70894359814893, 0.23027425466748785, 0.9311571531356245], [59.95685378158809, 0.1880752253965181, 0.5000000000000002], [72.38028243047691, 0.1144300751564844, 11.999999999999998]], "r_squared_": 0.9865971697867294, "error_": 0.03988038373545896}
{"freq_range": [2.0, 80.0], "freq_res": 1.0, "aperiodic_params_": [0.10581737886776814, 0.4736689512269506], "gaussian_params_": [[9.262566414452627, 0.5549575053785786, 0.9490266226862889], [11.938155836386052, 0.8279079519064932, 0.7693182905673029], [21.349737862171857, 0.32161688459202536, 2.5137306508768975], [30.926443009334438, 0.2946675693539774, 0.5224697967494388]], "peak_params_": [[9.262566414452627, 0.5346840278028172, 1.8980532453725778], [11.938155836386052, 0.8342167187802426, 1.5386365811346059], [21.349737862171857, 0.3185190612059097, 5.027461301753795], [30.926443009334438, 0.29196446117236646, 1.0449395934988777]], "r_squared_": 0.9337633086954054, "error_": 0.05455461186744039}
{"freq_range": [2.0, 80.0], "freq_res": 1.0, "aperiodic_params_": [-0.3858778292452588, 0.04484274587518389], "gaussian_params_": [[9.655952183397797, 0.43922104186594146, 1.0983499674111363], [12.086601383717001, 0.6689407739063499, 0.6237946371061569], [13.904117847911706, 0.20686084732073748, 0.2500010786206186], [17.46910260932411, 0.20209674478849246, 1.2206622164681884], [22.053731764181123, 0.34365174893410616, 2.113524281612315], [26.614828032115124, 0.5653774453292386, 0.26499740133796085], [30.509980481424662, 0.24413163133255875, 1.4134303730285744], [34.682859861418116, 0.16979744688559997, 0.7176008029377245], [44.15860885539242, 0.17266757778686156, 5.622845826088187]], "peak_params_": [[9.655952183397797, 0.42068014732519743, 2.1966999348222727], [12.086601383717001, 0.7075848356816249, 1.2475892742123138], [13.904117847911706, 0.20223068323734986, 0.5000021572412372], [17.46910260932411, 0.20741695042220826, 2.441324432936377], [22.053731764181123, 0.34381993346714534, 4.22704856322463], [26.614828032115124, 0.23164637035657598, 0.5299948026759217], [30.509980481424662, 0.24110530930964735, 2.826860746057149], [34.682859861418116, 0.2013963487155322, 1.435201605875449], [44.15860885539242, 0.17259889673719564, 11.245691652176374]], "r_squared_": 0.699761542274555, "error_": 0.05304954909007441}
{"freq_range": [2.0, 80.0], "freq_res": 1.0, "aperiodic_params_": [-0.08778856058424209, 0.361050183178327], "gaussian_params_": [[9.582722395409776, 0.4922616332771925, 0.7897606554490353], [11.977197080519577, 0.7656939120798253, 0.7458470263007932], [19.108845293357657, 0.23729307096741384, 1.4025207875499068], [21.533252754191793, 0.5327233528695119, 0.3236216004830813], [24.45187611406417, 0.18821887879693475, 1.3402038359552968], [42.17170423204131, 0.20302542066710924, 0.5330081916357743], [43.7558019811061, 0.2843602520993619, 0.2500248409333448]], "peak_params_": [[9.582722395409776, 0.45093694640769316, 1.5795213108980706], [11.977197080519577, 0.76988549020487, 1.4916940526015865], [19.108845293357657, 0.23662756113190064, 2.8050415750998137], [21.533252754191793, 0.25193972786092034, 0.6472432009661626], [24.45187611406417, 0.17836101497065482, 2.6804076719105936], [42.17170423204131, 0.19275954247346938, 1.0660163832715486], [43.7558019811061, 0.17705770402633436, 0.5000496818666896]], "r_squared_": 0.9260007135911799, "error_": 0.04477024801388014}
{"freq_range": [2.0, 80.0], "freq_res": 1.0, "aperiodic_params_": [0.21738105167776683, 0.530919365835882], "gaussian_params_": [[9.59703209575642, 0.4830724482763731, 0.8327000135184738], [11.99730568111289, 0.9817336163573137, 0.7083043831753519], [21.66921178991756, 0.2921332318209463, 2.7187553017638924], [36.33448509648492, 0.18959298126705917, 0.5275254611935342], [58.16660647620438, 0.1458370676537023, 1.2418410094708807]], "peak_params_": [[9.59703209575642, 0.4481454187743386, 1.6654000270369476], [11.99730568111289, 0.9897611465594696, 1.4166087663507039], [21.66921178991756, 0.28997894012118725, 5.437510603527785], [36.33448509648492, 0.1550678101394809, 1.0550509223870683], [58.16660647620438, 0.14453048489093323, 2.4836820189417614]], "r_squared_": 0.9568410186807915, "error_": 0.044432040387960774}
{"freq_range": [2.0, 80.0], "freq_res": 1.0, "aperiodic_params_": [0.4813368257930597, 0.8078832004240458], "gaussian_params_": [[9.682601474827743, 0.5346402379915675, 1.1598949499220037], [12.083864996345726, 1.1054864015553316, 0.7091831170149445], [21.315137535173086, 0.40997689170734497, 2.6905119458796514], [24.21281117856121, 0.25150510654869995, 0.26294125225439374]], "peak_params_": [[9.682601474827743, 0.5297977672351549, 2.3197898998440074], [12.083864996345726, 1.17146095285492, 1.418366234029889], [21.315137535173086, 0.40717422726303776, 5.381023891759303], [24.21281117856121, 0.4304471633138245, 0.5258825045087875]], "r_squared_": 0.9811961783196806, "error_": 0.043850393752057196}
{"freq_range": [2.0, 80.0], "freq_res": 1.0, "aperiodic_params_": [0.7374941054279387, 1.0029301633956729], "gaussian_params_": [[9.517117897368777, 0.6154633623865072, 0.9843914416687545], [11.97071344896471, 1.3025320256847621, 0.8058516532207347], [21.04862295923181, 0.4920223684123454, 2.8377746367158307], [23.613077936134776, 0.8954008513430265, 0.2543719781291651], [59.57870092644007, 0.7331302169025918, 0.25207492164115286]], "peak_params_": [[9.517117897368777, 0.6114319314790714, 1.968782883337509], [11.97071344896471, 1.330293270244184, 1.6117033064414694], [21.04862295923181, 0.49195014966604417, 5.6755492734316615], [23.613077936134776, 0.5680666096793247, 0.5087439562583302], [59.57870092644007, 0.18139192193888398, 0.5041498432823057]], "r_squared_": 0.9846034767422865, "error_": 0.04953345680827978}
{"freq_range": [2.0, 80.0], "freq_res": 1.0, "aperiodic_params_": [0.5353685011024273, 0.8333636057623767], "gaussian_params_": [[9.471152220770737, 0.65772994119658, 0.9087494539633543], [11.953605039056058, 1.2800340946676065, 0.8147758355034146], [21.00207447265106, 0.422689025762509, 2.5612263794428687], [23.58955836180511, 1.0714340117871268, 0.2638932194642483]], "peak_params_": [[9.471152220770737, 0.5768138018158228, 1.8174989079267085], [11.953605039056058, 1.2925313714954227, 1.6295516710068292], [21.00207447265106, 0.42268888711553343, 5.122452758885737], [23.58955836180511, 0.5327141004792906, 0.5277864389284966]], "r_squared_": 0.9767566526441522, "error_": 0.0523742269097309}
{"freq_range": [2.0, 80.0], "freq_res": 1.0, "aperiodic_params_": [0.18986889623159506, 0.49455962070258963], "gaussian_params_": [[9.499748472809364, 0.621281443800462, 0.9080819191983748], [11.975762107251203, 1.1221763414654096, 0.7924920457520958], [18.34316077249961, 0.2288225004785072, 0.9250273964594886], [21.30400000998173, 0.43109221762058453, 0.6937147837411041], [23.535900812764464, 0.8469098007871358, 0.37429278106053676], [31.423676846038745, 0.6802790487139057, 0.26825643542846184]], "peak_params_": [[9.499748472809364, 0.5349492998388977, 1.8161638383967496], [11.975762107251203, 1.1356839507764747, 1.5849840915041915], [18.34316077249961, 0.21361168751331963, 1.8500547929189772], [21.30400000998173, 0.3953242053447781, 1.3874295674822081], [23.535900812764464, 0.39285858604080226, 0.7485855621210735], [31.423676846038745, 0.1954479844891488, 0.5365128708569237]], "r_squared_": 0.9505715625735762, "error_": 0.050826391403285966}
{"freq_range": [2.0, 80.0], "freq_res": 1.0, "aperiodic_params_": [0.18389253703478747, 0.4877789411204447], "gaussian_params_": [[9.501910709456444, 0.6191631769596952, 0.9061722440330614], [11.975472126964055, 1.1197699725616694, 0.7975766336463026], [18.36437822952729, 0.23407901846391924, 0.929750807573908], [21.325201592703674, 0.43708427871483563, 0.6721146302866658], [23.519771285460838, 1.3524677695255691, 0.3041104159060117], [31.422454127850248, 0.7584208369161681, 0.25652274969379574]], "peak_params_": [[9.501910709456444, 0.5844692136647922, 1.8123444880661228], [11.975472126964055, 1.1330940721250007, 1.5951532672926052], [18.36437822952729, 0.21677760253361447, 1.859501615147816], [21.325201592703674, 0.39301355155643625, 1.3442292605733317], [23.519771285460838, 0.38888179981944, 0.6082208318120234], [31.422454127850248, 0.19542629316015825, 0.5130454993875915]], "r_squared_": 0.94779668933417, "error_": 0.052082220424098734}
{"freq_range": [2.0, 80.0], "freq_res": 1.0, "aperiodic_params_": [-0.3110071465397781, -0.026513874839058343], "gaussian_params_": [[9.64658807980429, 0.5565031175030718, 0.9614434203747851], [12.061632177821826, 0.8333296031311214, 0.717242295337826], [18.309629883511285, 0.16395468908840452, 0.7443489718905307], [25.25914466637633, 0.18545637877409174, 5.999999999999999]], "peak_params_": [[9.64658807980429, 0.540843882926983, 1.9228868407495703], [12.061632177821826, 0.8742173900806369, 1.434484590675652], [18.309629883511285, 0.23957153842715528, 1.4886979437810615], [25.25914466637633, 0.18528348024188848, 11.999999999999998]], "r_squared_": 0.6242212753805833, "error_": 0.0789049272979486}
{"freq_range": [2.0, 80.0], "freq_res": 1.0, "aperiodic_params_": [-0.266501821916508, 0.19310930135072046], "gaussian_params_": [[9.63500418582201, 0.6176502649334752, 1.1177166304801074], [12.092077605119323, 0.7969252939335045, 0.7226874508875413], [19.043985115616124, 0.27830662691641356, 1.0862902193992718], [21.881839366536262, 0.2607023351978377, 0.7046572214180123], [24.45619076428151, 0.6286934085377914, 0.325470633061621], [41.89036814942125, 0.34898373885228046, 0.6607863989768124], [44.34890210937603, 0.51364624170869, 0.2660429765113474]], "peak_params_": [[9.63500418582201, 0.5976495414854152, 2.2354332609602148], [12.092077605119323, 0.8563324629075019, 1.4453749017750825], [19.043985115616124, 0.27813941711131, 2.1725804387985437], [21.881839366536262, 0.26392647033967276, 1.4093144428360247], [24.45619076428151, 0.23826939057397067, 0.650941266123242], [41.89036814942125, 0.3442134874383551, 1.3215727979536247], [44.34890210937603, 0.21950170779011402, 0.5320859530226948]], "r_squared_": 0.8732096959581456, "error_": 0.05455230966160512}
{"freq_range": [2.0, 80.0], "freq_res": 1.0, "aperiodic_params_": [-0.18435822561877385, 0.2586431138654111], "gaussian_params_": [[9.641142021135062, 0.6106069552599352, 1.0616396259400422], [12.084196424247267, 0.8602477374769284, 0.753269484145627], [19.952272329144847, 0.28529139004016435, 2.0262107113417667], [24.462291519863072, 0.9933293336400455, 0.2689015596378588], [41.9986240003203, 0.32783006221679223, 0.6030405827949238], [44.32579421105374, 0.44504640398612116, 0.2712288563081241]], "peak_params_": [[9.641142021135062, 0.5954198482649502, 2.1232792518800845], [12.084196424247267, 0.9067493653108665, 1.506538968291254], [19.952272329144847, 0.28521225484139345, 4.052421422683533], [24.462291519863072, 0.26540673073969717, 0.5378031192757176], [41.9986240003203, 0.3278292087987873, 1.2060811655898476], [44.32579421105374, 0.217651206929232, 0.5424577126162482]], "r_squared_": 0.8891271997158304, "error_": 0.05689502987719375}
{"freq_range": [2.0, 80.0], "freq_res": 1.0, "aperiodic_params_": [0.4328930066296542, 0.7361605557336003], "gaussian_params_": [[9.80944882976009, 0.610733900726831, 1.159345182797654], [12.14056621493767, 1.3147118458027547, 0.7065776310334391], [14.437701121069239, 0.6004587818084722, 0.297866043010903], [20.963163097161917, 0.3717434718416643, 2.543455542847727], [24.135604398081878, 0.3196051959712787, 0.49442007329102566], [42.420783629574636, 0.5507210705970863, 0.27940624345849324], [58.64504157917893, 0.13853678007964307, 1.362432826997375]], "peak_params_": [[9.80944882976009, 0.6159372766360167, 2.318690365595308], [12.14056621493767, 1.3921727115296623, 1.4131552620668781], [14.437701121069239, 0.25484874684002745, 0.595732086021806], [20.963163097161917, 0.37170448644793247, 5.086911085695454], [24.135604398081878, 0.49006289878030684, 0.9888401465820513], [42.420783629574636, 0.17718992322131055, 0.5588124869169865], [58.64504157917893, 0.13391391713759448, 2.72486565399475]], "r_squared_": 0.9825209025306483, "error_": 0.04274829894387432}
{"freq_range": [2.0, 80.0], "freq_res": 1.0, "aperiodic_params_": [0.4982349328859938, 0.7856543501199605], "gaussian_params_": [[9.709277815342977, 0.692953551021151, 1.0619544409582895], [12.079390901159776, 1.5734650735795987, 0.7514705955916535], [14.45654907827879, 0.9366536520649826, 0.2976622327730359], [21.006308899511076, 0.4268817643333566, 2.8589485029997443], [23.85902402621901, 0.4269392158448225, 0.4909841484192565]], "peak_params_": [[9.709277815342977, 0.7019391955430516, 2.123908881916579], [12.079390901159776, 1.6353542379403678, 1.502941191183307], [14.45654907827879, 0.3703247047202128, 0.5953244655460718], [21.006308899511076, 0.42688074346801974, 5.717897005999489], [23.85902402621901, 0.6564208997900585, 0.981968296838513]], "r_squared_": 0.9813240239718786, "error_": 0.04824473427720016}
{"freq_range": [2.0, 80.0], "freq_res": 1.0, "aperiodic_params_": [0.30268589582001953, 0.580106690405092], "gaussian_params_": [[9.575128423764612, 0.6912159552050338, 0.9275585105435394], [12.012652708999601, 1.3961181944154641, 0.8193323667893792], [18.69460617900953, 0.24610668876217828, 1.1100388613918004], [21.293816396020446, 0.4902478451838523, 0.6230761151949166], [23.685325329509237, 0.6232770435610349, 0.6429517174435571]], "peak_params_": [[9.575128423764612, 0.6907080164601183, 1.8551170210870789], [12.012652708999601, 1.418627481610066, 1.6386647335787583], [18.69460617900953, 0.23752571747584944, 2.220077722783601], [21.293816396020446, 0.467239861895729, 1.2461522303898331], [23.685325329509237, 0.5529679882201853, 1.2859034348871141]], "r_squared_": 0.9618819893943112, "error_": 0.05571173690578416}
{"freq_range": [2.0, 80.0], "freq_res": 1.0, "aperiodic_params_": [-0.07803257545383606, 0.19322388021771889], "gaussian_params_": [[9.672793419996655, 0.6810022311789224, 0.9383105798184809], [12.010664400666975, 1.1329279365306115, 0.7531562917330266], [21.954364340368134, 0.26869163757345743, 2.6141729778069056], [42.43188593752985, 0.14128740627329436, 5.999999999939602]], "peak_params_": [[9.672793419996655, 0.6729431174187378, 1.8766211596369617], [12.010664400666975, 1.164438217070114, 1.5063125834660531], [21.954364340368134, 0.26907927538063814, 5.228345955613811], [42.43188593752985, 0.14092185638478938, 11.999999999879204]], "r_squared_": 0.8821970837725904, "error_": 0.06102677751845567}
{"freq_range": [2.0, 80.0], "freq_res": 1.0, "aperiodic_params_": [-0.34870104401065977, -0.036546068225584365], "gaussian_params_": [[9.724296106971224, 0.6883988345080321, 1.0452868025931359], [12.051736333441035, 0.886223093280909, 0.709950800402437], [18.136124103434884, 0.1913729094318713, 0.8567362268435063], [22.53551906379191, 0.2643652352093858, 2.208747662532359], [31.522090658722366, 0.19451118434940043, 0.796741328549243], [35.445186925467915, 0.21595007961857868, 0.736484057945727], [38.45418937703181, 0.5917621835838408, 0.30102807259024494], [41.40464638725537, 0.16807393204321502, 1.169933750963382], [44.41116291442624, 0.3860052975025129, 0.28835399447257803], [46.11596883834968, 0.20724305163088272, 1.4759155627218825]], "peak_params_": [[9.724296106971224, 0.6784777211857003, 2.0905736051862718], [12.051736333441035, 0.9482343697171018, 1.419901600804874], [18.136124103434884, 0.2210782169405745, 1.7134724536870125], [22.53551906379191, 0.2585839561214044, 4.417495325064718], [31.522090658722366, 0.162517028812555, 1.593482657098486], [35.445186925467915, 0.17990534986391665, 1.472968115891454], [38.45418937703181, 0.19255372422467293, 0.6020561451804899], [41.40464638725537, 0.15882540286811916, 2.339867501926764], [44.41116291442624, 0.22817551834649835, 0.5767079889451561], [46.11596883834968, 0.20667943047748447, 2.951831125443765]], "r_squared_": 0.844659154441327, "error_": 0.04533617304516889}
{"freq_range": [2.0, 80.0], "freq_res": 1.0, "aperiodic_params_": [0.17117037173800598, 0.4665567029480835], "gaussian_params_": [[11.588132706206006, 1.1746173325493838, 1.5848470350422388], [20.498093330227285, 0.35687139615063446, 2.248637956376286], [24.224564518071602, 0.32029756554354916, 0.5388721347255181], [43.59509588029598, 0.12709443675190543, 3.6141070506556314]], "peak_params_": [[11.588132706206006, 1.1358972293311025, 3.1696940700844776], [20.498093330227285, 0.3482236546849726, 4.497275912752572], [24.224564518071602, 0.3997938487219938, 1.0777442694510362], [43.59509588029598, 0.12629930912875648, 7.228214101311263]], "r_squared_": 0.9418415487209209, "error_": 0.060108352569582926}
{"freq_range": [2.0, 80.0], "freq_res": 1.0, "aperiodic_params_": [0.08778536179659006, 0.3746001355296083], "gaussian_params_": [[9.669607533367104, 0.6660885564716758, 0.9988504807169825], [11.95085610878858, 1.204574930437737, 0.6531806518601371], [12.81492980423983, 0.35283227005095, 1.6482675114101442], [18.44941887564767, 0.36207440502238597, 0.5109167841073856], [20.944503579405655, 0.37377154894095904, 0.91013074634237], [23.748078997452776, 0.46326686637816283, 0.6367417135608392], [42.042790098525174, 0.1573267323771322, 0.2500006126652161], [43.8893611752332, 0.11073138765378963, 5.99999854916436]], "peak_params_": [[9.669607533367104, 0.7266328593302389, 1.997700961433965], [11.95085610878858, 1.557217015126067, 1.3063613037202741], [12.81492980423983, 0.6847830087928801, 3.2965350228202883], [18.44941887564767, 0.25042048218074087, 1.0218335682147712], [20.944503579405655, 0.37319865603023256, 1.82026149268474], [23.748078997452776, 0.4301806804633785, 1.2734834271216784], [42.042790098525174, 0.26041433573532385, 0.5000012253304322], [43.8893611752332, 0.11071256344867891, 11.99999709832872]], "r_squared_": 0.9632970870639361, "error_": 0.04579536767225312}
{"freq_range": [2.0, 80.0], "freq_res": 1.0, "aperiodic_params_": [0.04643023235320873, 0.27893177704011496], "gaussian_params_": [[9.688737495039108, 0.7466417729762992, 0.9576462251598549], [12.008783871850943, 1.2773437813581578, 0.7520599091083052], [20.95118661693569, 0.25545338213609076, 2.7556409097237533], [23.56007673219894, 0.8200317435881181, 0.2866407379360317], [42.01994879489543, 0.08971261785983647, 0.25001832134715857], [42.16857491898211, 0.13318705041884957, 5.9999999978793594]], "peak_params_": [[9.688737495039108, 0.7443857378808068, 1.9152924503197097], [12.008783871850943, 1.3191378425478335, 1.5041198182166104], [20.95118661693569, 0.25567726181929745, 5.511281819447507], [23.56007673219894, 0.3924254776650279, 0.5732814758720634], [42.01994879489543, 0.22256199500554108, 0.5000366426943171], [42.16857491898211, 0.22256199500554108, 11.999999995758719]], "r_squared_": 0.929643051163282, "error_": 0.056646932526320165}
{"freq_range": [2.0, 80.0], "freq_res": 1.0, "aperiodic_params_": [-1.5547865706686246, 0.563220414011364], "gaussian_params_": [[11.82627952425597, 0.5987683905602009, 1.3631837526106683], [21.149469988649404, 0.3261920802263737, 2.553499262866093], [30.6251145511658, 0.27997480580129297, 0.8031784670529519]], "peak_params_": [[11.82627952425597, 0.5944576030580395, 2.7263675052213365], [21.149469988649404, 0.3256337284325985, 5.106998525732186], [30.6251145511658, 0.2512712002263533, 1.6063569341059039]], "r_squared_": 0.9451279893434865, "error_": 0.05234951883407981}
{"freq_range": [2.0, 80.0], "freq_res": 1.0, "aperiodic_params_": [0.025246855846341495, 0.6470297552430262], "gaussian_params_": [[11.690292767432704, 0.3447577152892834, 1.2097508319865764], [20.944107206186324, 0.35727594605506274, 1.0884052357746352], [23.90937560436043, 0.2382032187705991, 0.5941560701012567]], "peak_params_": [[11.690292767432704, 0.3336430016014862, 2.419501663973153], [20.944107206186324, 0.35680664653532274, 2.1768104715492704], [23.90937560436043, 0.24238620819476553, 1.1883121402025134]], "r_squared_": 0.8778482748974871, "error_": 0.07632777254292054}
{"freq_range": [2.0, 80.0], "freq_res": 1.0, "aperiodic_params_": [0.024948844671645553, 0.7548614913754652], "gaussian_params_": [[11.695531710975496, 0.5785766861655874, 0.9082753384667237], [21.119545943327353, 0.3780942492720416, 1.5797252205483143], [59.52926288189734, 0.5291900836081564, 0.2856586127504469], [68.85695563479497, 0.11002794258632242, 4.336327124667107], [75.03585637917362, 0.08353758187688204, 0.25004231243515707], [79.11319279877853, 0.12685013940522327, 2.9087043978964933]], "peak_params_": [[11.695531710975496, 0.5469658152316031, 1.8165506769334474], [21.119545943327353, 0.3770131762341886, 3.1594504410966286], [59.52926288189734, 0.1497878518060527, 0.5713172255008938], [68.85695563479497, 0.11026889323278821, 8.672654249334213], [75.03585637917362, 0.16969409027790738, 0.5000846248703141], [79.11319279877853, 0.1338895477904689, 5.8174087957929865]], "r_squared_": 0.9542988986868812, "error_": 0.0483503815261614}
{"freq_range": [2.0, 80.0], "freq_res": 1.0, "aperiodic_params_": [0.3679829145254044, 0.9117448498821396], "gaussian_params_": [[2.6113285382997242, 0.5671826930742893, 0.8590222014906757], [5.03902933950377, 0.16018920369712208, 0.9583454537352495], [11.4789053759408, 0.36565520897544895, 0.7131413844705553], [21.117699267547934, 0.2728581311672342, 1.6975256661513205], [26.619017356963166, 0.4516205709418511, 0.25000256331313664], [43.479188479354306, 0.6912680926184191, 0.25930147057688785], [47.539861684601135, 0.7406937434533853, 0.25776309148404697], [59.0519705897971, 0.19051212047636154, 0.5891706006992659], [61.88446027012917, 0.1328262445770502, 0.666736760874357], [64.48583937529854, 0.1332490864578026, 0.7985770552987213], [68.4596733789323, 0.6376563137525268, 0.2602549731333972], [70.44872971180945, 0.2916098760695937, 0.26184346555092397], [75.54796540086404, 0.17675208665218906, 5.9976801930269295]], "peak_params_": [[2.6113285382997242, 0.5286569201123613, 1.7180444029813513], [5.03902933950377, 0.17193304584268135, 1.916690907470499], [11.4789053759408, 0.2918399693476811, 1.4262827689411106], [21.117699267547934, 0.2722030428287676, 3.395051332302641], [26.619017356963166, 0.14208663365313756, 0.5000051266262733], [43.479188479354306, 0.12533383321767289, 0.5186029411537757], [47.539861684601135, 0.1505491331957367, 0.5155261829680939], [59.0519705897971, 0.1937134410586736, 1.1783412013985317], [61.88446027012917, 0.14567992070622848, 1.333473521748714], [64.48583937529854, 0.13929428689775003, 1.5971541105974425], [68.4596733789323, 0.21409566596346008, 0.5205099462667944], [70.44872971180945, 0.18238189684040118, 0.5236869311018479], [75.54796540086404, 0.17625079011256584, 11.995360386053859]], "r_squared_": 0.9861621809087247, "error_": 0.030865059885799694}
