{"freq_range": [2.0, 80.0], "freq_res": 1.0, "aperiodic_params_": [0.8960333277430472, 1.4508780535414576], "gaussian_params_": [[7.60437508002804, 0.5738312857561793, 1.620847991696797], [11.511186531625146, 0.3619959169017613, 0.5799768486491715], [18.39060085224664, 0.5244658731063837, 0.2544296497053194], [22.26259332305375, 0.16984213881236934, 1.809318610288092], [23.996448458241762, 0.07531203618858007, 0.2500000072680029], [31.195296486065644, 0.5440585969924994, 1.873952985488966], [33.46220604624779, 0.6385904338278827, 0.2786359631731936], [35.607037579692864, 0.5718619908905679, 0.26653337641386876], [62.59317594571236, 0.7720088982772344, 0.2614138502621996], [72.08256689992977, 0.15360039133228623, 3.2597269728886964], [76.53985985620994, 0.41299848516193155, 0.29606904916100857], [79.14351145317585, 0.2131561030157214, 0.7631952664689532]], "peak_params_": [[7.60437508002804, 0.5569896474938039, 3.241695983393594], [11.511186531625146, 0.26829221255552044, 1.159953697298343], [18.39060085224664, 0.17199957366688667, 0.5088592994106388], [22.26259332305375, 0.16806597826536918, 3.618637220576184], [23.996448458241762, 0.182753272342429, 0.5000000145360058], [31.195296486065644, 0.5411135491363475, 3.747905970977932], [33.46220604624779, 0.5035028030999837, 0.5572719263463872], [35.607037579692864, 0.21320771846654374, 0.5330667528277375], [62.59317594571236, 0.23315895914418894, 0.5228277005243992], [72.08256689992977, 0.1535511259139064, 6.519453945777393], [76.53985985620994, 0.1767954160760019, 0.5921380983220171], [79.14351145317585, 0.22558366765300963, 1.5263905329379064]], "r_squared_": 0.9934471427101131, "error_": 0.03534050259263693}
{"freq_range": [2.0, 80.0], "freq_res": 1.0, "aperiodic_params_": [1.0274029408706156, 1.442884012028844], "gaussian_params_": [[7.439547002984086, 0.4604113723814552, 1.4534610147910354], [11.519323291233848, 1.012246034126151, 0.2727050230420897], [31.14875992213351, 0.4428254852300217, 2.0718270926198503], [63.00224714083806, 0.18537596401183606, 0.2500024989505366], [69.14462863367571, 0.1490200459122298, 2.1933681093594126], [73.51795291938559, 0.6043324434780966, 0.2923822493969822], [76.17055004825615, 0.19427700917734156, 0.7962906333481297], [79.26463165663645, 0.30003757931279573, 0.7070546083566125]], "peak_params_": [[7.439547002984086, 0.43983218430326776, 2.906922029582071], [11.519323291233848, 0.21746534539177692, 0.5454100460841794], [31.14875992213351, 0.44168547734025165, 4.143654185239701], [63.00224714083806, 0.18831314747457406, 0.5000049979010732], [69.14462863367571, 0.14869643122312826, 4.386736218718825], [73.51795291938559, 0.17283928103096002, 0.5847644987939644], [76.17055004825615, 0.1910058663566372, 1.5925812666962593], [79.26463165663645, 0.28010024888886265, 1.414109216713225]], "r_squared_": 0.9911907575082887, "error_": 0.04036716023341508}
{"freq_range": [2.0, 80.0], "freq_res": 1.0, "aperiodic_params_": [0.8002695749273857, 1.400204910931705], "gaussian_params_": [[7.466489609269073, 0.5347645742908494, 1.5705734423215871], [11.515016704611678, 1.0400959954672884, 0.28578917809373583], [31.588632528624576, 0.49923261563367355, 1.8974858842376314], [36.3550831522035, 0.48883617197045715, 0.25000411452091187]], "peak_params_": [[7.466489609269073, 0.5116887661991537, 3.1411468846431743], [11.515016704611678, 0.254748687927834, 0.5715783561874717], [31.588632528624576, 0.4876372962023887, 3.794971768475263], [36.3550831522035, 0.2117545950536126, 0.5000082290418237]], "r_squared_": 0.9787760739408017, "error_": 0.06834087153998904}
{"freq_range": [2.0, 80.0], "freq_res": 1.0, "aperiodic_params_": [1.097940675749352, 1.462544459311397], "gaussian_params_": [[7.493413654916188, 0.6359157465355566, 1.4715204944035611], [11.504995291555575, 0.8584909386626034, 0.30242282084045247], [25.916791123168448, 0.5553844412073078, 2.2049805898897312], [31.868770186088756, 0.6502522070477676, 2.0716659756171807], [52.135573715613305, 0.24623858809747018, 2.503264202763506], [79.12581243131211, 0.2812665439411105, 0.6516275867240859]], "peak_params_": [[7.493413654916188, 0.6011533808475834, 2.9430409888071223], [11.504995291555575, 0.23073737436477515, 0.6048456416809049], [25.916791123168448, 0.5667499151705672, 4.4099611797794624], [31.868770186088756, 0.6613036101600701, 4.143331951234361], [52.135573715613305, 0.24587772264225416, 5.006528405527012], [79.12581243131211, 0.2760726247576115, 1.3032551734481719]], "r_squared_": 0.9877987156812567, "error_": 0.051877944175767673}
{"freq_range": [2.0, 80.0], "freq_res": 1.0, "aperiodic_params_": [1.0877443554727766, 1.5395392992274801], "gaussian_params_": [[7.513561409601554, 0.6589891254390957, 1.5094437435150267], [11.532688375876026, 1.0933440411085606, 0.28969572250350456], [14.54574465134361, 1.0893544324034166, 0.26238052802567363], [22.28726547119922, 0.18727576532333473, 1.9426278392534138], [31.249424254855878, 0.7781334828007099, 2.65937542447601], [63.376368816368064, 0.5982996644799281, 0.25000677781962183], [73.7277110949422, 0.19287198168292982, 0.6305727552025444], [79.43705999562422, 0.8228894758422238, 0.27216626361038637]], "peak_params_": [[7.513561409601554, 0.6256431484625131, 3.0188874870300535], [11.532688375876026, 0.30560725118600846, 0.5793914450070091], [14.54574465134361, 0.2435583375269561, 0.5247610560513473], [22.28726547119922, 0.18707702555367334, 3.8852556785068275], [31.249424254855878, 0.7747265339337464, 5.31875084895202], [63.376368816368064, 0.19265967610372758, 0.5000135556392437], [73.7277110949422, 0.17570313613454247, 1.2611455104050888], [79.43705999562422, 0.22665616070108618, 0.5443325272207727]], "r_squared_": 0.9906281250943724, "error_": 0.047979663629811535}
{"freq_range": [2.0, 80.0], "freq_res": 1.0, "aperiodic_params_": [0.9259096713056452, 1.4277589096788463], "gaussian_params_": [[6.256686127868763, 0.38536355893834257, 0.804517859393073], [8.243664642567888, 0.4232901328737729, 0.8876645798427428], [11.519633329976095, 1.3448724334580864, 0.2617444287859646], [14.57311778710985, 0.830945450656116, 0.2500025896085792], [23.103768909552542, 0.10152589422340737, 1.893830225603159], [30.828953443383543, 0.4229972772781557, 2.361482596348967], [63.20579759064355, 0.18873137502848852, 0.4601785508097935], [69.43587989694376, 0.2122418095437685, 1.466038637383626], [73.50780241035615, 0.7617137786111785, 0.276624356714547], [76.16859500812458, 0.1929503982702905, 0.7504267748780045], [79.35429154210155, 0.3490288580526598, 0.5268617285992507]], "peak_params_": [[6.256686127868763, 0.38359129384056556, 1.609035718786146], [8.243664642567888, 0.44447420174420205, 1.7753291596854857], [11.519633329976095, 0.2496851901435838, 0.5234888575719292], [14.57311778710985, 0.19341196309923148, 0.5000051792171584], [23.103768909552542, 0.10311007768640246, 3.787660451206318], [30.828953443383543, 0.4219061765051739, 4.722965192697934], [63.20579759064355, 0.17078516244529185, 0.920357101619587], [69.43587989694376, 0.20306521716544723, 2.932077274767252], [73.50780241035615, 0.16106447974073634, 0.553248713429094], [76.16859500812458, 0.18815119549713843, 1.500853549756009], [79.35429154210155, 0.27855549525139356, 1.0537234571985015]], "r_squared_": 0.9920764472237155, "error_": 0.0366390158773211}
{"freq_range": [2.0, 80.0], "freq_res": 1.0, "aperiodic_params_": [0.7690041414069831, 1.3922932863106428], "gaussian_params_": [[7.415334983122974, 0.5686870921420956, 1.664772751738553], [11.52004023524658, 0.8795840886307117, 0.30039226623340537], [14.597216169395963, 0.6436517923538148, 0.26465176093326337], [20.71394631714346, 0.11793208563149803, 2.3161547716584496], [25.575450856507775, 0.13834613012580968, 3.450271835355758], [31.152297148841292, 0.4489602344560149, 0.9667999121901395], [33.440446080270746, 0.5391063926837075, 0.4129937675114305], [36.13754695290534, 0.20558647684372608, 0.5778498674823042], [63.35640439966968, 0.5089123595023494, 0.26431296928516174]], "peak_params_": [[7.415334983122974, 0.551261470093178, 3.329545503477106], [11.52004023524658, 0.25841115997829145, 0.6007845324668107], [14.597216169395963, 0.2090531205148084, 0.5293035218665267], [20.71394631714346, 0.1744605677309472, 4.632309543316899], [25.575450856507775, 0.1460243424985277, 6.900543670711516], [31.152297148841292, 0.4836292185857146, 1.933599824380279], [33.440446080270746, 0.39123076876646157, 0.825987535022861], [36.13754695290534, 0.20128667884214257, 1.1556997349646083], [63.35640439966968, 0.2050307758357761, 0.5286259385703235]], "r_squared_": 0.9870215288808453, "error_": 0.04951734051446562}
{"freq_range": [2.0, 80.0], "freq_res": 1.0, "aperiodic_params_": [1.1028565233765433, 1.5618121560218845], "gaussian_params_": [[7.465080499891044, 0.6309917642331423, 1.4525377687425303], [11.378767952423566, 0.2899801850001046, 0.8120181078202081], [14.603233138290918, 0.5554163042652768, 0.26225156790243015], [22.413974580796484, 0.21880792218230916, 3.290447275970835], [25.95998019641406, 0.06721328455694542, 0.25000000726496463], [31.078799884681008, 0.6183923804265862, 1.6188876621625805], [33.50648956753029, 1.0980500455280071, 0.2913497163587019], [35.99118151329928, 0.3011787950794403, 0.6879477408951457], [63.01348187147424, 0.15721491729944348, 0.6236875371510993], [68.57153314216018, 0.521253274143015, 0.27494437861613225], [74.62123297703465, 0.12828317731018354, 2.757950618291464], [79.46057245229059, 0.5935804206763375, 0.27778863015650695]], "peak_params_": [[7.465080499891044, 0.5994665426191157, 2.9050755374850605], [11.378767952423566, 0.29327915112494596, 1.6240362156404162], [14.603233138290918, 0.19413919400626767, 0.5245031358048603], [22.413974580796484, 0.21708315673926448, 6.58089455194167], [25.95998019641406, 0.19168999440678003, 0.5000000145299293], [31.078799884681008, 0.6249302940427653, 3.237775324325161], [33.50648956753029, 0.38797869553800046, 0.5826994327174038], [35.99118151329928, 0.30728803406291116, 1.3758954817902913], [63.01348187147424, 0.15719608142148989, 1.2473750743021985], [68.57153314216018, 0.17084699210743737, 0.5498887572322645], [74.62123297703465, 0.12707907099880944, 5.515901236582928], [79.46057245229059, 0.18653367692163259, 0.5555772603130139]], "r_squared_": 0.9944310935238324, "error_": 0.0340175450165283}
{"freq_range": [2.0, 80.0], "freq_res": 1.0, "aperiodic_params_": [1.2094284842939211, 1.629937808291885], "gaussian_params_": [[7.501869894882308, 0.755536068106566, 1.4619868178510333], [11.487008309830884, 0.3466174012963573, 0.9223082000313103], [14.572992423463651, 0.7541296219954006, 0.27648016975470485], [22.574397829311334, 0.2731414709034204, 2.976643595115972], [31.701130349062254, 0.8168193604471127, 2.5971019857763444], [36.4244489362548, 0.7511033724243275, 0.2679966881332786]], "peak_params_": [[7.501869894882308, 0.7132036866316526, 2.9239736357020667], [11.487008309830884, 0.34481301936418357, 1.8446164000626206], [14.572992423463651, 0.23978549547890682, 0.5529603395094097], [22.574397829311334, 0.2733471831700647, 5.953287190231944], [31.701130349062254, 0.8132445373275538, 5.194203971552689], [36.4244489362548, 0.4218787722603664, 0.5359933762665572]], "r_squared_": 0.9927402445736506, "error_": 0.04521574479347581}
{"freq_range": [2.0, 80.0], "freq_res": 1.0, "aperiodic_params_": [1.3799806645641708, 1.7181521839153608], "gaussian_params_": [[7.608906461439127, 0.7608975942837106, 1.4411661214123048], [11.538875333552935, 0.3631267486714938, 0.7892434587029501], [14.596945743857363, 0.5906230404943497, 0.28093149649173393], [22.389908368690076, 0.24998803881037326, 2.4011680615786513], [31.56883395650886, 0.8979006153783052, 2.3819707521206324], [36.02928631776056, 0.2482554845613066, 0.6324661458771165], [39.086808499549335, 0.16243764961106147, 1.2772157262743147], [79.18959437102605, 0.19761474934699802, 0.6019730408328385]], "peak_params_": [[7.608906461439127, 0.7334052895303423, 2.8823322428246096], [11.538875333552935, 0.3135054832535649, 1.5784869174059002], [14.596945743857363, 0.21324630707600478, 0.5618629929834679], [22.389908368690076, 0.24699495942524785, 4.8023361231573025], [31.56883395650886, 0.8833935344194179, 4.763941504241265], [36.02928631776056, 0.4158743262607947, 1.264932291754233], [39.086808499549335, 0.16898142434654484, 2.5544314525486294], [79.18959437102605, 0.18805248964490473, 1.203946081665677]], "r_squared_": 0.9920796286212122, "error_": 0.04939959369293235}
{"freq_range": [2.0, 80.0], "freq_res": 1.0, "aperiodic_params_": [1.366017664566072, 1.700504990235807], "gaussian_params_": [[7.570297257094592, 0.7705579359108616, 1.4349626930552635], [11.579072251779378, 0.36967201211949385, 0.7803629679518155], [14.571318040095276, 0.9293680230116704, 0.2653981652824702], [19.452034600441642, 0.08882296075542442, 1.7150668663640196], [23.09524916770806, 0.26125379355202033, 1.3536485589949105], [31.433217600668716, 0.9216176025336761, 2.4877172031273354], [36.020663656182556, 0.2245508359332388, 0.6443622041339585], [39.08394279918468, 0.18871470556535186, 1.118257655334167], [79.1359902220276, 0.18413290579209488, 0.7095489555298632]], "peak_params_": [[7.570297257094592, 0.7367824075200589, 2.869925386110527], [11.579072251779378, 0.3261985450618085, 1.560725935903631], [14.571318040095276, 0.25522780839900583, 0.5307963305649404], [19.452034600441642, 0.08848318453178905, 3.4301337327280392], [23.09524916770806, 0.2740062052087764, 2.707297117989821], [31.433217600668716, 0.9077486965567416, 4.975434406254671], [36.020663656182556, 0.39956179742165143, 1.288724408267917], [39.08394279918468, 0.19721652768385245, 2.236515310668334], [79.1359902220276, 0.18078194019829197, 1.4190979110597264]], "r_squared_": 0.993542827769691, "error_": 0.045158420310112184}
{"freq_range": [2.0, 80.0], "freq_res": 1.0, "aperiodic_params_": [1.358402798000174, 1.7047163109138728], "gaussian_params_": [[7.576380449207153, 0.7982594747998709, 1.3681882465418493], [11.625958698751157, 0.3732747866386977, 0.685332815560217], [14.554332847832821, 0.9272091159251755, 0.2927558877352377], [19.45207409561066, 0.0797400098177112, 1.6434546102162861], [22.866623032964448, 0.2644453388041358, 1.3513394631031972], [31.318432924445567, 0.9638575646252714, 2.8946021937471755], [36.39084506613812, 0.35188183353805175, 0.29133411109367213], [79.21115822202349, 0.22215239496052827, 0.512190762778301]], "peak_params_": [[7.576380449207153, 0.76089972971933, 2.7363764930836987], [11.625958698751157, 0.3259119473104059, 1.370665631120434], [14.554332847832821, 0.29307386540755437, 0.5855117754704754], [19.45207409561066, 0.08130282176860137, 3.2869092204325723], [22.866623032964448, 0.286429411521552, 2.7026789262063944], [31.318432924445567, 0.9580428627348617, 5.789204387494351], [36.39084506613812, 0.40369275837815777, 0.5826682221873443], [79.21115822202349, 0.20405355375033696, 1.024381525556602]], "r_squared_": 0.991702832510991, "error_": 0.051329180699500654}
{"freq_range": [2.0, 80.0], "freq_res": 1.0, "aperiodic_params_": [1.4657271128305354, 1.7497904695510282], "gaussian_params_": [[7.692580424137081, 0.7490434480187195, 1.3960512519039263], [11.442767860225496, 0.3269284602973879, 0.882834516814872], [15.08505452544528, 0.15198608348846596, 0.6038765452602566], [19.452036932022256, 0.0915524887097363, 2.376051320345327], [23.132727830763784, 0.22324858710129855, 1.3408182280097347], [30.843522840425738, 0.45855370155440933, 1.0639718035476797], [32.847303384707146, 0.4319572028064444, 3.584532389770834], [33.40535863997214, 0.5854522832265042, 0.27928558515787166], [79.39210930989971, 0.6029952823208349, 0.263165383285278]], "peak_params_": [[7.692580424137081, 0.7312647694858335, 2.7921025038078526], [11.442767860225496, 0.3337159712752117, 1.765669033629744], [15.08505452544528, 0.16640987507982818, 1.2077530905205132], [19.452036932022256, 0.09209007663946545, 4.752102640690654], [23.132727830763784, 0.262106526793066, 2.6816364560194694], [30.843522840425738, 0.8318630358753629, 2.1279436070953595], [32.847303384707146, 0.694558953106179, 7.169064779541668], [33.40535863997214, 0.694558953106179, 0.5585711703157433], [79.39210930989971, 0.19872056363998203, 0.526330766570556]], "r_squared_": 0.9937414341175176, "error_": 0.04455395532619267}
{"freq_range": [2.0, 80.0], "freq_res": 1.0, "aperiodic_params_": [1.0240114319448799, 1.478702559174061], "gaussian_params_": [[7.425633805230898, 0.5902114946802963, 1.413131360006014], [11.543112818226255, 1.2809803889321758, 0.2633811016147966], [14.548385399823525, 1.3113126172670382, 0.2645409935096585], [30.77491566766116, 0.6268891091023485, 3.060781419320561], [68.93786761571592, 0.22361985540735616, 1.133931500852373]], "peak_params_": [[7.425633805230898, 0.5640373700105842, 2.826262720012028], [11.543112818226255, 0.28764658566931467, 0.5267622032295932], [14.548385399823525, 0.30538880953756076, 0.529081987019317], [30.77491566766116, 0.6251963326508149, 6.121562838641122], [68.93786761571592, 0.2232844138780128, 2.267863001704746]], "r_squared_": 0.986734753951676, "error_": 0.055561923077862785}
{"freq_range": [2.0, 80.0], "freq_res": 1.0, "aperiodic_params_": [0.9241416676852771, 1.4570350947973048], "gaussian_params_": [[7.273271703198218, 0.44129018942096165, 1.6210977665204997], [11.542209154601803, 1.3636333549289614, 0.2500074305186553], [14.533742693513132, 1.22798767569698, 0.2533159127107924], [30.58941635365679, 0.3890278512406577, 2.8237625832545343], [69.31817490526281, 0.22310185253291986, 0.2500192782089721], [70.25641653102639, 0.09454035816429841, 5.999999999999999], [76.49895913126547, 0.7364724958072434, 0.25938126876186707], [79.4460695626289, 0.9825116535535824, 0.25964865092732564]], "peak_params_": [[7.273271703198218, 0.4350645558177963, 3.2421955330409995], [11.542209154601803, 0.26133143575112006, 0.5000148610373106], [14.533742693513132, 0.22570340594809368, 0.5066318254215848], [30.58941635365679, 0.3849370895154989, 5.647525166509069], [69.31817490526281, 0.1917628931597768, 0.5000385564179441], [70.25641653102639, 0.09986876870128758, 11.999999999999998], [76.49895913126547, 0.17556636460273634, 0.5187625375237341], [79.4460695626289, 0.2573115412216309, 0.5192973018546513]], "r_squared_": 0.9900012466212906, "error_": 0.043719987533732484}
{"freq_range": [2.0, 80.0], "freq_res": 1.0, "aperiodic_params_": [0.810810119150415, 1.4229432754236508], "gaussian_params_": [[7.52166504901069, 0.49226964820498365, 1.7214431508698396], [11.52008365482659, 1.0196032073161625, 0.2805601470027285], [14.568060231409461, 0.6719605334426015, 0.2500091333358274], [18.442449414470417, 0.7000310567319011, 0.26805611697074], [23.583185623223013, 0.14388004727075399, 2.6548954720418765], [32.04570061633684, 0.29168515204662054, 1.6927023275925699], [36.47223582135141, 0.8062726481200669, 0.25914801541288335], [62.96245082878098, 0.18328118230164775, 0.7688938323265254], [68.50445674438208, 0.7599516861275307, 0.27374435086228444], [70.89388294599264, 0.20589053864981927, 0.8132905074190436], [77.13988792375098, 0.1815524174108788, 2.54378983454851]], "peak_params_": [[7.52166504901069, 0.47362751055761204, 3.442886301739679], [11.52008365482659, 0.2527815677819257, 0.561120294005457], [14.568060231409461, 0.15188103983134227, 0.5000182666716548], [18.442449414470417, 0.19503680621684572, 0.53611223394148], [23.583185623223013, 0.142121337828641, 5.309790944083753], [32.04570061633684, 0.2925240049847926, 3.3854046551851398], [36.47223582135141, 0.17230638971951917, 0.5182960308257667], [62.96245082878098, 0.1830627954739994, 1.5377876646530508], [68.50445674438208, 0.16240494015871332, 0.5474887017245689], [70.89388294599264, 0.21400673781083457, 1.6265810148380873], [77.13988792375098, 0.18127810735010574, 5.08757966909702]], "r_squared_": 0.9926125778001633, "error_": 0.03215881519265942}
{"freq_range": [2.0, 80.0], "freq_res": 1.0, "aperiodic_params_": [0.9172177208424018, 1.4537473186053405], "gaussian_params_": [[7.413914130883595, 0.6290806200504349, 1.5955424089801666], [11.486054026655392, 0.25016837667987807, 0.8775663733328184], [14.581651939979396, 0.5778513898538366, 0.28997905399838336], [18.16949152877024, 0.12084998776568834, 0.607194949698071], [20.170794677159627, 0.09516354885399218, 1.4400590787896157], [24.305548784547813, 0.19746998307562602, 2.907761917959749], [31.034526203791046, 0.540266631992173, 1.0747141620398954], [33.468231964157425, 0.9266128156678801, 0.3296998302363702], [35.90762911356765, 0.2211790517532917, 0.8203651093243359], [63.047322392404425, 0.14085521123357977, 0.857782676074521]], "peak_params_": [[7.413914130883595, 0.6082653208763651, 3.1910848179603333], [11.486054026655392, 0.26492428981469746, 1.7551327466656368], [14.581651939979396, 0.2055283886778425, 0.5799581079967667], [18.16949152877024, 0.1655930190100352, 1.214389899396142], [20.170794677159627, 0.16176011206505003, 2.8801181575792314], [24.305548784547813, 0.1991567753649247, 5.815523835919498], [31.034526203791046, 0.5539363045461565, 2.149428324079791], [33.468231964157425, 0.4421552332780764, 0.6593996604727403], [35.90762911356765, 0.21985461998203526, 1.6407302186486719], [63.047322392404425, 0.14064102509535692, 1.715565352149042]], "r_squared_": 0.9898925080178634, "error_": 0.04033923728320939}
{"freq_range": [2.0, 80.0], "freq_res": 1.0, "aperiodic_params_": [1.3393569213535235, 1.7086981053369426], "gaussian_params_": [[7.495743276793645, 0.7388502407963933, 1.38751312815279], [11.340947869589547, 0.3066103668426203, 1.036431677328709], [14.762379075260142, 0.19571584443923232, 0.5860339889505423], [22.125552052357907, 0.26395697994649236, 3.0758160028192485], [30.83748797745183, 0.4177417795987301, 0.9077663019821635], [32.7844724163534, 0.4436477689731473, 3.544124415785044], [33.41993561613545, 0.8070023315787573, 0.2529552392601952], [79.13476068496075, 0.1633355725289955, 0.6042078071897051]], "peak_params_": [[7.495743276793645, 0.6932136621231234, 2.77502625630558], [11.340947869589547, 0.32128452717793277, 2.072863354657418], [14.762379075260142, 0.19891140687668413, 1.1720679779010845], [22.125552052357907, 0.26806628110734865, 6.151632005638497], [30.83748797745183, 0.8060417232019674, 1.815532603964327], [32.7844724163534, 0.6712369785799729, 7.088248831570088], [33.41993561613545, 0.6712369785799729, 0.5059104785203904], [79.13476068496075, 0.15932307586740646, 1.2084156143794103]], "r_squared_": 0.9932701372084243, "error_": 0.0443690839811847}
{"freq_range": [2.0, 80.0], "freq_res": 1.0, "aperiodic_params_": [1.2650650340374154, 1.6426434646866541], "gaussian_params_": [[7.546927325212388, 0.7341112718480071, 1.3187339450364044], [11.638376990990336, 0.410161971148599, 0.48317996945255], [14.540789367155437, 1.3335827368624404, 0.26670040751356533], [22.258722002102743, 0.22924346258059924, 1.7198038281375787], [31.209296590075635, 0.9282180683671103, 3.0227643664753936], [79.43185212628484, 0.8584046249444928, 0.278805627852463]], "peak_params_": [[7.546927325212388, 0.6920385608611714, 2.637467890072809], [11.638376990990336, 0.3124255977736068, 0.9663599389051], [14.540789367155437, 0.30289717668994487, 0.5334008150271307], [22.258722002102743, 0.23561927333067878, 3.4396076562751574], [31.209296590075635, 0.9259962667173078, 6.045528732950787], [79.43185212628484, 0.2586495153171593, 0.557611255704926]], "r_squared_": 0.9911986669957384, "error_": 0.05221588550622637}
{"freq_range": [2.0, 80.0], "freq_res": 1.0, "aperiodic_params_": [1.487486393473137, 1.7806642160189183], "gaussian_params_": [[7.751793579996137, 0.779093956138748, 1.4357553276221044], [11.569095360511799, 0.33733480080865685, 0.8827444855499942], [14.74797995193662, 0.2630187725140181, 0.47987483141134946], [22.51527453342791, 0.19809391608832025, 2.0484793573734223], [23.56917153503543, 0.29173562956280447, 0.28607402678011606], [31.527219981873294, 0.8722768493088418, 2.3995689193319443], [35.99169096476501, 0.23233233070516532, 0.6279794458623449], [38.84881018512569, 0.15316852893236074, 1.2827197543051108], [79.11065250870637, 0.2128208844939006, 0.4819126056714564]], "peak_params_": [[7.751793579996137, 0.7676337000900897, 2.871510655244209], [11.569095360511799, 0.3092299799543601, 1.7654889710999884], [14.74797995193662, 0.22955269344970564, 0.9597496628226989], [22.51527453342791, 0.23451428787507977, 4.096958714746845], [23.56917153503543, 0.2525626374440675, 0.5721480535602321], [31.527219981873294, 0.8555138367472255, 4.7991378386638885], [35.99169096476501, 0.39884293810060545, 1.2559588917246898], [38.84881018512569, 0.1589448227647261, 2.5654395086102215], [79.11065250870637, 0.20728408701770196, 0.9638252113429128]], "r_squared_": 0.9935539483968485, "error_": 0.045188308301803856}
{"freq_range": [2.0, 80.0], "freq_res": 1.0, "aperiodic_params_": [1.4337270877805364, 1.7445839508304744], "gaussian_params_": [[7.758109273711317, 0.8189041357635181, 1.3812152751473075], [11.620564681699122, 0.3055981851634258, 0.8824390129058293], [14.549941822696981, 0.9351969870155226, 0.29665926758616024], [17.991824930938414, 0.1454458261079441, 0.2500000007034826], [22.277265436343647, 0.22701470190298392, 1.5828230480120755], [24.06819226155881, 0.11948948923961243, 0.4572686479809511], [31.29319285001264, 0.8544596779059729, 2.7595163477905214], [36.057709977545485, 0.1554272618658079, 0.49016920118662544], [79.43916136621945, 0.7203496765985282, 0.27589708849351696]], "peak_params_": [[7.758109273711317, 0.8065095497075923, 2.762430550294615], [11.620564681699122, 0.28594464326111624, 1.7648780258116585], [14.549941822696981, 0.2960939722100301, 0.5933185351723205], [17.991824930938414, 0.15126908421175467, 0.5000000014069652], [22.277265436343647, 0.22650672817883444, 3.165646096024151], [24.06819226155881, 0.2697155012288168, 0.9145372959619023], [31.29319285001264, 0.8496504860525943, 5.519032695581043], [36.057709977545485, 0.35385586894127674, 0.9803384023732509], [79.43916136621945, 0.2029359014743255, 0.5517941769870339]], "r_squared_": 0.9940002949576479, "error_": 0.04300496978812997}
{"freq_range": [2.0, 80.0], "freq_res": 1.0, "aperiodic_params_": [1.2537464519603179, 1.6292583067250594], "gaussian_params_": [[7.711087022927171, 0.7480422901180211, 1.4025457007513464], [11.669941284155886, 0.3306668135613929, 0.5563236779241133], [14.525440946102796, 1.3981182781550539, 0.275658652679601], [21.9783550038135, 0.20662522988437404, 2.1061883782766038], [31.008818095060008, 0.8443134287789715, 3.027364711634394], [68.76025012320993, 0.18766298374734824, 0.7038203248969902], [79.42588603917957, 0.5482151729919797, 0.30156038473685837]], "peak_params_": [[7.711087022927171, 0.7323387601739458, 2.805091401502693], [11.669941284155886, 0.2842798472283802, 1.1126473558482266], [14.525440946102796, 0.3185285218063036, 0.551317305359202], [21.9783550038135, 0.2166972554930371, 4.2123767565532075], [31.008818095060008, 0.8443312795573449, 6.054729423268788], [68.76025012320993, 0.17708496707722543, 1.4076406497939804], [79.42588603917957, 0.2022305212143467, 0.6031207694737167]], "r_squared_": 0.9935677149081925, "error_": 0.041532176478317966}
{"freq_range": [2.0, 80.0], "freq_res": 1.0, "aperiodic_params_": [0.9804026107212094, 1.434644241403298], "gaussian_params_": [[7.5421164304737545, 0.5307818620207941, 1.4211649425613153], [11.557158997661642, 0.9185050721359534, 0.27987178695788156], [14.51628124131315, 0.8897876271719496, 0.2836315931998072], [30.681591441726052, 0.5344139164488387, 2.535049588012376], [64.02312329440353, 0.16821529608076208, 0.7051059304544401], [69.24959581010215, 0.152834668646698, 1.4758640962795957], [75.84204529380476, 0.17909219968317414, 1.5201892074314525], [79.45074195843617, 0.9411173514658895, 0.2875055835992957]], "peak_params_": [[7.5421164304737545, 0.5039355017769707, 2.8423298851226306], [11.557158997661642, 0.26654883076411173, 0.5597435739157631], [14.51628124131315, 0.20782785365272727, 0.5672631863996144], [30.681591441726052, 0.5302150449889922, 5.070099176024752], [64.02312329440353, 0.16839831561896568, 1.4102118609088803], [69.24959581010215, 0.15067175686598788, 2.9517281925591914], [75.84204529380476, 0.17813242882474634, 3.040378414862905], [79.45074195843617, 0.296073085260677, 0.5750111671985914]], "r_squared_": 0.9907147156127931, "error_": 0.04374772733473059}
{"freq_range": [2.0, 80.0], "freq_res": 1.0, "aperiodic_params_": [0.469662720624216, 1.0209433844431628], "gaussian_params_": [[5.764734207506591, 0.4080640739077302, 3.0990918400418455], [11.661559104445027, 0.6447800377361003, 0.2500922628358862], [14.424390792402724, 0.5670307989811197, 0.2602934294429151], [30.353401790534324, 0.22678465825781502, 1.3110141853405886], [51.410257941508235, 0.17283656403406525, 1.408651330819009], [55.43464522258925, 0.15336370134115815, 1.6696560013789288], [58.21009070453172, 0.21968379102456728, 0.7181998015303553], [63.40574127364897, 0.1512117823869231, 4.001834267981434], [74.09593080168418, 0.32068576271952537, 5.999999999998049]], "peak_params_": [[5.764734207506591, 0.4068899295812684, 6.198183680083691], [11.661559104445027, 0.3119899361017783, 0.5001845256717724], [14.424390792402724, 0.16204393728519317, 0.5205868588858302], [30.353401790534324, 0.2186929388140928, 2.622028370681177], [51.410257941508235, 0.17159896965722288, 2.817302661638018], [55.43464522258925, 0.17366589605301042, 3.3393120027578576], [58.21009070453172, 0.3270952841130592, 1.4363996030607107], [63.40574127364897, 0.20844325296759503, 8.003668535962868], [74.09593080168418, 0.3251916897022915, 11.999999999996097]], "r_squared_": 0.9797178896376973, "error_": 0.04277056337800619}
{"freq_range": [2.0, 80.0], "freq_res": 1.0, "aperiodic_params_": [0.46632119696845553, 0.8596600758094044], "gaussian_params_": [[3.4521976330890864, 0.14208416409876382, 3.782638672766022], [7.621869735971972, 0.33598567418917225, 0.4525167520996723], [11.603532335640285, 0.5609577499744463, 0.26270270259310097], [18.805810597925138, 0.3147634838440108, 0.8368006249205664], [32.70544875802746, 0.11645153587440843, 1.4417796454831018], [36.47232481876136, 0.23710603538163555, 0.28665888496944847], [40.02414307578577, 0.13501289915345605, 3.6791331834957988], [50.35666491164173, 0.38412940075910357, 0.26759507218194256], [52.59540380272631, 0.3625563373920125, 0.369594735494684], [56.57751523770818, 0.18663184574085034, 1.4433913766517705], [62.85683849608558, 0.16683899542619363, 1.3204929126131866], [68.36654750357084, 0.4690239250107894, 0.26440804539169205], [76.39742967963494, 0.32571559737339295, 0.34782247717777326]], "peak_params_": [[3.4521976330890864, 0.14107251053199407, 7.565277345532044], [7.621869735971972, 0.3059422585996008, 0.9050335041993446], [11.603532335640285, 0.1906745685823581, 0.5254054051862019], [18.805810597925138, 0.30643163385743266, 1.6736012498411328], [32.70544875802746, 0.13586764913497518, 2.8835592909662036], [36.47232481876136, 0.1438008621728435, 0.5733177699388969], [40.02414307578577, 0.13501031410314956, 7.3582663669915975], [50.35666491164173, 0.1614461974392346, 0.5351901443638851], [52.59540380272631, 0.2080555949078121, 0.739189470989368], [56.57751523770818, 0.17881796775204406, 2.886782753303541], [62.85683849608558, 0.16587074068573437, 2.640985825226373], [68.36654750357084, 0.17950792689268136, 0.5288160907833841], [76.39742967963494, 0.16956424279488813, 0.6956449543555465]], "r_squared_": 0.9800544846282323, "error_": 0.03438794708888588}
{"freq_range": [2.0, 80.0], "freq_res": 1.0, "aperiodic_params_": [0.9632638729301252, 1.4623347209854507], "gaussian_params_": [[7.607511448107595, 0.5000135455207276, 1.7020979755596641], [11.634689258069223, 0.46795308076505554, 0.501798468992535], [14.745801866384452, 0.1428076192187389, 0.6009723429922837], [18.291931472066874, 0.18782090567047494, 0.6324130719638594], [19.55995951921497, 0.4279989345253243, 0.29346920053491793], [22.640039894326254, 0.19022519004775398, 1.470264736225642], [25.417239400120224, 0.1654721409738411, 0.620470586200487], [30.539833219614806, 1.128937334458037, 0.2912480410738321], [33.14100161063157, 0.2358522893019957, 1.1404302716571637], [62.85473556038106, 0.14495718067850935, 1.1228420554842082], [69.08961029600452, 0.11546066397805697, 1.3460198242056665], [76.2730887218005, 0.16260153440265332, 0.9460060795549623]], "peak_params_": [[7.607511448107595, 0.4868952823305489, 3.4041959511193283], [11.634689258069223, 0.376922752316501, 1.00359693798507], [14.745801866384452, 0.1306280424733951, 1.2019446859845675], [18.291931472066874, 0.17014693367528666, 1.2648261439277189], [19.55995951921497, 0.18190427741832604, 0.5869384010698359], [22.640039894326254, 0.18469246499327985, 2.940529472451284], [25.417239400120224, 0.18444408873420004, 1.240941172400974], [30.539833219614806, 0.3645238582822584, 0.5824960821476642], [33.14100161063157, 0.23405647217251735, 2.2808605433143274], [62.85473556038106, 0.14375330620319238, 2.2456841109684165], [69.08961029600452, 0.11520512408705796, 2.692039648411333], [76.2730887218005, 0.15596588200691275, 1.8920121591099246]], "r_squared_": 0.995024987352587, "error_": 0.028971209168034622}
{"freq_range": [2.0, 80.0], "freq_res": 1.0, "aperiodic_params_": [1.3085174983877783, 1.6914379849771564], "gaussian_params_": [[7.845274396626299, 0.6007216368320499, 1.6543470710926336], [19.15564140718033, 0.1434358425745788, 5.942002363812083], [21.988133904235728, 0.12161149564943585, 0.2502094135838265], [24.11875531261009, 0.13436149982952392, 1.0230588616163785], [30.683105644904224, 0.4213097699413648, 0.6501988682648472], [33.45203459913595, 0.3264137588997314, 2.3630085301266903]], "peak_params_": [[7.845274396626299, 0.622719392421071, 3.308694142185267], [19.15564140718033, 0.14338714052151302, 11.884004727624166], [21.988133904235728, 0.26512314439440776, 0.500418827167653], [24.11875531261009, 0.23644769268235977, 2.046117723232757], [30.683105644904224, 0.584325001339388, 1.3003977365296944], [33.45203459913595, 0.33073573280718804, 4.726017060253381]], "r_squared_": 0.9913827929774733, "error_": 0.048672186699787685}
{"freq_range": [2.0, 80.0], "freq_res": 1.0, "aperiodic_params_": [1.4984041373188415, 1.7965494256994747], "gaussian_params_": [[7.7628242876491855, 0.7234655749895027, 1.339670901694557], [11.14525954199915, 0.22417204075988043, 1.0740534047263304], [19.452034599139356, 0.08489000490747672, 4.7204003063596405], [23.26298806260411, 0.18211671996333398, 1.5449915360044408], [30.801771210787784, 0.5029393252127252, 1.0882451303630984], [33.41440165600767, 0.6783733544930264, 0.2713670795378755], [33.99979500216622, 0.24996429536108816, 2.745501454814862], [79.05180576704282, 0.10181002428725257, 5.286243405512789]], "peak_params_": [[7.7628242876491855, 0.7197699079691942, 2.679341803389114], [11.14525954199915, 0.27825804408079197, 2.1481068094526607], [19.452034599139356, 0.08854872252767698, 9.440800612719281], [23.26298806260411, 0.2435793130544004, 3.0899830720088817], [30.801771210787784, 0.6365312240051142, 2.176490260726197], [33.41440165600767, 0.5120837862580503, 0.542734159075751], [33.99979500216622, 0.32350757243142303, 5.491002909629724], [79.05180576704282, 0.10180513537748648, 10.572486811025579]], "r_squared_": 0.9943620678926028, "error_": 0.04318150721268001}
{"freq_range": [2.0, 80.0], "freq_res": 1.0, "aperiodic_params_": [1.4942994306219022, 1.7860004889656436], "gaussian_params_": [[7.861895760205591, 0.756439679303716, 1.3569953875884226], [11.36723201049836, 0.25251798725947744, 1.121129010457819], [14.590021906771511, 0.4980684399718239, 0.28650846119972095], [19.4520345998026, 0.0719943189068802, 1.6518476225057448], [23.299775094195383, 0.22717012955439997, 1.540757450561875], [30.77472231350102, 0.5228276811383702, 1.3441707354544399], [33.42684979067287, 0.6645058907288741, 0.2746776000894591], [34.19707526052271, 0.2369513007503178, 2.664191764632343], [78.96945788562935, 0.23435883035434082, 0.6087051471807378]], "peak_params_": [[7.861895760205591, 0.7553088635564378, 2.7139907751768453], [11.36723201049836, 0.2915087467847698, 2.242258020915638], [14.590021906771511, 0.18215076350543247, 0.5730169223994419], [19.4520345998026, 0.07397463858194275, 3.3036952450114896], [23.299775094195383, 0.23011539405506998, 3.08151490112375], [30.77472231350102, 0.6308713886666283, 2.6883414709088798], [33.42684979067287, 0.5456658057219008, 0.5493552001789181], [34.19707526052271, 0.3410327953471357, 5.328383529264686], [78.96945788562935, 0.2340640067431412, 1.2174102943614755]], "r_squared_": 0.9934063217150723, "error_": 0.04542727279799625}
{"freq_range": [2.0, 80.0], "freq_res": 1.0, "aperiodic_params_": [1.3782008126434016, 1.592915078302511], "gaussian_params_": [[8.153311467509688, 0.6429214158669565, 1.8233413783527617], [21.271021111032002, 0.16501188180798876, 2.4230539768259662], [31.27762767056464, 0.48214753814097167, 2.138813454092974], [79.10998133159387, 0.2890684962081875, 0.4868510375702848]], "peak_params_": [[8.153311467509688, 0.6406527833737602, 3.6466827567055233], [21.271021111032002, 0.16398756737534992, 4.8461079536519325], [31.27762767056464, 0.47815478608437645, 4.277626908185948], [79.10998133159387, 0.281785878260322, 0.9737020751405696]], "r_squared_": 0.990517935044748, "error_": 0.05033626693050381}
{"freq_range": [2.0, 80.0], "freq_res": 1.0, "aperiodic_params_": [1.2135350016882032, 1.5942677257117661], "gaussian_params_": [[7.947043861775317, 0.6958470466603066, 1.4953356228704369], [11.63566662923632, 0.5240707823251095, 0.7036287521793274], [14.509933255653394, 0.9148159404233679, 0.3004684915449714], [18.044652775843005, 0.14347251526106666, 0.25000000126431005], [22.114450497489468, 0.23443758672586437, 2.0782321396699124], [30.861828919374176, 0.5329509901789591, 2.3562992671049847], [68.97136723318647, 0.14151574490231464, 1.2867454804281955], [79.44158415834511, 0.77836282332215, 0.2927569086920036]], "peak_params_": [[7.947043861775317, 0.6954116649149287, 2.9906712457408737], [11.63566662923632, 0.4759961987405204, 1.4072575043586548], [14.509933255653394, 0.24260977703105713, 0.6009369830899428], [18.044652775843005, 0.17423236113946117, 0.5000000025286201], [22.114450497489468, 0.23453447935660687, 4.156464279339825], [30.861828919374176, 0.532060642078509, 4.712598534209969], [68.97136723318647, 0.1414807131117246, 2.573490960856391], [79.44158415834511, 0.24953791850289786, 0.5855138173840072]], "r_squared_": 0.9932990705602525, "error_": 0.04190677480455785}
{"freq_range": [2.0, 80.0], "freq_res": 1.0, "aperiodic_params_": [0.8444538690208171, 1.1815007414564132], "gaussian_params_": [[7.493899739912741, 0.3425163871455821, 1.5897633318622344], [11.528027291066305, 2.0699420346072688, 0.2500069943867671], [28.554267837885178, 0.6515236166920223, 0.2688085410593612], [30.595431747614985, 0.27236635496524053, 0.8961192867073431], [59.67987654433219, 0.11581736017887148, 1.5457388049095802], [64.47953318730701, 0.7123226834352503, 0.26723924727307286], [68.87090244780893, 0.16606342933945567, 0.6351467744712859], [71.37614763779574, 0.47343347854724677, 0.2500133488646015], [79.46107812167094, 1.0003360372424217, 0.25776572783827695]], "peak_params_": [[7.493899739912741, 0.3263792409854297, 3.179526663724469], [11.528027291066305, 0.35455290201407924, 0.5000139887735342], [28.554267837885178, 0.22059583701856245, 0.5376170821187224], [30.595431747614985, 0.24597670693675955, 1.7922385734146862], [59.67987654433219, 0.1133600613887511, 3.0914776098191603], [64.47953318730701, 0.1447257417980563, 0.5344784945461457], [68.87090244780893, 0.16266831935896264, 1.2702935489425717], [71.37614763779574, 0.15326634603576395, 0.500026697729203], [79.46107812167094, 0.20200253097525644, 0.5155314556765539]], "r_squared_": 0.9870960312612908, "error_": 0.04100017822896205}
{"freq_range": [2.0, 80.0], "freq_res": 1.0, "aperiodic_params_": [0.2611907349620809, 0.6893760292220273], "gaussian_params_": [[9.452034599135944, 0.32675069255790257, 5.852258618859401], [52.72931510486756, 0.18759072953439526, 4.47337986185379], [63.09593080172811, 0.2527666789877, 5.999999999999999], [76.22380575847663, 0.34038729335824747, 5.999999999999999]], "peak_params_": [[9.452034599135944, 0.32577741827664275, 11.704517237718802], [52.72931510486756, 0.24880032996347057, 8.94675972370758], [63.09593080172811, 0.2961831698264984, 11.999999999999998], [76.22380575847663, 0.36517290051516604, 11.999999999999998]], "r_squared_": 0.8534378556658406, "error_": 0.08475306149983375}
{"freq_range": [2.0, 80.0], "freq_res": 1.0, "aperiodic_params_": [0.5153695640295282, 0.9197844500220926], "gaussian_params_": [[2.445378348090711, 0.5074609035784645, 0.33657324320226256], [7.039706992430219, 0.2937738838776876, 1.5503243433101719], [11.549406889221633, 0.36029703733854457, 0.3188016533431728], [50.34002277385, 0.13059010335700685, 1.2437001327574246], [58.01173399104492, 0.11168343673051184, 0.2500014180435454], [61.887108519373314, 0.14824888716116433, 5.114564106465879], [69.0182061685673, 0.09619879499855988, 0.2500019737468833], [72.08530064134342, 0.14266081963169241, 0.25112065995328653], [74.1375663524141, 0.2617234171469021, 0.8403697014930662], [78.38207898803074, 0.16914432388241085, 1.3026722779903586]], "peak_params_": [[2.445378348090711, 0.21292049069154562, 0.6731464864045251], [7.039706992430219, 0.29367754516857286, 3.1006486866203438], [11.549406889221633, 0.13445739221715902, 0.6376033066863456], [50.34002277385, 0.13575405377068117, 2.4874002655148493], [58.01173399104492, 0.2226222675327485, 0.5000028360870908], [61.887108519373314, 0.14821277831294277, 10.229128212931759], [69.0182061685673, 0.15230919475743598, 0.5000039474937666], [72.08530064134342, 0.16595729250230473, 0.5022413199065731], [74.1375663524141, 0.2678053286177279, 1.6807394029861324], [78.38207898803074, 0.1630669132012832, 2.605344555980717]], "r_squared_": 0.9834880085173389, "error_": 0.03297916217620431}
{"freq_range": [2.0, 80.0], "freq_res": 1.0, "aperiodic_params_": [1.0027598390351506, 1.4614828274165284], "gaussian_params_": [[7.6924209340846295, 0.4569252163894977, 1.5422851321050477], [11.655764550026618, 0.5042648366045954, 0.6466750513662058], [18.166471921369858, 0.13158115490094313, 2.2171043927236416], [20.052459831550692, 0.06250201090803259, 0.2501715570422724], [22.883387424845253, 0.22246710478905454, 0.8143136743170254], [25.420879649702673, 0.40183171703892, 0.28850568298206103], [30.92035093554291, 0.23580574917815914, 0.7306517029826736], [62.34662586816116, 0.18247671779017524, 1.0945749766172594], [68.11914933147222, 0.14172791727437592, 0.9109153082271655]], "peak_params_": [[7.6924209340846295, 0.4479320463560281, 3.0845702642100954], [11.655764550026618, 0.44964679638896216, 1.2933501027324117], [18.166471921369858, 0.131210766590798, 4.434208785447283], [20.052459831550692, 0.15503660407753894, 0.5003431140845448], [22.883387424845253, 0.23241905144343467, 1.6286273486340508], [25.420879649702673, 0.147376629497891, 0.5770113659641221], [30.92035093554291, 0.23440882383206763, 1.4613034059653471], [62.34662586816116, 0.17355259184997762, 2.189149953234519], [68.11914933147222, 0.1405209637910405, 1.821830616454331]], "r_squared_": 0.990022266628451, "error_": 0.04067942912897835}
{"freq_range": [2.0, 80.0], "freq_res": 1.0, "aperiodic_params_": [1.3109597092871963, 1.69906326658186], "gaussian_params_": [[7.806536124697995, 0.6195665146818349, 1.4432286632325235], [11.541871819108271, 0.3473116406816256, 1.0027097387221156], [19.835472718370823, 0.19779353817865317, 3.454459282751067], [22.41569021703513, 0.6312443350548708, 0.2500023947523008], [24.487814632018274, 0.19197382887279446, 0.8897339958300693], [30.536616994511586, 1.2580584265876913, 0.2681003454274187], [33.15553766205054, 0.21418669576000457, 1.9793632978203581], [76.86974657588043, 0.19322920130900045, 1.0146704118360519], [79.42648996245116, 0.7677679638595274, 0.25820398629593494]], "peak_params_": [[7.806536124697995, 0.6152618316734246, 2.886457326465047], [11.541871819108271, 0.33708571148371913, 2.005419477444231], [19.835472718370823, 0.1975699036085926, 6.908918565502134], [22.41569021703513, 0.32482235621237854, 0.5000047895046016], [24.487814632018274, 0.26082444500452684, 1.7794679916601386], [30.536616994511586, 0.401937074445577, 0.5362006908548373], [33.15553766205054, 0.21366531536245748, 3.9587265956407163], [76.86974657588043, 0.19164363969732867, 2.0293408236721038], [79.42648996245116, 0.21756814631914767, 0.5164079725918699]], "r_squared_": 0.9931386606299694, "error_": 0.04088189041285028}
{"freq_range": [2.0, 80.0], "freq_res": 1.0, "aperiodic_params_": [1.4120653543415245, 1.760659681664587], "gaussian_params_": [[8.078017797279045, 0.6680566444489032, 1.6075554626524315], [17.45203473158548, 0.1331457344312027, 4.928663237811853], [21.983845577182088, 0.20416155067746639, 0.25024754828291146], [24.227560923354435, 0.17691510121525394, 1.0552746675496016], [31.864893722402204, 0.35906219219531144, 1.942678220919123], [75.87308664469441, 0.11694168761026838, 5.9999994376639725], [79.0077030847793, 0.12804158880451919, 0.2500839734812053]], "peak_params_": [[8.078017797279045, 0.6884391118635953, 3.215110925304863], [17.45203473158548, 0.1325870542352745, 9.857326475623706], [21.983845577182088, 0.30978279629664995, 0.5004950965658229], [24.227560923354435, 0.22803586239610696, 2.1105493350992033], [31.864893722402204, 0.35990262417882735, 3.885356441838246], [75.87308664469441, 0.11691552970171082, 11.999998875327945], [79.0077030847793, 0.23007298515229269, 0.5001679469624106]], "r_squared_": 0.9934649428824769, "error_": 0.043542616788891486}
{"freq_range": [2.0, 80.0], "freq_res": 1.0, "aperiodic_params_": [1.4570139095920416, 1.7938058257389808], "gaussian_params_": [[8.159595479462421, 0.7010837427995414, 1.6134475968694368], [19.452034599135946, 0.1032813584536873, 5.999999994250574], [22.857079535955688, 0.12470817289427807, 1.5650356458666859], [31.74503998554963, 0.3738067698507741, 1.7939231319117965], [76.45203459913596, 0.15604183083079384, 5.999999999999999]], "peak_params_": [[8.159595479462421, 0.7143712012513286, 3.2268951937388737], [19.452034599135946, 0.10897224119493432, 11.999999988501148], [22.857079535955688, 0.21090648010685464, 3.1300712917333717], [31.74503998554963, 0.38164612225678707, 3.587846263823593], [76.45203459913596, 0.1555996134788964, 11.999999999999998]], "r_squared_": 0.9905575523933129, "error_": 0.055903233366565865}
{"freq_range": [2.0, 80.0], "freq_res": 1.0, "aperiodic_params_": [1.369954194331534, 1.7405347332455603], "gaussian_params_": [[7.765545440578075, 0.6200555174972439, 1.2240259349803888], [11.149866985528252, 0.32141804513798633, 2.821081282886878], [18.366596612967285, 0.584752957161217, 0.250003478179084], [19.94260349751605, 0.26972545646772267, 0.47374793967158135], [21.522897608385595, 0.8173797614810407, 0.2763204838910202], [23.962242177721546, 0.21936597443752706, 1.3415903605901376], [31.383883227931918, 0.38086508675178093, 2.054941799388919], [76.45211743071326, 0.14986743606558792, 5.999999999999999]], "peak_params_": [[7.765545440578075, 0.7811135442033459, 2.4480518699607776], [11.149866985528252, 0.33985192099949496, 5.642162565773756], [18.366596612967285, 0.21647902825807175, 0.500006956358168], [19.94260349751605, 0.2728971684463436, 0.9474958793431627], [21.522897608385595, 0.25960288410018717, 0.5526409677820404], [23.962242177721546, 0.21988771899912596, 2.683180721180275], [31.383883227931918, 0.37427726843261155, 4.109883598777838], [76.45211743071326, 0.14944256129687372, 11.999999999999998]], "r_squared_": 0.9929220277880816, "error_": 0.04703788857921319}
{"freq_range": [2.0, 80.0], "freq_res": 1.0, "aperiodic_params_": [1.2642607198302784, 1.6720362184408448], "gaussian_params_": [[8.017565793734049, 0.6757469724492945, 1.4350525821091462], [11.527211676473877, 0.6235645029260984, 0.8428158766754358], [14.449447545027457, 0.28971864043059353, 0.5803767123214602], [21.79400901797972, 0.2999018185392443, 3.0233180672696713], [30.819059865856957, 0.33193849547993665, 1.8082033919381335], [67.68197710383592, 0.10951613320527397, 5.999999999999517], [76.5728808221778, 0.7411888508787629, 0.2657094522887544], [79.45466588200388, 1.0319587335194047, 0.2740541714037551]], "peak_params_": [[8.017565793734049, 0.6758034984712825, 2.8701051642182924], [11.527211676473877, 0.5487703380313387, 1.6856317533508716], [14.449447545027457, 0.23401112972726423, 1.1607534246429203], [21.79400901797972, 0.29920878389768335, 6.046636134539343], [30.819059865856957, 0.3331887273801668, 3.616406783876267], [67.68197710383592, 0.1093624036432217, 11.999999999999034], [76.5728808221778, 0.2364163018501082, 0.5314189045775088], [79.45466588200388, 0.2790914244267686, 0.5481083428075102]], "r_squared_": 0.9933371361363127, "error_": 0.046738405271755226}
{"freq_range": [2.0, 80.0], "freq_res": 1.0, "aperiodic_params_": [0.9752480236963943, 1.4677856950134112], "gaussian_params_": [[7.868819423445188, 0.4631684086931797, 1.840645480748163], [11.520164895930087, 2.441986744792477, 0.2738663215456249], [14.4752707565772, 0.21342942271148316, 0.9245708626991338], [18.276563224282487, 0.23119389042212854, 0.5845341837199823], [20.48870078560782, 0.7430526144204684, 0.2899835862672239], [22.674159862592113, 0.318192463259363, 0.5961853274120679], [30.025099350755205, 0.22246120075667206, 1.6271045288990345], [68.97007285175762, 0.10078778204643733, 5.999999999999999], [76.51579186530064, 0.7556860836390026, 0.2703261600760604], [79.46056352188738, 1.2873024962738362, 0.2556782043542535]], "peak_params_": [[7.868819423445188, 0.4619936292172147, 3.681290961496326], [11.520164895930087, 0.5694405355358788, 0.5477326430912498], [14.4752707565772, 0.18881890564040082, 1.8491417253982676], [18.276563224282487, 0.2068616116690407, 1.1690683674399647], [20.48870078560782, 0.18260197517759447, 0.5799671725344479], [22.674159862592113, 0.2740677170031922, 1.1923706548241357], [30.025099350755205, 0.22243473457004836, 3.254209057798069], [68.97007285175762, 0.10078652831833601, 11.999999999999998], [76.51579186530064, 0.1930911504401438, 0.5406523201521208], [79.46056352188738, 0.279064561447947, 0.511356408708507]], "r_squared_": 0.9915645729170798, "error_": 0.038527025053070076}
{"freq_range": [2.0, 80.0], "freq_res": 1.0, "aperiodic_params_": [0.42289300185890744, 0.9678335114235416], "gaussian_params_": [[2.9827146335671597, 0.15124559472815674, 0.25000000030374486], [6.893244758183715, 0.35209129063677397, 1.4648594979170062], [11.606624609727255, 0.2926175782843971, 0.8244417904860127], [16.210582995957367, 0.13946580681863613, 0.5772463637320856], [43.28961805300411, 0.10250366570769774, 1.4518650940020044], [46.19729110739054, 0.22298893085190952, 0.6647556501442404], [52.28176238534461, 0.20077818056668395, 0.615638145437322], [54.459903484909745, 0.1853129937029328, 0.6857542457369552], [56.61819930541969, 0.22193209311611856, 0.6348428094348447], [61.420084060190625, 0.15439674826108474, 0.7293251244797776], [68.12347383054994, 0.20116166289554532, 0.7168245962801276], [70.40031532009506, 0.3116415479706853, 0.32691876744470216], [77.6727618065559, 0.14445027075017697, 0.5459528990194394]], "peak_params_": [[2.9827146335671597, 0.16118350825543257, 0.5000000006074897], [6.893244758183715, 0.3511575793045507, 2.9297189958340124], [11.606624609727255, 0.26194253414470764, 1.6488835809720255], [16.210582995957367, 0.13048773692257343, 1.1544927274641712], [43.28961805300411, 0.10048650642834622, 2.9037301880040087], [46.19729110739054, 0.23132746209300414, 1.3295113002884809], [52.28176238534461, 0.18111139663724107, 1.231276290874644], [54.459903484909745, 0.15212226878216684, 1.3715084914739104], [56.61819930541969, 0.18541069412771094, 1.2696856188696894], [61.420084060190625, 0.13079657744451256, 1.4586502489595552], [68.12347383054994, 0.1981994121201256, 1.4336491925602552], [70.40031532009506, 0.1537890933825241, 0.6538375348894043], [77.6727618065559, 0.12069922175135406, 1.0919057980388789]], "r_squared_": 0.9922953804457063, "error_": 0.022798290184447012}
{"freq_range": [2.0, 80.0], "freq_res": 1.0, "aperiodic_params_": [0.6724517355240103, 1.2593854318496909], "gaussian_params_": [[7.566693460858046, 0.3214081163065513, 1.2685484907145206], [11.147673858256407, 0.2649246307091085, 1.2390007048255618], [22.512874240194762, 0.40874352926355684, 0.3222348539223836], [50.43912873569427, 0.1481017265599585, 1.1727058367065444], [55.122031053227296, 0.15899282626339425, 0.8503709263325188], [64.7988387258329, 0.16743797696029794, 3.1943889016395466], [69.42454608580196, 0.31161898065474836, 0.29247141832447227], [72.6396178435201, 0.22989651533846003, 0.6895468194412542], [74.69023515212885, 0.24712843981790597, 0.7089374613869669], [77.07824990075571, 0.19849877785667547, 0.6635803898000684], [79.25598451709388, 0.2855327727387794, 0.6466051656908468]], "peak_params_": [[7.566693460858046, 0.31370513184467935, 2.537096981429041], [11.147673858256407, 0.2712993234090118, 2.4780014096511236], [22.512874240194762, 0.13038007244677552, 0.6444697078447672], [50.43912873569427, 0.1380777050426425, 2.3454116734130888], [55.122031053227296, 0.1589566218237759, 1.7007418526650375], [64.7988387258329, 0.16710630660289283, 6.388777803279093], [69.42454608580196, 0.17917330254786346, 0.5849428366489445], [72.6396178435201, 0.2211581443219266, 1.3790936388825084], [74.69023515212885, 0.22777851829139673, 1.4178749227739338], [77.07824990075571, 0.1991107069978133, 1.3271607796001368], [79.25598451709388, 0.26701599072079363, 1.2932103313816936]], "r_squared_": 0.9932184977733329, "error_": 0.026194097014702232}
{"freq_range": [2.0, 80.0], "freq_res": 1.0, "aperiodic_params_": [0.9331845193907395, 1.5018203805056765], "gaussian_params_": [[7.750309643869735, 0.5374665199289873, 1.439631763016576], [11.555483466045148, 0.4227420540516671, 1.1657832689265877], [21.27732794368196, 0.2175054820889836, 4.163536615581798]], "peak_params_": [[7.750309643869735, 0.5348282739526592, 2.879263526033152], [11.555483466045148, 0.4181588070628425, 2.3315665378531754], [21.27732794368196, 0.21702351090228789, 8.327073231163595]], "r_squared_": 0.9839929038801014, "error_": 0.06525136655204697}
{"freq_range": [2.0, 80.0], "freq_res": 1.0, "aperiodic_params_": [1.244706866769308, 1.6541777095212082], "gaussian_params_": [[7.78413539646677, 0.6077005372877186, 1.368013091047122], [11.634438569659709, 0.357221972996439, 1.4330464471473299], [17.374757894895037, 0.15738717668892527, 1.5474581814728665], [19.718041052885834, 0.33354545993957263, 0.35965712168235603], [21.82630242002719, 0.1616420935497018, 0.6039494492937297], [24.110842814200634, 0.22167694688867592, 1.8542944573069515], [30.54548474410184, 0.8486042139590299, 0.2712188344118169], [33.346175414157656, 0.1394164255926889, 1.393469253382558], [68.67299295031583, 0.17448157652387697, 0.5798051979620056], [71.71914313278131, 0.1626954259969996, 0.8928062048648823], [76.85349710490983, 0.21181893613236308, 1.1626478107725846], [79.43953179511419, 0.5081235518604577, 0.2681523832109477]], "peak_params_": [[7.78413539646677, 0.6145110334826461, 2.736026182094244], [11.634438569659709, 0.35142934723308017, 2.8660928942946597], [17.374757894895037, 0.1533036050565244, 3.094916362945733], [19.718041052885834, 0.30328367998009576, 0.7193142433647121], [21.82630242002719, 0.2728666072411211, 1.2078988985874595], [24.110842814200634, 0.22154641835499045, 3.708588914613903], [30.54548474410184, 0.24239660729114165, 0.5424376688236338], [33.346175414157656, 0.1351822817104802, 2.786938506765116], [68.67299295031583, 0.15040004579541932, 1.1596103959240112], [71.71914313278131, 0.15487607515853896, 1.7856124097297645], [76.85349710490983, 0.2101439663159621, 2.3252956215451692], [79.43953179511419, 0.17113698258361398, 0.5363047664218954]], "r_squared_": 0.9959102794320707, "error_": 0.03194706511503682}
{"freq_range": [2.0, 80.0], "freq_res": 1.0, "aperiodic_params_": [1.2944308102462405, 1.7246449667790553], "gaussian_params_": [[7.91281987916102, 0.6742246758712508, 1.456612129277419], [12.441140887344153, 0.22184274487978084, 3.1871891417963036], [20.08718608865441, 0.20033534805488806, 0.763866523617062], [21.965982025892277, 0.20130405216909875, 0.251075944797383], [24.158099129409564, 0.2138536392789826, 1.3632545358958357], [31.47265845203738, 0.25275749091369604, 1.5162729265247905], [63.35373834026947, 0.16730330587169864, 1.4318161464729076], [76.3920784175207, 0.20868380846144252, 5.999999999999999]], "peak_params_": [[7.91281987916102, 0.757045165140607, 2.913224258554838], [12.441140887344153, 0.23288403259036783, 6.374378283592607], [20.08718608865441, 0.21440100881300395, 1.527733047234124], [21.965982025892277, 0.27173257541000884, 0.502151889594766], [24.158099129409564, 0.2127311148455755, 2.7265090717916713], [31.47265845203738, 0.24077133475442047, 3.032545853049581], [63.35373834026947, 0.17956031490675506, 2.863632292945815], [76.3920784175207, 0.2082387279408089, 11.999999999999998]], "r_squared_": 0.9931321457934728, "error_": 0.04693210537550188}
{"freq_range": [2.0, 80.0], "freq_res": 1.0, "aperiodic_params_": [1.275416007098096, 1.7151302165597313], "gaussian_params_": [[7.907450155135149, 0.7766287327684006, 1.2888735459770189], [10.967741488007308, 0.4081436289986773, 0.9189537062982395], [14.428485708663636, 0.2506949779699086, 1.2556398706750764], [18.432124197004278, 0.8615026516962088, 0.2500097277115813], [20.132036176185547, 0.24102485164961604, 0.48282937449122915], [21.57064252963598, 0.4701950173779749, 0.25005989710777765], [23.73161148809667, 0.21977685362067692, 1.8634792299336393], [30.23810544782493, 0.1924567829799704, 0.6915000036353868], [32.27761992940848, 0.1785920680705444, 1.59635305868546], [70.64389620259216, 0.21401745088665988, 5.999999999999999]], "peak_params_": [[7.907450155135149, 0.7768481373851022, 2.5777470919540377], [10.967741488007308, 0.45757730625013143, 1.837907412596479], [14.428485708663636, 0.23829029245907685, 2.511279741350153], [18.432124197004278, 0.19977760347586138, 0.5000194554231626], [20.132036176185547, 0.26178767542453873, 0.9656587489824583], [21.57064252963598, 0.2505238873120096, 0.5001197942155553], [23.73161148809667, 0.21750943947723056, 3.7269584598672787], [30.23810544782493, 0.2466857212985989, 1.3830000072707735], [32.27761992940848, 0.18341579538977593, 3.19270611737092], [70.64389620259216, 0.21364084465134248, 11.999999999999998]], "r_squared_": 0.9914084826801517, "error_": 0.0452937059805259}
{"freq_range": [2.0, 80.0], "freq_res": 1.0, "aperiodic_params_": [1.1846685860058672, 1.6440255389185217], "gaussian_params_": [[7.8627057226855595, 0.6713341868231605, 1.2301827670695407], [11.105362374018078, 0.5141412831962584, 0.9681289919610018], [14.466697669926694, 0.2273105371762824, 1.0025694482791159], [22.022449040529843, 0.2656454786323121, 3.0152390930860253], [31.291181615166227, 0.17333115729334297, 1.5144291912899654], [63.97676086963704, 0.15900220630276726, 0.9289732100489627], [68.65112877545232, 0.06542897068232803, 0.9995724494266321], [74.54796540086404, 0.1847240571691437, 5.999999999906919]], "peak_params_": [[7.8627057226855595, 0.6701702727157277, 2.4603655341390813], [11.105362374018078, 0.5379946346229538, 1.9362579839220035], [14.466697669926694, 0.21756998509360337, 2.0051388965582317], [22.022449040529843, 0.2656381174112685, 6.030478186172051], [31.291181615166227, 0.1733140404379825, 3.028858382579931], [63.97676086963704, 0.19834688665389577, 1.8579464200979254], [68.65112877545232, 0.18202845364170384, 1.9991448988532643], [74.54796540086404, 0.18420055545661929, 11.999999999813838]], "r_squared_": 0.9924425262079426, "error_": 0.0471807714527325}
{"freq_range": [2.0, 80.0], "freq_res": 1.0, "aperiodic_params_": [1.022447087400871, 1.571558510572913], "gaussian_params_": [[7.790798905671064, 0.5419688088349106, 1.3563884707692349], [11.121094317327161, 0.5071570701829519, 0.9181564473351992], [14.616024566565683, 0.17023216171356276, 1.5594297185917725], [20.094819149293834, 0.16750818614915583, 1.3540381374626553], [22.89501396650872, 0.18454454840542245, 0.8065212633608945], [60.98575418318196, 0.21979828327598988, 0.2500249691186532], [63.542351987869246, 0.20818858140978289, 1.1492224522061076], [68.84598045202766, 0.23771916904015364, 1.5334514838557407], [74.0431675750448, 0.1929229514531374, 2.2084576961739395], [77.48149278974248, 0.8557959094306544, 0.29612896398528327], [79.37393079670747, 0.34334634373063105, 0.6424734939514831]], "peak_params_": [[7.790798905671064, 0.53715196841724, 2.7127769415384697], [11.121094317327161, 0.5473304691543229, 1.8363128946703984], [14.616024566565683, 0.16535824620265582, 3.118859437183545], [20.094819149293834, 0.16783110945295032, 2.7080762749253107], [22.89501396650872, 0.1997528583720909, 1.613042526721789], [60.98575418318196, 0.23746168650933597, 0.5000499382373064], [63.542351987869246, 0.19393718644654467, 2.2984449044122153], [68.84598045202766, 0.25074995682669865, 3.0669029677114814], [74.0431675750448, 0.19372365756294485, 4.416915392347879], [77.48149278974248, 0.3072881345357976, 0.5922579279705665], [79.37393079670747, 0.3053933662600994, 1.2849469879029662]], "r_squared_": 0.9902637830786423, "error_": 0.04474904765057342}
{"freq_range": [2.0, 80.0], "freq_res": 1.0, "aperiodic_params_": [0.6353970742848039, 1.3197884141500422], "gaussian_params_": [[3.0476435059632774, 0.22128271974625527, 0.25000000000000006], [6.790639183929313, 0.30952597132441395, 1.3808248276748198], [10.604736835956636, 0.3870599503539775, 2.3460521263646106], [55.85556783848039, 0.15901701776809124, 2.2033272300803257], [61.43747372515318, 0.592686617959725, 0.28957545942542906], [63.4060997984609, 0.20258826870597793, 1.2697720685906402], [67.75620082678134, 0.243473247651693, 0.8636290125568192], [69.59167644437366, 0.5390674733178701, 0.2822395453446547], [73.22599725691485, 0.20453329572290835, 2.1823582194787057], [77.41422225317969, 0.3217456960047173, 0.6878813229890856], [79.47507212911103, 0.44463598388033737, 0.40783877473505514]], "peak_params_": [[3.0476435059632774, 0.22647339123370547, 0.5000000000000001], [6.790639183929313, 0.42487219847285385, 2.7616496553496397], [10.604736835956636, 0.3845752610406076, 4.692104252729221], [55.85556783848039, 0.1586757412594333, 4.406654460160651], [61.43747372515318, 0.2333900472277335, 0.5791509188508581], [63.4060997984609, 0.19332019840231163, 2.5395441371812804], [67.75620082678134, 0.2458835269017552, 1.7272580251136385], [69.59167644437366, 0.26622205945167243, 0.5644790906893093], [73.22599725691485, 0.2034395323845859, 4.364716438957411], [77.41422225317969, 0.3142476054170833, 1.375762645978171], [79.47507212911103, 0.25435595754675, 0.8156775494701103]], "r_squared_": 0.986339644188548, "error_": 0.043178936053948215}
{"freq_range": [2.0, 80.0], "freq_res": 1.0, "aperiodic_params_": [0.20952615129966937, 1.0163008107375924], "gaussian_params_": [[7.125495975954245, 0.35734241633596925, 0.8677761452941652], [10.077710269091636, 0.3236732644651855, 1.5214553846071779], [20.365295783174258, 0.17856603456168732, 0.8386841814725892], [52.547965308755835, 0.10205916702618369, 4.820428062612652], [52.63078144124006, 0.14106847047841517, 0.2756836546899057], [55.211886303360274, 0.14826039505989497, 0.2500300147167741], [57.032024262099505, 0.10022928852089338, 0.39781280578474354], [61.56147079811824, 0.505822000475795, 0.2906513727342381], [64.45672887186853, 0.5861230314932614, 0.29481037487650286], [66.6908220097543, 0.19975541973598981, 0.6415931417010358], [68.94720857130777, 0.17449202224911017, 0.6296044837507556], [71.60404346728639, 0.2051197114800638, 1.0525118811974004], [74.39447287754832, 0.29240050104760656, 0.32329498386398325], [79.54796540086168, 0.2217114043973358, 3.3309605355099756]], "peak_params_": [[7.125495975954245, 0.3954598726882162, 1.7355522905883305], [10.077710269091636, 0.32473184780133607, 3.0429107692143558], [20.365295783174258, 0.16240658861685608, 1.6773683629451783], [52.547965308755835, 0.15914709309346353, 9.640856125225303], [52.63078144124006, 0.15914709309346353, 0.5513673093798114], [55.211886303360274, 0.19320684087077766, 0.5000600294335482], [57.032024262099505, 0.16652844890155194, 0.7956256115694871], [61.56147079811824, 0.17698792808032948, 0.5813027454684762], [64.45672887186853, 0.18263231512911293, 0.5896207497530057], [66.6908220097543, 0.18065753116202843, 1.2831862834020715], [68.94720857130777, 0.18557345571783945, 1.2592089675015112], [71.60404346728639, 0.2081506598671936, 2.1050237623948007], [74.39447287754832, 0.20965793640056662, 0.6465899677279665], [79.54796540086168, 0.21967922314344301, 6.661921071019951]], "r_squared_": 0.9857991608812104, "error_": 0.031004977706494477}
{"freq_range": [2.0, 80.0], "freq_res": 1.0, "aperiodic_params_": [0.7953828698380069, 1.3923296022206517], "gaussian_params_": [[7.396540067612177, 0.38553486622355015, 0.9718604075066163], [10.65579713313507, 0.42882089592352496, 1.8406443054003019], [19.739731783001957, 0.19439076603839545, 0.5826638858480522], [22.833563617554724, 0.217182568161176, 0.9516691924034766], [54.919512088518395, 0.08429377470014769, 2.6333684899617418], [61.543106343575275, 0.25897029112860925, 0.5029131080233147], [64.32525361974528, 0.23016195700243808, 0.6200514060809338], [67.76912721923122, 0.11914335489508435, 1.2300056693323878], [77.07547104815461, 0.20877899501687722, 5.625164592442989]], "peak_params_": [[7.396540067612177, 0.414400827419262, 1.9437208150132326], [10.65579713313507, 0.4217870623384883, 3.6812886108006038], [19.739731783001957, 0.178515309619515, 1.1653277716961044], [22.833563617554724, 0.21388648024510404, 1.9033383848069532], [54.919512088518395, 0.08434890302903963, 5.2667369799234836], [61.543106343575275, 0.17963545633753686, 1.0058262160466294], [64.32525361974528, 0.21589851038572028, 1.2401028121618676], [67.76912721923122, 0.17387800772312922, 2.4600113386647755], [77.07547104815461, 0.20876020498331438, 11.250329184885977]], "r_squared_": 0.993064045546371, "error_": 0.032693822167995955}
{"freq_range": [2.0, 80.0], "freq_res": 1.0, "aperiodic_params_": [1.1435257256675755, 1.6378493901880806], "gaussian_params_": [[7.807080512408331, 0.6392019708106648, 1.2629699807911479], [10.730139078926772, 0.3329866839903077, 0.9132018910583509], [13.474215353267482, 0.20971358099938583, 2.11146929613719], [19.52866860342304, 0.5635629496972989, 0.2749525147486114], [23.178351598750496, 0.20436649031649212, 2.035042290000075], [62.27478725204574, 0.17322925576984874, 0.8308955447027124], [64.5111884854012, 0.7551568753014479, 0.3001570886877618], [68.4667021050972, 0.16272876881757292, 1.278849718563329], [72.32045819546141, 0.2130103723753824, 0.7389695225014976], [74.53797670764814, 0.3438268331574095, 0.3464232584852868], [76.72373252008543, 0.31335610270014336, 0.6774229269451287], [79.14580290143186, 0.2649603046981599, 0.6496281633684595]], "peak_params_": [[7.807080512408331, 0.6428824612601614, 2.5259399615822957], [10.730139078926772, 0.450479268510092, 1.8264037821167018], [13.474215353267482, 0.21979261616432494, 4.22293859227438], [19.52866860342304, 0.19179503940772158, 0.5499050294972228], [23.178351598750496, 0.20359112497636267, 4.07008458000015], [62.27478725204574, 0.16401098592283714, 1.6617910894054249], [64.5111884854012, 0.2054424621325346, 0.6003141773755236], [68.4667021050972, 0.15224554500887177, 2.557699437126658], [72.32045819546141, 0.19747410521262276, 1.4779390450029952], [74.53797670764814, 0.15388560402334117, 0.6928465169705736], [76.72373252008543, 0.2894840840211035, 1.3548458538902575], [79.14580290143186, 0.25947743580590377, 1.299256326736919]], "r_squared_": 0.9943525624122741, "error_": 0.032140042775884226}
{"freq_range": [2.0, 80.0], "freq_res": 1.0, "aperiodic_params_": [1.1525176681817795, 1.6028552975925785], "gaussian_params_": [[7.830959030984254, 0.687115426611376, 1.2425130605348742], [10.6523055136581, 0.4029907633955035, 0.711085146400416], [13.89577600106283, 0.18403573220794028, 1.8217947904431522], [20.043026542828215, 0.17158452976773486, 0.46510746991157087], [67.27533068646774, 0.14772213765685452, 5.903275969135252], [76.75646753098545, 0.2600739009670393, 0.8796167181350456], [79.40343986595076, 0.5565145011071317, 0.3262032710103018]], "peak_params_": [[7.830959030984254, 0.6821485020423323, 2.4850261210697484], [10.6523055136581, 0.4361901593518364, 1.422170292800832], [13.89577600106283, 0.18374406020465406, 3.6435895808863044], [20.043026542828215, 0.17152332664045844, 0.9302149398231417], [67.27533068646774, 0.14756155357625134, 11.806551938270504], [76.75646753098545, 0.2883287259232039, 1.7592334362700912], [79.40343986595076, 0.2896245509339861, 0.6524065420206036]], "r_squared_": 0.9905392307017246, "error_": 0.044937841248013685}
{"freq_range": [2.0, 80.0], "freq_res": 1.0, "aperiodic_params_": [1.122780348381837, 1.5833862339017197], "gaussian_params_": [[7.921493554976264, 0.6598988016020035, 1.105086345815943], [10.711628637184678, 0.5484762853253935, 0.7467806717054399], [13.545918291486377, 0.15724061330502392, 1.3545040140249973], [20.330310510030987, 0.31021894103672387, 0.2696450621743029], [22.610651301543573, 0.09513044482269226, 4.821225641173271], [45.976204250887974, 0.14301257403027087, 0.25000000000053535], [61.440008307813294, 0.5653500804960814, 0.28315570665932854], [63.725537884467784, 0.21193559231682937, 1.2187514099391592], [68.16477113490048, 0.1918652800748531, 0.9546987585456751], [72.39859673177077, 0.1905135862477448, 2.249296161349091], [76.95058370532523, 0.22458478439392876, 0.8580032649103465], [79.4636776985955, 0.7767955069757054, 0.3211397274539986]], "peak_params_": [[7.921493554976264, 0.6599875059571352, 2.210172691631886], [10.711628637184678, 0.5548093526722766, 1.4935613434108799], [13.545918291486377, 0.1679876743966906, 2.7090080280499946], [20.330310510030987, 0.22865410872365655, 0.5392901243486058], [22.610651301543573, 0.09482074270840801, 9.642451282346542], [45.976204250887974, 0.14236694361902136, 0.5000000000010707], [61.440008307813294, 0.18641627977571562, 0.5663114133186571], [63.725537884467784, 0.20682201960635305, 2.4375028198783184], [68.16477113490048, 0.21763371123631026, 1.9093975170913502], [72.39859673177077, 0.18760566384166055, 4.498592322698182], [76.95058370532523, 0.24771877124957098, 1.716006529820693], [79.4636776985955, 0.28944088075661956, 0.6422794549079972]], "r_squared_": 0.9937519103194248, "error_": 0.036145288345866104}
{"freq_range": [2.0, 80.0], "freq_res": 1.0, "aperiodic_params_": [0.7854781555390478, 1.4031038924341428], "gaussian_params_": [[3.038522202434887, 0.22453531072031366, 0.2500354992072307], [7.780661537273069, 0.529847047241621, 1.402515882087509], [10.977173326597221, 0.5108554886818443, 1.1522288487804613], [62.166020910909076, 0.1347099330033222, 1.4150644698665806], [71.54796540086404, 0.2766271079858689, 5.999999999999999]], "peak_params_": [[3.038522202434887, 0.22347535826141562, 0.5000709984144615], [7.780661537273069, 0.5415445040166624, 2.805031764175018], [10.977173326597221, 0.5487767606030913, 2.3044576975609226], [62.166020910909076, 0.21177037381488417, 2.8301289397331613], [71.54796540086404, 0.27584315597876485, 11.999999999999998]], "r_squared_": 0.9792224284398481, "error_": 0.06592526482363915}
{"freq_range": [2.0, 80.0], "freq_res": 1.0, "aperiodic_params_": [0.17670895998546093, 1.0349956047898914], "gaussian_params_": [[2.6762249465049606, 0.393519248128927, 0.6239303224534294], [5.257133642774491, 0.3120555820747566, 0.7545665352163166], [7.619038964321284, 0.469680903315238, 0.6596900341829355], [10.246320149655038, 0.400031529176213, 1.352795121943793], [45.89443280022333, 0.16238130264115516, 0.5694608178721928], [51.42550451676179, 0.4087690195503993, 0.2816828003504871], [55.852749789909474, 0.1476664861039232, 2.632404470538563], [62.408143591469866, 0.215494610946979, 1.0163868875540054], [67.28815494934383, 0.146315950744322, 0.30080061005443326], [68.30318135930483, 0.19904651240551652, 2.5204807264040343], [72.1916694253214, 0.09534332169107276, 1.0702131962497308], [76.64995007251248, 0.36416256720973705, 2.4447562996246344]], "peak_params_": [[2.6762249465049606, 0.34750512203477907, 1.2478606449068588], [5.257133642774491, 0.29523002244523305, 1.5091330704326331], [7.619038964321284, 0.49874390771428995, 1.319380068365871], [10.246320149655038, 0.39415174384271023, 2.705590243887586], [45.89443280022333, 0.15974897597837034, 1.1389216357443857], [51.42550451676179, 0.15760927105064138, 0.5633656007009742], [55.852749789909474, 0.14743697598862004, 5.264808941077126], [62.408143591469866, 0.21719354252640466, 2.032773775108011], [67.28815494934383, 0.2667946580852405, 0.6016012201088665], [68.30318135930483, 0.207252267518808, 5.040961452808069], [72.1916694253214, 0.2213854207640975, 2.1404263924994615], [76.64995007251248, 0.36096982593314797, 4.889512599249269]], "r_squared_": 0.9890205576098201, "error_": 0.03262585471587482}
{"freq_range": [2.0, 80.0], "freq_res": 1.0, "aperiodic_params_": [0.8937441082056752, 1.4348876977813738], "gaussian_params_": [[9.723635772495314, 0.585258733295317, 2.4492725233918597], [21.35617031639042, 0.16596162107109563, 2.398932547679365], [62.16057453312425, 0.17158488395086444, 0.7751404737453989], [64.4746814717854, 0.744870624089143, 0.29300476575511], [68.03724562399992, 0.16944932866481824, 1.3363248198438717], [72.39468279878795, 0.14448321394568456, 1.3511445052882527], [77.5424015656714, 0.25246244626280745, 2.290162772913921]], "peak_params_": [[9.723635772495314, 0.5815471303981359, 4.8985450467837195], [21.35617031639042, 0.1641570899048761, 4.79786509535873], [62.16057453312425, 0.16794872455476217, 1.5502809474907977], [64.4746814717854, 0.21256278367871406, 0.58600953151022], [68.03724562399992, 0.1701551559504182, 2.6726496396877435], [72.39468279878795, 0.15403766169251432, 2.7022890105765054], [77.5424015656714, 0.24749919156493827, 4.580325545827842]], "r_squared_": 0.9879019304232071, "error_": 0.04767748642200022}
{"freq_range": [2.0, 80.0], "freq_res": 1.0, "aperiodic_params_": [0.8657616857330258, 1.4491317958825585], "gaussian_params_": [[7.699121795327953, 0.6163195527582777, 1.022722996719172], [10.51938449171961, 0.7435963106427033, 0.8369969796688341], [13.742612908003075, 0.2016811546782301, 1.3518769786368752], [53.83889488294114, 0.1491665979274094, 0.45078305553556924], [62.31700160623902, 0.16353953533823481, 0.3005681491600715], [64.87044759578183, 0.15361524768846235, 4.793766885136354], [68.06140928549979, 0.11336314532755341, 0.6477948796496972], [77.2320025171282, 0.25210489149951715, 3.3924790577795405]], "peak_params_": [[7.699121795327953, 0.5982570170735865, 2.045445993438344], [10.51938449171961, 0.6597085364315791, 1.6739939593376683], [13.742612908003075, 0.1981893846493421, 2.7037539572737503], [53.83889488294114, 0.1516827512764738, 0.9015661110711385], [62.31700160623902, 0.22218789203614175, 0.601136298320143], [64.87044759578183, 0.15393968836364302, 9.587533770272708], [68.06140928549979, 0.24320341977704363, 1.2955897592993944], [77.2320025171282, 0.25777056783596586, 6.784958115559081]], "r_squared_": 0.9898552409997721, "error_": 0.04168723941715204}
{"freq_range": [2.0, 80.0], "freq_res": 1.0, "aperiodic_params_": [0.8314382091366659, 1.443662909614493], "gaussian_params_": [[7.744424602502495, 0.5770304120357386, 0.8939279507180611], [10.517808301289355, 0.6017916350294978, 0.9308548362941123], [16.547960085138712, 0.089898894335749, 5.999999968371552], [45.9963441256351, 0.16387419695011532, 0.2500000076370735], [61.52280113606149, 0.6355535022155474, 0.30394355053945127], [63.594564527931226, 0.2795688128887156, 0.6437679327799255], [67.50888330498414, 0.23179864433960237, 1.738138720071923], [72.08034179595474, 0.210968529588587, 1.2955067517846859], [77.27751541280709, 0.3412763286527095, 2.2412744465615657]], "peak_params_": [[7.744424602502495, 0.6020234707843934, 1.7878559014361222], [10.517808301289355, 0.5856201989674455, 1.8617096725882245], [16.547960085138712, 0.08964411789467497, 11.999999936743103], [45.9963441256351, 0.16385720262638137, 0.500000015274147], [61.52280113606149, 0.19984216570727664, 0.6078871010789025], [63.594564527931226, 0.2594877403252196, 1.287535865559851], [67.50888330498414, 0.2242723091930332, 3.476277440143846], [72.08034179595474, 0.24012853438582638, 2.5910135035693718], [77.27751541280709, 0.3388261457111479, 4.482548893123131]], "r_squared_": 0.9893426321351514, "error_": 0.043605122257371925}
{"freq_range": [2.0, 80.0], "freq_res": 1.0, "aperiodic_params_": [-0.46378597233182367, 0.7887839510493957], "gaussian_params_": [[3.4520345991359433, 0.3892755934382968, 3.8567242491221814], [6.356550423945266, 0.19467612077425506, 0.25000000000000006], [11.499257861832533, 0.8133199496084934, 0.25000000000000006], [55.27102987344131, 0.16189354386393665, 2.1461297922236904], [61.24354220700862, 0.15705449026180068, 0.559080037528242], [63.5096366717059, 0.22752438033240055, 1.2017724059315047], [66.73841277922847, 0.21982700111743633, 0.7874440072601467], [70.82358991034687, 0.1694715713993136, 1.804157598020582], [76.36371243535362, 0.20974341061757765, 1.0190459511735022], [79.43630858007424, 0.29427379012044014, 0.819547386028676]], "peak_params_": [[3.4520345991359433, 0.38661092801560687, 7.713448498244363], [6.356550423945266, 0.3833619000161844, 0.5000000000000001], [11.499257861832533, 0.16807639151376774, 0.5000000000000001], [55.27102987344131, 0.16060769050012436, 4.292259584447381], [61.24354220700862, 0.17313686902793624, 1.118160075056484], [63.5096366717059, 0.2100457823969757, 2.4035448118630094], [66.73841277922847, 0.22931639959158567, 1.5748880145202935], [70.82358991034687, 0.16866365502776293, 3.608315196041164], [76.36371243535362, 0.19960929698178997, 2.0380919023470043], [79.43630858007424, 0.2627831958376652, 1.639094772057352]], "r_squared_": 0.9732411908726951, "error_": 0.03874657897924843}
{"freq_range": [2.0, 80.0], "freq_res": 1.0, "aperiodic_params_": [0.5303155387298483, 1.2272175415296775], "gaussian_params_": [[6.480196278817173, 0.6914915702500228, 0.2849556604548397], [7.12244844473709, 0.21022009422720936, 2.909896184774396], [11.544078049072647, 0.4375356784390053, 0.2664328244808155], [47.70435673694451, 0.1702075389119694, 0.6659520067694326], [53.089557844490315, 0.17478055598433306, 0.7569327988093933], [58.142791163204635, 0.12181271766954262, 2.840573861250163], [62.9526569602996, 0.1622543768480992, 0.25000026437787304], [67.65664163369384, 0.12622520454401934, 3.5450868369891135], [73.64343686767855, 0.4141539132759804, 0.3306689462514777], [76.26322636352694, 0.1948610590346803, 0.6775193449868959], [79.2893118918984, 0.23127058589647523, 0.9807780510036915]], "peak_params_": [[6.480196278817173, 0.36231073287784493, 0.5699113209096794], [7.12244844473709, 0.34101835770786126, 5.819792369548792], [11.544078049072647, 0.15278495318965335, 0.532865648961631], [47.70435673694451, 0.15444247634836095, 1.3319040135388651], [53.089557844490315, 0.1972409417562515, 1.5138655976187867], [58.142791163204635, 0.124748733579787, 5.681147722500326], [62.9526569602996, 0.24087474981978918, 0.5000005287557461], [67.65664163369384, 0.12593022257127906, 7.090173673978227], [73.64343686767855, 0.25776370846771934, 0.6613378925029554], [76.26322636352694, 0.1894444318572963, 1.3550386899737918], [79.2893118918984, 0.2222351386204544, 1.961556102007383]], "r_squared_": 0.9888050291923052, "error_": 0.035202763238830065}
{"freq_range": [2.0, 80.0], "freq_res": 1.0, "aperiodic_params_": [0.6906019314773194, 1.3255650806105264], "gaussian_params_": [[7.70116871680052, 0.34416376520264735, 1.6970261233144186], [11.220066103455004, 0.24306540987707886, 0.5626241912270041], [17.740850817236552, 0.15384142782069876, 0.7979140192855618], [33.058307999355115, 0.2258494334355269, 0.6080916647822002], [58.51505673291408, 0.7922675134525956, 0.2500068941999896], [63.5663897789285, 0.09871185019812091, 1.461553924768869], [68.53940237209439, 0.5286451251194092, 0.25000008733068735], [74.54796540086404, 0.14427715907376273, 5.999999999999999]], "peak_params_": [[7.70116871680052, 0.3388690041681832, 3.394052246628837], [11.220066103455004, 0.27719230228157843, 1.1252483824540083], [17.740850817236552, 0.14593776973545936, 1.5958280385711237], [33.058307999355115, 0.22481355375983214, 1.2161833295644005], [58.51505673291408, 0.1265138943999462, 0.5000137883999792], [63.5663897789285, 0.12522953129109515, 2.923107849537738], [68.53940237209439, 0.19103258721599725, 0.5000001746613747], [74.54796540086404, 0.14386828240982963, 11.999999999999998]], "r_squared_": 0.990237914837001, "error_": 0.036707443929938695}
{"freq_range": [2.0, 80.0], "freq_res": 1.0, "aperiodic_params_": [0.6385677651461327, 1.429172222060131], "gaussian_params_": [[7.317817357496978, 0.31318855154710085, 1.7984594440002366], [11.517448443177152, 0.9365565601531864, 0.25989318948962853], [62.76935598852187, 0.14641701800609774, 5.999999999999999], [68.74926800919708, 0.16650810369363786, 0.7854111267362449], [71.49793236121405, 0.628466609483093, 0.28078144160648594], [74.08485690209623, 0.22651282004086956, 0.5288742734336175], [76.25022694814074, 0.24358400394421828, 0.6232718882913847], [79.17217972109968, 0.35286714883692577, 0.7323043311078019]], "peak_params_": [[7.317817357496978, 0.3083362966332806, 3.596918888000473], [11.517448443177152, 0.17765049656945797, 0.5197863789792571], [62.76935598852187, 0.1463088788446183, 11.999999999999998], [68.74926800919708, 0.24363035796538357, 1.5708222534724898], [71.49793236121405, 0.19031790332760878, 0.5615628832129719], [74.08485690209623, 0.24937430308535236, 1.057748546867235], [76.25022694814074, 0.2379492465875015, 1.2465437765827694], [79.17217972109968, 0.34703382504881897, 1.4646086622156038]], "r_squared_": 0.9878869058158911, "error_": 0.04115820499532516}
