{"freq_range": [2.0, 80.0], "freq_res": 1.0, "aperiodic_params_": [-0.9960023357990478, -0.43396442613078245], "gaussian_params_": [[20.431341711275905, 0.4171240422854964, 3.636314453862623], [31.756579862315043, 0.276683241228421, 2.7581854396954277], [37.90009956936105, 0.20845702726961346, 1.0336761882560004], [44.152973370760016, 0.19570730920303317, 5.999997804203674], [47.53819845309534, 0.3143807330336131, 0.2507204649301744]], "peak_params_": [[20.431341711275905, 0.4142903550657232, 7.272628907725246], [31.756579862315043, 0.3034139916308627, 5.5163708793908555], [37.90009956936105, 0.344513590658251, 2.0673523765120008], [44.152973370760016, 0.1956582820539979, 11.999995608407348], [47.53819845309534, 0.21699012555930391, 0.5014409298603488]], "r_squared_": 0.7377889112178057, "error_": 0.07295693274515323}
{"freq_range": [2.0, 80.0], "freq_res": 1.0, "aperiodic_params_": [-0.822033364660572, -0.1890615851874544], "gaussian_params_": [[16.52170721313817, 0.7813455549189803, 0.28741045631089196], [19.041838581510355, 0.1424676464451108, 0.25000000019877094], [20.571399252370963, 0.28031980275535895, 2.659885094945479], [28.634844551782603, 0.10979217694621915, 0.7490998371185253], [33.371654028300924, 0.20800504541125198, 5.9971885972803785], [44.27041162652812, 0.0955576842164935, 3.0656724085860514], [50.39602079318168, 0.35368980603136846, 0.2552605677688987], [55.54796540086405, 0.10460391269902021, 5.999999999999999]], "peak_params_": [[16.52170721313817, 0.3144692030258303, 0.5748209126217839], [19.041838581510355, 0.3876961133759473, 0.5000000003975419], [20.571399252370963, 0.3014774274049304, 5.319770189890958], [28.634844551782603, 0.258823107094158, 1.4981996742370507], [33.371654028300924, 0.20781185369398442, 11.994377194560757], [44.27041162652812, 0.15485662635080277, 6.131344817172103], [50.39602079318168, 0.1954927732727788, 0.5105211355377974], [55.54796540086405, 0.1045392751642209, 11.999999999999998]], "r_squared_": 0.6248339565456248, "error_": 0.05637881841448152}
{"freq_range": [2.0, 80.0], "freq_res": 1.0, "aperiodic_params_": [-0.6874698281409681, -0.08254713948752479], "gaussian_params_": [[21.46482949302548, 0.406624537096667, 3.819603272629974], [32.18267717132509, 0.17872247094072802, 1.4368722147035475], [34.41517171876997, 0.4098447220632192, 0.2621368611104577], [36.31759373417222, 0.2890990289838643, 0.4955810954296024], [38.268251677683786, 0.25032004669642066, 0.6687978303077854], [40.359294457000345, 0.218007529707133, 0.6559692091373365], [43.342029624695, 0.3630183342146312, 0.3120491672562259], [46.37130672186338, 0.1765704622228205, 2.6718893485725164], [51.89773865201158, 0.16225094330426718, 0.8689778084735178], [58.56710753863914, 0.8905066599171764, 0.25879634051202605]], "peak_params_": [[21.46482949302548, 0.40362463240680974, 7.639206545259948], [32.18267717132509, 0.18634609071268893, 2.873744429407095], [34.41517171876997, 0.19912146423769034, 0.5242737222209154], [36.31759373417222, 0.2418568341556146, 0.9911621908592048], [38.268251677683786, 0.2336085216713989, 1.3375956606155708], [40.359294457000345, 0.20668930737612878, 1.311938418274673], [43.342029624695, 0.27881081937135865, 0.6240983345124518], [46.37130672186338, 0.1748736978681128, 5.343778697145033], [51.89773865201158, 0.18032858707405303, 1.7379556169470356], [58.56710753863914, 0.21982121323917492, 0.5175926810240521]], "r_squared_": 0.6212605789868698, "error_": 0.05326686670782124}
{"freq_range": [2.0, 80.0], "freq_res": 1.0, "aperiodic_params_": [-0.3781796061278565, 0.4773515370560732], "gaussian_params_": [[7.4671755504617785, 1.0218206948617925, 0.2593968686439344], [18.588896828880692, 0.847275486234892, 0.25987817205904357], [21.46929062653979, 0.6213774891343339, 0.26975786275284414], [23.5051706179588, 0.3420018637743615, 2.582656558809167], [30.581697783276237, 0.2232382026306251, 0.5828186593331497], [41.39526617227083, 0.7594088895339194, 0.25000982864445115]], "peak_params_": [[7.4671755504617785, 0.20185071389257525, 0.5187937372878688], [18.588896828880692, 0.3171447562908334, 0.5197563441180871], [21.46929062653979, 0.35048181575757975, 0.5395157255056883], [23.5051706179588, 0.3357817756010911, 5.165313117618334], [30.581697783276237, 0.17762180437620212, 1.1656373186662994], [41.39526617227083, 0.21762118108627404, 0.5000196572889023]], "r_squared_": 0.8770979264341869, "error_": 0.05916408502875065}
{"freq_range": [2.0, 80.0], "freq_res": 1.0, "aperiodic_params_": [-0.5909961210675977, 0.11551285905726312], "gaussian_params_": [[16.45271047856339, 0.08316942788545019, 2.6416240837265277], [21.015458569090022, 0.14418321040503343, 0.2500000000000008], [21.69255515345057, 0.1929213733522206, 3.0901849589331767], [59.50363622375762, 0.1333908858362512, 1.4399871205184582], [65.31861217978928, 0.14081737827613489, 1.4342453078862814]], "peak_params_": [[16.45271047856339, 0.11731562542496377, 5.283248167453055], [21.015458569090022, 0.35094666393818896, 0.5000000000000016], [21.69255515345057, 0.20120110263897928, 6.180369917866353], [59.50363622375762, 0.1258424561243945, 2.8799742410369165], [65.31861217978928, 0.13747681244210974, 2.8684906157725627]], "r_squared_": 0.4057680576177562, "error_": 0.05777880093041238}
{"freq_range": [2.0, 80.0], "freq_res": 1.0, "aperiodic_params_": [-0.6867884679663656, -0.01550727933277268], "gaussian_params_": [[18.80745000893181, 0.22728052111566946, 0.46839143159897645], [22.253763263259927, 0.3946453672172954, 2.552733455115036], [27.55139976867, 0.16671277560260736, 0.8303750192121291], [29.684913934693654, 0.1797124069908942, 1.0344283209061402], [32.94514997262078, 0.19364034293619387, 0.5360333269723083], [37.55892141397609, 0.206294649878252, 3.098132306172539], [41.47053188211573, 0.6623687004082023, 0.30111148331804416], [44.18249380697935, 0.2401916854149965, 1.2605736959856146], [47.429259928895135, 0.4708928291135758, 0.2831582718119804], [48.922657078840224, 0.1412573479835481, 1.566632969293924], [52.987765291606316, 0.11849086506315494, 0.25025343285457835], [57.07502527171458, 0.09858510257429283, 5.653952681551789]], "peak_params_": [[18.80745000893181, 0.3840181678753912, 0.9367828631979529], [22.253763263259927, 0.39270091513469957, 5.105466910230072], [27.55139976867, 0.22486423861785615, 1.6607500384242582], [29.684913934693654, 0.1881907750425441, 2.0688566418122805], [32.94514997262078, 0.26362460108239333, 1.0720666539446166], [37.55892141397609, 0.2045487675882574, 6.196264612345078], [41.47053188211573, 0.318348392234196, 0.6022229666360883], [44.18249380697935, 0.2692655670881736, 2.5211473919712293], [47.429259928895135, 0.2576547989068119, 0.5663165436239608], [48.922657078840224, 0.17702593532183442, 3.133265938587848], [52.987765291606316, 0.19916155790364426, 0.5005068657091567], [57.07502527171458, 0.09857666265321485, 11.307905363103577]], "r_squared_": 0.6300306925019015, "error_": 0.05077677979913461}
{"freq_range": [2.0, 80.0], "freq_res": 1.0, "aperiodic_params_": [-0.4496480348523735, 0.400083150483447], "gaussian_params_": [[7.927460839249961, 0.4906316679353577, 0.9178303657843895], [18.571060028779343, 0.7451841871624431, 0.26429122728944887], [67.09044420744726, 0.10723819907506396, 3.892252051791384]], "peak_params_": [[7.927460839249961, 0.4891017512277775, 1.835660731568779], [18.571060028779343, 0.19965596771382388, 0.5285824545788977], [67.09044420744726, 0.10720925094635914, 7.784504103582768]], "r_squared_": 0.8294546311196764, "error_": 0.06210690578101074}
{"freq_range": [2.0, 80.0], "freq_res": 1.0, "aperiodic_params_": [-0.5755517653001259, 0.06477197482013401], "gaussian_params_": [[7.503570056042695, 1.156287666553467, 0.26757844945077636], [16.598629104551836, 0.5012779906866108, 0.2501395293858834], [20.55590129828835, 0.39925846778041363, 1.6210016979978663], [23.57107058978246, 0.48189840698736647, 0.2843355800625796], [25.597655911664088, 0.18595568891914277, 0.9286259756008659], [28.545343601055983, 0.6419640285677345, 0.2645062516648581], [33.921810303267804, 0.13576835878894872, 3.1437154036406674], [38.012623615890554, 0.11836172022208355, 0.5213113473981835], [40.86803543428653, 0.18957393539950237, 0.8691706838249667], [45.85054266789675, 0.2353527075136709, 1.7883590449633828], [50.72735679323385, 0.261720329025375, 0.45913499535157065]], "peak_params_": [[7.503570056042695, 0.20684272840819945, 0.5351568989015527], [16.598629104551836, 0.17435509325670262, 0.5002790587717668], [20.55590129828835, 0.3845825353292733, 3.2420033959957326], [23.57107058978246, 0.23950180172253, 0.5686711601251592], [25.597655911664088, 0.17638958790915144, 1.8572519512017318], [28.545343601055983, 0.18661979705907888, 0.5290125033297162], [33.921810303267804, 0.13572637193726544, 6.287430807281335], [38.012623615890554, 0.17769049694733408, 1.042622694796367], [40.86803543428653, 0.2041125481615781, 1.7383413676499333], [45.85054266789675, 0.2346168758756031, 3.5767180899267657], [50.72735679323385, 0.2231419505915272, 0.9182699907031413]], "r_squared_": 0.663917264784293, "error_": 0.04224078366313037}
{"freq_range": [2.0, 80.0], "freq_res": 1.0, "aperiodic_params_": [-0.3003516371283534, 0.4848651456779361], "gaussian_params_": [[7.441144479481143, 0.8713969402927985, 0.26501729935565194], [17.32436055628563, 0.37644002552155736, 0.250018939199307], [18.697046388080295, 0.3424009025822289, 0.3922997950418224], [20.88216548480394, 0.18746202975386186, 0.6057677016864307], [23.478471700586542, 0.381306959426736, 2.306878871408178], [27.405083009215062, 0.22437677603265668, 0.34811848391395184], [29.43124660656588, 0.18722564663782185, 0.746642338792612], [31.314336544211304, 0.26891164007373863, 0.378903297911021], [33.68768086232922, 0.2527600331616464, 0.7785341446171277], [41.224248489529906, 0.302847820434727, 0.45295774943466816], [46.33344098542366, 0.20629284901009995, 2.0709107452197495], [50.93951050321755, 0.19640936955282884, 0.7302783691084459]], "peak_params_": [[7.441144479481143, 0.21803854452997412, 0.5300345987113039], [17.32436055628563, 0.16968181684517059, 0.500037878398614], [18.697046388080295, 0.3135457755953458, 0.7845995900836448], [20.88216548480394, 0.39805131465165544, 1.2115354033728614], [23.478471700586542, 0.3736084474934951, 4.613757742816356], [27.405083009215062, 0.2338651606844081, 0.6962369678279037], [29.43124660656588, 0.1802085018088111, 1.493284677585224], [31.314336544211304, 0.21373957369439311, 0.757806595822042], [33.68768086232922, 0.23322983398114938, 1.5570682892342553], [41.224248489529906, 0.27540306754597965, 0.9059154988693363], [46.33344098542366, 0.20363605633436022, 4.141821490439499], [50.93951050321755, 0.21202468885639902, 1.4605567382168918]], "r_squared_": 0.907317529500613, "error_": 0.04504648100746727}
{"freq_range": [2.0, 80.0], "freq_res": 1.0, "aperiodic_params_": [0.0559008993833308, 0.8592534676357145], "gaussian_params_": [[7.42351044518522, 0.7009826531546467, 0.2736418643874775], [18.976538105989015, 0.17732176840382974, 0.25000000049721555], [22.433092727984477, 0.30287361893891507, 1.67896541810582], [25.427177327753515, 0.2586705259799784, 5.2867754535961655], [41.38491646426435, 0.68673191391611, 0.2751775768568617]], "peak_params_": [[7.42351044518522, 0.2122219477606181, 0.547283728774955], [18.976538105989015, 0.33752619084870417, 0.5000000009944311], [22.433092727984477, 0.5026125946431805, 3.35793083621164], [25.427177327753515, 0.3519507695520998, 10.573550907192331], [41.38491646426435, 0.26155160989935244, 0.5503551537137235]], "r_squared_": 0.9600952000635318, "error_": 0.056525498308156064}
{"freq_range": [2.0, 80.0], "freq_res": 1.0, "aperiodic_params_": [0.19788429471912802, 0.9690413347426582], "gaussian_params_": [[8.025052781770158, 0.17712735735117882, 0.9590886827436851], [19.007440232176442, 0.16436515835923368, 0.2500391889605817], [23.26765039632033, 0.49019861194266023, 3.0494985936130923], [30.76536546206551, 0.24599152914522315, 0.6216191370132381], [74.5745764850563, 0.5602229111104975, 0.2912350682973646]], "peak_params_": [[8.025052781770158, 0.17706870538761488, 1.9181773654873702], [19.007440232176442, 0.34840857566396366, 0.5000783779211634], [23.26765039632033, 0.48831416082012025, 6.098997187226185], [30.76536546206551, 0.2487680858981124, 1.2432382740264762], [74.5745764850563, 0.1927569375931737, 0.5824701365947292]], "r_squared_": 0.9684978428437503, "error_": 0.057513405695951716}
{"freq_range": [2.0, 80.0], "freq_res": 1.0, "aperiodic_params_": [0.16089754176589655, 0.9164878554668937], "gaussian_params_": [[7.86839791237856, 0.16963137193877087, 0.8548500561230047], [18.656323287301596, 0.44141517330181607, 0.29906084730819577], [21.41195209341913, 0.36208435127323846, 0.3125720162866481], [23.52214569120697, 0.4635832517767147, 2.552391867990077], [30.593732358539395, 0.2194306428156079, 0.9507296156445554], [53.10147797235574, 0.23154783110714688, 0.4364474926741587], [70.48689365313999, 0.5272209812276539, 0.3070402258900474]], "peak_params_": [[7.86839791237856, 0.1676331198725841, 1.7097001122460094], [18.656323287301596, 0.32456761304159965, 0.5981216946163915], [21.41195209341913, 0.43643480170462345, 0.6251440325732962], [23.52214569120697, 0.45552957808544403, 5.104783735980154], [30.593732358539395, 0.20662614865979934, 1.9014592312891108], [53.10147797235574, 0.22537287376794457, 0.8728949853483174], [70.48689365313999, 0.14994887670891455, 0.6140804517800948]], "r_squared_": 0.9723427596984845, "error_": 0.04901200330959917}
{"freq_range": [2.0, 80.0], "freq_res": 1.0, "aperiodic_params_": [-0.40377223023991254, 0.28567339588262664], "gaussian_params_": [[7.495595595948148, 0.7768320259569553, 0.27129304154788997], [18.914929708972238, 0.2954032852107445, 0.6121866010459586], [21.437778809743687, 0.6864528978257257, 0.2985404279959211], [24.049672147809325, 0.35608336493327536, 1.1534896286326408], [36.5807155003415, 0.5304008080015099, 0.2585928422062754], [46.37383383445848, 0.1020467351304062, 4.547624609644693], [61.49839989330759, 0.8012774394440907, 0.2690316046443033]], "peak_params_": [[7.495595595948148, 0.14644384965529755, 0.5425860830957799], [18.914929708972238, 0.29258940191908056, 1.2243732020919171], [21.437778809743687, 0.24594801847613512, 0.5970808559918422], [24.049672147809325, 0.35575392700643066, 2.3069792572652816], [36.5807155003415, 0.15466790893416993, 0.5171856844125508], [46.37383383445848, 0.10170252501365418, 9.095249219289386], [61.49839989330759, 0.14463451322167176, 0.5380632092886066]], "r_squared_": 0.6992220817308136, "error_": 0.05518141891497475}
{"freq_range": [2.0, 80.0], "freq_res": 1.0, "aperiodic_params_": [-0.832152971211142, -0.20781794192349476], "gaussian_params_": [[21.16719804396253, 0.46280073503903557, 2.0929760755099673], [43.02001175277767, 0.1711323816957423, 5.999999999999999], [63.04687528520389, 0.1294900022013214, 4.7489196550321395]], "peak_params_": [[21.16719804396253, 0.4615298835302818, 4.185952151019935], [43.02001175277767, 0.1711489165406786, 11.999999999999998], [63.04687528520389, 0.13015267086247972, 9.497839310064279]], "r_squared_": 0.5892932759496218, "error_": 0.06780096495592373}
{"freq_range": [2.0, 80.0], "freq_res": 1.0, "aperiodic_params_": [-0.6547068273657505, 0.10768654631899754], "gaussian_params_": [[7.868038051865729, 0.34500533031792785, 0.9590703920901816], [21.638992123036694, 0.25937612548773203, 2.321058637032694], [28.066901793686295, 0.18807198918912357, 2.7245960296123206], [32.83712500474066, 0.1513544025201955, 0.6825197375634078], [43.843459032508804, 0.18943015583179165, 5.999999999999999]], "peak_params_": [[7.868038051865729, 0.34175493014519087, 1.9181407841803633], [21.638992123036694, 0.2722719698685957, 4.642117274065388], [28.066901793686295, 0.1998818088226474, 5.449192059224641], [32.83712500474066, 0.22062365267087147, 1.3650394751268156], [43.843459032508804, 0.18936570163210753, 11.999999999999998]], "r_squared_": 0.4825793934246953, "error_": 0.06606540434306828}
{"freq_range": [2.0, 80.0], "freq_res": 1.0, "aperiodic_params_": [-0.7289620676562774, 0.029174125215284615], "gaussian_params_": [[7.97961348373605, 0.5518884836313369, 0.9403589999274645]], "peak_params_": [[7.97961348373605, 0.5517588048345126, 1.880717999854929]], "r_squared_": 0.323037865603754, "error_": 0.06997080601495738}
{"freq_range": [2.0, 80.0], "freq_res": 1.0, "aperiodic_params_": [-0.5035483792828968, 0.28758173267291576], "gaussian_params_": [[7.664751258881623, 0.3809344809215995, 0.7585535514371203], [22.7143654594823, 0.12669362971001866, 4.37692839032426], [27.52948085890538, 0.4774180573577554, 0.30383543418973846]], "peak_params_": [[7.664751258881623, 0.3459353690490008, 1.5171071028742407], [22.7143654594823, 0.1264241382289224, 8.75385678064852], [27.52948085890538, 0.2050339149162136, 0.6076708683794769]], "r_squared_": 0.6863336870439865, "error_": 0.06405121644143764}
{"freq_range": [2.0, 80.0], "freq_res": 1.0, "aperiodic_params_": [-0.16684982866566572, 0.695315516062149], "gaussian_params_": [[7.468040808664734, 0.9722806264574069, 0.28041811984698667], [18.97041751519693, 0.1629422237485721, 0.25000000002386097], [22.49139379632459, 0.2602417859481614, 1.5959754619707416], [26.357487199407704, 0.2443572980942954, 5.999999999997904], [41.38126512042034, 0.6443158643801036, 0.27560891136391763], [50.63247647687099, 0.4912520807073618, 0.27840355339669726]], "peak_params_": [[7.468040808664734, 0.2428078401571947, 0.5608362396939733], [18.97041751519693, 0.30079729336347016, 0.5000000000477219], [22.49139379632459, 0.43590701934624776, 3.191950923941483], [26.357487199407704, 0.26714620974620273, 11.999999999995808], [41.38126512042034, 0.2599243548267689, 0.5512178227278353], [50.63247647687099, 0.20558705262659704, 0.5568071067933945]], "r_squared_": 0.9345378431206357, "error_": 0.06024412845721513}
{"freq_range": [2.0, 80.0], "freq_res": 1.0, "aperiodic_params_": [0.1407242590645794, 0.9457841886409377], "gaussian_params_": [[7.472331183789033, 1.276963267003732, 0.25637638137453317], [23.493669990333046, 0.5093492813664415, 3.873358848634515], [30.530648263616715, 0.8392883465272095, 0.2823329411713548], [41.43681108212968, 0.959653440522603, 0.263937813775226]], "peak_params_": [[7.472331183789033, 0.23401667056341025, 0.5127527627490663], [23.493669990333046, 0.5052290539024105, 7.74671769726903], [30.530648263616715, 0.2886608499431229, 0.5646658823427096], [41.43681108212968, 0.2440013789359976, 0.527875627550452]], "r_squared_": 0.9590562491942289, "error_": 0.06591122865471769}
{"freq_range": [2.0, 80.0], "freq_res": 1.0, "aperiodic_params_": [0.23839752843902348, 1.0012710037028019], "gaussian_params_": [[7.480827044688057, 1.1235348470921438, 0.2606904388249592], [19.239961379413394, 0.3643389038400552, 0.6381013366913185], [21.44264162312393, 1.1157894579933603, 0.3133257824601781], [23.98673464049017, 0.5413951949825572, 1.5538396566440353], [27.22151772401809, 0.23447488583084847, 0.6186041396990593], [30.139559106602942, 0.2686160196397284, 1.1790170006045773], [41.46799521619192, 1.070757024219299, 0.2623687752623729]], "peak_params_": [[7.480827044688057, 0.20505157057316464, 0.5213808776499184], [19.239961379413394, 0.3426070539447823, 1.276202673382637], [21.44264162312393, 0.504814538302091, 0.6266515649203562], [23.98673464049017, 0.5413761162142476, 3.1076793132880707], [27.22151772401809, 0.3102495247968782, 1.2372082793981185], [30.139559106602942, 0.26705352114859704, 2.3580340012091545], [41.46799521619192, 0.21816981504217003, 0.5247375505247458]], "r_squared_": 0.9697543226269018, "error_": 0.05629068633711826}
{"freq_range": [2.0, 80.0], "freq_res": 1.0, "aperiodic_params_": [0.11650820855432693, 0.9138668108973315], "gaussian_params_": [[8.068080191858343, 0.23163496572754425, 0.985003402432166], [23.680683851716708, 0.432844609253339, 4.062922089159262], [53.18267718612621, 0.18715684348329006, 0.49429538148022956], [70.49943026056357, 0.71335624456527, 0.30280451760208743]], "peak_params_": [[8.068080191858343, 0.2313346017966189, 1.970006804864332], [23.680683851716708, 0.4315098703286775, 8.125844178318523], [53.18267718612621, 0.17480230989118328, 0.9885907629604591], [70.49943026056357, 0.18305840308160248, 0.6056090352041749]], "r_squared_": 0.9569463697430552, "error_": 0.061399498536332614}
{"freq_range": [2.0, 80.0], "freq_res": 1.0, "aperiodic_params_": [-0.2304705016055373, 0.5960943104908161], "gaussian_params_": [[8.160044435477051, 0.21419183347417572, 0.9301806241374818], [19.361046019855074, 0.5291663960390839, 0.2994655767322638], [21.388998772285845, 0.2764577076480624, 0.727087517762815], [22.792376041647998, 0.20816546903250321, 0.3360528510284841], [24.51266114159603, 0.37681830955658097, 0.7178431340716427], [28.607685441807174, 0.12021637635979604, 5.999999840799236], [52.98099104245968, 0.24653110755017146, 0.25000041129381356], [64.81285557352494, 0.2402517786587726, 0.47475711320152486], [70.44687261164523, 0.7469594258342048, 0.28260461002682363]], "peak_params_": [[8.160044435477051, 0.21137463316506921, 1.8603612482749636], [19.361046019855074, 0.29044059503111397, 0.5989311534645276], [21.388998772285845, 0.2934047197565973, 1.45417503552563], [22.792376041647998, 0.31433564731758623, 0.6721057020569682], [24.51266114159603, 0.39959785410355897, 1.4356862681432854], [28.607685441807174, 0.11995967165885224, 11.999999681598473], [52.98099104245968, 0.24585046640687702, 0.5000008225876271], [64.81285557352494, 0.22229262512563785, 0.9495142264030497], [70.44687261164523, 0.21396496828085887, 0.5652092200536473]], "r_squared_": 0.9136782872810693, "error_": 0.05601461266825454}
{"freq_range": [2.0, 80.0], "freq_res": 1.0, "aperiodic_params_": [-0.5707471463029445, 0.19347826585610156], "gaussian_params_": [[8.252791996305797, 0.27814872202878, 0.7929590122167943], [19.296959155664425, 0.23568090199299846, 0.5155281758230327], [23.170670580179436, 0.24384912428523556, 2.3471324576711807], [27.07423136013099, 0.16965850383367737, 0.25003148357007016], [29.114997245265922, 0.2243330341269662, 0.8497854579051348], [33.60514925955591, 0.5899830985772538, 0.27710399091240073], [36.69408669117089, 0.17834876458215645, 0.7058915953597444], [41.623571388818874, 0.5490113121803901, 0.2853288010859917], [50.45222323595536, 0.07255423301130405, 5.999999999999999], [58.04061762538117, 0.0943135775640508, 2.082231413854692], [70.30794178270774, 0.1719173957768813, 0.5561643628549193], [79.0140537115052, 0.15031551180238525, 0.25000000000000006]], "peak_params_": [[8.252791996305797, 0.26436760142764365, 1.5859180244335886], [19.296959155664425, 0.24994263886338908, 1.0310563516460653], [23.170670580179436, 0.24320737670914283, 4.6942649153423615], [27.07423136013099, 0.23694851280406926, 0.5000629671401403], [29.114997245265922, 0.2335708725855855, 1.6995709158102696], [33.60514925955591, 0.21558791459526472, 0.5542079818248015], [36.69408669117089, 0.16823971082681355, 1.4117831907194889], [41.623571388818874, 0.25685123408096866, 0.5706576021719834], [50.45222323595536, 0.07240296922507616, 11.999999999999998], [58.04061762538117, 0.1271833486067342, 4.164462827709384], [70.30794178270774, 0.1478449051824342, 1.1123287257098387], [79.0140537115052, 0.15007907336617343, 0.5000000000000001]], "r_squared_": 0.6609379334293292, "error_": 0.047991305915270975}
{"freq_range": [2.0, 80.0], "freq_res": 1.0, "aperiodic_params_": [-0.7144972200257336, 0.12908416220180707], "gaussian_params_": [[8.08846403951612, 0.47844553377186316, 1.0761368736664045], [19.891461750642748, 0.20869313084677604, 1.7545799178651855], [38.32332010884424, 0.1720594551177066, 1.132086808392881], [42.083885321459064, 0.17602331784744793, 1.18212048770655], [51.09004392978729, 0.09662229835390249, 5.999999999999999], [62.41600600189705, 0.5042428319667678, 0.26109405203831715], [70.42528807104958, 0.6333793143951464, 0.25943779873180217], [74.81094368305607, 0.19591656511464817, 0.490652195991752]], "peak_params_": [[8.08846403951612, 0.4768316676307821, 2.152273747332809], [19.891461750642748, 0.20829435708508903, 3.509159835730371], [38.32332010884424, 0.17457807657008495, 2.264173616785762], [42.083885321459064, 0.20712931564703785, 2.3642409754131], [51.09004392978729, 0.09661141834394305, 11.999999999999998], [62.41600600189705, 0.16019980815227464, 0.5221881040766343], [70.42528807104958, 0.16592492754257315, 0.5188755974636043], [74.81094368305607, 0.18193395027053927, 0.981304391983504]], "r_squared_": 0.5325677260408516, "error_": 0.055828931616525336}
{"freq_range": [2.0, 80.0], "freq_res": 1.0, "aperiodic_params_": [-0.6414801844773749, 0.31414277834073256], "gaussian_params_": [[8.23189747891936, 0.5252396882840717, 1.1595289098517805], [53.05200860522439, 0.11855324083139028, 5.999999999999999]], "peak_params_": [[8.23189747891936, 0.5148399829344695, 2.319057819703561], [53.05200860522439, 0.1185487871085158, 11.999999999999998]], "r_squared_": 0.7380828126213275, "error_": 0.0673737044344683}
{"freq_range": [2.0, 80.0], "freq_res": 1.0, "aperiodic_params_": [-0.6047260308173277, 0.3125981442575823], "gaussian_params_": [[7.486132695106928, 1.6830595678298608, 0.264530007598737], [9.405425881316809, 0.48797605443126046, 0.2870102985279113], [17.392604359400003, 0.7466227301268221, 0.2500001401291222], [18.530200190643562, 0.7035203775869859, 0.2893589349726178], [21.285784691471235, 0.3024883657799994, 0.6163475555088546], [24.280504197084273, 0.1801423711649685, 0.7770872816460208], [27.45124324509131, 0.7946503107097787, 0.2594314662725084], [41.57635199799093, 0.19759003360842, 0.5876146553321657], [45.700090734687315, 0.14675367460309996, 1.2026154369408042], [56.58614070866068, 0.22023498766565236, 0.7464610787083691]], "peak_params_": [[7.486132695106928, 0.31098881709492754, 0.529060015197474], [9.405425881316809, 0.1799306736008871, 0.5740205970558226], [17.392604359400003, 0.2175565169520406, 0.5000002802582444], [18.530200190643562, 0.18861966116639617, 0.5787178699452356], [21.285784691471235, 0.2716828073696108, 1.2326951110177091], [24.280504197084273, 0.16879897556555712, 1.5541745632920416], [27.45124324509131, 0.17547152778142872, 0.5188629325450168], [41.57635199799093, 0.15365973561533797, 1.1752293106643315], [45.700090734687315, 0.1422605297312043, 2.4052308738816084], [56.58614070866068, 0.1888587960245005, 1.4929221574167382]], "r_squared_": 0.8081102419631827, "error_": 0.05067355201041363}
{"freq_range": [2.0, 80.0], "freq_res": 1.0, "aperiodic_params_": [-0.14094218888641133, 0.7772000000637119], "gaussian_params_": [[7.474105737287973, 1.736641953287228, 0.2519822769680979], [13.869624686145281, 0.17113801080868724, 0.641342832813071], [19.001002759345877, 0.2521511474782397, 0.6449808561929727], [21.41443096520836, 1.0037566712872723, 0.2628268366179791], [24.0020142013072, 0.3575547280758179, 1.4160697417256871], [27.44294599857926, 1.1749442778693775, 0.26674944822847685], [29.64620512098376, 0.25494095353471313, 0.9231243186560516], [41.468491438606186, 1.1116019793642693, 0.2500111415141293], [56.48566724108013, 1.1040061128966574, 0.25054224620251]], "peak_params_": [[7.474105737287973, 0.29579877317568604, 0.5039645539361958], [13.869624686145281, 0.1676381749738265, 1.282685665626142], [19.001002759345877, 0.2528489652529162, 1.2899617123859455], [21.41443096520836, 0.32941219523546783, 0.5256536732359582], [24.0020142013072, 0.3575543682936897, 2.8321394834513742], [27.44294599857926, 0.338192173809462, 0.5334988964569537], [29.64620512098376, 0.2369337168445289, 1.8462486373121032], [41.468491438606186, 0.19206620847932365, 0.5000222830282586], [56.48566724108013, 0.1686589323788077, 0.50108449240502]], "r_squared_": 0.9533573820755218, "error_": 0.05286944257822947}
{"freq_range": [2.0, 80.0], "freq_res": 1.0, "aperiodic_params_": [0.054424373305062224, 0.9237543508324794], "gaussian_params_": [[7.760892305268721, 0.27084767176625124, 0.876674117940877], [19.157620811216134, 0.25512441977518385, 0.577196232673106], [21.417687751175944, 0.5197545025556254, 0.38310442715868226], [24.034740902102406, 0.39990360879275794, 1.4707876953675918], [27.320625292679527, 0.2957400763636139, 0.5448567386989008], [29.67234373822833, 0.2744221872616465, 1.0639353384064008], [41.42771435837475, 0.6586753375505217, 0.3026385158273238], [70.59266048282707, 0.4715507951452727, 0.29189359779526614]], "peak_params_": [[7.760892305268721, 0.2609586311842029, 1.753348235881754], [19.157620811216134, 0.24692827050487676, 1.154392465346212], [21.417687751175944, 0.3360147001874161, 0.7662088543173645], [24.034740902102406, 0.3997922517565129, 2.9415753907351836], [27.320625292679527, 0.3128292954603803, 1.0897134773978017], [29.67234373822833, 0.2618211777651578, 2.1278706768128015], [41.42771435837475, 0.24263155354308297, 0.6052770316546476], [70.59266048282707, 0.17809322222588087, 0.5837871955905323]], "r_squared_": 0.957030712704607, "error_": 0.061726653694803305}
{"freq_range": [2.0, 80.0], "freq_res": 1.0, "aperiodic_params_": [0.08945710452431095, 0.9462915168299328], "gaussian_params_": [[7.911327866085353, 0.2827060870770308, 1.020545643798395], [24.298930165885913, 0.33137759343281087, 4.824484453017823], [41.483692798457035, 0.7414731505101844, 0.30208985406952205], [70.55094992272049, 0.6790744111666617, 0.29587106692958454]], "peak_params_": [[7.911327866085353, 0.2827423298736033, 2.04109128759679], [24.298930165885913, 0.33074209564721957, 9.648968906035646], [41.483692798457035, 0.2066044726349041, 0.6041797081390441], [70.55094992272049, 0.2146460560444985, 0.5917421338591691]], "r_squared_": 0.9547112284186327, "error_": 0.06760123118152245}
{"freq_range": [2.0, 80.0], "freq_res": 1.0, "aperiodic_params_": [0.024987724270212692, 0.90135029996816], "gaussian_params_": [[8.114938457648826, 0.2779479923349656, 1.0775821588993315], [19.050678185507714, 0.15535545374287454, 0.25002589056177044], [21.44787698233855, 0.5237757536808526, 0.3017834049454406], [22.78855650473063, 0.09237241796741844, 0.5511083843467777], [24.452145985947613, 0.19032360492004274, 5.661678587737928], [24.512239003925288, 0.7797967932537757, 0.2708126457703296], [70.51260610663564, 1.2593891501637167, 0.25001017976494183]], "peak_params_": [[8.114938457648826, 0.2791631000148993, 2.155164317798663], [19.050678185507714, 0.27190403662492124, 0.5000517811235409], [21.44787698233855, 0.33264204070923553, 0.6035668098908812], [22.78855650473063, 0.2699841253814079, 1.1022167686935553], [24.452145985947613, 0.3283071773580637, 11.323357175475856], [24.512239003925288, 0.34347916262509703, 0.5416252915406592], [70.51260610663564, 0.18831467749100406, 0.5000203595298837]], "r_squared_": 0.9565163792389764, "error_": 0.05820468851960283}
{"freq_range": [2.0, 80.0], "freq_res": 1.0, "aperiodic_params_": [-0.2458236980548336, 0.6903534563847742], "gaussian_params_": [[8.292863533596966, 0.2810944542384661, 1.0541457382675221], [22.790361785224935, 0.17423079257454396, 5.575432072128695], [25.003307306066677, 0.10282452667731488, 0.2500006432636861], [27.0229095904835, 0.08199264515270005, 0.2504680759134083], [41.60782288146326, 0.6412417650306326, 0.27798054905065256], [53.01931339181971, 0.22496637890446292, 0.2500000000003854], [64.78926124454657, 0.3921357889848638, 0.4246872174596648], [70.50816697497724, 1.5987563476893907, 0.251365797303557], [74.93468952653114, 0.2590870032191331, 0.6496032674731963], [79.99999999999999, 0.3194977600503658, 1.5974514591313604]], "peak_params_": [[8.292863533596966, 0.27561739620250014, 2.1082914765350442], [22.790361785224935, 0.17410767351962742, 11.15086414425739], [25.003307306066677, 0.26388685015558233, 0.5000012865273722], [27.0229095904835, 0.2126694606771251, 0.5009361518268166], [41.60782288146326, 0.2374979296007389, 0.5559610981013051], [53.01931339181971, 0.22429614051935154, 0.5000000000007708], [64.78926124454657, 0.34671062331405844, 0.8493744349193296], [70.50816697497724, 0.23574633929500766, 0.502731594607114], [74.93468952653114, 0.26016383364663453, 1.2992065349463926], [79.99999999999999, 0.3194977600503821, 3.194902918262721]], "r_squared_": 0.9243500726046981, "error_": 0.05528382797057151}
{"freq_range": [2.0, 80.0], "freq_res": 1.0, "aperiodic_params_": [-0.5710592580670474, 0.3598077259446572], "gaussian_params_": [[8.468895532600284, 0.34849994924771033, 1.0241850472010903], [41.77965972578787, 0.22331354063624093, 0.4454927029852483], [52.653608705773685, 0.5699229301072678, 0.25001018442081097], [55.43751674951793, 0.7836762493899004, 0.2718647400924684]], "peak_params_": [[8.468895532600284, 0.31382550262396425, 2.0483700944021805], [41.77965972578787, 0.19760353570317635, 0.8909854059704966], [52.653608705773685, 0.2182593238295396, 0.5000203688416219], [55.43751674951793, 0.21465759802334528, 0.5437294801849368]], "r_squared_": 0.7636151697930986, "error_": 0.06148047815820938}
{"freq_range": [2.0, 80.0], "freq_res": 1.0, "aperiodic_params_": [-0.8431225486970513, -0.03966211672507899], "gaussian_params_": [[8.588692032083934, 0.3456661398889028, 1.0852290603888173], [17.25484680596368, 0.22922051648027703, 0.8299637776532016], [19.432312764473988, 0.3964331726925715, 0.32162357553643395], [21.46635118892458, 0.5453079690091746, 0.3063236682728233], [24.049046140067595, 0.14307764124302086, 0.2501494622521139], [35.83933902011455, 0.1839219727972539, 0.5306877048405073], [39.944601670593485, 0.13631636452742257, 1.0761419937068963], [43.40869874294638, 0.42187435987726457, 0.27600200769566274], [49.837815757189816, 0.15812275445104623, 2.935040295970109], [57.12866933498806, 0.14671675886947547, 0.8905809892346042]], "peak_params_": [[8.588692032083934, 0.32171007327622514, 2.1704581207776346], [17.25484680596368, 0.21866530320312794, 1.6599275553064032], [19.432312764473988, 0.18576331986406525, 0.6432471510728679], [21.46635118892458, 0.1711510620330967, 0.6126473365456466], [24.049046140067595, 0.14035377892462353, 0.5002989245042277], [35.83933902011455, 0.1758509162285783, 1.0613754096810146], [39.944601670593485, 0.13671046294164613, 2.1522839874137927], [43.40869874294638, 0.1538449538796436, 0.5520040153913255], [49.837815757189816, 0.15788152958526214, 5.870080591940218], [57.12866933498806, 0.1532460991094029, 1.7811619784692083]], "r_squared_": 0.37679331811947364, "error_": 0.046367187014676355}
{"freq_range": [2.0, 80.0], "freq_res": 1.0, "aperiodic_params_": [-0.764600005180608, 0.194419363882492], "gaussian_params_": [[7.487718907811186, 1.5768982981290856, 0.2709888012447632], [9.492708637803053, 0.9561057414301329, 0.2974775833371743], [19.11381462968043, 0.11414165824758639, 0.25001266253064897], [22.029708186272863, 0.1057998425340957, 5.999999999999998], [37.2452819499735, 0.15210416760661818, 1.4867470080948897], [41.76900049933306, 0.1505066450731843, 0.9779604964468556], [49.54796540086405, 0.11092272954643065, 5.999999999999999]], "peak_params_": [[7.487718907811186, 0.31678372511564723, 0.5419776024895264], [9.492708637803053, 0.25256397695477584, 0.5949551666743486], [19.11381462968043, 0.19604277037510454, 0.5000253250612979], [22.029708186272863, 0.10580147987599242, 11.999999999999996], [37.2452819499735, 0.16720917629810383, 2.9734940161897794], [41.76900049933306, 0.19797406137019347, 1.9559209928937111], [49.54796540086405, 0.11061039905741676, 11.999999999999998]], "r_squared_": 0.6369846569581323, "error_": 0.05101221981187613}
{"freq_range": [2.0, 80.0], "freq_res": 1.0, "aperiodic_params_": [-0.4406096163546718, 0.6761384086970104], "gaussian_params_": [[7.471986928425899, 1.3695700330578773, 0.2783557658028604], [9.418386927788132, 0.532196718692375, 0.30153422825256765], [16.452034599135946, 0.09031175763693003, 5.999975805305272], [21.398240873058466, 0.12775599890820497, 2.0163823601488198], [27.880356747144813, 0.23549384884777871, 1.120389491768432], [41.441440645188166, 0.6123270012203234, 0.2743141117996762], [50.49562128212602, 0.12107554395355598, 4.719220973985826], [67.96750692372483, 0.17577909858893984, 0.500050677823621], [70.76832088580012, 0.2837371016629622, 0.2500247976739016]], "peak_params_": [[7.471986928425899, 0.35139050366047475, 0.5567115316057208], [9.418386927788132, 0.24500378712032733, 0.6030684565051353], [16.452034599135946, 0.09360403531571881, 11.999951610610545], [21.398240873058466, 0.19304949535232963, 4.0327647202976395], [27.880356747144813, 0.24892659363994407, 2.240778983536864], [41.441440645188166, 0.18375403605257534, 0.5486282235993524], [50.49562128212602, 0.12040968974824984, 9.438441947971652], [67.96750692372483, 0.1755330027627635, 1.000101355647242], [70.76832088580012, 0.18470939533084407, 0.5000495953478032]], "r_squared_": 0.9389303046269197, "error_": 0.05057901211964556}
{"freq_range": [2.0, 80.0], "freq_res": 1.0, "aperiodic_params_": [-0.15628185925260407, 0.828009393920784], "gaussian_params_": [[7.466867818803436, 1.7246079860616421, 0.250000534276419], [13.973507538133038, 0.13218819551959932, 3.441284419456494], [20.755624048856728, 0.22467348953835165, 1.4641369903512313], [23.920218885074167, 0.21884375707355022, 0.6709050576838407], [27.835552715496885, 0.27078725165053164, 1.6339488888564917], [41.434408151084234, 0.6141988200534768, 0.2704622842476173], [52.78729456131886, 0.10113114149713621, 5.999999999999999], [68.3973141197575, 0.629154630422777, 0.2500891955577594], [70.69368534583303, 0.37837029974448266, 0.25003705896895595]], "peak_params_": [[7.466867818803436, 0.3185436676040577, 0.500001068552838], [13.973507538133038, 0.13218963125931293, 6.882568838912988], [20.755624048856728, 0.2380653020622836, 2.9282739807024627], [23.920218885074167, 0.2557096599503157, 1.3418101153676814], [27.835552715496885, 0.26947290466813567, 3.2678977777129834], [41.434408151084234, 0.18377268837626293, 0.5409245684952346], [52.78729456131886, 0.1010676123306462, 11.999999999999998], [68.3973141197575, 0.18217545741788443, 0.5001783911155188], [70.69368534583303, 0.1796662548935446, 0.5000741179379119]], "r_squared_": 0.9482234469989299, "error_": 0.05585431704677086}
{"freq_range": [2.0, 80.0], "freq_res": 1.0, "aperiodic_params_": [-0.11675409718672565, 0.8485534040821883], "gaussian_params_": [[7.763168325462508, 0.3438304236552151, 0.9211050806778381], [18.961820801510754, 0.06584772027350552, 0.2508563049030539], [23.000678720543664, 0.1996647414626185, 5.999999999642519], [41.48711711888258, 0.7068305474664235, 0.3166712913970733], [44.42456018877047, 0.5873893749577505, 0.29541756841352146], [70.59807895564757, 0.6812410592598546, 0.2931200468696431]], "peak_params_": [[7.763168325462508, 0.3414212228454768, 1.8422101613556763], [18.961820801510754, 0.22495645774354933, 0.5017126098061078], [23.000678720543664, 0.19966474018514813, 11.999999999285038], [41.48711711888258, 0.21874177804693118, 0.6333425827941466], [44.42456018877047, 0.20957274365755096, 0.5908351368270429], [70.59807895564757, 0.26609294318842425, 0.5862400937392862]], "r_squared_": 0.932364761243817, "error_": 0.07212764587609966}
{"freq_range": [2.0, 80.0], "freq_res": 1.0, "aperiodic_params_": [-0.04742933830071273, 0.8917070489494477], "gaussian_params_": [[7.888710539867956, 0.35371576960256756, 1.0317243177769557], [18.567099880487028, 0.1755828008004549, 1.2871770128392923], [21.48097009028194, 0.6489712772495816, 0.31487737133114624], [23.90942916708309, 0.22481538254043149, 0.8402483444168897], [28.228448762484195, 0.17541035822539444, 1.8051843028122367], [41.47844270703493, 0.36879235714703545, 0.4772139098849159], [48.13728729684707, 0.2236615372635532, 0.755861383827677], [70.59762893514143, 0.7510287086427982, 0.2861449798766434]], "peak_params_": [[7.888710539867956, 0.35166393438127586, 2.0634486355539114], [18.567099880487028, 0.1659287196369088, 2.5743540256785846], [21.48097009028194, 0.23214807991880282, 0.6297547426622925], [23.90942916708309, 0.23482476359166915, 1.6804966888337793], [28.228448762484195, 0.17401294881867613, 3.6103686056244735], [41.47844270703493, 0.22310790041979622, 0.9544278197698318], [48.13728729684707, 0.22000255057257578, 1.511722767655354], [70.59762893514143, 0.27943624770673936, 0.5722899597532868]], "r_squared_": 0.9419997060693961, "error_": 0.06809093424477912}
{"freq_range": [2.0, 80.0], "freq_res": 1.0, "aperiodic_params_": [-0.18089270220174852, 0.7978456842203367], "gaussian_params_": [[7.967571806056522, 0.3428558505198812, 1.0060671655590494], [16.452055401607787, 0.11854610482171787, 5.972091758217808], [21.45230522802569, 0.484565751751173, 0.2726707588329644], [24.95806473225938, 0.12453389420394137, 4.205416147731434], [41.51773080684278, 0.9358154114939701, 0.29455530246817235], [70.56557057537702, 0.8434891438824877, 0.27535159844748247]], "peak_params_": [[7.967571806056522, 0.38626070098706977, 2.012134331118099], [16.452055401607787, 0.13108935300256808, 11.944183516435617], [21.45230522802569, 0.2910969765198963, 0.5453415176659288], [24.95806473225938, 0.16709007669167408, 8.410832295462868], [41.51773080684278, 0.2450020514968585, 0.5891106049363447], [70.56557057537702, 0.24296978341175657, 0.5507031968949649]], "r_squared_": 0.9400685750600011, "error_": 0.06332736672843153}
{"freq_range": [2.0, 80.0], "freq_res": 1.0, "aperiodic_params_": [-0.2612485233582842, 0.7357054817021456], "gaussian_params_": [[8.403785475481367, 0.3587571815202919, 1.2092973805197726], [13.531736443508146, 0.8401371727278453, 0.26318919587944023], [18.586881337987695, 0.4695161578160902, 0.2500119346225346], [21.46181971791467, 0.5986227730177845, 0.2627009385688249], [22.379893654873857, 0.16664548304540924, 4.628355506198545], [41.523353716814306, 0.837000223342339, 0.2756619917887306], [53.02356171702527, 0.18004779904806037, 0.6856806165720241], [70.55934290272626, 0.9996147058778971, 0.25935251359656714], [79.99999999999999, 0.2154903775732614, 1.318958146214192]], "peak_params_": [[8.403785475481367, 0.3406411491491481, 2.4185947610395453], [13.531736443508146, 0.20493515058421796, 0.5263783917588805], [18.586881337987695, 0.24752277881815443, 0.5000238692450693], [21.46181971791467, 0.28706597979165605, 0.5254018771376499], [22.379893654873857, 0.23950268429099353, 9.25671101239709], [41.523353716814306, 0.18773803739071004, 0.5513239835774612], [53.02356171702527, 0.17994153177439864, 1.3713612331440481], [70.55934290272626, 0.23602952079565553, 0.5187050271931343], [79.99999999999999, 0.21549037757326128, 2.637916292428384]], "r_squared_": 0.9394415179166843, "error_": 0.055404457243462296}
{"freq_range": [2.0, 80.0], "freq_res": 1.0, "aperiodic_params_": [-0.6644773744148812, 0.40404636559120055], "gaussian_params_": [[8.738434179486799, 0.39707783482514164, 1.2154698078821693], [13.549579885793722, 0.7410533342531979, 0.28483112476960065], [37.4275757739413, 0.7899102050039044, 0.2556073916576379], [50.45203459913595, 0.10996019102258338, 5.999999999999999], [55.34733755947856, 0.30056452317378113, 0.2500079373532938], [58.357007955731135, 0.4856574853599407, 0.250003164916055], [70.57013404170873, 0.9932599544971974, 0.2558561119022429], [73.89020336854135, 0.22898003219599092, 0.5866394403965711]], "peak_params_": [[8.738434179486799, 0.3879891518486358, 2.4309396157643386], [13.549579885793722, 0.212275476286222, 0.5696622495392013], [37.4275757739413, 0.20387133885561837, 0.5112147833152758], [50.45203459913595, 0.10964856750324081, 11.999999999999998], [55.34733755947856, 0.19700371844367104, 0.5000158747065876], [58.357007955731135, 0.22503494395546042, 0.50000632983211], [70.57013404170873, 0.24247634035234755, 0.5117122238044858], [73.89020336854135, 0.22505412664032853, 1.1732788807931422]], "r_squared_": 0.7710163918159434, "error_": 0.06514587759321895}
{"freq_range": [2.0, 80.0], "freq_res": 1.0, "aperiodic_params_": [-1.1447861398497206, -0.21909854040924634], "gaussian_params_": [[8.875956743326444, 0.3445458343231073, 0.9417115010134525], [20.67479399871022, 0.1318361977176744, 4.3136690181504465], [41.36613266434595, 0.1716812609287033, 2.091778895707879], [43.97130435308028, 0.06218826474052564, 0.2501914128207737], [46.40725805864894, 0.4519358943569877, 0.271946706064929]], "peak_params_": [[8.875956743326444, 0.3449538370057921, 1.883423002026905], [20.67479399871022, 0.1314620774857742, 8.627338036300893], [41.36613266434595, 0.1690733982954844, 4.183557791415758], [43.97130435308028, 0.1394847158644149, 0.5003828256415473], [46.40725805864894, 0.1620183284219633, 0.543893412129858]], "r_squared_": 0.42537742991818034, "error_": 0.04906119833461738}
{"freq_range": [2.0, 80.0], "freq_res": 1.0, "aperiodic_params_": [-0.5042034991993123, 0.48310571488387233], "gaussian_params_": [[7.477748224916219, 1.3781421716622173, 0.2663103808097139], [9.514254006152429, 1.1679415945563336, 0.28112279036684085], [12.409173854814817, 0.6347973100387655, 0.2617675662927894], [20.893888626670524, 0.10005863957338756, 1.3048434993521678], [27.550341805930795, 0.15251370022474237, 1.4603928035376077], [43.42521272826679, 0.47716748115923113, 0.25000151256173986], [51.07634681943063, 0.09692951387419275, 5.999999999999999], [67.81399704694172, 0.1840210117083339, 0.48683794746554104]], "peak_params_": [[7.477748224916219, 0.2757124530251014, 0.5326207616194278], [9.514254006152429, 0.26249086873430016, 0.5622455807336817], [12.409173854814817, 0.18709850768731306, 0.5235351325855788], [20.893888626670524, 0.09973520136483716, 2.6096869987043356], [27.550341805930795, 0.14551244892486692, 2.9207856070752154], [43.42521272826679, 0.15150505197823927, 0.5000030251234797], [51.07634681943063, 0.0969216671595794, 11.999999999999998], [67.81399704694172, 0.17288340977324035, 0.9736758949310821]], "r_squared_": 0.880104922489507, "error_": 0.04791048054392745}
{"freq_range": [2.0, 80.0], "freq_res": 1.0, "aperiodic_params_": [-0.4344526405929937, 0.6864319904142807], "gaussian_params_": [[7.44833286927948, 1.2358913361869253, 0.29723125728430505], [9.483364529414926, 0.31568830705593215, 0.7070641359879326], [12.32142663753121, 0.26954830269550906, 0.7685932137935001], [14.322121975174378, 0.2271008352186331, 0.38979030300798556], [20.361376399896436, 0.10291661209309365, 0.9074861717146786], [20.6074067205785, 0.14524504475665814, 3.170533538872685], [28.293157772574833, 0.21237693443596137, 1.2168709387057712], [48.60934582217179, 0.12156150695168949, 5.999999999999999], [70.83654147807249, 0.24369916398591793, 0.6048704972949316]], "peak_params_": [[7.44833286927948, 0.396895114970514, 0.5944625145686101], [9.483364529414926, 0.25011000175259634, 1.4141282719758652], [12.32142663753121, 0.2511836033381508, 1.5371864275870002], [14.322121975174378, 0.20279157669232784, 0.7795806060159711], [20.361376399896436, 0.23767697465102944, 1.8149723434293572], [20.6074067205785, 0.2244816605342681, 6.34106707774537], [28.293157772574833, 0.21621994583356807, 2.4337418774115425], [48.60934582217179, 0.12130411892354154, 11.999999999999998], [70.83654147807249, 0.23507623309483927, 1.2097409945898632]], "r_squared_": 0.9288150099230543, "error_": 0.05596318302418888}
{"freq_range": [2.0, 80.0], "freq_res": 1.0, "aperiodic_params_": [-0.2497850231459224, 0.814340395461542], "gaussian_params_": [[7.407100851921574, 0.4915775276521397, 0.4770362321547413], [12.009080974320408, 0.24717190620144025, 2.510328776665857], [20.71572234507549, 0.24235148272089588, 2.701376387729318], [28.15408158141241, 0.23284465529032475, 1.2888434909860695], [41.4983251753816, 0.703535142313477, 0.29534753115395374], [50.18725748204471, 0.13977857311361216, 5.99999999581792], [71.02191075361162, 0.2756734355570056, 0.4837527979054693]], "peak_params_": [[7.407100851921574, 0.3753055279181755, 0.9540724643094826], [12.009080974320408, 0.2485007944074885, 5.020657553331714], [20.71572234507549, 0.24141937370629174, 5.402752775458636], [28.15408158141241, 0.23772718044090047, 2.577686981972139], [41.4983251753816, 0.2127589087230557, 0.5906950623079075], [50.18725748204471, 0.1397105148734259, 11.99999999163584], [71.02191075361162, 0.2757317015325291, 0.9675055958109386]], "r_squared_": 0.9373286874515007, "error_": 0.06333857143237656}
{"freq_range": [2.0, 80.0], "freq_res": 1.0, "aperiodic_params_": [-0.18049946890337518, 0.841896060655297], "gaussian_params_": [[7.556977082984075, 0.4343928177095407, 0.7308503436142387], [12.246542044241453, 0.1791065295263949, 2.371216389912117], [19.420398504885434, 0.10155304193033686, 2.263374745080135], [23.54796257166536, 0.10438015398803957, 5.600807836457839], [41.49782441202957, 1.4699222746483362, 0.26069718735897873], [44.252751558238366, 0.2370869851233026, 0.49591776903543966], [48.104025687444896, 0.26665056238193213, 0.5797900476217401], [52.29208411453378, 0.2022789221721016, 1.4502888892167105], [70.81832567456321, 0.3231195723518134, 0.44822476750802365]], "peak_params_": [[7.556977082984075, 0.3997319756015888, 1.4617006872284775], [12.246542044241453, 0.19107080199545545, 4.742432779824234], [19.420398504885434, 0.17798345390504022, 4.52674949016027], [23.54796257166536, 0.11715460256450849, 11.201615672915677], [41.49782441202957, 0.23820233085772546, 0.5213943747179575], [44.252751558238366, 0.2083430132618791, 0.9918355380708793], [48.104025687444896, 0.26493615053405484, 1.1595800952434803], [52.29208411453378, 0.19821820002101176, 2.900577778433421], [70.81832567456321, 0.2976387255716004, 0.8964495350160473]], "r_squared_": 0.9416327303288743, "error_": 0.06263434479071191}
{"freq_range": [2.0, 80.0], "freq_res": 1.0, "aperiodic_params_": [-0.2473327692240732, 0.7756643559215213], "gaussian_params_": [[7.7553231188165475, 0.3802123590951551, 0.8763336694445173], [11.857255097059511, 0.17973814625776408, 2.2810880167490266], [18.5534541080145, 0.42024878345636973, 0.25343051161544977], [21.509600062707396, 0.17768858083050212, 5.179210372506815], [41.60061353557352, 0.27838778465426955, 0.8079414113216933], [48.31348365407251, 0.35972010750569827, 0.4455978244682701], [70.82985778777886, 0.328579506559873, 0.5442821262931782]], "peak_params_": [[7.7553231188165475, 0.41462230721983495, 1.7526673388890346], [11.857255097059511, 0.21231957254169154, 4.562176033498053], [18.5534541080145, 0.24833097468147636, 0.5068610232308995], [21.509600062707396, 0.17690298186295061, 10.35842074501363], [41.60061353557352, 0.24644129412253357, 1.6158828226433866], [48.31348365407251, 0.28086177029123727, 0.8911956489365402], [70.82985778777886, 0.31291127260611673, 1.0885642525863564]], "r_squared_": 0.9304395533054147, "error_": 0.06659662982877547}
{"freq_range": [2.0, 80.0], "freq_res": 1.0, "aperiodic_params_": [-0.32846232421160687, 0.7288152445133098], "gaussian_params_": [[8.175607880893127, 0.3930588929469455, 1.0664226479372612], [13.556160255142872, 0.6097356058818328, 0.31471803866607756], [15.91190232503512, 0.11155112653968105, 0.2500101097631636], [19.595721294421704, 0.16826467265728345, 5.999999999999999], [41.48760662209513, 1.0129203607253923, 0.28418543121323847], [48.07620824997764, 0.24613766052598202, 0.5817853062530597], [70.6837818970432, 0.5893372840568387, 0.2500031778591961]], "peak_params_": [[8.175607880893127, 0.41376393025183655, 2.1328452958745223], [13.556160255142872, 0.33448341832433504, 0.6294360773321551], [15.91190232503512, 0.24544270880262298, 0.5000202195263272], [19.595721294421704, 0.16788314208258703, 11.999999999999998], [41.48760662209513, 0.23272273053710024, 0.5683708624264769], [48.07620824997764, 0.24403730853466943, 1.1635706125061194], [70.6837818970432, 0.2648246438922308, 0.5000063557183922]], "r_squared_": 0.9333198648574842, "error_": 0.059081577604545646}
{"freq_range": [2.0, 80.0], "freq_res": 1.0, "aperiodic_params_": [-0.5384950764890795, 0.5916546826936682], "gaussian_params_": [[8.471050122398063, 0.4290591810098451, 1.2032024110386152], [13.872968967180753, 0.3017567859731419, 1.358637774503198], [22.284760800051853, 0.15023287231568277, 3.724181769680081], [42.18035233141946, 0.19727734403637334, 1.271168076853931], [48.19016784483339, 0.28227804139694335, 0.4820313531697871], [70.82639759665368, 0.3306000705688515, 0.2500000000008838], [73.78995437711018, 0.22183570211611384, 0.8294066177122895]], "peak_params_": [[8.471050122398063, 0.3975289626024058, 2.4064048220772305], [13.872968967180753, 0.3131035896467096, 2.717275549006396], [22.284760800051853, 0.14979434773504696, 7.448363539360162], [42.18035233141946, 0.19530185812858214, 2.542336153707862], [48.19016784483339, 0.2611495799620185, 0.9640627063395742], [70.82639759665368, 0.2605471400210577, 0.5000000000017676], [73.78995437711018, 0.2148348805317204, 1.658813235424579]], "r_squared_": 0.8980338276301362, "error_": 0.061941750789819096}
{"freq_range": [2.0, 80.0], "freq_res": 1.0, "aperiodic_params_": [-0.9051486953443452, 0.3114142483305834], "gaussian_params_": [[8.826022942432783, 0.43344705057052385, 1.2258284618483506], [13.787280761443114, 0.371942249910022, 1.255331996267435]], "peak_params_": [[8.826022942432783, 0.4293619911255744, 2.451656923696701], [13.787280761443114, 0.36669906428693855, 2.51066399253487]], "r_squared_": 0.7662258583415279, "error_": 0.06586382137936664}
{"freq_range": [2.0, 80.0], "freq_res": 1.0, "aperiodic_params_": [-0.9156051610362355, 0.6715734798259719], "gaussian_params_": [[7.3892096416584385, 0.38298145430534697, 0.6388681489472323], [27.847842405900888, 0.312886834058736, 0.7546538967398523], [33.561819238176845, 1.1425485736411383, 0.2570732833039042], [41.58049061174023, 0.34713414886801475, 1.0874780710594045], [48.11083705253457, 0.29918981614548645, 0.7163416759793199], [56.782138644093905, 0.25664470312469884, 0.49079312166395656], [71.38284928728444, 1.136205757395224, 0.25003147852770125]], "peak_params_": [[7.3892096416584385, 0.31811520557628237, 1.2777362978944646], [27.847842405900888, 0.3065911552445102, 1.5093077934797046], [33.561819238176845, 0.2672971120733416, 0.5141465666078084], [41.58049061174023, 0.32224255802181334, 2.174956142118809], [48.11083705253457, 0.2956298286666059, 1.4326833519586397], [56.782138644093905, 0.23256519460214098, 0.9815862433279131], [71.38284928728444, 0.3518328934281474, 0.5000629570554025]], "r_squared_": 0.8774554812224693, "error_": 0.07066315611227125}
{"freq_range": [2.0, 80.0], "freq_res": 1.0, "aperiodic_params_": [-0.521521829082913, 0.6144817557531439], "gaussian_params_": [[7.320371294928785, 0.4037395961553375, 0.6774999706727936], [10.309625874256385, 0.2876019579908498, 1.1082264190169187], [12.939946948703248, 0.21648075067642536, 0.7253449721275841], [20.331858539197718, 0.16235805980956555, 2.2082716228293195], [27.440803102479336, 0.9193454602582211, 0.2649430107142063], [41.528608876134726, 0.29837389825421784, 0.7911541980685788], [63.00607977118684, 0.2039801584315728, 0.6254795624125579], [71.41445791701726, 0.34104723937519865, 0.7333447024308055]], "peak_params_": [[7.320371294928785, 0.3643592504739025, 1.354999941345587], [10.309625874256385, 0.27681672991236717, 2.2164528380338373], [12.939946948703248, 0.231498326243879, 1.4506899442551682], [20.331858539197718, 0.1605350242158874, 4.416543245658639], [27.440803102479336, 0.23205109866811857, 0.5298860214284126], [41.528608876134726, 0.249845422416759, 1.5823083961371576], [63.00607977118684, 0.20397052245149871, 1.2509591248251157], [71.41445791701726, 0.29070745463978365, 1.466689404861611]], "r_squared_": 0.9159138301613026, "error_": 0.05449701972276701}
{"freq_range": [2.0, 80.0], "freq_res": 1.0, "aperiodic_params_": [-0.23737056164625767, 0.8531322342154953], "gaussian_params_": [[7.418649158807167, 0.5229271913947319, 0.44564381303672623], [11.559041208471243, 0.270502060512029, 2.311406151409423], [20.675085665609807, 0.22422240125954435, 2.742295393895852], [28.138456438902292, 0.2265452085439126, 1.0736208026422815], [41.88762994703124, 0.26110947882349583, 1.451575784886198], [47.99213410011707, 0.28920977955928845, 0.7437596066077615], [52.23522908762685, 0.23784753952406007, 1.172812840353747], [56.505051774743464, 1.1123764633736815, 0.2668690073066165], [72.40956044117965, 0.20106400833941634, 2.6863471056736525]], "peak_params_": [[7.418649158807167, 0.37503148607376546, 0.8912876260734525], [11.559041208471243, 0.2671293543876675, 4.622812302818846], [20.675085665609807, 0.22271856492335163, 5.484590787791704], [28.138456438902292, 0.23099903406312516, 2.147241605284563], [41.88762994703124, 0.26032827583053164, 2.903151569772396], [47.99213410011707, 0.2895808733113374, 1.487519213215523], [52.23522908762685, 0.23311145085766483, 2.345625680707494], [56.505051774743464, 0.19927870787198487, 0.533738014613233], [72.40956044117965, 0.19874076423613762, 5.372694211347305]], "r_squared_": 0.9427086159149128, "error_": 0.056923338643818704}
{"freq_range": [2.0, 80.0], "freq_res": 1.0, "aperiodic_params_": [-0.12414708870611887, 0.8893565484793512], "gaussian_params_": [[7.700125376810607, 0.366667023147673, 0.8569004223624433], [10.782120112028842, 0.1911502437084386, 0.7238444415384738], [13.698903567921196, 0.24124221838810048, 1.462699886009507], [20.790142905923446, 0.17352561833370783, 2.6201236114671835], [28.45193628552726, 0.16068710441713663, 1.1695802797569053], [34.00819986123918, 0.19353873121366494, 0.2500588080020963], [41.76243112572818, 0.3116127318325235, 0.8856403134090003], [44.37084541119691, 0.28346474636238894, 0.3235864473140626], [48.3217427541972, 0.33703311714338313, 0.5699789643185483], [52.42533540400392, 0.19314846767320945, 1.0591854901968163], [56.72881287761478, 0.23913210637490043, 0.662249848503174], [63.46632140899025, 0.44236474195150643, 0.3124219119898598], [70.85082419873373, 0.33265755937101227, 0.3792345430901305], [73.40819928098632, 0.1938100366950201, 1.1449891187312153]], "peak_params_": [[7.700125376810607, 0.3451298814249002, 1.7138008447248867], [10.782120112028842, 0.22703620536247338, 1.4476888830769477], [13.698903567921196, 0.24223389751741264, 2.925399772019014], [20.790142905923446, 0.17297085570045234, 5.240247222934367], [28.45193628552726, 0.15306437502804338, 2.3391605595138105], [34.00819986123918, 0.19343731576689538, 0.5001176160041926], [41.76243112572818, 0.3006008771581845, 1.7712806268180006], [44.37084541119691, 0.15980080167359723, 0.6471728946281252], [48.3217427541972, 0.28742736747867603, 1.1399579286370967], [52.42533540400392, 0.17818646792177706, 2.1183709803936326], [56.72881287761478, 0.2199173441838087, 1.324499697006348], [63.46632140899025, 0.1452135121709024, 0.6248438239797196], [70.85082419873373, 0.3291136766272662, 0.758469086180261], [73.40819928098632, 0.18187674585390656, 2.2899782374624307]], "r_squared_": 0.9731308173509696, "error_": 0.03631714020077275}
{"freq_range": [2.0, 80.0], "freq_res": 1.0, "aperiodic_params_": [-0.294001892690714, 0.7714908029263348], "gaussian_params_": [[7.80291641539872, 0.3564221383814023, 0.9043977999041334], [13.792150989225124, 0.27033622775904886, 3.269623536793124], [21.154324644468073, 0.2679963453790524, 0.5631488770470447], [23.748479704617196, 0.19557290295953428, 0.6999224366951344], [27.685643846348654, 0.2383836879771103, 0.5972914969155422], [33.67895057422045, 0.3672051807895616, 0.29258215239657437], [42.35548555224813, 0.23493958694697736, 1.5244533894041952], [48.30698226780567, 0.3706480165065274, 0.5109941797094748], [52.55386882996996, 0.15785670912260072, 1.2333164850488219], [71.34556078262946, 0.7087722904600857, 0.2849864144193428]], "peak_params_": [[7.80291641539872, 0.4043510219536759, 1.8087955998082668], [13.792150989225124, 0.269790550351118, 6.539247073586248], [21.154324644468073, 0.28200997184908405, 1.1262977540940895], [23.748479704617196, 0.1854120817020899, 1.3998448733902689], [27.685643846348654, 0.20757394020375441, 1.1945829938310843], [33.67895057422045, 0.2011178626420933, 0.5851643047931487], [42.35548555224813, 0.22863798048374395, 3.0489067788083903], [48.30698226780567, 0.3098715604293534, 1.0219883594189496], [52.55386882996996, 0.14785948034013496, 2.4666329700976437], [71.34556078262946, 0.33981229835768567, 0.5699728288386856]], "r_squared_": 0.9448126955013553, "error_": 0.05323859242803831}
{"freq_range": [2.0, 80.0], "freq_res": 1.0, "aperiodic_params_": [-0.4872350306074598, 0.6452461248721617], "gaussian_params_": [[8.38001787019309, 0.3206206074366513, 1.3851587906960778], [13.911294127813722, 0.3423244234758546, 1.5399361534764915], [20.87260654515797, 0.26427380324546956, 0.6335485512322452], [23.77955822105951, 0.21956933204297374, 0.6584309543184984], [27.69994674676229, 0.3369751659718639, 0.4958399781144329], [33.50512994163585, 1.092429217719273, 0.2999991397302946], [41.35898175196986, 0.43729321084045575, 0.27846570347766353], [42.772489741748956, 0.25556516231786114, 1.072370112447984], [48.18637756528171, 0.42185147948927193, 0.6643738297888481], [53.172869271686004, 0.17950778746810858, 1.0812807665589748], [70.61132997763417, 0.7566552062218148, 0.2909411022452238], [73.41586441508464, 0.18611431808134116, 1.0929139268266461], [78.58912035414244, 0.24818451615575343, 0.6217733453167962]], "peak_params_": [[8.38001787019309, 0.3089947632078063, 2.7703175813921557], [13.911294127813722, 0.34184233895522964, 3.079872306952983], [20.87260654515797, 0.25902298087946773, 1.2670971024644904], [23.77955822105951, 0.20760339329818445, 1.3168619086369968], [27.69994674676229, 0.28059468764958195, 0.9916799562288658], [33.50512994163585, 0.2802314637444998, 0.5999982794605891], [41.35898175196986, 0.25570334350933743, 0.5569314069553271], [42.772489741748956, 0.2498778708448841, 2.144740224895968], [48.18637756528171, 0.40557813519181773, 1.3287476595776961], [53.172869271686004, 0.1772282865342516, 2.1625615331179495], [70.61132997763417, 0.32617542876851835, 0.5818822044904476], [73.41586441508464, 0.17311692960352287, 2.1858278536532922], [78.58912035414244, 0.1995038640419715, 1.2435466906335924]], "r_squared_": 0.9230919038193128, "error_": 0.05176366955204235}
{"freq_range": [2.0, 80.0], "freq_res": 1.0, "aperiodic_params_": [-0.7962431146273896, 0.3158760179700006], "gaussian_params_": [[8.922692028052387, 0.19426561346262008, 1.400458370969776], [13.64247128365398, 0.27165383452866876, 1.3142572890035202], [20.84679424704982, 0.22171085637440838, 0.6005548042136601], [23.675381926663295, 0.2036565814712143, 0.677600715746884], [33.4911617922458, 1.2760685275907264, 0.2504002576499542], [42.09386670283052, 0.2178764839376515, 2.1408839055627267], [47.911257847171555, 0.1883457753117524, 1.2256293009324135], [56.370553403216284, 0.2722174828126376, 0.48749873800190274], [72.76623895949903, 0.10039775381790111, 5.99999999999647]], "peak_params_": [[8.922692028052387, 0.19450012226692848, 2.800916741939552], [13.64247128365398, 0.2620574435953038, 2.6285145780070405], [20.84679424704982, 0.21469648440459643, 1.2011096084273203], [23.675381926663295, 0.18157748021228404, 1.355201431493768], [33.4911617922458, 0.18640579837948956, 0.5008005152999084], [42.09386670283052, 0.21766903489975453, 4.281767811125453], [47.911257847171555, 0.19272100373134027, 2.451258601864827], [56.370553403216284, 0.20594131845171826, 0.9749974760038055], [72.76623895949903, 0.10032158609528907, 11.99999999999294]], "r_squared_": 0.7362882944273474, "error_": 0.055514852288426876}
{"freq_range": [2.0, 80.0], "freq_res": 1.0, "aperiodic_params_": [-0.3891649348944666, 0.7595625701817149], "gaussian_params_": [[7.410047344944758, 0.42441755967167116, 0.5628149714291275], [11.49235669419607, 0.20186809612907028, 2.0454918102344686], [33.55126818595468, 0.9906024104078721, 0.2772622961312908], [41.71884033183119, 0.30922172121621677, 1.196663179619511], [48.17741766434156, 0.25940616565480484, 0.6450886407338614], [56.57824795095155, 0.8261591005671776, 0.28316993508006183], [71.36099151834367, 0.8737977568061477, 0.2500004767582973], [73.87036422082979, 0.2462600574014391, 0.9189650337600074]], "peak_params_": [[7.410047344944758, 0.3435843778973364, 1.125629942858255], [11.49235669419607, 0.1961040627650783, 4.090983620468937], [33.55126818595468, 0.26737244269912464, 0.5545245922625816], [41.71884033183119, 0.30080346018362913, 2.393326359239022], [48.17741766434156, 0.2497788765062734, 1.2901772814677228], [56.57824795095155, 0.2724997719498956, 0.5663398701601237], [71.36099151834367, 0.3099466181677393, 0.5000009535165946], [73.87036422082979, 0.24382192686259763, 1.8379300675200148]], "r_squared_": 0.9250110023624948, "error_": 0.06337615249708631}
{"freq_range": [2.0, 80.0], "freq_res": 1.0, "aperiodic_params_": [-0.42325981772701404, 0.7020670381557242], "gaussian_params_": [[7.506699046334937, 0.8951257782713371, 0.2967849498551317], [14.931836723942615, 0.10940300129097165, 5.999999999989366], [27.875413406362032, 0.2019569316685947, 0.3774388808291529], [33.53334658489768, 1.1005414851767452, 0.2871349575031963], [35.96538109740465, 0.21811274282447884, 0.25000671548969533], [42.113832708783846, 0.31280133896454376, 1.2461792941207885], [48.20930700853929, 0.3630738021166435, 0.6900151336312639], [56.81765248128431, 0.23686823912172641, 0.49787996411206004], [71.34258164683241, 0.6412972205200838, 0.2842062933329368], [73.63081437278856, 0.22746032452953055, 1.077499716574525]], "peak_params_": [[7.506699046334937, 0.2810161377448961, 0.5935698997102634], [14.931836723942615, 0.10939594163337296, 11.999999999978732], [27.875413406362032, 0.20145673152637156, 0.7548777616583058], [33.53334658489768, 0.2945045682671452, 0.5742699150063926], [35.96538109740465, 0.21626346779926875, 0.5000134309793907], [42.113832708783846, 0.31150321842449036, 2.492358588241577], [48.20930700853929, 0.3467529228229982, 1.3800302672625278], [56.81765248128431, 0.22150280458423133, 0.9957599282241201], [71.34258164683241, 0.32167839322045944, 0.5684125866658736], [73.63081437278856, 0.21449309851604026, 2.15499943314905]], "r_squared_": 0.9159619421929763, "error_": 0.057289993742568525}
{"freq_range": [2.0, 80.0], "freq_res": 1.0, "aperiodic_params_": [-0.4631464472107695, 0.654452432035438], "gaussian_params_": [[7.5583091112285805, 0.3401590920181319, 0.8036231727374419], [13.125669132105614, 0.22155006191232182, 2.649747424401365], [20.93728837134681, 0.2256308970971691, 0.6305326676103027], [27.768678227484685, 0.2957209125586784, 0.46019382848159396], [33.5253737574239, 1.1705513753073709, 0.2945651164932444], [42.239857504950265, 0.3151251412672607, 1.2392324306930014], [48.23660226263916, 0.4236462116158264, 0.7022313239823248], [53.595103886346585, 0.6293179910048421, 0.280877293781169], [71.0147569943735, 0.35016506379234275, 0.250000015980551], [73.75861456552987, 0.24496345034030256, 0.9294775405652659]], "peak_params_": [[7.5583091112285805, 0.32658597850105586, 1.6072463454748838], [13.125669132105614, 0.22130103522211353, 5.29949484880273], [20.93728837134681, 0.2271956689150798, 1.2610653352206054], [27.768678227484685, 0.2606248246347487, 0.9203876569631879], [33.5253737574239, 0.31961656739116817, 0.5891302329864888], [42.239857504950265, 0.30927733455035167, 2.4784648613860027], [48.23660226263916, 0.4002759014730539, 1.4044626479646496], [53.595103886346585, 0.22265345761562472, 0.561754587562338], [71.0147569943735, 0.35255022973305206, 0.500000031961102], [73.75861456552987, 0.23684050487847608, 1.8589550811305318]], "r_squared_": 0.9009709964927667, "error_": 0.06042731176058175}
{"freq_range": [2.0, 80.0], "freq_res": 1.0, "aperiodic_params_": [-1.0095959452222243, 0.5566800219803973], "gaussian_params_": [[7.486895949032945, 1.865002943141441, 0.2619595152409381], [9.415749166919332, 0.27303130287993427, 0.6574164905181268], [20.626729747018924, 0.18796966598574538, 2.237058313873001], [27.999321476896068, 0.3141615259667775, 1.1926994470157573], [36.425010157620186, 0.8464136817604255, 0.2556251806572605], [41.46883993313972, 1.2191791009361286, 0.2606114023520275], [50.45203459913595, 0.13617870203025514, 5.999999999999999], [70.5464995079639, 0.8878966875586907, 0.2734836510680605]], "peak_params_": [[7.486895949032945, 0.3318409455489557, 0.5239190304818762], [9.415749166919332, 0.22354755704038176, 1.3148329810362536], [20.626729747018924, 0.18537192725578677, 4.474116627746002], [27.999321476896068, 0.3151079826767109, 2.3853988940315145], [36.425010157620186, 0.2199646349593225, 0.511250361314521], [41.46883993313972, 0.28108310446351825, 0.521222804704055], [50.45203459913595, 0.13579277612387464, 11.999999999999998], [70.5464995079639, 0.2249104748063795, 0.546967302136121]], "r_squared_": 0.8912137753320803, "error_": 0.05726648008594547}
{"freq_range": [2.0, 80.0], "freq_res": 1.0, "aperiodic_params_": [-0.9281405670421867, 0.4206997782836206], "gaussian_params_": [[8.24662681039982, 0.36245935804383855, 1.1672023602868629], [13.766864090813892, 0.20081802308831082, 0.5403861092832242], [22.30774268222455, 0.20476984576558815, 1.7345213068575045], [28.551156213796396, 0.1484641693338397, 1.9844035303210474], [41.547449127052644, 1.3336806100138738, 0.2500177153336425], [53.700345302925264, 0.18072441218562538, 1.0612766098273163], [57.95504264397934, 0.18330379005399705, 0.6864907313437414], [63.414456414586475, 0.21563353650477568, 0.6298018741130837]], "peak_params_": [[8.24662681039982, 0.35445771532843484, 2.3344047205737257], [13.766864090813892, 0.1829764907050282, 1.0807722185664483], [22.30774268222455, 0.20221038902310284, 3.469042613715009], [28.551156213796396, 0.14483449950934113, 3.968807060642095], [41.547449127052644, 0.25917709968396596, 0.500035430667285], [53.700345302925264, 0.1736621468404771, 2.1225532196546326], [57.95504264397934, 0.18296043235012727, 1.3729814626874828], [63.414456414586475, 0.17365134035350938, 1.2596037482261675]], "r_squared_": 0.8571162437384059, "error_": 0.05488491280316879}
{"freq_range": [2.0, 80.0], "freq_res": 1.0, "aperiodic_params_": [-0.7076407572834381, 0.5748306856528665], "gaussian_params_": [[8.18330211059498, 0.45984808713398717, 1.0380017235666603], [18.5494096323122, 0.8739679517713577, 0.26999004293522266], [22.37887530948996, 0.20570614469922868, 1.3708768277803915], [27.67507188564215, 0.25660273261632965, 0.9056900963043562], [41.40954494768467, 0.7154431413974417, 0.2564774413376873]], "peak_params_": [[8.18330211059498, 0.4527336301836069, 2.0760034471333206], [18.5494096323122, 0.22697476905508207, 0.5399800858704453], [22.37887530948996, 0.19799806499629802, 2.741753655560783], [27.67507188564215, 0.2406550588380969, 1.8113801926087123], [41.40954494768467, 0.19993773499427414, 0.5129548826753746]], "r_squared_": 0.9149908977927463, "error_": 0.059486409794163336}
{"freq_range": [2.0, 80.0], "freq_res": 1.0, "aperiodic_params_": [-0.8878719373935859, 0.5351823288071238], "gaussian_params_": [[8.512342640167866, 0.3709037457362091, 1.1982121072838634], [22.07300203735469, 0.11604219820980022, 5.999999999999999], [58.46797335052578, 0.8193851774625166, 0.27280363667895946], [70.57892988974776, 0.6464577658347912, 0.30781858937817314], [75.03212048274258, 0.20999197252838106, 0.585412038262586]], "peak_params_": [[8.512342640167866, 0.3522314375466953, 2.396424214567727], [22.07300203735469, 0.11603360931389384, 11.999999999999998], [58.46797335052578, 0.18814595656656818, 0.5456072733579189], [70.57892988974776, 0.2536385366735858, 0.6156371787563463], [75.03212048274258, 0.20967611829254929, 1.170824076525172]], "r_squared_": 0.8657317011131941, "error_": 0.06568681579426773}
