{"freq_range": [2.0, 80.0], "freq_res": 1.0, "aperiodic_params_": [-0.38707467040892946, 0.41401463518790255], "gaussian_params_": [[23.495563529025112, 0.28989021811837523, 2.1002109956470014], [29.97012047235497, 0.17396175965342842, 0.7255382789570064], [32.75862409252963, 0.1946736074733057, 0.6357251746187199], [37.34487356660671, 0.23971662248866032, 0.484729899376315], [38.6848834797826, 0.3392739312887757, 0.25005688246281566], [41.60794838564198, 0.9499218496339353, 0.27612173063323603], [44.50215675107316, 0.8267430590134981, 0.287582061238339], [48.707788588931244, 0.1538723385174863, 0.9210338370253398], [54.22727685108697, 0.20824950125884462, 1.4644139815710056], [62.80211665969564, 0.11810396445200093, 2.010687479960619], [71.60047396497535, 0.4981817189214892, 0.255103258809128]], "peak_params_": [[23.495563529025112, 0.2819314583583724, 4.200421991294003], [29.97012047235497, 0.1762258679136096, 1.4510765579140128], [32.75862409252963, 0.18117395594878727, 1.2714503492374398], [37.34487356660671, 0.1861138568184434, 0.96945979875263], [38.6848834797826, 0.15406368444063112, 0.5001137649256313], [41.60794838564198, 0.3466764089938976, 0.5522434612664721], [44.50215675107316, 0.1848107796719891, 0.575164122476678], [48.707788588931244, 0.1466761106251948, 1.8420676740506796], [54.22727685108697, 0.20576464596071276, 2.928827963142011], [62.80211665969564, 0.11753339296973375, 4.021374959921238], [71.60047396497535, 0.14614499404256764, 0.510206517618256]], "r_squared_": 0.8895363846827901, "error_": 0.040199525851392304}
{"freq_range": [2.0, 80.0], "freq_res": 1.0, "aperiodic_params_": [-0.21385067509168015, 0.7347685507734834], "gaussian_params_": [[20.541920622766202, 0.11970937813379535, 5.999999999999982], [22.430944836630495, 0.4025187781439566, 0.28464105621698516], [42.900646648592215, 0.17394062761889803, 0.5422929285966119], [46.95404637008582, 0.16241057376091161, 0.2500002929853757], [56.73118519342391, 0.272614985238997, 0.25082454237854307], [60.952580120534265, 0.21972546864956793, 1.3183811113781347], [65.44762762367975, 0.8082133638803115, 0.2815762099403558], [69.13167095619592, 0.13249725283667327, 0.6143276244004794], [74.54796539791477, 0.11263964978202684, 4.430575920100914]], "peak_params_": [[20.541920622766202, 0.11936231404102893, 11.999999999999964], [22.430944836630495, 0.24417801831826647, 0.5692821124339703], [42.900646648592215, 0.17115436685008079, 1.0845858571932239], [46.95404637008582, 0.15969705266520506, 0.5000005859707514], [56.73118519342391, 0.15600910289857484, 0.5016490847570861], [60.952580120534265, 0.22063362438140954, 2.6367622227562695], [65.44762762367975, 0.24144829912285215, 0.5631524198807116], [69.13167095619592, 0.18091702439516943, 1.2286552488009588], [74.54796539791477, 0.11205492082493529, 8.861151840201828]], "r_squared_": 0.9474217627448834, "error_": 0.043340008286244326}
{"freq_range": [2.0, 80.0], "freq_res": 1.0, "aperiodic_params_": [-0.3501832501097884, 0.3231388402692114], "gaussian_params_": [[8.516602493599963, 0.21592411263093944, 0.8413718004535474], [22.100973441631975, 0.21230878944073586, 1.130631343995877], [24.423010895579353, 0.7245236411007582, 0.33354422222367697], [29.752480251133736, 0.17717546364376477, 0.7532821988250274], [32.69264159949938, 0.1741370830459535, 0.5053351792269247], [37.87493005771729, 0.13369001291963276, 1.2529217742263898], [41.63345195784125, 0.7170981812927926, 0.2943091833676714], [44.39782082894512, 0.2954025334153021, 0.5423267926387442], [48.57762244427138, 0.20933177355232865, 0.8076093419198775], [54.99288284561091, 0.13198989893567437, 2.2317823096249017], [62.66765624465031, 0.3517161542454471, 0.38100379179451993], [71.6481577774781, 0.5113340513627451, 0.25001674423772896]], "peak_params_": [[8.516602493599963, 0.1830724196603134, 1.6827436009070948], [22.100973441631975, 0.2114638130323223, 2.261262687991754], [24.423010895579353, 0.37598869939980967, 0.6670884444473539], [29.752480251133736, 0.1678643350023038, 1.506564397650055], [32.69264159949938, 0.1448157273874795, 1.0106703584538494], [37.87493005771729, 0.13302558860666003, 2.5058435484527797], [41.63345195784125, 0.33078849635043284, 0.5886183667353428], [44.39782082894512, 0.22572157424505357, 1.0846535852774883], [48.57762244427138, 0.18616181255566044, 1.615218683839755], [54.99288284561091, 0.13198922778704725, 4.463564619249803], [62.66765624465031, 0.24063078354384948, 0.7620075835890399], [71.6481577774781, 0.18995973870565885, 0.5000334884754579]], "r_squared_": 0.8786464672007327, "error_": 0.03583994468109221}
{"freq_range": [2.0, 80.0], "freq_res": 1.0, "aperiodic_params_": [-0.049614400263240564, 0.8246841287046495], "gaussian_params_": [[8.75976191882846, 0.2517400194631177, 1.4502429795889507], [12.733796670015716, 0.23440832638970124, 0.8530102836817273], [18.375466297262758, 0.2914121325047356, 1.8085896851321486], [23.135339519346147, 0.3009109091921207, 1.472474456011862], [32.177360163918166, 0.16501752280204043, 0.827610345019283], [41.59255349418374, 0.9178826945051678, 0.2579664772697646], [49.45539422157854, 0.24409639124607727, 0.8083715559123906], [54.379803299364276, 0.13997012188075167, 0.9502539758160687], [59.18739237880658, 0.325695416810681, 0.8455145365872467], [61.595040909110466, 0.5235607123056554, 0.25001015370349394], [67.31667184131283, 0.36948912134403344, 0.4347260878066247], [70.55040541394496, 1.1598458057099825, 0.2663902705650548], [77.49203093781267, 0.792046268224276, 0.3061083976059322]], "peak_params_": [[8.75976191882846, 0.24832621409287214, 2.9004859591779013], [12.733796670015716, 0.23028934928333478, 1.7060205673634545], [18.375466297262758, 0.28588708939205343, 3.617179370264297], [23.135339519346147, 0.31072824966069357, 2.944948912023724], [32.177360163918166, 0.16127139052070816, 1.655220690038566], [41.59255349418374, 0.2636783954883657, 0.5159329545395293], [49.45539422157854, 0.20827992663245287, 1.6167431118247813], [54.379803299364276, 0.12922496158414232, 1.9005079516321375], [59.18739237880658, 0.3177947366952716, 1.6910290731744935], [61.595040909110466, 0.14229720300074744, 0.5000203074069879], [67.31667184131283, 0.28338571834816206, 0.8694521756132494], [70.55040541394496, 0.27917190902014455, 0.5327805411301096], [77.49203093781267, 0.21762923657391742, 0.6122167952118645]], "r_squared_": 0.9838359194124394, "error_": 0.028659669637679942}
{"freq_range": [2.0, 80.0], "freq_res": 1.0, "aperiodic_params_": [-0.12645063598153464, 0.8683506180815579], "gaussian_params_": [[9.982386795729523, 0.31768425755088264, 2.6169330463529934], [16.460732576416962, 0.2678610291428091, 0.6495338234318622], [18.858346717015596, 0.28474725799413375, 0.9955985988274162], [22.740474217819234, 0.3636373892004808, 1.8133407274244484], [41.28122267783598, 0.2183374237629055, 0.4699909585752635], [47.09966405621586, 0.155365457013769, 0.5165235409890252], [53.446329256737855, 0.46698998457331736, 0.26211713397274167], [59.566863677099285, 0.44826878896544575, 0.28381401114036253], [61.64738100460844, 0.3244616581482874, 0.333131090801188], [63.70937573081713, 0.23514380924136552, 0.6688700301662464], [66.94234594028163, 0.15606225989740927, 0.8347867394710939], [71.24577682198387, 0.2977667241961562, 0.25000436869073744], [78.12707879077698, 0.0920800003698356, 5.999999395782659]], "peak_params_": [[9.982386795729523, 0.31767706220157044, 5.233866092705987], [16.460732576416962, 0.2358491991104371, 1.2990676468637243], [18.858346717015596, 0.32616983505513786, 1.9911971976548324], [22.740474217819234, 0.35998320982412835, 3.626681454848897], [41.28122267783598, 0.18255030066384847, 0.939981917150527], [47.09966405621586, 0.15250018794824616, 1.0330470819780504], [53.446329256737855, 0.10958485910692417, 0.5242342679454833], [59.566863677099285, 0.14085196493622076, 0.5676280222807251], [61.64738100460844, 0.1967582645756747, 0.666262181602376], [63.70937573081713, 0.22003497309490094, 1.3377400603324927], [66.94234594028163, 0.17218665396668542, 1.6695734789421879], [71.24577682198387, 0.22913475664359395, 0.5000087373814749], [78.12707879077698, 0.09205934988050002, 11.999998791565318]], "r_squared_": 0.9851770269110811, "error_": 0.030796418411677115}
{"freq_range": [2.0, 80.0], "freq_res": 1.0, "aperiodic_params_": [-0.6205524130656711, 0.520588115958161], "gaussian_params_": [[10.590487041195631, 0.2001355917272703, 2.057036838602986], [16.57160836399325, 0.46349418287563005, 0.29519720971103], [21.337779552457278, 0.22485544160935475, 2.605373686787869], [26.209887651715263, 0.28603059798968644, 0.25001482206012726], [27.862151336220023, 0.18528038397300584, 0.5497089451288472], [68.88483379118227, 0.0588802900161303, 0.2509935817524237], [69.4725217603641, 0.14405014241308758, 5.999999999999999], [73.59193710440289, 0.8085558237504643, 0.26914073410333417]], "peak_params_": [[10.590487041195631, 0.19629442608120784, 4.114073677205972], [16.57160836399325, 0.2194985696367644, 0.59039441942206], [21.337779552457278, 0.22297417919007745, 5.210747373575738], [26.209887651715263, 0.24702817818645784, 0.5000296441202545], [27.862151336220023, 0.18809652577714675, 1.0994178902576943], [68.88483379118227, 0.19660130780732343, 0.5019871635048474], [69.4725217603641, 0.19660130780732343, 11.999999999999998], [73.59193710440289, 0.36453689690913715, 0.5382814682066683]], "r_squared_": 0.8883263662624272, "error_": 0.05400410905754713}
{"freq_range": [2.0, 80.0], "freq_res": 1.0, "aperiodic_params_": [-0.26062075923522937, 0.3492860119154266], "gaussian_params_": [[7.58974970803531, 0.42865958604344134, 0.3067534141317052], [9.253248335242118, 0.24339567696292586, 0.9895375311088521], [24.179156947017557, 0.28155465999320073, 0.5961343372589871], [29.62997749605654, 0.34697826508855434, 0.25706057670423627], [41.692631418040115, 0.4013599077862005, 0.2567903716796375], [44.38949963752201, 0.16083589711501228, 0.6315220013089786], [48.387018588359496, 0.20361782406484835, 0.6736381841575255], [52.22202211341322, 0.18888785930562638, 0.6238441418608414], [60.96032727344543, 0.17639600052848312, 0.2551600896207802], [62.750889468506344, 0.2556573978289161, 0.7300661680429567], [71.59011911533727, 0.654863931614585, 0.26410987547651177]], "peak_params_": [[7.58974970803531, 0.2844192698792956, 0.6135068282634104], [9.253248335242118, 0.23556483857402222, 1.9790750622177042], [24.179156947017557, 0.26912261998964265, 1.1922686745179742], [29.62997749605654, 0.12313394058459015, 0.5141211534084725], [41.692631418040115, 0.1962004049665791, 0.513580743359275], [44.38949963752201, 0.13297831189719522, 1.2630440026179572], [48.387018588359496, 0.17263996569203732, 1.347276368315051], [52.22202211341322, 0.1772966005704436, 1.2476882837216827], [60.96032727344543, 0.18868794208850836, 0.5103201792415604], [62.750889468506344, 0.24119939368288623, 1.4601323360859133], [71.59011911533727, 0.19640505712754608, 0.5282197509530235]], "r_squared_": 0.8865015017266625, "error_": 0.037250695765161594}
{"freq_range": [2.0, 80.0], "freq_res": 1.0, "aperiodic_params_": [-0.32674100821096774, 0.17664993929393488], "gaussian_params_": [[21.510809281309708, 0.14390731271579454, 2.3542832565655507], [41.511154159787324, 0.940781474322888, 0.2712376287184], [43.570029490395484, 0.30321694308249814, 0.579490114901787], [45.565259454461184, 0.8524289156560981, 0.2500010778530283], [51.83004795996389, 0.3005355041955173, 0.5598322826831805], [62.28281842603811, 0.23463105749812704, 0.9150776893658892], [66.38962465730405, 0.2826694440005343, 0.9059331914808365], [69.42151656906705, 0.948013853613394, 0.25665928337731303], [74.06397246153249, 0.2833788769785348, 1.168726275526274]], "peak_params_": [[21.510809281309708, 0.14083395895833783, 4.708566513131101], [41.511154159787324, 0.19313992186493545, 0.5424752574368], [43.570029490395484, 0.23025348906142884, 1.158980229803574], [45.565259454461184, 0.1879833279876233, 0.5000021557060566], [51.83004795996389, 0.28700122651489907, 1.119664565366361], [62.28281842603811, 0.2236905950503828, 1.8301553787317784], [66.38962465730405, 0.25776055064167314, 1.811866382961673], [69.42151656906705, 0.25058009176310236, 0.5133185667546261], [74.06397246153249, 0.2829546749638469, 2.337452551052548]], "r_squared_": 0.6079996640432959, "error_": 0.049844452779957346}
{"freq_range": [2.0, 80.0], "freq_res": 1.0, "aperiodic_params_": [0.03313579317463061, 0.7432960696028463], "gaussian_params_": [[8.213505586297572, 0.2308701335666381, 1.3720599258879205], [14.201487442458747, 0.1838160236108474, 3.58743433529197], [21.314614337456305, 0.2681319911251948, 2.40558888898076], [47.31691361809912, 0.5682913824136576, 0.25000464708210574], [54.166661855134265, 0.21321905129875518, 0.40409457365934387], [57.57901619702734, 0.5572230685123628, 0.2751472763846287], [61.178663558214645, 0.23082512133143515, 0.7707003505691681], [63.56828396723968, 0.6628311874490933, 0.29519587936277697], [66.66098573926372, 0.19934168407478844, 0.6112278382473203]], "peak_params_": [[8.213505586297572, 0.2693474569561268, 2.744119851775841], [14.201487442458747, 0.18619235924447786, 7.17486867058394], [21.314614337456305, 0.2963646274525732, 4.81117777796152], [47.31691361809912, 0.2544718506369301, 0.5000092941642115], [54.166661855134265, 0.1958344464288979, 0.8081891473186877], [57.57901619702734, 0.1729043893308495, 0.5502945527692574], [61.178663558214645, 0.22470539223149189, 1.5414007011383362], [63.56828396723968, 0.22778931481959108, 0.5903917587255539], [66.66098573926372, 0.17092160558367775, 1.2224556764946406]], "r_squared_": 0.9714880634324743, "error_": 0.04012029210998923}
{"freq_range": [2.0, 80.0], "freq_res": 1.0, "aperiodic_params_": [0.3109223638223137, 1.1221238126953703], "gaussian_params_": [[8.462564118734832, 0.4231131011697747, 1.6078497998547698], [12.541194863580756, 0.22962297558663713, 1.5985468230570352], [20.400671542057264, 0.4630917511769624, 4.111721881227112], [28.035150913102342, 0.1875000126042278, 0.25000000479839396], [31.417893242316005, 0.8274027465034803, 0.3030391751818043], [47.05581394646633, 0.23807621481029345, 0.2500425932853456], [62.7022672770651, 0.16158674928263222, 2.5515673288756275]], "peak_params_": [[8.462564118734832, 0.41492493140971215, 3.2156995997095397], [12.541194863580756, 0.31991013327507223, 3.1970936461140704], [20.400671542057264, 0.4609025587724491, 8.223443762454224], [28.035150913102342, 0.2695858170538563, 0.5000000095967879], [31.417893242316005, 0.3364233650498589, 0.6060783503636086], [47.05581394646633, 0.23221827625948444, 0.5000851865706912], [62.7022672770651, 0.16049042923037526, 5.103134657751255]], "r_squared_": 0.9811169209401672, "error_": 0.05129690954297157}
{"freq_range": [2.0, 80.0], "freq_res": 1.0, "aperiodic_params_": [0.3253092672461254, 1.16678898716339], "gaussian_params_": [[8.693726730804338, 0.4683728862739499, 1.7122756252014184], [12.673747749890834, 0.2389609281320984, 1.195238880829393], [19.071894547474468, 0.45000642031421567, 3.3335493373041443], [24.11265250757262, 0.2565516780848722, 1.8132647180114108], [27.958886189815296, 0.22236430430011564, 0.2500130251727069], [31.317703707305334, 0.3237680424608803, 0.5103286865973519], [46.9712772620952, 0.24084036690047902, 0.2500000021733596], [60.07518179282192, 0.1630218906766069, 0.25100351016766015], [62.60782131870657, 0.15347405996001465, 1.6848160239679089], [75.0529628963162, 0.1895731943070577, 0.5562582492620101]], "peak_params_": [[8.693726730804338, 0.4677500559089002, 3.424551250402837], [12.673747749890834, 0.33570771391458487, 2.390477761658786], [19.071894547474468, 0.45471970844143794, 6.6670986746082885], [24.11265250757262, 0.40694286776543453, 3.6265294360228215], [27.958886189815296, 0.25761291511952966, 0.5000260503454138], [31.317703707305334, 0.2676674601675617, 1.0206573731947037], [46.9712772620952, 0.23925606277106182, 0.5000000043467192], [60.07518179282192, 0.2021933726692422, 0.5020070203353203], [62.60782131870657, 0.14937203386562903, 3.3696320479358177], [75.0529628963162, 0.18871585337832641, 1.1125164985240201]], "r_squared_": 0.983683225420535, "error_": 0.04753194199283769}
{"freq_range": [2.0, 80.0], "freq_res": 1.0, "aperiodic_params_": [0.32537600633570485, 1.1236014201096192], "gaussian_params_": [[8.471408536507814, 0.420504403826916, 1.5752571982228645], [9.63945410071278, 0.30358936943158243, 0.25237630651582316], [11.978397004035886, 0.2486210903285634, 0.9573710234794041], [18.445796879693358, 0.4125002433359319, 3.2252465823344445], [24.02139115986584, 0.3115239418511782, 1.9658390039944618], [28.03118271401498, 0.28463441162160585, 0.5497381603268247], [31.464177947559467, 1.6960700740596981, 0.25002369569034427], [34.47906628533391, 1.093987013063186, 0.25005355767196413], [46.89280581689168, 0.28439213218934695, 0.25000000000145844], [62.54796540086405, 0.08679338617015028, 5.99999995172069]], "peak_params_": [[8.471408536507814, 0.40431068040900553, 3.150514396445729], [9.63945410071278, 0.41479513876246915, 0.5047526130316463], [11.978397004035886, 0.3387603350534413, 1.9147420469588081], [18.445796879693358, 0.41143752978447634, 6.450493164668889], [24.02139115986584, 0.40514191815016365, 3.9316780079889235], [28.03118271401498, 0.32948719716302444, 1.0994763206536493], [31.464177947559467, 0.3034723850540628, 0.5000473913806885], [34.47906628533391, 0.17457703286562687, 0.5001071153439283], [46.89280581689168, 0.2624374196761321, 0.5000000000029169], [62.54796540086405, 0.0865474166002802, 11.99999990344138]], "r_squared_": 0.9877924788239284, "error_": 0.038563211680834576}
{"freq_range": [2.0, 80.0], "freq_res": 1.0, "aperiodic_params_": [0.10973675428229425, 0.8234686430143539], "gaussian_params_": [[9.742941499172613, 0.2538031660309056, 1.8877508134864593], [18.465777715200876, 0.28324399815896334, 2.1289405080232258], [24.293324724252113, 0.25467194817744465, 2.759207943963964], [31.32182074760354, 0.4920171276619151, 0.25033342257294044], [49.44924305778148, 0.8273249648595321, 0.26809157402691025], [67.39450753454047, 0.12054119170627178, 5.999999999998927], [70.75056715962947, 0.13773710264185973, 0.6484384902906927]], "peak_params_": [[9.742941499172613, 0.25156565800422104, 3.7755016269729187], [18.465777715200876, 0.29545743681318415, 4.2578810160464515], [24.293324724252113, 0.2628927365437921, 5.518415887927928], [31.32182074760354, 0.22860549990664003, 0.5006668451458809], [49.44924305778148, 0.20429883675549165, 0.5361831480538205], [67.39450753454047, 0.12028091710659194, 11.999999999997854], [70.75056715962947, 0.22854369298238364, 1.2968769805813853]], "r_squared_": 0.9606867679866014, "error_": 0.052757669846600526}
{"freq_range": [2.0, 80.0], "freq_res": 1.0, "aperiodic_params_": [-0.6243741545938792, -0.16816446222234316], "gaussian_params_": [[19.475532881947423, 0.2996298841125624, 1.9722310494130784], [24.1787030004349, 0.33369824372615975, 1.526347241323963], [27.56882763012264, 0.704122281986169, 0.31558518422041953], [29.830173788827597, 0.25705931490597067, 0.5680937042088573], [33.0245014082773, 0.17621643508927437, 0.9491206015079245], [39.940819324389466, 0.20522827415745212, 5.559382710021455], [46.77147390334002, 0.2331157009152098, 0.4811839140811081], [54.57868536284051, 0.22603607644586404, 3.519505325932054], [60.45053618801013, 0.4982457192397926, 0.2654965149859114]], "peak_params_": [[19.475532881947423, 0.29227187260523607, 3.9444620988261567], [24.1787030004349, 0.3563495867970794, 3.052694482647926], [27.56882763012264, 0.31331911933695156, 0.6311703684408391], [29.830173788827597, 0.28864651881571946, 1.1361874084177146], [33.0245014082773, 0.2702958591295582, 1.898241203015849], [39.940819324389466, 0.20525913823118214, 11.11876542004291], [46.77147390334002, 0.3221501485842714, 0.9623678281622162], [54.57868536284051, 0.22965727109009465, 7.039010651864108], [60.45053618801013, 0.1873896071327643, 0.5309930299718228]], "r_squared_": 0.6343095564458027, "error_": 0.06231128785401334}
{"freq_range": [2.0, 80.0], "freq_res": 1.0, "aperiodic_params_": [-0.04592680871755405, 0.5556905599942932], "gaussian_params_": [[20.143859274273336, 0.15654375627983752, 0.39105600319826], [22.661981306010652, 0.157438560495447, 1.9628859616854846], [26.011428195763692, 0.2347973483529359, 0.669436006553157], [28.428438914538717, 0.6081538432405543, 0.3174153869760838], [29.885992414562974, 0.20563342399190893, 0.5946524160587005], [31.63704845996438, 0.49314076996798734, 0.25733463677572604], [46.378609291640196, 0.3235601101286831, 0.42855157044262726], [50.45190218053482, 0.24377640689032246, 0.8736043078346107], [53.50937671646649, 0.9443865283172626, 0.28563378407818313], [57.087269423805395, 0.2230929131867689, 0.6169420720411326], [63.8194430821949, 0.15944222050998139, 1.7256675441713707], [68.89309514562761, 0.2146526575293157, 0.6266139073080241], [78.45208586590296, 0.7156651940713586, 0.2618971802136092]], "peak_params_": [[20.143859274273336, 0.20907013631295657, 0.78211200639652], [22.661981306010652, 0.15513086974287182, 3.925771923370969], [26.011428195763692, 0.27184290854659887, 1.338872013106314], [28.428438914538717, 0.25266031987399173, 0.6348307739521676], [29.885992414562974, 0.20203692794965256, 1.189304832117401], [31.63704845996438, 0.18276168580794638, 0.5146692735514521], [46.378609291640196, 0.2190137177587529, 0.8571031408852545], [50.45190218053482, 0.2132488272412102, 1.7472086156692215], [53.50937671646649, 0.2160797488899483, 0.5712675681563663], [57.087269423805395, 0.22093684899320687, 1.2338841440822652], [63.8194430821949, 0.15857185980303445, 3.4513350883427414], [68.89309514562761, 0.2133116798082474, 1.2532278146160483], [78.45208586590296, 0.16131131471712834, 0.5237943604272184]], "r_squared_": 0.8435613879101085, "error_": 0.053512549713863544}
{"freq_range": [2.0, 80.0], "freq_res": 1.0, "aperiodic_params_": [-0.43537475782915896, 0.2840949606850014], "gaussian_params_": [[8.19063273066948, 0.29177617016594437, 0.7406712687983193], [9.779793654124898, 0.27494399653084045, 1.4168935311060549], [54.59389544903319, 0.18286045917999982, 2.359469162141641], [61.38816868070897, 0.7190339973594176, 0.27338082645088335], [67.34161445442912, 0.11645050904745805, 3.367725645456158], [74.56435064718819, 0.6107570387902016, 0.3059875421660532], [77.66695878665192, 0.19433073529450598, 1.7461922091232853]], "peak_params_": [[8.19063273066948, 0.40718661785730664, 1.4813425375966387], [9.779793654124898, 0.2864071463731601, 2.8337870622121097], [54.59389544903319, 0.1803130880450179, 4.718938324283282], [61.38816868070897, 0.2867640385423551, 0.5467616529017667], [67.34161445442912, 0.11585311517164187, 6.735451290912316], [74.56435064718819, 0.2909756249701818, 0.6119750843321063], [77.66695878665192, 0.19160647061032998, 3.4923844182465706]], "r_squared_": 0.7791319733172527, "error_": 0.05171218381853013}
{"freq_range": [2.0, 80.0], "freq_res": 1.0, "aperiodic_params_": [-0.002900270253935091, 0.7838751873751281], "gaussian_params_": [[8.70953016015111, 0.3209650856086262, 1.250443681989606], [12.54796539852591, 0.1574625824578978, 2.5172770960822244], [21.06673283504739, 0.21943752916245443, 5.823083479134968], [31.412958829819583, 0.40321789643583406, 0.3077218238898745], [41.86631034366506, 0.19458909045234643, 0.9452158439588462], [49.34770617507008, 0.40909190437957904, 0.2510927445435598], [62.460650234869114, 0.3074504653935638, 0.791475671012433], [72.65132500974285, 0.22055676812641006, 1.028042532579261]], "peak_params_": [[8.70953016015111, 0.3963760386068475, 2.500887363979212], [12.54796539852591, 0.2398958508245318, 5.034554192164449], [21.06673283504739, 0.21998437245837166, 11.646166958269935], [31.412958829819583, 0.21507925829803975, 0.615443647779749], [41.86631034366506, 0.1929952733624145, 1.8904316879176923], [49.34770617507008, 0.15682920304164916, 0.5021854890871196], [62.460650234869114, 0.2595485063194878, 1.582951342024866], [72.65132500974285, 0.20822912025071827, 2.056085065158522]], "r_squared_": 0.9753576889523259, "error_": 0.041947917211824455}
{"freq_range": [2.0, 80.0], "freq_res": 1.0, "aperiodic_params_": [0.2918754737455925, 1.064328987156621], "gaussian_params_": [[8.632197953365605, 0.4348680204734458, 1.4396655610830542], [12.592470473869524, 0.2670552192636123, 1.9099127819167627], [20.38330805180453, 0.43967078330802534, 4.029166726102234], [27.967156356134076, 0.21974261514845825, 0.2500270884027702], [32.12413705738177, 0.24694926877681253, 1.380563475886996], [41.706614435168156, 0.26581380922791303, 0.5901131858946453], [62.77088242612798, 0.20345819199950702, 1.6151598442475115]], "peak_params_": [[8.632197953365605, 0.47456503901332503, 2.8793311221661084], [12.592470473869524, 0.3474338499422096, 3.8198255638335255], [20.38330805180453, 0.4378302899996067, 8.058333452204469], [27.967156356134076, 0.29434856375951046, 0.5000541768055404], [32.12413705738177, 0.25284075180184584, 2.761126951773992], [41.706614435168156, 0.23491153459468217, 1.1802263717892907], [62.77088242612798, 0.20142139375807933, 3.230319688495023]], "r_squared_": 0.9823972693959091, "error_": 0.04995166884385853}
{"freq_range": [2.0, 80.0], "freq_res": 1.0, "aperiodic_params_": [0.4304657342245538, 1.2013457947466646], "gaussian_params_": [[9.147812022133575, 0.47705346840025403, 2.129554031650035], [19.68116800978114, 0.49303359522267487, 4.885910374252921], [27.960764498921364, 0.20452415776053373, 0.25000012565324425], [31.262134540669347, 0.26219051174757174, 0.5825633460836748], [46.972042323370125, 0.19816257639601054, 0.2500852490943985], [62.636965401728574, 0.17926579032978912, 1.7699746581014997]], "peak_params_": [[9.147812022133575, 0.5211024460370823, 4.25910806330007], [19.68116800978114, 0.4919860729157104, 9.771820748505842], [27.960764498921364, 0.3177353241072802, 0.5000002513064885], [31.262134540669347, 0.27063675355687744, 1.1651266921673495], [46.972042323370125, 0.19692824086893324, 0.500170498188797], [62.636965401728574, 0.1755344076929104, 3.5399493162029994]], "r_squared_": 0.9858476076531079, "error_": 0.05071829549167375}
{"freq_range": [2.0, 80.0], "freq_res": 1.0, "aperiodic_params_": [0.45692949903393715, 1.2172964183866788], "gaussian_params_": [[8.819805912727519, 0.5524342683311743, 1.7084997023541915], [12.558384645595828, 0.25448269456556516, 1.0210019748782018], [18.73451961581366, 0.4969891318718635, 3.301608667835478], [24.208538827640574, 0.284522549600564, 1.6810146826091443], [27.642170568708032, 0.5971629186378572, 0.27682581063045764], [31.26370762343983, 0.25056700292543654, 0.6785779338613499], [46.96192772686989, 0.2013717890068238, 0.25000000342588397], [60.12812874777252, 0.17825843634204197, 0.504520921596686], [68.61794863052897, 0.5426184283146432, 0.27985267072506553]], "peak_params_": [[8.819805912727519, 0.556392968731762, 3.416999404708383], [12.558384645595828, 0.3694167065333177, 2.0420039497564035], [18.73451961581366, 0.4977261471573281, 6.603217335670956], [24.208538827640574, 0.42167064887024597, 3.3620293652182887], [27.642170568708032, 0.29103179893336684, 0.5536516212609153], [31.26370762343983, 0.23292470447047986, 1.3571558677226998], [46.96192772686989, 0.19905017179007478, 0.5000000068517679], [60.12812874777252, 0.17260163247568783, 1.009041843193372], [68.61794863052897, 0.21369246456645108, 0.5597053414501311]], "r_squared_": 0.9871166667597372, "error_": 0.04733945130017284}
{"freq_range": [2.0, 80.0], "freq_res": 1.0, "aperiodic_params_": [0.4262792039423812, 1.1533941579453857], "gaussian_params_": [[8.371540670504755, 0.48947273174731687, 1.1660884198513812], [10.403472300794991, 0.314066435365906, 0.304796324600907], [11.828885367268, 0.31318449785705754, 1.1679382689849154], [18.85791820301799, 0.44695581585912575, 3.4775175022491136], [24.162194401112366, 0.29355455857794244, 1.612863322571022], [27.93919103186499, 0.2860116991570161, 0.5314486626380569], [31.22803655690746, 0.36800854383668125, 0.5026554314467638], [34.45824626004386, 0.5754544665176867, 0.2962377211059008], [46.99165754677544, 0.18306453554006188, 0.25000000000000017], [60.369769467682644, 0.4692509211865023, 0.27932894912087114], [68.61099878033393, 0.5791394737313715, 0.27761440641148133], [79.49888997328462, 0.6031797966865137, 0.3077341473160821]], "peak_params_": [[8.371540670504755, 0.47011390506604817, 2.3321768397027625], [10.403472300794991, 0.4247120217916119, 0.609592649201814], [11.828885367268, 0.3776458860027882, 2.3358765379698307], [18.85791820301799, 0.44833361947974026, 6.955035004498227], [24.162194401112366, 0.44186411216497135, 3.225726645142044], [27.93919103186499, 0.3155614984042081, 1.0628973252761138], [31.22803655690746, 0.33306542992279276, 1.0053108628935277], [34.45824626004386, 0.1739777259947095, 0.5924754422118016], [46.99165754677544, 0.1829626386639991, 0.5000000000000003], [60.369769467682644, 0.19537949168269186, 0.5586578982417423], [68.61099878033393, 0.21698379518976352, 0.5552288128229627], [79.49888997328462, 0.16208421524476302, 0.6154682946321642]], "r_squared_": 0.9899711629955105, "error_": 0.03865870630024214}
{"freq_range": [2.0, 80.0], "freq_res": 1.0, "aperiodic_params_": [0.25144237953579796, 0.9231749643042603], "gaussian_params_": [[8.256561474811383, 0.3571401248298963, 0.6234004740318173], [9.825703984294666, 0.06358109098614788, 0.2781228394296144], [11.263721194277412, 0.27910389828512244, 1.9642638036665334], [16.842030706187238, 0.26308911765449683, 1.072973078268671], [19.53423864152766, 0.4853586078906033, 0.34876342180226455], [23.576523949027532, 0.3921122748845461, 3.1210196880452767], [28.130489248175206, 0.29637443479938885, 0.4209620621413237], [31.099857446305215, 0.4679397736676073, 0.6043056091973246], [33.996568645914344, 0.2681158386852405, 0.7604193350504922], [41.708003067543785, 0.570172415076827, 0.25001845024422453], [47.010510610431915, 0.2790968473782294, 0.25000000000000017], [60.406082277793274, 0.6530822970176839, 0.2789052726648553], [62.59247212197659, 0.5925211167138896, 0.272623643282084], [68.99298547729683, 0.2944792690960292, 0.43074733634357465], [79.45197998732536, 0.6467951156305468, 0.29815235487882236]], "peak_params_": [[8.256561474811383, 0.398332056286925, 1.2468009480636346], [9.825703984294666, 0.28635579222081514, 0.5562456788592288], [11.263721194277412, 0.2767473841966998, 3.928527607333067], [16.842030706187238, 0.3067618573868788, 2.145946156537342], [19.53423864152766, 0.4057988035546275, 0.6975268436045291], [23.576523949027532, 0.38851935324455544, 6.2420393760905535], [28.130489248175206, 0.4260906593312461, 0.8419241242826474], [31.099857446305215, 0.48487744055688276, 1.2086112183946491], [33.996568645914344, 0.26960146013368913, 1.5208386701009844], [41.708003067543785, 0.2882827685996121, 0.5000369004884491], [47.010510610431915, 0.27885029516833315, 0.5000000000000003], [60.406082277793274, 0.22627588475318583, 0.5578105453297106], [62.59247212197659, 0.19385643401452146, 0.545247286564168], [68.99298547729683, 0.2944402257537342, 0.8614946726871493], [79.45197998732536, 0.20499756361649113, 0.5963047097576447]], "r_squared_": 0.9701598681921233, "error_": 0.048716880819321365}
{"freq_range": [2.0, 80.0], "freq_res": 1.0, "aperiodic_params_": [-0.4280732178706233, 0.13680198004459465], "gaussian_params_": [[8.4300650160454, 1.019583632912285, 0.2603642484562225], [21.488891206357017, 0.20030454716665436, 2.185384901961753], [24.4811047064316, 1.2768509181817445, 0.2827280421357507], [26.361949107385755, 0.42580122847823854, 0.6182666491119553], [27.907950783885298, 0.35830119983419056, 0.5361342705794954], [30.724497690510386, 0.4028635301597179, 0.7056024572945174], [39.47856504368296, 0.1284052037648529, 5.242580973816104], [50.070163423034785, 0.29788271990057424, 0.6474878014614136], [52.36254230498081, 0.5463235559190849, 0.2906559538304117], [53.68991965244761, 0.2996618979966746, 0.5146912956295621], [56.36579647644131, 0.4654820347674633, 0.29256888506201983], [65.81411382315417, 0.2954971875642861, 0.619750268919106], [69.36377489534819, 0.670835293318729, 0.25526807871903245], [78.63795470188265, 0.5511190550284594, 0.2500038437572304]], "peak_params_": [[8.4300650160454, 0.2605924020902322, 0.520728496912445], [21.488891206357017, 0.1956120632813375, 4.370769803923506], [24.4811047064316, 0.4056114506687663, 0.5654560842715014], [26.361949107385755, 0.38788687618441403, 1.2365332982239106], [27.907950783885298, 0.38007692113927033, 1.0722685411589907], [30.724497690510386, 0.4080360938710477, 1.4112049145890349], [39.47856504368296, 0.12787132841300797, 10.485161947632209], [50.070163423034785, 0.3132774389396543, 1.2949756029228272], [52.36254230498081, 0.2632475548057499, 0.5813119076608234], [53.68991965244761, 0.25269943035719644, 1.0293825912591241], [56.36579647644131, 0.21394356524661506, 0.5851377701240397], [65.81411382315417, 0.2825002425603158, 1.239500537838212], [69.36377489534819, 0.24301267433552298, 0.5105361574380649], [78.63795470188265, 0.19313100050465082, 0.5000076875144608]], "r_squared_": 0.7711536445843131, "error_": 0.043883617892392965}
{"freq_range": [2.0, 80.0], "freq_res": 1.0, "aperiodic_params_": [-0.6877392657068279, 0.281386142601213], "gaussian_params_": [[8.423283042238364, 0.9045959264941261, 0.28945823315038793], [9.452034599135944, 0.12874875002158043, 5.999999322786553], [10.122466001459772, 0.25019899585693123, 1.189739378191996], [42.44793324598409, 0.7715505160051856, 0.2503185582354535], [49.48444160931778, 1.070263696922318, 0.25054676822993366], [52.491541347747464, 1.0693106934830197, 0.26945496266781], [58.00130383608436, 0.2449244340667516, 2.542061538944839], [63.048749748475885, 0.19140294634089827, 1.460626809867539], [68.17471798736437, 0.1565391494842472, 0.8892655921807117], [74.54796540086404, 0.3437713167425637, 5.999999999999999]], "peak_params_": [[8.423283042238364, 0.4865213911672069, 0.5789164663007759], [9.452034599135944, 0.4130037020189141, 11.999998645573106], [10.122466001459772, 0.3770902561108771, 2.379478756383992], [42.44793324598409, 0.15560686325115936, 0.500637116470907], [49.48444160931778, 0.16557471308790395, 0.5010935364598673], [52.491541347747464, 0.2179218450617323, 0.53890992533562], [58.00130383608436, 0.2530767331184125, 5.084123077889678], [63.048749748475885, 0.2806646923251117, 2.921253619735078], [68.17471798736437, 0.3437827836891486, 1.7785311843614233], [74.54796540086404, 0.3427970803273632, 11.999999999999998]], "r_squared_": 0.8189980848894324, "error_": 0.050472014550610136}
{"freq_range": [2.0, 80.0], "freq_res": 1.0, "aperiodic_params_": [-0.07730122973299519, 0.9033894246481813], "gaussian_params_": [[9.188332123251541, 0.5268060753445757, 1.3601697383914138], [14.82332477535663, 0.34227208476316134, 3.641487100476712], [51.614004835731755, 0.2752483140753357, 0.6915241075474061], [58.58508395825376, 0.41492476454850463, 0.2726569549297136], [62.84474663446194, 0.14564219702706063, 2.273148343520424], [68.12326966244524, 0.2183936212117361, 0.5544213143727883], [69.83014590791385, 0.26920872760236064, 0.25007996427690093], [75.04970220465623, 0.18372740353166128, 3.844429423815033]], "peak_params_": [[9.188332123251541, 0.6170724766382351, 2.7203394767828275], [14.82332477535663, 0.3419266695177169, 7.282974200953424], [51.614004835731755, 0.23554408060333243, 1.3830482150948122], [58.58508395825376, 0.1652219798140444, 0.5453139098594272], [62.84474663446194, 0.14665471642704664, 4.546296687040848], [68.12326966244524, 0.25838710768917483, 1.1088426287455766], [69.83014590791385, 0.29303253817166985, 0.5001599285538019], [75.04970220465623, 0.18371213981633217, 7.688858847630066]], "r_squared_": 0.9684432321318392, "error_": 0.0485716839471609}
{"freq_range": [2.0, 80.0], "freq_res": 1.0, "aperiodic_params_": [0.1607841533572415, 1.0986076494409251], "gaussian_params_": [[9.161914289168065, 0.5999891957620409, 1.5103464156593263], [14.147001991527548, 0.28570638096792567, 3.194493379857518], [20.09084886436313, 0.29166421148543364, 4.700789202874193], [62.473459440346446, 0.27530759518010983, 0.6274411639275581], [65.38823428233168, 0.3612722768263655, 0.297026643658694], [75.547963798012, 0.08833165717812927, 4.330280576542663]], "peak_params_": [[9.161914289168065, 0.6926063592339111, 3.0206928313186525], [14.147001991527548, 0.41493834998482026, 6.388986759715036], [20.09084886436313, 0.34493761989371996, 9.401578405748387], [62.473459440346446, 0.20775863634333125, 1.2548823278551162], [65.38823428233168, 0.15839335210976402, 0.594053287317388], [75.547963798012, 0.0878516827127358, 8.660561153085325]], "r_squared_": 0.9880357378328459, "error_": 0.04362193441195171}
{"freq_range": [2.0, 80.0], "freq_res": 1.0, "aperiodic_params_": [0.3847263087951146, 1.2117604282987908], "gaussian_params_": [[9.232991329934237, 0.5652055396756729, 1.544020722168406], [18.406892673303346, 0.4845468777157295, 5.872091431024484], [62.624169528506876, 0.24760715261882107, 0.6756190600748142], [65.40194052061695, 0.6148012172419288, 0.2599738234973508], [72.64576334563526, 0.15398100547508645, 0.9439676136483731]], "peak_params_": [[9.232991329934237, 0.6931056788372436, 3.088041444336812], [18.406892673303346, 0.4833850609727295, 11.744182862048968], [62.624169528506876, 0.21211362458449345, 1.3512381201496284], [65.40194052061695, 0.18657987142840238, 0.5199476469947016], [72.64576334563526, 0.1435118888883944, 1.8879352272967462]], "r_squared_": 0.988481522392301, "error_": 0.04520621993557978}
{"freq_range": [2.0, 80.0], "freq_res": 1.0, "aperiodic_params_": [0.49141620623037074, 1.2734255164331656], "gaussian_params_": [[8.547532127637695, 0.5183008408585225, 1.3217910137896063], [11.211116993516836, 0.35010391389466894, 1.9363991333306954], [18.34895255887536, 0.500476963955036, 3.1741291712616673], [24.538053257529896, 0.26211344912838125, 1.4512522232885434], [27.578041870073843, 0.8267936689808709, 0.2813493839169678], [31.094303593260655, 0.17485881257785632, 0.795114734932328], [62.47240252954325, 0.2784362633886529, 0.6495775359400089], [65.4460314035644, 0.6548813554644187, 0.2903222618655734]], "peak_params_": [[8.547532127637695, 0.6777637757124226, 2.6435820275792126], [11.211116993516836, 0.4750273634629277, 3.8727982666613907], [18.34895255887536, 0.49822205759886284, 6.3482583425233345], [24.538053257529896, 0.30487913827693935, 2.902504446577087], [27.578041870073843, 0.28875761358472385, 0.5626987678339356], [31.094303593260655, 0.1738240251366734, 1.590229469864656], [62.47240252954325, 0.21373692908423414, 1.2991550718800178], [65.4460314035644, 0.2013428171402869, 0.5806445237311468]], "r_squared_": 0.9882325237260096, "error_": 0.04727954460630795}
{"freq_range": [2.0, 80.0], "freq_res": 1.0, "aperiodic_params_": [0.5633378886170856, 1.2715308716577094], "gaussian_params_": [[8.749093253742986, 0.6410401193470889, 1.3021859035415353], [11.882162129496901, 0.3328827124813484, 1.1663381159383537], [18.21025405477745, 0.49590536748286534, 3.163071278248305], [24.200072359350866, 0.272022444733343, 1.5105900094021631], [27.57235893296951, 0.9464536933495301, 0.2760518169346551], [31.252381396228436, 0.19544281604128508, 0.5217067159580985], [65.12494002782653, 0.2506530236743054, 0.4675843334339057], [68.58898164207768, 0.4148843358139201, 0.2891445080384982], [75.16215107693918, 0.16698328275936347, 0.2505645354051201]], "peak_params_": [[8.749093253742986, 0.6521142802630708, 2.6043718070830706], [11.882162129496901, 0.43176830119567594, 2.3326762318767074], [18.21025405477745, 0.4948711351644022, 6.32614255649661], [24.200072359350866, 0.3625139394335508, 3.0211800188043263], [27.57235893296951, 0.3007123612425303, 0.5521036338693102], [31.252381396228436, 0.17401138869797883, 1.043413431916197], [65.12494002782653, 0.24186285079703485, 0.9351686668678114], [68.58898164207768, 0.15105913789588632, 0.5782890160769965], [75.16215107693918, 0.1354356600692861, 0.5011290708102402]], "r_squared_": 0.9910330194371559, "error_": 0.041179652370569246}
{"freq_range": [2.0, 80.0], "freq_res": 1.0, "aperiodic_params_": [0.4736719240315441, 1.1999092438083196], "gaussian_params_": [[8.334788231224321, 0.5315409042624941, 1.0439754144228515], [11.155116439256942, 0.48287868305121345, 1.5308783241976591], [18.131704055961194, 0.5136970511630562, 3.0337814234975804], [24.185625567622612, 0.2854173178781898, 1.658008197931232], [27.566239564976684, 1.0512488647037115, 0.2623523772639273], [31.30838242668966, 0.25419219072263266, 0.4410706716220641], [65.44111605147843, 0.8318462725685054, 0.25878462500940547], [79.48030592366636, 1.0535440268917722, 0.27880562919029567]], "peak_params_": [[8.334788231224321, 0.5645838860492891, 2.087950828845703], [11.155116439256942, 0.5332503940393737, 3.0617566483953182], [18.131704055961194, 0.5135063094196126, 6.067562846995161], [24.185625567622612, 0.36274436033289814, 3.316016395862464], [27.566239564976684, 0.2908184356543013, 0.5247047545278546], [31.30838242668966, 0.19919819746094958, 0.8821413432441282], [65.44111605147843, 0.19458541560533793, 0.5175692500188109], [79.48030592366636, 0.23889431204957523, 0.5576112583805913]], "r_squared_": 0.9882085491383161, "error_": 0.04718743567644199}
{"freq_range": [2.0, 80.0], "freq_res": 1.0, "aperiodic_params_": [0.28926303469101866, 1.062571874956627], "gaussian_params_": [[9.652444548824432, 0.5318730349807399, 1.9535104882919998], [19.310991602509898, 0.4729966103838865, 5.6227099963108484], [31.40772892080379, 0.7277752435777911, 0.2794460953614613], [79.42898962248098, 0.3942945709027669, 0.4323259819905842]], "peak_params_": [[9.652444548824432, 0.6435806438925281, 3.9070209765839996], [19.310991602509898, 0.47227934576291986, 11.245419992621697], [31.40772892080379, 0.3055270482213581, 0.5588921907229226], [79.42898962248098, 0.24099729879326892, 0.8646519639811684]], "r_squared_": 0.9761306201145691, "error_": 0.06291178891567761}
{"freq_range": [2.0, 80.0], "freq_res": 1.0, "aperiodic_params_": [0.049025078463105304, 0.904216009437078], "gaussian_params_": [[8.4362046296648, 1.504640625399322, 0.26865715087985315], [10.730863677255877, 0.4503258413206768, 2.0679931371164386], [16.618189559038832, 0.3066626899331014, 0.712967204195471], [21.725421567089604, 0.2671724144979391, 4.9989869165692], [31.366672100369126, 0.5919282374545317, 0.25182213096499645], [41.57331297422589, 0.9553358624403768, 0.25164919176453765], [68.53128432089328, 0.8962081858476619, 0.2633926124341912], [79.20340642350801, 0.2512519154890318, 1.207119217351207]], "peak_params_": [[8.4362046296648, 0.5971684664312438, 0.5373143017597063], [10.730863677255877, 0.47327115165129524, 4.135986274232877], [16.618189559038832, 0.441153276180859, 1.425934408390942], [21.725421567089604, 0.266769855186054, 9.9979738331384], [31.366672100369126, 0.252852081255178, 0.5036442619299929], [41.57331297422589, 0.2269913113700932, 0.5032983835290753], [68.53128432089328, 0.18397594462243094, 0.5267852248683824], [79.20340642350801, 0.24771007355165442, 2.414238434702414]], "r_squared_": 0.9795916501189773, "error_": 0.04849660451198998}
{"freq_range": [2.0, 80.0], "freq_res": 1.0, "aperiodic_params_": [-0.3084253817461501, 0.7159142173417264], "gaussian_params_": [[8.438967207612906, 1.4036757115276441, 0.2860105526239107], [11.211777215220057, 0.49028150573315876, 2.260267101001327], [16.62289267821052, 0.3179938690019294, 0.6964935113122142], [21.98635392914871, 0.19251418210261542, 0.5835800120895266], [30.59606453540129, 0.47215101227646383, 0.2689385218663879], [40.01971905826784, 0.153894923360214, 0.2500000120436657], [58.35909430215679, 0.24195943798750083, 0.6327387016762801], [62.605592311369534, 0.22787391095622925, 0.5533016851382974], [68.48564667078455, 0.6843376404479942, 0.2792428953432215], [76.54796540086404, 0.1235511164922407, 5.999999999999999]], "peak_params_": [[8.438967207612906, 0.6109160232512558, 0.5720211052478213], [11.211777215220057, 0.48813416160641854, 4.520534202002654], [16.62289267821052, 0.2931053041808437, 1.3929870226244283], [21.98635392914871, 0.19246709786791216, 1.1671600241790532], [30.59606453540129, 0.15283422153490456, 0.5378770437327758], [40.01971905826784, 0.1534169427450578, 0.5000000240873314], [58.35909430215679, 0.20700882323820813, 1.2654774033525602], [62.605592311369534, 0.18640340257483556, 1.1066033702765947], [68.48564667078455, 0.19560804533069587, 0.558485790686443], [76.54796540086404, 0.12320097674273711, 11.999999999999998]], "r_squared_": 0.9680167697179425, "error_": 0.04355016551106182}
{"freq_range": [2.0, 80.0], "freq_res": 1.0, "aperiodic_params_": [-0.0823678056117737, 0.9870099039196181], "gaussian_params_": [[9.213919763773701, 0.6885662930428668, 1.48019026298941], [14.525114138528815, 0.4619422739791094, 2.947161133792584], [20.648616786832267, 0.19187201289712633, 1.9309845211001055], [64.23100919531399, 0.1848288150198452, 1.4673705634163035], [69.44633267616473, 0.17732466813675613, 0.7560640851850989], [75.13595581247918, 0.1761434857047948, 0.6708905805172551], [79.10412235987462, 0.1370066764999431, 0.8363536083547041]], "peak_params_": [[9.213919763773701, 0.7611028669013903, 2.96038052597882], [14.525114138528815, 0.4589750035571327, 5.894322267585168], [20.648616786832267, 0.2300707021496311, 3.861969042200211], [64.23100919531399, 0.18255250999814598, 2.934741126832607], [69.44633267616473, 0.1499082554619222, 1.5121281703701979], [75.13595581247918, 0.17256433908317703, 1.3417811610345103], [79.10412235987462, 0.13594904682099318, 1.6727072167094081]], "r_squared_": 0.9890979071516475, "error_": 0.03801176425716251}
{"freq_range": [2.0, 80.0], "freq_res": 1.0, "aperiodic_params_": [0.23326162648380033, 1.1853126643845973], "gaussian_params_": [[9.236216683775796, 0.7341798770833496, 1.4854706296736904], [17.094403010221374, 0.5209715049508258, 5.049200840964815], [63.33753923139743, 0.19870098540180517, 1.3540828340865718]], "peak_params_": [[9.236216683775796, 0.869086610520374, 2.9709412593473807], [17.094403010221374, 0.5208813159140255, 10.09840168192963], [63.33753923139743, 0.1926224495571527, 2.7081656681731436]], "r_squared_": 0.9879118222604429, "error_": 0.05149544355065937}
{"freq_range": [2.0, 80.0], "freq_res": 1.0, "aperiodic_params_": [0.38712934275038907, 1.2241048927157134], "gaussian_params_": [[9.260710161751222, 0.8323182064003691, 1.6026125908206486], [16.03482493693711, 0.39698081715709355, 3.5945031064506936], [21.466025673060553, 0.25787936475548995, 4.689849963137339], [27.581034417996356, 0.44527211235460634, 0.26606571886098374], [64.99223030063224, 0.23756256386012098, 0.4520897936441171], [68.58175647309228, 0.5016070401538675, 0.2962700874769796]], "peak_params_": [[9.260710161751222, 0.8873982245189942, 3.205225181641297], [16.03482493693711, 0.5278335911688735, 7.189006212901387], [21.466025673060553, 0.40952082746692486, 9.379699926274679], [27.581034417996356, 0.22814619706858186, 0.5321314377219675], [64.99223030063224, 0.23752748261779777, 0.9041795872882342], [68.58175647309228, 0.1851882977050734, 0.5925401749539592]], "r_squared_": 0.9879575893216019, "error_": 0.048040672227540736}
{"freq_range": [2.0, 80.0], "freq_res": 1.0, "aperiodic_params_": [0.5064897408129893, 1.2199987544647157], "gaussian_params_": [[8.722813918472848, 0.791516364448725, 1.0959110582737666], [11.2260434477825, 0.41454117244902916, 1.0915462555483197], [14.706382619750864, 0.3473243731123914, 1.6762157355558058], [16.499859797881673, 0.5963114863155893, 0.34269621070731626], [18.796728091294366, 0.43399710526232427, 0.95675523471095], [22.284216919742807, 0.23466387963017218, 2.9911724492733867], [27.551030243714198, 0.6991274511111248, 0.25564757663092297]], "peak_params_": [[8.722813918472848, 0.8194848511626097, 2.191822116547533], [11.2260434477825, 0.5274608435784476, 2.1830925110966395], [14.706382619750864, 0.35539158169785356, 3.3524314711116117], [16.499859797881673, 0.49559416998409755, 0.6853924214146325], [18.796728091294366, 0.5658028869331142, 1.9135104694219], [22.284216919742807, 0.23523107583754443, 5.982344898546773], [27.551030243714198, 0.1873649270630049, 0.5112951532618459]], "r_squared_": 0.9879936548938819, "error_": 0.04704876350422175}
{"freq_range": [2.0, 80.0], "freq_res": 1.0, "aperiodic_params_": [0.4701385417374313, 1.2185424876790727], "gaussian_params_": [[9.325355321257362, 0.7635050689528495, 1.742211687375451], [17.556602399023404, 0.5526602026441166, 3.6529086362008654], [24.530221309007228, 0.143415239478998, 1.471689039493068], [27.531139209474432, 0.9659923281113847, 0.2934054154126095], [65.37289951222084, 0.5711136917880425, 0.2975094139421045]], "peak_params_": [[9.325355321257362, 0.7858698615953483, 3.484423374750902], [17.556602399023404, 0.5486145879055951, 7.305817272401731], [24.530221309007228, 0.20560978159078713, 2.943378078986136], [27.531139209474432, 0.28762831744959527, 0.586810830825219], [65.37289951222084, 0.26036315601137305, 0.595018827884209]], "r_squared_": 0.9846646221341511, "error_": 0.05868733010772059}
{"freq_range": [2.0, 80.0], "freq_res": 1.0, "aperiodic_params_": [0.43300180872112337, 1.177909766285454], "gaussian_params_": [[9.400838659685292, 0.6859006254200309, 1.8015415377445794], [17.897327726180883, 0.537068179679938, 4.362579712770755], [27.559828131494573, 1.0772701898110508, 0.25001329768365405]], "peak_params_": [[9.400838659685292, 0.7362468231298831, 3.6030830754891587], [17.897327726180883, 0.5369272052227979, 8.72515942554151], [27.559828131494573, 0.26545668099029207, 0.5000265953673081]], "r_squared_": 0.9833072783088397, "error_": 0.05804946681407327}
{"freq_range": [2.0, 80.0], "freq_res": 1.0, "aperiodic_params_": [0.3951097053443562, 1.1019758120792535], "gaussian_params_": [[9.595759937752135, 0.6262579122267267, 1.9195996896576624], [16.604646644163694, 0.25174065749368923, 0.6416806151918614], [18.528321060427174, 0.48077524309831465, 5.109288602944582], [27.603907203524592, 0.5414459407130892, 0.2502596300673949]], "peak_params_": [[9.595759937752135, 0.7319055387582349, 3.8391993793153247], [16.604646644163694, 0.6683287211771249, 1.2833612303837227], [18.528321060427174, 0.47897188318341577, 10.218577205889163], [27.603907203524592, 0.24097314747780474, 0.5005192601347898]], "r_squared_": 0.982611083367755, "error_": 0.05991703687430177}
{"freq_range": [2.0, 80.0], "freq_res": 1.0, "aperiodic_params_": [0.0822116066823652, 0.9381391812258371], "gaussian_params_": [[8.461402661714047, 2.3175248534169612, 0.2500038956986593], [10.459469390960013, 0.5752733242410925, 2.061631859906183], [16.50760559573755, 0.3098517262794941, 0.8674648437217698], [19.452034599135946, 0.331647060221518, 4.80955154448252], [79.99999999999999, 0.1624731635103876, 5.999513721718523]], "peak_params_": [[8.461402661714047, 0.7239263230197421, 0.5000077913973185], [10.459469390960013, 0.6092460993521505, 4.123263719812366], [16.50760559573755, 0.558729931884369, 1.7349296874435396], [19.452034599135946, 0.3352886488549647, 9.61910308896504], [79.99999999999999, 0.16247316351038754, 11.999027443437045]], "r_squared_": 0.9756339054728955, "error_": 0.057215536442476296}
{"freq_range": [2.0, 80.0], "freq_res": 1.0, "aperiodic_params_": [-0.19157644042201205, 0.6923148827846294], "gaussian_params_": [[8.463319197023965, 1.8865764441976918, 0.26864554443783184], [11.06135971701394, 0.486528995407252, 1.946207962527578], [16.28969371980355, 0.33704758927930706, 1.121549342343617], [62.566485477004, 0.7092167954752249, 0.27810446351803964], [64.60929767699544, 0.6387071071865467, 0.25151739450754007], [74.402019225041, 0.2288997159061117, 5.999999999999999], [77.37023056202636, 0.6085059252335715, 0.25000052905048925]], "peak_params_": [[8.463319197023965, 0.5675685998578712, 0.5372910888756637], [11.06135971701394, 0.48629223084473194, 3.892415925055156], [16.28969371980355, 0.3454359681125394, 2.243098684687234], [62.566485477004, 0.24806458107361573, 0.5562089270360793], [64.60929767699544, 0.25818566551104016, 0.5030347890150801], [74.402019225041, 0.2283864776047626, 11.999999999999998], [77.37023056202636, 0.411668866376385, 0.5000010581009785]], "r_squared_": 0.954711600251492, "error_": 0.04789886419240362}
{"freq_range": [2.0, 80.0], "freq_res": 1.0, "aperiodic_params_": [0.02709098268049858, 1.0915371769030955], "gaussian_params_": [[9.172278653429332, 0.7455267220118095, 1.4959071643672497], [16.11850417375838, 0.45687875387516996, 4.8031622565854875], [34.261649924423935, 0.17057424688380485, 0.6082683401402598], [64.26585312798343, 0.15774940590750247, 1.3923609073002974]], "peak_params_": [[9.172278653429332, 0.8929502586292167, 2.9918143287344994], [16.11850417375838, 0.4567620429934658, 9.606324513170975], [34.261649924423935, 0.1559481578949935, 1.2165366802805195], [64.26585312798343, 0.1548999273272733, 2.7847218146005948]], "r_squared_": 0.9895542353469164, "error_": 0.04259362943248432}
{"freq_range": [2.0, 80.0], "freq_res": 1.0, "aperiodic_params_": [0.19644391458873123, 1.1374355445368267], "gaussian_params_": [[8.95565039228335, 0.91312425136822, 1.3067101800950827], [11.482385359768843, 0.8576134526371781, 0.31440768105510647], [14.447760621675338, 0.33094729115186633, 0.2918315978748161], [17.46558713433703, 0.4757643387750687, 4.692716271519561], [62.53174407447265, 0.6339876517196867, 0.29309748534040025], [65.00411396176315, 0.17485524321034415, 0.4024236147834786], [68.74709269510808, 0.2915162648051551, 0.2500232447501323], [75.04011212602002, 0.17753711789241303, 0.25000000045293735]], "peak_params_": [[8.95565039228335, 1.0060780331653094, 2.6134203601901653], [11.482385359768843, 0.7170252039016091, 0.6288153621102129], [14.447760621675338, 0.46473495705393875, 0.5836631957496322], [17.46558713433703, 0.4734284835487351, 9.385432543039123], [62.53174407447265, 0.17694734893245445, 0.5861949706808005], [65.00411396176315, 0.17484610647798937, 0.8048472295669572], [68.74709269510808, 0.17477406856997013, 0.5000464895002646], [75.04011212602002, 0.17526652945553622, 0.5000000009058747]], "r_squared_": 0.9907431466040594, "error_": 0.041856348435718976}
{"freq_range": [2.0, 80.0], "freq_res": 1.0, "aperiodic_params_": [0.3129470286751069, 1.1789410594678584], "gaussian_params_": [[9.205099461052326, 0.9248041563959695, 1.5987456693119746], [15.964239982961324, 0.390472555519719, 3.676329765885277], [20.586656350295435, 0.22132245545229487, 4.384505918615806], [27.527734446674796, 0.7874575751633577, 0.2507312993525961], [64.08540420425975, 0.1478298871517066, 1.3249457626424552], [77.54796419135141, 0.08705306070449809, 5.999995981794774]], "peak_params_": [[9.205099461052326, 0.9888792974734006, 3.197491338623949], [15.964239982961324, 0.5186186546340465, 7.352659531770554], [20.586656350295435, 0.3731534012695936, 8.769011837231613], [27.527734446674796, 0.188442915124988, 0.5014625987051922], [64.08540420425975, 0.15432529414367235, 2.6498915252849105], [77.54796419135141, 0.08680635358127442, 11.999991963589547]], "r_squared_": 0.9881762593473182, "error_": 0.05063561429254808}
{"freq_range": [2.0, 80.0], "freq_res": 1.0, "aperiodic_params_": [0.38947006926119904, 1.1511887652425736], "gaussian_params_": [[9.250049929949393, 0.8195282077898839, 1.6464128872925583], [17.458404268617873, 0.5290116383749661, 4.111134484368752], [27.523739761905837, 0.939016734758321, 0.26595434477686514], [64.77713740067334, 0.24320599110910796, 0.5127348005827049]], "peak_params_": [[9.250049929949393, 0.8738499376261042, 3.2928257745851166], [17.458404268617873, 0.5257459043050233, 8.222268968737504], [27.523739761905837, 0.20869691647861077, 0.5319086895537303], [64.77713740067334, 0.2212838846332852, 1.0254696011654099]], "r_squared_": 0.9877881551009919, "error_": 0.04941691640211583}
{"freq_range": [2.0, 80.0], "freq_res": 1.0, "aperiodic_params_": [0.343718565328232, 1.087795683369722], "gaussian_params_": [[9.275833518640617, 0.7756466785073924, 1.6824033660601359], [17.57370258086705, 0.5304521082935588, 4.180676870718354], [27.51960910861639, 0.9698589368564485, 0.267372691177827], [64.9744611825131, 0.20775976377274258, 0.5048172952742759]], "peak_params_": [[9.275833518640617, 0.8300623533936378, 3.3648067321202717], [17.57370258086705, 0.5277026791858519, 8.361353741436709], [27.51960910861639, 0.21673579635546458, 0.534745382355654], [64.9744611825131, 0.20749406673387205, 1.0096345905485518]], "r_squared_": 0.9841613707802336, "error_": 0.05403268852887153}
{"freq_range": [2.0, 80.0], "freq_res": 1.0, "aperiodic_params_": [0.22262792417621918, 0.9766349267378768], "gaussian_params_": [[9.137420812664816, 0.7161021505773908, 1.535770399069859], [17.30401462061257, 0.5012370386404736, 4.869777175473814]], "peak_params_": [[9.137420812664816, 0.830361296088318, 3.071540798139718], [17.30401462061257, 0.5002626954146825, 9.739554350947628]], "r_squared_": 0.9780049396053117, "error_": 0.06057152605633506}
{"freq_range": [2.0, 80.0], "freq_res": 1.0, "aperiodic_params_": [0.05470226396845999, 0.844346160465193], "gaussian_params_": [[8.462171609753538, 1.2924497225598013, 0.313948706501504], [10.056105450020734, 0.5020059667482811, 1.7250518028673394], [16.514866120890677, 0.23786414309829762, 0.7582228185592201], [17.94314513695482, 0.3325148089777467, 4.949800629909442]], "peak_params_": [[8.462171609753538, 0.7282864764595367, 0.627897413003008], [10.056105450020734, 0.5935004176646967, 3.450103605734679], [16.514866120890677, 0.5205204137739796, 1.5164456371184403], [17.94314513695482, 0.3674386075916176, 9.899601259818883]], "r_squared_": 0.9773514005218944, "error_": 0.05247775900853621}
{"freq_range": [2.0, 80.0], "freq_res": 1.0, "aperiodic_params_": [-0.26465622387846655, 0.6224610549851973], "gaussian_params_": [[8.418917332170118, 0.6005719131796938, 0.550313736953269], [10.452034599323081, 0.39861385644290565, 1.6877082098116858], [15.087402908037365, 0.21987936352787416, 1.9009693457671686], [19.54796095678139, 0.12954752975142747, 5.9105312276646504], [34.10336962046958, 0.19677959256902774, 0.25031380200234926], [40.66527322116827, 0.1570826740033405, 0.8736330203570017], [68.57331811963134, 0.7329563828683738, 0.2500044867296372], [76.58404970556177, 0.17817785586862978, 1.7353582613920802]], "peak_params_": [[8.418917332170118, 0.6076586794740764, 1.100627473906538], [10.452034599323081, 0.43551525653892703, 3.3754164196233716], [15.087402908037365, 0.32655966889560395, 3.801938691534337], [19.54796095678139, 0.13696736452560354, 11.821062455329301], [34.10336962046958, 0.18721495202891414, 0.5006276040046985], [40.66527322116827, 0.14614449470692392, 1.7472660407140035], [68.57331811963134, 0.1708444222420733, 0.5000089734592744], [76.58404970556177, 0.1731323411398964, 3.4707165227841603]], "r_squared_": 0.9675318999339542, "error_": 0.04337876608756409}
{"freq_range": [2.0, 80.0], "freq_res": 1.0, "aperiodic_params_": [-0.34825686992239546, 1.0957733141049188], "gaussian_params_": [[9.310938497333881, 0.7253545528090171, 1.6581490732596094], [14.421775873662288, 0.15976730246495738, 1.2913233166662257], [17.586588414860636, 0.23737300651031548, 4.713640297609275], [34.64860846662998, 0.18438611789227238, 0.9073175326975138], [55.248992899290855, 0.20697256177589377, 0.4470942583159257], [58.97728045067197, 0.14269494031492955, 0.2500020212859625], [65.41972543749775, 0.11770902088263246, 1.0534271166658467], [69.59282684261593, 0.47503766809371567, 0.27697611753330564], [75.05651892747402, 0.17068063525092678, 0.8879719142554287]], "peak_params_": [[9.310938497333881, 0.7579065053899692, 3.3162981465192187], [14.421775873662288, 0.3424837430423753, 2.5826466333324514], [17.586588414860636, 0.23989948022037777, 9.42728059521855], [34.64860846662998, 0.17132199368352508, 1.8146350653950276], [55.248992899290855, 0.17724089942133148, 0.8941885166318514], [58.97728045067197, 0.14210691795059738, 0.500004042571925], [65.41972543749775, 0.10872689827887294, 2.1068542333316933], [69.59282684261593, 0.1612417136716422, 0.5539522350666113], [75.05651892747402, 0.17033524996292426, 1.7759438285108573]], "r_squared_": 0.9931237161489026, "error_": 0.03240060455352524}
{"freq_range": [2.0, 80.0], "freq_res": 1.0, "aperiodic_params_": [0.14150445629615582, 1.0897483888768158], "gaussian_params_": [[9.27987739852283, 0.8511518954633946, 1.661104586149189], [15.323545593038306, 0.361094176004351, 2.522183262580919], [20.036534701714658, 0.2047661057547362, 1.5142022818790786], [24.54796539911362, 0.08973453080722205, 3.1898332074729905], [34.64023476449146, 0.13716167431943582, 0.9042262321733445], [58.991717744872574, 0.1406539340557128, 0.25000000001815714], [64.16705229141138, 0.10862486951214251, 1.461816395824153]], "peak_params_": [[9.27987739852283, 0.8547394794688595, 3.322209172298378], [15.323545593038306, 0.3622280783374696, 5.044366525161838], [20.036534701714658, 0.30191177638017197, 3.028404563758157], [24.54796539911362, 0.0900185313818358, 6.379666414945981], [34.64023476449146, 0.12714212992087326, 1.808452464346689], [58.991717744872574, 0.14078709886608554, 0.5000000000363143], [64.16705229141138, 0.10791789888993697, 2.923632791648306]], "r_squared_": 0.9886206569279717, "error_": 0.04487373544238921}
{"freq_range": [2.0, 80.0], "freq_res": 1.0, "aperiodic_params_": [0.22183197265018537, 1.0718587795492784], "gaussian_params_": [[9.016662496420707, 0.9149684782453509, 1.348539914586829], [11.482335897906832, 0.9358507722063697, 0.27271604215977896], [17.14239330536722, 0.4441791044383718, 4.311382715324739], [27.532583152386117, 0.8048074057966612, 0.2547467062531393], [67.54796540086404, 0.07973191571809822, 5.999999999999999]], "peak_params_": [[9.016662496420707, 0.9895523099447737, 2.697079829173658], [11.482335897906832, 0.6671014627899172, 0.5454320843195579], [17.14239330536722, 0.44393693717563965, 8.622765430649478], [27.532583152386117, 0.16813823124493132, 0.5094934125062786], [67.54796540086404, 0.07950595812427319, 11.999999999999998]], "r_squared_": 0.987269304417035, "error_": 0.044669998565725795}
{"freq_range": [2.0, 80.0], "freq_res": 1.0, "aperiodic_params_": [0.296986254580823, 1.0394611709707913], "gaussian_params_": [[9.208019689502512, 0.7842216162387564, 1.511233096125553], [17.07908724069233, 0.4479560027667302, 4.139794310703428], [27.540434413262624, 0.9979418625765705, 0.25000000000000006], [65.11133106616349, 0.15736418926417503, 0.4285348582520322], [73.58688696420882, 0.08082627008084951, 5.999999999999999]], "peak_params_": [[9.208019689502512, 0.8435394588459307, 3.022466192251106], [17.07908724069233, 0.44787558853827036, 8.279588621406855], [27.540434413262624, 0.19801842112331958, 0.5000000000000001], [65.11133106616349, 0.18116880697599425, 0.8570697165040644], [73.58688696420882, 0.08063491357367081, 11.999999999999998]], "r_squared_": 0.985998724099481, "error_": 0.04579090494759541}
{"freq_range": [2.0, 80.0], "freq_res": 1.0, "aperiodic_params_": [0.08487910354547418, 0.7994189398061992], "gaussian_params_": [[9.020303319856579, 0.7375994366554331, 1.2614155510832796], [16.68043689115884, 0.38463523905246194, 4.7947049727876445], [34.04216578037836, 0.20892432678200237, 0.2500210868018476]], "peak_params_": [[9.020303319856579, 0.8441291960674087, 2.5228311021665593], [16.68043689115884, 0.3837818921874656, 9.589409945575289], [34.04216578037836, 0.20653870410495478, 0.5000421736036952]], "r_squared_": 0.9758310272515385, "error_": 0.05284462578266513}
{"freq_range": [2.0, 80.0], "freq_res": 1.0, "aperiodic_params_": [-0.22639012162107755, 0.46026398881021374], "gaussian_params_": [[8.620436662139149, 0.601516338394198, 0.7857925180161435], [10.452037064753476, 0.1990913466625951, 1.5038157043310922], [15.618009561090236, 0.236998133544939, 3.334770710767033], [27.556698094800694, 0.16103036884865585, 4.3080710883339055], [34.44276286048318, 0.7705763357030089, 0.2759194249356496], [40.66252729545341, 0.21655342705768282, 0.9702032273752421], [59.10147526833691, 0.19266458243193121, 0.7094824903145909]], "peak_params_": [[8.620436662139149, 0.6932850894274538, 1.571585036032287], [10.452037064753476, 0.37648490024764164, 3.0076314086621845], [15.618009561090236, 0.2400773119858357, 6.669541421534066], [27.556698094800694, 0.16042056869593369, 8.616142176667811], [34.44276286048318, 0.26526962414631183, 0.5518388498712992], [40.66252729545341, 0.2050785509239227, 1.9404064547504842], [59.10147526833691, 0.19070397894470492, 1.4189649806291817]], "r_squared_": 0.947886071392022, "error_": 0.048061216191337956}
{"freq_range": [2.0, 80.0], "freq_res": 1.0, "aperiodic_params_": [-0.7974963480662003, -0.09295942863813011], "gaussian_params_": [[8.926040929163815, 0.3579928274632009, 0.7969773790345086], [14.351988432827364, 0.20908001846479826, 2.804519817846806], [27.984837135833992, 0.28288424222924696, 5.999986187999731], [34.43539299249787, 0.6369463600977644, 0.29287261937278203], [40.65969713872477, 0.24909121938580794, 1.3444544007893804]], "peak_params_": [[8.926040929163815, 0.3921957608649722, 1.5939547580690172], [14.351988432827364, 0.22614299270288551, 5.609039635693612], [27.984837135833992, 0.2828848447974113, 11.999972375999462], [34.43539299249787, 0.3821016983208225, 0.5857452387455641], [40.65969713872477, 0.2681436951576279, 2.6889088015787608]], "r_squared_": 0.5283092571338395, "error_": 0.06657921477759153}
{"freq_range": [2.0, 80.0], "freq_res": 1.0, "aperiodic_params_": [0.06755130921635927, 0.9376959722793757], "gaussian_params_": [[9.161679070638913, 0.7195621553215915, 1.4327462115564613], [17.082010594102332, 0.251497708476738, 4.663759171848557], [34.366771805889144, 0.45156532276129613, 0.26558178321241666], [58.621761751905076, 0.4898049017696467, 0.27872744867595683], [66.17738560943192, 0.09399938518387954, 2.655041963700913], [76.18162788163896, 0.10725106074066457, 2.072972775211947]], "peak_params_": [[9.161679070638913, 0.7710256423904129, 2.8654924231129226], [17.082010594102332, 0.25145905536183377, 9.327518343697115], [34.366771805889144, 0.17436081845339668, 0.5311635664248333], [58.621761751905076, 0.1974839440884415, 0.5574548973519137], [66.17738560943192, 0.09379044647444479, 5.310083927401826], [76.18162788163896, 0.10694041224546336, 4.145945550423894]], "r_squared_": 0.9867355368611967, "error_": 0.03917517834992116}
{"freq_range": [2.0, 80.0], "freq_res": 1.0, "aperiodic_params_": [-0.11779536073005696, 0.649141319241642], "gaussian_params_": [[9.026862362944428, 0.6849785214223376, 1.2019899443231032], [16.275177242127473, 0.21304939149790642, 4.146746269271909], [26.095930736585913, 0.06568007731558974, 5.182384771223314], [27.604687549919763, 0.37107745299303463, 0.26221440062943135], [34.41329816140716, 0.7244203543579312, 0.27084145471690874], [40.71300941017829, 0.13592670579492486, 1.0416276254872603], [58.6060118693921, 0.44882670127894114, 0.3085266179327482]], "peak_params_": [[9.026862362944428, 0.7308110329815585, 2.4039798886462065], [16.275177242127473, 0.22242818413172172, 8.293492538543818], [26.095930736585913, 0.07928984701152086, 10.364769542446629], [27.604687549919763, 0.1844094590608183, 0.5244288012588627], [34.41329816140716, 0.2466695799854146, 0.5416829094338175], [40.71300941017829, 0.13191476878031105, 2.0832552509745206], [58.6060118693921, 0.19859624417693156, 0.6170532358654964]], "r_squared_": 0.9753189683161948, "error_": 0.04205393305456255}
{"freq_range": [2.0, 80.0], "freq_res": 1.0, "aperiodic_params_": [-0.19448980437219068, 0.46591480827179854], "gaussian_params_": [[8.932604895843296, 0.6533281426537323, 0.9239511079627232], [16.192194799788957, 0.2270968381662551, 4.358273357438228], [28.302157000516274, 0.179614818901784, 3.533353925095569], [34.41848040769297, 0.7274954603653618, 0.2818408953584299], [40.73632110558367, 0.20050913459830824, 1.1809678033058113], [58.87978105779915, 0.20423434861060158, 0.5771823797734484]], "peak_params_": [[8.932604895843296, 0.7097835076612963, 1.8479022159254463], [16.192194799788957, 0.22729491926796042, 8.716546714876456], [28.302157000516274, 0.18474423568824916, 7.066707850191138], [34.41848040769297, 0.29059207786952923, 0.5636817907168598], [40.73632110558367, 0.19585492944902538, 2.3619356066116226], [58.87978105779915, 0.19985190104622907, 1.1543647595468969]], "r_squared_": 0.9529466688631699, "error_": 0.047350901423056146}
{"freq_range": [2.0, 80.0], "freq_res": 1.0, "aperiodic_params_": [-1.1780632683363148, 0.9532181350731681], "gaussian_params_": [[8.581499691939712, 0.5203696520384908, 1.0542421553125334], [12.130811731126466, 0.60579365438972, 2.001569522386821], [15.507331421648207, 1.6814009251195858, 0.2733925663016513], [17.240571385140676, 0.42589531486281346, 0.5669336645843697], [19.500721941612166, 0.91807120608539, 0.28741763577645657], [21.644439068423726, 0.2951086095090519, 0.8524396205943501], [52.46671706802814, 0.9525403728598955, 0.25015451928977944], [58.521661906320794, 0.7844145193446022, 0.25750996185340475], [67.82474253572957, 0.15907692891785669, 0.9308343601766151], [75.42684001655724, 0.13890388349214317, 5.999999999999999]], "peak_params_": [[8.581499691939712, 0.6591970007703585, 2.108484310625067], [12.130811731126466, 0.60721215812458, 4.003139044773642], [15.507331421648207, 0.46389827483313617, 0.5467851326033026], [17.240571385140676, 0.4206511646723512, 1.1338673291687393], [19.500721941612166, 0.24923460173502843, 0.5748352715529131], [21.644439068423726, 0.2705251119526353, 1.7048792411887002], [52.46671706802814, 0.16718361386367642, 0.5003090385795589], [58.521661906320794, 0.14300060863180786, 0.5150199237068095], [67.82474253572957, 0.22084893090758184, 1.8616687203532303], [75.42684001655724, 0.1385528384989101, 11.999999999999998]], "r_squared_": 0.983476759228802, "error_": 0.04102908225418188}
{"freq_range": [2.0, 80.0], "freq_res": 1.0, "aperiodic_params_": [-1.0414604456456453, 0.6866082110636538], "gaussian_params_": [[10.248927019792719, 0.3685691541972082, 1.9890539585686924], [17.25210583643241, 0.22759344257731645, 0.25002420675993847], [20.667096859535494, 0.17489562868259592, 3.7615972653487155], [43.524444095260634, 4.062368519723995e-34, 1.767681715240472], [57.482591140494065, 0.37064945234605345, 0.2766909407279799], [58.37415397711929, 0.12208465445972659, 4.166883343272068], [69.26300231021172, 0.17347082659026247, 1.356816057000456], [71.61134109000716, 0.48334552544894316, 0.25538279828340754]], "peak_params_": [[10.248927019792719, 0.36883136308302844, 3.9781079171373848], [17.25210583643241, 0.24679850023750882, 0.5000484135198769], [20.667096859535494, 0.17421221450152524, 7.523194530697431], [43.524444095260634, 0.0003181559664242606, 3.535363430480944], [57.482591140494065, 0.19660497492346263, 0.5533818814559598], [58.37415397711929, 0.18610400564179574, 8.333766686544136], [69.26300231021172, 0.174969301436517, 2.713632114000912], [71.61134109000716, 0.17507946987813794, 0.5107655965668151]], "r_squared_": 0.9525968350400974, "error_": 0.046015441238269096}
{"freq_range": [2.0, 80.0], "freq_res": 1.0, "aperiodic_params_": [-0.45407922116369914, 0.914807824947055], "gaussian_params_": [[8.135604512898466, 0.47816046802839407, 0.8973561838649478], [10.05435012237075, 0.24842761231510932, 1.3142751746718444], [15.175092593607957, 0.35753563993813037, 3.566868654738092], [22.19462651889526, 0.17592824243772515, 1.4937681668133755], [48.524027916305805, 0.1819421965641951, 0.9358922930949504], [52.8154838995104, 0.16878874654029033, 0.9689303715843859], [59.72191774119857, 0.19416713068138572, 0.9437967597356408], [61.65756725990374, 0.46473583689156794, 0.2657729238921591], [67.36280651073503, 0.2749889537069144, 0.7466911846504708], [69.48375276901564, 0.3490135394862082, 0.29736513763055], [74.10033349992783, 0.11146040788211214, 0.861338763823148], [77.54796540086404, 0.1582744287109229, 5.999994422679348]], "peak_params_": [[8.135604512898466, 0.5932292975202695, 1.7947123677298955], [10.05435012237075, 0.4282515891951575, 2.628550349343689], [15.175092593607957, 0.357315821009321, 7.133737309476184], [22.19462651889526, 0.23176144649306551, 2.987536333626751], [48.524027916305805, 0.15994493680852817, 1.8717845861899007], [52.8154838995104, 0.16579445217271216, 1.9378607431687718], [59.72191774119857, 0.18811712499815259, 1.8875935194712816], [61.65756725990374, 0.2186959922513192, 0.5315458477843182], [67.36280651073503, 0.2781237717702705, 1.4933823693009416], [69.48375276901564, 0.17515472061494886, 0.5947302752611], [74.10033349992783, 0.24359334612991201, 1.722677527646296], [77.54796540086404, 0.1578298287452431, 11.999988845358695]], "r_squared_": 0.9852324718108707, "error_": 0.033494349872742545}
{"freq_range": [2.0, 80.0], "freq_res": 1.0, "aperiodic_params_": [-0.9762048857472645, 0.73914100929375], "gaussian_params_": [[10.19908774378628, 0.5409109314868923, 1.9194697896881452], [13.754164113652322, 0.3002128159864807, 0.8141596887710526], [16.56762059034069, 0.2656525737392275, 0.8179355946911652], [21.0615603074081, 0.2539969727033402, 2.1627900344300257], [51.81991024809083, 0.13949592556768556, 1.965775676206534], [58.21533299513922, 0.2533962205403382, 1.0217433685582655], [62.49757789709945, 0.25831403805036524, 0.9105572577722774], [68.10362220756694, 0.17709258471962147, 1.7383101144492858], [71.64299995650389, 0.20796824846188833, 0.2630942182065766], [73.9786815145867, 0.12770432378114271, 0.25000180167403785], [78.54795399918291, 0.15758578584006477, 5.04897860276087]], "peak_params_": [[10.19908774378628, 0.5380169982294405, 3.8389395793762904], [13.754164113652322, 0.3661378543202134, 1.6283193775421052], [16.56762059034069, 0.275689166213243, 1.6358711893823303], [21.0615603074081, 0.2538942875987096, 4.325580068860051], [51.81991024809083, 0.1389119257174909, 3.931551352413068], [58.21533299513922, 0.24886822768684835, 2.043486737116531], [62.49757789709945, 0.2238583494625912, 1.8211145155445547], [68.10362220756694, 0.1945523800168405, 3.4766202288985717], [71.64299995650389, 0.1651553876046239, 0.5261884364131532], [73.9786815145867, 0.23283637472313057, 0.5000036033480757], [78.54795399918291, 0.15695544585950127, 10.09795720552174]], "r_squared_": 0.9822165403000611, "error_": 0.030922310577578604}
