{"freq_range": [2.0, 80.0], "freq_res": 1.0, "aperiodic_params_": [-0.28425580057911903, 0.3290684227954257], "gaussian_params_": [[10.530907814772005, 0.25209139172459494, 1.7415101089976235], [15.378865636213426, 0.2543511817511778, 1.1279909571514763], [28.475340854911366, 0.2149395348495185, 2.0550575006838177], [34.25630999173548, 0.2617655568514082, 0.25001556435598116], [54.5360489996163, 0.5579590982724639, 0.305721864096109]], "peak_params_": [[10.530907814772005, 0.24324594366771068, 3.483020217995247], [15.378865636213426, 0.24976698726923585, 2.2559819143029527], [28.475340854911366, 0.20926601230584163, 4.110115001367635], [34.25630999173548, 0.16056644497994355, 0.5000311287119623], [54.5360489996163, 0.1764068245867394, 0.611443728192218]], "r_squared_": 0.7771733974341231, "error_": 0.060490414678013846}
{"freq_range": [2.0, 80.0], "freq_res": 1.0, "aperiodic_params_": [-0.005682080332578602, 0.7791400541707323], "gaussian_params_": [[8.729587677321181, 0.31815120997300483, 0.8677367667646807], [12.15609140298879, 0.33802871239190035, 2.206963718562159], [16.567302983249416, 0.3637112078269698, 0.3361529046185633], [21.899918910015437, 0.1816109184185784, 4.191760288965152], [47.22053668168524, 0.24831342601624223, 0.46246640642053927]], "peak_params_": [[8.729587677321181, 0.4262490968842892, 1.7354735335293614], [12.15609140298879, 0.3486127226843957, 4.413927437124318], [16.567302983249416, 0.28095644400587916, 0.6723058092371266], [21.899918910015437, 0.18157533574701434, 8.383520577930303], [47.22053668168524, 0.2216254824231796, 0.9249328128410785]], "r_squared_": 0.9566243995960959, "error_": 0.05454669337615751}
{"freq_range": [2.0, 80.0], "freq_res": 1.0, "aperiodic_params_": [-0.17544173982090058, 0.3548353036850576], "gaussian_params_": [[9.649356639076574, 0.18507982596055733, 1.2890844830996633], [14.608311488776216, 0.31604406975061106, 1.7790150217372052], [28.853144627741244, 0.23558957315839138, 1.6845248122484253], [32.31665361010111, 0.18638326920736847, 1.7099617532412437], [40.10569488844432, 0.17662250248935885, 0.6585988944007036], [41.539037839838954, 0.3565011085790542, 0.33030718194401265], [44.43494914730717, 0.141072252992255, 1.2112922555611603], [50.03167228105382, 0.1623911541257681, 2.199549764493911], [57.3576750182516, 0.2149653871953132, 0.3446588675006796], [59.20960627549104, 0.12558185158637372, 1.428687516493817], [63.53496721718205, 0.4148224463424333, 0.2976181589919868], [72.89110570391375, 0.13585872458559278, 0.3395493870516379]], "peak_params_": [[9.649356639076574, 0.18939070955713677, 2.5781689661993266], [14.608311488776216, 0.3085095486499758, 3.5580300434744103], [28.853144627741244, 0.26310676098229874, 3.3690496244968506], [32.31665361010111, 0.2243637090150773, 3.4199235064824873], [40.10569488844432, 0.1745553050091705, 1.3171977888014073], [41.539037839838954, 0.15636679081643245, 0.6606143638880253], [44.43494914730717, 0.13604587198914853, 2.4225845111223205], [50.03167228105382, 0.16237800073692232, 4.399099528987822], [57.3576750182516, 0.16451250622387925, 0.6893177350013592], [59.20960627549104, 0.12427993501925316, 2.857375032987634], [63.53496721718205, 0.12283377814903496, 0.5952363179839736], [72.89110570391375, 0.12904878977702516, 0.6790987741032758]], "r_squared_": 0.749603758671665, "error_": 0.04912668801417579}
{"freq_range": [2.0, 80.0], "freq_res": 1.0, "aperiodic_params_": [-0.06291983381506394, 0.6097721735575609], "gaussian_params_": [[9.79867211236437, 0.2989049585977475, 1.6671387572489382], [14.036946265492306, 0.037418909905043984, 0.2503291695736741], [14.263507419396253, 0.2599839624072945, 2.2171418664709965], [19.57402171951247, 0.5236683613624232, 0.2673526901296848], [40.913051396710976, 0.1508721181606438, 0.6814196886191626], [46.0783048920229, 0.14025413139928997, 1.355113800451799], [51.68515160607835, 0.26409239544261853, 1.0614569781298813], [55.55474327241664, 0.1447322555427622, 0.9632766251386544]], "peak_params_": [[9.79867211236437, 0.337656827671791, 3.3342775144978765], [14.036946265492306, 0.30765518135842906, 0.5006583391473483], [14.263507419396253, 0.30765518135842906, 4.434283732941993], [19.57402171951247, 0.15630801296191654, 0.5347053802593696], [40.913051396710976, 0.14977400962179122, 1.3628393772383252], [46.0783048920229, 0.1400203229738003, 2.710227600903598], [51.68515160607835, 0.2528961851486584, 2.1229139562597625], [55.55474327241664, 0.13013605312098087, 1.9265532502773088]], "r_squared_": 0.9508204426095761, "error_": 0.04785391021999797}
{"freq_range": [2.0, 80.0], "freq_res": 1.0, "aperiodic_params_": [0.33009748458875093, 0.8822201931410429], "gaussian_params_": [[10.454297178345424, 0.30456731902772505, 2.0351981456792045], [17.333481208595124, 0.14879690975418347, 3.1155271374982774], [21.994666334382014, 0.15322882557308173, 0.2500000170516772], [41.50218024669803, 0.12722119888859793, 1.6189130560560745], [61.61875424922737, 0.1328741709029242, 5.999999999999999]], "peak_params_": [[10.454297178345424, 0.3063942743863521, 4.070396291358409], [17.333481208595124, 0.1496746017122237, 6.231054274996555], [21.994666334382014, 0.20165891607557662, 0.5000000341033544], [41.50218024669803, 0.12197987680176459, 3.237826112112149], [61.61875424922737, 0.13260620483236374, 11.999999999999998]], "r_squared_": 0.9421261477447264, "error_": 0.05688975982300459}
{"freq_range": [2.0, 80.0], "freq_res": 1.0, "aperiodic_params_": [0.1653219543558733, 1.0103014165315396], "gaussian_params_": [[8.493413809618767, 0.9497499874049354, 0.33355749690657605], [10.804602014812854, 0.390698903390565, 1.6091737416444365], [15.58214676143056, 0.279003291175393, 2.6374475818089436], [22.917113633580207, 0.1625075121855928, 3.0145395905099672], [66.36988028807924, 0.1580331957308123, 2.194243352505691], [73.88155936247779, 0.1885838030716634, 1.0509678735160897]], "peak_params_": [[8.493413809618767, 0.4080489025469365, 0.6671149938131521], [10.804602014812854, 0.4495801263231988, 3.218347483288873], [15.58214676143056, 0.28933667975982336, 5.274895163617887], [22.917113633580207, 0.16779082770341902, 6.0290791810199345], [66.36988028807924, 0.1558037874220095, 4.388486705011382], [73.88155936247779, 0.18776417833488201, 2.1019357470321793]], "r_squared_": 0.9802733957336439, "error_": 0.04687120226005308}
{"freq_range": [2.0, 80.0], "freq_res": 1.0, "aperiodic_params_": [-0.006883858270576638, 0.8921102639828061], "gaussian_params_": [[7.971537905466005, 0.3834790864521939, 0.5694946533406681], [9.844014348338415, 0.37772095631460095, 1.130997992812026], [13.511638061332544, 0.27595009551031185, 2.2931642937449], [20.240129982581774, 0.17719835788435154, 2.6990096829808685], [23.628546124616438, 0.3069021175768451, 0.3072078340808956], [27.810358767653653, 0.19869605038647878, 0.5766136968416643]], "peak_params_": [[7.971537905466005, 0.49835023070574674, 1.1389893066813361], [9.844014348338415, 0.4603829533335446, 2.261995985624052], [13.511638061332544, 0.28244290060611665, 4.5863285874898], [20.240129982581774, 0.18153822405200082, 5.398019365961737], [23.628546124616438, 0.2149121437746535, 0.6144156681617912], [27.810358767653653, 0.19107647845155262, 1.1532273936833286]], "r_squared_": 0.9810542509545318, "error_": 0.041355088422804616}
{"freq_range": [2.0, 80.0], "freq_res": 1.0, "aperiodic_params_": [-0.1496888694690201, 0.5307423592569913], "gaussian_params_": [[10.736553833411625, 0.3416141109218184, 2.721740650260682], [20.387041662548643, 0.31127634365363666, 2.308618127073237], [41.55673422663487, 0.12304296771620975, 4.080815092939712], [52.30305003470964, 0.178397059498656, 0.5555950584107613], [63.45203459913595, 0.08943309397111467, 5.999999999999996]], "peak_params_": [[10.736553833411625, 0.3400975631880074, 5.443481300521364], [20.387041662548643, 0.3079752145738952, 4.617236254146474], [41.55673422663487, 0.12246909335161293, 8.161630185879424], [52.30305003470964, 0.17286232931383494, 1.1111901168215226], [63.45203459913595, 0.08917976781882553, 11.999999999999991]], "r_squared_": 0.9146247369262342, "error_": 0.053144903960001204}
{"freq_range": [2.0, 80.0], "freq_res": 1.0, "aperiodic_params_": [0.26833544563964207, 0.9134108755450489], "gaussian_params_": [[9.978639537287858, 0.3517497938371479, 1.8748619343880044], [13.65330933073918, 0.19965676638962856, 0.2729863510817493], [14.694912214356721, 0.24498837864801778, 3.1588401895112654], [25.94320257912146, 0.08801331058684345, 5.9999983192996424]], "peak_params_": [[9.978639537287858, 0.43548785019503283, 3.749723868776009], [13.65330933073918, 0.3756621578212142, 0.5459727021634986], [14.694912214356721, 0.27027142577769125, 6.317680379022531], [25.94320257912146, 0.0884147372279358, 11.999996638599285]], "r_squared_": 0.9733907759846079, "error_": 0.047654760791279616}
{"freq_range": [2.0, 80.0], "freq_res": 1.0, "aperiodic_params_": [0.2705166582580221, 1.0464635615681779], "gaussian_params_": [[9.880246124687336, 0.4179075406233586, 1.8221934449638608], [14.52563078423703, 0.3663541607162803, 3.382157256762048], [23.452042189219945, 0.16768413234349525, 4.047427723944879]], "peak_params_": [[9.880246124687336, 0.5673344308694609, 3.6443868899277216], [14.52563078423703, 0.38978615692579544, 6.764314513524096], [23.452042189219945, 0.18251358123365102, 8.094855447889758]], "r_squared_": 0.9863562700222285, "error_": 0.04513858370828191}
{"freq_range": [2.0, 80.0], "freq_res": 1.0, "aperiodic_params_": [0.2946620345301642, 1.0916352371899947], "gaussian_params_": [[9.803644328746056, 0.42633832594848026, 1.8598558195348653], [14.44988117367823, 0.3876548690172517, 3.3321679315851966], [23.452038080406773, 0.21826192319753446, 3.793091635314312], [79.11650285162824, 0.1738680350767123, 0.5745011794801508]], "peak_params_": [[9.803644328746056, 0.583298421021889, 3.7197116390697307], [14.44988117367823, 0.4273659012270701, 6.664335863170393], [23.452038080406773, 0.23113018927814566, 7.586183270628624], [79.11650285162824, 0.17032949821992638, 1.1490023589603016]], "r_squared_": 0.9874586548693074, "error_": 0.04527800730640524}
{"freq_range": [2.0, 80.0], "freq_res": 1.0, "aperiodic_params_": [0.27802741933145025, 1.0640469518045983], "gaussian_params_": [[9.273054713560564, 0.37416429089543357, 1.5160857966843782], [13.025857351889314, 0.36626968381122127, 2.702927744202], [20.78577167171765, 0.2758399733625209, 5.238809008328494], [73.432237007254, 0.15499573420956392, 0.9363435547837272]], "peak_params_": [[9.273054713560564, 0.510906573994761, 3.0321715933687563], [13.025857351889314, 0.47590474720012665, 5.405855488404], [20.78577167171765, 0.28032830255630126, 10.477618016656988], [73.432237007254, 0.13933067295146961, 1.8726871095674544]], "r_squared_": 0.9856398780668376, "error_": 0.04719672915140136}
{"freq_range": [2.0, 80.0], "freq_res": 1.0, "aperiodic_params_": [0.5115053412150421, 1.094033384062554], "gaussian_params_": [[9.00275659517197, 0.28123722991247957, 1.1122709275614742], [12.705137380973081, 0.28353205760512146, 2.2813729474676347], [20.131507084478365, 0.20729096026246893, 4.353682760978994]], "peak_params_": [[9.00275659517197, 0.36495636394720365, 2.2245418551229483], [12.705137380973081, 0.3358069892396196, 4.5627458949352695], [20.131507084478365, 0.20890400087436256, 8.707365521957987]], "r_squared_": 0.9771451189676205, "error_": 0.045640566453863066}
{"freq_range": [2.0, 80.0], "freq_res": 1.0, "aperiodic_params_": [0.4454750117576722, 1.1363572107006843], "gaussian_params_": [[9.744679044700895, 0.3651204852028469, 1.6135075253519282], [14.452034599138276, 0.2204300655277944, 2.593215300827049], [21.39824673539331, 0.1464756458174983, 5.382088616994167], [74.33883414745729, 0.1521481562785815, 0.9721440827486748]], "peak_params_": [[9.744679044700895, 0.42662655929972376, 3.2270150507038564], [14.452034599138276, 0.28532591489160786, 5.186430601654098], [21.39824673539331, 0.1551697356171009, 10.764177233988335], [74.33883414745729, 0.1431815777966312, 1.9442881654973496]], "r_squared_": 0.982546873705308, "error_": 0.04254231821318946}
{"freq_range": [2.0, 80.0], "freq_res": 1.0, "aperiodic_params_": [0.2348285195616701, 1.0642599685692147], "gaussian_params_": [[9.485828588996073, 0.435813618880457, 1.5124079778149593], [15.743539716154473, 0.2739827801336495, 4.658194755794306], [73.55058782078801, 0.2361370809117288, 1.228784717320552], [75.41467305419913, 0.23741132059047482, 0.3335100315196192]], "peak_params_": [[9.485828588996073, 0.5099791277958559, 3.0248159556299186], [15.743539716154473, 0.27360867626846774, 9.316389511588612], [73.55058782078801, 0.22088977207309024, 2.457569434641104], [75.41467305419913, 0.2273695699910736, 0.6670200630392384]], "r_squared_": 0.9759012780889115, "error_": 0.058579132563244596}
{"freq_range": [2.0, 80.0], "freq_res": 1.0, "aperiodic_params_": [0.1684861248656674, 0.9867636356413017], "gaussian_params_": [[7.633887304777213, 0.872364677726755, 0.31172829375353095], [9.44354637031055, 0.5451930441061652, 0.6153702620575565], [11.401317984413037, 0.31802870563724495, 0.8326105804274372], [13.512571174409533, 0.22349944131885913, 0.5930712546867117], [16.464642904256493, 0.34456056623012205, 0.30767896867813693], [18.807511608704324, 0.12950702205931017, 4.396032757585171], [72.42550993621605, 0.5780860503575858, 0.2724336119826281], [74.72513561343376, 0.1875178265068669, 0.9161633102613582]], "peak_params_": [[7.633887304777213, 0.47888372307952376, 0.6234565875070619], [9.44354637031055, 0.43625167742787535, 1.230740524115113], [11.401317984413037, 0.33218333434370195, 1.6652211608548744], [13.512571174409533, 0.23309774843905795, 1.1861425093734235], [16.464642904256493, 0.2158146506062928, 0.6153579373562739], [18.807511608704324, 0.12938293044989468, 8.792065515170343], [72.42550993621605, 0.17296041045606736, 0.5448672239652562], [74.72513561343376, 0.17926566629871332, 1.8323266205227164]], "r_squared_": 0.977718719915751, "error_": 0.04402474221012543}
{"freq_range": [2.0, 80.0], "freq_res": 1.0, "aperiodic_params_": [0.1590713382052909, 0.9591918007378648], "gaussian_params_": [[8.647701801191072, 0.3006755532850132, 1.1551731765700919], [11.993066028412414, 0.375193394455543, 2.2148049547564153], [18.362434055670725, 0.20637574140209128, 2.300906471786313], [22.349741337201362, 0.2216387338734203, 0.32731256859773616], [23.674998555970994, 0.36312435156406203, 0.26490594703629883], [27.78314383826989, 0.16396436310293486, 0.6495869274521802], [45.903914400879934, 0.13091004790539204, 0.4950246864016082], [67.18848750178198, 0.10126072407195007, 2.017283781681487], [72.19414909617294, 0.2586151599853615, 0.5714365442162591], [74.7276584433124, 0.1697078747172319, 0.6444339517425672], [78.99348617318552, 0.14693968593906756, 0.6583449462600316]], "peak_params_": [[8.647701801191072, 0.43761806288535043, 2.3103463531401838], [11.993066028412414, 0.3841633179877977, 4.4296099095128305], [18.362434055670725, 0.2133142697193171, 4.601812943572626], [22.349741337201362, 0.1843943818969811, 0.6546251371954723], [23.674998555970994, 0.18134356340625324, 0.5298118940725977], [27.78314383826989, 0.15510956902351758, 1.2991738549043603], [45.903914400879934, 0.1284670578673932, 0.9900493728032164], [67.18848750178198, 0.10081966717683577, 4.034567563362974], [72.19414909617294, 0.2500229942593448, 1.1428730884325182], [74.7276584433124, 0.15526792293158143, 1.2888679034851345], [78.99348617318552, 0.1469324973915469, 1.3166898925200632]], "r_squared_": 0.9828892815396028, "error_": 0.03645945338206203}
{"freq_range": [2.0, 80.0], "freq_res": 1.0, "aperiodic_params_": [0.27177085139735563, 1.0216914096382075], "gaussian_params_": [[9.796918175828207, 0.4373940302817019, 1.7403387456221504], [14.062480104879393, 0.3544350930722441, 2.402672861229211], [16.468433643483134, 0.29057578745619067, 0.25884237512836733], [19.22169954902147, 0.3172151656571844, 1.0151954098173823], [22.567257879404547, 0.20493079871927367, 1.1674140550044005], [27.600238270248546, 0.21254611190351888, 1.8987247419144009], [56.34685298635794, 0.43313585420692186, 0.25000000000000006]], "peak_params_": [[9.796918175828207, 0.5192939465171766, 3.480677491244301], [14.062480104879393, 0.37799262203203265, 4.805345722458422], [16.468433643483134, 0.3153819987805542, 0.5176847502567347], [19.22169954902147, 0.35457676691843343, 2.0303908196347646], [22.567257879404547, 0.20327915668998453, 2.334828110008801], [27.600238270248546, 0.2078911407928019, 3.7974494838288018], [56.34685298635794, 0.16543783032897075, 0.5000000000000001]], "r_squared_": 0.9841068447064065, "error_": 0.0432597686476575}
{"freq_range": [2.0, 80.0], "freq_res": 1.0, "aperiodic_params_": [0.3539288375126018, 1.1282463372431517], "gaussian_params_": [[9.563979783864138, 0.46163327366335466, 1.6175508055622945], [12.925635319799936, 0.3797086164291588, 2.0933545016421458], [19.154733490409114, 0.3185540383541101, 3.7596751200191814], [27.670806777106367, 0.1888023393548671, 1.7465076115806433], [79.17067278485348, 0.18358599193877306, 0.5299322735233178]], "peak_params_": [[9.563979783864138, 0.604586625399423, 3.235101611124589], [12.925635319799936, 0.5112435323453636, 4.1867090032842915], [19.154733490409114, 0.3239222949586613, 7.519350240038363], [27.670806777106367, 0.20548888691551137, 3.4930152231612865], [79.17067278485348, 0.17430735640975925, 1.0598645470466357]], "r_squared_": 0.9883097777033097, "error_": 0.04472762123524474}
{"freq_range": [2.0, 80.0], "freq_res": 1.0, "aperiodic_params_": [0.3473028208121681, 1.1397103198082403], "gaussian_params_": [[9.663139158895886, 0.43021773419642567, 1.7286655306368313], [13.532155504207298, 0.36788130764803334, 2.8668252247824677], [21.582299290294248, 0.272720909564004, 5.493498228250207], [79.02101963915685, 0.17492673549035284, 0.6462480742226636]], "peak_params_": [[9.663139158895886, 0.6238856391916193, 3.4573310612736625], [13.532155504207298, 0.4867128961205055, 5.733650449564935], [21.582299290294248, 0.2766239290233551, 10.986996456500414], [79.02101963915685, 0.17483423089081485, 1.2924961484453272]], "r_squared_": 0.9903587065908103, "error_": 0.042356709483075884}
{"freq_range": [2.0, 80.0], "freq_res": 1.0, "aperiodic_params_": [0.29088420693453015, 1.1069280514925846], "gaussian_params_": [[9.854647890274435, 0.46664507150275897, 1.8213398780654506], [14.760445174717463, 0.414593401015121, 3.3574755169029613], [23.723837897331695, 0.2970530828685467, 5.087104647804725]], "peak_params_": [[9.854647890274435, 0.6247016518053243, 3.6426797561309012], [14.760445174717463, 0.4904394799880296, 6.714951033805923], [23.723837897331695, 0.30601583280674416, 10.17420929560945]], "r_squared_": 0.9890022131361789, "error_": 0.04347829225633651}
{"freq_range": [2.0, 80.0], "freq_res": 1.0, "aperiodic_params_": [0.5274464396986952, 1.1814293806059109], "gaussian_params_": [[10.368669702478035, 0.3362642506693095, 2.0116356729618294], [16.87377601419778, 0.39490131482547947, 4.383714770967937], [26.494664054072782, 0.22268859757945397, 2.5435406513702885], [73.61550095561493, 0.1222327300286895, 1.6102374787947331]], "peak_params_": [[10.368669702478035, 0.44616585321796776, 4.023271345923659], [16.87377601419778, 0.3964163612586372, 8.767429541935874], [26.494664054072782, 0.26373929777899663, 5.087081302740577], [73.61550095561493, 0.11879721178375258, 3.2204749575894662]], "r_squared_": 0.9815221794569644, "error_": 0.048919648833900556}
{"freq_range": [2.0, 80.0], "freq_res": 1.0, "aperiodic_params_": [0.10705154363675388, 0.992923786527431], "gaussian_params_": [[8.518791843824754, 0.41148279139959115, 0.7796471235349299], [10.762397586169433, 0.3278146414000286, 1.5476349147016988], [14.43511016455652, 0.34256678980785615, 2.7645174961814925], [21.778566970587693, 0.20286425513467427, 4.571155805905673], [66.57273446868524, 0.35517888567080025, 0.28818016060604357], [69.55701651179217, 0.41635698084611367, 0.29401470289146775], [77.1461262006204, 0.12115533619193378, 5.999998949707401]], "peak_params_": [[8.518791843824754, 0.565195246138464, 1.5592942470698599], [10.762397586169433, 0.49745752271820526, 3.0952698294033976], [14.43511016455652, 0.4227946529836051, 5.529034992362985], [21.778566970587693, 0.21073121141920503, 9.142311611811346], [66.57273446868524, 0.1473351596895438, 0.5763603212120871], [69.55701651179217, 0.1934315210251134, 0.5880294057829355], [77.1461262006204, 0.12111941076066213, 11.999997899414803]], "r_squared_": 0.9836838912732488, "error_": 0.039701549121261295}
{"freq_range": [2.0, 80.0], "freq_res": 1.0, "aperiodic_params_": [-0.02386657860261649, 0.7732931318958995], "gaussian_params_": [[8.790493266219885, 0.4299294570740352, 0.8418853391927558], [12.993348980453042, 0.363971681222295, 3.2766442041575097], [60.452034602033265, 0.12958256074333468, 5.999999999999999], [70.14148594005238, 0.18675306333493125, 0.9967349731119856], [73.50396361983833, 0.5851876088940985, 0.2749564342143709], [77.54262311169066, 0.21423325467836415, 5.5025881475320135]], "peak_params_": [[8.790493266219885, 0.5900168707186886, 1.6837706783855115], [12.993348980453042, 0.3639725328422835, 6.553288408315019], [60.452034602033265, 0.13054532657718654, 11.999999999999998], [70.14148594005238, 0.30514205472137457, 1.9934699462239711], [73.50396361983833, 0.29932730199872415, 0.5499128684287418], [77.54262311169066, 0.21529394365614318, 11.005176295064027]], "r_squared_": 0.9613595295611946, "error_": 0.04884691718918164}
{"freq_range": [2.0, 80.0], "freq_res": 1.0, "aperiodic_params_": [-0.04642437027476552, 0.8674791930591244], "gaussian_params_": [[10.195674644899999, 0.47479457706174016, 2.0608467358466256], [17.005613383033946, 0.20414445303757567, 3.5561250659422323], [72.4280217664465, 0.7162568964084646, 0.25989093990993767]], "peak_params_": [[10.195674644899999, 0.5019816000970246, 4.121693471693251], [17.005613383033946, 0.20618272356354672, 7.112250131884465], [72.4280217664465, 0.1845374346293578, 0.5197818798198753]], "r_squared_": 0.9653370227106886, "error_": 0.05717879344396549}
{"freq_range": [2.0, 80.0], "freq_res": 1.0, "aperiodic_params_": [-0.04774520769524522, 0.7846277429544243], "gaussian_params_": [[9.318887701233805, 0.3529053411554006, 1.430978763366133], [12.949280454483263, 0.34017160002996427, 2.0962025454193816], [19.549253507296005, 0.33678613163658655, 1.9907608722447327], [28.584412852600842, 0.24048984478811272, 1.4362685329548426], [38.30746534327967, 0.27894916460701363, 0.29413269390655084], [72.44432102276338, 0.5299019362714175, 0.27990880171250054]], "peak_params_": [[9.318887701233805, 0.40191814900228945, 2.861957526732266], [12.949280454483263, 0.3544788973536924, 4.192405090838763], [19.549253507296005, 0.3294515137416678, 3.9815217444894655], [28.584412852600842, 0.23063450439085265, 2.872537065909685], [38.30746534327967, 0.1615271962470437, 0.5882653878131017], [72.44432102276338, 0.1503262294893879, 0.5598176034250011]], "r_squared_": 0.9731447895487826, "error_": 0.044749798699917694}
{"freq_range": [2.0, 80.0], "freq_res": 1.0, "aperiodic_params_": [0.24527393399573788, 1.0580290068384304], "gaussian_params_": [[9.70844857858547, 0.4704434259320807, 1.7265471206655114], [14.037299617135613, 0.4629907250731519, 2.6153282676369316], [19.2887756888752, 0.5481236389721399, 0.9440571711905857], [21.524618989248754, 0.6898985103784621, 0.3582131276725325], [23.53347279685751, 0.26065890957075155, 0.58599166245705], [28.48664669030051, 0.4748924956460551, 2.632164196451806]], "peak_params_": [[9.70844857858547, 0.6044220473732936, 3.453094241331023], [14.037299617135613, 0.4843677252123261, 5.230656535273863], [19.2887756888752, 0.6002949737044079, 1.8881143423811715], [21.524618989248754, 0.3306418278682486, 0.716426255345065], [23.53347279685751, 0.30128229718719224, 1.1719833249141], [28.48664669030051, 0.46684529680556586, 5.264328392903612]], "r_squared_": 0.9878758872066643, "error_": 0.042335716519610635}
{"freq_range": [2.0, 80.0], "freq_res": 1.0, "aperiodic_params_": [0.3301413006436644, 1.11255277355041], "gaussian_params_": [[10.774266118791477, 0.5820664042792619, 2.373213884727251], [18.709749325227158, 0.417876998293648, 4.171770518566578], [26.8873445028014, 0.13904617142441125, 0.6440718987081097], [29.609340985048593, 0.2625277197024546, 2.309134485227378], [79.14305157160024, 0.1760826956802012, 0.6870309035385873]], "peak_params_": [[10.774266118791477, 0.6551935294842111, 4.746427769454502], [18.709749325227158, 0.4183066358156444, 8.343541037133155], [26.8873445028014, 0.3335899038665282, 1.2881437974162193], [29.609340985048593, 0.2695285543033241, 4.618268970454756], [79.14305157160024, 0.1723067932101663, 1.3740618070771746]], "r_squared_": 0.9886338755393322, "error_": 0.0444234190237866}
{"freq_range": [2.0, 80.0], "freq_res": 1.0, "aperiodic_params_": [0.33174920221368476, 1.1271590924464021], "gaussian_params_": [[10.70866043950109, 0.4884360386990983, 2.248160522508411], [18.84133196236861, 0.4411538977216588, 5.999999999999999]], "peak_params_": [[10.70866043950109, 0.6721588984760195, 4.496321045016822], [18.84133196236861, 0.4415432029482075, 11.999999999999998]], "r_squared_": 0.9848886961738724, "error_": 0.05513705947725088}
{"freq_range": [2.0, 80.0], "freq_res": 1.0, "aperiodic_params_": [0.2955992048162583, 1.0786273272746363], "gaussian_params_": [[10.384605663889515, 0.5053805123235747, 2.063158284340055], [17.96851523672057, 0.5733081240360844, 4.397964626182478], [28.257504587279957, 0.23656506198682622, 2.8012630721719214]], "peak_params_": [[10.384605663889515, 0.6077269850381251, 4.12631656868011], [17.96851523672057, 0.57413944393701, 8.795929252364957], [28.257504587279957, 0.2780923315553817, 5.602526144343843]], "r_squared_": 0.9895802294553039, "error_": 0.04445659977946785}
{"freq_range": [2.0, 80.0], "freq_res": 1.0, "aperiodic_params_": [0.37288750036613166, 1.1134977148076073], "gaussian_params_": [[10.64805914159959, 0.4205300632727132, 1.9297213501484938], [18.405549945789584, 0.64440840174095, 4.246984882441097], [28.493977471528925, 0.2784111076969419, 2.5371547128793392]], "peak_params_": [[10.64805914159959, 0.5544945412513886, 3.8594427002969875], [18.405549945789584, 0.6418271570124092, 8.493969764882195], [28.493977471528925, 0.3234092938602535, 5.0743094257586785]], "r_squared_": 0.9859128702529323, "error_": 0.05177000910025681}
{"freq_range": [2.0, 80.0], "freq_res": 1.0, "aperiodic_params_": [-0.08268367360894208, 0.8359819497107016], "gaussian_params_": [[15.454119863997837, 0.555665646641516, 5.795120479678963], [29.02616453822069, 0.1656240711887154, 0.9092286157413577], [69.50828402253747, 0.8417756932522373, 0.2797489990635806]], "peak_params_": [[15.454119863997837, 0.5539621822206217, 11.590240959357926], [29.02616453822069, 0.20172803752279855, 1.8184572314827154], [69.50828402253747, 0.17960349873480896, 0.5594979981271612]], "r_squared_": 0.9725396159572324, "error_": 0.05197407235615935}
{"freq_range": [2.0, 80.0], "freq_res": 1.0, "aperiodic_params_": [-0.36314751414421625, 0.39509057770569705], "gaussian_params_": [[8.599915057291708, 0.42613547456540035, 0.6557342542234854], [10.716263669852752, 0.2711529239442803, 1.22760471160551], [14.43204304028185, 0.29253470364334144, 2.953128751850941], [48.37732749769176, 0.3711211707516807, 0.3074791400975435], [58.22809812486218, 0.14515237473517711, 4.243195884275667], [63.44859834048719, 0.15773373399102691, 0.5854225695238009], [71.50646644665372, 0.24521965020313533, 3.1055402023866505], [76.44275987732819, 0.6590676541869694, 0.28527298881990704], [78.90553996172524, 0.25883416498747663, 0.785732271001147]], "peak_params_": [[8.599915057291708, 0.509691072802853, 1.3114685084469708], [10.716263669852752, 0.41342957440924566, 2.45520942321102], [14.43204304028185, 0.2969976145078532, 5.906257503701882], [48.37732749769176, 0.1827314288087606, 0.614958280195087], [58.22809812486218, 0.1449619514549393, 8.486391768551334], [63.44859834048719, 0.20048641133072653, 1.1708451390476018], [71.50646644665372, 0.2428912999006152, 6.211080404773301], [76.44275987732819, 0.28401321093602117, 0.5705459776398141], [78.90553996172524, 0.2703141672433418, 1.571464542002294]], "r_squared_": 0.928755106895479, "error_": 0.0423052618833949}
{"freq_range": [2.0, 80.0], "freq_res": 1.0, "aperiodic_params_": [-0.10827099020115774, 0.8743097924647107], "gaussian_params_": [[11.451170478692752, 0.5697951297499061, 2.532071981110025], [19.17571344536141, 0.3346724946145772, 2.0949584153402427]], "peak_params_": [[11.451170478692752, 0.5609863410202396, 5.06414396222005], [19.17571344536141, 0.34019159040186, 4.1899168306804855]], "r_squared_": 0.9659874952298815, "error_": 0.05950107603382724}
{"freq_range": [2.0, 80.0], "freq_res": 1.0, "aperiodic_params_": [0.02538368186486578, 0.8259015971486723], "gaussian_params_": [[10.097017965241124, 0.4930982770346518, 1.5139609335196718], [14.046063916806157, 0.374031220188295, 1.418500277674357], [18.603981919888806, 0.6009080981991908, 0.260868517297468], [19.88727126746112, 0.49370770514281925, 2.1892127258774683], [28.920440151724986, 0.2949718825884413, 1.443384524530916]], "peak_params_": [[10.097017965241124, 0.49850575126252866, 3.0279218670393435], [14.046063916806157, 0.4048835907403785, 2.837000555348714], [18.603981919888806, 0.6454567583056813, 0.521737034594936], [19.88727126746112, 0.4931098501032829, 4.378425451754937], [28.920440151724986, 0.2946094295124049, 2.886769049061832]], "r_squared_": 0.977447857556646, "error_": 0.04711401014343256}
{"freq_range": [2.0, 80.0], "freq_res": 1.0, "aperiodic_params_": [0.24042961629678802, 1.0480951259539986], "gaussian_params_": [[10.193289110328742, 0.6769980801633672, 1.7512209408042252], [14.21712263721628, 0.5213473406704716, 1.3264005047947227], [19.626644655725055, 0.7551592544600305, 2.2402376297078255], [28.52990847062362, 0.4400411510786332, 3.5553675450586777]], "peak_params_": [[10.193289110328742, 0.676288738002375, 3.5024418816084504], [14.21712263721628, 0.6104966470538383, 2.6528010095894454], [19.626644655725055, 0.769534607557138, 4.480475259415651], [28.52990847062362, 0.4363307405509258, 7.110735090117355]], "r_squared_": 0.9880211177094689, "error_": 0.047370913926838364}
{"freq_range": [2.0, 80.0], "freq_res": 1.0, "aperiodic_params_": [0.3537623825531693, 1.1146044487698783], "gaussian_params_": [[11.025752089488508, 0.6096869016656281, 2.4839326051086403], [19.12950643720585, 0.5374426047348023, 3.6252931928434386], [29.676105354385403, 0.2775368430609459, 3.7202578797866357]], "peak_params_": [[11.025752089488508, 0.6531459378355304, 4.967865210217281], [19.12950643720585, 0.5451436634944805, 7.250586385686877], [29.676105354385403, 0.28248409919829354, 7.440515759573271]], "r_squared_": 0.9852835521435721, "error_": 0.050778623031960915}
{"freq_range": [2.0, 80.0], "freq_res": 1.0, "aperiodic_params_": [0.3226387892514969, 1.1207645762661205], "gaussian_params_": [[10.571571271144574, 0.5726632211535277, 2.2248582221587783], [18.44550220724961, 0.5670985544599181, 4.4249516520107495], [30.277870512494424, 0.19731539457791658, 2.464933031943162]], "peak_params_": [[10.571571271144574, 0.6998235135305498, 4.4497164443175565], [18.44550220724961, 0.5664060985246222, 8.849903304021499], [30.277870512494424, 0.21481786298679872, 4.929866063886324]], "r_squared_": 0.9878827359198181, "error_": 0.04971886311305002}
{"freq_range": [2.0, 80.0], "freq_res": 1.0, "aperiodic_params_": [0.2928307468773449, 1.0908268212514154], "gaussian_params_": [[10.542658830655176, 0.5448466905046048, 2.124195070331435], [18.30153965014889, 0.6847035372320266, 4.332145605152806], [29.628286538030448, 0.19788592221442652, 3.375052318178498], [78.68049686702615, 0.2583299782267897, 0.3339331716364169]], "peak_params_": [[10.542658830655176, 0.6978098257368102, 4.24839014066287], [18.30153965014889, 0.6847183097587572, 8.664291210305612], [29.628286538030448, 0.21455623619903674, 6.750104636356996], [78.68049686702615, 0.1634515234972167, 0.6678663432728338]], "r_squared_": 0.9885372780955884, "error_": 0.04602547181143995}
{"freq_range": [2.0, 80.0], "freq_res": 1.0, "aperiodic_params_": [0.293118597686148, 1.0638983461548384], "gaussian_params_": [[10.547208377221374, 0.5322628622353675, 2.0951069479599496], [18.38447309600302, 0.7793769407407956, 4.216253471095405], [29.750992565594572, 0.25096304492171845, 3.2788207205292847]], "peak_params_": [[10.547208377221374, 0.6881072537564202, 4.190213895919899], [18.38447309600302, 0.7775025131520349, 8.43250694219081], [29.750992565594572, 0.26776568800264533, 6.5576414410585695]], "r_squared_": 0.9880301976192851, "error_": 0.04871962782531485}
{"freq_range": [2.0, 80.0], "freq_res": 1.0, "aperiodic_params_": [0.10197701010531458, 0.9373849613601266], "gaussian_params_": [[15.689240707957628, 0.6128529345895188, 5.505402237550543], [23.354735082697285, 0.46775361022861717, 0.2602698352009226]], "peak_params_": [[15.689240707957628, 0.6118773823684734, 11.010804475101086], [23.354735082697285, 0.43854339703681966, 0.5205396704018452]], "r_squared_": 0.9756631185340822, "error_": 0.0584717087330549}
{"freq_range": [2.0, 80.0], "freq_res": 1.0, "aperiodic_params_": [-0.2303953799877315, 0.7480604593456792], "gaussian_params_": [[8.720294334527754, 0.4025544677504092, 0.9569102829637306], [12.130282747840557, 0.6066125142107142, 2.384043954160546], [17.356177626958292, 0.35217991407701676, 1.9998686966926333], [20.529503212773076, 0.5401832645048698, 0.2917622682722728], [22.92127326758045, 0.37579257019845286, 0.8575413779088936], [66.95149404674271, 0.06350101687867515, 0.2500000019175964], [72.54796540086404, 0.2108911405348701, 5.999999999999999]], "peak_params_": [[8.720294334527754, 0.6419583573677741, 1.9138205659274612], [12.130282747840557, 0.616592947544985, 4.768087908321092], [17.356177626958292, 0.4219567774789512, 3.9997373933852667], [20.529503212773076, 0.24529604428544705, 0.5835245365445456], [22.92127326758045, 0.3807976592414659, 1.7150827558177872], [66.95149404674271, 0.19984709319186234, 0.5000000038351928], [72.54796540086404, 0.21029348206592346, 11.999999999999998]], "r_squared_": 0.9776845458552044, "error_": 0.044184772055592035}
{"freq_range": [2.0, 80.0], "freq_res": 1.0, "aperiodic_params_": [-0.043489080840820336, 0.8573711774225236], "gaussian_params_": [[9.722515275842204, 0.406358120532524, 1.335704204863605], [13.224530797599321, 0.4889251990710528, 2.0211935312265914], [19.37732018255645, 0.32379202842057525, 1.978113162107968], [75.45203461528446, 0.15184826007427213, 5.999999999999999]], "peak_params_": [[9.722515275842204, 0.5346385898868442, 2.67140840972721], [13.224530797599321, 0.5077305953974182, 4.042387062453183], [19.37732018255645, 0.32620040910843195, 3.956226324215936], [75.45203461528446, 0.151417927131537, 11.999999999999998]], "r_squared_": 0.9629705956412954, "error_": 0.05917322519902395}
{"freq_range": [2.0, 80.0], "freq_res": 1.0, "aperiodic_params_": [0.07633958847067257, 0.9720283164135308], "gaussian_params_": [[9.964671349378994, 0.6255016029473294, 1.4674822555106475], [13.924901065312858, 0.5410740788215026, 1.389993853554462], [19.39492839691819, 0.5866974112032205, 2.3375732903843836], [29.170306617552544, 0.19425482616553083, 4.682124207645228]], "peak_params_": [[9.964671349378994, 0.6355910538251923, 2.934964511021295], [13.924901065312858, 0.5964753184307755, 2.779987707108924], [19.39492839691819, 0.5974306007446917, 4.675146580768767], [29.170306617552544, 0.19425287808525238, 9.364248415290456]], "r_squared_": 0.9798423124164437, "error_": 0.05604257404698817}
{"freq_range": [2.0, 80.0], "freq_res": 1.0, "aperiodic_params_": [0.27783888269995943, 1.090585397918642], "gaussian_params_": [[9.960410160702397, 0.6895644537353544, 1.5438237572740834], [13.975177887923952, 0.5782042807985868, 1.2861483671055152], [19.327137778891434, 0.65023988960842, 2.5425515638383356], [29.342893149407264, 0.2888556181170333, 4.950289602025346]], "peak_params_": [[9.960410160702397, 0.6951273685568495, 3.0876475145481668], [13.975177887923952, 0.6753644031751714, 2.5722967342110303], [19.327137778891434, 0.6777249848624044, 5.085103127676671], [29.342893149407264, 0.2886314573914981, 9.900579204050691]], "r_squared_": 0.9839673713049463, "error_": 0.054515698341299566}
{"freq_range": [2.0, 80.0], "freq_res": 1.0, "aperiodic_params_": [0.2704951145175991, 1.111793754274884], "gaussian_params_": [[10.475731774294422, 0.5364687323187388, 2.137884605784503], [17.874833874097522, 0.5880765820315313, 4.486049430897116], [30.62389362600763, 0.18551062561366596, 3.286577481598385]], "peak_params_": [[10.475731774294422, 0.6493309318496208, 4.275769211569006], [17.874833874097522, 0.5890596997704275, 8.972098861794231], [30.62389362600763, 0.19243980851219966, 6.57315496319677]], "r_squared_": 0.9855081434476631, "error_": 0.05249224759007075}
{"freq_range": [2.0, 80.0], "freq_res": 1.0, "aperiodic_params_": [0.2513460499501521, 1.0824579641484882], "gaussian_params_": [[10.530885239749837, 0.5189015312137346, 2.1504960069812116], [17.931614601069835, 0.62326361111593, 4.511858586341091], [30.531754570341175, 0.18069476329335743, 2.8497557928326125]], "peak_params_": [[10.530885239749837, 0.6981927742130809, 4.300992013962423], [17.931614601069835, 0.6244496931127715, 9.023717172682183], [30.531754570341175, 0.18766763459797708, 5.699511585665225]], "r_squared_": 0.9865814614690216, "error_": 0.049949989478586115}
{"freq_range": [2.0, 80.0], "freq_res": 1.0, "aperiodic_params_": [0.22565277479079235, 1.0581498391185151], "gaussian_params_": [[10.425984944621165, 0.4981792987919339, 2.002969993688851], [16.791819020417986, 0.662916975325521, 3.9654707475228683], [21.34390364821271, 0.11601746484787465, 0.3234544761753889], [22.639449755710174, 0.4200449515778122, 0.3067618687906845], [28.700416089908, 0.1785814770687275, 4.193369149875028]], "peak_params_": [[10.425984944621165, 0.6399670906067361, 4.005939987377702], [16.791819020417986, 0.667926871600037, 7.930941495045737], [21.34390364821271, 0.4765079650756694, 0.6469089523507778], [22.639449755710174, 0.476062305735131, 0.613523737581369], [28.700416089908, 0.18392538216013543, 8.386738299750055]], "r_squared_": 0.9912539515985129, "error_": 0.04000523461985652}
{"freq_range": [2.0, 80.0], "freq_res": 1.0, "aperiodic_params_": [0.14435990542035493, 0.9540227727016178], "gaussian_params_": [[14.868451462319097, 0.6604281587838186, 5.087776376187624], [22.915015919272793, 0.22171323432587245, 0.5619943764074723]], "peak_params_": [[14.868451462319097, 0.6602074401368926, 10.175552752375248], [22.915015919272793, 0.40333037294584617, 1.1239887528149446]], "r_squared_": 0.973720547506622, "error_": 0.060922414679328143}
{"freq_range": [2.0, 80.0], "freq_res": 1.0, "aperiodic_params_": [0.20533729192221448, 1.0484536716965767], "gaussian_params_": [[10.277853127171129, 0.37515595493145193, 1.7668337014443865], [15.671931659577574, 0.4974349486730294, 3.9177774920768473], [28.452034610525875, 0.12945069771184595, 5.926055757687088], [43.06026659742343, 0.15864999766790508, 0.8857917794436143]], "peak_params_": [[10.277853127171129, 0.5459848494509971, 3.533667402888773], [15.671931659577574, 0.511908675321598, 7.835554984153695], [28.452034610525875, 0.1325951503772005, 11.852111515374176], [43.06026659742343, 0.1646430143850146, 1.7715835588872286]], "r_squared_": 0.9884892461253246, "error_": 0.041236639521760196}
{"freq_range": [2.0, 80.0], "freq_res": 1.0, "aperiodic_params_": [-0.3586727555000599, 0.6917771635291329], "gaussian_params_": [[9.490114485079728, 0.38419358142421256, 1.256757258985079], [12.849090304969401, 0.48508236554457346, 2.2333237310953606], [19.90417898462742, 0.13708547618517045, 1.720188672720034], [53.73592509335416, 0.269606696169009, 0.2503103055031305], [79.99999999999999, 0.18557151229641647, 4.214418149235977]], "peak_params_": [[9.490114485079728, 0.4659124445774451, 2.513514517970158], [12.849090304969401, 0.49179735950588865, 4.466647462190721], [19.90417898462742, 0.13975411980355035, 3.440377345440068], [53.73592509335416, 0.15454141440478586, 0.500620611006261], [79.99999999999999, 0.18557151229641655, 8.428836298471953]], "r_squared_": 0.9685885379395093, "error_": 0.04695153956661089}
{"freq_range": [2.0, 80.0], "freq_res": 1.0, "aperiodic_params_": [0.23293088682879198, 1.0079459090875458], "gaussian_params_": [[8.434244697586609, 0.5675099091844154, 0.2955202192384212], [10.243377210602782, 0.5250752945232656, 1.0773970350522557], [13.450754292687714, 0.5117788155049501, 1.4346867384565514], [19.199470163708423, 0.33451158281185533, 2.9258591370225693], [26.988899961797905, 0.1222983055349313, 0.25002024258649225], [29.460299924520164, 0.1977064756633984, 0.9007103158691255], [69.32234741941072, 0.34912798244087, 0.2606468281694305], [71.79552321647093, 0.21507879668876626, 0.6769944144533677], [78.94691969367163, 0.18816341436679493, 0.7294200298065072]], "peak_params_": [[8.434244697586609, 0.2534785883971159, 0.5910404384768424], [10.243377210602782, 0.5426043394520146, 2.1547940701045114], [13.450754292687714, 0.542467364550312, 2.8693734769131027], [19.199470163708423, 0.33402377585449816, 5.851718274045139], [26.988899961797905, 0.13648948606655087, 0.5000404851729845], [29.460299924520164, 0.17472891606910257, 1.801420631738251], [69.32234741941072, 0.1625460811581565, 0.521293656338861], [71.79552321647093, 0.20548880192224317, 1.3539888289067354], [78.94691969367163, 0.18766585852447726, 1.4588400596130144]], "r_squared_": 0.9862237764542037, "error_": 0.038062773808078924}
{"freq_range": [2.0, 80.0], "freq_res": 1.0, "aperiodic_params_": [0.3138493554829495, 1.0665142968097718], "gaussian_params_": [[9.748814721165948, 0.6114637412242063, 1.210954333803561], [13.508827427251406, 0.46495436513689103, 1.5215247695274203], [19.029135566099196, 0.46818271257938326, 3.825104795289043], [26.71954700787779, 0.3061805044606083, 0.2775670859672157], [29.437314634058573, 0.40612722446510163, 0.31909889093566735], [30.567745359988017, 0.16969291514060802, 1.326974820711429], [35.18749588260256, 0.15689449523032284, 1.6200184450433457], [72.36209183812961, 0.40840074070176413, 0.2588726406398021]], "peak_params_": [[9.748814721165948, 0.659874121791978, 2.421908667607122], [13.508827427251406, 0.6399019039815036, 3.0430495390548407], [19.029135566099196, 0.4688595364379684, 7.650209590578086], [26.71954700787779, 0.24174143405524473, 0.5551341719344314], [29.437314634058573, 0.2590045958052267, 0.6381977818713347], [30.567745359988017, 0.16997966364410377, 2.653949641422858], [35.18749588260256, 0.1565652539507698, 3.2400368900866914], [72.36209183812961, 0.15355088119876936, 0.5177452812796042]], "r_squared_": 0.9907444670804411, "error_": 0.03668703053725238}
{"freq_range": [2.0, 80.0], "freq_res": 1.0, "aperiodic_params_": [0.3151683901106873, 1.130472777289101], "gaussian_params_": [[9.490098594414276, 0.584373472227969, 1.1004906700081036], [14.058308342151236, 0.6371936665577672, 2.414727677446888], [18.960777422820104, 0.44719422062422026, 1.155165013291748], [21.415919228197403, 0.4218971618099547, 0.32365431939482897], [23.23306632217869, 0.30250474121889775, 1.428453322043105], [26.978649459843773, 0.20136665487041602, 0.2509794696803516], [30.31481258397382, 0.22518459989596834, 1.76013477540275], [35.64630424678487, 0.15666994745244942, 1.570734394343616]], "peak_params_": [[9.490098594414276, 0.6002292018359017, 2.2009813400162073], [14.058308342151236, 0.6371839527430153, 4.829455354893776], [18.960777422820104, 0.5291795270903035, 2.310330026583496], [21.415919228197403, 0.37826954572980265, 0.6473086387896579], [23.23306632217869, 0.30020830972921286, 2.85690664408621], [26.978649459843773, 0.24821429689562713, 0.5019589393607032], [30.31481258397382, 0.22186042813576012, 3.5202695508055], [35.64630424678487, 0.15396995426746596, 3.141468788687232]], "r_squared_": 0.9876354073240611, "error_": 0.04129238553923687}
{"freq_range": [2.0, 80.0], "freq_res": 1.0, "aperiodic_params_": [0.238232554835707, 1.1214207835791157], "gaussian_params_": [[9.517641623874017, 0.5876504733599079, 1.2039962701600344], [13.497280960366401, 0.6303355936637945, 2.1636732877908726], [18.615001216221305, 0.4507966256876254, 2.1371151234420083], [22.660890868979674, 0.1888880411768999, 1.0177828296290048], [29.264518058154742, 0.16813484967373202, 5.999951798069216]], "peak_params_": [[9.517641623874017, 0.7141420226275804, 2.407992540320069], [13.497280960366401, 0.641425030409198, 4.327346575581745], [18.615001216221305, 0.5075843058694995, 4.2742302468840165], [22.660890868979674, 0.3311425796893839, 2.0355656592580096], [29.264518058154742, 0.16797489378616515, 11.999903596138433]], "r_squared_": 0.9911984034597398, "error_": 0.03774565869102467}
{"freq_range": [2.0, 80.0], "freq_res": 1.0, "aperiodic_params_": [0.21721466633471165, 1.0733280591135623], "gaussian_params_": [[9.471010299306132, 0.4545131353153339, 1.1559013783918335], [12.601505158626424, 0.3023670561170139, 2.0782034319190337], [17.10429285370096, 0.4321728461114773, 3.613642109241818], [22.70077762467365, 0.251860327135592, 0.2700231615049069], [52.572902872208005, 0.30985482329961833, 0.2958024233470713]], "peak_params_": [[9.471010299306132, 0.5206127740885781, 2.311802756783667], [12.601505158626424, 0.5279057824657143, 4.156406863838067], [17.10429285370096, 0.46419006963094245, 7.227284218483636], [22.70077762467365, 0.2505006274396142, 0.5400463230098138], [52.572902872208005, 0.10926092216652927, 0.5916048466941426]], "r_squared_": 0.9938423192155169, "error_": 0.03283041847390893}
{"freq_range": [2.0, 80.0], "freq_res": 1.0, "aperiodic_params_": [-0.2531827951048339, 1.0810040022737513], "gaussian_params_": [[9.487824840789774, 0.4644416608980542, 1.212904800537443], [14.573249297125455, 0.5204941260029445, 3.582613241152228], [24.133302833711177, 0.146902669395854, 5.999999999999999]], "peak_params_": [[9.487824840789774, 0.5896697197726462, 2.425809601074886], [14.573249297125455, 0.5629475260216104, 7.165226482304456], [24.133302833711177, 0.16319701750940996, 11.999999999999998]], "r_squared_": 0.9864401309071826, "error_": 0.04758750771695535}
{"freq_range": [2.0, 80.0], "freq_res": 1.0, "aperiodic_params_": [0.04643835837917165, 0.8480754365797771], "gaussian_params_": [[9.505522977661434, 0.46284772885506664, 1.134007216243045], [13.343019302458384, 0.5856222642974841, 2.0633847300412453], [17.51733005314026, 0.2678133034310716, 0.3331988059623139], [20.14533012522623, 0.25997549584611224, 2.281690851614555], [72.98607973256038, 0.16878255361406488, 5.999999999960357]], "peak_params_": [[9.505522977661434, 0.5785099541787503, 2.26801443248609], [13.343019302458384, 0.5835278217268598, 4.126769460082491], [17.51733005314026, 0.30675368796318847, 0.6663976119246278], [20.14533012522623, 0.26266536863988255, 4.56338170322911], [72.98607973256038, 0.16878209936961386, 11.999999999920714]], "r_squared_": 0.9675209406244099, "error_": 0.05255987399452208}
{"freq_range": [2.0, 80.0], "freq_res": 1.0, "aperiodic_params_": [0.09420444577538198, 1.0817378708591918], "gaussian_params_": [[9.375949860389632, 0.6297490898752133, 1.0359730553814874], [12.97775829644348, 0.5088214375125965, 2.102492344895495], [18.662211946952713, 0.37993432893240675, 3.1693673316461375], [31.21294901750816, 0.13210148750118814, 5.92823452264923]], "peak_params_": [[9.375949860389632, 0.6783588209531697, 2.071946110762975], [12.97775829644348, 0.5883826962265817, 4.20498468979099], [18.662211946952713, 0.40202005692494014, 6.338734663292275], [31.21294901750816, 0.1322108429545248, 11.85646904529846]], "r_squared_": 0.9874294759826562, "error_": 0.045544076940613534}
{"freq_range": [2.0, 80.0], "freq_res": 1.0, "aperiodic_params_": [0.07069966151707649, 1.0793502784503028], "gaussian_params_": [[9.389752149582065, 0.6910932653908933, 1.0177739196055775], [12.303982854582529, 0.368348467406684, 1.713822221731753], [16.452035205092375, 0.4569408362832898, 2.625795731335077], [19.411106524302287, 0.34426752505272523, 0.29712456798039544], [22.35224107580181, 0.20244298947369818, 1.188726447372132], [29.653931730304546, 0.09749172323444225, 5.999946494390351]], "peak_params_": [[9.389752149582065, 0.7080782187813023, 2.035547839211155], [12.303982854582529, 0.4982112959747723, 3.427644443463506], [16.452035205092375, 0.49354076820850157, 5.251591462670154], [19.411106524302287, 0.44167515268457147, 0.5942491359607909], [22.35224107580181, 0.28598961450879545, 2.377452894744264], [29.653931730304546, 0.0973304468305638, 11.999892988780703]], "r_squared_": 0.9896912400466569, "error_": 0.04159187494596099}
{"freq_range": [2.0, 80.0], "freq_res": 1.0, "aperiodic_params_": [-0.9585667266078853, 0.9809703463045063], "gaussian_params_": [[10.044375942690435, 0.5708752694678334, 1.8959358437664973], [14.833090484918614, 0.43459837720765565, 3.5040282075390947]], "peak_params_": [[10.044375942690435, 0.7385896520360529, 3.7918716875329945], [14.833090484918614, 0.4528549500296899, 7.008056415078189]], "r_squared_": 0.9861195046126208, "error_": 0.04657681087277691}
{"freq_range": [2.0, 80.0], "freq_res": 1.0, "aperiodic_params_": [-0.37838270314477185, 1.011193556385799], "gaussian_params_": [[8.462861899101826, 0.42586098464868416, 0.6489951436953107], [11.298328818514554, 0.4184797985765795, 1.9357742522278918], [17.32995449211896, 0.28438511420470014, 4.464237747845913]], "peak_params_": [[8.462861899101826, 0.46025677446430213, 1.2979902873906215], [11.298328818514554, 0.5178150447947657, 3.8715485044557836], [17.32995449211896, 0.2890771982774698, 8.928475495691826]], "r_squared_": 0.9834562606540648, "error_": 0.049283668961575655}
{"freq_range": [2.0, 80.0], "freq_res": 1.0, "aperiodic_params_": [-0.45989923258479365, 0.9394342693936553], "gaussian_params_": [[8.633716338120337, 0.38576424907941403, 1.076222143651656], [11.870482390061985, 0.3562891664604397, 2.022292507914576], [16.42815723682783, 0.4159359814981694, 0.2616508775994922], [19.205083263270797, 0.1882230820766952, 4.241424466313157], [23.598182836774136, 0.2762220150694227, 0.2625140708749891]], "peak_params_": [[8.633716338120337, 0.5045783616026702, 2.152444287303312], [11.870482390061985, 0.4029233860518209, 4.044585015829152], [16.42815723682783, 0.2948048500705367, 0.5233017551989844], [19.205083263270797, 0.18871587621296593, 8.482848932626315], [23.598182836774136, 0.18495318271439243, 0.5250281417499782]], "r_squared_": 0.9814786330977746, "error_": 0.04221550186608373}
{"freq_range": [2.0, 80.0], "freq_res": 1.0, "aperiodic_params_": [-0.27279505992064623, 1.0039116629387468], "gaussian_params_": [[10.09888168151458, 0.4871035072886051, 2.091890510563028], [16.80871636320967, 0.28934247271309393, 4.6207114303094565], [72.20523122406972, 0.16845881258809675, 5.999999999999996]], "peak_params_": [[10.09888168151458, 0.5842671566338047, 4.183781021126056], [16.80871636320967, 0.29120493486724297, 9.241422860618913], [72.20523122406972, 0.16836029334080105, 11.999999999999991]], "r_squared_": 0.9782471663794826, "error_": 0.050469344907479424}
