{"freq_range": [2.0, 80.0], "freq_res": 1.0, "aperiodic_params_": [0.3578446669228959, 0.675795308040488], "gaussian_params_": [[6.450602134147395, 0.2444958432659067, 1.3055264813706904], [22.224452639224527, 0.4021641060565327, 2.943134442445088], [26.536703898603456, 0.6489201855599862, 0.2597468175792334], [44.46452226582676, 0.29783794497870464, 5.999999999999999], [58.64389620259217, 0.07965585678433057, 5.999999999999999]], "peak_params_": [[6.450602134147395, 0.23035798955269848, 2.6110529627413808], [22.224452639224527, 0.40126543369715995, 5.886268884890176], [26.536703898603456, 0.24436389073735376, 0.5194936351584668], [44.46452226582676, 0.30099916108783364, 11.999999999999998], [58.64389620259217, 0.09534879963250398, 11.999999999999998]], "r_squared_": 0.9342038252687082, "error_": 0.05475973636217444}
{"freq_range": [2.0, 80.0], "freq_res": 1.0, "aperiodic_params_": [0.22371070359704698, 0.4035391334206445], "gaussian_params_": [[22.400107914718497, 0.5628025438344042, 3.454610856121911], [37.515380792727285, 0.18980202078596556, 5.999999999999999], [48.769573703696466, 0.29456725706115167, 5.999999999999999]], "peak_params_": [[22.400107914718497, 0.5657574631401622, 6.909221712243822], [37.515380792727285, 0.24803318963288695, 11.999999999999998], [48.769573703696466, 0.3247392700692442, 11.999999999999998]], "r_squared_": 0.8420977779059928, "error_": 0.06649646462710158}
{"freq_range": [2.0, 80.0], "freq_res": 1.0, "aperiodic_params_": [0.3299006997607778, 0.7980668133392689], "gaussian_params_": [[6.575125406347709, 0.28404486140343166, 1.6224643530365197], [22.59642109211182, 0.34410735963029737, 3.4184030862355907], [45.27110021325232, 0.2895968266857455, 5.999999999999999]], "peak_params_": [[6.575125406347709, 0.2744810182984961, 3.2449287060730394], [22.59642109211182, 0.342012662336755, 6.8368061724711815], [45.27110021325232, 0.289301366379078, 11.999999999999998]], "r_squared_": 0.9524783888171602, "error_": 0.05639214903353261}
{"freq_range": [2.0, 80.0], "freq_res": 1.0, "aperiodic_params_": [0.7009906608533865, 1.1912573553030952], "gaussian_params_": [[7.039694341496395, 0.41729803350648104, 1.751829967162641], [22.94627014613786, 0.16296540834419485, 3.32780203802256], [44.54796540086405, 0.13018589256047386, 5.999999999999999], [52.00506461194631, 0.13136615777763733, 0.25003692007423006], [67.99840254968991, 0.18767044472958805, 0.2500066591152557]], "peak_params_": [[7.039694341496395, 0.41719260576474665, 3.503659934325282], [22.94627014613786, 0.16315017367565243, 6.65560407604512], [44.54796540086405, 0.12981695012389705, 11.999999999999998], [52.00506461194631, 0.1915393236775209, 0.5000738401484601], [67.99840254968991, 0.18772928219856366, 0.5000133182305114]], "r_squared_": 0.9784757419006966, "error_": 0.055287898146646225}
{"freq_range": [2.0, 80.0], "freq_res": 1.0, "aperiodic_params_": [0.459809749094102, 0.8758402448194806], "gaussian_params_": [[6.647411492623335, 0.3386648086719836, 2.083955672860434], [20.036800552961825, 0.20973700745987087, 0.7318793273252253], [23.409487009416054, 0.3261575798781285, 0.2571256700672216], [24.614627293069272, 0.18837912730004178, 2.67233550288926], [36.44107343604983, 0.5472858272090664, 0.27546176577057385], [39.64027977596513, 0.35186886043851684, 0.2576541642860302], [49.78941931161036, 0.1426691824663615, 5.999999999999999], [56.423996736551246, 0.17170429702494147, 0.6902566248093502]], "peak_params_": [[6.647411492623335, 0.3338520386731214, 4.167911345720868], [20.036800552961825, 0.25188811831685687, 1.4637586546504506], [23.409487009416054, 0.24878249072181563, 0.5142513401344432], [24.614627293069272, 0.1864585426366706, 5.34467100577852], [36.44107343604983, 0.16206328810025872, 0.5509235315411477], [39.64027977596513, 0.17047031863891626, 0.5153083285720604], [49.78941931161036, 0.14258134070692807, 11.999999999999998], [56.423996736551246, 0.22568063380257253, 1.3805132496187005]], "r_squared_": 0.9746654815114405, "error_": 0.03993075475340133}
{"freq_range": [2.0, 80.0], "freq_res": 1.0, "aperiodic_params_": [0.18262090163691636, 0.6427269308081895], "gaussian_params_": [[6.155063300936825, 0.2211558508314694, 0.8687108345478873], [9.36210371142856, 0.33476072207235397, 0.3112181872604954], [21.782735560771254, 0.43131596946256995, 1.9683333638087317], [27.01841691679812, 0.4234001218686216, 2.5409375320778858], [39.879318989227535, 0.28764373183408654, 3.7757231737452015], [47.59553266583119, 0.24153407474615846, 2.1092748182990095], [49.95715959447503, 0.17660902070966708, 0.7736734357038993], [51.91633157579905, 0.24487586112103057, 0.25010461541886014], [55.67297726110547, 0.22323900780204883, 2.1459503921185075], [59.590548222612256, 0.4018426358833676, 0.2865563175297255], [62.92007872762196, 0.1715724707744809, 0.25018241545399855]], "peak_params_": [[6.155063300936825, 0.21766057644380357, 1.7374216690957747], [9.36210371142856, 0.17116400603977322, 0.6224363745209908], [21.782735560771254, 0.4889173085157843, 3.9366667276174634], [27.01841691679812, 0.4371029749766924, 5.0818750641557715], [39.879318989227535, 0.28786686628468516, 7.551446347490403], [47.59553266583119, 0.27317853937312464, 4.218549636598019], [49.95715959447503, 0.31716209911803206, 1.5473468714077987], [51.91633157579905, 0.31751879280416306, 0.5002092308377203], [55.67297726110547, 0.22077971277557262, 4.291900784237015], [59.590548222612256, 0.17401695065520217, 0.573112635059451], [62.92007872762196, 0.1636942428556597, 0.5003648309079971]], "r_squared_": 0.9433664028290166, "error_": 0.04718824207923245}
{"freq_range": [2.0, 80.0], "freq_res": 1.0, "aperiodic_params_": [0.3649948711068429, 0.9499771691197842], "gaussian_params_": [[6.757784132608807, 0.29972630902157543, 1.815042059679763], [22.874284173129528, 0.24213432531340684, 3.337362464142207], [26.391618804846278, 0.223141644257355, 0.2500123922114159], [39.85686874760969, 0.2277977687810918, 0.6834872374942558], [43.23786780828471, 0.2305877266675935, 0.9928330780820761], [52.26764191610944, 0.14764127988767897, 5.999999999999999]], "peak_params_": [[6.757784132608807, 0.29707224996162884, 3.630084119359526], [22.874284173129528, 0.241963600995036, 6.674724928284414], [26.391618804846278, 0.2216046239108369, 0.5000247844228318], [39.85686874760969, 0.24224584165677276, 1.3669744749885115], [43.23786780828471, 0.2688549588054654, 1.9856661561641522], [52.26764191610944, 0.14749446586251502, 11.999999999999998]], "r_squared_": 0.9754953170151179, "error_": 0.04371406865350053}
{"freq_range": [2.0, 80.0], "freq_res": 1.0, "aperiodic_params_": [0.350339461473788, 0.9359897243043936], "gaussian_params_": [[6.7623694873641504, 0.3031642359386383, 1.7770924099409136], [23.107020822020083, 0.23855238424600417, 3.488672165157759], [39.54862271729708, 0.7995494510231509, 0.25000000000000006], [47.48567351027439, 0.16682072180461088, 5.999999999999999]], "peak_params_": [[6.7623694873641504, 0.3004715305385997, 3.554184819881827], [23.107020822020083, 0.2384805158877299, 6.977344330315518], [39.54862271729708, 0.2332722022872693, 0.5000000000000001], [47.48567351027439, 0.16627509572538024, 11.999999999999998]], "r_squared_": 0.9710089466888757, "error_": 0.05110797438904847}
{"freq_range": [2.0, 80.0], "freq_res": 1.0, "aperiodic_params_": [0.7734074941253765, 1.2303468349446283], "gaussian_params_": [[7.091349561194694, 0.41199086575543775, 1.8574671309832047], [22.331956344915753, 0.21375147876046494, 3.693047811205307], [29.09593078402392, 0.061501136013759124, 2.479270406596779], [36.40877745566813, 0.17900544430149057, 0.8666118908500947], [40.37021259094544, 0.22143668424957266, 0.5464745206059632], [43.53254337710113, 0.1816793909719144, 1.451659089374472], [48.488895372784626, 0.18527590809024458, 1.247286128080735], [72.6364578126179, 0.6209225874820312, 0.25000341353185707]], "peak_params_": [[7.091349561194694, 0.4115315982179464, 3.7149342619664094], [22.331956344915753, 0.21391320981746442, 7.386095622410614], [29.09593078402392, 0.10333387206048061, 4.958540813193558], [36.40877745566813, 0.16165953096283014, 1.7332237817001894], [40.37021259094544, 0.18547759478966186, 1.0929490412119265], [43.53254337710113, 0.17278516929018894, 2.903318178748944], [48.488895372784626, 0.17317097409592153, 2.49457225616147], [72.6364578126179, 0.21570935282432258, 0.5000068270637141]], "r_squared_": 0.9860994279937358, "error_": 0.04598967853541951}
{"freq_range": [2.0, 80.0], "freq_res": 1.0, "aperiodic_params_": [0.8581316160245113, 1.2893917460392479], "gaussian_params_": [[7.112202135594509, 0.4124149337010396, 1.9551837634245273], [22.05526971002717, 0.13735749231264832, 4.484921065831636], [59.40666836756033, 0.7369030959315286, 0.2500696983260795], [72.61148644840837, 0.6248262313549624, 0.26089160521271826]], "peak_params_": [[7.112202135594509, 0.4122272146125654, 3.9103675268490545], [22.05526971002717, 0.1373470626411678, 8.969842131663272], [59.40666836756033, 0.19640139660537614, 0.500139396652159], [72.61148644840837, 0.20615963683830274, 0.5217832104254365]], "r_squared_": 0.9832845602073178, "error_": 0.05843145228895787}
{"freq_range": [2.0, 80.0], "freq_res": 1.0, "aperiodic_params_": [0.8944924570183667, 1.3066811654380286], "gaussian_params_": [[7.165085876338857, 0.4163588519538006, 2.0327116868756465], [24.030118767087753, 0.21050229577139945, 0.641524715915372], [52.30189782121611, 0.34622572090738624, 0.2500257880341107], [59.40593513204841, 0.561731300821424, 0.2673633130864083], [72.91369088120928, 0.20824663848857974, 0.5011631064516908]], "peak_params_": [[7.165085876338857, 0.4149880013014512, 4.065423373751293], [24.030118767087753, 0.21027043080126717, 1.283049431830744], [52.30189782121611, 0.1670182320427298, 0.5000515760682214], [59.40593513204841, 0.17740244720874898, 0.5347266261728166], [72.91369088120928, 0.20518123965145274, 1.0023262129033816]], "r_squared_": 0.9847753576052356, "error_": 0.055262159283709304}
{"freq_range": [2.0, 80.0], "freq_res": 1.0, "aperiodic_params_": [0.8299823466932946, 1.2575649846786412], "gaussian_params_": [[7.404972643244028, 0.3748717875255178, 2.0990876403134178], [22.928363829143155, 0.1380075839848002, 3.8828776145781005], [59.39576196135416, 0.4995518335262417, 0.2500223676857799], [66.93645073637013, 0.07460118952408719, 5.999999997487838]], "peak_params_": [[7.404972643244028, 0.36799031975282653, 4.1981752806268355], [22.928363829143155, 0.13798409883607343, 7.765755229156201], [59.39576196135416, 0.17382828310153342, 0.5000447353715598], [66.93645073637013, 0.0745970052307614, 11.999999994975676]], "r_squared_": 0.9827122833880162, "error_": 0.05302347582225046}
{"freq_range": [2.0, 80.0], "freq_res": 1.0, "aperiodic_params_": [0.561670173171679, 0.9529777723852711], "gaussian_params_": [[6.570349021062761, 0.2502260826173168, 1.0245748203063194], [9.200119726812085, 0.2551678339011057, 0.5721520400120913], [21.728033410069976, 0.259497148367173, 1.615651817578152], [24.294944559942646, 0.24585630997674612, 0.7231675016654455], [27.449447119533843, 0.3466022436289597, 0.9100838120039503], [30.200089215707465, 0.17428882959018385, 0.9322261401379317], [36.39155490682027, 0.17752172093333016, 0.9471379295340902], [39.860445377806755, 0.14969360659602857, 0.7623423177662199], [42.25772667773295, 0.21755400312586892, 0.27749892921913355], [46.24209188169801, 0.12184306205263923, 5.999999999999999]], "peak_params_": [[6.570349021062761, 0.2293213730656488, 2.049149640612639], [9.200119726812085, 0.25506654176237836, 1.1443040800241826], [21.728033410069976, 0.25748020049133136, 3.231303635156304], [24.294944559942646, 0.3231705011906982, 1.446335003330891], [27.449447119533843, 0.30949454560616485, 1.8201676240079006], [30.200089215707465, 0.18027161148666204, 1.8644522802758634], [36.39155490682027, 0.19136518481759535, 1.8942758590681803], [39.860445377806755, 0.2182527686403728, 1.5246846355324397], [42.25772667773295, 0.23915250174282643, 0.5549978584382671], [46.24209188169801, 0.12174392134529533, 11.999999999999998]], "r_squared_": 0.9791136942280338, "error_": 0.036445576577022645}
{"freq_range": [2.0, 80.0], "freq_res": 1.0, "aperiodic_params_": [0.5482925951616899, 0.9416750643874768], "gaussian_params_": [[6.514806408170615, 0.2442731929114831, 0.8968748182524923], [9.146857823966059, 0.2447275251864383, 0.5772981923005722], [21.731508931634234, 0.2573343533409452, 1.6712164003251861], [24.255809577864202, 0.2478984621241792, 0.6875987705055383], [27.563671624632626, 0.3297572583955396, 1.1138327884384744], [30.40583699353137, 0.36602566367947326, 0.324581016998259], [36.404227087122365, 0.18014368113477702, 0.7189526565161076], [39.78744510598928, 0.12191502691033587, 0.6260629427399391], [41.94363223748156, 0.1391695498184643, 0.25017123779593314], [44.198361887998665, 0.14620200881388826, 5.999999999999999], [55.671369262329065, 0.30851951310756065, 0.25001747185974793]], "peak_params_": [[6.514806408170615, 0.21126371723801585, 1.7937496365049845], [9.146857823966059, 0.24219086178299992, 1.1545963846011444], [21.731508931634234, 0.25533237076966975, 3.3424328006503723], [24.255809577864202, 0.33622717465066887, 1.3751975410110766], [27.563671624632626, 0.30945041283044716, 2.227665576876949], [30.40583699353137, 0.2065483721683543, 0.649162033996518], [36.404227087122365, 0.21128860645278646, 1.4379053130322152], [39.78744510598928, 0.22954277158645664, 1.2521258854798782], [41.94363223748156, 0.27262863793631165, 0.5003424755918663], [44.198361887998665, 0.1461221324019113, 11.999999999999998], [55.671369262329065, 0.15117744727723714, 0.5000349437194959]], "r_squared_": 0.9801315193228141, "error_": 0.0342609790614617}
{"freq_range": [2.0, 80.0], "freq_res": 1.0, "aperiodic_params_": [0.09819190884543187, 0.6461593597438668], "gaussian_params_": [[6.0314859200179045, 0.20304303301416576, 0.5806486060660223], [19.538217681528256, 0.8305333138885436, 0.2841089240391205], [21.659380170866893, 0.39347754634715076, 0.5857201198478855], [23.50121882155237, 1.2048102953845048, 0.27460968638902467], [26.784909456848908, 0.27164660747384595, 2.4167812993136724], [42.12045253840896, 0.22274190208240519, 5.928471721227664], [49.451669336327306, 0.6449399227862419, 0.25305999581528993], [56.84518892573038, 0.12291036898859255, 5.999999999999997], [68.41758571730868, 0.7743734827794616, 0.2516766288418882]], "peak_params_": [[6.0314859200179045, 0.2027447406977947, 1.1612972121320446], [19.538217681528256, 0.2342648194736372, 0.568217848078241], [21.659380170866893, 0.37123275449782656, 1.171440239695771], [23.50121882155237, 0.37356463497484804, 0.5492193727780493], [26.784909456848908, 0.2791887139104686, 4.833562598627345], [42.12045253840896, 0.2284541455449458, 11.856943442455329], [49.451669336327306, 0.297035957066615, 0.5061199916305799], [56.84518892573038, 0.1324176542985167, 11.999999999999995], [68.41758571730868, 0.2173449956111262, 0.5033532576837764]], "r_squared_": 0.9123483960498014, "error_": 0.05504585919846974}
{"freq_range": [2.0, 80.0], "freq_res": 1.0, "aperiodic_params_": [0.2018241355781845, 0.770862754352954], "gaussian_params_": [[21.289415866003875, 0.26048511271161995, 2.8213884366995585], [26.87229657363542, 0.32987352292506733, 0.9427856258105528], [31.24273888984313, 0.35650775861491596, 1.8108129888990399], [34.021860473548685, 0.19768510784132415, 0.42816785662590473], [35.7572493076495, 0.23394251584737819, 0.6003173070745565], [37.53564214736737, 0.8455465036707656, 0.2732830275514977], [44.38284831557185, 0.2615923821414156, 4.0644562086392595], [52.450324388724624, 1.2468732804278326, 0.25737344890811364], [54.61822709868582, 0.22184615772389996, 0.6106770978770244], [56.58935295528716, 0.3689463712918778, 0.49236300660499993], [58.67198171598666, 0.2376115130921148, 0.45788244582155385]], "peak_params_": [[21.289415866003875, 0.2591182928606939, 5.642776873399117], [26.87229657363542, 0.3833867185838047, 1.8855712516211056], [31.24273888984313, 0.35519632253561295, 3.6216259777980797], [34.021860473548685, 0.3225195887153941, 0.8563357132518095], [35.7572493076495, 0.25807215750177803, 1.200634614149113], [37.53564214736737, 0.27639248652352244, 0.5465660551029954], [44.38284831557185, 0.2604344563974499, 8.128912417278519], [52.450324388724624, 0.3150043139303256, 0.5147468978162273], [54.61822709868582, 0.19311000523917232, 1.2213541957540488], [56.58935295528716, 0.2630899012147043, 0.9847260132099999], [58.67198171598666, 0.18424340782027915, 0.9157648916431077]], "r_squared_": 0.9643107277437163, "error_": 0.03898927254175583}
{"freq_range": [2.0, 80.0], "freq_res": 1.0, "aperiodic_params_": [0.48586063268358487, 1.061909940895964], "gaussian_params_": [[7.461934826111686, 0.27686345436333, 2.2188744773538227], [16.082582854426178, 0.18577613193022754, 0.7086814882746022], [20.50116407018842, 0.33949929216018454, 1.3735474793438194], [24.114872308101457, 0.38832435333271825, 0.9900232204858367], [26.550217394627232, 0.9208582656279658, 0.2780561342861278], [30.026985515021664, 0.21277022063458204, 1.1396319202021903], [35.709335813114166, 0.20511590777589622, 1.4431415893518076], [41.469697054257885, 0.2095017492969787, 2.7312082848689836], [48.610324942569434, 0.1393258272026615, 2.4853729374407463], [55.84904523420508, 0.15393076700877156, 0.8244705192389297], [59.39330537562172, 0.49751045743949635, 0.27029615921278966], [65.62644845579383, 0.45731970498646685, 0.2500195137280458], [72.66504620572407, 0.32911231989239387, 0.2500354709079196]], "peak_params_": [[7.461934826111686, 0.27092826717810337, 4.437748954707645], [16.082582854426178, 0.18626862419116685, 1.4173629765492044], [20.50116407018842, 0.3205845507365659, 2.7470949586876388], [24.114872308101457, 0.3989575115195263, 1.9800464409716734], [26.550217394627232, 0.26070222456093894, 0.5561122685722556], [30.026985515021664, 0.21282351670133903, 2.2792638404043806], [35.709335813114166, 0.22920013255476523, 2.886283178703615], [41.469697054257885, 0.2079564209503988, 5.462416569737967], [48.610324942569434, 0.1423063836398022, 4.9707458748814926], [55.84904523420508, 0.15304872456368068, 1.6489410384778593], [59.39330537562172, 0.17272526526818965, 0.5405923184255793], [65.62644845579383, 0.14978949162166888, 0.5000390274560916], [72.66504620572407, 0.13416915810336993, 0.5000709418158392]], "r_squared_": 0.9890305645896742, "error_": 0.034114146977893285}
{"freq_range": [2.0, 80.0], "freq_res": 1.0, "aperiodic_params_": [0.7464131793164843, 1.20325462973215], "gaussian_params_": [[7.636569227537927, 0.3293858266566879, 2.2854048551469943], [21.503789952979318, 0.15535418883556362, 4.812687651436154], [24.061020991106382, 0.12417984180939692, 0.25040842172430483], [26.927165325097988, 0.09004770470394846, 0.2500090419541392], [59.40613133083475, 0.529867652682678, 0.27374567396856814]], "peak_params_": [[7.636569227537927, 0.3282793383006073, 4.570809710293989], [21.503789952979318, 0.15453063009640944, 9.625375302872309], [24.061020991106382, 0.25634882333661324, 0.5008168434486097], [26.927165325097988, 0.16723738135774646, 0.5000180839082784], [59.40613133083475, 0.17628122603919416, 0.5474913479371363]], "r_squared_": 0.9799312694966383, "error_": 0.05882497159289828}
{"freq_range": [2.0, 80.0], "freq_res": 1.0, "aperiodic_params_": [0.8825915832115651, 1.2908246662080725], "gaussian_params_": [[7.846875909671528, 0.3464231554472533, 2.4467274131968706], [23.953048050962682, 0.2045540288370362, 0.5634561056101517], [59.4491008457277, 0.9099292257333024, 0.2574354119228999], [72.62810320805166, 0.6470294343394057, 0.25000120916840585]], "peak_params_": [[7.846875909671528, 0.3457454084397893, 4.893454826393741], [23.953048050962682, 0.20384508576464533, 1.1269122112203034], [59.4491008457277, 0.1986797786657748, 0.5148708238457999], [72.62810320805166, 0.21399329852259008, 0.5000024183368117]], "r_squared_": 0.9839856442460704, "error_": 0.05520150323729663}
{"freq_range": [2.0, 80.0], "freq_res": 1.0, "aperiodic_params_": [0.9094555033108191, 1.304032836258153], "gaussian_params_": [[6.327330610895338, 0.34501029307638487, 1.278846750977411], [9.144463132039748, 0.33504945921083257, 0.7068551243534335], [11.404366290557485, 0.6229149775434786, 0.2941952452961394], [24.102985438204428, 0.18080482026913966, 0.5110704698303947], [52.365723124141155, 0.4575703533370708, 0.2500211631517546], [59.412851872252034, 0.540354919722647, 0.2639467054608789], [72.7964000482056, 0.21394490107579583, 0.6091614385265203]], "peak_params_": [[6.327330610895338, 0.3339087350716772, 2.557693501954822], [9.144463132039748, 0.36697519170244913, 1.413710248706867], [11.404366290557485, 0.25333085652236687, 0.5883904905922788], [24.102985438204428, 0.17717095520826454, 1.0221409396607894], [52.365723124141155, 0.15697468661763203, 0.5000423263035092], [59.412851872252034, 0.1590066056869499, 0.5278934109217578], [72.7964000482056, 0.20232265102481062, 1.2183228770530405]], "r_squared_": 0.9885209259342367, "error_": 0.044731558719855805}
{"freq_range": [2.0, 80.0], "freq_res": 1.0, "aperiodic_params_": [0.823201776974419, 1.2447762253099992], "gaussian_params_": [[6.513446609885673, 0.29711497158960437, 1.2712400211172383], [9.293223167117558, 0.4211643617655854, 0.6394651263916091], [11.436006620230549, 0.840604755169415, 0.2727254427920649], [23.980163057132007, 0.21488727247963407, 0.5331570686969387], [59.449419358666084, 0.9075782638363741, 0.2538229279780744], [72.89755560673294, 0.22303951970157704, 0.5935362541753496]], "peak_params_": [[6.513446609885673, 0.2768096875309522, 2.5424800422344767], [9.293223167117558, 0.4230007226647073, 1.2789302527832183], [11.436006620230549, 0.24674558625626902, 0.5454508855841298], [23.980163057132007, 0.2147385866614815, 1.0663141373938774], [59.449419358666084, 0.18928697667172467, 0.5076458559561488], [72.89755560673294, 0.21974187976710402, 1.1870725083506992]], "r_squared_": 0.9850539050021954, "error_": 0.049963812035913824}
{"freq_range": [2.0, 80.0], "freq_res": 1.0, "aperiodic_params_": [0.7238670434991986, 1.1521421795973372], "gaussian_params_": [[6.556314904066148, 0.23780030371317995, 0.968165532469067], [9.288000822933267, 0.4185892598799638, 0.6559772918582109], [11.31358100062149, 0.2591975642542427, 0.3178764334728611], [23.880857209701954, 0.24532895350345935, 0.631694462202144], [27.48374188718177, 0.5974742650559751, 0.2977026414087367], [40.301275252984446, 0.20745691302516853, 0.26103640826338165], [41.84004617497278, 0.12505827490499621, 0.9589163029472605], [56.215297941981014, 0.1411638673132086, 0.4739464879696125], [59.94303172534385, 0.10446045137862876, 1.3178096330707094], [73.05515879494519, 0.14981731465675224, 0.46176161940276395]], "peak_params_": [[6.556314904066148, 0.21505094428264723, 1.936331064938134], [9.288000822933267, 0.3899654212017964, 1.3119545837164217], [11.31358100062149, 0.17323289754642546, 0.6357528669457222], [23.880857209701954, 0.2410039781932526, 1.263388924404288], [27.48374188718177, 0.15957953634112654, 0.5954052828174734], [40.301275252984446, 0.12642015867422074, 0.5220728165267633], [41.84004617497278, 0.12333047775879069, 1.917832605894521], [56.215297941981014, 0.12851315279558473, 0.947892975939225], [59.94303172534385, 0.1043628895809059, 2.635619266141419], [73.05515879494519, 0.14875224608445414, 0.9235232388055279]], "r_squared_": 0.9889335072355846, "error_": 0.036050708557341105}
{"freq_range": [2.0, 80.0], "freq_res": 1.0, "aperiodic_params_": [0.1596338722907902, 0.6686326965418458], "gaussian_params_": [[2.5707718962342416, 0.2532831406352722, 0.8049295110021063], [6.3547947912137, 0.1840249481378837, 0.7888205460842482], [9.447374369725592, 1.021944825154378, 0.26500292472084785], [18.41796452436548, 0.6323169697830646, 0.25560508878523275], [20.452751805618398, 0.24931754076894322, 0.6031064829283117], [22.437812333414694, 0.23315265984630512, 0.6185045688738668], [24.43040450475455, 1.2014239489023055, 0.2893000174385234], [27.47775676335581, 0.2743790451129962, 1.5502329232838186], [36.39600158940198, 0.1395397216867515, 1.33961443568025], [41.03595419109529, 0.21963135569799208, 1.288048219581421], [46.1228492367458, 0.15430923381358058, 0.37899067574840795], [49.76050889383697, 0.13909579918440979, 2.5172466396032664], [59.87413141519047, 0.1327092636543363, 1.0286099830723991], [64.03330464671053, 0.12867178565326282, 0.7044966207909983]], "peak_params_": [[2.5707718962342416, 0.21973659300450404, 1.6098590220042126], [6.3547947912137, 0.16635019456937156, 1.5776410921684965], [9.447374369725592, 0.24645493564887894, 0.5300058494416957], [18.41796452436548, 0.16614180046699756, 0.5112101775704655], [20.452751805618398, 0.18819710002414825, 1.2062129658566234], [22.437812333414694, 0.19129728108941368, 1.2370091377477337], [24.43040450475455, 0.42901091633560645, 0.5786000348770468], [27.47775676335581, 0.2616537020351499, 3.100465846567637], [36.39600158940198, 0.13367959135627427, 2.6792288713605], [41.03595419109529, 0.22025189378388466, 2.576096439162842], [46.1228492367458, 0.19211464656936184, 0.7579813514968159], [49.76050889383697, 0.1384676990945547, 5.034493279206533], [59.87413141519047, 0.13175490536221268, 2.0572199661447983], [64.03330464671053, 0.12857068053407172, 1.4089932415819966]], "r_squared_": 0.9771812497604152, "error_": 0.031465895853134446}
{"freq_range": [2.0, 80.0], "freq_res": 1.0, "aperiodic_params_": [0.05341427726625565, 0.551544514467281], "gaussian_params_": [[15.449686123839031, 0.3310955316556912, 0.2782190653825146], [18.47401990904504, 0.2907282711838757, 1.9954940762606257], [21.258651880766706, 0.29427928209599763, 0.77311759358058], [23.844486744083063, 0.4244967682455953, 0.9354336581068997], [27.438511366661924, 1.1941865739018456, 0.26979620660818227], [31.547965325509665, 0.2529783198718086, 5.999999999999999], [46.85392536766, 0.2104783968374716, 5.999999999999999]], "peak_params_": [[15.449686123839031, 0.15919333612867104, 0.5564381307650292], [18.47401990904504, 0.3024505869837645, 3.9909881525212514], [21.258651880766706, 0.4668782760838684, 1.54623518716116], [23.844486744083063, 0.5403186155716148, 1.8708673162137994], [27.438511366661924, 0.5108914606988294, 0.5395924132163645], [31.547965325509665, 0.26208659320975647, 11.999999999999998], [46.85392536766, 0.21959686278889612, 11.999999999999998]], "r_squared_": 0.9374710394283662, "error_": 0.04801125230493425}
{"freq_range": [2.0, 80.0], "freq_res": 1.0, "aperiodic_params_": [-0.4837001785905127, -0.015280421514092634], "gaussian_params_": [[17.576152046390167, 0.500201633919213, 0.7454998344164422], [20.325803186152704, 0.4628951387040653, 1.2903885487132833], [37.160127527922334, 0.24638214625406263, 3.4852105041463557], [53.97894764178973, 0.16834972113971497, 5.999999999999999]], "peak_params_": [[17.576152046390167, 0.516764155365351, 1.4909996688328844], [20.325803186152704, 0.4509080215603774, 2.5807770974265667], [37.160127527922334, 0.24919350157087528, 6.970421008292711], [53.97894764178973, 0.16835078382648877, 11.999999999999998]], "r_squared_": 0.4711595131993761, "error_": 0.078769589482394}
{"freq_range": [2.0, 80.0], "freq_res": 1.0, "aperiodic_params_": [0.48111506395453707, 0.9824649796679857], "gaussian_params_": [[9.30529813729032, 0.25954017918992034, 0.61477547389587], [10.793213602051537, 0.265499955591624, 0.25000938977486215], [16.607151115597137, 0.16330117432517208, 0.9981449978333778], [20.612129618171764, 0.21142082868347234, 0.9847541867367402], [23.817020690733102, 0.22330291257681295, 0.7668363646803154], [26.527942621311514, 0.852790193240141, 0.2671824348818705], [35.54114026568451, 0.4142677079809916, 0.28121250618520804], [41.818690136679606, 0.12125889091070408, 5.999999999999999], [52.28071484621915, 0.2670964826838196, 0.2500049338503526], [59.07607885784821, 0.18080375725032716, 0.5408816402496255]], "peak_params_": [[9.30529813729032, 0.22943170364593643, 1.22955094779174], [10.793213602051537, 0.19439566286948284, 0.5000187795497243], [16.607151115597137, 0.15140712385146526, 1.9962899956667557], [20.612129618171764, 0.19620805263268437, 1.9695083734734804], [23.817020690733102, 0.21907850712985943, 1.5336727293606307], [26.527942621311514, 0.1848446354564125, 0.534364869763741], [35.54114026568451, 0.18519620343457466, 0.5624250123704161], [41.818690136679606, 0.12120353999419053, 11.999999999999998], [52.28071484621915, 0.17093705633080014, 0.5000098677007052], [59.07607885784821, 0.1810336816609237, 1.081763280499251]], "r_squared_": 0.9817700522760614, "error_": 0.03686172839753383}
{"freq_range": [2.0, 80.0], "freq_res": 1.0, "aperiodic_params_": [0.7898376678477677, 1.1970108701253266], "gaussian_params_": [[6.543036278799627, 0.2138769968976835, 1.2408909208604004], [9.363652164870459, 0.6922666770745548, 0.3093924576668569], [10.615571656452623, 0.5543949520750119, 0.401720781504771], [17.909033797426613, 0.17275684179133266, 2.9268794138661707], [23.941596590421238, 0.15466278857134677, 0.5044116639889279], [72.89733512812732, 0.19339795824273792, 0.25000735751130887]], "peak_params_": [[6.543036278799627, 0.20002193111316216, 2.481781841720801], [9.363652164870459, 0.3789347380627103, 0.6187849153337138], [10.615571656452623, 0.3617140451114004, 0.803441563009542], [17.909033797426613, 0.17267342550346287, 5.853758827732341], [23.941596590421238, 0.17344597694844155, 1.0088233279778558], [72.89733512812732, 0.17776000985955642, 0.5000147150226177]], "r_squared_": 0.9852845447291576, "error_": 0.047451302317552325}
{"freq_range": [2.0, 80.0], "freq_res": 1.0, "aperiodic_params_": [0.8250014096698645, 1.2475983620706517], "gaussian_params_": [[6.6994166538435165, 0.263946402197842, 1.2065027503228236], [9.395910696922954, 0.4480448142570049, 0.5916268892820483], [11.341708591883245, 0.6464614997872268, 0.3056849769471154], [17.340119357170064, 0.1614699488451789, 2.5303583198526147], [23.88160827831963, 0.1679215030770333, 0.5010076225757699], [52.18648340440886, 0.1947032396347782, 0.25000073510315185], [59.679251194492174, 0.1492430717171359, 1.0036933922155302], [72.72182651664748, 0.32629998226928947, 0.25219338494552823]], "peak_params_": [[6.6994166538435165, 0.25604203578862694, 2.4130055006456472], [9.395910696922954, 0.4017210811260417, 1.1832537785640966], [11.341708591883245, 0.3649044945189635, 0.6113699538942308], [17.340119357170064, 0.16001783662268854, 5.0607166397052294], [23.88160827831963, 0.16835416602716957, 1.0020152451515398], [52.18648340440886, 0.1474176487755945, 0.5000014702063037], [59.679251194492174, 0.1418137125789407, 2.0073867844310604], [72.72182651664748, 0.1775929916624206, 0.5043867698910565]], "r_squared_": 0.988941929853599, "error_": 0.04285063373803388}
{"freq_range": [2.0, 80.0], "freq_res": 1.0, "aperiodic_params_": [0.829400616975594, 1.2514118037116717], "gaussian_params_": [[6.755764936468055, 0.2669389515897258, 1.2400529123128927], [9.368137546060659, 0.46757985547012865, 0.5880556146716356], [11.398634375832406, 0.7694440751487337, 0.3118079002896502], [16.58492503170978, 0.15382497751807817, 2.203198045885913], [24.011244474341506, 0.15960995487070107, 0.5238913218015733], [52.37130179551701, 0.5513759473800133, 0.2500024356060659], [59.43951515058269, 0.5714710931635514, 0.27115017512511047], [72.8967465451735, 0.21950519257131265, 0.552583669178485]], "peak_params_": [[6.755764936468055, 0.26196402481697584, 2.4801058246257854], [9.368137546060659, 0.43668636880591394, 1.1761112293432712], [11.398634375832406, 0.3567265320814062, 0.6236158005793004], [16.58492503170978, 0.15111918219211307, 4.406396091771826], [24.011244474341506, 0.16010695779630701, 1.0477826436031465], [52.37130179551701, 0.18300586101312444, 0.5000048712121318], [59.43951515058269, 0.15362409530612453, 0.5423003502502209], [72.8967465451735, 0.215706426480746, 1.10516733835697]], "r_squared_": 0.9906698291010099, "error_": 0.038924676209631665}
{"freq_range": [2.0, 80.0], "freq_res": 1.0, "aperiodic_params_": [0.83201121080362, 1.2636828182895614], "gaussian_params_": [[6.870185148419976, 0.2421624387660471, 1.0433144739748916], [9.338178659747406, 0.5324678406415162, 0.5888761730285982], [11.42921537906879, 0.8263818434222263, 0.3016852071360891], [16.659444177324378, 0.14864094373233913, 2.1536958891023326], [24.040429944004, 0.18306883433942903, 0.47459416473534405], [49.512112068814396, 0.6161064732665771, 0.2896130027731522], [52.35509334137535, 0.4918410949596848, 0.251969157235637], [59.426996595142555, 0.5362281418406466, 0.2719838460407899], [67.79559280081591, 0.0853443460526395, 5.999999999999999], [72.94408612639106, 0.15454064440278603, 0.2500000018102473]], "peak_params_": [[6.870185148419976, 0.24050234772535242, 2.0866289479497833], [9.338178659747406, 0.48193221015001975, 1.1777523460571964], [11.42921537906879, 0.31509299291211135, 0.6033704142721782], [16.659444177324378, 0.14679420956653677, 4.307391778204665], [24.040429944004, 0.18285200473304108, 0.9491883294706881], [49.512112068814396, 0.15012413925220058, 0.5792260055463044], [52.35509334137535, 0.1848728411154148, 0.503938314471274], [59.426996595142555, 0.18551128631994396, 0.5439676920815798], [67.79559280081591, 0.08529483426271667, 11.999999999999998], [72.94408612639106, 0.2093097337472507, 0.5000000036204946]], "r_squared_": 0.990707303177662, "error_": 0.03632915234713572}
{"freq_range": [2.0, 80.0], "freq_res": 1.0, "aperiodic_params_": [0.7415366786707787, 1.15808457469735], "gaussian_params_": [[6.992805424507524, 0.17462860310291464, 0.8738357850940014], [9.357825753180077, 0.5599962331401268, 0.556408806708651], [11.429276361833073, 0.6451104910830444, 0.29566486546048404], [23.996108100509165, 0.22036808115833756, 0.5211707839589351], [27.457717298149834, 0.7178300357324449, 0.27274476323527413], [41.31355878759155, 0.15765371181312895, 1.270337252826356], [52.27515515186314, 0.2769480667269121, 0.25002842316891594], [59.43979584370129, 0.5394932818919984, 0.27040823716265733]], "peak_params_": [[6.992805424507524, 0.17469329293269872, 1.7476715701880028], [9.357825753180077, 0.4678700677626914, 1.112817613417302], [11.429276361833073, 0.23203931812209524, 0.5913297309209681], [23.996108100509165, 0.2203619368111428, 1.0423415679178702], [27.457717298149834, 0.1755762660949085, 0.5454895264705483], [41.31355878759155, 0.15292355032485372, 2.540674505652712], [52.27515515186314, 0.1511518322205463, 0.5000568463378319], [59.43979584370129, 0.1437417770027687, 0.5408164743253147]], "r_squared_": 0.9870989441832457, "error_": 0.040001108745981596}
{"freq_range": [2.0, 80.0], "freq_res": 1.0, "aperiodic_params_": [0.4620030527899783, 0.9243851362583939], "gaussian_params_": [[9.458958341851744, 0.24457630704605257, 0.8686715381863594], [20.945713268728177, 0.1791155249987958, 2.7673775440813717], [24.07410176432071, 0.22413327732884042, 0.6333256562459766], [27.363778570632906, 0.7232723554027333, 0.2500162942108251], [28.51177178260798, 0.733787613325431, 0.2958525483928864], [39.13792627542398, 0.10643194011355929, 5.999999999999999], [40.43784896944025, 0.31288893713338384, 0.2640396209828882], [42.47090710688187, 0.32171982013386036, 0.28425455282588413], [51.744425819942656, 0.23087844761890153, 0.25006039607504205], [59.465302156570836, 0.5185962722072124, 0.2775993226200126]], "peak_params_": [[9.458958341851744, 0.2127314266482211, 1.737343076372719], [20.945713268728177, 0.1801860507852311, 5.534755088162743], [24.07410176432071, 0.32443338360390017, 1.2666513124919532], [27.363778570632906, 0.28106937124416254, 0.5000325884216502], [28.51177178260798, 0.21615165519564727, 0.5917050967857728], [39.13792627542398, 0.10640393652428659, 11.999999999999998], [40.43784896944025, 0.18445529960759188, 0.5280792419657764], [42.47090710688187, 0.17655603492098026, 0.5685091056517683], [51.744425819942656, 0.1476431439196132, 0.5001207921500841], [59.465302156570836, 0.12772059776205902, 0.5551986452400252]], "r_squared_": 0.9858278381262968, "error_": 0.03201347984339535}
{"freq_range": [2.0, 80.0], "freq_res": 1.0, "aperiodic_params_": [-0.005923453843598791, 0.43228505518920096], "gaussian_params_": [[17.94289702847992, 0.35360127877637204, 3.46757720011534], [21.227045016116584, 0.22263119107088203, 0.4709429190842673], [23.767161206140045, 0.26417492938460724, 0.7212843765434201], [28.78330183552774, 0.3845297319712869, 5.999999999999999], [44.43190771866613, 0.2679258773392267, 5.999999999999999]], "peak_params_": [[17.94289702847992, 0.4300495026069003, 6.93515440023068], [21.227045016116584, 0.6040157633672096, 0.9418858381685346], [23.767161206140045, 0.6083258471895431, 1.4425687530868403], [28.78330183552774, 0.3962773471350511, 11.999999999999998], [44.43190771866613, 0.2826589729310458, 11.999999999999998]], "r_squared_": 0.9220779855853776, "error_": 0.05712115650830923}
{"freq_range": [2.0, 80.0], "freq_res": 1.0, "aperiodic_params_": [0.0430624881348555, 0.33345209222998196], "gaussian_params_": [[16.490720365328702, 0.27177979535929064, 1.4369818977371893], [21.313843256206756, 0.462529593794111, 3.1126114372202722], [30.828797372322423, 0.19300125041720184, 3.2055433975666805], [40.72311631735517, 0.38594082478346026, 5.9999646470568555], [52.31678808742885, 0.18526027971631662, 2.6464920603042543], [59.53791835186285, 0.1797121909881265, 3.0256902309643703], [69.02708522664682, 0.14523510009493812, 0.25000455259656273]], "peak_params_": [[16.490720365328702, 0.3641801158984404, 2.8739637954743786], [21.313843256206756, 0.4656532664448279, 6.2252228744405445], [30.828797372322423, 0.30019290904236096, 6.411086795133361], [40.72311631735517, 0.38680690739583656, 11.999929294113711], [52.31678808742885, 0.2579927920390264, 5.292984120608509], [59.53791835186285, 0.18258097825200315, 6.051380461928741], [69.02708522664682, 0.14574297221938476, 0.5000091051931255]], "r_squared_": 0.8510286638992148, "error_": 0.05694712077711909}
{"freq_range": [2.0, 80.0], "freq_res": 1.0, "aperiodic_params_": [0.3995924949476369, 0.7980226208054225], "gaussian_params_": [[9.47369053075851, 0.9344076201768576, 0.2582933708245083], [10.659649762768382, 0.41297520529992215, 0.25000426727402497], [16.606958156791475, 0.2740220952488118, 0.9676762912333817], [21.491516039490293, 0.35591443487407154, 2.6238571966304725], [30.22743971362069, 0.1962839929564413, 2.5476854124661465], [35.29198398243898, 0.24507644787372823, 0.8525816001238179], [39.42287908275524, 0.22500426945996113, 1.8052561771497926], [43.794138157179795, 0.24253628066304722, 1.1038311689023959], [47.53632051583131, 0.414870269022565, 0.34378348180467294], [49.54135963446231, 0.8488879744750376, 0.255469982179114], [57.703910901318864, 0.10009800996331432, 3.242316943440078]], "peak_params_": [[9.47369053075851, 0.1738682496013939, 0.5165867416490166], [10.659649762768382, 0.16360378779575996, 0.5000085345480499], [16.606958156791475, 0.33455962352845803, 1.9353525824667634], [21.491516039490293, 0.3500115650178626, 5.247714393260945], [30.22743971362069, 0.19735704523688524, 5.095370824932293], [35.29198398243898, 0.2762587069406939, 1.7051632002476358], [39.42287908275524, 0.21947619550840636, 3.610512354299585], [43.794138157179795, 0.24741025790087723, 2.2076623378047917], [47.53632051583131, 0.16837674391537005, 0.6875669636093459], [49.54135963446231, 0.17537477525163647, 0.510939964358228], [57.703910901318864, 0.09968150111720031, 6.484633886880156]], "r_squared_": 0.9848992854943267, "error_": 0.03019342763689823}
{"freq_range": [2.0, 80.0], "freq_res": 1.0, "aperiodic_params_": [0.7315801371453585, 1.110370845628609], "gaussian_params_": [[7.190861662343489, 0.18987803288137586, 0.6328359085119045], [9.371439903103427, 0.6493433041559886, 0.35619116101260856], [10.64189849151755, 0.5274433046469194, 0.35593258410184836], [16.507216614610844, 0.22106251498122334, 0.6553961985015163], [21.2627235582062, 0.13351800794717236, 4.952378864540325], [35.37830839282064, 0.14770083306887533, 0.7089068978883665], [41.7411237088026, 0.11716867345296651, 3.2921029404465236], [48.92264930997771, 0.1044596016287405, 1.1419500114136605], [59.52404760116266, 0.17687150622072165, 0.869722645073076]], "peak_params_": [[7.190861662343489, 0.1835466134580761, 1.265671817023809], [9.371439903103427, 0.38642417211608926, 0.7123823220252171], [10.64189849151755, 0.3335766210996027, 0.7118651682036967], [16.507216614610844, 0.25881554818826374, 1.3107923970030326], [21.2627235582062, 0.133330260537307, 9.90475772908065], [35.37830839282064, 0.14534632434775396, 1.417813795776733], [41.7411237088026, 0.11682777794379662, 6.584205880893047], [48.92264930997771, 0.11452643495371495, 2.283900022827321], [59.52404760116266, 0.15227444975211712, 1.739445290146152]], "r_squared_": 0.9887848722690463, "error_": 0.03633415336164514}
{"freq_range": [2.0, 80.0], "freq_res": 1.0, "aperiodic_params_": [0.8135209014956813, 1.2138519710280207], "gaussian_params_": [[7.2041800650278125, 0.25695084611806124, 0.8896093893932356], [9.10864985837485, 0.4366836412268172, 0.258739715910893], [10.622012552520388, 0.46270309210218213, 0.6894366731253166], [16.681165425398326, 0.19300115243293658, 2.5180917379750243], [49.57122173355857, 0.505082686182348, 0.27420443629397806], [52.04599102230748, 0.14877328618704805, 0.2500000000006983], [59.446982329511684, 0.6286926166248187, 0.29140749317201364]], "peak_params_": [[7.2041800650278125, 0.2503909408230722, 1.7792187787864713], [9.10864985837485, 0.4642330705328112, 0.517479431821786], [10.622012552520388, 0.41330870654060925, 1.3788733462506333], [16.681165425398326, 0.1914602393530649, 5.036183475950049], [49.57122173355857, 0.14872753283787477, 0.5484088725879561], [52.04599102230748, 0.14627701469334142, 0.5000000000013965], [59.446982329511684, 0.19388359989021842, 0.5828149863440273]], "r_squared_": 0.9893304892168732, "error_": 0.03952596961470288}
{"freq_range": [2.0, 80.0], "freq_res": 1.0, "aperiodic_params_": [0.8916560278401241, 1.2907926106007468], "gaussian_params_": [[7.319116070404762, 0.2551127360361491, 0.8762749153151081], [8.960705125086177, 0.3567713040222415, 0.250018554231903], [10.65282940039094, 0.41093905343607484, 1.0107716543265586], [16.475824600708883, 0.2348084672247147, 1.5337329343422403], [49.5309197387278, 0.623870110604536, 0.27483951994096123], [52.38335943118002, 0.4952341369160656, 0.2535452831525624], [59.55495086607065, 0.16518103439504522, 0.9006225514205066], [67.69730532923101, 0.10415804409477218, 2.475443358419073], [72.59314438709595, 0.48698256519285216, 0.27263558937434323]], "peak_params_": [[7.319116070404762, 0.2393440859160561, 1.7525498306302163], [8.960705125086177, 0.5008487751963917, 0.500037108463806], [10.65282940039094, 0.38783867866710864, 2.021543308653117], [16.475824600708883, 0.2237764136874022, 3.0674658686844807], [49.5309197387278, 0.14539546639899226, 0.5496790398819225], [52.38335943118002, 0.15790046080382347, 0.5070905663051248], [59.55495086607065, 0.1470239535144695, 1.8012451028410132], [67.69730532923101, 0.10338225443694848, 4.950886716838146], [72.59314438709595, 0.1704327266029364, 0.5452711787486865]], "r_squared_": 0.9901139371323838, "error_": 0.03882161694715959}
{"freq_range": [2.0, 80.0], "freq_res": 1.0, "aperiodic_params_": [0.8071473577262295, 1.2178033506942203], "gaussian_params_": [[7.331175952408231, 0.2344390531146648, 0.6429074158451082], [8.952589822712731, 0.3554373444788757, 0.2772607833571698], [10.413190418083998, 0.3662102854985024, 1.2600629097725313], [16.665477439727592, 0.1775038744447808, 1.957244335805333], [24.376894707397778, 0.3963855162094649, 0.2682771489334451], [27.410774278278947, 0.5161797289915413, 0.2589136051673664], [52.080405353022186, 0.18828514466537802, 0.2500000046776422], [59.4524088721927, 0.622028609102736, 0.27272152877821776], [72.69461856767272, 0.2059074504970478, 0.45810640966570926]], "peak_params_": [[7.331175952408231, 0.21465304407835561, 1.2858148316902165], [8.952589822712731, 0.5536861822707351, 0.5545215667143396], [10.413190418083998, 0.347905033611426, 2.5201258195450627], [16.665477439727592, 0.17493052488774996, 3.914488671610666], [24.376894707397778, 0.14791357138304706, 0.5365542978668902], [27.410774278278947, 0.1466306585088707, 0.5178272103347328], [52.080405353022186, 0.17879454910474046, 0.5000000093552844], [59.4524088721927, 0.1571287365114733, 0.5454430575564355], [72.69461856767272, 0.16488327747979392, 0.9162128193314185]], "r_squared_": 0.9896129161847883, "error_": 0.03903930096141748}
{"freq_range": [2.0, 80.0], "freq_res": 1.0, "aperiodic_params_": [0.7173664141850059, 1.1090506413993155], "gaussian_params_": [[7.429997468365524, 0.4827260070366258, 0.2905815941446462], [9.291285221510742, 0.5493318771030605, 0.6517343668096652], [11.40412008048627, 0.46156434292096665, 0.335958899553541], [18.224821098584176, 0.11754031372964657, 3.0198443480545145], [24.129788074427324, 0.16744887060513164, 0.5301341762050116], [27.779493590522787, 0.18435886508377064, 0.9328483974118013], [41.60180718742698, 0.16078401728853461, 1.5584861688491316], [59.6144413596319, 0.13562812597724722, 0.9502706657191479]], "peak_params_": [[7.429997468365524, 0.16276559787704356, 0.5811631882892924], [9.291285221510742, 0.4982237473257202, 1.3034687336193305], [11.40412008048627, 0.24827725479950138, 0.671917799107082], [18.224821098584176, 0.11721503157766111, 6.039688696109029], [24.129788074427324, 0.18143578529556215, 1.0602683524100232], [27.779493590522787, 0.1799031912571255, 1.8656967948236025], [41.60180718742698, 0.1556207407227188, 3.116972337698263], [59.6144413596319, 0.12491157455958302, 1.9005413314382957]], "r_squared_": 0.9880512953408118, "error_": 0.03659803858031465}
{"freq_range": [2.0, 80.0], "freq_res": 1.0, "aperiodic_params_": [0.5122164081245603, 0.8445221512992346], "gaussian_params_": [[9.338340077705535, 0.3054730310152869, 0.7504240724285418], [16.998301373007834, 0.2021617006291802, 1.4421616974013693], [21.06554618895401, 0.3118712886211198, 1.7535649444133996], [24.31926735459647, 0.23974084984923513, 0.8228162943229165], [27.42364397126653, 1.0499666081277148, 0.25561227724281477], [29.542447887135634, 0.24972728229305993, 3.1531319265574727], [43.02570734512389, 0.21234691419862725, 5.999999999999999]], "peak_params_": [[9.338340077705535, 0.27595064555111853, 1.5008481448570836], [16.998301373007834, 0.22349159239651056, 2.8843233948027387], [21.06554618895401, 0.32264139145558723, 3.507129888826799], [24.31926735459647, 0.3539202508886196, 1.645632588645833], [27.42364397126653, 0.45450997732814763, 0.5112245544856295], [29.542447887135634, 0.26723238506138547, 6.306263853114945], [43.02570734512389, 0.21237263193066425, 11.999999999999998]], "r_squared_": 0.9670620984398931, "error_": 0.049185293998907836}
{"freq_range": [2.0, 80.0], "freq_res": 1.0, "aperiodic_params_": [0.06104193226956106, 0.3962501324739082], "gaussian_params_": [[18.755487239187822, 0.3653770890250469, 4.322972431964594], [23.89606779881021, 0.1626014048192157, 0.6130300949481422], [28.146975217683227, 0.3645194839672497, 5.999999999999999], [43.66840432018227, 0.28031728546632134, 5.999999999999999]], "peak_params_": [[18.755487239187822, 0.4788914625167345, 8.645944863929188], [23.89606779881021, 0.6236962018687112, 1.2260601898962844], [28.146975217683227, 0.41080466926949627, 11.999999999999998], [43.66840432018227, 0.2910017714246865, 11.999999999999998]], "r_squared_": 0.9076602544937655, "error_": 0.06323489382936669}
{"freq_range": [2.0, 80.0], "freq_res": 1.0, "aperiodic_params_": [0.14597846385835564, 0.4537000302396742], "gaussian_params_": [[20.43387325919732, 0.4925685079583807, 4.274115882517955], [29.44375775775769, 0.20194101676711682, 1.250180796145724], [31.825544517254524, 0.23415267289848593, 0.7082513251123395], [35.3052613630186, 0.295976667789519, 1.2786676072458627], [38.62769480905657, 0.23022430638036365, 0.7757055938198358], [42.745711067179876, 0.25946908428197873, 1.9277589583327543], [51.8196000117228, 0.11378463770210935, 5.999999999999999]], "peak_params_": [[20.43387325919732, 0.4900372509437, 8.54823176503591], [29.44375775775769, 0.25588303219929065, 2.500361592291448], [31.825544517254524, 0.27574518924534314, 1.416502650224679], [35.3052613630186, 0.291484559328928, 2.5573352144917254], [38.62769480905657, 0.2606666016461524, 1.5514111876396717], [42.745711067179876, 0.2958491168756062, 3.8555179166655087], [51.8196000117228, 0.11373578812009522, 11.999999999999998]], "r_squared_": 0.9266582147951339, "error_": 0.05229300450182595}
{"freq_range": [2.0, 80.0], "freq_res": 1.0, "aperiodic_params_": [0.24327773556120286, 0.5247042647522239], "gaussian_params_": [[16.38397071617746, 0.28319876131810523, 0.7645156468485828], [21.04851594249056, 0.4998472893518215, 3.746747301894052], [29.340201151818967, 0.27287052713185955, 1.3586720357935962], [31.931564631729156, 0.25902909194316254, 0.752444432509962], [35.18069521881998, 0.36403198353510585, 1.1196602359659626], [38.63411786851706, 0.28332610207700326, 1.126435442798958], [43.28958643369277, 0.32157828736833316, 1.9093421828128743], [47.52724976894449, 0.8385167658301045, 0.2656514888261247], [49.52379979306841, 1.251960222649441, 0.2599153992870242], [57.74603063925188, 0.11590195294434935, 3.623518019555602]], "peak_params_": [[16.38397071617746, 0.4512859955923887, 1.5290312936971655], [21.04851594249056, 0.4998053911777228, 7.493494603788104], [29.340201151818967, 0.3171614917991222, 2.7173440715871924], [31.931564631729156, 0.3115321594539346, 1.504888865019924], [35.18069521881998, 0.3615020097859385, 2.2393204719319253], [38.63411786851706, 0.2956345279827629, 2.252870885597916], [43.28958643369277, 0.3180851721116509, 3.8186843656257485], [47.52724976894449, 0.19056352466131926, 0.5313029776522494], [49.52379979306841, 0.24618126641019955, 0.5198307985740483], [57.74603063925188, 0.11561761861272934, 7.247036039111204]], "r_squared_": 0.9531078685645084, "error_": 0.040608525960388775}
{"freq_range": [2.0, 80.0], "freq_res": 1.0, "aperiodic_params_": [0.6273890440777186, 0.9222935060986739], "gaussian_params_": [[9.331188711165252, 0.33111022432510323, 0.772597184782218], [11.176496737610087, 0.2698138412724687, 0.2500011853866117], [16.591764932205443, 0.27982565330531833, 0.9329182082948982], [21.57963545182013, 0.2499826453694461, 2.3727412901533724], [24.588633538712287, 0.653861218978558, 0.25138699789561514], [27.456210581230064, 0.8349082344515645, 0.26283551769417146], [29.434617622565273, 0.43160065113306995, 0.43189425075132915], [31.663390902273, 0.18323333290861107, 0.6719965155130763], [35.1577447689604, 0.23518801511005274, 0.889210895218505], [38.10273024043647, 0.11662592478950864, 1.1474925163457916], [43.2136220851604, 0.17825637151492033, 3.6720733441524747], [49.54309410593135, 1.025316795827559, 0.25266320775025936], [54.57478087320454, 0.2204264107921262, 0.42149295030757256], [59.650765777664, 0.22879625096013592, 0.7174168652717714], [64.15259798748617, 0.1529696713267163, 0.5431905987446055]], "peak_params_": [[9.331188711165252, 0.3020441751975138, 1.545194369564436], [11.176496737610087, 0.2424355169746307, 0.5000023707732234], [16.591764932205443, 0.2930895781488524, 1.8658364165897965], [21.57963545182013, 0.24609017605801708, 4.745482580306745], [24.588633538712287, 0.25984940500555115, 0.5027739957912303], [27.456210581230064, 0.20351513856106707, 0.5256710353883429], [29.434617622565273, 0.2621789503718381, 0.8637885015026583], [31.663390902273, 0.16375802554278385, 1.3439930310261525], [35.1577447689604, 0.24914030120588349, 1.77842179043701], [38.10273024043647, 0.1826408329833702, 2.2949850326915833], [43.2136220851604, 0.17796792100927916, 7.344146688304949], [49.54309410593135, 0.23218478545213017, 0.5053264155005187], [54.57478087320454, 0.13354602908051583, 0.8429859006151451], [59.650765777664, 0.2032370640122808, 1.4348337305435428], [64.15259798748617, 0.14705097208623852, 1.086381197489211]], "r_squared_": 0.9843057627585415, "error_": 0.02941260089254181}
{"freq_range": [2.0, 80.0], "freq_res": 1.0, "aperiodic_params_": [0.9233988922682426, 1.3041915563009012], "gaussian_params_": [[7.355863350011391, 0.5407400188407406, 0.27427689819411966], [8.749755771225411, 0.48618010973578396, 0.5014871637811026], [10.65473954155316, 0.4309979751726987, 0.9365078856442292], [13.756760787778324, 0.17844610022306848, 0.9734458086636772], [16.60659185631603, 0.30132853620458117, 0.7800675235923803], [52.29292943771168, 0.3325059060601881, 0.2563991548830256], [59.452420812537596, 0.6264896725281578, 0.26757091244036285], [68.7286430653145, 0.08779389911951115, 5.999999999999999], [72.963699736956, 0.10891165496079677, 0.2500000000000106]], "peak_params_": [[7.355863350011391, 0.23436349959585823, 0.5485537963882393], [8.749755771225411, 0.5197436239982688, 1.0029743275622052], [10.65473954155316, 0.4059377346469954, 1.8730157712884583], [13.756760787778324, 0.17482566952463435, 1.9468916173273545], [16.60659185631603, 0.26603808337055185, 1.5601350471847606], [52.29292943771168, 0.17492924744927474, 0.5127983097660512], [59.452420812537596, 0.17358428696161243, 0.5351418248807257], [68.7286430653145, 0.08770415796915332, 11.999999999999998], [72.963699736956, 0.17591174824085365, 0.5000000000000212]], "r_squared_": 0.9873777107188917, "error_": 0.04495339513418304}
{"freq_range": [2.0, 80.0], "freq_res": 1.0, "aperiodic_params_": [0.8455936461884355, 1.23489870958383], "gaussian_params_": [[7.150113022296035, 0.16063922754613055, 0.25023172562551227], [8.922272872678665, 0.35079587588355127, 0.6014868112770343], [10.7166539298059, 0.3167626294361898, 2.028363407634965], [16.562317076438127, 0.29606714004773355, 0.49591762180334936], [52.37225167994807, 0.48736022962155506, 0.2509041408934381], [59.4553543547203, 0.886886181979155, 0.2537778263835507], [72.89435486260324, 0.15985125852785212, 0.45043272741225915]], "peak_params_": [[7.150113022296035, 0.19542068236586735, 0.5004634512510245], [8.922272872678665, 0.569289925150547, 1.2029736225540686], [10.7166539298059, 0.3145864953745268, 4.05672681526993], [16.562317076438127, 0.20317334955355199, 0.9918352436066987], [52.37225167994807, 0.1621315716935201, 0.5018082817868762], [59.4553543547203, 0.17731977640279317, 0.5075556527671014], [72.89435486260324, 0.1555144894059255, 0.9008654548245183]], "r_squared_": 0.9869156413654959, "error_": 0.04428066639666731}
{"freq_range": [2.0, 80.0], "freq_res": 1.0, "aperiodic_params_": [0.7398043225840317, 1.1198392770437975], "gaussian_params_": [[9.044484388109105, 0.3116657092251649, 0.563028201096787], [10.097924915455284, 0.3012946920560034, 1.9405503385386436], [24.128004915273074, 0.1455181098580781, 0.5243518976350877], [27.442340442355043, 0.8303693965165116, 0.25485773241317083], [42.54796540086322, 0.0870886197176642, 5.999999999996305], [52.44231732326137, 0.7046770182795993, 0.2539326636736386], [59.67875060459137, 0.1536179123385149, 1.0030521168753763]], "peak_params_": [[9.044484388109105, 0.5674270994488605, 1.126056402193574], [10.097924915455284, 0.3747480325777812, 3.881100677077287], [24.128004915273074, 0.14197856837260814, 1.0487037952701754], [27.442340442355043, 0.18716475556171497, 0.5097154648263417], [42.54796540086322, 0.08684181346970443, 11.99999999999261], [52.44231732326137, 0.17975684336978048, 0.5078653273472772], [59.67875060459137, 0.1472050390953259, 2.0061042337507526]], "r_squared_": 0.9804799110083289, "error_": 0.049376412447651626}
{"freq_range": [2.0, 80.0], "freq_res": 1.0, "aperiodic_params_": [0.4865360594429184, 0.7802904658529578], "gaussian_params_": [[9.16838844416553, 0.4963086355221273, 0.7549733937220883], [11.315270430532252, 0.2706096735745559, 0.31415946748514323], [20.619960151807092, 0.21591855684345565, 4.2154217702969365], [27.341373151090835, 0.4424997878747487, 0.25187407276613766], [30.97466877488038, 0.17473697751814, 2.476217648744002], [42.87138586127941, 0.1760708044955562, 5.999999999999999], [63.942225070422815, 0.1623909705752767, 0.25003906433420825]], "peak_params_": [[9.16838844416553, 0.48895006212862924, 1.5099467874441765], [11.315270430532252, 0.20568852046954075, 0.6283189349702865], [20.619960151807092, 0.2153244503505397, 8.430843540593873], [27.341373151090835, 0.29881210774629025, 0.5037481455322753], [30.97466877488038, 0.21000903318336944, 4.952435297488004], [42.87138586127941, 0.17603184331829014, 11.999999999999998], [63.942225070422815, 0.15847049534706337, 0.5000781286684165]], "r_squared_": 0.954830690174062, "error_": 0.050188577472397695}
{"freq_range": [2.0, 80.0], "freq_res": 1.0, "aperiodic_params_": [0.25121363132085434, 0.6010577685835329], "gaussian_params_": [[9.290898042438966, 0.5066889614482482, 0.68807450233254], [15.96732384911981, 0.1930020807887407, 0.5908961888606127], [26.19064366441289, 0.31622029840118393, 2.4987139611320512], [30.499236238930845, 1.0268022985113723, 0.25259323447608084], [48.547965400850416, 0.11789895743272524, 5.999999999999999]], "peak_params_": [[9.290898042438966, 0.46337173177815744, 1.37614900466508], [15.96732384911981, 0.1927845535101495, 1.1817923777212254], [26.19064366441289, 0.31540236906482955, 4.9974279222641025], [30.499236238930845, 0.24554115063278636, 0.5051864689521617], [48.547965400850416, 0.11756483571374177, 11.999999999999998]], "r_squared_": 0.9297087323194495, "error_": 0.050378079672642455}
{"freq_range": [2.0, 80.0], "freq_res": 1.0, "aperiodic_params_": [-0.5668762049181291, 0.3651893817439902], "gaussian_params_": [[10.577907836327945, 0.20104312230836902, 1.3631043492315125], [24.04190890798764, 0.19013683397181674, 4.220105494505153], [31.342165062026606, 0.4848726422430378, 0.2520073254974031], [35.8806787588105, 0.2040928140096115, 2.1004400484875028], [40.442877717599025, 0.5045053067123485, 0.25057205022299833], [44.105505233921896, 0.20597607005946178, 3.2791015857942347], [49.643275017313364, 0.19976469662220994, 0.5576330404703351], [51.61406879015649, 0.3713006574308533, 0.33605298653718263], [53.63427569347787, 0.5100181217667682, 0.26189593529248884], [58.26999347322826, 0.11081417693905266, 2.87564166607195]], "peak_params_": [[10.577907836327945, 0.19323571071806256, 2.726208698463025], [24.04190890798764, 0.19012748298838256, 8.440210989010305], [31.342165062026606, 0.25551977333904674, 0.5040146509948062], [35.8806787588105, 0.2169011361933163, 4.2008800969750055], [40.442877717599025, 0.22984902059234824, 0.5011441004459967], [44.105505233921896, 0.20598880518866935, 6.558203171588469], [49.643275017313364, 0.20551576511354863, 1.1152660809406703], [51.61406879015649, 0.2136832288883702, 0.6721059730743653], [53.63427569347787, 0.23133639156801045, 0.5237918705849777], [58.26999347322826, 0.110352824843857, 5.7512833321439]], "r_squared_": 0.881240313681942, "error_": 0.039659944967768784}
{"freq_range": [2.0, 80.0], "freq_res": 1.0, "aperiodic_params_": [0.16203263111233623, 0.36338295671178733], "gaussian_params_": [[19.986969577829957, 0.5727783749831293, 4.74860899459772], [34.567847584707465, 0.4324985393825219, 5.999999999999999], [43.182234051879874, 0.2308909101717602, 0.572427781388487], [45.91292883116372, 0.21695096102116027, 1.1481331667936872], [49.328907497349036, 0.3028245456629167, 0.8685352298304045]], "peak_params_": [[19.986969577829957, 0.5954690396964748, 9.49721798919544], [34.567847584707465, 0.43524623671139245, 11.999999999999998], [43.182234051879874, 0.38927453904457693, 1.144855562776974], [45.91292883116372, 0.28693832713623796, 2.2962663335873743], [49.328907497349036, 0.3116797605241865, 1.737070459660809]], "r_squared_": 0.9008879035533194, "error_": 0.06770287680313809}
{"freq_range": [2.0, 80.0], "freq_res": 1.0, "aperiodic_params_": [0.6048515945279054, 0.8815541241972777], "gaussian_params_": [[9.717676228014213, 0.4234844119593401, 1.3167128370184642], [11.622778258135838, 2.0487376059268243e-29, 0.5838386583063536], [13.55289854387816, 0.5885781057096442, 0.2650342424375181], [16.5316994914121, 0.6141682687131572, 0.2821693247769795], [24.600931016918246, 0.15356182807897137, 2.6325092579356792], [29.392076232415146, 0.5411656986445624, 0.25963132249506116], [35.17700122836777, 0.11914313990450016, 0.7642200396563834], [38.19161768252091, 0.13549673980938146, 2.2556070369713144], [42.49531050709997, 0.6364712288797605, 0.29260276371264615], [44.427548368874625, 0.45853624159914125, 0.3068400197941099], [49.576794726941266, 0.8071198077665179, 0.26302224787777884], [52.439733450115064, 0.8029353903595734, 0.26568254959687976], [54.5537859846012, 0.7442945860945678, 0.268458295865385], [59.48617742850979, 0.8644299096127246, 0.2747047634834941], [64.0193492527873, 0.1737941457967377, 0.7860796313693454]], "peak_params_": [[9.717676228014213, 0.4138608303296966, 2.6334256740369284], [11.622778258135838, 0.09428137032032269, 1.1676773166127072], [13.55289854387816, 0.14403800092872587, 0.5300684848750362], [16.5316994914121, 0.1573204018439816, 0.564338649553959], [24.600931016918246, 0.15180748111352, 5.2650185158713585], [29.392076232415146, 0.21107841027469354, 0.5192626449901223], [35.17700122836777, 0.1658458886814378, 1.5284400793127668], [38.19161768252091, 0.1351387824496324, 4.511214073942629], [42.49531050709997, 0.18447247165918512, 0.5852055274252923], [44.427548368874625, 0.1786111242802484, 0.6136800395882198], [49.576794726941266, 0.2211889149849332, 0.5260444957555577], [52.439733450115064, 0.20409430308713117, 0.5313650991937595], [54.5537859846012, 0.1869965177791556, 0.53691659173077], [59.48617742850979, 0.18053820056491454, 0.5494095269669882], [64.0193492527873, 0.1737415035185278, 1.5721592627386909]], "r_squared_": 0.976759852650752, "error_": 0.03514294574898359}
{"freq_range": [2.0, 80.0], "freq_res": 1.0, "aperiodic_params_": [0.8236266868969739, 1.2755864968488793], "gaussian_params_": [[7.491961438991474, 1.0742583575390126, 0.2731529568409441], [9.302453271909961, 0.5859219737009345, 0.5782826189455305], [11.115795236528582, 0.485131842199706, 0.8467678408576123], [13.826462050691534, 0.31351625461211075, 0.7756026351665753], [16.52461075222402, 1.040614962948041, 0.27002556576789943], [43.045363562785184, 0.11286380036968145, 2.9953580216952242], [49.571292524604175, 0.5626640754405247, 0.2592152632571946], [52.27538617772833, 0.385169804326418, 0.2500054008915559], [59.90105295837769, 0.12115155477745249, 1.1685020927953649], [64.4058524764134, 0.6451230332385308, 0.2500152381641935]], "peak_params_": [[7.491961438991474, 0.21240894114811038, 0.5463059136818882], [9.302453271909961, 0.5324078725059049, 1.156565237891061], [11.115795236528582, 0.48890886998342836, 1.6935356817152245], [13.826462050691534, 0.3072334727772057, 1.5512052703331507], [16.52461075222402, 0.22099834233928684, 0.5400511315357989], [43.045363562785184, 0.11285085791640204, 5.9907160433904485], [49.571292524604175, 0.1509351784556372, 0.5184305265143891], [52.27538617772833, 0.21127338391243544, 0.5000108017831117], [59.90105295837769, 0.12071798912545706, 2.3370041855907298], [64.4058524764134, 0.17301236627310423, 0.500030476328387]], "r_squared_": 0.9891666528988828, "error_": 0.040117422820941294}
{"freq_range": [2.0, 80.0], "freq_res": 1.0, "aperiodic_params_": [0.7554084483662773, 1.2348517166924962], "gaussian_params_": [[7.520697726536989, 0.8768162070452198, 0.2872304701841655], [9.3852725199618, 0.7632502717160288, 0.6084686103630834], [11.463598303716447, 0.8184317396324723, 0.3758408637643351], [13.645619952602521, 0.2699320594383331, 0.6834517028486511], [24.029385739691595, 0.1606428819536513, 0.2500000000324919], [45.01348236814555, 0.1251877568237722, 4.24704185289554], [52.354883799164654, 0.4322577755533513, 0.260910007320573], [59.190191883203276, 0.12720582333388933, 2.625840956435266], [68.09677748380088, 0.1561012403000425, 1.7035993306882111], [72.65356517863898, 0.20137690464402433, 0.556228365731227], [78.1709640805085, 0.1298185853304676, 1.747489948723185]], "peak_params_": [[7.520697726536989, 0.27506378139681964, 0.574460940368331], [9.3852725199618, 0.6246100352403637, 1.2169372207261668], [11.463598303716447, 0.4051784815142525, 0.7516817275286702], [13.645619952602521, 0.23597864813524638, 1.3669034056973022], [24.029385739691595, 0.15953756226027993, 0.5000000000649838], [45.01348236814555, 0.12518718396601614, 8.49408370579108], [52.354883799164654, 0.20674583139713398, 0.521820014641146], [59.190191883203276, 0.1274254121385774, 5.251681912870532], [68.09677748380088, 0.15630695629147806, 3.4071986613764222], [72.65356517863898, 0.16998287622031438, 1.112456731462454], [78.1709640805085, 0.12919879694990422, 3.49497989744637]], "r_squared_": 0.9872547188913373, "error_": 0.03942612217482618}
{"freq_range": [2.0, 80.0], "freq_res": 1.0, "aperiodic_params_": [0.1398224185486415, 0.3780716347647956], "gaussian_params_": [[9.428352882495815, 0.897632071186854, 0.30049736174745034], [16.11117352435894, 0.359966403938757, 2.476443165637862], [21.15864255865254, 0.27978650852422, 1.2122825322370228], [26.98311919434585, 0.07867454999764274, 0.25000880624932803], [31.294334939003242, 0.34730545467740753, 5.999999999999993], [44.91430449827508, 0.1890406703808097, 5.999999996884699], [57.01170161074724, 0.13062045872466593, 2.8160820151003954], [61.58722127339716, 0.5841949044768213, 0.2693353140433564]], "peak_params_": [[9.428352882495815, 0.331159944266083, 0.6009947234949007], [16.11117352435894, 0.37312037864265996, 4.952886331275724], [21.15864255865254, 0.40846050733034245, 2.4245650644740455], [26.98311919434585, 0.3495414856153995, 0.5000176124986561], [31.294334939003242, 0.35973294052346244, 11.999999999999986], [44.91430449827508, 0.2146014972209498, 11.999999993769398], [57.01170161074724, 0.15551608881293078, 5.632164030200791], [61.58722127339716, 0.21100333721996778, 0.5386706280867128]], "r_squared_": 0.8677443919275568, "error_": 0.05937730861602249}
{"freq_range": [2.0, 80.0], "freq_res": 1.0, "aperiodic_params_": [-0.12249882290817794, 0.30964265423161486], "gaussian_params_": [[16.538595431449288, 0.31294133793457773, 3.568885765601977], [28.713314249549683, 0.4318619170722862, 5.999999996983894], [41.35224363250144, 0.2206288997509512, 2.797837061092525], [46.06637740511115, 0.1416245102474158, 0.25000005914751333], [53.24185320688242, 0.16882010222882157, 5.999999999999999]], "peak_params_": [[16.538595431449288, 0.3745704700966746, 7.137771531203954], [28.713314249549683, 0.43213506110988026, 11.999999993967789], [41.35224363250144, 0.29300675949803334, 5.59567412218505], [46.06637740511115, 0.2805287537768729, 0.5000001182950267], [53.24185320688242, 0.16884057302033073, 11.999999999999998]], "r_squared_": 0.869396607751997, "error_": 0.060165983498551893}
{"freq_range": [2.0, 80.0], "freq_res": 1.0, "aperiodic_params_": [0.12560181764525713, 0.4801772358154502], "gaussian_params_": [[9.473340395543353, 1.012257278736004, 0.2894856593458352], [23.064622451681377, 0.2590600423594478, 5.2731637161966916], [28.85025763450845, 0.18008558447287012, 0.5272317104124437], [30.894591014169283, 0.17442475421851036, 0.25000212422216567], [36.437327399335906, 0.27156581006827585, 2.015340509441094], [40.44542975814797, 0.9422149008932061, 0.2824689521467352], [44.509888728451756, 0.19614861840271697, 1.6412690369862895], [53.05535013966117, 0.17715709409966862, 5.999999999999999]], "peak_params_": [[9.473340395543353, 0.273297015309817, 0.5789713186916704], [23.064622451681377, 0.2590412201987213, 10.546327432393383], [28.85025763450845, 0.3108193939170719, 1.0544634208248873], [30.894591014169283, 0.25046528198792906, 0.5000042484443313], [36.437327399335906, 0.28114975239241535, 4.030681018882188], [40.44542975814797, 0.3512734609723274, 0.5649379042934703], [44.509888728451756, 0.2596111962535694, 3.282538073972579], [53.05535013966117, 0.1771498855244762, 11.999999999999998]], "r_squared_": 0.8836034709714001, "error_": 0.049126994218472504}
{"freq_range": [2.0, 80.0], "freq_res": 1.0, "aperiodic_params_": [0.4053139037291476, 1.006918550224565], "gaussian_params_": [[9.482675227769061, 0.4790488192395662, 0.7134662401821733], [11.517786557988824, 0.862329184579734, 0.32893136185023053], [13.56503253596308, 1.0060186620606169, 0.2527986848462935], [24.071898415383263, 0.17036170279145793, 0.5268342475333366], [30.547652683823337, 0.45940720936814067, 0.2910230617928691], [36.05209659204895, 0.17794031117482748, 0.81205833006074], [42.634981515924025, 0.1844461579518231, 3.1280284408745263], [52.04272387235699, 0.0942199537839804, 3.5806628995943472], [61.2186027561348, 0.14820595698415714, 1.6332502559343978]], "peak_params_": [[9.482675227769061, 0.38106191304390635, 1.4269324803643466], [11.517786557988824, 0.2953838646154251, 0.6578627237004611], [13.56503253596308, 0.22895140911785827, 0.505597369692587], [24.071898415383263, 0.1687825977091224, 1.0536684950666733], [30.547652683823337, 0.137453813685133, 0.5820461235857382], [36.05209659204895, 0.19702661825560774, 1.62411666012148], [42.634981515924025, 0.1870780611756726, 6.2560568817490525], [52.04272387235699, 0.09630005172726563, 7.1613257991886945], [61.2186027561348, 0.15100789172010076, 3.2665005118687955]], "r_squared_": 0.976060873313262, "error_": 0.03952744953718508}
{"freq_range": [2.0, 80.0], "freq_res": 1.0, "aperiodic_params_": [0.22440818195080686, 0.7948493720947571], "gaussian_params_": [[9.144042916301938, 0.3080488597753448, 0.6492026503845976], [11.548614165619727, 0.21365195618933253, 1.7384345179056617], [34.91377035994758, 0.12179741652872784, 5.999999999999436], [36.93757888453726, 0.101761340026683, 0.25065403107127565], [48.09592895689919, 0.10458906157459544, 5.999999999999999], [61.581865801621774, 0.7411171190416977, 0.29265759772897754], [67.69569842346985, 0.23939238582787503, 0.3513918280013691]], "peak_params_": [[9.144042916301938, 0.373515209973975, 1.2984053007691951], [11.548614165619727, 0.2066721941008164, 3.4768690358113234], [34.91377035994758, 0.13144536332112522, 11.999999999998872], [36.93757888453726, 0.23222390747141897, 0.5013080621425513], [48.09592895689919, 0.11586544410161137, 11.999999999999998], [61.581865801621774, 0.2742057818088768, 0.5853151954579551], [67.69569842346985, 0.16496340097532025, 0.7027836560027382]], "r_squared_": 0.9401744394908393, "error_": 0.049729571066272}
{"freq_range": [2.0, 80.0], "freq_res": 1.0, "aperiodic_params_": [-0.6396941167750076, 0.5221473564962448], "gaussian_params_": [[10.528271727088443, 0.2631422574328993, 0.978600972989048], [13.017283245549846, 0.22241451242352242, 0.7178306994601429], [24.47055804910979, 0.3277886428703301, 2.562255983237715], [29.46540220007841, 0.4962344169412603, 0.28942305170425275], [31.439792755075846, 0.1854219740258246, 0.6589493226188541], [33.459045164970924, 0.5115090466112165, 0.33718003689281056], [35.917982161906664, 0.27223884793709346, 0.8838425867082514], [40.49648588030683, 0.563830865815369, 0.29637548438076833], [44.99300325315528, 0.08618939116842371, 0.25000000043872483], [45.30727578777882, 0.1687182766532878, 5.999999999999999], [51.95520394247124, 0.14327417009688528, 0.7467991552296283], [56.22885950096066, 0.19086345324975484, 0.621943510293704]], "peak_params_": [[10.528271727088443, 0.23856700563830058, 1.957201945978096], [13.017283245549846, 0.23320120542096157, 1.4356613989202858], [24.47055804910979, 0.3226153818971067, 5.12451196647543], [29.46540220007841, 0.2093090160375466, 0.5788461034085055], [31.439792755075846, 0.17097672505469452, 1.3178986452377082], [33.459045164970924, 0.23675784117944443, 0.6743600737856211], [35.917982161906664, 0.32174050115509467, 1.7676851734165029], [40.49648588030683, 0.2527038671357331, 0.5927509687615367], [44.99300325315528, 0.2546528130461885, 0.5000000008774497], [45.30727578777882, 0.2546528130461885, 11.999999999999998], [51.95520394247124, 0.23358559793914857, 1.4935983104592565], [56.22885950096066, 0.2128449099811085, 1.243887020587408]], "r_squared_": 0.9671609382159765, "error_": 0.029358966094082103}
{"freq_range": [2.0, 80.0], "freq_res": 1.0, "aperiodic_params_": [-0.29850682177867244, 0.7872971932342229], "gaussian_params_": [[6.5054921113252, 0.5857097218219192, 0.2974745957260863], [9.152252423117332, 0.2709316774110968, 0.6499368446901933], [20.419303533301463, 0.44002748231903754, 0.2701746090854751], [23.534823037874546, 0.5698220483372303, 0.29608711875154503], [26.538927028546258, 0.1647269089493494, 3.3466782603930127], [36.088617486876906, 0.15366487065208737, 0.9291370812974392], [46.521908752310395, 0.19652913571847924, 5.999999999999999], [55.88092157426277, 0.11144866741977302, 0.7341187608112576]], "peak_params_": [[6.5054921113252, 0.14822663327069274, 0.5949491914521726], [9.152252423117332, 0.2635990308925923, 1.2998736893803866], [20.419303533301463, 0.156397775582388, 0.5403492181709502], [23.534823037874546, 0.2895711551405171, 0.5921742375030901], [26.538927028546258, 0.16415875293940885, 6.6933565207860255], [36.088617486876906, 0.19822818551326193, 1.8582741625948784], [46.521908752310395, 0.19590622474282116, 11.999999999999998], [55.88092157426277, 0.166428459364808, 1.4682375216225152]], "r_squared_": 0.9740410626361066, "error_": 0.038647379003015424}
{"freq_range": [2.0, 80.0], "freq_res": 1.0, "aperiodic_params_": [-0.26884514620608563, 0.8264557971626537], "gaussian_params_": [[9.463557955305149, 0.6538729363998942, 0.2944363036870578], [20.477013993393715, 0.6523294755324867, 0.2781094397261362], [23.907690161918932, 0.27352287698924055, 1.2942802376916662], [26.56299615337643, 0.3884493156434225, 0.38941101633649305], [30.65294556815543, 0.20520314073849366, 2.201292641327715], [36.04107010306224, 0.24760224093468491, 1.317772469839191], [41.277951657392, 0.18061561906020146, 1.3276492280127152], [45.65476622164515, 0.1595377884981153, 3.066572962881925], [49.98789318353913, 0.1546157753910105, 0.59473240477423], [52.36136591671469, 0.5500938410022761, 0.33726202819710954], [56.015504208676134, 0.18654322243759408, 1.2128611127656586], [58.96221156167382, 0.14352524150782567, 0.2500000000119697]], "peak_params_": [[9.463557955305149, 0.18934278715476383, 0.5888726073741156], [20.477013993393715, 0.15271294318522877, 0.5562188794522724], [23.907690161918932, 0.2749597085290747, 2.5885604753833324], [26.56299615337643, 0.2744910924358097, 0.7788220326729861], [30.65294556815543, 0.20283488581884068, 4.40258528265543], [36.04107010306224, 0.2594106538233367, 2.635544939678382], [41.277951657392, 0.22732577567506618, 2.6552984560254305], [45.65476622164515, 0.15885343900486415, 6.13314592576385], [49.98789318353913, 0.21304691945819076, 1.18946480954846], [52.36136591671469, 0.32988280477555687, 0.6745240563942191], [56.015504208676134, 0.1870669301314669, 2.425722225531317], [58.96221156167382, 0.15094245173203236, 0.5000000000239394]], "r_squared_": 0.9854624669371197, "error_": 0.025741006137856178}
{"freq_range": [2.0, 80.0], "freq_res": 1.0, "aperiodic_params_": [-0.3014897586393771, 0.8140694334191185], "gaussian_params_": [[6.370119099991785, 0.38429744002302485, 0.29966074567321555], [9.241518077398663, 0.30962282340550246, 0.7128939588167433], [20.748447222426083, 0.13642292143795517, 0.8485385262656885], [23.567777478829893, 0.5156225037186448, 0.3231380603498066], [26.87674656705467, 0.16587310403598385, 3.1282045732294304], [35.47724234117296, 0.17118912966966685, 0.8875447521924125], [37.39120375136822, 0.24356607209536535, 0.32191087372350013], [42.76073924963312, 0.19707041936655098, 2.7265669772501995], [49.36300254731995, 0.20504261577041638, 0.9612166304389702], [51.91756130330455, 0.23010923886992757, 0.7850485330746458], [55.95466675121607, 0.1629105623667637, 1.0037670903981233], [67.86890494860589, 0.16470969373780447, 0.5041427650832805]], "peak_params_": [[6.370119099991785, 0.17923599634814602, 0.5993214913464311], [9.241518077398663, 0.29235450509540983, 1.4257879176334867], [20.748447222426083, 0.15896375129883733, 1.697077052531377], [23.567777478829893, 0.31954535777764104, 0.6462761206996132], [26.87674656705467, 0.16574441300648868, 6.256409146458861], [35.47724234117296, 0.15727225890244445, 1.775089504384825], [37.39120375136822, 0.17771274118431757, 0.6438217474470003], [42.76073924963312, 0.19631340503744643, 5.453133954500399], [49.36300254731995, 0.20553389042376247, 1.9224332608779404], [51.91756130330455, 0.2343054185714235, 1.5700970661492917], [55.95466675121607, 0.16274630677025526, 2.0075341807962466], [67.86890494860589, 0.15923406768268267, 1.008285530166561]], "r_squared_": 0.9768490300045075, "error_": 0.03458519415236967}
