{"freq_range": [2.0, 80.0], "freq_res": 1.0, "aperiodic_params_": [0.9950230854251331, 1.5260420674451083], "gaussian_params_": [[9.359087501608698, 1.0034817343466886, 1.5422238934862738], [15.244196383906301, 0.20386282915459913, 1.3781277211207303], [19.506395023468386, 0.4851603026769184, 4.844235812054642]], "peak_params_": [[9.359087501608698, 1.0228326622475907, 3.0844477869725475], [15.244196383906301, 0.5166890257187824, 2.7562554422414607], [19.506395023468386, 0.483177097722126, 9.688471624109283]], "r_squared_": 0.9908038012376451, "error_": 0.04967990727755421}
{"freq_range": [2.0, 80.0], "freq_res": 1.0, "aperiodic_params_": [1.058148465615742, 0.9211396040640604], "gaussian_params_": [[8.777504971795407, 0.4122821943967745, 0.6535030279203476], [10.42250939341363, 1.0370747691893054, 0.303884016718367], [18.949273549469737, 0.24284492816631156, 2.419333809423431], [34.463007973639215, 0.8188567322076217, 0.27038368924692663], [39.45203459913603, 0.6507035761849844, 0.2500000000013492], [41.54796540086405, 0.09718840014431336, 5.999999999976411], [54.510351975248724, 1.0195027116634676, 0.2579771878752173], [59.65294952212118, 0.3002456894746221, 0.25001966205897347], [65.70279785723613, 0.08884072234428123, 5.999999999999998]], "peak_params_": [[8.777504971795407, 0.38913607790961946, 1.3070060558406953], [10.42250939341363, 0.46641715317855426, 0.607768033436734], [18.949273549469737, 0.2428749124430719, 4.838667618846862], [34.463007973639215, 0.23304980311894474, 0.5407673784938533], [39.45203459913603, 0.2157095149460425, 0.5000000000026984], [41.54796540086405, 0.09694926022680644, 11.999999999952822], [54.510351975248724, 0.19428282661436858, 0.5159543757504346], [59.65294952212118, 0.1719819783389966, 0.5000393241179469], [65.70279785723613, 0.08875585183058332, 11.999999999999996]], "r_squared_": 0.9803499138724088, "error_": 0.03825213739985631}
{"freq_range": [2.0, 80.0], "freq_res": 1.0, "aperiodic_params_": [0.8219060397050281, 1.3546097132066728], "gaussian_params_": [[4.92135579007014, 0.24340012911281073, 0.25040579414127745], [9.376492127159118, 1.0086152779824267, 1.5882541205771288], [14.8493621190645, 0.3575691833578669, 1.5290465074703108], [20.10710421877404, 0.4487082274175255, 3.5326386563760717]], "peak_params_": [[4.92135579007014, 0.2543778541420587, 0.5008115882825549], [9.376492127159118, 0.9841105559203872, 3.1765082411542576], [14.8493621190645, 0.5155552967119842, 3.0580930149406216], [20.10710421877404, 0.44973059597647297, 7.065277312752143]], "r_squared_": 0.9904742853305942, "error_": 0.04965752905403508}
{"freq_range": [2.0, 80.0], "freq_res": 1.0, "aperiodic_params_": [1.1567165776375952, 1.615733131109871], "gaussian_params_": [[4.921435461456481, 0.23690945080209322, 0.2504160419566204], [8.374821027108826, 0.7807229184073525, 1.1346450052274724], [10.260208495453224, 0.7544614208451623, 0.7622264097485184], [14.056792837595525, 0.2938948959304007, 2.072640510667157], [19.50658464867213, 0.5415855182477991, 4.30481819051543]], "peak_params_": [[4.921435461456481, 0.23676967570601887, 0.5008320839132409], [8.374821027108826, 0.7678847849323489, 2.2692900104549447], [10.260208495453224, 1.0822184859429378, 1.5244528194970368], [14.056792837595525, 0.5327693095261683, 4.145281021334314], [19.50658464867213, 0.5428562112407693, 8.60963638103086]], "r_squared_": 0.9939758308222687, "error_": 0.04586928386280101}
{"freq_range": [2.0, 80.0], "freq_res": 1.0, "aperiodic_params_": [0.8006233758317023, 1.018552492985581], "gaussian_params_": [[9.466354397354019, 0.7999249959332263, 1.388881747723345], [17.46551572648132, 0.37926297760686206, 3.0920610611218726], [20.608430499130723, 0.558604160140332, 0.2500305797192136], [63.41522678488435, 0.7446766167199985, 0.2608687842905023]], "peak_params_": [[9.466354397354019, 0.7650169953603182, 2.77776349544669], [17.46551572648132, 0.3749894032627213, 6.184122122243745], [20.608430499130723, 0.3612152780464642, 0.5000611594384272], [63.41522678488435, 0.20980609876265133, 0.5217375685810046]], "r_squared_": 0.9798591571961601, "error_": 0.0534020784591557}
{"freq_range": [2.0, 80.0], "freq_res": 1.0, "aperiodic_params_": [0.508928288153843, 1.0009579120053287], "gaussian_params_": [[9.50802557638603, 0.7797196257857092, 1.3486903966221795], [17.714977238461486, 0.31308808321570475, 4.524593162601525], [53.18994519801899, 0.21002499279875766, 0.7012779318054945]], "peak_params_": [[9.50802557638603, 0.8026999979571712, 2.697380793244359], [17.714977238461486, 0.3124674936923856, 9.04918632520305], [53.18994519801899, 0.20246056031353987, 1.402555863610989]], "r_squared_": 0.9818204435958291, "error_": 0.051981240356693395}
{"freq_range": [2.0, 80.0], "freq_res": 1.0, "aperiodic_params_": [0.7012645462521271, 1.0497911640059028], "gaussian_params_": [[5.009837405426218, 0.15134875194212985, 0.25000867861608056], [8.200241847437448, 0.49241554203789367, 0.8357179765354623], [10.034024966480253, 0.738924941406891, 0.7990893141906394], [15.161541575891532, 0.30993874471727273, 1.8209847391048006], [20.655302910822797, 0.35399248191358906, 1.9743584995295047], [24.947967032353397, 0.20362185804464375, 1.7384096364582124], [34.98413027509528, 0.1959855454212313, 0.5493556817699378], [38.29890626631421, 0.19378419712135928, 1.0459198745098244], [43.12649901757374, 0.22364733901646805, 1.6016780192460998], [48.77017298331577, 0.20496227048831445, 1.0150770300859433], [56.39508904027165, 0.13304550216311875, 1.7166489226307164], [63.905075462027796, 0.16643751199665058, 0.5874434598704776]], "peak_params_": [[5.009837405426218, 0.15155389131203842, 0.5000173572321611], [8.200241847437448, 0.507567994489091, 1.6714359530709246], [10.034024966480253, 0.7922813893844383, 1.5981786283812789], [15.161541575891532, 0.31457460082679334, 3.6419694782096013], [20.655302910822797, 0.3659023779479038, 3.9487169990590094], [24.947967032353397, 0.23496953584028535, 3.476819272916425], [34.98413027509528, 0.1972443611010467, 1.0987113635398755], [38.29890626631421, 0.1873637884472471, 2.0918397490196488], [43.12649901757374, 0.22295887520231905, 3.2033560384921995], [48.77017298331577, 0.20005677820252066, 2.0301540601718866], [56.39508904027165, 0.1295680690645482, 3.433297845261433], [63.905075462027796, 0.1642859866269355, 1.1748869197409553]], "r_squared_": 0.990542775294862, "error_": 0.035846632107816606}
{"freq_range": [2.0, 80.0], "freq_res": 1.0, "aperiodic_params_": [0.9760947234795692, 1.2458375262983805], "gaussian_params_": [[4.971257542692887, 0.1979170763851052, 0.25000004029204137], [9.421443548082047, 0.820078959554608, 1.4850168115542677], [14.485057793847925, 0.3793753712139208, 1.1177946964180876], [16.569166278161838, 0.9044115465605422, 0.30341846414352486], [19.880041872741202, 0.4517965183709665, 1.5453056367169025], [23.313736512515668, 0.19802667328676812, 1.3799486136071646], [43.47026516736834, 0.12247426878336556, 5.585453908754547]], "peak_params_": [[4.971257542692887, 0.20636109965731597, 0.5000000805840827], [9.421443548082047, 0.7877124091400822, 2.9700336231085354], [14.485057793847925, 0.3526845933697065, 2.235589392836175], [16.569166278161838, 0.4397839499632236, 0.6068369282870497], [19.880041872741202, 0.46153747725625394, 3.090611273433805], [23.313736512515668, 0.25197723585172666, 2.759897227214329], [43.47026516736834, 0.12204094341388927, 11.170907817509095]], "r_squared_": 0.9897307518699022, "error_": 0.0470160754350033}
{"freq_range": [2.0, 80.0], "freq_res": 1.0, "aperiodic_params_": [1.2847933055238163, 1.647370206476683], "gaussian_params_": [[4.958790212362393, 0.21680224156524452, 0.2501076094819307], [9.24674332407659, 0.8180446430467965, 1.4655387729968306], [17.698377917218107, 0.585512348185312, 5.3978148608289445], [21.052255391261895, 0.08723291450932097, 1.0746804245546098], [23.997525520442945, 0.0943267948258548, 0.2504379432103998]], "peak_params_": [[4.958790212362393, 0.2629600583979439, 0.5002152189638615], [9.24674332407659, 0.9663574122806842, 2.931077545993661], [17.698377917218107, 0.5861444758795541, 10.795629721657889], [21.052255391261895, 0.5727486274829743, 2.1493608491092195], [23.997525520442945, 0.3925482239359386, 0.5008758864207996]], "r_squared_": 0.9925206725588063, "error_": 0.052225226126156855}
{"freq_range": [2.0, 80.0], "freq_res": 1.0, "aperiodic_params_": [1.46781837398953, 1.8087853165549561], "gaussian_params_": [[4.987438962764937, 0.19962838468633312, 0.250000002562913], [9.393207589869187, 0.9461885743196365, 1.601971648872123], [14.865154562354645, 0.22376126907612343, 1.43832069031944], [19.749940376805654, 0.6141258390017815, 5.180958544337714]], "peak_params_": [[4.987438962764937, 0.23207260706850785, 0.500000005125826], [9.393207589869187, 0.9895166859134266, 3.203943297744246], [14.865154562354645, 0.6282517240860738, 2.87664138063888], [19.749940376805654, 0.6137930846806936, 10.361917088675428]], "r_squared_": 0.9921178760068253, "error_": 0.05700063364428053}
{"freq_range": [2.0, 80.0], "freq_res": 1.0, "aperiodic_params_": [1.4775385104952503, 1.8218189930088653], "gaussian_params_": [[9.322220831596738, 0.899436577341078, 1.5567564735150337], [17.179027476104594, 0.5402486390134478, 4.589952042277548], [23.509051597278855, 0.22939889013929832, 5.805278579832623]], "peak_params_": [[9.322220831596738, 1.0009007151165719, 3.1135129470300673], [17.179027476104594, 0.6621923514877747, 9.179904084555096], [23.509051597278855, 0.40766011587277595, 11.610557159665246]], "r_squared_": 0.9924450253619215, "error_": 0.05487270375258552}
{"freq_range": [2.0, 80.0], "freq_res": 1.0, "aperiodic_params_": [1.3892829691301574, 1.7322072174319645], "gaussian_params_": [[7.5277139813207485, 1.577875149507684, 0.275925485265684], [9.723403543947049, 0.8744407964094724, 1.1318114885721202], [16.15664014296084, 0.5147074568818718, 4.166507766131416], [20.75782555463528, 0.18583337660435897, 1.067274535742626], [23.537364988249386, 0.19130077749638835, 0.2739095077909862], [24.452034599135946, 0.2031662056457605, 5.887936387727824]], "peak_params_": [[7.5277139813207485, 0.7188214090227132, 0.551850970531368], [9.723403543947049, 1.0314605775837882, 2.2636229771442404], [16.15664014296084, 0.586862560476994, 8.333015532262833], [20.75782555463528, 0.6140921318262305, 2.134549071485252], [23.537364988249386, 0.33786503595239226, 0.5478190155819724], [24.452034599135946, 0.33786503595239226, 11.775872775455648]], "r_squared_": 0.9935945371294732, "error_": 0.045840915514878726}
{"freq_range": [2.0, 80.0], "freq_res": 1.0, "aperiodic_params_": [1.0535881742122233, 1.3129739344816462], "gaussian_params_": [[9.562195448877604, 0.8187567652786079, 1.5408718819399068], [13.794596071873746, 0.13211921883753533, 0.9439900818216875], [19.04534315540076, 0.4737589437534496, 3.701417487612057], [35.71620554023035, 0.12811061983490088, 5.999999999999999], [38.92646414930592, 0.07282582799655471, 0.25006816489800415]], "peak_params_": [[9.562195448877604, 0.8103409826208622, 3.0817437638798135], [13.794596071873746, 0.3292632157107561, 1.887980163643375], [19.04534315540076, 0.4763663990242679, 7.402834975224114], [35.71620554023035, 0.12798056042230632, 11.999999999999998], [38.92646414930592, 0.18003582045145972, 0.5001363297960083]], "r_squared_": 0.9891774399614369, "error_": 0.0504786599300876}
{"freq_range": [2.0, 80.0], "freq_res": 1.0, "aperiodic_params_": [0.49357656695021196, 0.7944626492043135], "gaussian_params_": [[9.538317791495, 0.7199568532803233, 1.3966394154424708], [15.675070501056481, 0.23690527708452655, 2.2418921410542483], [19.86676426798067, 0.24751739373212198, 1.6698823905923017], [47.22210594571472, 0.17472409563349395, 0.8577244455752069], [53.60032091663312, 0.5423772654034126, 0.2500145316131928], [60.02554932529682, 0.10716846107617158, 5.997596517769825]], "peak_params_": [[9.538317791495, 0.6912947049865814, 2.7932788308849417], [15.675070501056481, 0.25140018357390814, 4.4837842821084966], [19.86676426798067, 0.2835811356086202, 3.3397647811846034], [47.22210594571472, 0.17909884708628354, 1.7154488911504138], [53.60032091663312, 0.2158314910453012, 0.5000290632263856], [60.02554932529682, 0.10716748868857906, 11.99519303553965]], "r_squared_": 0.9776073211373518, "error_": 0.04391379355745221}
{"freq_range": [2.0, 80.0], "freq_res": 1.0, "aperiodic_params_": [0.4508817031281793, 0.9798213800659455], "gaussian_params_": [[9.516893216912292, 0.7338423015619494, 1.38065847596848], [15.54332406768678, 0.29688566654362386, 3.5099951205230404], [25.795084073706402, 0.4342081602980303, 4.794168825376001], [34.55591368277389, 0.5868594315509137, 0.29487378389802965], [38.30246530901865, 0.11603863345098518, 1.1728585623584564], [42.66402086037826, 0.13991318891387677, 0.2834005431619484], [49.08698411084654, 0.2228592408100443, 5.487902780492504], [53.02721642503436, 0.08558891588209017, 0.25012695481277397], [58.468359325034264, 0.4369141324231772, 0.30939453174907217]], "peak_params_": [[9.516893216912292, 0.7774803078540704, 2.76131695193696], [15.54332406768678, 0.3482530886727528, 7.019990241046081], [25.795084073706402, 0.4373542915487156, 9.588337650752003], [34.55591368277389, 0.2680128951187718, 0.5897475677960593], [38.30246530901865, 0.1581972853203737, 2.345717124716913], [42.66402086037826, 0.1904926370271527, 0.5668010863238968], [49.08698411084654, 0.2228347997484914, 10.975805560985007], [53.02721642503436, 0.25791880637321984, 0.5002539096255479], [58.468359325034264, 0.1985275020142121, 0.6187890634981443]], "r_squared_": 0.9835934163287439, "error_": 0.045785516936952805}
{"freq_range": [2.0, 80.0], "freq_res": 1.0, "aperiodic_params_": [0.534712695711183, 0.8318447725570877], "gaussian_params_": [[9.59640832240726, 0.6566025136391799, 1.2213357434231378], [15.120421310924776, 0.24426910982950456, 1.4850332649794848], [21.18067431725873, 0.3473257057456884, 2.6941499307105206], [25.551005027879, 0.18472296054299248, 1.7628311560708327], [34.6144773153214, 0.18036961687402733, 1.2369480355674043], [38.47932884029798, 0.21417761882856054, 1.1244668685275931], [43.34599503340664, 0.25419443763610655, 1.5477979778368052], [48.65820446079998, 0.24261059146685454, 1.3247877383033815], [56.23689346961349, 0.1737756989857929, 1.6332222979274178], [64.12632846512585, 0.19168534727928707, 0.6450319589238893]], "peak_params_": [[9.59640832240726, 0.6224171429690605, 2.4426714868462756], [15.120421310924776, 0.2685021612661612, 2.9700665299589697], [21.18067431725873, 0.35323760555901734, 5.388299861421041], [25.551005027879, 0.24895662319114548, 3.5256623121416655], [34.6144773153214, 0.17360494422503447, 2.4738960711348086], [38.47932884029798, 0.20048985485422777, 2.2489337370551863], [43.34599503340664, 0.24801481684262838, 3.0955959556736103], [48.65820446079998, 0.23500016170019156, 2.649575476606763], [56.23689346961349, 0.17195733851163353, 3.2664445958548356], [64.12632846512585, 0.1880463338919145, 1.2900639178477786]], "r_squared_": 0.9789148990858515, "error_": 0.04457925376462805}
{"freq_range": [2.0, 80.0], "freq_res": 1.0, "aperiodic_params_": [1.0243929034976595, 1.314170877681013], "gaussian_params_": [[9.432881592242866, 0.6745453925771967, 1.324203360239607], [19.384994167067646, 0.4740271387450402, 5.535850579024577], [38.08176806480914, 0.28137776743783627, 4.926337679261382], [50.64389620259217, 0.1367848633516975, 5.999999999999999]], "peak_params_": [[9.432881592242866, 0.7210358886913129, 2.648406720479214], [19.384994167067646, 0.4730376737249092, 11.071701158049153], [38.08176806480914, 0.29785064466963196, 9.852675358522765], [50.64389620259217, 0.1455829851291397, 11.999999999999998]], "r_squared_": 0.9807458058198498, "error_": 0.06520154252880403}
{"freq_range": [2.0, 80.0], "freq_res": 1.0, "aperiodic_params_": [1.3476258704180264, 1.7163189713472544], "gaussian_params_": [[4.985007680728683, 0.19347295776181359, 0.25000000760037117], [9.336231348967459, 0.8355070130394173, 1.5197697656392577], [18.149800231604623, 0.6333463277915499, 5.161725431047816], [34.191843190943274, 0.07934952177043429, 5.999999999999999]], "peak_params_": [[4.985007680728683, 0.232068120998013, 0.5000000152007423], [9.336231348967459, 0.9469394315026626, 3.0395395312785154], [18.149800231604623, 0.635160084351814, 10.323450862095632], [34.191843190943274, 0.08498564219359994, 11.999999999999998]], "r_squared_": 0.9914912169311273, "error_": 0.05830206346418446}
{"freq_range": [2.0, 80.0], "freq_res": 1.0, "aperiodic_params_": [1.506088809016903, 1.869577806292197], "gaussian_params_": [[7.554763339255825, 1.3259987050255408, 0.31276751360459126], [9.798147980528586, 0.9263074303153569, 1.0686155906349075], [17.328327614027597, 0.640910843845909, 5.128073940225618], [25.73641419023339, 0.1541874948712683, 5.999999999999999]], "peak_params_": [[7.554763339255825, 0.8307428186883928, 0.6255350272091825], [9.798147980528586, 1.1457293240479465, 2.137231181269815], [17.328327614027597, 0.6930140504969564, 10.256147880451236], [25.73641419023339, 0.30744924440381693, 11.999999999999998]], "r_squared_": 0.9923998731337318, "error_": 0.0541329540578147}
{"freq_range": [2.0, 80.0], "freq_res": 1.0, "aperiodic_params_": [1.4986608869765574, 1.8622343042964369], "gaussian_params_": [[7.796872071000061, 0.6202653758733833, 0.7031354839857431], [9.923317302993887, 0.940743240696722, 1.009141836167967], [15.64567914399983, 0.5693228195897051, 3.905112016749993], [21.1998269796766, 0.22890348137407546, 1.6601797308537385], [24.452034615990712, 0.2684589983134712, 5.49068277760156]], "peak_params_": [[7.796872071000061, 0.8346825156330345, 1.4062709679714862], [9.923317302993887, 1.1512308069811434, 2.018283672335934], [15.64567914399983, 0.6507781754017247, 7.810224033499986], [21.1998269796766, 0.669968101055833, 3.320359461707477], [24.452034615990712, 0.38049353874777614, 10.98136555520312]], "r_squared_": 0.993794252957402, "error_": 0.04907886707533551}
{"freq_range": [2.0, 80.0], "freq_res": 1.0, "aperiodic_params_": [1.3360301984368677, 1.7538393858910615], "gaussian_params_": [[7.524167830430328, 1.174781174871853, 0.31122906493830993], [9.781376125554019, 0.9331944550900612, 1.265632409118818], [15.751064730445727, 0.5712373191449254, 3.623281648666324], [20.861415561575747, 0.3185380163999154, 1.237363626759034], [24.45203459913595, 0.2695396232164245, 5.2727463056391946]], "peak_params_": [[7.524167830430328, 0.7716701609749154, 0.6224581298766199], [9.781376125554019, 1.0877592649819883, 2.531264818237636], [15.751064730445727, 0.6446246298067011, 7.246563297332648], [20.861415561575747, 0.734124230535377, 2.474727253518068], [24.45203459913595, 0.3241044940465114, 10.545492611278389]], "r_squared_": 0.9936628958668942, "error_": 0.0495501245451228}
{"freq_range": [2.0, 80.0], "freq_res": 1.0, "aperiodic_params_": [1.0423082047116188, 1.547564203246267], "gaussian_params_": [[9.618398764497085, 0.9633236983519561, 1.8367048710540044], [15.940972520326476, 0.5165425973385548, 2.712222614172055], [20.744538062644818, 0.46895148102334794, 1.2447507081769689], [24.452034599585453, 0.22396177966399713, 5.921564780171737]], "peak_params_": [[9.618398764497085, 1.00105664082946, 3.6734097421080087], [15.940972520326476, 0.5999215702383961, 5.42444522834411], [20.744538062644818, 0.7388408118673919, 2.4895014163539377], [24.452034599585453, 0.24490047503539225, 11.843129560343474]], "r_squared_": 0.9933978805530813, "error_": 0.04768223291954566}
{"freq_range": [2.0, 80.0], "freq_res": 1.0, "aperiodic_params_": [0.6837682745553358, 1.3607288027920355], "gaussian_params_": [[9.592991777835156, 0.9206317263684987, 1.7582735058031305], [15.22996350911046, 0.5511597936362173, 2.595132829676983], [20.623304971769116, 0.5552617478106592, 1.6733383040539813], [26.715632206830215, 0.15918233312104915, 2.341353846200277], [50.492056542246544, 0.888873682698094, 0.2655540305512517]], "peak_params_": [[9.592991777835156, 0.9686291451652477, 3.516547011606261], [15.22996350911046, 0.5590997073469381, 5.190265659353966], [20.623304971769116, 0.5959945164129445, 3.3466766081079626], [26.715632206830215, 0.15842144115099677, 4.682707692400554], [50.492056542246544, 0.15969341733542874, 0.5311080611025034]], "r_squared_": 0.9930201792124785, "error_": 0.04373877018416041}
{"freq_range": [2.0, 80.0], "freq_res": 1.0, "aperiodic_params_": [0.5135197447460808, 1.3439480406603652], "gaussian_params_": [[9.766143200731449, 0.9422883021739167, 1.8157056844377584], [14.238896617390193, 0.3460966873378257, 1.08683197539678], [18.83776878648824, 0.546965144016732, 4.08078711806747]], "peak_params_": [[9.766143200731449, 0.9870953297084324, 3.6314113688755167], [14.238896617390193, 0.6708748173923316, 2.17366395079356], [18.83776878648824, 0.5465589203142599, 8.16157423613494]], "r_squared_": 0.9870162605476992, "error_": 0.060125278614594456}
{"freq_range": [2.0, 80.0], "freq_res": 1.0, "aperiodic_params_": [0.8181343181621218, 1.5487791307305787], "gaussian_params_": [[9.742310511886433, 0.8852604288546945, 1.6505336597256366], [13.969692573221886, 0.26798924276772074, 0.975951214011141], [16.538471930694364, 0.42697539166882936, 0.30229213178339565], [19.17944833943756, 0.567182643764319, 4.72353454318687], [71.57569632065213, 0.5821413380395005, 0.28481816196825105]], "peak_params_": [[9.742310511886433, 0.9604371150293428, 3.301067319451273], [13.969692573221886, 0.6105475581521211, 1.951902428022282], [16.538471930694364, 0.6452441409405455, 0.6045842635667913], [19.17944833943756, 0.5667740821439538, 9.44706908637374], [71.57569632065213, 0.19191596347992612, 0.5696363239365021]], "r_squared_": 0.9920175728402207, "error_": 0.05117153590314447}
{"freq_range": [2.0, 80.0], "freq_res": 1.0, "aperiodic_params_": [1.0686883849487478, 1.5805827265701538], "gaussian_params_": [[9.64233410807535, 0.8618751053172065, 1.5079571445524942], [14.76490156266867, 0.1356395386191498, 1.2205723246014066], [19.066983252491458, 0.5889489937050099, 5.258489054095132]], "peak_params_": [[9.64233410807535, 0.9712305354497746, 3.0159142891049884], [14.76490156266867, 0.5714150435929615, 2.4411446492028133], [19.066983252491458, 0.5892308984254667, 10.516978108190264]], "r_squared_": 0.98803951225651, "error_": 0.06187831846849703}
{"freq_range": [2.0, 80.0], "freq_res": 1.0, "aperiodic_params_": [1.3526379745056545, 1.7805796797872657], "gaussian_params_": [[9.518658556633428, 0.9188483867509839, 1.6772939442424475], [15.101892202930733, 0.18779314073469003, 1.2327864566603115], [19.357272030135046, 0.6394794517955364, 5.623504195752429]], "peak_params_": [[9.518658556633428, 1.0419935627313484, 3.354587888484895], [15.101892202930733, 0.6652119360718811, 2.465572913320623], [19.357272030135046, 0.6394566233661315, 11.247008391504858]], "r_squared_": 0.9897571072573225, "error_": 0.06245999479497994}
{"freq_range": [2.0, 80.0], "freq_res": 1.0, "aperiodic_params_": [1.3945709815572713, 1.824355775965111], "gaussian_params_": [[5.316641173769561, 0.2460089226703283, 0.45093634295496726], [7.542466170040671, 1.7242932733599339, 0.3095206342222749], [9.85498676907799, 1.0315493645448535, 1.1472115017605915], [17.404034146619885, 0.7215908168538698, 4.938809598610062], [28.100155789365914, 0.14997414177821414, 5.999999999999999]], "peak_params_": [[5.316641173769561, 0.22328182014530784, 0.9018726859099345], [7.542466170040671, 0.9756670350028298, 0.6190412684445498], [9.85498676907799, 1.2594892724621436, 2.294423003521183], [17.404034146619885, 0.7462702206461899, 9.877619197220124], [28.100155789365914, 0.22219237244050838, 11.999999999999998]], "r_squared_": 0.9946957904457521, "error_": 0.050262360358254037}
{"freq_range": [2.0, 80.0], "freq_res": 1.0, "aperiodic_params_": [1.388192283734826, 1.8083940780060392], "gaussian_params_": [[7.685909583964621, 0.6651957912251576, 0.6384210825147494], [9.968043031907499, 1.0252994344069544, 1.161332817605937], [15.130858034760706, 0.09810697583641627, 1.3752831154152023], [18.730877101829766, 0.7061651248980408, 5.999999999999999]], "peak_params_": [[7.685909583964621, 0.9759596826544747, 1.2768421650294988], [9.968043031907499, 1.270904758141802, 2.322665635211874], [15.130858034760706, 0.6797806637889896, 2.7505662308304046], [18.730877101829766, 0.707330132863093, 11.999999999999998]], "r_squared_": 0.9935293949874767, "error_": 0.05513138236188137}
{"freq_range": [2.0, 80.0], "freq_res": 1.0, "aperiodic_params_": [1.266564817838003, 1.7452395588163603], "gaussian_params_": [[9.8077015065439, 1.204501231752884, 2.0603942649412046], [15.124206904614597, 0.5453492466386793, 1.368982171266618], [16.948098841102833, 0.2049607208562825, 0.5582044398417906], [20.352079022353898, 0.9060506430550918, 2.4757266142387415], [26.673959913389623, 0.3969039635007457, 0.8125350799280396], [29.927148583745424, 0.28151229729384303, 1.2402871412871692]], "peak_params_": [[9.8077015065439, 1.1999059969381853, 4.120788529882409], [15.124206904614597, 0.6814612208385866, 2.737964342533236], [16.948098841102833, 0.7823939044293947, 1.1164088796835812], [20.352079022353898, 0.8979002728830621, 4.951453228477483], [26.673959913389623, 0.40820870283405997, 1.6250701598560793], [29.927148583745424, 0.28157479885400694, 2.4805742825743384]], "r_squared_": 0.9941398060709199, "error_": 0.051087947171838836}
{"freq_range": [2.0, 80.0], "freq_res": 1.0, "aperiodic_params_": [1.1307368973549616, 1.6750688807623886], "gaussian_params_": [[9.869430599456718, 1.14809427303764, 1.8322387510565818], [15.882244534007826, 0.6416918669333624, 2.184695672012905], [20.754543368930058, 0.9141204903497228, 1.6921035133555888], [26.37931473008547, 0.3512476526297647, 1.1232018382985907], [30.00628763816474, 0.3080819162602835, 1.2314160110873917]], "peak_params_": [[9.869430599456718, 1.1622881140025112, 3.6644775021131637], [15.882244534007826, 0.6626591099338633, 4.36939134402581], [20.754543368930058, 0.9458354300254652, 3.3842070267111777], [26.37931473008547, 0.3408288226657299, 2.2464036765971813], [30.00628763816474, 0.310024420966454, 2.4628320221747835]], "r_squared_": 0.9925581286458725, "error_": 0.05366964815695081}
{"freq_range": [2.0, 80.0], "freq_res": 1.0, "aperiodic_params_": [0.7139517972644349, 1.4474595590629662], "gaussian_params_": [[9.903899268585066, 1.1094923279880475, 1.927423798192147], [15.16983906406657, 0.5639422986322232, 1.7442184730816284], [20.282471686137878, 0.7676391330575979, 1.9601201448815888], [26.509861177990214, 0.256047704103038, 1.085774369884246], [29.563377631310406, 0.36868265654044663, 0.45990113746567135], [74.93499367708726, 0.16882574955422586, 2.298485397773849]], "peak_params_": [[9.903899268585066, 1.115089996872197, 3.854847596384294], [15.16983906406657, 0.6152603664654828, 3.4884369461632567], [20.282471686137878, 0.7719004857512495, 3.9202402897631776], [26.509861177990214, 0.23340580176920933, 2.171548739768492], [29.563377631310406, 0.23639087338444686, 0.9198022749313427], [74.93499367708726, 0.16875824243880522, 4.596970795547698]], "r_squared_": 0.9930823621241823, "error_": 0.04615680551295325}
{"freq_range": [2.0, 80.0], "freq_res": 1.0, "aperiodic_params_": [0.47296006647515687, 1.3358266936124663], "gaussian_params_": [[9.933976563934227, 1.0371836025197574, 1.898366259464177], [14.493195013266194, 0.4856029930076608, 1.2540230867027573], [19.594397087865744, 0.5599128941265079, 2.909231421748798], [29.802065057140176, 0.20396823194045877, 0.6109131239904689]], "peak_params_": [[9.933976563934227, 1.039782461688983, 3.796732518928354], [14.493195013266194, 0.6422329562456863, 2.5080461734055146], [19.594397087865744, 0.554529890424305, 5.818462843497596], [29.802065057140176, 0.19447206678176832, 1.2218262479809379]], "r_squared_": 0.9911080132089413, "error_": 0.04940884881335844}
{"freq_range": [2.0, 80.0], "freq_res": 1.0, "aperiodic_params_": [0.8045313712588437, 1.5843313824845884], "gaussian_params_": [[10.151609064360075, 0.9984413075779754, 1.831672031907162], [13.491413102387323, 1.1175875460568916, 0.3151338709022107], [16.132639337111552, 0.6136325016401284, 1.4152507313122007], [20.300152985401517, 0.6810757129562575, 1.9955690315678407], [26.830389185863112, 0.20454120313704693, 2.9441830804639952], [71.56083935903125, 0.740524119450602, 0.2768331042505504]], "peak_params_": [[10.151609064360075, 0.9950794715419576, 3.663344063814324], [13.491413102387323, 0.6831290943893908, 0.6302677418044214], [16.132639337111552, 0.684101024921278, 2.8305014626244014], [20.300152985401517, 0.7019539648564721, 3.9911380631356814], [26.830389185863112, 0.20663169140549087, 5.8883661609279905], [71.56083935903125, 0.2104121245609607, 0.5536662085011008]], "r_squared_": 0.9919276730419506, "error_": 0.053105758354232785}
{"freq_range": [2.0, 80.0], "freq_res": 1.0, "aperiodic_params_": [1.0803237593350696, 1.6994272294089718], "gaussian_params_": [[9.958035057307626, 1.0680151971885161, 1.992811872891503], [15.525340166913834, 0.604834492964836, 1.743024108490177], [20.309871044830686, 0.8021931331690914, 2.3494450173968366], [28.145470934896338, 0.28521540036162024, 2.8598293418341214]], "peak_params_": [[9.958035057307626, 1.0718084837726602, 3.985623745783006], [15.525340166913834, 0.742757209020217, 3.486048216980354], [20.309871044830686, 0.8226030542730971, 4.698890034793673], [28.145470934896338, 0.28862971155739947, 5.719658683668243]], "r_squared_": 0.9918924648369164, "error_": 0.056424766927546804}
{"freq_range": [2.0, 80.0], "freq_res": 1.0, "aperiodic_params_": [1.2569905264131536, 1.7570579288346293], "gaussian_params_": [[8.887389561479825, 0.8568665933063359, 1.906874047178066], [10.457800465191793, 1.8981972837963734, 0.2708818165364922], [16.056624757155696, 0.7064606156560589, 3.686870403430305], [20.786559942798956, 0.33360189594306466, 1.237625473450144], [25.315202460746864, 0.30250615707566164, 4.970420410871563]], "peak_params_": [[8.887389561479825, 0.9698947695488808, 3.813748094356132], [10.457800465191793, 1.3637539811562427, 0.5417636330729844], [16.056624757155696, 0.7596258938438291, 7.37374080686061], [20.786559942798956, 0.8237468711031826, 2.475250946900288], [25.315202460746864, 0.34018267322996343, 9.940840821743127]], "r_squared_": 0.9953542874005354, "error_": 0.04580292572386081}
{"freq_range": [2.0, 80.0], "freq_res": 1.0, "aperiodic_params_": [1.3487847118454153, 1.801714010791357], "gaussian_params_": [[7.797938514662088, 0.8185870479931734, 0.8377580018712122], [10.164634763002823, 1.0440716726478019, 1.0231841309253853], [15.768714433457745, 0.11332147599190033, 0.8200232016632193], [18.312676242159032, 0.7534459578986742, 5.999999999999999]], "peak_params_": [[7.797938514662088, 1.0785194307647674, 1.6755160037424244], [10.164634763002823, 1.3450786046130259, 2.0463682618507706], [15.768714433457745, 0.8084076410466137, 1.6400464033264386], [18.312676242159032, 0.7552198811024756, 11.999999999999998]], "r_squared_": 0.9934970470817959, "error_": 0.056070586242716436}
{"freq_range": [2.0, 80.0], "freq_res": 1.0, "aperiodic_params_": [1.3444750744145273, 1.7921456848886343], "gaussian_params_": [[9.647283894402076, 1.3527222043949656, 2.116987089234584], [15.960186861117638, 0.7080572381683452, 1.6817940447867468], [20.32913226300407, 0.6255984699629845, 1.8335759157283562], [24.90406919928163, 0.2791488983942941, 4.938201992555213], [26.584743666108615, 0.3764904217025766, 0.2500342627915357]], "peak_params_": [[9.647283894402076, 1.3383397406631692, 4.233974178469168], [15.960186861117638, 0.8163158462114061, 3.3635880895734935], [20.32913226300407, 0.8256398215691675, 3.6671518314567124], [24.90406919928163, 0.3034839086354102, 9.876403985110427], [26.584743666108615, 0.3507403141591876, 0.5000685255830714]], "r_squared_": 0.9946194386889194, "error_": 0.05089993022190539}
{"freq_range": [2.0, 80.0], "freq_res": 1.0, "aperiodic_params_": [1.2896644976543554, 1.7710560221840792], "gaussian_params_": [[9.51835224005947, 1.2646475153779864, 1.9716517081004066], [18.775282889070645, 0.8887113606641018, 4.203501248052109], [26.542445644935377, 0.7947103583392854, 0.2790049631106798], [29.80892097637978, 0.2668973837722488, 1.420043210937651]], "peak_params_": [[9.51835224005947, 1.3280258668837563, 3.943303416200813], [18.775282889070645, 0.8874543616596416, 8.407002496104218], [26.542445644935377, 0.3758919689699254, 0.5580099262213596], [29.80892097637978, 0.2896318832102047, 2.840086421875302]], "r_squared_": 0.9940679814562388, "error_": 0.054323296502545394}
{"freq_range": [2.0, 80.0], "freq_res": 1.0, "aperiodic_params_": [1.2302416307682251, 1.7317037814562213], "gaussian_params_": [[9.760930981555841, 1.2898831359423888, 1.8406168274346764], [15.938460029336781, 0.6597233727138738, 2.2515333032796954], [20.721336452372274, 0.84846563575793, 1.9177893100796342], [24.617046365365898, 0.41421971627624554, 0.3239654022894135], [26.54901650517887, 0.3753358089853601, 0.7155918861512413], [29.72787430440225, 0.35773411343463046, 1.2581933139986619]], "peak_params_": [[9.760930981555841, 1.2994086968247938, 3.6812336548693527], [15.938460029336781, 0.7045816692480682, 4.503066606559391], [20.721336452372274, 0.8922747397435956, 3.8355786201592683], [24.617046365365898, 0.31296313643998186, 0.647930804578827], [26.54901650517887, 0.3458339788967243, 1.4311837723024825], [29.72787430440225, 0.3494744630926703, 2.5163866279973237]], "r_squared_": 0.9936105459666638, "error_": 0.05398032295244713}
{"freq_range": [2.0, 80.0], "freq_res": 1.0, "aperiodic_params_": [0.9963854218006966, 1.6267094535486553], "gaussian_params_": [[9.734154517003963, 1.3758484739963297, 1.7643708594687364], [14.481585614823727, 0.4691673261649561, 1.4608160374183032], [19.71088872171512, 0.8574863858772124, 2.7356715949029895], [26.367792212273322, 0.23371259904177988, 1.2951323653745506], [29.696134681888793, 0.3562895772113439, 1.0070141799326127], [74.27481129506292, 0.13686904855044987, 1.7158985121656103], [78.2331792702317, 0.23008502428567293, 0.4514037478347304]], "peak_params_": [[9.734154517003963, 1.3661352785072187, 3.528741718937473], [14.481585614823727, 0.6153814633300274, 2.9216320748366065], [19.71088872171512, 0.8530863243593542, 5.471343189805979], [26.367792212273322, 0.28593574394836274, 2.590264730749101], [29.696134681888793, 0.34573863157895834, 2.0140283598652253], [74.27481129506292, 0.13512491680537186, 3.4317970243312206], [78.2331792702317, 0.2143143050007743, 0.9028074956694608]], "r_squared_": 0.9941592803320928, "error_": 0.04712144213937348}
{"freq_range": [2.0, 80.0], "freq_res": 1.0, "aperiodic_params_": [0.632402964851, 1.3576980425873872], "gaussian_params_": [[8.405902832734302, 0.8460332454680126, 1.3708511064572797], [10.247098167139741, 0.9438769673701353, 0.9296933793906161], [12.556389860329919, 0.8832059387965518, 0.3372883386611645], [14.55785315244765, 0.3288350877606064, 0.5960871500016175], [18.20122753408201, 0.6586587423880237, 4.308832970388432], [29.958091945167652, 0.26176592993440795, 0.8646872238343121], [64.42709768879246, 0.8403025758318196, 0.25712410415300974], [73.5764771240923, 0.7991719034285487, 0.2561920156602473]], "peak_params_": [[8.405902832734302, 0.9005527787047789, 2.7417022129145594], [10.247098167139741, 1.4490488175920249, 1.8593867587812323], [12.556389860329919, 0.7154469148990246, 0.674576677322329], [14.55785315244765, 0.7495669040240565, 1.192174300003235], [18.20122753408201, 0.6579408857112927, 8.617665940776863], [29.958091945167652, 0.2769631465493285, 1.7293744476686241], [64.42709768879246, 0.21149630573023925, 0.5142482083060195], [73.5764771240923, 0.2037980944361053, 0.5123840313204946]], "r_squared_": 0.9932804470068219, "error_": 0.04583839251320432}
{"freq_range": [2.0, 80.0], "freq_res": 1.0, "aperiodic_params_": [0.7881610496763786, 1.5656689348144404], "gaussian_params_": [[10.065764029687623, 1.1061768215525245, 1.8759149830796404], [13.477501354364462, 1.3130091428504536, 0.27342053609671907], [16.60868010486762, 0.7576111739591647, 1.6624946548646462], [20.72832304727306, 0.7966217848089616, 1.5589769274802263], [24.766901218422607, 0.23270077082442056, 0.5323974496802031], [28.206194311624376, 0.2221436851516124, 2.489190331088843], [72.00552502311453, 0.19055656967365064, 0.544703661028745]], "peak_params_": [[10.065764029687623, 1.1057779014626423, 3.751829966159281], [13.477501354364462, 0.683086982534978, 0.5468410721934381], [16.60868010486762, 0.7837500033650732, 3.3249893097292924], [20.72832304727306, 0.8111223130086331, 3.1179538549604526], [24.766901218422607, 0.3270068095166856, 1.0647948993604062], [28.206194311624376, 0.22139786951185925, 4.978380662177686], [72.00552502311453, 0.19054676731992792, 1.08940732205749]], "r_squared_": 0.9937451620112155, "error_": 0.047296915630280705}
{"freq_range": [2.0, 80.0], "freq_res": 1.0, "aperiodic_params_": [1.0516341886612792, 1.6821532415034028], "gaussian_params_": [[10.032317083973528, 1.1471986000661791, 1.9731352844424153], [16.55636762170493, 0.7742961422731666, 2.2091663413287894], [21.010534385952795, 0.7649647403019993, 1.662215271440283], [24.982538376935533, 0.3400795343557565, 0.7983478320636946], [28.73250988838904, 0.2806464261553522, 1.8751780931294544]], "peak_params_": [[10.032317083973528, 1.1565138111381463, 3.9462705688848305], [16.55636762170493, 0.8027305389464207, 4.418332682657579], [21.010534385952795, 0.8674179464725277, 3.324430542880566], [24.982538376935533, 0.4221604410093742, 1.5966956641273893], [28.73250988838904, 0.2778140883165523, 3.7503561862589088]], "r_squared_": 0.993660563744345, "error_": 0.05124857337036741}
{"freq_range": [2.0, 80.0], "freq_res": 1.0, "aperiodic_params_": [1.3144600671617266, 1.7927203424471327], "gaussian_params_": [[9.961921538806113, 1.1856488738052884, 2.099634504983097], [15.859150927051102, 0.6780748657195956, 1.5990053380716354], [20.2379507252638, 0.7582731398204582, 2.068399547447031], [26.662632748079726, 0.2760346390611913, 3.5562374700214403]], "peak_params_": [[9.961921538806113, 1.1862858329065888, 4.199269009966194], [15.859150927051102, 0.7904523951221849, 3.1980106761432707], [20.2379507252638, 0.8247284681546071, 4.136799094894062], [26.662632748079726, 0.27841777386675615, 7.112474940042881]], "r_squared_": 0.9938943980137016, "error_": 0.053159083738039965}
{"freq_range": [2.0, 80.0], "freq_res": 1.0, "aperiodic_params_": [1.3647550788055123, 1.8185276089746965], "gaussian_params_": [[9.866124907302302, 1.4643805650036832, 2.19994805931561], [15.99412192439486, 0.756799794573921, 1.5248981740215248], [20.151400266850928, 0.7300501258178378, 1.8812825127852626], [25.635828956298106, 0.3368629630204677, 4.01080048406925]], "peak_params_": [[9.866124907302302, 1.4621747560887561, 4.39989611863122], [15.99412192439486, 0.8695895356306645, 3.0497963480430497], [20.151400266850928, 0.877254886792725, 3.762565025570525], [25.635828956298106, 0.3412936350968898, 8.0216009681385]], "r_squared_": 0.9943057713662078, "error_": 0.05449939551412265}
{"freq_range": [2.0, 80.0], "freq_res": 1.0, "aperiodic_params_": [1.339897027987685, 1.798684161227409], "gaussian_params_": [[9.543966769995006, 1.2331622326170073, 1.8109714530952794], [18.686212476321334, 0.8208340028638268, 5.685360552113576]], "peak_params_": [[9.543966769995006, 1.4501720082893832, 3.621942906190559], [18.686212476321334, 0.8195862324158685, 11.370721104227153]], "r_squared_": 0.9929333426444972, "error_": 0.06084874070715971}
{"freq_range": [2.0, 80.0], "freq_res": 1.0, "aperiodic_params_": [1.3335827696435094, 1.7777020479320595], "gaussian_params_": [[9.565433161315019, 1.492237142668744, 1.6118899149324821], [13.39182383079449, 0.6005509547281801, 0.2500090715048511], [18.680387107175058, 0.8888741393755237, 4.41777165278882], [29.02587070818408, 0.299729377038425, 2.0529524504426324]], "peak_params_": [[9.565433161315019, 1.5679495474743308, 3.2237798298649643], [13.39182383079449, 0.7189147991446295, 0.5000181430097022], [18.680387107175058, 0.8865529918084971, 8.83554330557764], [29.02587070818408, 0.3577766238697957, 4.105904900885265]], "r_squared_": 0.9928676830970565, "error_": 0.0565090020722486}
{"freq_range": [2.0, 80.0], "freq_res": 1.0, "aperiodic_params_": [1.34127380634684, 1.7777282665861835], "gaussian_params_": [[9.555435720774327, 1.4609533143197084, 1.6155806023890968], [18.524773305039304, 0.8807974522104308, 4.6815272534523045], [29.117188441653102, 0.2854559936093073, 2.0642651570089807]], "peak_params_": [[9.555435720774327, 1.574499987545415, 3.2311612047781937], [18.524773305039304, 0.8762728292232519, 9.363054506904609], [29.117188441653102, 0.3570547572303556, 4.1285303140179614]], "r_squared_": 0.9928098613385474, "error_": 0.0558708044182286}
{"freq_range": [2.0, 80.0], "freq_res": 1.0, "aperiodic_params_": [0.8280992670448288, 1.4603185418798241], "gaussian_params_": [[9.461237295903922, 1.524348156076218, 1.5360517875523982], [13.311356723674626, 0.438914382486143, 0.25478445790355436], [18.148621400461707, 0.7973864732507614, 4.697081245712436], [29.711830973586878, 0.2302076695686991, 1.1861910035379497]], "peak_params_": [[9.461237295903922, 1.5767972630504001, 3.0721035751047965], [13.311356723674626, 0.7525946153335785, 0.5095689158071087], [18.148621400461707, 0.7969877117216267, 9.394162491424872], [29.711830973586878, 0.25657059234056057, 2.3723820070758994]], "r_squared_": 0.9895990412556929, "error_": 0.06402592326953598}
{"freq_range": [2.0, 80.0], "freq_res": 1.0, "aperiodic_params_": [0.43120384415174534, 1.3078733800262439], "gaussian_params_": [[9.79904575196821, 1.2283550136228063, 1.839371369285202], [18.15061262431738, 0.8306022482548118, 3.657526950532623], [26.997757063122865, 0.0689307879634917, 1.2478750581877416]], "peak_params_": [[9.79904575196821, 1.290395537000564, 3.678742738570404], [18.15061262431738, 0.8299575742990681, 7.315053901065246], [26.997757063122865, 0.11341604368413338, 2.495750116375483]], "r_squared_": 0.9894741573731939, "error_": 0.05969150833174966}
{"freq_range": [2.0, 80.0], "freq_res": 1.0, "aperiodic_params_": [1.0261301167252967, 1.635935990504412], "gaussian_params_": [[5.761659686223522, 0.28121397351797395, 0.25514011548146187], [9.905008112086842, 1.4397525788280303, 1.736560852910912], [16.962585761919502, 0.8636989319877749, 2.6369255106520777], [21.219682469018274, 0.6776070165698275, 1.6983080890286202], [25.086075194911768, 0.3297936080893584, 0.6563327675877905], [28.41584204899822, 0.28959067534776406, 2.004715335370536]], "peak_params_": [[5.761659686223522, 0.2968127313999423, 0.5102802309629237], [9.905008112086842, 1.4640518647282654, 3.473121705821824], [16.962585761919502, 0.8948875217042467, 5.273851021304155], [21.219682469018274, 0.9397604696782406, 3.3966161780572404], [25.086075194911768, 0.459978855945232, 1.312665535175581], [28.41584204899822, 0.2838140730891259, 4.009430670741072]], "r_squared_": 0.9949252063799195, "error_": 0.04733502931575138}
{"freq_range": [2.0, 80.0], "freq_res": 1.0, "aperiodic_params_": [1.2950875613932988, 1.758972923295556], "gaussian_params_": [[10.10688881350268, 1.3729824547027922, 1.8918296679516107], [15.96410316569868, 0.7097630547280888, 1.626832072554323], [20.292229120419236, 0.8366856307460787, 1.840403982457], [26.754542162708876, 0.2895916686581082, 3.418888403051616]], "peak_params_": [[10.10688881350268, 1.3716509162746306, 3.7836593359032213], [15.96410316569868, 0.777513557746729, 3.253664145108646], [20.292229120419236, 0.9000507081204883, 3.680807964914], [26.754542162708876, 0.28993764917215037, 6.837776806103232]], "r_squared_": 0.9934849670877953, "error_": 0.05345712689287782}
{"freq_range": [2.0, 80.0], "freq_res": 1.0, "aperiodic_params_": [1.3603669714897169, 1.7925453922651486], "gaussian_params_": [[8.073663070706091, 0.6734549069672691, 1.3906811351210862], [10.426793014403872, 1.3177970266979009, 1.0296884556244061], [15.437981678937325, 0.7041697668495046, 3.286287713207052], [16.580386947023197, 0.44714011302983514, 0.26218372654871286], [20.66968922768444, 0.5987680996192741, 1.783170177168797], [26.957874963692614, 0.3193507728315046, 3.2505802297337305]], "peak_params_": [[8.073663070706091, 0.808847676750503, 2.7813622702421723], [10.426793014403872, 1.646447816940205, 2.0593769112488123], [15.437981678937325, 0.7022022155827559, 6.572575426414104], [16.580386947023197, 0.8281564076453091, 0.5243674530974257], [20.66968922768444, 0.8162523217276982, 3.566340354337594], [26.957874963692614, 0.32186673473371963, 6.501160459467461]], "r_squared_": 0.9942477500766471, "error_": 0.05469047291277941}
{"freq_range": [2.0, 80.0], "freq_res": 1.0, "aperiodic_params_": [1.325526616667052, 1.7493520076505105], "gaussian_params_": [[9.794304173594131, 1.5785293528322044, 1.710132295006725], [14.972976612532323, 0.32442154647230315, 1.790280062084894], [19.420162431754928, 0.8330083598376183, 3.3619428710064616], [28.248980383608924, 0.29763507478952617, 2.5500562353428187]], "peak_params_": [[9.794304173594131, 1.59043608365699, 3.42026459001345], [14.972976612532323, 0.6907202522162278, 3.580560124169788], [19.420162431754928, 0.8527899777682176, 6.723885742012923], [28.248980383608924, 0.32831061161475183, 5.100112470685637]], "r_squared_": 0.9921205536953568, "error_": 0.05922602181581949}
{"freq_range": [2.0, 80.0], "freq_res": 1.0, "aperiodic_params_": [1.012807269911077, 1.5227656868904058], "gaussian_params_": [[9.536987268641473, 1.6434809334858214, 1.5173726541532382], [18.140663160417798, 0.8486239149328966, 4.092774050699135], [27.643896202592167, 0.19878854068209922, 2.5548790267745076]], "peak_params_": [[9.536987268641473, 1.6861101182527207, 3.0347453083064764], [18.140663160417798, 0.8482832568192421, 8.18554810139827], [27.643896202592167, 0.2434886842321604, 5.109758053549015]], "r_squared_": 0.9890190811741536, "error_": 0.063561789561498}
{"freq_range": [2.0, 80.0], "freq_res": 1.0, "aperiodic_params_": [0.20655402492975342, 0.9424604804031341], "gaussian_params_": [[8.085348903861506, 0.5331205085143895, 1.0862766542152211], [9.910101380221697, 1.4438101336615015, 0.8841561368936515], [12.594124167593518, 0.5327485260044865, 0.5136613684088366], [16.168120904222853, 0.39641222697571976, 1.678018590346633], [19.85139508191476, 0.4498213091085889, 1.3334344875947484], [56.07634985662057, 0.22391405647474896, 0.3798755519440172], [58.51756292269837, 0.7091006359405329, 0.27379304950978706], [68.58544283554214, 0.2467853942560894, 5.999999999999999], [78.74259581179896, 0.25546888719569033, 1.115963553289961]], "peak_params_": [[8.085348903861506, 0.6714532475125746, 2.1725533084304423], [9.910101380221697, 1.549604793912993, 1.768312273787303], [12.594124167593518, 0.4598263665751575, 1.0273227368176732], [16.168120904222853, 0.40136990860937993, 3.356037180693266], [19.85139508191476, 0.47626377931038455, 2.6668689751894967], [56.07634985662057, 0.24678397394757257, 0.7597511038880344], [58.51756292269837, 0.21902506316144033, 0.5475860990195741], [68.58544283554214, 0.246197041762517, 11.999999999999998], [78.74259581179896, 0.30347500011224837, 2.231927106579922]], "r_squared_": 0.9833771069934581, "error_": 0.04458059731962945}
{"freq_range": [2.0, 80.0], "freq_res": 1.0, "aperiodic_params_": [1.0639397123288963, 1.6482983727866647], "gaussian_params_": [[10.032102223375878, 1.525014615489513, 1.789316766174223], [15.540363516693802, 0.5863685868256975, 1.6933371881956967], [20.151411863080025, 0.9711335838928982, 2.4864431465018675], [25.303858245015647, 0.38092097149493453, 0.4805792737708891], [28.94401614072657, 0.3362050742729366, 1.473587861097144]], "peak_params_": [[10.032102223375878, 1.5277795321050087, 3.578633532348446], [15.540363516693802, 0.8119821431455688, 3.3866743763913933], [20.151411863080025, 0.9876171049438398, 4.972886293003735], [25.303858245015647, 0.4663299145312714, 0.9611585475417782], [28.94401614072657, 0.33768916162934715, 2.947175722194288]], "r_squared_": 0.9943802435162152, "error_": 0.04682618092358314}
{"freq_range": [2.0, 80.0], "freq_res": 1.0, "aperiodic_params_": [0.9860942285949923, 1.6017775009203266], "gaussian_params_": [[10.032685331372207, 1.4356311760184355, 1.720318059676095], [15.425065342560952, 0.555767139572339, 1.698945649303631], [20.06756734317189, 0.8076240680137612, 2.433694875443864], [25.343308571926496, 0.3547025986207331, 0.506080408304896], [28.629808381880295, 0.23660760624566707, 1.5323132204972663]], "peak_params_": [[10.032685331372207, 1.4389217188623706, 3.44063611935219], [15.425065342560952, 0.6532630917865014, 3.397891298607262], [20.06756734317189, 0.8221146674475396, 4.867389750887728], [25.343308571926496, 0.39967784004577234, 1.012160816609792], [28.629808381880295, 0.2307618272771763, 3.0646264409945325]], "r_squared_": 0.9911534442007851, "error_": 0.06017960934547051}
{"freq_range": [2.0, 80.0], "freq_res": 1.0, "aperiodic_params_": [0.8873685047609323, 1.4897889949457457], "gaussian_params_": [[9.716470933761508, 1.3946902344917387, 1.4323995093438766], [13.00717753021088, 0.2655156974823701, 0.2500129327125537], [15.410415017277742, 0.388718642021559, 0.29157592755362577], [16.757536560988726, 0.275790774054954, 0.25018780691014436], [18.837626321342924, 0.6895833490345991, 4.243568517047543]], "peak_params_": [[9.716470933761508, 1.4464795162973267, 2.864799018687753], [13.00717753021088, 0.6339039913808078, 0.5000258654251074], [15.410415017277742, 0.6040352590757891, 0.5831518551072515], [16.757536560988726, 0.8003078567275937, 0.5003756138202887], [18.837626321342924, 0.689078727554802, 8.487137034095086]], "r_squared_": 0.9863851655229909, "error_": 0.07226787350611824}
{"freq_range": [2.0, 80.0], "freq_res": 1.0, "aperiodic_params_": [-0.6659842160034263, 1.2211926674730103], "gaussian_params_": [[9.89402988252664, 0.8045553603400186, 1.9450924756165981], [17.578194384862925, 0.5983451154387159, 5.14586482680111]], "peak_params_": [[9.89402988252664, 1.0056678623675888, 3.8901849512331963], [17.578194384862925, 0.5964745769845141, 10.29172965360222]], "r_squared_": 0.9908688644270669, "error_": 0.05046093702351886}
{"freq_range": [2.0, 80.0], "freq_res": 1.0, "aperiodic_params_": [-0.2407280956034063, 1.2116107669749199], "gaussian_params_": [[9.164573267121382, 1.1840755642093153, 1.5422981209672297], [10.387822639559518, 0.4986707299096041, 0.2931117174500111], [14.40723602783534, 5.1221391466573294e-24, 1.277501528890376], [17.3107049414804, 0.6550791118272908, 4.683059503333136]], "peak_params_": [[9.164573267121382, 1.313013007260888, 3.0845962419344595], [10.387822639559518, 1.424001648465626, 0.5862234349000222], [14.40723602783534, 0.5189195122355976, 2.555003057780752], [17.3107049414804, 0.6536418546368616, 9.366119006666272]], "r_squared_": 0.9904629764017496, "error_": 0.05221372619920875}
{"freq_range": [2.0, 80.0], "freq_res": 1.0, "aperiodic_params_": [0.254054063615902, 1.3056637828716586], "gaussian_params_": [[9.427397338926086, 1.012029061833296, 1.3968995495670817], [16.732202303622785, 0.5715847124886895, 4.497196064030744]], "peak_params_": [[9.427397338926086, 1.0961179023508907, 2.7937990991341635], [16.732202303622785, 0.5705726314774696, 8.994392128061488]], "r_squared_": 0.9900173770822348, "error_": 0.05288557582873618}
{"freq_range": [2.0, 80.0], "freq_res": 1.0, "aperiodic_params_": [0.07382453772628206, 1.3973084144178016], "gaussian_params_": [[7.54136485697784, 0.6332195379136768, 0.27365001256840155], [9.575669641314729, 1.2800863417318595, 1.621604279335821], [13.096119848240727, 0.19682476966608883, 0.4324420941035454], [14.582162991860256, 0.2616619752268331, 0.48363163116459096], [18.088020331482397, 0.7424624900272995, 4.081405419554164], [29.553468442708887, 0.20579478723529926, 0.6933028173288891], [68.79964039592318, 0.22042115002695575, 0.5483177074179848], [73.93331351039848, 0.13007068048102133, 1.145245302109957]], "peak_params_": [[7.54136485697784, 0.9888506543687944, 0.5473000251368031], [9.575669641314729, 1.3412172521224508, 3.243208558671642], [13.096119848240727, 0.6723160574871778, 0.8648841882070908], [14.582162991860256, 0.7425882817877174, 0.9672632623291819], [18.088020331482397, 0.7422916153209994, 8.162810839108328], [29.553468442708887, 0.1777413858954584, 1.3866056346577782], [68.79964039592318, 0.20619813775702767, 1.0966354148359696], [73.93331351039848, 0.1298503573917169, 2.290490604219914]], "r_squared_": 0.9929521830368914, "error_": 0.04737065215748853}
