{"freq_range": [2.0, 80.0], "freq_res": 1.0, "aperiodic_params_": [0.17560682176296163, 0.4847399809944546], "gaussian_params_": [[8.236035292061604, 0.4504730659814319, 0.8228239074929827], [10.730204246177612, 0.32640938855056073, 1.4380658149227832], [15.030836406292464, 0.17311792930175413, 1.2017291254052507], [17.230980892224352, 0.21256768777807297, 0.32251167852302637], [19.126893988569094, 0.11926243097411941, 0.4880851487235586], [21.515791104536273, 0.20793778900780313, 0.2796965864287482], [22.75161874249065, 0.17293089333459974, 4.5301566000524245], [32.96124518783188, 0.15702016580920702, 0.6414208220224975], [47.18487143163453, 0.11494574309124181, 4.807473758301902], [50.58136110363821, 0.3954582913978076, 0.2821581182597099], [64.65069217090655, 0.20595090998910187, 1.0852732606530946]], "peak_params_": [[8.236035292061604, 0.4870130155569675, 1.6456478149859655], [10.730204246177612, 0.3289158896927539, 2.8761316298455664], [15.030836406292464, 0.21703926965389703, 2.4034582508105014], [17.230980892224352, 0.28696986367018873, 0.6450233570460527], [19.126893988569094, 0.23876907790545954, 0.9761702974471173], [21.515791104536273, 0.21703327486640633, 0.5593931728574963], [22.75161874249065, 0.17267168715843845, 9.060313200104849], [32.96124518783188, 0.17159600950014303, 1.282841644044995], [47.18487143163453, 0.11486088818915186, 9.614947516603804], [50.58136110363821, 0.2154417711366322, 0.5643162365194198], [64.65069217090655, 0.19567457572014024, 2.170546521306189]], "r_squared_": 0.9519671264522648, "error_": 0.03592960868791557}
{"freq_range": [2.0, 80.0], "freq_res": 1.0, "aperiodic_params_": [0.11362700167903887, 0.5379025884209948], "gaussian_params_": [[7.941127965938786, 0.39489822403432556, 0.7703500670219953], [9.83981791742274, 0.41685983001800836, 1.3586707198207089], [15.110817431715247, 0.29615710194652073, 2.623327294938948], [19.471820222191248, 0.3748775239641378, 0.32316169007883966], [22.369911943585834, 0.17056623514820532, 0.3160682951143581], [24.131271632957183, 0.18831558916795268, 2.6595506446688075], [47.09649757542378, 0.1522652396314069, 0.8374434392046565], [64.55010975082844, 0.20322336337861033, 0.8437215660661247], [70.5790472742367, 0.15801683112984283, 0.7758056990708588]], "peak_params_": [[7.941127965938786, 0.5679170508341609, 1.5407001340439905], [9.83981791742274, 0.46946907634288493, 2.7173414396414177], [15.110817431715247, 0.29671934837119385, 5.246654589877896], [19.471820222191248, 0.2570888310983329, 0.6463233801576793], [22.369911943585834, 0.23200621275600064, 0.6321365902287162], [24.131271632957183, 0.18903773126055567, 5.319101289337615], [47.09649757542378, 0.15125772397979542, 1.674886878409313], [64.55010975082844, 0.1762922708594299, 1.6874431321322494], [70.5790472742367, 0.1363866390468481, 1.5516113981417177]], "r_squared_": 0.9763371154511378, "error_": 0.03242790251575216}
{"freq_range": [2.0, 80.0], "freq_res": 1.0, "aperiodic_params_": [0.25669313390761783, 0.6666338984609791], "gaussian_params_": [[8.180112911256463, 0.5030032175667912, 0.945747992532877], [10.93963644322277, 0.38763672760802587, 1.7499002874285967], [15.07316842800921, 0.2542266254142579, 0.9517680311297191], [16.605860700916242, 0.47558145849223904, 0.29063166349157005], [20.57555506878104, 0.239053424104552, 2.605400550179131], [25.380736949523545, 0.2877838930457143, 0.3237174371697099]], "peak_params_": [[8.180112911256463, 0.5885089332552127, 1.891495985065754], [10.93963644322277, 0.3936149559793567, 3.4998005748571934], [15.07316842800921, 0.3039504553514069, 1.9035360622594382], [16.605860700916242, 0.3165494885743005, 0.5812633269831401], [20.57555506878104, 0.23590221893702584, 5.210801100358262], [25.380736949523545, 0.2006374323397031, 0.6474348743394198]], "r_squared_": 0.967450648976605, "error_": 0.04617084045400924}
{"freq_range": [2.0, 80.0], "freq_res": 1.0, "aperiodic_params_": [0.37023584603101245, 0.744638024987865], "gaussian_params_": [[8.173361074119956, 0.5065887402047239, 0.8769789496503152], [10.59289119891221, 0.3277036050747822, 1.3860949261904922], [18.35117696393021, 0.3743024012776162, 5.925894249294337], [64.45828939516035, 0.783142895935422, 0.28854262398691016]], "peak_params_": [[8.173361074119956, 0.6351596310300148, 1.7539578993006304], [10.59289119891221, 0.4900834504414192, 2.7721898523809845], [18.35117696393021, 0.37364592477721287, 11.851788498588673], [64.45828939516035, 0.22184577764286106, 0.5770852479738203]], "r_squared_": 0.9734259074847426, "error_": 0.049395991427339025}
{"freq_range": [2.0, 80.0], "freq_res": 1.0, "aperiodic_params_": [0.1890815606551672, 0.40767533543114787], "gaussian_params_": [[8.014846299175604, 0.43096950028495207, 0.8354607612761852], [10.049195262981327, 0.3535878393970558, 1.3824044592452938], [14.9170748971457, 0.2712850118218646, 2.2391417123291384], [19.83801975856972, 0.28188065454259004, 0.8651227373973606], [22.497138745610922, 0.5936510267169501, 0.3292999692127584], [24.823889951086905, 0.1506726232472931, 1.46039725834329], [59.59871542253307, 0.40365447676363364, 0.30020455274604596], [64.27588514497894, 0.1339822318048039, 1.3412009820036197]], "peak_params_": [[8.014846299175604, 0.5510547485418691, 1.6709215225523704], [10.049195262981327, 0.4033142382172702, 2.7648089184905875], [14.9170748971457, 0.27167908494303056, 4.478283424658277], [19.83801975856972, 0.29825463088428616, 1.7302454747947211], [22.497138745610922, 0.227413133719308, 0.6585999384255168], [24.823889951086905, 0.14959177755246347, 2.92079451668658], [59.59871542253307, 0.16603397873170678, 0.6004091054920919], [64.27588514497894, 0.13117744280562377, 2.6824019640072394]], "r_squared_": 0.9411908178182826, "error_": 0.04311855681059443}
{"freq_range": [2.0, 80.0], "freq_res": 1.0, "aperiodic_params_": [0.226343934317257, 0.7336020828632549], "gaussian_params_": [[8.836805073555661, 0.6051898279660317, 1.5595649726624756], [15.261960200547831, 0.41404130872570344, 3.46388807024566], [19.531686122652815, 0.3927565207309027, 0.30163822708097143], [22.261231277180954, 0.21736781747235312, 0.25695387197297], [24.17748007260903, 0.26418882546272443, 2.3507506003302945]], "peak_params_": [[8.836805073555661, 0.6826813195377629, 3.1191299453249512], [15.261960200547831, 0.4132343079707625, 6.92777614049132], [19.531686122652815, 0.33461547376891665, 0.6032764541619429], [22.261231277180954, 0.3641017504093312, 0.51390774394594], [24.17748007260903, 0.2806244734468061, 4.701501200660589]], "r_squared_": 0.9804640486893162, "error_": 0.04336338935589737}
{"freq_range": [2.0, 80.0], "freq_res": 1.0, "aperiodic_params_": [0.6824923649440632, 0.9749693745510973], "gaussian_params_": [[7.929350511164564, 0.4015529836010274, 0.8263634894922599], [10.269584495017316, 0.38001981766703874, 1.5903107993420051], [15.494491448258488, 0.2708058926288442, 1.4451577307174637], [20.651784297623905, 0.2228147040436221, 1.7072171245651517], [65.09994499785302, 0.18795369341251, 1.50298759130464]], "peak_params_": [[7.929350511164564, 0.5373475074086653, 1.6527269789845198], [10.269584495017316, 0.39218689915054994, 3.1806215986840103], [15.494491448258488, 0.2608925249639656, 2.8903154614349273], [20.651784297623905, 0.21841880527891477, 3.4144342491303035], [65.09994499785302, 0.18753859393320726, 3.00597518260928]], "r_squared_": 0.9801585284341527, "error_": 0.046632643035977216}
{"freq_range": [2.0, 80.0], "freq_res": 1.0, "aperiodic_params_": [0.42054156640699325, 0.8194486510589514], "gaussian_params_": [[7.957240085730123, 0.5184611319032837, 0.8969982146434927], [10.568450484358602, 0.494458865915009, 1.6247053149242427], [15.820187995785638, 0.4548885008190135, 1.924800403825327], [19.782066694563127, 0.3343375955695466, 0.7031544670651297], [22.32016992812726, 0.3398058626690333, 1.5135649526741353], [25.22545179096964, 0.22201016338072901, 0.6231084126340315], [28.05264274853793, 0.21311655555215026, 0.6407697755869562]], "peak_params_": [[7.957240085730123, 0.6597155258090959, 1.7939964292869854], [10.568450484358602, 0.4987397191980501, 3.2494106298484855], [15.820187995785638, 0.45481390860505805, 3.849600807650654], [19.782066694563127, 0.4666500115438812, 1.4063089341302595], [22.32016992812726, 0.3372259688238193, 3.0271299053482705], [25.22545179096964, 0.2788297484746127, 1.246216825268063], [28.05264274853793, 0.21270693603553048, 1.2815395511739125]], "r_squared_": 0.9883351231731564, "error_": 0.03318505672315018}
{"freq_range": [2.0, 80.0], "freq_res": 1.0, "aperiodic_params_": [0.581798478363355, 0.8432008449881893], "gaussian_params_": [[8.25274179972138, 0.5216768758130903, 0.9397139832474436], [10.909605780729251, 0.2893734720949595, 1.0781879773964578], [18.783516182031413, 0.438586224871189, 5.999999999999999]], "peak_params_": [[8.25274179972138, 0.5979585621157779, 1.8794279664948872], [10.909605780729251, 0.4846984753415946, 2.1563759547929156], [18.783516182031413, 0.43830083928606806, 11.999999999999998]], "r_squared_": 0.9787498509438844, "error_": 0.04872159426806886}
{"freq_range": [2.0, 80.0], "freq_res": 1.0, "aperiodic_params_": [0.6603072026717564, 0.9200492590122116], "gaussian_params_": [[9.007155736277875, 0.5136047113799124, 1.7340851092573055], [19.027729503691365, 0.5001100899818546, 5.999999999999999]], "peak_params_": [[9.007155736277875, 0.6373457158540096, 3.468170218514611], [19.027729503691365, 0.5001047806754332, 11.999999999999998]], "r_squared_": 0.9794274639342059, "error_": 0.055318779525938486}
{"freq_range": [2.0, 80.0], "freq_res": 1.0, "aperiodic_params_": [0.6770924114247718, 0.8957267887432454], "gaussian_params_": [[9.062660429286344, 0.49533979363207353, 1.7459954886677445], [19.086896165054448, 0.4681733561311522, 5.999999999999999]], "peak_params_": [[9.062660429286344, 0.6089649042274955, 3.491990977335489], [19.086896165054448, 0.468124305186112, 11.999999999999998]], "r_squared_": 0.9801048349792161, "error_": 0.05128932239937599}
{"freq_range": [2.0, 80.0], "freq_res": 1.0, "aperiodic_params_": [0.6582116240681789, 0.8543596340730891], "gaussian_params_": [[9.012514668682291, 0.49319743002260197, 1.7201176995387397], [18.879027881916098, 0.45568721440698023, 5.999999999999999]], "peak_params_": [[9.012514668682291, 0.6106702228521531, 3.4402353990774794], [18.879027881916098, 0.45559462735922795, 11.999999999999998]], "r_squared_": 0.978898582133153, "error_": 0.052356857221800564}
{"freq_range": [2.0, 80.0], "freq_res": 1.0, "aperiodic_params_": [0.544783153766596, 0.781879200906741], "gaussian_params_": [[8.966471807821966, 0.4589764345844573, 1.6883033215330245], [17.75050126272732, 0.46411279581231935, 5.843121431701701]], "peak_params_": [[8.966471807821966, 0.6101103748999501, 3.376606643066049], [17.75050126272732, 0.4636901697329274, 11.686242863403402]], "r_squared_": 0.9761482453206732, "error_": 0.052115456436408934}
{"freq_range": [2.0, 80.0], "freq_res": 1.0, "aperiodic_params_": [0.6073981006604436, 0.8774449235712753], "gaussian_params_": [[8.714732469336022, 0.49309975376059806, 1.4184004073835963], [14.142336023611367, 0.3985273923306808, 3.4360248747519364], [22.48568102561068, 0.29408815041882375, 3.46070880362938], [64.43293617885949, 0.7937994149574782, 0.25023833106766485]], "peak_params_": [[8.714732469336022, 0.6134202812708341, 2.8368008147671926], [14.142336023611367, 0.41321368685966203, 6.872049749503873], [22.48568102561068, 0.32037039906286174, 6.92141760725876], [64.43293617885949, 0.17772115954054712, 0.5004766621353297]], "r_squared_": 0.9811791397888953, "error_": 0.04905553930229087}
{"freq_range": [2.0, 80.0], "freq_res": 1.0, "aperiodic_params_": [0.5702085263547007, 0.9118129894278715], "gaussian_params_": [[8.177085796418659, 0.6142179400419698, 1.1481261129306533], [10.446954234230144, 0.7210165735224201, 0.35779588502387427], [13.351362278649196, 0.34792496155389663, 2.33708513253099], [18.84230608447107, 0.26988401407768975, 2.346885914612594], [24.881072207251453, 0.21942066740985172, 2.4971056623543126], [64.75303322557843, 0.17636504428408686, 0.8200275428311131], [77.29482007861927, 0.32228774573718005, 0.2500070065445672]], "peak_params_": [[8.177085796418659, 0.6322534615069171, 2.2962522258613065], [10.446954234230144, 0.6292515751685748, 0.7155917700477485], [13.351362278649196, 0.35628425628096827, 4.67417026506198], [18.84230608447107, 0.3017274585471971, 4.693771829225188], [24.881072207251453, 0.2278090366175256, 4.994211324708625], [64.75303322557843, 0.16854531003964301, 1.6400550856622262], [77.29482007861927, 0.1607953938581974, 0.5000140130891344]], "r_squared_": 0.9881101828279322, "error_": 0.03805662342968403}
{"freq_range": [2.0, 80.0], "freq_res": 1.0, "aperiodic_params_": [0.48729937206801854, 0.9011868713560217], "gaussian_params_": [[7.93726099445752, 0.42592482093676304, 1.0407507551567468], [10.322310821956258, 0.38989225757349805, 1.8351324580212383], [15.499792659473918, 0.25852648508676507, 1.2535949784311575], [20.14129965876048, 0.19061483931609705, 1.350300251339897], [50.472824130287286, 0.07941024667720938, 2.6462622929478843], [57.404860922462404, 0.20563859660559877, 0.6498548051778031], [64.6672902278085, 0.2358855459185061, 0.6672177119698378], [73.1755263808991, 0.12159753275861654, 2.292230450981744]], "peak_params_": [[7.93726099445752, 0.6002169746051293, 2.0815015103134935], [10.322310821956258, 0.44369117704725947, 3.6702649160424765], [15.499792659473918, 0.25404945519804706, 2.507189956862315], [20.14129965876048, 0.18998569266270093, 2.700600502679794], [50.472824130287286, 0.07815271650321254, 5.292524585895769], [57.404860922462404, 0.17315581365382626, 1.2997096103556063], [64.6672902278085, 0.20851860024954616, 1.3344354239396756], [73.1755263808991, 0.12124155199807118, 4.584460901963488]], "r_squared_": 0.988450287056161, "error_": 0.032048578353277284}
{"freq_range": [2.0, 80.0], "freq_res": 1.0, "aperiodic_params_": [0.36589182700849193, 0.8189715726854551], "gaussian_params_": [[8.684490992600015, 0.5917812089383081, 1.429241820405688], [13.750124926569033, 0.3866401415461637, 2.974945469490131], [21.47562788067117, 0.3177859358427419, 3.9778271801953884], [27.990343651956028, 0.11835402305356098, 0.2501863051775252], [64.68204168194947, 0.20117962825059657, 0.7080399308417825]], "peak_params_": [[8.684490992600015, 0.6879271989135142, 2.858483640811376], [13.750124926569033, 0.44021585794048296, 5.949890938980262], [21.47562788067117, 0.335369591504315, 7.955654360390777], [27.990343651956028, 0.20105723326264657, 0.5003726103550504], [64.68204168194947, 0.18188361305642708, 1.416079861683565]], "r_squared_": 0.9855320013394298, "error_": 0.040411023895602714}
{"freq_range": [2.0, 80.0], "freq_res": 1.0, "aperiodic_params_": [0.6883952332724261, 0.9843878025174156], "gaussian_params_": [[8.990440265232891, 0.4835818332191157, 1.6916860210479479], [18.626340828897007, 0.5436763304384035, 5.999999999999999]], "peak_params_": [[8.990440265232891, 0.6336768877207748, 3.3833720420958957], [18.626340828897007, 0.5426230761909226, 11.999999999999998]], "r_squared_": 0.9862510419324407, "error_": 0.04579234921520102}
{"freq_range": [2.0, 80.0], "freq_res": 1.0, "aperiodic_params_": [0.8654812129363583, 1.0976042815881972], "gaussian_params_": [[8.901022596015158, 0.48883414385914603, 1.6103141016732672], [18.899916190376175, 0.5707026618152977, 5.999999999999999]], "peak_params_": [[8.901022596015158, 0.6342090096748306, 3.2206282033465343], [18.899916190376175, 0.5706232715694612, 11.999999999999998]], "r_squared_": 0.9871979994494734, "error_": 0.047152824290028456}
{"freq_range": [2.0, 80.0], "freq_res": 1.0, "aperiodic_params_": [0.8162221924451052, 1.058592224135507], "gaussian_params_": [[8.553556165599487, 0.5126996688730991, 1.312613983229516], [15.26584206012388, 0.5407065536800953, 4.532319826048865], [23.911573395737435, 0.416498754262487, 2.765678287876945], [28.4529770434265, 0.5061024576399961, 0.27489520279628127]], "peak_params_": [[8.553556165599487, 0.6918268601852626, 2.625227966459032], [15.26584206012388, 0.5420979404295521, 9.06463965209773], [23.911573395737435, 0.5007268039441471, 5.53135657575389], [28.4529770434265, 0.2803082240505733, 0.5497904055925625]], "r_squared_": 0.9898836152522175, "error_": 0.04223566201747993}
{"freq_range": [2.0, 80.0], "freq_res": 1.0, "aperiodic_params_": [0.8110246745804506, 1.0492648137312268], "gaussian_params_": [[8.62355879560317, 0.5040390861797308, 1.3889594886544823], [14.959600111203594, 0.5589593414112805, 4.399186020743122], [24.073648466653395, 0.40891805084430355, 3.074463407335777]], "peak_params_": [[8.62355879560317, 0.7091538175966969, 2.7779189773089645], [14.959600111203594, 0.5642002690649334, 8.798372041486244], [24.073648466653395, 0.4764631198336869, 6.148926814671554]], "r_squared_": 0.9875389921942567, "error_": 0.04658820534357593}
{"freq_range": [2.0, 80.0], "freq_res": 1.0, "aperiodic_params_": [0.7847139431797416, 1.0345914591814682], "gaussian_params_": [[9.382803955359888, 0.4810338161991403, 2.2354760484501788], [18.348627983673936, 0.5446750458564015, 5.99999999999993]], "peak_params_": [[9.382803955359888, 0.6358298153248969, 4.4709520969003576], [18.348627983673936, 0.5440418432276466, 11.99999999999986]], "r_squared_": 0.9832738448018714, "error_": 0.05554263907794809}
{"freq_range": [2.0, 80.0], "freq_res": 1.0, "aperiodic_params_": [0.6102736413211698, 0.9134512446606212], "gaussian_params_": [[8.605342307434192, 0.5573178592782538, 1.577905802404879], [11.955353586464254, 0.29675511395326126, 2.409991057306285], [17.937591477989475, 0.4498901507892229, 3.758807310107974], [25.37460942781902, 0.222870933650095, 2.7945363119224793]], "peak_params_": [[8.605342307434192, 0.706698743570938, 3.155811604809758], [11.955353586464254, 0.48099487149715175, 4.81998211461257], [17.937591477989475, 0.469455276876549, 7.517614620215948], [25.37460942781902, 0.2978831798100442, 5.589072623844959]], "r_squared_": 0.9842858139743569, "error_": 0.046732163923886474}
{"freq_range": [2.0, 80.0], "freq_res": 1.0, "aperiodic_params_": [0.49199836006913245, 0.7669290967249779], "gaussian_params_": [[8.130136022191163, 0.5875646335754647, 0.9170448921884785], [10.207991882074856, 0.46106375406797284, 0.7488011572317415], [15.15917453535512, 0.23129892447927072, 3.7558373361128425], [23.97925307738154, 0.12885044300330223, 2.9072804407635155], [24.918831028296076, 0.09199891052071762, 1.0073896529179902], [45.37531387875678, 0.11672079460304748, 1.4291295145491667], [49.391722296251025, 0.13340056321678173, 1.3515400162124391], [54.44387023051678, 0.38528719523148014, 0.2866443775761581], [57.880594339508576, 0.13468811987910478, 1.637360402603105], [71.36228954806057, 0.160409790478481, 0.7415589166981965]], "peak_params_": [[8.130136022191163, 0.6252448095943269, 1.834089784376957], [10.207991882074856, 0.6071522639960135, 1.497602314463483], [15.15917453535512, 0.23218450135655896, 7.511674672225685], [23.97925307738154, 0.2040276541788404, 5.814560881527031], [24.918831028296076, 0.22032104546334064, 2.0147793058359804], [45.37531387875678, 0.11344417952563823, 2.8582590290983334], [49.391722296251025, 0.13259407202007267, 2.7030800324248783], [54.44387023051678, 0.12468967948458132, 0.5732887551523163], [57.880594339508576, 0.13433044946001094, 3.27472080520621], [71.36228954806057, 0.14236448451638506, 1.483117833396393]], "r_squared_": 0.9819568674913304, "error_": 0.036826722098910095}
{"freq_range": [2.0, 80.0], "freq_res": 1.0, "aperiodic_params_": [0.348644307319099, 0.8108078348665881], "gaussian_params_": [[8.885676129318345, 0.5496916202094051, 1.4181897773461567], [15.041147823198168, 0.2913510273534845, 2.4291364468789047], [20.64364760463831, 0.11226249811541109, 1.0514265656568047], [56.893845549586175, 0.12714980246321542, 0.9433774252151234], [64.64692757551717, 0.23347064940976478, 0.6709531180242652], [72.58432589125594, 0.10651719744744902, 2.0367568447406876]], "peak_params_": [[8.885676129318345, 0.5611328390260392, 2.8363795546923134], [15.041147823198168, 0.2913598549828793, 4.8582728937578095], [20.64364760463831, 0.12037505919096592, 2.1028531313136094], [56.893845549586175, 0.1263473540847455, 1.8867548504302467], [64.64692757551717, 0.20338701809003623, 1.3419062360485303], [72.58432589125594, 0.1043218516310005, 4.073513689481375]], "r_squared_": 0.9810702249053842, "error_": 0.038509608478171024}
{"freq_range": [2.0, 80.0], "freq_res": 1.0, "aperiodic_params_": [0.30010112977502706, 0.7918686972397909], "gaussian_params_": [[8.727835757731343, 0.570298638966239, 1.3352202684965755], [14.191919029283895, 0.43275834524199713, 3.083516840735075], [20.958752782966176, 0.18446041883721273, 4.781913796326239], [25.479453477140762, 0.4651652745872645, 0.3144214455071138], [64.56095081622388, 0.26745562914517057, 0.47466870862801946]], "peak_params_": [[8.727835757731343, 0.6715232612607238, 2.670440536993151], [14.191919029283895, 0.49613738438794586, 6.16703368147015], [20.958752782966176, 0.22227134698161166, 9.563827592652478], [25.479453477140762, 0.27543747290792986, 0.6288428910142276], [64.56095081622388, 0.17436990431209987, 0.9493374172560389]], "r_squared_": 0.9855623877698758, "error_": 0.03722197662743262}
{"freq_range": [2.0, 80.0], "freq_res": 1.0, "aperiodic_params_": [0.6601791138984918, 0.9928561472141059], "gaussian_params_": [[8.626205627151677, 0.5558465862218609, 1.3871992743167287], [14.634829500365322, 0.5782797400769156, 3.512017468552289], [23.20133610241923, 0.3970293454219649, 3.687312729539241]], "peak_params_": [[8.626205627151677, 0.6959105715181612, 2.7743985486334575], [14.634829500365322, 0.6086406050448144, 7.024034937104578], [23.20133610241923, 0.4303375705490752, 7.374625459078482]], "r_squared_": 0.9887025704121172, "error_": 0.04302195081817038}
{"freq_range": [2.0, 80.0], "freq_res": 1.0, "aperiodic_params_": [0.8223366504644194, 1.0742333871734329], "gaussian_params_": [[8.540635347688843, 0.5428168457239515, 1.250613848638231], [14.404430548184374, 0.5745684943473037, 3.6545162354943086], [19.487834176191683, 0.7486297108815203, 0.3001726538447661], [23.826413758091046, 0.4556601824238543, 3.1809367035410316]], "peak_params_": [[8.540635347688843, 0.699924255934364, 2.501227697276462], [14.404430548184374, 0.5749589779918247, 7.309032470988617], [19.487834176191683, 0.6045798892995347, 0.6003453076895322], [23.826413758091046, 0.4732755452077883, 6.361873407082063]], "r_squared_": 0.9908582650296225, "error_": 0.039276624491427416}
{"freq_range": [2.0, 80.0], "freq_res": 1.0, "aperiodic_params_": [0.9036335831681119, 1.1095524965877273], "gaussian_params_": [[9.023034054364567, 0.5035194837192779, 1.7644121353101028], [18.86150381586618, 0.5738971260200123, 5.999999999999999]], "peak_params_": [[9.023034054364567, 0.6521520707200448, 3.5288242706202055], [18.86150381586618, 0.5737443144616525, 11.999999999999998]], "r_squared_": 0.9859588661177644, "error_": 0.051579996671404414}
{"freq_range": [2.0, 80.0], "freq_res": 1.0, "aperiodic_params_": [0.7955115261911906, 1.0654950867577466], "gaussian_params_": [[9.309909668292725, 0.502057378143585, 2.1589042841990844], [18.376245747007303, 0.5882734427736225, 5.999999999999999]], "peak_params_": [[9.309909668292725, 0.6704088173853784, 4.317808568398169], [18.376245747007303, 0.5872701653873831, 11.999999999999998]], "r_squared_": 0.9834757736573112, "error_": 0.05578524269501091}
{"freq_range": [2.0, 80.0], "freq_res": 1.0, "aperiodic_params_": [0.7147059739209296, 1.0113158565485005], "gaussian_params_": [[8.852013482654035, 0.5439062995001976, 1.8849421053110726], [14.956337000778236, 0.5932013153507647, 3.7745364439579534], [19.522357296299415, 0.26809325504313, 0.8575934905198298], [24.404109360744304, 0.37594570075766354, 1.9387999057125762], [28.441990667952428, 0.6387030059930385, 0.31547533398140537]], "peak_params_": [[8.852013482654035, 0.7130239069611009, 3.7698842106221453], [14.956337000778236, 0.5958283414243597, 7.549072887915907], [19.522357296299415, 0.500992926909126, 1.7151869810396596], [24.404109360744304, 0.40149060273912585, 3.8775998114251524], [28.441990667952428, 0.30820248646063936, 0.6309506679628107]], "r_squared_": 0.9882520714187859, "error_": 0.046710231406630644}
{"freq_range": [2.0, 80.0], "freq_res": 1.0, "aperiodic_params_": [0.5685004208148068, 0.8602244651913203], "gaussian_params_": [[8.640541137843144, 0.6299476924060785, 1.3838277874211373], [10.559433252870434, 1.1025085066563045, 0.28885537463905103], [12.487595816646271, 1.5704488689944203, 0.2605574066549451], [16.612157931439175, 0.4324314850941742, 3.1040330034349095], [23.552866681895953, 0.7412131630945532, 0.26473896820194404], [25.463677826687675, 0.20667877556930936, 0.8562085871300568], [28.34733563894255, 0.18499797771844256, 1.1213325493256596], [57.42442491424435, 0.6383845834858786, 0.2522104734310346], [71.24614835538667, 0.15344001756790443, 0.6243323394805703]], "peak_params_": [[8.640541137843144, 0.6304296573947171, 2.7676555748422746], [10.559433252870434, 0.5761284516142827, 0.5777107492781021], [12.487595816646271, 0.4491015022093086, 0.5211148133098902], [16.612157931439175, 0.4290690836195476, 6.208066006869819], [23.552866681895953, 0.25153888993824797, 0.5294779364038881], [25.463677826687675, 0.19186573905422233, 1.7124171742601135], [28.34733563894255, 0.17941851552929533, 2.2426650986513192], [57.42442491424435, 0.1549339274499444, 0.5044209468620692], [71.24614835538667, 0.14196631742578725, 1.2486646789611406]], "r_squared_": 0.9831314664661451, "error_": 0.04367000902010306}
{"freq_range": [2.0, 80.0], "freq_res": 1.0, "aperiodic_params_": [0.21923350927989824, 0.5513747365473747], "gaussian_params_": [[9.022661954015193, 0.6050950614508661, 1.3750115988960396], [15.451295045793655, 0.157271761214091, 3.6974602719455865], [21.571828886542203, 0.3971793150483417, 0.30094932987583384], [24.354832441267096, 0.1657710435542473, 1.0307064091653666], [41.38944862233711, 0.4125804010479527, 0.29986749143535757], [43.648239486050656, 0.1693610747349441, 0.48331133069554666], [57.45980232175178, 0.6329845598062014, 0.29592189345236924]], "peak_params_": [[9.022661954015193, 0.6393362951134395, 2.7500231977920793], [15.451295045793655, 0.15615230922349232, 7.394920543891173], [21.571828886542203, 0.1893200220197946, 0.6018986597516677], [24.354832441267096, 0.1670943335037094, 2.061412818330733], [41.38944862233711, 0.17751837983826502, 0.5997349828707151], [43.648239486050656, 0.12995350376212467, 0.9666226613910933], [57.45980232175178, 0.18929462639285788, 0.5918437869047385]], "r_squared_": 0.9699663387006675, "error_": 0.03760857746801516}
{"freq_range": [2.0, 80.0], "freq_res": 1.0, "aperiodic_params_": [0.00848572151216068, 0.6491566738941138], "gaussian_params_": [[8.875650916205418, 0.613557937983585, 1.298789249721416], [15.120714772167974, 0.5074346756791871, 3.733720429526575], [64.52731658687131, 0.2728928552896773, 0.6392308553943262]], "peak_params_": [[8.875650916205418, 0.7431358783532424, 2.597578499442832], [15.120714772167974, 0.5071786466814036, 7.46744085905315], [64.52731658687131, 0.20761414536114486, 1.2784617107886525]], "r_squared_": 0.9741981661068229, "error_": 0.04841475512647707}
{"freq_range": [2.0, 80.0], "freq_res": 1.0, "aperiodic_params_": [0.3144977665649581, 0.8035759585299812], "gaussian_params_": [[8.748177172269019, 0.5160503306364789, 1.3079288968931693], [15.478395687366586, 0.7369897058842205, 4.2578330414636065], [25.35244052837508, 0.2971870655824748, 0.7235134693695484]], "peak_params_": [[8.748177172269019, 0.7381837220489874, 2.6158577937863385], [15.478395687366586, 0.7323581153641773, 8.515666082927213], [25.35244052837508, 0.32440912892614177, 1.4470269387390968]], "r_squared_": 0.9828423486303625, "error_": 0.0481974049941245}
{"freq_range": [2.0, 80.0], "freq_res": 1.0, "aperiodic_params_": [0.6019935151684402, 0.9680124681881352], "gaussian_params_": [[8.045771630136974, 0.5209799833069167, 0.9979326329579182], [10.231963611901914, 0.411817722810182, 1.4592700100132283], [15.12400471654911, 0.667939078519239, 3.096805315892375], [21.969741690505135, 0.38726760961028983, 4.815153230876393], [64.4628859821228, 0.550580251734387, 0.3040301703455818]], "peak_params_": [[8.045771630136974, 0.701423594090807, 1.9958652659158365], [10.231963611901914, 0.6707705955103117, 2.9185400200264566], [15.12400471654911, 0.8052320331651532, 6.19361063178475], [21.969741690505135, 0.444041847163691, 9.630306461752786], [64.4628859821228, 0.17277140477113728, 0.6080603406911635]], "r_squared_": 0.9905287876313995, "error_": 0.04325023251166577}
{"freq_range": [2.0, 80.0], "freq_res": 1.0, "aperiodic_params_": [0.6899656617341937, 1.0223945747552283], "gaussian_params_": [[7.475759576721478, 0.6780069600834506, 0.3091961068867161], [9.118114577097248, 0.5389138878718858, 1.4252234553687106], [15.027012276518546, 0.6125833125087287, 3.6653297917181638], [23.099888316406517, 0.3516943607246679, 4.681852265092498]], "peak_params_": [[7.475759576721478, 0.44279371308817383, 0.6183922137734322], [9.118114577097248, 0.6993461056487352, 2.8504469107374213], [15.027012276518546, 0.6914190198777984, 7.3306595834363275], [23.099888316406517, 0.4091175533739849, 9.363704530184997]], "r_squared_": 0.9887859183444798, "error_": 0.04477854309085487}
{"freq_range": [2.0, 80.0], "freq_res": 1.0, "aperiodic_params_": [0.7716397772887484, 1.0672875424484327], "gaussian_params_": [[8.460291900225522, 0.6634600302481901, 1.162867160931805], [11.433262011831943, 1.1344599966824551, 0.2653670411166148], [15.235707440962333, 0.6494159669579426, 3.6229703578983847], [19.683608724811855, 0.37066102228707076, 0.9735230811572109], [23.6893339217708, 0.3082955615692437, 1.3144763929305574], [27.042409379415904, 0.23039341701061117, 2.5711661145390745], [64.48519745952233, 1.10185545521973, 0.25225064910213996]], "peak_params_": [[8.460291900225522, 0.7018555386262182, 2.32573432186361], [11.433262011831943, 0.6881691851363801, 0.5307340822332296], [15.235707440962333, 0.6480505836843076, 7.2459407157967695], [19.683608724811855, 0.6365447139510773, 1.9470461623144217], [23.6893339217708, 0.4490415557624644, 2.628952785861115], [27.042409379415904, 0.24662311894170008, 5.142332229078149], [64.48519745952233, 0.17327423371657402, 0.5045012982042799]], "r_squared_": 0.9922048439479733, "error_": 0.03737261987473694}
{"freq_range": [2.0, 80.0], "freq_res": 1.0, "aperiodic_params_": [0.7350699532635387, 1.0394437167667945], "gaussian_params_": [[9.125281676600496, 0.541882740613073, 2.003395695492041], [16.379536436863475, 0.6662698481683428, 4.442842031970815], [24.303026162031035, 0.25424506676257025, 1.0834436269462382], [27.659529053415596, 0.1894283441331993, 1.92253459381488]], "peak_params_": [[9.125281676600496, 0.7085354120373134, 4.006791390984082], [16.379536436863475, 0.6653459815199653, 8.88568406394163], [24.303026162031035, 0.4284828786894771, 2.1668872538924764], [27.659529053415596, 0.2090177049836418, 3.84506918762976]], "r_squared_": 0.9879328254400243, "error_": 0.04738164297384011}
{"freq_range": [2.0, 80.0], "freq_res": 1.0, "aperiodic_params_": [0.7014075531376407, 1.0206481263002116], "gaussian_params_": [[10.107235311841364, 0.756812967043393, 2.609453429212748], [14.682625086270816, 0.37805081311982497, 0.2500300064442874], [17.617141985789043, 0.6794457159397853, 3.401497936829521], [23.833895695452316, 0.23802125226402898, 0.7095010910587961], [27.359069164891807, 0.22729369160136223, 2.096336433306582], [64.48819961471678, 0.6891881757775585, 0.28289853783396296]], "peak_params_": [[10.107235311841364, 0.8115384720838277, 5.218906858425496], [14.682625086270816, 0.8047699846773733, 0.5000600128885748], [17.617141985789043, 0.6829711465263228, 6.802995873659042], [23.833895695452316, 0.4113713886119363, 1.4190021821175922], [27.359069164891807, 0.23912629024576026, 4.192672866613164], [64.48819961471678, 0.15547489851982954, 0.5657970756679259]], "r_squared_": 0.9896210864668042, "error_": 0.04424450875642989}
{"freq_range": [2.0, 80.0], "freq_res": 1.0, "aperiodic_params_": [0.5526562230660857, 0.9346494363230676], "gaussian_params_": [[9.813576325989034, 0.6970109738860791, 2.320387214585342], [15.0218592091907, 0.1613183319100145, 0.2500946619513424], [17.235282480263283, 0.6499794449317727, 3.8039828173748536], [24.117332470287398, 0.1729780190217616, 0.7631736992729122], [28.00415949883478, 0.22934425733600575, 1.3171130823592299]], "peak_params_": [[9.813576325989034, 0.8012587036345036, 4.640774429170684], [15.0218592091907, 0.7649499070419155, 0.5001893239026848], [17.235282480263283, 0.6544968440505441, 7.607965634749707], [24.117332470287398, 0.30691927078498504, 1.5263473985458245], [28.00415949883478, 0.24120034281551916, 2.6342261647184597]], "r_squared_": 0.9865267699698916, "error_": 0.04683562756409458}
{"freq_range": [2.0, 80.0], "freq_res": 1.0, "aperiodic_params_": [0.4687294318397598, 0.9130383770504412], "gaussian_params_": [[9.03762722002255, 0.5915382093221566, 1.3956078486378671], [10.943515780817705, 0.14844935900813375, 0.25000396545390086], [15.061756885349084, 0.4945837421033726, 3.8011812527999593], [19.336897480293636, 0.2697192395963494, 0.2500003644849459], [20.52892434025621, 0.49745809760032333, 0.2834241820058334], [27.58158277263156, 0.3991796663012277, 0.2807941171441558], [57.508729236696155, 0.6668074434998494, 0.2884229035291968], [64.424592023872, 0.6782610513056059, 0.2781981555298987], [74.45203459913596, 0.07687153615139279, 5.999999999999999]], "peak_params_": [[9.03762722002255, 0.7300043348044791, 2.7912156972757343], [10.943515780817705, 0.6442732267864024, 0.5000079309078017], [15.061756885349084, 0.49458282990142677, 7.602362505599919], [19.336897480293636, 0.39795473611968135, 0.5000007289698918], [20.52892434025621, 0.2709709162205501, 0.5668483640116668], [27.58158277263156, 0.1330312329990324, 0.5615882342883116], [57.508729236696155, 0.15810806487403728, 0.5768458070583936], [64.424592023872, 0.22849183176540366, 0.5563963110597974], [74.45203459913596, 0.07665368477800039, 11.999999999999998]], "r_squared_": 0.9894997870034133, "error_": 0.03198594055450352}
{"freq_range": [2.0, 80.0], "freq_res": 1.0, "aperiodic_params_": [0.09788606366499991, 0.704781716040662], "gaussian_params_": [[9.180403029411881, 0.5712803355937929, 1.4893089660913899], [14.962405341805125, 0.5932589913519518, 3.648246367706274], [64.6607659621055, 0.2248358489336558, 0.7312107951899588]], "peak_params_": [[9.180403029411881, 0.7231470167319823, 2.9786179321827797], [14.962405341805125, 0.5935036686002731, 7.296492735412548], [64.6607659621055, 0.2018960351264375, 1.4624215903799176]], "r_squared_": 0.9795104250293484, "error_": 0.04638473944045091}
{"freq_range": [2.0, 80.0], "freq_res": 1.0, "aperiodic_params_": [0.5182015813502057, 0.9245808276317503], "gaussian_params_": [[9.177645468075044, 0.4593415120216722, 1.5753708827877124], [15.40935413462573, 0.6981375771946005, 4.5371305916401905], [64.48598384870903, 0.5313749529312013, 0.3277095088382791]], "peak_params_": [[9.177645468075044, 0.7138308927763121, 3.150741765575425], [15.40935413462573, 0.6957984890770275, 9.074261183280381], [64.48598384870903, 0.1769497374120783, 0.6554190176765582]], "r_squared_": 0.9836608853248675, "error_": 0.053644928944575024}
{"freq_range": [2.0, 80.0], "freq_res": 1.0, "aperiodic_params_": [0.5315486849212844, 0.9424051718144224], "gaussian_params_": [[8.546533975615892, 0.6288346241449493, 1.1922457928654266], [11.237740354730645, 0.31922891320930835, 0.6949659062317243], [15.76157598791552, 0.8503316403014691, 4.22252195632367], [24.931741114869087, 0.23436101150018676, 1.5861811663327896], [30.19412076693618, 0.21002157227953386, 0.4723185312099425], [64.48978934426057, 0.8927740499799129, 0.2645838563934175]], "peak_params_": [[8.546533975615892, 0.822673412536412, 2.3844915857308533], [11.237740354730645, 0.8270200562907475, 1.3899318124634485], [15.76157598791552, 0.84897720605382, 8.44504391264734], [24.931741114869087, 0.3117924109803457, 3.172362332665579], [30.19412076693618, 0.19732124048370114, 0.944637062419885], [64.48978934426057, 0.16092216677342175, 0.529167712786835]], "r_squared_": 0.9908956028872171, "error_": 0.04162205766571568}
{"freq_range": [2.0, 80.0], "freq_res": 1.0, "aperiodic_params_": [0.6802404200616654, 1.0263138743086753], "gaussian_params_": [[9.311727050566573, 0.5971486297101397, 1.981142524720932], [14.908693665020937, 0.11280583320714384, 0.25083633968264557], [16.440551571078835, 0.6917522846148434, 4.338269137773524], [26.05248970923155, 0.15930626110006854, 3.0043669135447915]], "peak_params_": [[9.311727050566573, 0.7487297749522288, 3.962285049441864], [14.908693665020937, 0.7700873587780062, 0.5016726793652911], [16.440551571078835, 0.6907947137330015, 8.676538275547047], [26.05248970923155, 0.2203192421444845, 6.008733827089583]], "r_squared_": 0.986396053006656, "error_": 0.05166265616735139}
{"freq_range": [2.0, 80.0], "freq_res": 1.0, "aperiodic_params_": [0.6827738880358464, 1.0228707833473334], "gaussian_params_": [[9.633891539378865, 0.6342332082212769, 2.111080728760698], [16.33821906849798, 0.7439539077221899, 4.179375114853593], [26.218373330078066, 0.16221009659695063, 2.6944621006727534]], "peak_params_": [[9.633891539378865, 0.8603403609048708, 4.222161457521396], [16.33821906849798, 0.7483673959844477, 8.358750229707185], [26.218373330078066, 0.21308779406109746, 5.388924201345507]], "r_squared_": 0.9870186585312655, "error_": 0.05155116108582439}
{"freq_range": [2.0, 80.0], "freq_res": 1.0, "aperiodic_params_": [0.6828343645495023, 1.0313636956876147], "gaussian_params_": [[9.62443392686743, 0.639167187599789, 2.1071109863880144], [16.269670667823416, 0.7508806155039354, 4.123175147474181], [25.964607632223927, 0.1695391174777099, 2.993454291263889]], "peak_params_": [[9.62443392686743, 0.8654049927988963, 4.214221972776029], [16.269670667823416, 0.7565124344625413, 8.246350294948362], [25.964607632223927, 0.2158973757229059, 5.986908582527778]], "r_squared_": 0.9870129204796249, "error_": 0.051698875080176475}
{"freq_range": [2.0, 80.0], "freq_res": 1.0, "aperiodic_params_": [0.35448977501628937, 0.8781775956963791], "gaussian_params_": [[9.399826657267786, 0.6095846121398268, 2.0210660432893204], [16.234745263868575, 0.6937788193188469, 4.923317215134599]], "peak_params_": [[9.399826657267786, 0.8334482378617767, 4.042132086578641], [16.234745263868575, 0.6959365472172816, 9.846634430269198]], "r_squared_": 0.9852891280164405, "error_": 0.04955618896639051}
{"freq_range": [2.0, 80.0], "freq_res": 1.0, "aperiodic_params_": [0.35924286143095324, 0.8874514589200495], "gaussian_params_": [[9.441278750058784, 0.6034477875549531, 2.023588877371853], [16.274144307009905, 0.6863326122702212, 4.9986765301281215]], "peak_params_": [[9.441278750058784, 0.8273327529454757, 4.047177754743706], [16.274144307009905, 0.6884599974759403, 9.997353060256243]], "r_squared_": 0.9856430508355402, "error_": 0.05044593278409874}
{"freq_range": [2.0, 80.0], "freq_res": 1.0, "aperiodic_params_": [-0.04575214096273202, 0.6567335030862549], "gaussian_params_": [[9.430466797435294, 0.6098809848942073, 1.7525367653097512], [15.699132910612308, 0.3416441376780702, 2.4817332930996017], [41.6469678637948, 0.48767385759035126, 0.2500336660291522], [64.61846392861874, 0.20298432406004696, 0.8128380269568369]], "peak_params_": [[9.430466797435294, 0.6006974051620684, 3.5050735306195024], [15.699132910612308, 0.33968460355505325, 4.963466586199203], [41.6469678637948, 0.17998289609733598, 0.5000673320583044], [64.61846392861874, 0.18181076734289214, 1.6256760539136739]], "r_squared_": 0.9599005298763694, "error_": 0.05354465354781468}
{"freq_range": [2.0, 80.0], "freq_res": 1.0, "aperiodic_params_": [0.2629428718323041, 0.7911974000915347], "gaussian_params_": [[9.5883496172246, 0.5959154853686871, 1.6874291451431958], [15.238878257502105, 0.5744806933335245, 3.4012158681704814]], "peak_params_": [[9.5883496172246, 0.7538694887689822, 3.3748582902863915], [15.238878257502105, 0.5765473723852292, 6.802431736340963]], "r_squared_": 0.9758708603498742, "error_": 0.053150865624755336}
{"freq_range": [2.0, 80.0], "freq_res": 1.0, "aperiodic_params_": [0.5369157747179846, 0.9491598639173214], "gaussian_params_": [[9.55411438446519, 0.6087913813561935, 1.828506942142474], [15.617934930991987, 0.7317455010455844, 3.873588940408822], [22.73958355258825, 0.1645291427993893, 0.38611994072562067], [24.97481838528639, 0.19134164089589242, 0.6846040776775643]], "peak_params_": [[9.55411438446519, 0.8465849109531478, 3.657013884284948], [15.617934930991987, 0.7294135707838816, 7.747177880817644], [22.73958355258825, 0.2530895650147278, 0.7722398814512413], [24.97481838528639, 0.23016094734748038, 1.3692081553551285]], "r_squared_": 0.984755868543923, "error_": 0.05186521828254972}
{"freq_range": [2.0, 80.0], "freq_res": 1.0, "aperiodic_params_": [0.604093343960186, 0.9943721690055289], "gaussian_params_": [[9.634478368618886, 0.6157953889405006, 2.1006587920384483], [14.985767631007793, 0.1601267335263472, 0.2503353050053581], [16.48375793683608, 0.6597205690705492, 4.755621579117488]], "peak_params_": [[9.634478368618886, 0.8669912161298274, 4.201317584076897], [14.985767631007793, 0.8118399000527263, 0.5006706100107162], [16.48375793683608, 0.662604300285832, 9.511243158234976]], "r_squared_": 0.985906302163914, "error_": 0.053745967863150446}
{"freq_range": [2.0, 80.0], "freq_res": 1.0, "aperiodic_params_": [0.6733838362812216, 1.0308522647206815], "gaussian_params_": [[9.79775924248352, 0.6348051875513572, 1.994718976323542], [16.263836895752355, 0.6912471102375302, 4.679956820886066]], "peak_params_": [[9.79775924248352, 0.913799291530317, 3.989437952647084], [16.263836895752355, 0.6951993119342357, 9.359913641772131]], "r_squared_": 0.9862004120138781, "error_": 0.05468549286747694}
{"freq_range": [2.0, 80.0], "freq_res": 1.0, "aperiodic_params_": [0.42085906486666574, 0.9194806194795295], "gaussian_params_": [[9.606732362390666, 0.6822738825099399, 1.9832228272350207], [16.27837885691726, 0.6263970334039574, 4.743140407104339]], "peak_params_": [[9.606732362390666, 0.9298356671253785, 3.9664456544700415], [16.27837885691726, 0.6290978441075525, 9.486280814208678]], "r_squared_": 0.9840140781968608, "error_": 0.051270070273641666}
{"freq_range": [2.0, 80.0], "freq_res": 1.0, "aperiodic_params_": [0.03689985842114796, 0.7099508606551176], "gaussian_params_": [[8.877565761263348, 0.7822820283148336, 1.5626716802775442], [10.557900259373323, 1.6417960246033074, 0.2660977520884196], [13.428212710358295, 0.32129789430725136, 1.2301018125537324], [17.672957521297413, 0.38680202872469055, 3.470663379471434], [35.27314945589818, 0.194149966479543, 1.789799708055566]], "peak_params_": [[8.877565761263348, 0.7974179889791858, 3.1253433605550884], [10.557900259373323, 0.8307037889853833, 0.5321955041768393], [13.428212710358295, 0.4827713520221224, 2.460203625107465], [17.672957521297413, 0.38541027418635604, 6.941326758942868], [35.27314945589818, 0.1919035852867098, 3.579599416111132]], "r_squared_": 0.9835668161746416, "error_": 0.04336333368611536}
{"freq_range": [2.0, 80.0], "freq_res": 1.0, "aperiodic_params_": [0.5096669030759184, 0.9493602052544095], "gaussian_params_": [[9.816574620780873, 0.5789366681015292, 1.8309992291697326], [15.574857169624975, 0.5316952524158945, 3.316382227870887]], "peak_params_": [[9.816574620780873, 0.705474183401782, 3.661998458339465], [15.574857169624975, 0.5292768448941189, 6.632764455741774]], "r_squared_": 0.9808174277325308, "error_": 0.05226169199436224}
{"freq_range": [2.0, 80.0], "freq_res": 1.0, "aperiodic_params_": [0.40384846211422054, 0.9044950917105692], "gaussian_params_": [[9.223701760166952, 0.6041555752075476, 1.7829301234184753], [14.276096831957403, 0.5921482719765335, 2.9906487797548698], [17.344571997145575, 0.3491839145545503, 0.27801357045209535], [19.335860674021365, 0.2745964054691334, 1.0390498022655972], [23.097368455734586, 0.172406564356107, 1.3894034202821202]], "peak_params_": [[9.223701760166952, 0.7243245932271879, 3.5658602468369507], [14.276096831957403, 0.6063333967541483, 5.9812975595097395], [17.344571997145575, 0.5750911437610113, 0.5560271409041907], [19.335860674021365, 0.43292614686111985, 2.0780996045311944], [23.097368455734586, 0.18093873952934392, 2.7788068405642403]], "r_squared_": 0.9844432336198831, "error_": 0.04714073557736842}
{"freq_range": [2.0, 80.0], "freq_res": 1.0, "aperiodic_params_": [0.44041314569283324, 0.9259747408022279], "gaussian_params_": [[9.575109289767372, 0.6258056848583348, 1.9100862374293721], [15.804910220130827, 0.5925285729460237, 4.578189031209873]], "peak_params_": [[9.575109289767372, 0.8757304469954745, 3.8201724748587442], [15.804910220130827, 0.5941765037931658, 9.156378062419746]], "r_squared_": 0.9865230796263574, "error_": 0.04665674085191357}
{"freq_range": [2.0, 80.0], "freq_res": 1.0, "aperiodic_params_": [-0.24162313172015001, 0.5575342902822944], "gaussian_params_": [[8.799599580651112, 0.6426868337061924, 1.440838413358274], [14.833457572151833, 0.2588612582252594, 2.930261596128173], [32.618321726229865, 0.511942974076503, 0.2500077943442026], [57.497513744168344, 0.8651782618117912, 0.2858477539301257], [64.68558200998514, 0.2695256025312584, 0.7993218815554909]], "peak_params_": [[8.799599580651112, 0.6721851675564696, 2.881676826716548], [14.833457572151833, 0.25850469846127744, 5.860523192256346], [32.618321726229865, 0.15963013396891634, 0.5000155886884052], [57.497513744168344, 0.1902409549523736, 0.5716955078602514], [64.68558200998514, 0.24946009139313174, 1.5986437631109818]], "r_squared_": 0.9525700736995643, "error_": 0.05414015619129343}
{"freq_range": [2.0, 80.0], "freq_res": 1.0, "aperiodic_params_": [-0.39281294543869594, 0.5059412452198082], "gaussian_params_": [[7.537059240311946, 1.0970165443573516, 0.30040940662044924], [9.567762244230593, 0.5099232959462091, 1.19741639958267], [15.107125430020712, 0.3078830134150896, 2.9931682025883135], [20.00464344096017, 0.16745655676849003, 0.2500159268233502], [23.267457385355826, 0.12261277550587624, 1.7237104357597854], [28.42917845749918, 0.5836806727597933, 0.27075192640123613], [50.77335367262898, 0.09497465111862279, 2.312189412872921], [57.496532468200186, 0.7110971185347368, 0.28280587808257646], [64.53662184355986, 0.22227142471280786, 0.5493545868795968]], "peak_params_": [[7.537059240311946, 0.5693807620661543, 0.6008188132408985], [9.567762244230593, 0.5495724904164089, 2.39483279916534], [15.107125430020712, 0.30770444231769445, 5.986336405176627], [20.00464344096017, 0.26869724621036606, 0.5000318536467004], [23.267457385355826, 0.1306612214758811, 3.447420871519571], [28.42917845749918, 0.1690305938610387, 0.5415038528024723], [50.77335367262898, 0.09451946871287209, 4.624378825745842], [57.496532468200186, 0.15477542754598916, 0.5656117561651529], [64.53662184355986, 0.15573516282002497, 1.0987091737591936]], "r_squared_": 0.9774467093411677, "error_": 0.03179487548727476}
{"freq_range": [2.0, 80.0], "freq_res": 1.0, "aperiodic_params_": [0.4634975827230869, 0.9016947216940812], "gaussian_params_": [[8.703326928031132, 0.5949801391440156, 1.5783790410598655], [14.60649841377451, 0.1665248443385062, 2.677228266249976], [20.25833049628225, 0.13476823239873664, 0.8166367014216169], [51.05711852398128, 0.11812792346802882, 1.7038538598932775], [57.249318123099236, 0.19692542607149383, 0.8088475112332069], [64.68656386689636, 0.24181750341221137, 0.7082251111737117], [72.93968411521335, 0.1025847534202527, 4.682788011614411]], "peak_params_": [[8.703326928031132, 0.6031486898072671, 3.156758082119731], [14.60649841377451, 0.16494405844154525, 5.354456532499952], [20.25833049628225, 0.15007767156643492, 1.6332734028432339], [51.05711852398128, 0.1180633219450441, 3.407707719786555], [57.249318123099236, 0.18837135491814694, 1.6176950224664137], [64.68656386689636, 0.2436277136846693, 1.4164502223474233], [72.93968411521335, 0.10257624421066258, 9.365576023228822]], "r_squared_": 0.9837801435187984, "error_": 0.0368210959099551}
{"freq_range": [2.0, 80.0], "freq_res": 1.0, "aperiodic_params_": [-0.043040631389103245, 0.6574722114515057], "gaussian_params_": [[7.5502622720521595, 1.2092676877581094, 0.3082854508265693], [9.625739914143553, 0.591002421075813, 1.0882778658434697], [14.930139254360657, 0.3437307378050332, 3.2830254034119664], [20.13442728818794, 0.17401604924956623, 0.25015518434640494], [21.841907136323297, 0.07341718046149626, 0.2502214510734167], [24.234798020344495, 0.1389531799908016, 2.7964632495159805], [64.48521515761024, 0.6252493227391549, 0.2911040423154432], [77.33117935297314, 0.3437533414858809, 0.2554416307692938]], "peak_params_": [[7.5502622720521595, 0.6479208040699588, 0.6165709016531385], [9.625739914143553, 0.6683752985685905, 2.1765557316869395], [14.930139254360657, 0.34425132947325865, 6.566050806823933], [20.13442728818794, 0.29908903222968497, 0.5003103686928099], [21.841907136323297, 0.19492639174794157, 0.5004429021468334], [24.234798020344495, 0.1460307648824133, 5.592926499031961], [64.48521515761024, 0.15587003224924612, 0.5822080846308864], [77.33117935297314, 0.14833480364886764, 0.5108832615385877]], "r_squared_": 0.9785577467343157, "error_": 0.03968225733084328}
