{"freq_range": [2.0, 80.0], "freq_res": 1.0, "aperiodic_params_": [-0.290155651797993, 0.23889230287115404], "gaussian_params_": [[10.41618717727156, 0.32916333418638405, 0.8667482125208782], [13.52026543512864, 0.19410442181695486, 0.6785545148565251], [17.558013964913968, 0.35427374983824567, 2.371046143693696], [21.31563881608035, 0.2938738806963409, 0.8985533003636005], [27.145616035742872, 0.3921467268163492, 2.825820897921363], [36.31901398685032, 0.17419271646886242, 0.8516793981571675], [41.27557319324442, 0.17168951524024323, 0.8971303902422471], [43.52973414578227, 0.9511252693618173, 0.27894227434510344], [52.741190741977746, 0.11236502709832759, 5.4998695241773445], [58.59698398440123, 0.37492563282050717, 0.2500156062386433], [61.40886546082483, 0.543575129446334, 0.251275548284163]], "peak_params_": [[10.41618717727156, 0.2955250832836404, 1.7334964250417564], [13.52026543512864, 0.26616304773794497, 1.3571090297130501], [17.558013964913968, 0.3505804914260422, 4.742092287387392], [21.31563881608035, 0.4366551467088854, 1.797106600727201], [27.145616035742872, 0.3917559825907413, 5.651641795842726], [36.31901398685032, 0.16637854812839564, 1.703358796314335], [41.27557319324442, 0.17528815598051783, 1.7942607804844941], [43.52973414578227, 0.26312856797005074, 0.5578845486902069], [52.741190741977746, 0.11224068574076662, 10.999739048354689], [58.59698398440123, 0.161065336604028, 0.5000312124772865], [61.40886546082483, 0.18104387897732988, 0.502551096568326]], "r_squared_": 0.9124863771976522, "error_": 0.03723898562426501}
{"freq_range": [2.0, 80.0], "freq_res": 1.0, "aperiodic_params_": [-0.20140578498342493, 0.44469120389270467], "gaussian_params_": [[10.430177683032166, 0.3700237707686098, 0.9563977216155117], [16.684946252323428, 0.4334262773786509, 4.002949231937397], [26.28583755513207, 0.33122050904413175, 1.6663175580496254], [29.085666491251207, 0.34223539197389824, 1.2673571078357786], [54.54796540086405, 0.1401672307713171, 5.999999999999999]], "peak_params_": [[10.430177683032166, 0.44190026836521296, 1.9127954432310235], [16.684946252323428, 0.432085976003917, 8.005898463874795], [26.28583755513207, 0.372957999212371, 3.332635116099251], [29.085666491251207, 0.433189420725291, 2.534714215671557], [54.54796540086405, 0.13977000150731478, 11.999999999999998]], "r_squared_": 0.9370457720756014, "error_": 0.04866245650964316}
{"freq_range": [2.0, 80.0], "freq_res": 1.0, "aperiodic_params_": [0.02422572525039159, 0.5655185673508334], "gaussian_params_": [[9.965056727753316, 0.2155281870835733, 0.8532928607853771], [13.876141098560009, 0.227481441748822, 0.8952961537257035], [16.80337452052326, 0.30871127822472544, 1.0006620078763022], [24.80887909482976, 0.4065495096462874, 4.690375047822218], [46.0917108716325, 0.17528648626792326, 5.08243068530459], [49.06526275368869, 0.03854361244567209, 0.2504533756155194], [52.86044057078771, 0.11813828476129797, 0.6500763937272821]], "peak_params_": [[9.965056727753316, 0.21814970771351105, 1.7065857215707543], [13.876141098560009, 0.2599880238547202, 1.790592307451407], [16.80337452052326, 0.4050028298704785, 2.0013240157526044], [24.80887909482976, 0.4062440612729833, 9.380750095644435], [46.0917108716325, 0.17527296966056816, 10.16486137060918], [49.06526275368869, 0.18607232328238932, 0.5009067512310388], [52.86044057078771, 0.1850385474676114, 1.3001527874545642]], "r_squared_": 0.9500903942820318, "error_": 0.042426519055025966}
{"freq_range": [2.0, 80.0], "freq_res": 1.0, "aperiodic_params_": [-0.10879435212221662, 0.2785603719123048], "gaussian_params_": [[10.20907870371871, 0.3119899872840348, 0.9158651980844764], [16.766811031236355, 0.4199985838981094, 2.875692599249], [22.109004059778286, 0.3487606016845799, 2.202788717704921], [27.651138655944646, 0.2669989417638062, 2.956823445509154], [39.15716694287072, 0.21474627931222065, 5.214901706003624], [53.58870106881329, 0.15002543375370253, 5.9999999992320445]], "peak_params_": [[10.20907870371871, 0.3303215690752455, 1.8317303961689528], [16.766811031236355, 0.44273440235031386, 5.751385198498], [22.109004059778286, 0.47246893502605786, 4.405577435409842], [27.651138655944646, 0.2969037887052649, 5.913646891018308], [39.15716694287072, 0.22262315477197614, 10.429803412007248], [53.58870106881329, 0.15341278196664743, 11.999999998464089]], "r_squared_": 0.8988113764501746, "error_": 0.051601371460722016}
{"freq_range": [2.0, 80.0], "freq_res": 1.0, "aperiodic_params_": [-0.010659512817182424, 0.4979123400261745], "gaussian_params_": [[10.315296102211342, 0.49339312827412857, 0.9745515496307933], [17.892825700925513, 0.49082823241844553, 4.715510801889723], [27.60552969180115, 0.31267258693370237, 1.3436992587144048], [29.36726477726047, 0.577460758490187, 0.250035682656062], [51.29617630840089, 0.23580328378634072, 0.9307089618695942], [72.82418772114549, 0.1927212813123941, 0.5184058652618695]], "peak_params_": [[10.315296102211342, 0.5891745646217179, 1.9491030992615865], [17.892825700925513, 0.49070147678708287, 9.431021603779445], [27.60552969180115, 0.3488401708334194, 2.6873985174288095], [29.36726477726047, 0.4094606655168834, 0.500071365312124], [51.29617630840089, 0.22416084303531825, 1.8614179237391884], [72.82418772114549, 0.18195091677697395, 1.036811730523739]], "r_squared_": 0.9488957912370491, "error_": 0.049462575404269404}
{"freq_range": [2.0, 80.0], "freq_res": 1.0, "aperiodic_params_": [-0.2779524575555548, 0.26761596899638845], "gaussian_params_": [[18.40044707706285, 0.45164365483602115, 5.999999999999999], [28.31724698387799, 0.3016246600394294, 1.0849004255862735], [44.41840570618978, 0.18614352614942897, 5.802910894856274], [61.420223770002245, 0.8233271168704478, 0.25000030332323236]], "peak_params_": [[18.40044707706285, 0.4506447543022565, 11.999999999999998], [28.31724698387799, 0.4179898434690229, 2.169800851172547], [44.41840570618978, 0.1857106298880048, 11.605821789712548], [61.420223770002245, 0.20360687130083488, 0.5000006066464647]], "r_squared_": 0.8664374122580447, "error_": 0.05753378979077882}
{"freq_range": [2.0, 80.0], "freq_res": 1.0, "aperiodic_params_": [0.2647812137950112, 0.8957721135834678], "gaussian_params_": [[9.399254488643859, 0.4752714926633574, 1.286070418376112], [17.28918616581257, 0.480444510818356, 3.877948130635106], [27.342287960338997, 0.2811311873833822, 0.731072353932], [29.731266251604342, 0.2220122650603515, 0.767203714620294], [59.798811013429216, 0.16370515858289292, 0.5556969340449142], [63.731395570334044, 0.16511398134125577, 0.7758506739116833]], "peak_params_": [[9.399254488643859, 0.5018336956007577, 2.572140836752224], [17.28918616581257, 0.47911050841128305, 7.755896261270212], [27.342287960338997, 0.27323241527369246, 1.462144707864], [29.731266251604342, 0.2114134901394349, 1.534407429240588], [59.798811013429216, 0.15332162266810356, 1.1113938680898283], [63.731395570334044, 0.1555094673677584, 1.5517013478233666]], "r_squared_": 0.9879212940298024, "error_": 0.03409488015251155}
{"freq_range": [2.0, 80.0], "freq_res": 1.0, "aperiodic_params_": [0.1431212469922748, 0.5011980654395114], "gaussian_params_": [[10.379359383535503, 0.339385207600341, 1.1304571394375302], [17.323796165993926, 0.5853358568017283, 3.2357054617196126], [22.955084849543262, 0.19294222782135417, 1.9940280946518576], [30.096298522021254, 0.31437573434928456, 5.600317619842306], [37.97451610733008, 0.16859029385339, 1.0395140722229628], [40.5173386250441, 0.693652634158551, 0.3152563516158599], [43.22390007243942, 0.23083116963835623, 0.7529764200105115], [45.07719723931167, 0.21462498318012538, 0.4013093785388812], [50.56035478089341, 0.23535822489436786, 4.661181093154227], [58.379916075744696, 0.33574296251482305, 0.274414828967908]], "peak_params_": [[10.379359383535503, 0.366484834512099, 2.2609142788750605], [17.323796165993926, 0.6050604248858945, 6.471410923439225], [22.955084849543262, 0.4594069968638662, 3.988056189303715], [30.096298522021254, 0.3149911814553138, 11.200635239684612], [37.97451610733008, 0.29090669685484344, 2.0790281444459255], [40.5173386250441, 0.2962040304428599, 0.6305127032317198], [43.22390007243942, 0.30612434333135136, 1.505952840021023], [45.07719723931167, 0.34963269486444337, 0.8026187570777624], [50.56035478089341, 0.2346101850226292, 9.322362186308453], [58.379916075744696, 0.19461440406299102, 0.548829657935816]], "r_squared_": 0.9533401944700575, "error_": 0.04423111078565019}
{"freq_range": [2.0, 80.0], "freq_res": 1.0, "aperiodic_params_": [0.13994036792934053, 0.5008430071721611], "gaussian_params_": [[10.369551951530196, 0.3334609337006127, 1.1473015818113315], [17.228135963515907, 0.5912048785714413, 3.1650549904636427], [22.819421677687345, 0.253916668225228, 2.2555423597646236], [30.069625170135314, 0.3178679635525145, 4.4324945633002475], [39.30755716213872, 0.21022926858257424, 2.4853605628055933], [43.46029420709057, 0.5043346029183875, 0.2940498499567081], [44.817272768385145, 0.2657200926028035, 0.25000288973492785], [50.64451518560346, 0.22760733581583628, 5.61626777604554]], "peak_params_": [[10.369551951530196, 0.36018806423258987, 2.294603163622663], [17.228135963515907, 0.6028892335878882, 6.330109980927285], [22.819421677687345, 0.4542968349926876, 4.511084719529247], [30.069625170135314, 0.3200544898996969, 8.864989126600495], [39.30755716213872, 0.2769178817823313, 4.9707211256111865], [43.46029420709057, 0.3124959142120558, 0.5880996999134162], [44.817272768385145, 0.35714284974323063, 0.5000057794698557], [50.64451518560346, 0.22715971835185778, 11.23253555209108]], "r_squared_": 0.948690575879474, "error_": 0.04969622122385005}
{"freq_range": [2.0, 80.0], "freq_res": 1.0, "aperiodic_params_": [0.37983357023142805, 0.9181981798692168], "gaussian_params_": [[10.241679979598189, 0.5378949817197066, 1.35744605047427], [17.70765140733252, 0.7483807429519724, 4.394172128457278], [28.11398403625969, 0.4868351745677676, 2.67562998417874]], "peak_params_": [[10.241679979598189, 0.6901378729828602, 2.71489210094854], [17.70765140733252, 0.7471105784694418, 8.788344256914556], [28.11398403625969, 0.5345662715123697, 5.35125996835748]], "r_squared_": 0.9853545110591065, "error_": 0.04754410907400266}
{"freq_range": [2.0, 80.0], "freq_res": 1.0, "aperiodic_params_": [0.3887409899421441, 0.9283771013397519], "gaussian_params_": [[10.241846333653447, 0.5396999777985708, 1.3641878854657217], [17.708744499361647, 0.7529392229616775, 4.373676976600187], [28.114847485169893, 0.4823669560510022, 2.8175726313977036]], "peak_params_": [[10.241846333653447, 0.690574992921045, 2.7283757709314433], [17.708744499361647, 0.7520388042295963, 8.747353953200374], [28.114847485169893, 0.5292273103480144, 5.635145262795407]], "r_squared_": 0.9857819697682028, "error_": 0.04688901346143431}
{"freq_range": [2.0, 80.0], "freq_res": 1.0, "aperiodic_params_": [0.4503166426848985, 1.0362475960724744], "gaussian_params_": [[10.241299156172811, 0.5859974421738645, 1.4877032819445122], [16.270420603594335, 0.6787095528973294, 3.6131708160259786], [24.452065578186016, 0.4135956036499891, 4.843409025712682], [28.626024391803206, 0.37620717177832874, 1.5575084299063269]], "peak_params_": [[10.241299156172811, 0.7337165824138664, 2.9754065638890244], [16.270420603594335, 0.7673590821433266, 7.226341632051957], [24.452065578186016, 0.4852172613669329, 9.686818051425364], [28.626024391803206, 0.6330290250904511, 3.1150168598126537]], "r_squared_": 0.9892304579284843, "error_": 0.04634420200701524}
{"freq_range": [2.0, 80.0], "freq_res": 1.0, "aperiodic_params_": [0.27161090398572896, 0.7754765074935127], "gaussian_params_": [[10.406525061846935, 0.4818334246936513, 1.3174199078454563], [18.00856279847343, 0.644509885094842, 4.781487489951018], [28.410616518896123, 0.4077988351416553, 1.9271378858813653]], "peak_params_": [[10.406525061846935, 0.6179425708433659, 2.6348398156909125], [18.00856279847343, 0.6445090687389095, 9.562974979902036], [28.410616518896123, 0.4712675517338101, 3.8542757717627305]], "r_squared_": 0.9807556871862727, "error_": 0.04571795875376445}
{"freq_range": [2.0, 80.0], "freq_res": 1.0, "aperiodic_params_": [-0.0936788009650712, 0.25064791626640764], "gaussian_params_": [[10.70928972749209, 0.34290260140914525, 0.950923584490907], [18.890443577509824, 0.6073889065366027, 3.682636758963298], [31.904069198271888, 0.16230490296015385, 5.999999999999999], [41.29224406944307, 0.2144357870820472, 3.593898306674811], [52.72404374601112, 0.15339712377591025, 5.999999999899767]], "peak_params_": [[10.70928972749209, 0.38880063555548733, 1.901847168981814], [18.890443577509824, 0.6231872230336784, 7.365273517926596], [31.904069198271888, 0.17133310908873167, 11.999999999999998], [41.29224406944307, 0.28790161979209566, 7.187796613349622], [52.72404374601112, 0.15463437492985255, 11.999999999799535]], "r_squared_": 0.9103143579483939, "error_": 0.05124782745217847}
{"freq_range": [2.0, 80.0], "freq_res": 1.0, "aperiodic_params_": [-0.09425628047242177, 0.2481282520078454], "gaussian_params_": [[10.842610868377223, 0.3521424537081459, 1.1196556976236691], [16.374846632988174, 0.17054381712809136, 0.9754469658363584], [19.6414965273235, 0.5863611679299456, 3.5889507542734735], [28.126721289657677, 0.1300054689643955, 1.0736436268833378], [36.290144371608996, 0.12807509674439937, 5.998438487703378], [42.94762757847724, 0.1811438755520783, 5.9999214509184275], [50.597591761451326, 0.5111102277004125, 0.25001708790071986], [57.54794528720015, 0.10563666779090558, 4.037148128884415]], "peak_params_": [[10.842610868377223, 0.3810016872469281, 2.2393113952473382], [16.374846632988174, 0.5092804519482215, 1.9508939316727167], [19.6414965273235, 0.5869405715311105, 7.177901508546947], [28.126721289657677, 0.22545595484892048, 2.1472872537666756], [36.290144371608996, 0.22059673213600361, 11.996876975406757], [42.94762757847724, 0.24980721038325415, 11.999842901836855], [50.597591761451326, 0.24824150076882334, 0.5000341758014397], [57.54794528720015, 0.11294592354705468, 8.07429625776883]], "r_squared_": 0.9202672337012908, "error_": 0.04726453362756867}
{"freq_range": [2.0, 80.0], "freq_res": 1.0, "aperiodic_params_": [0.06121351624605212, 0.7267285512713082], "gaussian_params_": [[9.964266873721886, 0.6269848312027957, 1.6724075462129457], [15.965827686993014, 0.5501935801547309, 2.37539011274703], [20.574799562212178, 0.2966511536338943, 1.535988294321882], [24.422208839703266, 0.1664730968757109, 0.935596086279394], [27.360492028752397, 0.24749039353625424, 0.6015857379424087], [29.62465817140537, 0.4555861439709477, 0.25532444632489276], [63.588793201673845, 0.30605110219238874, 0.3172186278781553]], "peak_params_": [[9.964266873721886, 0.6503280170239016, 3.3448150924258915], [15.965827686993014, 0.5545828142886263, 4.75078022549406], [20.574799562212178, 0.3439451793071635, 3.071976588643764], [24.422208839703266, 0.17684623039664105, 1.871192172558788], [27.360492028752397, 0.21061471423052136, 1.2031714758848173], [29.62465817140537, 0.15464851136792912, 0.5106488926497855], [63.588793201673845, 0.13210147803232197, 0.6344372557563106]], "r_squared_": 0.9881369342529163, "error_": 0.03168823122682865}
{"freq_range": [2.0, 80.0], "freq_res": 1.0, "aperiodic_params_": [0.31134496081076546, 0.7228225541469838], "gaussian_params_": [[9.827733975183351, 0.31429141297548496, 1.3308994409067294], [15.74808774201971, 0.45195518059786055, 2.5016121914191407], [21.687701825989507, 0.2967725554755732, 4.059772111134763], [33.09593080172785, 0.1609124557041463, 5.999999999999999]], "peak_params_": [[9.827733975183351, 0.3487309409229014, 2.661798881813459], [15.74808774201971, 0.563681294745593, 5.003224382838281], [21.687701825989507, 0.3448990685373745, 8.119544222269527], [33.09593080172785, 0.1670075406694611, 11.999999999999998]], "r_squared_": 0.9592488280166804, "error_": 0.05587896766455159}
{"freq_range": [2.0, 80.0], "freq_res": 1.0, "aperiodic_params_": [0.46403722142352516, 0.7883235802340796], "gaussian_params_": [[9.88982790734708, 0.27802066711445667, 0.9874797857294889], [17.049827167195787, 0.6075662688597019, 4.120670357487204], [28.2638283184069, 0.4319964270791443, 5.999999999999999], [36.88727680143309, 0.21170846236903995, 0.6617061479254678], [42.20966671736758, 0.23393277156122613, 2.640330092795483], [47.48788423580433, 0.803233010649279, 0.2660602831336822], [49.931217824028884, 0.16598205381220982, 5.999999999999694]], "peak_params_": [[9.88982790734708, 0.42110425807949986, 1.9749595714589778], [17.049827167195787, 0.6816860450598871, 8.241340714974408], [28.2638283184069, 0.44957749761721566, 11.999999999999998], [36.88727680143309, 0.4079980761641762, 1.3234122958509356], [42.20966671736758, 0.33391214803280594, 5.280660185590966], [47.48788423580433, 0.3452300299780686, 0.5321205662673644], [49.931217824028884, 0.16959258456921666, 11.999999999999387]], "r_squared_": 0.9771762527212067, "error_": 0.04945144208809964}
{"freq_range": [2.0, 80.0], "freq_res": 1.0, "aperiodic_params_": [0.539322272520666, 1.0960967248567937], "gaussian_params_": [[10.244519117017472, 0.57003382996535, 1.5382891544554795], [17.466154305496175, 0.8728461720298092, 4.283515156129647], [28.063465291802277, 0.6940101546767368, 2.9717468478063767]], "peak_params_": [[10.244519117017472, 0.7539668084160658, 3.076578308910959], [17.466154305496175, 0.8684086994608751, 8.567030312259295], [28.063465291802277, 0.7362891934160306, 5.943493695612753]], "r_squared_": 0.9857016862447626, "error_": 0.05850440733201784}
{"freq_range": [2.0, 80.0], "freq_res": 1.0, "aperiodic_params_": [0.5316985292880917, 1.09174101768374], "gaussian_params_": [[10.240062971342157, 0.5744085356712716, 1.5554978990260322], [17.517813195870634, 0.8777115698517584, 4.310664782757423], [28.10405088341291, 0.6989673882922023, 2.880143064045378]], "peak_params_": [[10.240062971342157, 0.7594258892813438, 3.1109957980520644], [17.517813195870634, 0.8737256155638566, 8.621329565514847], [28.10405088341291, 0.7441506327955364, 5.760286128090756]], "r_squared_": 0.9856788018981024, "error_": 0.05825661823067536}
{"freq_range": [2.0, 80.0], "freq_res": 1.0, "aperiodic_params_": [0.5633378796799805, 1.1405304094120312], "gaussian_params_": [[10.362055166706796, 0.5600509793234029, 1.6849923821959247], [17.438724014987113, 0.8974632619988565, 4.45388229633526], [28.220215101964012, 0.7906799278860605, 2.713985435101136]], "peak_params_": [[10.362055166706796, 0.7697520927348391, 3.3699847643918495], [17.438724014987113, 0.8935123571143027, 8.90776459267052], [28.220215101964012, 0.8420365955741993, 5.427970870202272]], "r_squared_": 0.9902247029554566, "error_": 0.05017868453519128}
{"freq_range": [2.0, 80.0], "freq_res": 1.0, "aperiodic_params_": [0.45738425288178314, 0.9573436181758679], "gaussian_params_": [[10.464355849036743, 0.5108214946199129, 1.5464771359439724], [17.51945114190693, 0.7624723890255584, 4.295449810027744], [28.135529873507004, 0.5575816378998708, 2.937947927395638]], "peak_params_": [[10.464355849036743, 0.653039053648299, 3.092954271887945], [17.51945114190693, 0.7591712070371466, 8.590899620055488], [28.135529873507004, 0.5958486303388826, 5.875895854791276]], "r_squared_": 0.9789063442440612, "error_": 0.06059968877542207}
{"freq_range": [2.0, 80.0], "freq_res": 1.0, "aperiodic_params_": [0.04359749052044949, 0.4140367200205445], "gaussian_params_": [[10.367641935908338, 0.4056952055214501, 1.226560154545752], [13.399480856104551, 0.38821728105026027, 0.2889576324327503], [17.63767667140483, 0.49529623747189455, 3.854226601188977], [27.38190196991982, 0.30077897831875033, 0.25961273198897633], [27.81360249129343, 0.23307271066263857, 5.073917599764697], [38.21010820675867, 0.16503433150356378, 1.0487970142473066], [40.62822952838379, 0.32590997363373364, 0.2954888439234394], [43.37954603841355, 0.22842805819758089, 0.5895768283081256]], "peak_params_": [[10.367641935908338, 0.4578923187310226, 2.453120309091504], [13.399480856104551, 0.4332768221508801, 0.5779152648655006], [17.63767667140483, 0.5290193192011122, 7.708453202377954], [27.38190196991982, 0.357952467692557, 0.5192254639779527], [27.81360249129343, 0.2639334499798118, 10.147835199529395], [38.21010820675867, 0.19282232479250072, 2.0975940284946133], [40.62822952838379, 0.16051745659532501, 0.5909776878468788], [43.37954603841355, 0.18832556146461055, 1.1791536566162513]], "r_squared_": 0.9572560217825139, "error_": 0.03945724641834911}
{"freq_range": [2.0, 80.0], "freq_res": 1.0, "aperiodic_params_": [-0.015405363041027308, 0.3920751763461311], "gaussian_params_": [[10.545385891822377, 0.33634450005906763, 1.247618049644031], [13.400269611086316, 0.48869978901907724, 0.2770798146017245], [17.944153753957213, 0.5229846610418283, 2.916165786094098], [21.40661237018968, 0.45648855388469983, 0.2644507189196907], [27.11377798229324, 0.20827634500797498, 0.686063071994277], [29.917146339364372, 0.1936294801892088, 0.6210965326130676], [34.784952519356345, 0.25512820115414286, 2.2129358728690414], [40.36153930694921, 0.2594589357537055, 1.2470872502688513], [48.81442607130768, 0.12289791120427665, 5.6090180980046425], [53.998455397235595, 0.14580215040517464, 0.2500098801423334]], "peak_params_": [[10.545385891822377, 0.34544282215511635, 2.495236099288062], [13.400269611086316, 0.34494919278998104, 0.554159629203449], [17.944153753957213, 0.5228888092609897, 5.832331572188196], [21.40661237018968, 0.4420042644220565, 0.5289014378393814], [27.11377798229324, 0.2102342927903751, 1.372126143988554], [29.917146339364372, 0.2171213947481318, 1.2421930652261353], [34.784952519356345, 0.25987209080909157, 4.425871745738083], [40.36153930694921, 0.3004110477190137, 2.4941745005377025], [48.81442607130768, 0.12283066712727153, 11.218036196009285], [53.998455397235595, 0.22595722032788135, 0.5000197602846668]], "r_squared_": 0.9294624932423153, "error_": 0.045181539142412616}
{"freq_range": [2.0, 80.0], "freq_res": 1.0, "aperiodic_params_": [-0.1795836420749113, 0.42807965360817474], "gaussian_params_": [[10.608999072779202, 0.7190047888871319, 1.2944670003813565], [15.65075005612637, 0.45382948026560943, 1.7299364971687667], [19.08566978372448, 0.231115979460789, 1.100845541215993], [21.850475105040214, 0.15376735822004028, 1.1003361353639822], [31.533693061688712, 0.638105356326776, 0.26632943026755845], [36.44090476410787, 0.1586616847701501, 2.3450220155279515], [50.01036150078909, 0.12120204613437069, 4.4212608550821635]], "peak_params_": [[10.608999072779202, 0.6991727942444237, 2.588934000762713], [15.65075005612637, 0.44934499046530196, 3.4598729943375335], [19.08566978372448, 0.3054386268628545, 2.201691082431986], [21.850475105040214, 0.15984293558740081, 2.2006722707279645], [31.533693061688712, 0.16422792744809755, 0.5326588605351169], [36.44090476410787, 0.15668174722936, 4.690044031055903], [50.01036150078909, 0.12120172202080226, 8.842521710164327]], "r_squared_": 0.9486279949581645, "error_": 0.04330496244536994}
{"freq_range": [2.0, 80.0], "freq_res": 1.0, "aperiodic_params_": [0.13507999426349648, 0.6547998308359124], "gaussian_params_": [[7.499915131089937, 0.9216716505141191, 0.2824022322392409], [9.728659213987962, 0.4669368912301388, 1.2951545296047908], [15.806015730161281, 0.8318290702514056, 2.6804586111937874], [22.215800348795078, 0.3466825333442765, 2.5932714772839045], [28.628841621959257, 0.2860918591843111, 1.5114620921942619], [32.46385737076549, 0.8399110638249387, 0.27463099986678463], [38.80666536232303, 0.16058426252181146, 5.999999999999999], [47.87343734357315, 0.14053060927897867, 0.5241342020614996], [50.44992732934969, 0.8564397865029264, 0.26923794610775625], [52.94477331646931, 0.1586037564267056, 0.5586465656752272]], "peak_params_": [[7.499915131089937, 0.24687214992721412, 0.5648044644784818], [9.728659213987962, 0.5364652554640841, 2.5903090592095817], [15.806015730161281, 0.8493808137553617, 5.360917222387575], [22.215800348795078, 0.40629240797797683, 5.186542954567809], [28.628841621959257, 0.3311476257757276, 3.0229241843885237], [32.46385737076549, 0.3101690071986427, 0.5492619997335693], [38.80666536232303, 0.1605009182875774, 11.999999999999998], [47.87343734357315, 0.18614113625263518, 1.0482684041229993], [50.44992732934969, 0.24019513637902967, 0.5384758922155125], [52.94477331646931, 0.16761603980487372, 1.1172931313504544]], "r_squared_": 0.9828278119891702, "error_": 0.0388744863347557}
{"freq_range": [2.0, 80.0], "freq_res": 1.0, "aperiodic_params_": [0.608183368868676, 1.0453839979176476], "gaussian_params_": [[15.22148740236859, 0.7959662960340922, 4.647418099173168], [26.828192807765323, 0.3740276898136484, 5.999999999999999], [37.37760472929655, 0.38101875183626954, 0.27541503416845553]], "peak_params_": [[15.22148740236859, 0.8486435697918139, 9.294836198346337], [26.828192807765323, 0.4059441157931432, 11.999999999999998], [37.37760472929655, 0.23775061214888238, 0.5508300683369111]], "r_squared_": 0.9742008390380341, "error_": 0.07116001057737434}
{"freq_range": [2.0, 80.0], "freq_res": 1.0, "aperiodic_params_": [0.6264979614344285, 1.1381972387743369], "gaussian_params_": [[9.982499840090249, 0.51221131919868, 1.5582267096051676], [17.058470985490924, 0.9102735945399562, 4.166659042694631], [27.973094789703367, 0.6152544276052544, 3.1313783978027376], [36.681484956576256, 0.20337531863518624, 0.764664147732135]], "peak_params_": [[9.982499840090249, 0.7289553704628896, 3.1164534192103353], [17.058470985490924, 0.9115302062535152, 8.333318085389262], [27.973094789703367, 0.6441907264289524, 6.262756795605475], [36.681484956576256, 0.1961353021958515, 1.52932829546427]], "r_squared_": 0.9890841901015741, "error_": 0.05314713947791885}
{"freq_range": [2.0, 80.0], "freq_res": 1.0, "aperiodic_params_": [0.6563973760487548, 1.2029241162673638], "gaussian_params_": [[10.327399035234263, 0.5416054502651805, 1.7347741048293184], [17.3032469512495, 0.9104378747055688, 4.272125435912363], [28.19002094279707, 0.8416804749904252, 2.815097631139692]], "peak_params_": [[10.327399035234263, 0.743225450924779, 3.4695482096586368], [17.3032469512495, 0.9087910142708163, 8.544250871824726], [28.19002094279707, 0.8793837417770073, 5.630195262279384]], "r_squared_": 0.9921110224846994, "error_": 0.0478282185608713}
{"freq_range": [2.0, 80.0], "freq_res": 1.0, "aperiodic_params_": [0.5550103814400551, 1.1299939441064262], "gaussian_params_": [[10.361326889446763, 0.5664003253306183, 1.7038419017746373], [17.416086019299033, 0.8923566638267494, 4.405256160784111], [28.179864179742417, 0.7868543016238372, 2.7509910476958344]], "peak_params_": [[10.361326889446763, 0.7701443706593747, 3.4076838035492747], [17.416086019299033, 0.8888751936528342, 8.810512321568222], [28.179864179742417, 0.8349589469998709, 5.501982095391669]], "r_squared_": 0.9895409903157355, "error_": 0.052781589654081605}
{"freq_range": [2.0, 80.0], "freq_res": 1.0, "aperiodic_params_": [0.4974080055429127, 1.022651271164491], "gaussian_params_": [[10.376467915325385, 0.456687982551383, 1.9407771428379321], [17.14386260383406, 0.8707714071127449, 4.319218476541299], [28.109400227090692, 0.5977167397198349, 2.868269388715958], [33.37877461453316, 0.18833458993859165, 0.3133775466265841], [39.464437223083436, 0.1373647185143192, 3.2425892231391065]], "peak_params_": [[10.376467915325385, 0.6699304394978176, 3.8815542856758642], [17.14386260383406, 0.8719691122413652, 8.638436953082598], [28.109400227090692, 0.6345379145600167, 5.736538777431916], [33.37877461453316, 0.2502775524331031, 0.6267550932531682], [39.464437223083436, 0.13640785520011645, 6.485178446278213]], "r_squared_": 0.9854601511884226, "error_": 0.05374013616188837}
{"freq_range": [2.0, 80.0], "freq_res": 1.0, "aperiodic_params_": [0.37128146989387073, 0.7666751730624625], "gaussian_params_": [[14.84004683203457, 0.709607370114525, 4.29885050869369], [26.452034599136176, 0.2892679562538403, 5.158714057460851], [27.71286357397696, 0.09476743654897651, 1.2677907010269571], [39.95143059011158, 0.13328080032698908, 3.757266197709267]], "peak_params_": [[14.84004683203457, 0.7337296319065096, 8.59770101738738], [26.452034599136176, 0.3507493246218137, 10.317428114921702], [27.71286357397696, 0.37629518835050263, 2.5355814020539142], [39.95143059011158, 0.14246610453298292, 7.514532395418534]], "r_squared_": 0.9731352456067419, "error_": 0.056108376728233676}
{"freq_range": [2.0, 80.0], "freq_res": 1.0, "aperiodic_params_": [0.10946163619331534, 0.6238348516901989], "gaussian_params_": [[7.5898321952582615, 0.6976459937406075, 0.25116271756005076], [10.671406546237561, 0.3720495322920084, 1.4755915665398214], [16.51618520037271, 0.5556446253428176, 3.6441102782955332], [27.20864483395641, 0.2176323999165978, 0.9717597058672984], [29.84715817393031, 0.1553028641542936, 0.5711026811453926], [38.45203459913595, 0.1182378406473096, 5.999999999999999], [50.63769248865781, 0.4493776826942797, 0.2500106060980736], [63.68725491781115, 0.1940465595848689, 0.5044059459356832]], "peak_params_": [[7.5898321952582615, 0.2923446844568632, 0.5023254351201015], [10.671406546237561, 0.539640129796287, 2.9511831330796428], [16.51618520037271, 0.5510048347167206, 7.2882205565910665], [27.20864483395641, 0.2406647644044314, 1.9435194117345969], [29.84715817393031, 0.19778540916249243, 1.1422053622907853], [38.45203459913595, 0.11790277430089402, 11.999999999999998], [50.63769248865781, 0.17052204440783036, 0.5000212121961471], [63.68725491781115, 0.16012696550203676, 1.0088118918713664]], "r_squared_": 0.9733325865259632, "error_": 0.04355502811820659}
{"freq_range": [2.0, 80.0], "freq_res": 1.0, "aperiodic_params_": [-0.23673989216394342, 0.2114622938951362], "gaussian_params_": [[10.179580423602772, 0.5211811532320301, 1.3944851258711468], [16.096671329236273, 0.6346441510926959, 3.2324570897750995], [30.25749603627091, 0.32989368173820083, 5.9999999999977165], [40.99415622591095, 0.12703044083708606, 0.2500014334275734], [44.64389620259217, 0.14183614623951965, 5.999999999999999], [49.61279135288081, 0.437036552551157, 0.3016151630427271], [52.49735904382719, 0.7016009564147165, 0.3038703568545147]], "peak_params_": [[10.179580423602772, 0.6251517170765662, 2.7889702517422936], [16.096671329236273, 0.6540471231377583, 6.464914179550199], [30.25749603627091, 0.33686692798295786, 11.999999999995433], [40.99415622591095, 0.31136353423363394, 0.5000028668551468], [44.64389620259217, 0.15770782785735554, 11.999999999999998], [49.61279135288081, 0.28840062345613054, 0.6032303260854542], [52.49735904382719, 0.251167014282607, 0.6077407137090294]], "r_squared_": 0.9164266591984673, "error_": 0.05195646107571555}
{"freq_range": [2.0, 80.0], "freq_res": 1.0, "aperiodic_params_": [0.2630699536099755, 0.7362768803202491], "gaussian_params_": [[7.450733591333109, 0.9296977582250372, 0.2976855741118187], [9.674988713555674, 0.5010390497982454, 1.382450106855113], [15.918527360740468, 0.9232302600582177, 2.669791330512756], [22.289475237670963, 0.29689999011766477, 2.8555955753443865], [27.598581857794482, 0.27033532280964456, 0.46373970809899945], [29.510598270787696, 0.8744536453591746, 0.3166041854155051], [32.6708092115924, 0.2292775985995584, 1.357787960601252], [36.971537815360044, 0.18256956834428995, 1.0528416623511214]], "peak_params_": [[7.450733591333109, 0.3760200652269624, 0.5953711482236373], [9.674988713555674, 0.5665066934006575, 2.764900213710226], [15.918527360740468, 0.949070161103331, 5.339582661025512], [22.289475237670963, 0.3643367746782959, 5.711191150688773], [27.598581857794482, 0.22672563364361586, 0.9274794161979989], [29.510598270787696, 0.3056536026624268, 0.6332083708310102], [32.6708092115924, 0.22304729684847324, 2.715575921202504], [36.971537815360044, 0.18392520398299894, 2.105683324702243]], "r_squared_": 0.9823466250259437, "error_": 0.04244958040465251}
{"freq_range": [2.0, 80.0], "freq_res": 1.0, "aperiodic_params_": [0.599115993730343, 1.0804195016570333], "gaussian_params_": [[9.167012269096348, 0.5379660514295658, 1.6328271069789224], [16.128470427955204, 1.0224952831517062, 3.5380661062697283], [25.6437570603076, 0.3680026150717376, 4.973044161636267], [29.535113988473448, 0.4924611630649921, 0.2724032980543589], [32.494055217361485, 0.5227426773276395, 0.2770272784471686], [36.58820310781667, 0.6883027252654096, 0.2522624948393992]], "peak_params_": [[9.167012269096348, 0.6708502982518315, 3.265654213957845], [16.128470427955204, 1.0780451249833989, 7.076132212539457], [25.6437570603076, 0.38791672451797776, 9.946088323272534], [29.535113988473448, 0.36600851019702696, 0.5448065961087178], [32.494055217361485, 0.2692097515402445, 0.5540545568943372], [36.58820310781667, 0.2087396894775475, 0.5045249896787984]], "r_squared_": 0.990098447654209, "error_": 0.05008257591030425}
{"freq_range": [2.0, 80.0], "freq_res": 1.0, "aperiodic_params_": [0.7376227174895222, 1.2029836080317087], "gaussian_params_": [[15.972150753792564, 0.9365865936272283, 5.21796701124835], [28.028514153720533, 0.28633940447157225, 1.0435917093991298], [29.45203459913597, 0.27155312575942403, 4.526559406688255]], "peak_params_": [[15.972150753792564, 0.9398549379930023, 10.4359340224967], [28.028514153720533, 0.609896323573947, 2.0871834187982596], [29.45203459913597, 0.4973448842036847, 9.05311881337651]], "r_squared_": 0.9834901445135636, "error_": 0.06485057582894801}
{"freq_range": [2.0, 80.0], "freq_res": 1.0, "aperiodic_params_": [0.6272858297331199, 1.1749720237420775], "gaussian_params_": [[9.697013374717425, 0.5175152326076721, 1.6347126637196283], [16.641508962163797, 0.9861130640061488, 4.16816694605339], [27.951218855574464, 0.6572177771785551, 3.2606085792567376], [36.294339333829576, 0.1036122189500364, 0.8273174117777103]], "peak_params_": [[9.697013374717425, 0.7857881552483782, 3.2694253274392566], [16.641508962163797, 0.984831011837705, 8.33633389210678], [27.951218855574464, 0.6812103294004894, 6.521217158513475], [36.294339333829576, 0.12850571371270547, 1.6546348235554207]], "r_squared_": 0.9937854786438399, "error_": 0.04039854731916906}
{"freq_range": [2.0, 80.0], "freq_res": 1.0, "aperiodic_params_": [0.7354324152499604, 1.1837001473221922], "gaussian_params_": [[10.122254552795427, 0.45734329418723874, 1.8630228077263677], [16.585253345896863, 0.9078114182267932, 3.8887412743649423], [27.81738097581434, 0.6363554299128025, 3.3311564201079333]], "peak_params_": [[10.122254552795427, 0.6727775041178474, 3.7260456154527355], [16.585253345896863, 0.9064297388304784, 7.777482548729885], [27.81738097581434, 0.6476183794549439, 6.662312840215867]], "r_squared_": 0.9883429162783999, "error_": 0.05547094034582199}
{"freq_range": [2.0, 80.0], "freq_res": 1.0, "aperiodic_params_": [0.5734223481265329, 1.1050082186361099], "gaussian_params_": [[15.153077842252769, 1.0869717733296105, 4.875941390243089], [28.265292368948398, 0.49705230474491185, 3.9794487593203316]], "peak_params_": [[15.153077842252769, 1.0883570560944968, 9.751882780486177], [28.265292368948398, 0.5297394451296327, 7.958897518640663]], "r_squared_": 0.9824555026354392, "error_": 0.06448002999662253}
{"freq_range": [2.0, 80.0], "freq_res": 1.0, "aperiodic_params_": [0.7021541821677649, 1.0568150498623279], "gaussian_params_": [[14.849967858140808, 0.905214861361382, 4.597432743903786], [27.320729281732337, 0.2831042540498075, 5.999999998694276]], "peak_params_": [[14.849967858140808, 0.9391130358052101, 9.194865487807572], [27.320729281732337, 0.3102503481772584, 11.999999997388551]], "r_squared_": 0.9791344435131097, "error_": 0.06428440563812551}
{"freq_range": [2.0, 80.0], "freq_res": 1.0, "aperiodic_params_": [-0.10267367117224767, 0.42122132754716424], "gaussian_params_": [[7.523543744520143, 0.8608185540309983, 0.31900989080277503], [10.299626711874183, 0.3133087069169591, 1.6646708567781856], [15.533238042328826, 0.6956722634878802, 3.304782456381902], [25.605243413772083, 0.18336965691105597, 5.999486650292213], [29.64752757361078, 0.29520072379561957, 0.2649425897877], [39.8599278206979, 0.14238644198161093, 5.999999999999999]], "peak_params_": [[7.523543744520143, 0.4570891162160113, 0.6380197816055501], [10.299626711874183, 0.4857665304706377, 3.329341713556371], [15.533238042328826, 0.7406122789609143, 6.609564912763804], [25.605243413772083, 0.1974688328936589, 11.998973300584426], [29.64752757361078, 0.2990106948558757, 0.5298851795754], [39.8599278206979, 0.15265758739992907, 11.999999999999998]], "r_squared_": 0.9500371205408594, "error_": 0.05725109919314614}
{"freq_range": [2.0, 80.0], "freq_res": 1.0, "aperiodic_params_": [0.183258276880469, 0.5341973414727995], "gaussian_params_": [[10.089766939344573, 0.3359083229023496, 1.3936525560307125], [16.271448836625463, 0.6983061682438328, 2.633371466960068], [30.284983575875195, 0.11345837296383399, 5.999999999999999], [37.4467909500453, 0.21862540926646354, 0.5844096971310395], [41.43907209591126, 0.6880192767335476, 0.25000000000000006]], "peak_params_": [[10.089766939344573, 0.3765553425808589, 2.787305112061425], [16.271448836625463, 0.7013154275862022, 5.266742933920136], [30.284983575875195, 0.1133313402588525, 11.999999999999998], [37.4467909500453, 0.22387573940772976, 1.168819394262079], [41.43907209591126, 0.17019399847413286, 0.5000000000000001]], "r_squared_": 0.9580588477073643, "error_": 0.04781508515379091}
{"freq_range": [2.0, 80.0], "freq_res": 1.0, "aperiodic_params_": [0.2518039747454666, 0.8342323458193857], "gaussian_params_": [[9.069478842731998, 0.5222607247764438, 1.4951511513013656], [16.237552523429024, 1.0218085707861027, 3.43670625773857], [27.660046756645624, 0.22372376393525967, 5.9999999427404225]], "peak_params_": [[9.069478842731998, 0.634725762098125, 2.990302302602731], [16.237552523429024, 1.0532380125260974, 6.87341251547714], [27.660046756645624, 0.22628691773664988, 11.999999885480845]], "r_squared_": 0.9837914583557201, "error_": 0.05262481924341281}
{"freq_range": [2.0, 80.0], "freq_res": 1.0, "aperiodic_params_": [0.44709423031209833, 1.0643549632712173], "gaussian_params_": [[16.006681577977915, 1.1602709686767616, 5.283358151870346], [27.518779044425468, 0.6816676886180993, 0.2984610225375096], [29.49478421610653, 0.6609154249055973, 0.2763603522275883], [30.65484840612984, 0.20324915437637447, 4.205244390584303]], "peak_params_": [[16.006681577977915, 1.1607387255682606, 10.566716303740693], [27.518779044425468, 0.44056288058475457, 0.5969220450750192], [29.49478421610653, 0.3775797391026746, 0.5527207044551766], [30.65484840612984, 0.22325789161125797, 8.410488781168606]], "r_squared_": 0.9789108498616915, "error_": 0.06892703133491426}
{"freq_range": [2.0, 80.0], "freq_res": 1.0, "aperiodic_params_": [0.46697246468926684, 1.1482901798543035], "gaussian_params_": [[7.4994512192727365, 0.8793581494019014, 0.3048782952581569], [9.923655557041418, 0.590223351132481, 1.4735240599574742], [15.914303897468487, 0.9644655867862412, 3.6217452788359616], [23.947622800339698, 0.39605621472951424, 5.789138261874561], [29.572071729627687, 0.306028338038441, 2.180796460755255]], "peak_params_": [[7.4994512192727365, 0.3643724971638121, 0.6097565905163138], [9.923655557041418, 0.8654021187608721, 2.9470481199149483], [15.914303897468487, 1.118661404068376, 7.243490557671923], [23.947622800339698, 0.48753345404971205, 11.578276523749121], [29.572071729627687, 0.529998424009693, 4.36159292151051]], "r_squared_": 0.9922231958126302, "error_": 0.04872909835405834}
{"freq_range": [2.0, 80.0], "freq_res": 1.0, "aperiodic_params_": [0.6306386195846007, 1.1390527461913793], "gaussian_params_": [[15.512834779220237, 1.006550034041594, 5.162474100496595], [28.42478334927965, 0.4363926949859806, 3.133182914491001], [35.21121578824332, 0.05654938516959521, 2.113105929786218]], "peak_params_": [[15.512834779220237, 1.0022462281475921, 10.32494820099319], [28.42478334927965, 0.4865635708637307, 6.266365828982002], [35.21121578824332, 0.10533479699076653, 4.226211859572436]], "r_squared_": 0.9861530436204586, "error_": 0.056766642370855006}
{"freq_range": [2.0, 80.0], "freq_res": 1.0, "aperiodic_params_": [0.7893830223386819, 1.182491698243291], "gaussian_params_": [[15.174905718875797, 0.9759545096281972, 4.805927612917987], [28.449054687289717, 0.34595573587793527, 4.571194179042506]], "peak_params_": [[15.174905718875797, 0.9798725885249805, 9.611855225835974], [28.449054687289717, 0.3720257562078273, 9.142388358085013]], "r_squared_": 0.9826213103360311, "error_": 0.06495032267654773}
{"freq_range": [2.0, 80.0], "freq_res": 1.0, "aperiodic_params_": [0.40818589651249126, 0.9663965644915805], "gaussian_params_": [[7.521383741237368, 0.5828189162698452, 0.5944326432216687], [9.761417042785503, 0.31999946060592543, 0.6418282365922776], [15.268733579411737, 1.0944743650360635, 4.037337637142964], [27.088736579788034, 0.3197216279798418, 5.999999999999999], [27.418009698528397, 0.3605033075849228, 0.26490632015484905]], "peak_params_": [[7.521383741237368, 0.6473453173932348, 1.1888652864433373], [9.761417042785503, 0.7713591022826092, 1.2836564731845552], [15.268733579411737, 1.1340564090856875, 8.074675274285928], [27.088736579788034, 0.4395563968512667, 11.999999999999998], [27.418009698528397, 0.4395563968512667, 0.5298126403096981]], "r_squared_": 0.9890757823811271, "error_": 0.04941474680079642}
{"freq_range": [2.0, 80.0], "freq_res": 1.0, "aperiodic_params_": [0.1755281484508581, 0.7138125805400001], "gaussian_params_": [[7.542258767382624, 0.4474511634535745, 0.7123568698015388], [9.866800909141501, 0.23703264583767034, 0.6362790471408138], [15.016185205332615, 0.9060926048025294, 3.7891594136469915], [25.907265179675548, 0.26344595600378934, 5.9999999993112345], [29.690192267666806, 0.1207500435625584, 0.6255477879936248], [33.415218162698665, 0.3331349794810081, 0.28360944938086147], [35.581646350696005, 0.4542448434867788, 0.2757106090766447], [42.67859116042685, 0.13280312246761533, 3.6589729152377917]], "peak_params_": [[7.542258767382624, 0.5334335768241858, 1.4247137396030776], [9.866800909141501, 0.6181416144030869, 1.2725580942816277], [15.016185205332615, 0.9565608897426653, 7.578318827293983], [25.907265179675548, 0.27698739717895215, 11.999999998622469], [29.690192267666806, 0.3162694235990853, 1.2510955759872495], [33.415218162698665, 0.24909271510432207, 0.5672188987617229], [35.581646350696005, 0.23277634129414781, 0.5514212181532894], [42.67859116042685, 0.13684594275095552, 7.317945830475583]], "r_squared_": 0.978209294703663, "error_": 0.051841472367677485}
{"freq_range": [2.0, 80.0], "freq_res": 1.0, "aperiodic_params_": [-0.02962142021739539, 0.6701906842844817], "gaussian_params_": [[9.185746372107763, 0.4045012587460552, 1.6383666409070585], [16.311997990788452, 0.743983683282917, 2.7088693701812914], [20.027292769264317, 0.10741290114144138, 0.2500251196444755]], "peak_params_": [[9.185746372107763, 0.4213816763516003, 3.276733281814117], [16.311997990788452, 0.7391361949372, 5.417738740362583], [20.027292769264317, 0.40126339055348625, 0.500050239288951]], "r_squared_": 0.9690106043975012, "error_": 0.05074477412296592}
{"freq_range": [2.0, 80.0], "freq_res": 1.0, "aperiodic_params_": [0.3490976567545084, 1.1048110763091672], "gaussian_params_": [[7.475302042482806, 1.136269082632355, 0.27937147277054825], [9.601185352759348, 0.608299213285842, 1.4106231106156997], [16.55886951157385, 1.2545708906981008, 3.150265164495372], [23.283962535796785, 0.30481633990884055, 1.7747727362708055], [26.647697129270696, 0.29631367536551784, 0.28181932691156303], [28.726154585702364, 0.24587195378993493, 1.469676495592516], [32.516525983345176, 0.16998446427729572, 0.9735684535974005]], "peak_params_": [[7.475302042482806, 0.3909421334538786, 0.5587429455410965], [9.601185352759348, 0.7280879922781646, 2.8212462212313993], [16.55886951157385, 1.2429093825285482, 6.300530328990744], [23.283962535796785, 0.4561980331462199, 3.549545472541611], [26.647697129270696, 0.298211370350729, 0.5636386538231261], [28.726154585702364, 0.24410960235236479, 2.939352991185032], [32.516525983345176, 0.15385092839344483, 1.947136907194801]], "r_squared_": 0.9912714737419509, "error_": 0.04696287366502823}
{"freq_range": [2.0, 80.0], "freq_res": 1.0, "aperiodic_params_": [0.4673643340881368, 1.146288538080125], "gaussian_params_": [[9.118294314736627, 0.5664484281376808, 1.4995282995801893], [16.80392896732649, 1.2041745750370292, 4.002319354783579], [28.574807053588422, 0.3218607741211839, 3.598401695087421]], "peak_params_": [[9.118294314736627, 0.7446224890439468, 2.9990565991603786], [16.80392896732649, 1.204554408061537, 8.004638709567159], [28.574807053588422, 0.33121790030435583, 7.196803390174842]], "r_squared_": 0.9898994464829354, "error_": 0.0528139737498161}
{"freq_range": [2.0, 80.0], "freq_res": 1.0, "aperiodic_params_": [0.4857327389997063, 1.1522759190756524], "gaussian_params_": [[7.506699817092872, 0.7395066123985392, 0.30945221992675986], [9.843333652090696, 0.5361199379239172, 1.4658215187227068], [16.866730144386164, 1.1168428424923769, 4.014710754882754], [28.893220006713957, 0.3849008778409117, 3.1238121907991108]], "peak_params_": [[7.506699817092872, 0.5481527543475977, 0.6189044398535197], [9.843333652090696, 0.7917332356014884, 2.9316430374454137], [16.866730144386164, 1.1165052230967627, 8.029421509765507], [28.893220006713957, 0.396280730738062, 6.2476243815982215]], "r_squared_": 0.9900363513233759, "error_": 0.053011058078227494}
{"freq_range": [2.0, 80.0], "freq_res": 1.0, "aperiodic_params_": [0.5333753710692684, 1.1081136684986652], "gaussian_params_": [[7.507984115593641, 0.6193086979410682, 0.5118208256828946], [9.80667846276447, 0.5825091275231005, 1.0254228118513888], [12.801548732065687, 0.32279458280804946, 0.8284035514107402], [16.236010470558995, 0.992922180756035, 3.3757984601491478], [25.349580329344345, 0.2654864914190514, 5.981914189315425], [29.666800309123087, 0.13215017718087396, 2.4043639384293747], [30.049537015986527, 0.03785371503720345, 0.26080089209076157]], "peak_params_": [[7.507984115593641, 0.568118408107953, 1.023641651365789], [9.80667846276447, 0.7634509615769982, 2.0508456237027777], [12.801548732065687, 0.9769065437256552, 1.6568071028214804], [16.236010470558995, 1.0689520479208203, 6.7515969202982955], [25.349580329344345, 0.319272873126883, 11.96382837863085], [29.666800309123087, 0.36455592146430027, 4.808727876858749], [30.049537015986527, 0.36455592146430027, 0.5216017841815231]], "r_squared_": 0.9910825763453005, "error_": 0.04748102544197229}
{"freq_range": [2.0, 80.0], "freq_res": 1.0, "aperiodic_params_": [0.39769147691485385, 0.9584295100771891], "gaussian_params_": [[8.355708343411042, 0.321236349622228, 1.3155461997372162], [15.752422689498465, 1.0118087537948057, 4.120989587579919], [27.190965856165153, 0.10933743020144238, 0.2652184190966924], [29.0696618631525, 0.24389448802067495, 4.007961919108371]], "peak_params_": [[8.355708343411042, 0.48214258036996355, 2.6310923994744324], [15.752422689498465, 1.0111815955431012, 8.241979175159837], [27.190965856165153, 0.3222278678126126, 0.5304368381933848], [29.0696618631525, 0.24962653029214654, 8.015923838216741]], "r_squared_": 0.9833500767806055, "error_": 0.055491890244424025}
{"freq_range": [2.0, 80.0], "freq_res": 1.0, "aperiodic_params_": [0.1453095527316003, 0.7414623009719283], "gaussian_params_": [[7.994157398177499, 0.25784941495954283, 1.2150644603438165], [15.403961207196962, 0.786904838473595, 3.8690476119487838]], "peak_params_": [[7.994157398177499, 0.3839495326825685, 2.430128920687633], [15.403961207196962, 0.7826274491929809, 7.7380952238975675]], "r_squared_": 0.9680191528945915, "error_": 0.05978565264223715}
{"freq_range": [2.0, 80.0], "freq_res": 1.0, "aperiodic_params_": [0.520771877020614, 1.2460225453881546], "gaussian_params_": [[7.487397264657833, 1.139129775450067, 0.27217791657183105], [9.527104388742043, 0.5287257693916937, 1.3081297819921887], [17.00782526927603, 1.2199720497918323, 3.5471408209464284], [28.37621689635675, 0.2826516857227349, 3.4433251000597367]], "peak_params_": [[7.487397264657833, 0.33382407510887313, 0.5443558331436621], [9.527104388742043, 0.6685835741182475, 2.6162595639843773], [17.00782526927603, 1.221174167338856, 7.094281641892857], [28.37621689635675, 0.29099423512529576, 6.886650200119473]], "r_squared_": 0.9888427135417839, "error_": 0.05959449039728383}
{"freq_range": [2.0, 80.0], "freq_res": 1.0, "aperiodic_params_": [0.5580826962250189, 1.2574340157375585], "gaussian_params_": [[7.486127245361585, 0.6290182989410188, 0.3124032721130518], [9.724948518828928, 0.5282798124145651, 1.4989138702431715], [17.03034250580422, 1.1863011516545283, 3.567017970453502], [28.78826133164799, 0.2961183423192462, 3.2663392320750835]], "peak_params_": [[7.486127245361585, 0.31140521568450313, 0.6248065442261036], [9.724948518828928, 0.6895475586421786, 2.997827740486343], [17.03034250580422, 1.1867019543314368, 7.134035940907004], [28.78826133164799, 0.29975315271259473, 6.532678464150167]], "r_squared_": 0.9883836112708273, "error_": 0.05758441215086737}
{"freq_range": [2.0, 80.0], "freq_res": 1.0, "aperiodic_params_": [0.5426246569981659, 1.1797625319073615], "gaussian_params_": [[7.505603506954385, 0.46074232494447426, 0.663501646884417], [9.729880086593157, 0.5418708916445517, 0.9069070697548314], [12.533821118251263, 0.2797226417249637, 0.8270111932079389], [16.815594317456522, 1.103746282865608, 3.5251909988054106], [28.852100589777688, 0.2802043668899636, 3.212081319703073]], "peak_params_": [[7.505603506954385, 0.4853286011919373, 1.327003293768834], [9.729880086593157, 0.6915958887341226, 1.8138141395096627], [12.533821118251263, 0.8538765014704048, 1.6540223864158778], [16.815594317456522, 1.1025470399195216, 7.050381997610821], [28.852100589777688, 0.28271747340576114, 6.424162639406146]], "r_squared_": 0.9883113613047706, "error_": 0.052491197269983615}
{"freq_range": [2.0, 80.0], "freq_res": 1.0, "aperiodic_params_": [-1.3481114056805539, 0.7146465524375999], "gaussian_params_": [[10.220012756413027, 0.7874277697623996, 1.8120408850659029], [15.201049059869858, 0.5262447954481977, 1.7542095287856003], [19.50230635628459, 0.39037819898506204, 3.0620287865835545]], "peak_params_": [[10.220012756413027, 0.7913006469282253, 3.6240817701318058], [15.201049059869858, 0.679515920317266, 3.5084190575712006], [19.50230635628459, 0.3977318420630076, 6.124057573167109]], "r_squared_": 0.9796746964054416, "error_": 0.04631421663396014}
{"freq_range": [2.0, 80.0], "freq_res": 1.0, "aperiodic_params_": [-0.5224205381793767, 0.9090336077638947], "gaussian_params_": [[10.335653944806232, 0.4294775853029112, 1.37524489185763], [17.016151691843266, 0.74989866191719, 4.358924607093414], [27.845129578478222, 0.37960494007754275, 2.152242163669286], [68.94529644513835, 0.2169141480965605, 0.39977117191306444]], "peak_params_": [[10.335653944806232, 0.6221845737692214, 2.75048978371526], [17.016151691843266, 0.7498980940740526, 8.717849214186828], [27.845129578478222, 0.40997013231877455, 4.304484327338572], [68.94529644513835, 0.21489283008782323, 0.7995423438261289]], "r_squared_": 0.9864234751084212, "error_": 0.04682822341998357}
{"freq_range": [2.0, 80.0], "freq_res": 1.0, "aperiodic_params_": [-0.42022175019195673, 0.8300862049891863], "gaussian_params_": [[9.47241806806408, 0.376062272098429, 1.4053176425085967], [16.719041529319306, 0.6776745079576441, 4.26728909861763], [27.862695257134746, 0.28427202880270175, 2.3763917027361927], [30.007947362066695, 0.07786146523862629, 0.2502304165315083], [64.17612789031985, 0.15157392468362, 0.6603355140509065]], "peak_params_": [[9.47241806806408, 0.4873802343736804, 2.8106352850171934], [16.719041529319306, 0.6762157411346227, 8.53457819723526], [27.862695257134746, 0.3043792796333358, 4.752783405472385], [30.007947362066695, 0.2728707596976434, 0.5004608330630166], [64.17612789031985, 0.1462770439758725, 1.320671028101813]], "r_squared_": 0.990241470760762, "error_": 0.03473307750436457}
{"freq_range": [2.0, 80.0], "freq_res": 1.0, "aperiodic_params_": [-0.38882769186028, 0.9177236391697863], "gaussian_params_": [[10.416246317531584, 0.500882676533327, 1.4107140432080894], [17.110558856714192, 0.7605141813278447, 4.302185172116018], [28.071452608239603, 0.41898702034958935, 2.217014139438714]], "peak_params_": [[10.416246317531584, 0.6736046779645157, 2.8214280864161787], [17.110558856714192, 0.7602740457231651, 8.604370344232036], [28.071452608239603, 0.4496663481692662, 4.434028278877428]], "r_squared_": 0.9807968580940363, "error_": 0.06067286070581915}
