{"freq_range": [2.0, 80.0], "freq_res": 1.0, "aperiodic_params_": [-0.018590574270122482, 0.8324202504798648], "gaussian_params_": [[6.3924269722849845, 0.29093251028676853, 0.6269391846128365], [9.362818152056366, 1.4327206608053422, 0.9457008468009496], [11.588750615653845, 0.5915065646233274, 0.29594590507941965], [13.904473615236666, 0.31260707823028505, 0.6318089045380406], [18.556890303074752, 1.3993490975364846, 0.2646170371163516], [29.744447519912303, 0.21535536152717244, 0.825461574155295], [58.473591162296394, 0.8856525392477169, 0.28240183136158287]], "peak_params_": [[6.3924269722849845, 0.241746848304767, 1.253878369225673], [9.362818152056366, 1.3311188399049123, 1.8914016936018991], [11.588750615653845, 0.2579128304411238, 0.5918918101588393], [13.904473615236666, 0.30906294318534955, 1.2636178090760812], [18.556890303074752, 0.3443758900016983, 0.5292340742327032], [29.744447519912303, 0.20527844735646217, 1.65092314831059], [58.473591162296394, 0.21705280436287544, 0.5648036627231657]], "r_squared_": 0.9750643977548302, "error_": 0.05584039114992285}
{"freq_range": [2.0, 80.0], "freq_res": 1.0, "aperiodic_params_": [0.2738644060046704, 0.9417847671173498], "gaussian_params_": [[9.44021078991038, 1.256136967324532, 0.9744856121740445], [18.545392345102822, 1.0623718526446928, 0.2509437461890024], [52.58911591884684, 0.14635398952217155, 5.38454871043364], [69.8005990559828, 0.16276911064498664, 4.525060195528378], [72.55893967839408, 0.2834941304142691, 0.30180371842891635], [77.79354023764368, 0.16939610835347627, 1.7642731561386293]], "peak_params_": [[9.44021078991038, 1.134291409629719, 1.948971224348089], [18.545392345102822, 0.20588684108708533, 0.5018874923780048], [52.58911591884684, 0.1460937930821482, 10.76909742086728], [69.8005990559828, 0.16340625370394246, 9.050120391056756], [72.55893967839408, 0.22855592575690586, 0.6036074368578327], [77.79354023764368, 0.19976363997052493, 3.5285463122772587]], "r_squared_": 0.9684358443259228, "error_": 0.05451571777145046}
{"freq_range": [2.0, 80.0], "freq_res": 1.0, "aperiodic_params_": [0.03671928186274859, 0.8106834672974685], "gaussian_params_": [[6.4754194256314666, 0.906723463870536, 0.2746357305629109], [9.345296821362846, 1.3422992496185526, 0.9237921800620502], [11.882542365278999, 0.2165888800318933, 0.870632291768908], [14.034166054310319, 0.24985996874158303, 0.4175433452459655], [18.589778303425266, 1.0166333448048304, 0.25000898565547336], [29.657423320823483, 0.20537343677616998, 0.7342670730300278], [58.45058745982559, 0.8652230748728259, 0.2614413486281577], [66.45203459913596, 0.08696031723718163, 5.999999999999999], [78.54796540086404, 0.11600555843114155, 5.390319058591779]], "peak_params_": [[6.4754194256314666, 0.20456056563329195, 0.5492714611258218], [9.345296821362846, 1.2526333980265631, 1.8475843601241004], [11.882542365278999, 0.23623640772414423, 1.741264583537816], [14.034166054310319, 0.26028011003763063, 0.835086690491931], [18.589778303425266, 0.2645668215102013, 0.5000179713109467], [29.657423320823483, 0.18419458710300218, 1.4685341460600556], [58.45058745982559, 0.228262595320887, 0.5228826972563154], [66.45203459913596, 0.09443644514829241, 11.999999999999998], [78.54796540086404, 0.12536162615528523, 10.780638117183559]], "r_squared_": 0.9844051115289677, "error_": 0.03734491520011048}
{"freq_range": [2.0, 80.0], "freq_res": 1.0, "aperiodic_params_": [0.22391583574084528, 0.9122655955574985], "gaussian_params_": [[6.341993170290038, 0.30756817188681185, 0.7875093388927918], [9.349004751363687, 1.3621255819350506, 0.9340761239119104], [11.58623194079109, 0.9281883378549574, 0.2586887892168591], [14.118314282720114, 0.31731225080744485, 0.9192950179973965], [18.553299210867362, 1.6592302582714225, 0.258919391555362], [30.122836361949318, 0.22917474697771678, 0.8127289828784021], [54.02921460456095, 0.15211626346339144, 1.5961582614435068], [58.49650276275141, 0.799004734816701, 0.2882542582096328]], "peak_params_": [[6.341993170290038, 0.2820931587903969, 1.5750186777855837], [9.349004751363687, 1.2713221962441548, 1.8681522478238208], [11.58623194079109, 0.3048690370572187, 0.5173775784337182], [14.118314282720114, 0.3147007573378555, 1.838590035994793], [18.553299210867362, 0.37460240311629334, 0.517838783110724], [30.122836361949318, 0.22657206370206584, 1.6254579657568042], [54.02921460456095, 0.15209078592846237, 3.1923165228870136], [58.49650276275141, 0.18815547457453619, 0.5765085164192656]], "r_squared_": 0.9725049816105503, "error_": 0.06182419490076941}
{"freq_range": [2.0, 80.0], "freq_res": 1.0, "aperiodic_params_": [0.2546706698705632, 0.8647853019798458], "gaussian_params_": [[6.410384376816615, 0.44595135527078367, 0.39064038940545004], [9.358412588176003, 1.3058131670057054, 0.9063098745123498], [11.568568374829898, 0.6046865597010064, 0.3030713330716053], [14.124477228955968, 0.24070069246614875, 0.5636813516187004], [18.53769941199584, 1.0253299683861663, 0.2738817130034553], [67.00852274769382, 0.1611465804464932, 0.6721287558823058], [69.60111743389704, 0.5009172256414227, 0.2949460463493604], [72.03785018235068, 0.16535995895182942, 0.6502743682678394], [75.42926111367338, 0.22844981650163917, 1.1916108209094542], [78.87864832754066, 0.2638504462920436, 0.7365400975941432]], "peak_params_": [[6.410384376816615, 0.25818563590189286, 0.7812807788109001], [9.358412588176003, 1.20759433054737, 1.8126197490246996], [11.568568374829898, 0.23839881212817493, 0.6061426661432106], [14.124477228955968, 0.23490535510616373, 1.1273627032374007], [18.53769941199584, 0.24669928803330265, 0.5477634260069106], [67.00852274769382, 0.16113362573196, 1.3442575117646116], [69.60111743389704, 0.20196342519288613, 0.5898920926987208], [72.03785018235068, 0.16871411724083418, 1.3005487365356787], [75.42926111367338, 0.2141029229318474, 2.3832216418189085], [78.87864832754066, 0.2628575798445416, 1.4730801951882864]], "r_squared_": 0.9829537755643358, "error_": 0.03834109149472686}
{"freq_range": [2.0, 80.0], "freq_res": 1.0, "aperiodic_params_": [0.20669866276111157, 0.9081654925989032], "gaussian_params_": [[2.530104442675915, 1.1573672220369582, 0.259723057503396], [9.427665589900572, 1.262035709029966, 0.9508718443772582], [18.54513958692593, 1.0209157254518073, 0.2578607315254707], [53.242985230551334, 0.16381446132887728, 5.0628539482258965], [71.30586317555638, 0.22348947677542244, 2.611142666831799], [78.33397242614143, 0.21271250126017344, 1.0797212764176214]], "peak_params_": [[2.530104442675915, 0.22526301928624842, 0.519446115006792], [9.427665589900572, 1.1406329590806379, 1.9017436887545165], [18.54513958692593, 0.21543252539971602, 0.5157214630509414], [53.242985230551334, 0.1636259049965525, 10.125707896451793], [71.30586317555638, 0.22231072609823177, 5.222285333663598], [78.33397242614143, 0.2111347751218282, 2.159442552835243]], "r_squared_": 0.9739032411812366, "error_": 0.05128028836414459}
{"freq_range": [2.0, 80.0], "freq_res": 1.0, "aperiodic_params_": [0.20066310648839147, 0.8488773553221873], "gaussian_params_": [[9.313319571971254, 0.8441308142778757, 0.6898220248301469], [10.160742049201858, 0.4322000244558256, 1.7334272698479358], [58.51936470041762, 0.1567221835880038, 5.999999999894245], [61.92828753497624, 0.09576333581294796, 0.6253457815828555], [70.45806245697847, 0.13212147037149333, 3.3257115781683586], [78.54796540086404, 0.17664677143638952, 5.999999999999999]], "peak_params_": [[9.313319571971254, 1.106794550155332, 1.3796440496602937], [10.160742049201858, 0.9446686912006775, 3.4668545396958717], [58.51936470041762, 0.1574466551985707, 11.99999999978849], [61.92828753497624, 0.2367310625807999, 1.250691563165711], [70.45806245697847, 0.2200269924380691, 6.651423156336717], [78.54796540086404, 0.18148904738063276, 11.999999999999998]], "r_squared_": 0.9683275727920226, "error_": 0.048937783713687386}
{"freq_range": [2.0, 80.0], "freq_res": 1.0, "aperiodic_params_": [0.19037395976367286, 0.7213518954508958], "gaussian_params_": [[9.330955077714854, 1.1495000224665477, 0.9871836034213571], [44.8440083118049, 0.1322642901060076, 5.999999895368681], [64.4520408451297, 0.136919667380687, 5.999997981238484], [65.011580806728, 0.19373776635064283, 0.250003292460152], [75.13119452581229, 0.2098537213165063, 3.2442757981903747]], "peak_params_": [[9.330955077714854, 1.0866832887599798, 1.9743672068427143], [44.8440083118049, 0.13293428221291304, 11.999999790737363], [64.4520408451297, 0.13797775269612877, 11.999995962476968], [65.011580806728, 0.3319493943141858, 0.500006584920304], [75.13119452581229, 0.23888131226557008, 6.488551596380749]], "r_squared_": 0.9060122939768306, "error_": 0.0763718965827854}
{"freq_range": [2.0, 80.0], "freq_res": 1.0, "aperiodic_params_": [0.31423893467892605, 0.9164155217971536], "gaussian_params_": [[6.334377920831874, 0.29427711778084714, 0.6946630789815148], [9.312716079504296, 1.3121514431395438, 0.9149677041518397], [11.56611464046996, 0.8284261997905774, 0.2790473332552372], [14.012341936639467, 0.30224973069874234, 0.7946807362534969], [18.556006291009275, 1.5118449931287041, 0.2552395876203711], [55.23590317803358, 0.1686087494104065, 1.1404427433846018], [58.53083772374147, 0.9301769359067252, 0.25772334884845943], [64.98157738814542, 0.06703167882474456, 3.1084244717880054], [69.43396743602857, 0.2593204495621294, 0.25000340947607286], [76.57289800342234, 0.18359890889033836, 5.999999999999999]], "peak_params_": [[6.334377920831874, 0.2639542017256857, 1.3893261579630296], [9.312716079504296, 1.2378955621837036, 1.8299354083036794], [11.56611464046996, 0.277141732705091, 0.5580946665104743], [14.012341936639467, 0.3022159064279431, 1.5893614725069938], [18.556006291009275, 0.3329943785661219, 0.5104791752407422], [55.23590317803358, 0.16571261133991322, 2.2808854867692037], [58.53083772374147, 0.1911733260671975, 0.5154466976969189], [64.98157738814542, 0.09560707612117492, 6.216848943576011], [69.43396743602857, 0.1693331031226717, 0.5000068189521457], [76.57289800342234, 0.18317236962256844, 11.999999999999998]], "r_squared_": 0.9832375950460431, "error_": 0.03942564222685913}
{"freq_range": [2.0, 80.0], "freq_res": 1.0, "aperiodic_params_": [0.4690759400272781, 1.0698885051028877], "gaussian_params_": [[6.341416810583344, 0.34076573096223567, 0.8859497491396237], [9.33706353748544, 1.3609796295349625, 0.9165317539549298], [11.558768223024758, 1.1573755450260304, 0.2531747274741527], [14.161926607242355, 0.3311264690273653, 1.3376966030404212], [18.556829055247817, 1.8254274712892105, 0.26382881718213114], [29.934450353225152, 0.21548940297490965, 0.7435063018803661], [54.04335952895604, 0.18965405663524756, 1.3020112351160906], [58.509222255754594, 0.8502425255707677, 0.264018282644403], [63.0765093787354, 0.1597225264030499, 0.7447993470820476], [75.23296954449593, 0.21198866234787883, 5.999999999999999]], "peak_params_": [[6.341416810583344, 0.31817874840666416, 1.7718994982792473], [9.33706353748544, 1.2759577309925656, 1.8330635079098596], [11.558768223024758, 0.36316178920713177, 0.5063494549483054], [14.161926607242355, 0.32871262675965457, 2.6753932060808423], [18.556829055247817, 0.4457837811963937, 0.5276576343642623], [29.934450353225152, 0.21465356193735907, 1.4870126037607323], [54.04335952895604, 0.1899534140250414, 2.6040224702321813], [58.509222255754594, 0.15667084762758243, 0.528036565288806], [63.0765093787354, 0.18540794111284398, 1.4895986941640953], [75.23296954449593, 0.21182892195061198, 11.999999999999998]], "r_squared_": 0.9898110414952299, "error_": 0.03865194450677902}
{"freq_range": [2.0, 80.0], "freq_res": 1.0, "aperiodic_params_": [0.5213643790084387, 1.107906970387365], "gaussian_params_": [[6.361010839580856, 0.3291056626758965, 0.8797958209451133], [9.289436719269444, 1.2447225937961888, 0.8584875823052551], [12.912317004951293, 0.3079562262799683, 2.5379042888920993], [18.660493483660602, 0.5437931578400268, 0.43188163652369904], [29.862222746399173, 0.19672788611684436, 0.7967862696114006], [56.45203459913595, 0.13531087892517324, 3.518816902464346], [63.38075735424927, 0.23501131418101534, 0.4302735025360516], [70.95813647411643, 0.2134427812423652, 2.6963233891918135], [78.9752996763893, 0.21211836999559086, 2.7940351199716025]], "peak_params_": [[6.361010839580856, 0.31088547940427064, 1.7595916418902267], [9.289436719269444, 1.2734697412803029, 1.7169751646105103], [12.912317004951293, 0.3078817377399849, 5.075808577784199], [18.660493483660602, 0.41658950852173393, 0.8637632730473981], [29.862222746399173, 0.19380867853290273, 1.5935725392228013], [56.45203459913595, 0.1341990321836941, 7.037633804928692], [63.38075735424927, 0.18556618323305596, 0.8605470050721032], [70.95813647411643, 0.2170520090147885, 5.392646778383627], [78.9752996763893, 0.21460842593387275, 5.588070239943205]], "r_squared_": 0.9879606392665881, "error_": 0.0434945165746508}
{"freq_range": [2.0, 80.0], "freq_res": 1.0, "aperiodic_params_": [0.543605703900051, 1.0885991091783276], "gaussian_params_": [[6.435460891874367, 0.37763029103754864, 0.4945478707641659], [9.34455147536696, 1.3048023691677753, 0.8967580559577377], [11.55273816168646, 1.2938081151444263, 0.2500121677537318], [14.251226656801624, 0.218886798455891, 1.2977557028544517], [18.776600296557103, 0.4309871615882728, 0.620450147205311], [29.783056938498245, 0.18407619219491345, 0.5038174334316845], [63.10894438351841, 0.15187742893473002, 0.5686255598198563], [74.9938818026175, 0.19237587326420547, 5.999999999999999]], "peak_params_": [[6.435460891874367, 0.2575206495531791, 0.9890957415283318], [9.34455147536696, 1.212022185805724, 1.7935161119154754], [11.55273816168646, 0.32605554038407353, 0.5000243355074636], [14.251226656801624, 0.21482539025094616, 2.5955114057089035], [18.776600296557103, 0.4042067979053301, 1.240900294410622], [29.783056938498245, 0.1677780877249413, 1.007634866863369], [63.10894438351841, 0.17520370026132825, 1.1372511196397126], [74.9938818026175, 0.19237577324924615, 11.999999999999998]], "r_squared_": 0.9853693246584987, "error_": 0.046533039595324587}
{"freq_range": [2.0, 80.0], "freq_res": 1.0, "aperiodic_params_": [0.31543921747163484, 0.7502402877008442], "gaussian_params_": [[9.358691484466462, 1.127749157910948, 0.9863819192991619], [14.02685079957027, 0.17214321247055125, 0.2500000001378027], [18.69190641223084, 0.2035194106609484, 0.8702515388698437], [48.23476623591422, 0.24362577271464056, 0.7130966988093899], [70.52740902027243, 0.16029828049238967, 3.1822679217533816], [79.00384083995414, 0.15804434969619224, 1.3765685668705436]], "peak_params_": [[9.358691484466462, 1.0555958689116067, 1.9727638385983237], [14.02685079957027, 0.17117085117082947, 0.5000000002756054], [18.69190641223084, 0.1911566789545936, 1.7405030777396875], [48.23476623591422, 0.23077429979505715, 1.4261933976187797], [70.52740902027243, 0.15854034827983243, 6.364535843506763], [79.00384083995414, 0.1626746210758111, 2.7531371337410873]], "r_squared_": 0.9624085082050302, "error_": 0.05116087623901519}
{"freq_range": [2.0, 80.0], "freq_res": 1.0, "aperiodic_params_": [0.29115911059463034, 0.9414794443834874], "gaussian_params_": [[6.466604367132845, 1.01138373898852, 0.25569194420806524], [9.371774186716753, 1.3009220404480124, 0.8927374842455247], [11.535224577681115, 0.8580853177893542, 0.2886813949946537], [14.446761745726098, 0.7096442401184411, 0.2755763484460197], [18.72346469324561, 0.31101693281028636, 0.6425002895295563], [62.595666421386184, 0.5294311181491876, 0.2500115928477998], [73.01857200754021, 0.16582026894999827, 5.999999999999999]], "peak_params_": [[6.466604367132845, 0.19236932898919182, 0.5113838884161305], [9.371774186716753, 1.1928685236402659, 1.7854749684910494], [11.535224577681115, 0.2518517794396346, 0.5773627899893073], [14.446761745726098, 0.19068912315537512, 0.5511526968920394], [18.72346469324561, 0.2835031248081925, 1.2850005790591126], [62.595666421386184, 0.18430562209395362, 0.5000231856955996], [73.01857200754021, 0.1658194745819246, 11.999999999999998]], "r_squared_": 0.9727717091715616, "error_": 0.056165516829909556}
{"freq_range": [2.0, 80.0], "freq_res": 1.0, "aperiodic_params_": [-0.01871936144060032, 0.7601654657860079], "gaussian_params_": [[9.385260217242617, 1.3225732566972561, 0.907173324274106], [11.643571730351956, 0.36565238029942493, 0.6145452997733755], [18.723885724884852, 0.23945427100233285, 0.47668982847723346]], "peak_params_": [[9.385260217242617, 1.208561578370106, 1.814346648548212], [11.643571730351956, 0.32981651427170233, 1.229090599546751], [18.723885724884852, 0.20247314843951947, 0.9533796569544669]], "r_squared_": 0.9492677731620454, "error_": 0.07197266252538799}
{"freq_range": [2.0, 80.0], "freq_res": 1.0, "aperiodic_params_": [0.0403567367089846, 0.6304494337442426], "gaussian_params_": [[9.25623494228388, 0.8790437615945642, 0.7465812874193065], [10.882753835932398, 0.40137002711421027, 1.773632975631069], [51.70645160307617, 0.2565524414724001, 0.5607529418337529], [62.100127390806165, 0.32942916435050373, 1.0420479389940953], [66.02628473433761, 0.3100362422131712, 0.9491472569220603], [68.58031307439342, 0.7213772499143177, 0.27980853397606054], [75.83372213233223, 0.1888961964003876, 4.096946405969623]], "peak_params_": [[9.25623494228388, 1.057250178837004, 1.493162574838613], [10.882753835932398, 0.4579583898909753, 3.547265951262138], [51.70645160307617, 0.22370145922189477, 1.1215058836675058], [62.100127390806165, 0.32858187154352336, 2.0840958779881906], [66.02628473433761, 0.32081394517034434, 1.8982945138441205], [68.58031307439342, 0.28351657402081787, 0.5596170679521211], [75.83372213233223, 0.18874068482753392, 8.193892811939246]], "r_squared_": 0.9225872891528077, "error_": 0.0660095258478302}
{"freq_range": [2.0, 80.0], "freq_res": 1.0, "aperiodic_params_": [0.22714521823977732, 0.8020060063798872], "gaussian_params_": [[9.312314280907643, 1.182575720089154, 0.9287190197257023], [11.543495192570635, 0.828279313439426, 0.28050627655126115], [13.925666533928474, 0.16689474257077788, 0.4982813826346679], [18.55829413533452, 1.6258697968420117, 0.2503778086751861], [27.025707764149498, 0.1501681676285952, 0.6665602655377453], [57.559132255774074, 0.9207236998377095, 0.2509833983841738], [63.168533199716656, 0.15873848937824836, 1.7225606603462411], [71.07243412772551, 0.18030058529792586, 1.8141010981916015], [78.26355279214968, 0.15832365661416006, 2.85732162158651]], "peak_params_": [[9.312314280907643, 1.1175637252174975, 1.8574380394514045], [11.543495192570635, 0.23837174019530205, 0.5610125531025223], [13.925666533928474, 0.16505142204953627, 0.9965627652693358], [18.55829413533452, 0.3429801385103358, 0.5007556173503722], [27.025707764149498, 0.15005652342848075, 1.3331205310754906], [57.559132255774074, 0.19860373335269033, 0.5019667967683475], [63.168533199716656, 0.15798969159644605, 3.4451213206924822], [71.07243412772551, 0.18641809742435123, 3.628202196383203], [78.26355279214968, 0.1577744518289197, 5.71464324317302]], "r_squared_": 0.9846971329424572, "error_": 0.035112019310164874}
{"freq_range": [2.0, 80.0], "freq_res": 1.0, "aperiodic_params_": [0.4138304785023627, 0.9177401978310017], "gaussian_params_": [[9.309894965571527, 1.1869404490760542, 1.0284731825206588], [11.903241902029654, 0.19509225983729106, 0.2500477735211701], [14.430903760602675, 0.19398381487994892, 1.5208639677369915], [18.618475222204314, 1.0972259481109865, 0.28369369286564944]], "peak_params_": [[9.309894965571527, 1.1345935713827628, 2.0569463650413176], [11.903241902029654, 0.273893112028298, 0.5000955470423402], [14.430903760602675, 0.18638817832713983, 3.041727935473983], [18.618475222204314, 0.44630881044213383, 0.5673873857312989]], "r_squared_": 0.9766188690062007, "error_": 0.05592480388924386}
{"freq_range": [2.0, 80.0], "freq_res": 1.0, "aperiodic_params_": [0.40076025547594707, 0.9615642918792171], "gaussian_params_": [[6.463979471468343, 0.30946301869349474, 0.9381829261772605], [9.290009556637685, 1.201612427644078, 0.8326011850005711], [12.954190235856764, 0.3162386032894495, 2.8088061117933356], [18.609270895533648, 1.0805082258728116, 0.3002832218631105]], "peak_params_": [[6.463979471468343, 0.289084873502571, 1.876365852354521], [9.290009556637685, 1.256300268901629, 1.6652023700011422], [12.954190235856764, 0.31625520015878783, 5.617612223586671], [18.609270895533648, 0.4946016176641809, 0.600566443726221]], "r_squared_": 0.9713882336230882, "error_": 0.06949424473101683}
{"freq_range": [2.0, 80.0], "freq_res": 1.0, "aperiodic_params_": [0.580490574872206, 1.1261625945102223], "gaussian_params_": [[6.443009405711086, 0.3328395907488938, 0.9140643239471041], [9.335901612752362, 1.3512299201631999, 0.8777733736233874], [11.549332577409308, 1.092987939278708, 0.2594916050803225], [14.132575735516578, 0.3002693184145385, 1.6597416210665732], [18.767221674876712, 0.4882200092584803, 0.5485386141656619], [29.909536506234613, 0.2086017127635718, 0.7501803394909031], [54.314556813091116, 0.20437804289070335, 1.6634211568923438], [58.70003146047428, 0.2418183216354683, 0.6263791196104452], [62.84391297984899, 0.14277753988848987, 1.1476431583159732], [75.1699894181227, 0.21161981836470434, 5.9999999997973905]], "peak_params_": [[6.443009405711086, 0.2969459310757531, 1.8281286478942083], [9.335901612752362, 1.2649980150228683, 1.7555467472467747], [11.549332577409308, 0.3869376834098964, 0.518983210160645], [14.132575735516578, 0.2993139269003312, 3.3194832421331464], [18.767221674876712, 0.45025462056482674, 1.0970772283313237], [29.909536506234613, 0.20709050094265813, 1.5003606789818063], [54.314556813091116, 0.20117531769351582, 3.3268423137846876], [58.70003146047428, 0.2256147292241053, 1.2527582392208905], [62.84391297984899, 0.1685144175821549, 2.2952863166319464], [75.1699894181227, 0.21153490413607878, 11.999999999594781]], "r_squared_": 0.9865234137891707, "error_": 0.04456508192024304}
{"freq_range": [2.0, 80.0], "freq_res": 1.0, "aperiodic_params_": [0.6247820278700136, 1.1273706087565987], "gaussian_params_": [[6.487413092052995, 0.7938469545464755, 0.3093410433477853], [9.324226860113935, 1.265199017779312, 0.9151228121768762], [11.548609712794013, 0.9369781089112443, 0.2821343692820184], [14.104441217990567, 0.2694242681727902, 1.187197255362089], [18.78399188542794, 0.37634142924328945, 0.7130397652554595], [55.47372927415312, 0.13760384836299572, 3.720329552052203], [63.290308066910306, 0.179427389791967, 0.6416903182180795], [67.05855869113326, 0.10387350881643392, 0.2500522298214901], [75.57637980456201, 0.22488738398335087, 5.999999999999999]], "peak_params_": [[6.487413092052995, 0.23114520771822167, 0.6186820866955706], [9.324226860113935, 1.1882570614265642, 1.8302456243537524], [11.548609712794013, 0.33414944106024175, 0.5642687385640368], [14.104441217990567, 0.26838642532842666, 2.374394510724178], [18.78399188542794, 0.3595174425584065, 1.426079530510919], [55.47372927415312, 0.13712105743932268, 7.440659104104406], [63.290308066910306, 0.20475333679947338, 1.283380636436159], [67.05855869113326, 0.18316163094075533, 0.5001044596429802], [75.57637980456201, 0.22432760240316751, 11.999999999999998]], "r_squared_": 0.9821320596731393, "error_": 0.048140975979456685}
{"freq_range": [2.0, 80.0], "freq_res": 1.0, "aperiodic_params_": [0.4359992401850659, 1.0012737896599129], "gaussian_params_": [[6.4770877635789565, 0.9259916042586246, 0.28403389329658607], [9.320248380857842, 1.2630344628200798, 0.9082099953965918], [11.536583946519182, 0.7807808777201315, 0.28620978248956824], [14.070513850849881, 0.2115358129614778, 1.1981456790969713], [18.81920989978214, 0.31313845724907835, 0.6664875131424446], [29.353016224713606, 0.15243875154235004, 1.206938773791962], [57.31367098213247, 0.11701572652933091, 5.964016772411933], [67.03850535883049, 0.10619782437822137, 0.2500310306267812], [76.09593080166428, 0.18959960047508145, 5.999999999999999]], "peak_params_": [[6.4770877635789565, 0.2275047666990374, 0.5680677865931721], [9.320248380857842, 1.186931619307904, 1.8164199907931835], [11.536583946519182, 0.2742746955884603, 0.5724195649791365], [14.070513850849881, 0.2111719586034373, 2.3962913581939427], [18.81920989978214, 0.3018719329369488, 1.3329750262848892], [29.353016224713606, 0.1460571853578273, 2.413877547583924], [57.31367098213247, 0.11805153646026123, 11.928033544823865], [67.03850535883049, 0.19632710209058613, 0.5000620612535625], [76.09593080166428, 0.1904394435502359, 11.999999999999998]], "r_squared_": 0.9795033971896563, "error_": 0.050063593139426606}
{"freq_range": [2.0, 80.0], "freq_res": 1.0, "aperiodic_params_": [0.14010179743847134, 0.7937993313717686], "gaussian_params_": [[9.355713203444354, 0.9413581695851541, 0.5979046486662427], [9.95767158663164, 0.4401041726977464, 1.9277463098448295], [18.53574045491116, 0.7322791556574906, 0.2938810921891816], [63.680764586784534, 0.2612915731468763, 0.676126919418733], [67.41946871524954, 0.40385017870235945, 0.37807755176905555], [70.3930384301774, 0.22234683964428875, 0.8413318000162026], [72.78836309327698, 0.20200483616810427, 0.570969904475811], [78.30480265553956, 0.22066135310189222, 2.9172520860818194]], "peak_params_": [[9.355713203444354, 1.177686212731162, 1.1958092973324854], [9.95767158663164, 0.9667555984313905, 3.855492619689659], [18.53574045491116, 0.21026884202373264, 0.5877621843783633], [63.680764586784534, 0.2337327399748983, 1.352253838837466], [67.41946871524954, 0.2184230735297843, 0.7561551035381111], [70.3930384301774, 0.20319889400488433, 1.6826636000324051], [72.78836309327698, 0.2326595013435837, 1.141939808951622], [78.30480265553956, 0.2194601923466084, 5.834504172163639]], "r_squared_": 0.9540553345848664, "error_": 0.06376666238433677}
{"freq_range": [2.0, 80.0], "freq_res": 1.0, "aperiodic_params_": [-0.0922450765575482, 0.6820311273353722], "gaussian_params_": [[2.7027343361680995, 0.2858716497975864, 0.5606080567869576], [9.350315841305967, 0.8354315188257547, 0.5214640512321957], [10.084155628472281, 0.6043881302001843, 1.7256700328642762], [73.65246461044944, 0.21424539719551322, 5.999999999999999]], "peak_params_": [[2.7027343361680995, 0.2485117755004293, 1.1212161135739152], [9.350315841305967, 1.1628142961709544, 1.0429281024643915], [10.084155628472281, 0.9881276087472344, 3.4513400657285525], [73.65246461044944, 0.21388629930106928, 11.999999999999998]], "r_squared_": 0.940619944812564, "error_": 0.06643805241042142}
{"freq_range": [2.0, 80.0], "freq_res": 1.0, "aperiodic_params_": [0.0033074330691783005, 0.6672650543555974], "gaussian_params_": [[9.265520772037522, 0.9859409778024077, 0.7259015069547521], [11.832499966418599, 0.4583166007025567, 1.734711785086941], [54.69271535237539, 0.14789108150000602, 5.999999999999999], [62.493684158471915, 0.7560205395496774, 0.2942256212964886], [73.33637187994121, 0.208999821961934, 5.999999999999999]], "peak_params_": [[9.265520772037522, 1.0429834802152087, 1.4518030139095042], [11.832499966418599, 0.4570024637238941, 3.469423570173882], [54.69271535237539, 0.14965653588395855, 11.999999999999998], [62.493684158471915, 0.29052368135342854, 0.5884512425929772], [73.33637187994121, 0.21007873032878832, 11.999999999999998]], "r_squared_": 0.9537432473588396, "error_": 0.053183106942177046}
{"freq_range": [2.0, 80.0], "freq_res": 1.0, "aperiodic_params_": [0.04302906562721912, 0.5892349859222257], "gaussian_params_": [[9.322692099366227, 1.0673131183890447, 0.7725505822140232], [13.687253569803824, 0.24437365692778182, 3.167431244882144], [18.94893071224964, 0.36203712475202543, 1.1798684789626268], [30.18720325575897, 0.14193142458224267, 1.1742317398753186], [34.054299541405165, 0.1737724753405853, 0.540158443898454], [36.93031285753206, 0.1905131607717166, 0.7731027206376877]], "peak_params_": [[9.322692099366227, 1.0599083146627144, 1.5451011644280463], [13.687253569803824, 0.2432400847362436, 6.334862489764288], [18.94893071224964, 0.42155903652495896, 2.3597369579252536], [30.18720325575897, 0.14013954811652196, 2.348463479750637], [34.054299541405165, 0.17377011653556962, 1.080316887796908], [36.93031285753206, 0.1897408251589361, 1.5462054412753754]], "r_squared_": 0.9734517567641696, "error_": 0.04151855219422598}
{"freq_range": [2.0, 80.0], "freq_res": 1.0, "aperiodic_params_": [0.3848965692578891, 0.9613189338869795], "gaussian_params_": [[9.331851278475755, 1.243659979749362, 1.042643929705819], [11.749608383435026, 0.3687766872957622, 0.2500055472318363], [14.238730314834148, 0.21961736679270333, 1.4267772289282916], [18.656706091477705, 0.5985217259861821, 0.4149232432894998], [74.8347661809438, 0.19008574543106543, 5.999998999769292]], "peak_params_": [[9.331851278475755, 1.1824960324963216, 2.085287859411638], [11.749608383435026, 0.3345211639605814, 0.5000110944636726], [14.238730314834148, 0.21661972312013344, 2.8535544578565832], [18.656706091477705, 0.42588326101805163, 0.8298464865789996], [74.8347661809438, 0.19001367904544852, 11.999997999538584]], "r_squared_": 0.9721565063824236, "error_": 0.05802578361681913}
{"freq_range": [2.0, 80.0], "freq_res": 1.0, "aperiodic_params_": [0.47675508709723186, 1.0312584471433086], "gaussian_params_": [[7.1434607003164, 0.30008590115578904, 1.5134938473097914], [9.411665068786965, 1.2941310916486741, 0.7655532669228733], [11.52888944724505, 1.1377245649910892, 0.28670483753093634], [14.132652042448568, 0.28768165061162604, 1.3344740167930949], [18.721252996105033, 0.5384433148960027, 0.47785605098436446], [75.6960207832682, 0.21282755251540336, 5.999999999999999]], "peak_params_": [[7.1434607003164, 0.30779889790352866, 3.026987694619583], [9.411665068786965, 1.261517872904604, 1.5311065338457466], [11.52888944724505, 0.38116645179494696, 0.5734096750618727], [14.132652042448568, 0.28627435017725167, 2.6689480335861897], [18.721252996105033, 0.45457552381429905, 0.9557121019687289], [75.6960207832682, 0.21255458907401126, 11.999999999999998]], "r_squared_": 0.9738429210748831, "error_": 0.05825732276282346}
{"freq_range": [2.0, 80.0], "freq_res": 1.0, "aperiodic_params_": [0.6104955917316573, 1.1331655537546232], "gaussian_params_": [[7.369492479592269, 0.28947382631831675, 1.5723546321151494], [9.40971883680511, 1.2483476383679806, 0.7440762841685583], [11.53280282253213, 1.0820286966024322, 0.2975619097955549], [14.116768989225715, 0.26688333682232884, 1.2560958505485682], [18.744753276600502, 0.47800766791002525, 0.529032593516134], [29.85640329223411, 0.21676576527361266, 0.8171021517387427], [55.69118691012302, 0.16957671318129855, 5.218184532243778], [58.599048722674574, 0.18423446577302657, 0.25250939880566114], [75.52713767897268, 0.24078706183917947, 5.999999999999999]], "peak_params_": [[7.369492479592269, 0.28818030238108133, 3.1447092642302987], [9.40971883680511, 1.2418927598957101, 1.4881525683371166], [11.53280282253213, 0.38666987608005665, 0.5951238195911098], [14.116768989225715, 0.26577246950169237, 2.5121917010971364], [18.744753276600502, 0.4256263473039108, 1.058065187032268], [29.85640329223411, 0.21344508386867866, 1.6342043034774854], [55.69118691012302, 0.1704867963357397, 10.436369064487556], [58.599048722674574, 0.19633878661646142, 0.5050187976113223], [75.52713767897268, 0.24012758668967482, 11.999999999999998]], "r_squared_": 0.9852228922567025, "error_": 0.04624550230827055}
{"freq_range": [2.0, 80.0], "freq_res": 1.0, "aperiodic_params_": [0.5147624140818634, 1.0745665680492145], "gaussian_params_": [[6.601529592551659, 0.2529203789213062, 0.6920613765373432], [9.335258982733906, 1.3193505953290383, 0.8721067829369494], [11.596986269905043, 0.3816703272066331, 0.5310537129853378], [13.958783323426248, 0.24578416114984375, 1.2719935870536336], [18.824546666467967, 0.40816200622519266, 0.6109011863959514], [29.912977559622462, 0.23084339075649138, 0.7550115497430899], [54.11516772019979, 0.22076791045971741, 1.6236053738710015], [58.65360560328223, 0.2128281101602872, 0.7011155429264786], [63.26679000221114, 0.18084226096842898, 0.7554505635666617], [75.5938963522271, 0.23712159864653462, 5.999999999999999]], "peak_params_": [[6.601529592551659, 0.25087819147010515, 1.3841227530746865], [9.335258982733906, 1.2261261875371523, 1.7442135658738989], [11.596986269905043, 0.37365719989096446, 1.0621074259706755], [13.958783323426248, 0.2456696318772999, 2.5439871741072673], [18.824546666467967, 0.39176600307676074, 1.2218023727919027], [29.912977559622462, 0.229315116866748, 1.5100230994861799], [54.11516772019979, 0.22057824155341255, 3.247210747742003], [58.65360560328223, 0.1959417402309933, 1.4022310858529572], [63.26679000221114, 0.19610833543192951, 1.5109011271333235], [75.5938963522271, 0.23657907945556178, 11.999999999999998]], "r_squared_": 0.9837764916389556, "error_": 0.04439652966525363}
{"freq_range": [2.0, 80.0], "freq_res": 1.0, "aperiodic_params_": [0.32788359447148074, 0.9541235755833131], "gaussian_params_": [[9.341178769961193, 0.9176980021202173, 0.6666594130691318], [10.243422281570831, 0.45649238899875855, 2.368063902039099], [18.930291729376474, 0.3295144605404584, 0.6830720968942254], [29.99947438340878, 0.22670894125040553, 0.8978164415446597], [56.15534298221143, 0.1429618095030871, 5.6409009942995025], [75.79266333574625, 0.22959386319632097, 5.999999999999999]], "peak_params_": [[9.341178769961193, 1.2027641289433544, 1.3333188261382636], [10.243422281570831, 1.0172429538481043, 4.736127804078198], [18.930291729376474, 0.3282931341627827, 1.3661441937884509], [29.99947438340878, 0.226711969380202, 1.7956328830893193], [56.15534298221143, 0.14390296732469698, 11.281801988599005], [75.79266333574625, 0.22975041429096588, 11.999999999999998]], "r_squared_": 0.9763926957592304, "error_": 0.05301458950759291}
{"freq_range": [2.0, 80.0], "freq_res": 1.0, "aperiodic_params_": [-0.01954571273634967, 0.6154524526984733], "gaussian_params_": [[9.451083326905827, 1.1076137495847969, 1.0231112989014002], [18.60405640526838, 0.4235186801162352, 0.3878393238725688], [29.86720403928478, 0.21105382748679055, 1.0436373657656175], [46.85732256025914, 0.2257311506279538, 0.64838486259659], [75.45203459913596, 0.15980491365724167, 5.999999999999999]], "peak_params_": [[9.451083326905827, 1.005026891021011, 2.0462225978028004], [18.60405640526838, 0.2515101514479361, 0.7756786477451376], [29.86720403928478, 0.20935215094999338, 2.087274731531235], [46.85732256025914, 0.22033366781483, 1.29676972519318], [75.45203459913596, 0.15935203185393632, 11.999999999999998]], "r_squared_": 0.9411625606982823, "error_": 0.0566273420559608}
{"freq_range": [2.0, 80.0], "freq_res": 1.0, "aperiodic_params_": [-0.3354784999363951, 0.47770793536475753], "gaussian_params_": [[9.32824717048379, 0.960828320385131, 0.6311785466170136], [10.575527576296732, 0.36580709067790385, 1.6906883181045482], [18.58456239392207, 0.9033692039825358, 0.2500259417430011], [29.885030000659782, 0.2626234935705043, 1.1749180405081403], [75.78921998080551, 0.15560782988168198, 5.999993703892122]], "peak_params_": [[9.32824717048379, 1.0762616652960317, 1.2623570932340271], [10.575527576296732, 0.38325272971714447, 3.3813766362090965], [18.58456239392207, 0.22717420202443073, 0.5000518834860022], [29.885030000659782, 0.26136914488839436, 2.3498360810162806], [75.78921998080551, 0.15551184015511277, 11.999987407784245]], "r_squared_": 0.9153739485177942, "error_": 0.05954206768574912}
{"freq_range": [2.0, 80.0], "freq_res": 1.0, "aperiodic_params_": [-0.18355266836352901, 0.3683154601637877], "gaussian_params_": [[9.426047693863149, 0.9651955797664683, 0.49791658032988156], [12.349594780272957, 0.3639879598212498, 2.3998402920931405], [54.40576778466141, 0.5994941104275308, 0.30013615992467874]], "peak_params_": [[9.426047693863149, 0.8067351462790899, 0.9958331606597631], [12.349594780272957, 0.36014780805871954, 4.799680584186281], [54.40576778466141, 0.24037677547816338, 0.6002723198493575]], "r_squared_": 0.9059850186313079, "error_": 0.05834384855151777}
{"freq_range": [2.0, 80.0], "freq_res": 1.0, "aperiodic_params_": [0.17361223335687842, 0.8453416863541975], "gaussian_params_": [[9.450827346758038, 1.2442148900551802, 0.8983031622508073], [11.533790366630887, 0.81408544916276, 0.29296987458553075], [13.589462356598442, 0.2557953456158303, 1.5609419474853166], [18.619490052679254, 0.29712438023336374, 0.6832995890908848], [70.81500060172647, 0.17820629373478675, 5.999999999999999], [78.67102993752754, 0.20114359968525394, 0.7314748886000525]], "peak_params_": [[9.450827346758038, 1.1003842489910478, 1.7966063245016146], [11.533790366630887, 0.4040088371764951, 0.5859397491710615], [13.589462356598442, 0.24710296426100875, 3.121883894970633], [18.619490052679254, 0.2550778431325348, 1.3665991781817697], [70.81500060172647, 0.1781216045489753, 11.999999999999998], [78.67102993752754, 0.2520750928991111, 1.462949777200105]], "r_squared_": 0.964763380317522, "error_": 0.05731220226797752}
{"freq_range": [2.0, 80.0], "freq_res": 1.0, "aperiodic_params_": [0.38082417815271913, 0.9972676599481023], "gaussian_params_": [[9.436780010582378, 1.262605398749303, 1.079274155724107], [11.66712321361297, 0.6374733814248242, 0.25000113352359665], [14.019111749990826, 0.24176452860286166, 1.5925477005214144], [18.68443808076849, 0.41570717406981306, 0.5763836405392888], [55.5529812319584, 0.15922339546618688, 4.375099248053405], [75.28545036570911, 0.2174630301245337, 5.999999999999999]], "peak_params_": [[9.436780010582378, 1.1650153855458174, 2.158548311448214], [11.66712321361297, 0.44618652017816085, 0.5000022670471933], [14.019111749990826, 0.24191287399779893, 3.1850954010428287], [18.68443808076849, 0.3596654262330643, 1.1527672810785776], [55.5529812319584, 0.15963600378714027, 8.75019849610681], [75.28545036570911, 0.21722522878179196, 11.999999999999998]], "r_squared_": 0.9713857848087124, "error_": 0.05912082050386406}
{"freq_range": [2.0, 80.0], "freq_res": 1.0, "aperiodic_params_": [0.43703035493211684, 1.0390227637421876], "gaussian_params_": [[7.631642810352256, 0.3038252306221685, 1.3278273328380292], [9.454324446184005, 1.2604655870954358, 0.7374623063516625], [11.524629686825092, 1.0890561631304456, 0.3049128609463492], [14.01068887875031, 0.2743989964085523, 1.3747340612850252], [18.67794565702131, 0.49087785281723595, 0.4822819035199682], [29.811599324264954, 0.23372623177588792, 0.8248746727106832], [56.01966148701536, 0.1602714921488681, 4.654197101440663], [73.06651032327417, 0.230868552940615, 4.1462441593667], [79.20963420826595, 0.20766729365977354, 1.105235925278033]], "peak_params_": [[7.631642810352256, 0.4726923171597602, 2.6556546656760585], [9.454324446184005, 1.2216095612756066, 1.474924612703325], [11.524629686825092, 0.4218114003900598, 0.6098257218926983], [14.01068887875031, 0.274393783533912, 2.7494681225700504], [18.67794565702131, 0.39315307550307527, 0.9645638070399364], [29.811599324264954, 0.22770877489751074, 1.6497493454213663], [56.01966148701536, 0.16031840452014579, 9.308394202881326], [73.06651032327417, 0.2310451618296696, 8.2924883187334], [79.20963420826595, 0.2868874468358713, 2.210471850556066]], "r_squared_": 0.9830795727752163, "error_": 0.047075343519093045}
{"freq_range": [2.0, 80.0], "freq_res": 1.0, "aperiodic_params_": [0.4015043732658852, 0.9856197079231496], "gaussian_params_": [[9.31241977198219, 0.9378526692188967, 0.6962237752812214], [10.672907124570127, 0.41244734118315474, 3.0800769018765477], [18.763988773489277, 0.40182540194272, 0.5513576242095731], [29.896551529095515, 0.273025700622531, 0.7992011792859313], [58.31871089745664, 0.1771034488927105, 5.999999999999999]], "peak_params_": [[9.31241977198219, 1.203911626573681, 1.3924475505624427], [10.672907124570127, 0.4598247076134251, 6.160153803753095], [18.763988773489277, 0.37731932357999376, 1.1027152484191463], [29.896551529095515, 0.27075060372288995, 1.5984023585718625], [58.31871089745664, 0.17685376988115875, 11.999999999999998]], "r_squared_": 0.9602927771412806, "error_": 0.07409017342183562}
{"freq_range": [2.0, 80.0], "freq_res": 1.0, "aperiodic_params_": [0.4097780824750808, 1.016408728175594], "gaussian_params_": [[9.351596493928588, 0.8895426921550538, 0.7245712333253096], [10.776616688385374, 0.4595508061070474, 2.8452952237880846], [18.832989701044294, 0.3915662674376053, 0.6528031677446138], [29.92887563512755, 0.2598187590046871, 0.8380124186962848], [56.551152681985336, 0.15998790584684194, 5.728218066984413], [72.4029980386982, 0.23627106074750248, 3.1875611715561725], [79.87119564860737, 0.24494975900880067, 2.2004585580332634]], "peak_params_": [[9.351596493928588, 1.1689011661403348, 1.4491424666506192], [10.776616688385374, 0.5250155406810846, 5.690590447576169], [18.832989701044294, 0.3860141347432027, 1.3056063354892276], [29.92887563512755, 0.2588881140407595, 1.6760248373925697], [56.551152681985336, 0.1594995164674724, 11.456436133968825], [72.4029980386982, 0.23901161179966057, 6.375122343112345], [79.87119564860737, 0.2583697973778667, 4.400917116066527]], "r_squared_": 0.9834628753366395, "error_": 0.04587838085478768}
{"freq_range": [2.0, 80.0], "freq_res": 1.0, "aperiodic_params_": [0.21172255488597894, 0.855109191988382], "gaussian_params_": [[9.424272724839009, 0.912985008411741, 0.761560733239218], [10.801594976518938, 0.43906986121644154, 2.5074987816514422], [18.752070576332706, 0.36148260151872397, 0.6578292148357477], [29.93393730564384, 0.2532890682189202, 0.8820828344112263], [67.45203459913627, 0.1295334423577641, 5.999999999999999], [79.40996489239245, 0.19382707711676364, 5.121696795328052]], "peak_params_": [[9.424272724839009, 1.1209355535161878, 1.523121466478436], [10.801594976518938, 0.545056855115199, 5.0149975633028845], [18.752070576332706, 0.3387947096619571, 1.3156584296714955], [29.93393730564384, 0.25257970095842575, 1.7641656688224525], [67.45203459913627, 0.1394592829509198, 11.999999999999998], [79.40996489239245, 0.2135306594955051, 10.243393590656105]], "r_squared_": 0.9713984404761626, "error_": 0.05114289321802077}
{"freq_range": [2.0, 80.0], "freq_res": 1.0, "aperiodic_params_": [-0.07176418460661783, 0.62078849854007], "gaussian_params_": [[9.44038928704651, 1.0045319197748488, 0.8281028674623357], [11.195711398193135, 0.25084897590877225, 2.325084985892696], [18.55710237467752, 1.3754675465329278, 0.2500000773207698], [29.871215861143092, 0.23556720262902103, 1.0268299746917782], [54.18767178233487, 0.18707172105715578, 1.4392279707335776], [63.630471970466324, 0.42377785359550074, 0.25002087983698446], [71.7570997483085, 0.13152294348558843, 5.999999999999999], [75.60115317765099, 0.3226356644653961, 0.2500092101586483], [79.99999999999999, 0.14318025054375555, 1.7759681110821741]], "peak_params_": [[9.44038928704651, 1.032673708075059, 1.6562057349246715], [11.195711398193135, 0.42046714143215985, 4.650169971785392], [18.55710237467752, 0.2872669332128489, 0.5000001546415396], [29.871215861143092, 0.23372173781465766, 2.0536599493835563], [54.18767178233487, 0.18713643536569702, 2.878455941467155], [63.630471970466324, 0.1991871764437293, 0.5000417596739689], [71.7570997483085, 0.13142083025836504, 11.999999999999998], [75.60115317765099, 0.2041365087825573, 0.5000184203172966], [79.99999999999999, 0.19436773905348703, 3.5519362221643482]], "r_squared_": 0.965011740099148, "error_": 0.041910124061994306}
{"freq_range": [2.0, 80.0], "freq_res": 1.0, "aperiodic_params_": [-0.5131980882159081, 0.28730462917484734], "gaussian_params_": [[9.447971749684053, 1.1400987922258352, 0.7045946316983986], [11.130970490739587, 0.3016929710763324, 2.227306382197698], [18.556595618753576, 1.1667298625999745, 0.25561881708952366], [29.851663270327894, 0.2893642682614983, 1.2694868902715015]], "peak_params_": [[9.447971749684053, 1.1223599916480327, 1.4091892633967973], [11.130970490739587, 0.4019449305080498, 4.454612764395396], [18.556595618753576, 0.2597585058020445, 0.5112376341790473], [29.851663270327894, 0.2873955919784723, 2.538973780543003]], "r_squared_": 0.9080814250645566, "error_": 0.0605590439681093}
{"freq_range": [2.0, 80.0], "freq_res": 1.0, "aperiodic_params_": [0.005274334956430704, 0.5909751572806224], "gaussian_params_": [[10.002108082908869, 1.1640027804120145, 1.2974332279732355], [62.091200511934076, 0.23381421410576425, 0.6577134697816822], [72.54796540086404, 0.17634792378478972, 5.999999999999999]], "peak_params_": [[10.002108082908869, 1.164001243924352, 2.594866455946471], [62.091200511934076, 0.2691840424465659, 1.3154269395633644], [72.54796540086404, 0.17584815964171652, 11.999999999999998]], "r_squared_": 0.9155510065174749, "error_": 0.0743573700186929}
{"freq_range": [2.0, 80.0], "freq_res": 1.0, "aperiodic_params_": [0.22025509416962555, 0.8349163504342536], "gaussian_params_": [[9.999724953484515, 1.2604268107384948, 1.391142793635414]], "peak_params_": [[9.999724953484515, 1.2604267861032714, 2.782285587270828]], "r_squared_": 0.9413508098810165, "error_": 0.0866432931612132}
{"freq_range": [2.0, 80.0], "freq_res": 1.0, "aperiodic_params_": [0.3087793414624124, 0.9600406606020988], "gaussian_params_": [[9.576150769197044, 1.0175704625866138, 0.8630418286134338], [11.452034599135944, 0.455755055726911, 2.790970582713303], [18.669630635354267, 0.3061047025295, 0.85965950519468], [67.90406920253274, 0.12143242443060816, 5.999999999999999], [79.31639128531636, 0.19072999111148842, 4.992684462640524]], "peak_params_": [[9.576150769197044, 1.3000339174063742, 1.7260836572268676], [11.452034599135944, 0.7107452301998267, 5.581941165426606], [18.669630635354267, 0.2960785758343121, 1.71931901038936], [67.90406920253274, 0.13603314668430322, 11.999999999999998], [79.31639128531636, 0.21231047014587534, 9.985368925281048]], "r_squared_": 0.9658913841340936, "error_": 0.06559636397854994}
{"freq_range": [2.0, 80.0], "freq_res": 1.0, "aperiodic_params_": [0.3328481375449526, 0.9573563390722997], "gaussian_params_": [[9.506853176506638, 1.1931592075357993, 1.176377991902153], [12.369111626020747, 0.7035994447332006, 0.2826268257650022], [14.054426986725286, 0.30478727235470476, 1.1897314705080264], [18.674073594543014, 0.3821473064080854, 0.6889521380997699], [29.840001585274265, 0.26349388391090434, 0.8380411155865563], [75.45203459913596, 0.23484250223790398, 5.999999999999999]], "peak_params_": [[9.506853176506638, 1.0937097895654464, 2.352755983804306], [12.369111626020747, 0.4947958069403777, 0.5652536515300044], [14.054426986725286, 0.3052792658898737, 2.379462941016053], [18.674073594543014, 0.3417446142010363, 1.3779042761995397], [29.840001585274265, 0.258735168608618, 1.6760822311731125], [75.45203459913596, 0.23417696640754548, 11.999999999999998]], "r_squared_": 0.9716515123163422, "error_": 0.05700823587364681}
{"freq_range": [2.0, 80.0], "freq_res": 1.0, "aperiodic_params_": [0.29128438845280236, 0.9371926725360777], "gaussian_params_": [[7.033337058956046, 0.217984228354357, 0.6004408533459796], [9.58265433549982, 1.2482628933875732, 1.0261426980401926], [12.332955972021985, 0.37995873482483505, 0.32071763220583377], [13.477439327762774, 0.27025683880673146, 1.628870387596561], [18.697186514568482, 0.40241122080958125, 0.6731595239036778], [29.921779317589692, 0.2790998830647424, 0.8379182441324208], [55.317903397498355, 0.16275859538285214, 3.8985760615016005], [63.52903602735518, 0.5575142826336612, 0.28336244704038593], [76.15707391475762, 0.22341719428756568, 5.999999999999999]], "peak_params_": [[7.033337058956046, 0.2703221344434618, 1.2008817066919593], [9.58265433549982, 1.1768518195545778, 2.0522853960803853], [12.332955972021985, 0.4786239945922356, 0.6414352644116675], [13.477439327762774, 0.30746080286420036, 3.257740775193122], [18.697186514568482, 0.364550526216623, 1.3463190478073557], [29.921779317589692, 0.27788642796642415, 1.6758364882648416], [55.317903397498355, 0.16266415621487362, 7.797152123003201], [63.52903602735518, 0.182405960161798, 0.5667248940807719], [76.15707391475762, 0.22334077508391448, 11.999999999999998]], "r_squared_": 0.9858343273811089, "error_": 0.039376378930422916}
{"freq_range": [2.0, 80.0], "freq_res": 1.0, "aperiodic_params_": [0.16687947005635453, 0.8201830443099587], "gaussian_params_": [[7.525015696236933, 0.8628384196033578, 0.3090795750484312], [9.547142133977204, 1.1972473612947572, 0.7044183346201259], [11.512718634619524, 0.5024866260362072, 1.8481636761217344], [18.664964104270442, 0.491391195691903, 0.6359837080928548], [29.875058786661654, 0.27843942795049476, 0.9181852651240802], [72.54796540086404, 0.1842918192393184, 5.999999999999999]], "peak_params_": [[7.525015696236933, 0.4547763545224017, 0.6181591500968624], [9.547142133977204, 1.3331864394150137, 1.4088366692402519], [11.512718634619524, 0.4881092854703765, 3.6963273522434688], [18.664964104270442, 0.4278626922653457, 1.2719674161857095], [29.875058786661654, 0.2758735102526172, 1.8363705302481603], [72.54796540086404, 0.18376954236108345, 11.999999999999998]], "r_squared_": 0.9738836889486437, "error_": 0.05290117675439662}
{"freq_range": [2.0, 80.0], "freq_res": 1.0, "aperiodic_params_": [0.0419978815830267, 0.6985381571911292], "gaussian_params_": [[9.551554946761781, 1.411076352526435, 1.0013320622958277], [12.446670665692519, 0.34268844430269696, 1.050511241678866], [18.52702727376005, 2.0357661902470783, 0.2630782362096254], [29.762422538093762, 0.29680693905926725, 1.0098402589847117], [67.45203459913596, 0.10513967870530926, 5.999999999999999], [79.99999999999999, 0.17646383363149856, 5.089753809795356]], "peak_params_": [[9.551554946761781, 1.2991835354846808, 2.0026641245916554], [12.446670665692519, 0.38406692303914247, 2.101022483357732], [18.52702727376005, 0.4044435525437795, 0.5261564724192508], [29.762422538093762, 0.2887056592531879, 2.0196805179694235], [67.45203459913596, 0.11160340171671335, 11.999999999999998], [79.99999999999999, 0.18826813802021203, 10.179507619590712]], "r_squared_": 0.969235868444942, "error_": 0.052213755312298285}
{"freq_range": [2.0, 80.0], "freq_res": 1.0, "aperiodic_params_": [-0.3016386649417152, 0.37554622394997567], "gaussian_params_": [[9.454223759533367, 1.5189883370989954, 0.8955471110390768], [12.262293468545463, 0.36166756423169333, 1.2962347143160866], [18.534905179889716, 1.431472848945515, 0.2677422150446565]], "peak_params_": [[9.454223759533367, 1.3508859396589872, 1.7910942220781536], [12.262293468545463, 0.38105586100215777, 2.5924694286321732], [18.534905179889716, 0.3166204325531961, 0.535484430089313]], "r_squared_": 0.9280656776226399, "error_": 0.06618613900271036}
{"freq_range": [2.0, 80.0], "freq_res": 1.0, "aperiodic_params_": [-0.2605229915554702, 0.8232970787610914], "gaussian_params_": [[9.81365694714241, 1.714935951741484, 1.3426409800000114], [18.701471589030497, 0.4777406083174799, 1.2791612790849456]], "peak_params_": [[9.81365694714241, 1.6984984870945703, 2.685281960000023], [18.701471589030497, 0.46490599461422566, 2.558322558169891]], "r_squared_": 0.9646739072574269, "error_": 0.07069504748125362}
{"freq_range": [2.0, 80.0], "freq_res": 1.0, "aperiodic_params_": [0.32473608452574143, 0.9595658448858005], "gaussian_params_": [[9.677138594367724, 1.3801735884152098, 1.0341517987421023], [11.97989113457123, 0.47922455483892445, 2.748729124771194], [18.891809929222227, 0.42353735005115467, 1.1285158502926496], [74.9556294861367, 0.19342455867822242, 5.999999999999999]], "peak_params_": [[9.677138594367724, 1.6842491027697988, 2.0683035974842046], [11.97989113457123, 0.5899718488600404, 5.497458249542388], [18.891809929222227, 0.4399678049033845, 2.257031700585299], [74.9556294861367, 0.1934192698179018, 11.999999999999998]], "r_squared_": 0.9772724876922291, "error_": 0.06405549123008206}
{"freq_range": [2.0, 80.0], "freq_res": 1.0, "aperiodic_params_": [0.35362989635199005, 0.9650092236410229], "gaussian_params_": [[9.832349059016094, 1.3829414797131057, 1.2723419076146278], [15.452034599135944, 0.28018914927496086, 3.917229160806628], [75.45203459913596, 0.21535076325917366, 5.999999999999999]], "peak_params_": [[9.832349059016094, 1.4773553654948852, 2.5446838152292557], [15.452034599135944, 0.2786918252900301, 7.834458321613256], [75.45203459913596, 0.21474046636794553, 11.999999999999998]], "r_squared_": 0.9660436816771578, "error_": 0.07325102753843893}
{"freq_range": [2.0, 80.0], "freq_res": 1.0, "aperiodic_params_": [0.3214869421225342, 0.962267392150042], "gaussian_params_": [[9.538609935220306, 1.2704599119622941, 1.1401828486702135], [12.852125599490055, 0.389854332142549, 1.6392265060239046], [18.590445895820093, 0.40332411231002574, 0.9579822107613518], [29.869359703592362, 0.28054764681412503, 0.7715319816718719], [56.892688701398214, 0.12338571681747768, 5.352462780171047], [72.41800295419476, 0.1813235223042861, 2.87335983357843], [79.17510661474309, 0.20573805251437896, 1.9943718987910029]], "peak_params_": [[9.538609935220306, 1.2563918176136255, 2.280365697340427], [12.852125599490055, 0.40093869543973826, 3.2784530120478093], [18.590445895820093, 0.3684440509116069, 1.9159644215227036], [29.869359703592362, 0.27655491999823334, 1.5430639633437437], [56.892688701398214, 0.12336102266333904, 10.704925560342094], [72.41800295419476, 0.18203123973640944, 5.74671966715686], [79.17510661474309, 0.21812376192762772, 3.9887437975820057]], "r_squared_": 0.9852395068030642, "error_": 0.044717578113198236}
{"freq_range": [2.0, 80.0], "freq_res": 1.0, "aperiodic_params_": [0.28610820964055184, 0.8709941019222638], "gaussian_params_": [[7.481200405861364, 0.7866569579097672, 0.30006663089892577], [9.494901561977983, 1.376250040627585, 0.7867035832870404], [11.505448793542945, 0.4648530598199816, 1.66376236003795], [18.610416471573803, 0.5337921887893221, 0.8312626371894801], [29.78568586698438, 0.31566469881108367, 0.7111273516702071], [72.54796540086404, 0.14877062177633874, 5.999999999999999]], "peak_params_": [[7.481200405861364, 0.23834062175172505, 0.6001332617978515], [9.494901561977983, 1.2787650383111002, 1.5734071665740808], [11.505448793542945, 0.453410876907032, 3.3275247200759], [18.610416471573803, 0.4782919915310632, 1.6625252743789602], [29.78568586698438, 0.3016501550294479, 1.4222547033404143], [72.54796540086404, 0.14834901078874774, 11.999999999999998]], "r_squared_": 0.9767502053609939, "error_": 0.054460651623869316}
{"freq_range": [2.0, 80.0], "freq_res": 1.0, "aperiodic_params_": [-0.006743735528493443, 0.5893660218099539], "gaussian_params_": [[9.498457389890797, 1.7653075203074464, 0.9719654710507685], [12.137094465640894, 0.4311278266210654, 0.672214619213384], [18.619487081603072, 0.628254107759525, 0.6528250127410979]], "peak_params_": [[9.498457389890797, 1.5477937196582072, 1.943930942101537], [12.137094465640894, 0.48659090573242353, 1.344429238426768], [18.619487081603072, 0.5301050949342019, 1.3056500254821959]], "r_squared_": 0.964325895564912, "error_": 0.05892848271395237}
{"freq_range": [2.0, 80.0], "freq_res": 1.0, "aperiodic_params_": [-0.6039574626012925, -0.002192231154553137], "gaussian_params_": [[9.434798840568806, 1.4806512148570423, 0.7140611684352709], [11.761877408432014, 0.27156683173773977, 0.7207092161046409], [33.84789164409867, 0.1585374755007651, 5.999999999999999]], "peak_params_": [[9.434798840568806, 1.2303068820435683, 1.4281223368705418], [11.761877408432014, 0.2596846379347127, 1.4414184322092818], [33.84789164409867, 0.15848653821392872, 11.999999999999998]], "r_squared_": 0.8741777355264286, "error_": 0.054348111685987396}
{"freq_range": [2.0, 80.0], "freq_res": 1.0, "aperiodic_params_": [0.23084761847919438, 0.8766319523420865], "gaussian_params_": [[9.815099638706316, 1.6672803904419367, 1.294546605217513], [18.883962662166372, 0.46092852974387494, 1.127117037801966]], "peak_params_": [[9.815099638706316, 1.65036018172736, 2.589093210435026], [18.883962662166372, 0.45849234157037283, 2.254234075603932]], "r_squared_": 0.9665777507172092, "error_": 0.07356685550849575}
{"freq_range": [2.0, 80.0], "freq_res": 1.0, "aperiodic_params_": [0.10984935943305257, 0.8040205387337064], "gaussian_params_": [[9.718777288916137, 1.508578464423016, 1.2098149468993866], [18.837014598147338, 0.4648579783605108, 0.7229827244297778], [75.84484200741178, 0.15587024916803008, 5.999999999999999]], "peak_params_": [[9.718777288916137, 1.4683672308872378, 2.4196298937987732], [18.837014598147338, 0.45319456269446223, 1.4459654488595557], [75.84484200741178, 0.1558181409245334, 11.999999999999998]], "r_squared_": 0.9628011118470594, "error_": 0.06718772843530148}
{"freq_range": [2.0, 80.0], "freq_res": 1.0, "aperiodic_params_": [0.011478142521966163, 0.6707116938312139], "gaussian_params_": [[9.438402740813613, 1.6370107907873754, 0.906227265246655], [11.653297777561708, 0.37471809546017404, 0.9779606374785017], [18.70730290179952, 0.5231180517893173, 0.6580927670925489], [29.59309944076751, 0.2567543493294457, 0.8334959513156004], [76.9373005714565, 0.14535454527908323, 5.999999999999999]], "peak_params_": [[9.438402740813613, 1.4656858140300026, 1.81245453049331], [11.653297777561708, 0.3820281907895471, 1.9559212749570034], [18.70730290179952, 0.47385382577391727, 1.3161855341850979], [29.59309944076751, 0.22791147667910683, 1.6669919026312008], [76.9373005714565, 0.1453466091005473, 11.999999999999998]], "r_squared_": 0.9723662260881304, "error_": 0.04840842744215089}
{"freq_range": [2.0, 80.0], "freq_res": 1.0, "aperiodic_params_": [-0.806527928816262, 0.6404317110957506], "gaussian_params_": [[9.421597316014061, 0.9859044474605689, 0.7069161352137164], [11.580275186387675, 0.26510432444206466, 1.8372829105253785], [70.45203459914357, 0.13212302296032824, 5.99999999999999], [78.54796540086384, 0.06236281961162297, 3.2567321774096065]], "peak_params_": [[9.421597316014061, 0.9241621383377078, 1.4138322704274329], [11.580275186387675, 0.2595496203804395, 3.674565821050757], [70.45203459914357, 0.13373917404657343, 11.99999999999998], [78.54796540086384, 0.10965485634713223, 6.513464354819213]], "r_squared_": 0.9468685195545805, "error_": 0.05590684064808915}
{"freq_range": [2.0, 80.0], "freq_res": 1.0, "aperiodic_params_": [-0.24537233753190435, 0.974828284104749], "gaussian_params_": [[9.399478652696809, 1.5600139444203693, 0.9377888864341382], [11.545712940583774, 0.9231872045339707, 0.2934489790930935], [14.070582913355857, 0.23250130396661103, 0.7074137350929135], [18.71768926401348, 0.4236903677700605, 0.6253460487147812], [68.0959308017281, 0.21350581651795902, 5.999999999999999]], "peak_params_": [[9.399478652696809, 1.4247061447638287, 1.8755777728682763], [11.545712940583774, 0.31510636748810394, 0.586897958186187], [14.070582913355857, 0.2313561490723568, 1.414827470185827], [18.71768926401348, 0.3826423064239155, 1.2506920974295623], [68.0959308017281, 0.2134785289011294, 11.999999999999998]], "r_squared_": 0.9658056164369138, "error_": 0.06721383932086557}
{"freq_range": [2.0, 80.0], "freq_res": 1.0, "aperiodic_params_": [-0.17598638588402127, 0.8846236994394433], "gaussian_params_": [[9.38326179530543, 1.3524457272015293, 1.0284975797236502], [13.095454061262997, 0.19518833445124498, 1.2760592888466384], [18.563784127826903, 1.0931505990098584, 0.25451793158432706], [60.45203496564393, 0.16567477772916822, 5.999998530097021], [77.12243618908944, 0.20616527382028638, 5.706168431631616]], "peak_params_": [[9.38326179530543, 1.262861175020576, 2.0569951594473004], [13.095454061262997, 0.1974348179457004, 2.552118577693277], [18.563784127826903, 0.2516719073666809, 0.5090358631686541], [60.45203496564393, 0.16749082035674534, 11.999997060194042], [77.12243618908944, 0.20981200166747827, 11.412336863263231]], "r_squared_": 0.9611241416055136, "error_": 0.06485676930101512}
{"freq_range": [2.0, 80.0], "freq_res": 1.0, "aperiodic_params_": [-0.09631636524838236, 0.8798300610154982], "gaussian_params_": [[9.348919047956914, 1.4060303275377974, 0.8407803780396711], [11.572572553398334, 0.29009469263380644, 0.8652803210961474], [18.87449557708974, 0.25310156504140946, 0.49697589836017464], [60.06963409192645, 0.18013853285442416, 5.39586997421172], [69.03836123547343, 0.11132941746374474, 0.25000516850676663], [76.20313739897621, 0.20592543472467503, 5.999965081832822]], "peak_params_": [[9.348919047956914, 1.293515400268521, 1.6815607560793422], [11.572572553398334, 0.26652703357548657, 1.7305606421922948], [18.87449557708974, 0.2451581654940389, 0.9939517967203493], [60.06963409192645, 0.18549477827417693, 10.79173994842344], [69.03836123547343, 0.2559914018184952, 0.5000103370135333], [76.20313739897621, 0.20811367287794025, 11.999930163665644]], "r_squared_": 0.9837234006782074, "error_": 0.0383399398752095}
