{"freq_range": [2.0, 80.0], "freq_res": 1.0, "aperiodic_params_": [-0.7436162441954561, -0.14190303871424545], "gaussian_params_": [[9.929744486152366, 0.3161412229105053, 0.6106346737089192], [14.000583654688851, 0.15506421807132778, 0.25000000000249933], [19.90829351640773, 0.37216023882753496, 2.3041596390632617], [23.6613805705482, 0.17385049934787086, 0.8578504160053309], [31.54786974276445, 0.08354912810888884, 5.999999006522561], [38.451582762588544, 0.20597412097960394, 1.2566310491857804], [42.96636196180147, 0.1980478750653539, 0.25018453115401357], [52.3968552301085, 0.11114936816440335, 5.999999999999999], [60.808533905229936, 0.14379436567835982, 0.8547060776356818]], "peak_params_": [[9.929744486152366, 0.3142238470777332, 1.2212693474178384], [14.000583654688851, 0.170122838589649, 0.5000000000049987], [19.90829351640773, 0.3849939758205809, 4.608319278126523], [23.6613805705482, 0.2756007504494685, 1.7157008320106617], [31.54786974276445, 0.08365695242922072, 11.999998013045122], [38.451582762588544, 0.24620546274811395, 2.513262098371561], [42.96636196180147, 0.24268170226149133, 0.5003690623080271], [52.3968552301085, 0.11115704162613399, 11.999999999999998], [60.808533905229936, 0.1799933690902491, 1.7094121552713637]], "r_squared_": 0.6301743778808538, "error_": 0.05011696165645383}
{"freq_range": [2.0, 80.0], "freq_res": 1.0, "aperiodic_params_": [-0.2765608260549012, 0.8382479363865304], "gaussian_params_": [[10.162893271260833, 0.6203458411987077, 1.6247856491512533], [13.755718461382244, 0.24123372075650532, 0.6814873227589746], [16.015680339367577, 0.15261564741392222, 0.5613082813103558], [45.59887625040004, 0.21789324615130856, 0.5153104136569558], [52.92814904963095, 0.2224875282303654, 1.0183393596432102], [62.17577386781201, 0.12439585200131657, 2.3673288093777773], [66.92167502486518, 0.1461902607878153, 0.6336359061513996], [70.52513281437356, 0.7296889934810181, 0.25001922022087775], [75.87379276602377, 0.0887597601369607, 4.027231772278945]], "peak_params_": [[10.162893271260833, 0.6172361401926326, 3.2495712983025067], [13.755718461382244, 0.2646207974514979, 1.3629746455179492], [16.015680339367577, 0.1545986599651752, 1.1226165626207116], [45.59887625040004, 0.16094178510704737, 1.0306208273139117], [52.92814904963095, 0.22200242334556886, 2.0366787192864204], [62.17577386781201, 0.12428844974120379, 4.734657618755555], [66.92167502486518, 0.16850767456503912, 1.2672718123027993], [70.52513281437356, 0.16296503014433883, 0.5000384404417555], [75.87379276602377, 0.08871619029955036, 8.05446354455789]], "r_squared_": 0.979604465996111, "error_": 0.03629826046168759}
{"freq_range": [2.0, 80.0], "freq_res": 1.0, "aperiodic_params_": [-0.2747136809730845, 0.32960850517564716], "gaussian_params_": [[9.824710195642048, 0.2327638427067245, 0.8053654494681841], [18.46386206858843, 0.6277675966471645, 0.29376343283830475], [20.768649577059648, 0.15841892451625345, 1.26305196282468], [23.735117699588816, 0.1701511139175986, 1.0104084490289136], [42.272923925179235, 0.1291836348757697, 2.9177963408206327], [45.50003653301018, 0.2709572066104212, 0.32748754358260374], [49.26820906906315, 0.17684287233125565, 0.8094929566897112], [72.85536321758808, 0.1525116280335167, 0.5595656955795001], [77.37551509647133, 0.31577087835260886, 0.29475341118380227]], "peak_params_": [[9.824710195642048, 0.22731530973653186, 1.6107308989363682], [18.46386206858843, 0.19479352935028987, 0.5875268656766095], [20.768649577059648, 0.16014552232224588, 2.52610392564936], [23.735117699588816, 0.1704088264322775, 2.020816898057827], [42.272923925179235, 0.1286197360704443, 5.835592681641265], [45.50003653301018, 0.14167368661682345, 0.6549750871652075], [49.26820906906315, 0.1764542140171823, 1.6189859133794224], [72.85536321758808, 0.14750097350946456, 1.1191313911590002], [77.37551509647133, 0.1402577948470638, 0.5895068223676045]], "r_squared_": 0.7448940828452386, "error_": 0.0496879364514723}
{"freq_range": [2.0, 80.0], "freq_res": 1.0, "aperiodic_params_": [-0.06768923704630547, 0.6430499603042354], "gaussian_params_": [[9.564769285101185, 0.34250686413763004, 1.7180383653723235], [20.346519435728034, 0.14131314978856158, 1.7118372887832778], [55.0606848225359, 0.19196795803408417, 1.4992802122107345], [59.819325154736454, 0.1764920033829844, 0.8282313966558876], [61.54071142845528, 0.47153795424215317, 0.30172354189356426], [70.09073187785337, 0.14906791536461494, 5.999999996243674]], "peak_params_": [[9.564769285101185, 0.3316909464130602, 3.436076730744647], [20.346519435728034, 0.1384473820871338, 3.4236745775665556], [55.0606848225359, 0.1981166604923954, 2.998560424421469], [59.819325154736454, 0.2094285309903856, 1.6564627933117753], [61.54071142845528, 0.2136027682932693, 0.6034470837871285], [70.09073187785337, 0.1490508723407009, 11.999999992487348]], "r_squared_": 0.9101242649970618, "error_": 0.057430697531134674}
{"freq_range": [2.0, 80.0], "freq_res": 1.0, "aperiodic_params_": [0.3200047294103367, 1.0745894989874163], "gaussian_params_": [[7.66877487764837, 0.2476596893885435, 0.8085771699148924], [10.251257790424908, 0.47980351793775783, 0.8022841416498387], [12.709405957107354, 0.16518584473516604, 0.8124755511261184], [16.000095457515286, 0.15708605649847887, 0.25000000000000006], [19.755490774854703, 0.16009267387826265, 0.6708998434618907], [25.37528440134415, 0.37641164304197866, 0.27384783101832544], [38.03932561244563, 0.15253840687139197, 0.8041974449436766], [45.159280375887775, 0.18440193043412492, 0.25658008773880053], [51.059272206376505, 0.11422562182674854, 0.2500249562708954], [59.64008799010626, 0.40303388008489005, 0.2601373764518365], [61.566548717612825, 0.08548084405462018, 5.999999999999999], [67.00559345037037, 0.0755494539533554, 0.2519018045116221]], "peak_params_": [[7.66877487764837, 0.23708780163183352, 1.6171543398297847], [10.251257790424908, 0.4613571609903565, 1.6045682832996775], [12.709405957107354, 0.15630647751877047, 1.6249511022522367], [16.000095457515286, 0.15713136701966024, 0.5000000000000001], [19.755490774854703, 0.14980599332069922, 1.3417996869237814], [25.37528440134415, 0.1471818036390793, 0.5476956620366509], [38.03932561244563, 0.1523943204428, 1.6083948898873532], [45.159280375887775, 0.15397373213960464, 0.5131601754776011], [51.059272206376505, 0.12919061477816363, 0.5000499125417908], [59.64008799010626, 0.23738340653916823, 0.520274752903673], [61.566548717612825, 0.08525807729929635, 11.999999999999998], [67.00559345037037, 0.13225832939357818, 0.5038036090232442]], "r_squared_": 0.9879412753268733, "error_": 0.03132936160785366}
{"freq_range": [2.0, 80.0], "freq_res": 1.0, "aperiodic_params_": [-0.3064295278979618, 0.43880712933265076], "gaussian_params_": [[10.125406579957659, 0.36302608920893986, 1.1669435663494432], [19.782523848844672, 0.2712041322728058, 1.1965814576637293], [22.550210209243794, 0.5958877627477038, 0.2919066012672744], [24.422753824874437, 0.604377630425896, 0.2922098918322109], [36.60986146261495, 0.20068214530626519, 0.8873951879368234], [42.09334833437998, 0.2569521699542023, 1.5724516596090214], [45.52999062259388, 0.7336300355393048, 0.2775252414248047], [48.77781206839365, 0.2352364399408136, 0.890632926324876], [55.07485960821193, 0.13149466275492727, 0.7238906883100512], [59.49622083169506, 0.1612569809653758, 1.1527332282517277], [62.49430981097957, 0.5283793891923443, 0.3075298646148637], [64.3064867958551, 0.22517508290967103, 0.3371327903284379], [66.98659690859395, 0.11684891506740715, 0.25000207405343594]], "peak_params_": [[10.125406579957659, 0.3609358524630115, 2.3338871326988864], [19.782523848844672, 0.2667616720639123, 2.3931629153274585], [22.550210209243794, 0.18910502950134755, 0.5838132025345488], [24.422753824874437, 0.21277463851306377, 0.5844197836644218], [36.60986146261495, 0.18354905581449665, 1.7747903758736467], [42.09334833437998, 0.2564997972616093, 3.144903319218043], [45.52999062259388, 0.18839917109907844, 0.5550504828496095], [48.77781206839365, 0.22804566398159842, 1.781265852649752], [55.07485960821193, 0.13087356925012616, 1.4477813766201024], [59.49622083169506, 0.14698727267202027, 2.3054664565034555], [62.49430981097957, 0.16042954766059714, 0.6150597292297274], [64.3064867958551, 0.14903705090678832, 0.6742655806568758], [66.98659690859395, 0.11668110997640813, 0.5000041481068719]], "r_squared_": 0.9374384089710933, "error_": 0.03500145363182142}
{"freq_range": [2.0, 80.0], "freq_res": 1.0, "aperiodic_params_": [0.05067910765214811, 0.7203261173616029], "gaussian_params_": [[7.533598839751729, 0.7399501135879424, 0.2776628206226965], [9.796465232933434, 0.31534551769889274, 1.3403870745216757], [41.712158485261945, 0.15808809523569534, 1.4372885181463044], [48.522790293450946, 0.11929250885263622, 2.094681336578712], [54.668637925808056, 0.2268646032342291, 0.5937942097364302]], "peak_params_": [[7.533598839751729, 0.3089640038001713, 0.555325641245393], [9.796465232933434, 0.3117308168923945, 2.6807741490433514], [41.712158485261945, 0.15588479639194885, 2.874577036292609], [48.522790293450946, 0.11623699604349502, 4.189362673157424], [54.668637925808056, 0.1951539595634757, 1.1875884194728603]], "r_squared_": 0.9204932697538889, "error_": 0.061632519354567275}
{"freq_range": [2.0, 80.0], "freq_res": 1.0, "aperiodic_params_": [0.22630114122576536, 0.9468500937827711], "gaussian_params_": [[9.842029165165775, 0.34364310044466095, 1.8975216403069732], [21.531240373769243, 0.7299589445343664, 0.2785837178509239], [25.480579530461622, 0.16173868689339754, 1.166357600432456], [53.96898624489057, 0.17535150918111406, 0.5094024763638731], [58.17498144815782, 0.12536465756455717, 1.465853572692498], [66.53658610467355, 0.8650782891033297, 0.271630720420029], [70.26817032119455, 0.12689856114875736, 1.4329105967111535]], "peak_params_": [[9.842029165165775, 0.3424543089066062, 3.7950432806139465], [21.531240373769243, 0.1790927875955829, 0.5571674357018478], [25.480579530461622, 0.1485758776917221, 2.332715200864912], [53.96898624489057, 0.17719790786368628, 1.0188049527277463], [58.17498144815782, 0.12447463351161692, 2.931707145384996], [66.53658610467355, 0.21126625128065557, 0.543261440840058], [70.26817032119455, 0.12469557050908397, 2.865821193422307]], "r_squared_": 0.9775278890301855, "error_": 0.04458144264895658}
{"freq_range": [2.0, 80.0], "freq_res": 1.0, "aperiodic_params_": [0.21504357235291302, 0.9271631348496323], "gaussian_params_": [[9.82750859722199, 0.3490644770400994, 1.9812896423149227], [21.621280118688194, 0.23761177551379822, 0.4744235149501307], [25.535567445059122, 0.1427533243778364, 1.2595960251736118], [53.584951623279636, 0.5309846412332232, 0.26573107424774756], [58.4026497617074, 0.12315323383425988, 1.3084866003532116], [66.8255975055382, 0.2245290169782195, 0.603940682919081], [69.97987118147597, 0.16394982509583056, 0.6158535141697156]], "peak_params_": [[9.82750859722199, 0.34774411825958734, 3.9625792846298453], [21.621280118688194, 0.17555781291361128, 0.9488470299002614], [25.535567445059122, 0.1333720489238106, 2.5191920503472236], [53.584951623279636, 0.1572252671166099, 0.5314621484954951], [58.4026497617074, 0.11745826178824181, 2.6169732007064233], [66.8255975055382, 0.21536105687746, 1.207881365838162], [69.97987118147597, 0.16386250196937469, 1.2317070283394311]], "r_squared_": 0.9791947733833686, "error_": 0.04124484624960708}
{"freq_range": [2.0, 80.0], "freq_res": 1.0, "aperiodic_params_": [0.2198702269411077, 0.9417409508265824], "gaussian_params_": [[9.822844064742885, 0.35158110597883485, 1.9329506480196834], [21.538347589518686, 0.5827349190874789, 0.2853340960816999], [25.370242607682457, 0.14907219321582893, 1.2438243091983225], [53.85797685175384, 0.20767071186236444, 0.5948682562432135], [58.373647879312614, 0.1263813433417093, 1.6415506648922962], [66.59709772280897, 0.356467945217127, 0.3999513559771864], [69.9452209466952, 0.17156766601810375, 0.82541075892147]], "peak_params_": [[9.822844064742885, 0.3501075937806133, 3.865901296039367], [21.538347589518686, 0.16120743108444846, 0.5706681921633998], [25.370242607682457, 0.14261212975397364, 2.487648618396645], [53.85797685175384, 0.20546822939580012, 1.189736512486427], [58.373647879312614, 0.1231494550699459, 3.2831013297845923], [66.59709772280897, 0.21490859625285808, 0.7999027119543728], [69.9452209466952, 0.17119025365401042, 1.65082151784294]], "r_squared_": 0.9758985723556863, "error_": 0.045378608917128735}
{"freq_range": [2.0, 80.0], "freq_res": 1.0, "aperiodic_params_": [0.5274231993675295, 1.2427993099843897], "gaussian_params_": [[9.822431995851211, 0.4242670995750022, 2.305968360999448], [16.159376876887592, 0.20158782424936153, 0.4010862021709131], [59.033788022669874, 0.1253094276766221, 4.229153560636189], [66.54489592681962, 0.6756649229790685, 0.2744344785852529], [70.42730179402191, 0.3465702001297199, 0.27361817005952654], [78.54796540086404, 0.12785269512450934, 5.748976736586711]], "peak_params_": [[9.822431995851211, 0.42301110297928607, 4.611936721998896], [16.159376876887592, 0.19801279893215495, 0.8021724043418262], [59.033788022669874, 0.12569999190890946, 8.458307121272378], [66.54489592681962, 0.20909054830029672, 0.5488689571705058], [70.42730179402191, 0.1490529053548919, 0.5472363401190531], [78.54796540086404, 0.12745989399899438, 11.497953473173421]], "r_squared_": 0.9866196791862321, "error_": 0.04252043724329854}
{"freq_range": [2.0, 80.0], "freq_res": 1.0, "aperiodic_params_": [0.4839456423613365, 1.1977721407343995], "gaussian_params_": [[9.612575899118122, 0.4339941586644229, 2.01578244113105], [13.634718851394755, 0.29338669373699827, 0.31406907687808505], [16.055329920139926, 0.21723822215166447, 0.4422398627769313], [62.54796540086405, 0.09878891463983076, 5.999999999999999], [66.56593962000458, 0.3858909928256586, 0.2652374571520109]], "peak_params_": [[9.612575899118122, 0.4260520576827479, 4.0315648822621], [13.634718851394755, 0.18980667117270122, 0.6281381537561701], [16.055329920139926, 0.21840993352024485, 0.8844797255538626], [62.54796540086405, 0.09850895014571881, 11.999999999999998], [66.56593962000458, 0.17615456702002863, 0.5304749143040218]], "r_squared_": 0.9820017256378416, "error_": 0.04798846849795523}
{"freq_range": [2.0, 80.0], "freq_res": 1.0, "aperiodic_params_": [0.3917686084947162, 1.118013387451563], "gaussian_params_": [[7.953605669057812, 0.34198661582866596, 0.9195010448594269], [10.296262892686904, 0.5192294304769929, 0.6392754362558005], [12.918340457033223, 0.1983654809302282, 1.2521396308949828], [16.379170912806828, 0.6546810934979259, 0.2508019640409659], [25.346037016991165, 0.21186594537568437, 0.3892220089610114], [61.524296327430285, 0.08720814933306574, 5.999999999999999], [63.88038465652432, 0.08399409168064585, 0.2511091598862624], [66.97635566134075, 0.08558436884937991, 0.2500231672504761]], "peak_params_": [[7.953605669057812, 0.34245982861965013, 1.8390020897188537], [10.296262892686904, 0.5082184493168939, 1.278550872511601], [12.918340457033223, 0.19801197201502363, 2.5042792617899656], [16.379170912806828, 0.21838779074453563, 0.5016039280819318], [25.346037016991165, 0.14270087356032235, 0.7784440179220228], [61.524296327430285, 0.08693448684352667, 11.999999999999998], [63.88038465652432, 0.15507697307034207, 0.5022183197725248], [66.97635566134075, 0.14270699046427526, 0.5000463345009521]], "r_squared_": 0.9838404176452973, "error_": 0.04030966425232026}
{"freq_range": [2.0, 80.0], "freq_res": 1.0, "aperiodic_params_": [0.2742652868879608, 0.9652659878656106], "gaussian_params_": [[7.609860534575218, 0.4115277456755264, 0.29549262133308496], [10.171697207820639, 0.4772966719465408, 0.6649825464462151], [13.528190167609404, 0.6223073936356167, 0.29206618338040974], [54.45207610924532, 0.09727690193400848, 5.999999999999999], [60.469832123769024, 0.4969226011467275, 0.2995863614272589], [66.1486363161778, 0.1510429576621298, 0.9236374302221361]], "peak_params_": [[7.609860534575218, 0.1744406016502021, 0.5909852426661699], [10.171697207820639, 0.4616491239290547, 1.3299650928924303], [13.528190167609404, 0.16878773578114648, 0.5841323667608195], [54.45207610924532, 0.09700117187203405, 11.999999999999998], [60.469832123769024, 0.20872374460297594, 0.5991727228545178], [66.1486363161778, 0.16436254550549312, 1.8472748604442721]], "r_squared_": 0.9752761637824, "error_": 0.042343931720011094}
{"freq_range": [2.0, 80.0], "freq_res": 1.0, "aperiodic_params_": [0.08394726798544758, 0.726816178212904], "gaussian_params_": [[7.565363235370135, 1.063586134445546, 0.27922874907394873], [9.975720689735608, 0.39357486081307586, 0.8384036832936201], [19.619199586752565, 0.3080349929231762, 0.6581025393836977], [38.80386633932751, 0.16865547386043162, 3.124504674969612], [59.91994910853538, 0.13364199659858364, 5.999999999999999]], "peak_params_": [[7.565363235370135, 0.3412011798818844, 0.5584574981478975], [9.975720689735608, 0.3934098651075718, 1.6768073665872403], [19.619199586752565, 0.2605526172406677, 1.3162050787673953], [38.80386633932751, 0.1686298031570398, 6.249009349939224], [59.91994910853538, 0.13363010273775844, 11.999999999999998]], "r_squared_": 0.9333154329838266, "error_": 0.05170613969488873}
{"freq_range": [2.0, 80.0], "freq_res": 1.0, "aperiodic_params_": [-0.12885221879588504, 0.5984460197802134], "gaussian_params_": [[4.904069198271887, 0.25261760105094205, 5.999999999999999], [41.20047231045865, 0.17877289961437262, 0.8671329675177145], [47.24636808363147, 0.0912273450088307, 2.2373128618149285], [54.313242488897025, 0.13954471276577993, 1.3345961798827068], [70.45203459913596, 0.1030234781984916, 5.999999999999999]], "peak_params_": [[4.904069198271887, 0.25258531465980605, 11.999999999999998], [41.20047231045865, 0.17591066621700036, 1.734265935035429], [47.24636808363147, 0.0907255449240667, 4.474625723629857], [54.313242488897025, 0.13911213694653113, 2.6691923597654137], [70.45203459913596, 0.10273151309227857, 11.999999999999998]], "r_squared_": 0.9193927048103174, "error_": 0.05496405722486972}
{"freq_range": [2.0, 80.0], "freq_res": 1.0, "aperiodic_params_": [0.40255729019631525, 0.9370495802739556], "gaussian_params_": [[7.4638349538355335, 0.5654503547632355, 0.29658142105221835], [10.192803725174324, 0.3214927713179379, 0.8861010095219966], [22.09872546435275, 0.1410322431822159, 0.6326720291116557], [25.63467617084471, 0.1545819737193427, 1.3500010779498548], [41.60352926233738, 0.3890718605423953, 0.27538654818955544], [44.85082842367838, 0.15896479062394453, 0.6152075338972158], [47.88480361322004, 0.19437508504382034, 0.7119090131092504], [53.936611759439174, 0.15127153343645458, 1.103126168184556], [59.04405915676092, 0.13884216358670737, 1.4099457054658733], [64.78027899262949, 0.09970200389976022, 1.2431989523086073], [70.01713056191153, 0.1457289965803638, 0.6077955099212431], [72.452757122329, 0.27320003404594767, 0.3716435747903954]], "peak_params_": [[7.4638349538355335, 0.16693353913781578, 0.5931628421044367], [10.192803725174324, 0.3139717740195146, 1.772202019043993], [22.09872546435275, 0.14344761990054833, 1.2653440582233113], [25.63467617084471, 0.1490243389928323, 2.7000021558997096], [41.60352926233738, 0.13802546117821124, 0.5507730963791109], [44.85082842367838, 0.15441260942044033, 1.2304150677944317], [47.88480361322004, 0.19184735636027284, 1.4238180262185007], [53.936611759439174, 0.15125287518486563, 2.206252336369112], [59.04405915676092, 0.13878043216044422, 2.8198914109317466], [64.78027899262949, 0.09817545488024626, 2.4863979046172147], [70.01713056191153, 0.1456859424467276, 1.2155910198424862], [72.452757122329, 0.13078932404326027, 0.7432871495807908]], "r_squared_": 0.9731592618387794, "error_": 0.036777219255661894}
{"freq_range": [2.0, 80.0], "freq_res": 1.0, "aperiodic_params_": [0.47511429873318967, 1.1203054633677003], "gaussian_params_": [[7.45964194147512, 0.784034379485008, 0.27976995123574633], [9.96672859626379, 0.4235840245451625, 0.8125064293860518], [12.141456358750563, 0.16558407826152355, 0.969337989038987], [25.403119526993667, 0.24164284255796434, 0.6252598540268367], [45.33045565417792, 0.23785967261105925, 0.2500470334983797], [47.652486036661585, 0.2926025953258271, 0.268148022393807], [53.822498884445054, 0.15845485760527628, 0.6878917725988608], [58.16390047156607, 0.09232312792349179, 1.7570502379392963], [60.384962826109074, 0.24333479259974547, 0.2538610904128569], [63.84272775856069, 0.15794508552992692, 0.6655332971187143], [66.60845939440748, 0.5132234088936711, 0.2521830726293758], [70.40181557707417, 0.32426476309897956, 0.2500026639340658], [74.54796540086404, 0.10561773210431243, 5.999999999999999]], "peak_params_": [[7.45964194147512, 0.20387276677409555, 0.5595399024714927], [9.96672859626379, 0.43765757834474167, 1.6250128587721036], [12.141456358750563, 0.18232675392908082, 1.938675978077974], [25.403119526993667, 0.19629660057637555, 1.2505197080536734], [45.33045565417792, 0.09932603786515459, 0.5000940669967594], [47.652486036661585, 0.12635338956786146, 0.536296044787614], [53.822498884445054, 0.15913566491064568, 1.3757835451977216], [58.16390047156607, 0.09427737487711307, 3.5141004758785925], [60.384962826109074, 0.13613119959847708, 0.5077221808257139], [63.84272775856069, 0.1764906610240493, 1.3310665942374287], [66.60845939440748, 0.2016396044049562, 0.5043661452587516], [70.40181557707417, 0.16836160334757655, 0.5000053278681316], [74.54796540086404, 0.1053184149689268, 11.999999999999998]], "r_squared_": 0.9904784648499082, "error_": 0.029515085027988244}
{"freq_range": [2.0, 80.0], "freq_res": 1.0, "aperiodic_params_": [0.7439170600394678, 1.2910863399224692], "gaussian_params_": [[7.339711823686444, 0.5120318559245697, 0.25002671405901544], [10.667801496586678, 0.34496060475752754, 1.8845788858085861], [15.643830406981353, 0.37558777221455797, 0.250788376085737], [63.898035551649556, 0.19065238717674912, 0.4660370507325492], [66.53681566950713, 0.15904329199847558, 0.8414263395223245], [69.62218196772908, 0.1592753698308194, 0.6366263095203953], [78.2291088300208, 0.13713390578436802, 5.999999999999999]], "peak_params_": [[7.339711823686444, 0.255347821224953, 0.5000534281180309], [10.667801496586678, 0.3396427436111061, 3.7691577716171722], [15.643830406981353, 0.14330486156513522, 0.501576752171474], [63.898035551649556, 0.19607200470749375, 0.9320741014650984], [66.53681566950713, 0.16051563582883288, 1.682852679044649], [69.62218196772908, 0.18713068777956843, 1.2732526190407907], [78.2291088300208, 0.13703396616181962, 11.999999999999998]], "r_squared_": 0.9894621875712196, "error_": 0.03894469304435537}
{"freq_range": [2.0, 80.0], "freq_res": 1.0, "aperiodic_params_": [0.5520363937237158, 1.2376479970746692], "gaussian_params_": [[9.907775520475283, 0.4723242525002725, 1.9804869999488837], [13.639285216404643, 0.20633608581173393, 0.33600836560059094], [15.589449864869087, 0.3547445952063173, 0.3154909375647849], [25.486001257485018, 0.6495358174467321, 0.2920270302965702], [53.52865176195375, 0.5203885676315385, 0.30368324098077903], [59.84355816896378, 0.1267601770051442, 1.4164900278771784], [63.62897160863155, 0.3245471078481369, 0.3426553539134626], [66.54048743982325, 0.20818293549004907, 0.7732859492762704], [69.85515333551982, 0.13486097303948444, 0.7243764259499123], [71.77812488145636, 0.18588485296714227, 0.25001849509415963], [79.99956956035274, 0.1876873718393572, 5.10393181923407]], "peak_params_": [[9.907775520475283, 0.47181242540916896, 3.9609739998977673], [13.639285216404643, 0.1718287378165374, 0.6720167312011819], [15.589449864869087, 0.1562882586376506, 0.6309818751295698], [25.486001257485018, 0.16262076456009522, 0.5840540605931404], [53.52865176195375, 0.1560579699091289, 0.6073664819615581], [59.84355816896378, 0.12607638894374174, 2.8329800557543567], [63.62897160863155, 0.184618239109277, 0.6853107078269252], [66.54048743982325, 0.18187084151696342, 1.5465718985525407], [69.85515333551982, 0.159738947956235, 1.4487528518998245], [71.77812488145636, 0.18201873150089853, 0.5000369901883193], [79.99956956035274, 0.18768737117190537, 10.20786363846814]], "r_squared_": 0.991116473446008, "error_": 0.03010156010969631}
{"freq_range": [2.0, 80.0], "freq_res": 1.0, "aperiodic_params_": [2.4534246614564936, 2.070504240904495], "gaussian_params_": [[11.257185844110618, 0.08653480236339717, 2.791329933192439], [53.02571205700665, 0.12580480837531416, 0.2500000021971988], [58.68441659381332, 0.11494969619725538, 1.0719789768830643], [62.48053111129361, 0.45989881689547724, 0.285614271642964], [68.7041148510931, 0.07307105711725176, 2.601000756725338], [72.65788899062844, 0.2511242042719165, 0.2577906366442734], [75.48798419664575, 0.5608439260994302, 0.2846274451219775]], "peak_params_": [[11.257185844110618, 0.0861682709526374, 5.582659866384878], [53.02571205700665, 0.1251412893519046, 0.5000000043943976], [58.68441659381332, 0.11014424575489268, 2.1439579537661286], [62.48053111129361, 0.11528502888257863, 0.571228543285928], [68.7041148510931, 0.07259977985478971, 5.202001513450676], [72.65788899062844, 0.12278219865845275, 0.5155812732885467], [75.48798419664575, 0.13289480794335295, 0.569254890243955]], "r_squared_": 0.9969099010046487, "error_": 0.027795230724672413}
{"freq_range": [2.0, 80.0], "freq_res": 1.0, "aperiodic_params_": [1.5855183791172034, 1.7313361071594473], "gaussian_params_": [[5.452034599135944, 0.10698593434934332, 5.999994891289023], [10.338392401490614, 0.23717818760723455, 0.5376312236126225], [22.637479372273564, 0.36471161694172194, 0.25645025349745737], [37.55827826722628, 0.19169941590672385, 0.5325348760194437], [53.601799710951326, 0.4580651819640874, 0.27657988809012723], [56.23014320959108, 0.1351769850182245, 1.0067831127860782], [60.45943377697442, 0.743743572056983, 0.28322850235361474], [63.897411743940395, 0.2440270854355153, 0.515387370420348], [66.88518936579914, 0.1740320196181041, 0.9068178045010201], [71.14351893291773, 0.15500384729040778, 1.39712008687467], [73.94495888092295, 0.16863218106264796, 0.250000000002542], [76.59010867459374, 0.639569988482236, 0.30268560064503475], [79.26012849958336, 0.19245559281034288, 1.078409699121411]], "peak_params_": [[5.452034599135944, 0.1066827392587813, 11.999989782578046], [10.338392401490614, 0.2748299966224969, 1.075262447225245], [22.637479372273564, 0.13577013960718942, 0.5129005069949147], [37.55827826722628, 0.13589990715551847, 1.0650697520388874], [53.601799710951326, 0.1741130507365356, 0.5531597761802545], [56.23014320959108, 0.1316909148174381, 2.0135662255721565], [60.45943377697442, 0.1996673395975488, 0.5664570047072295], [63.897411743940395, 0.24034334189299078, 1.030774740840696], [66.88518936579914, 0.1745498770537266, 1.8136356090020402], [71.14351893291773, 0.15419405244904993, 2.79424017374934], [73.94495888092295, 0.1837658534492781, 0.500000000005084], [76.59010867459374, 0.27710103660261565, 0.6053712012900695], [79.26012849958336, 0.18693729438961038, 2.156819398242822]], "r_squared_": 0.9954661376612968, "error_": 0.0302184371101837}
{"freq_range": [2.0, 80.0], "freq_res": 1.0, "aperiodic_params_": [0.3923485081066428, 1.0498680447591102], "gaussian_params_": [[8.356887017645645, 0.753631676542126, 0.2606763506874329], [10.115434272069285, 0.45929738824730726, 0.7534172046037991], [13.396477180212957, 0.1498019872811732, 1.7221008508957034], [37.848962781552956, 0.15962230051075205, 0.6713869275123596], [40.74157726416836, 0.16046062667640285, 0.6156512543634008], [58.65509261668478, 0.11367652836406268, 5.999999999999999], [66.5480871933803, 0.4182048741743183, 0.28785347571530767]], "peak_params_": [[8.356887017645645, 0.30523821605747203, 0.5213527013748658], [10.115434272069285, 0.4753586577272786, 1.5068344092075983], [13.396477180212957, 0.14618531400669188, 3.444201701791407], [37.848962781552956, 0.1559453774674433, 1.3427738550247192], [40.74157726416836, 0.1484299588986029, 1.2313025087268017], [58.65509261668478, 0.1134888628129167, 11.999999999999998], [66.5480871933803, 0.1651646956430488, 0.5757069514306153]], "r_squared_": 0.9784679109362816, "error_": 0.04533501749943686}
{"freq_range": [2.0, 80.0], "freq_res": 1.0, "aperiodic_params_": [-0.055637763707737424, 0.6317773800845333], "gaussian_params_": [[7.549628258614356, 1.3444627397925089, 0.2765981783341838], [9.909959398026906, 0.39302037976651855, 1.2694268867752019], [38.46704786648137, 0.32539887044861077, 0.30397365077835964], [43.54796540086367, 0.10619125515125523, 5.999999999999999], [60.43943778672828, 0.15991587342239333, 0.8868897365994128], [64.87875120120975, 0.12104103658634613, 2.019881054801591], [72.19932110406273, 0.19740649462940002, 0.25015553922140854]], "peak_params_": [[7.549628258614356, 0.48386594584802173, 0.5531963566683676], [9.909959398026906, 0.3920329806293775, 2.5388537735504038], [38.46704786648137, 0.16920178543991793, 0.6079473015567193], [43.54796540086367, 0.1058903126706543, 11.999999999999998], [60.43943778672828, 0.15046509012507636, 1.7737794731988257], [64.87875120120975, 0.12100139224017048, 4.039762109603182], [72.19932110406273, 0.14395794646511173, 0.5003110784428171]], "r_squared_": 0.9362524934091646, "error_": 0.050628497670242446}
{"freq_range": [2.0, 80.0], "freq_res": 1.0, "aperiodic_params_": [0.026412254490126234, 0.7259937901324333], "gaussian_params_": [[10.188963862363908, 0.3115490545846777, 1.23504256820227], [14.547965400864001, 0.0656418919064979, 2.109574176542835], [41.109025477017774, 0.14305631210759617, 0.7574794695161164], [45.83118641786815, 0.1748487029136501, 0.6358931286102638], [54.4234854310984, 0.13630415069748528, 1.0704588250895062], [62.53097446070593, 0.07704118931980385, 2.8950118568969496], [75.11565786323807, 0.1302164878966137, 5.999999999999999]], "peak_params_": [[10.188963862363908, 0.3143495449472678, 2.47008513640454], [14.547965400864001, 0.06431000615121119, 4.21914835308567], [41.109025477017774, 0.14158216673264867, 1.5149589390322329], [45.83118641786815, 0.16879561418495403, 1.2717862572205276], [54.4234854310984, 0.12731325026291773, 2.1409176501790124], [62.53097446070593, 0.09298997225384054, 5.790023713793899], [75.11565786323807, 0.13019951606117974, 11.999999999999998]], "r_squared_": 0.9282809365554914, "error_": 0.04942873291495378}
{"freq_range": [2.0, 80.0], "freq_res": 1.0, "aperiodic_params_": [0.4005429052951544, 0.9794132072589508], "gaussian_params_": [[10.391791005192003, 0.4110311292647976, 0.7940005951760464], [17.82632485339479, 0.23769038098760928, 1.0043734808492957], [22.216377042550384, 0.20851764739966444, 0.8770086883106286], [26.33305692902352, 0.1337114520444445, 1.3518180615102129], [41.54277134611678, 0.5641781090659438, 0.26964672087513514], [46.98477016175604, 0.10107241618364111, 1.4929647463895632], [53.336182412917566, 0.2129418038519255, 0.6279571768782252], [58.776778361211626, 0.14597751428904218, 1.3211055847292468], [63.65580326761851, 0.1907349758307212, 0.4711218875454302], [70.00003619469075, 0.04278366374262995, 0.2502288050627271], [74.54796540086404, 0.12164927676456977, 5.8143859748882125]], "peak_params_": [[10.391791005192003, 0.3639177345619763, 1.5880011903520928], [17.82632485339479, 0.23416522602873857, 2.0087469616985913], [22.216377042550384, 0.2030946229804823, 1.7540173766212572], [26.33305692902352, 0.12973311031001478, 2.7036361230204258], [41.54277134611678, 0.13437050716453536, 0.5392934417502703], [46.98477016175604, 0.10106878170327827, 2.9859294927791264], [53.336182412917566, 0.18467913249936196, 1.2559143537564503], [58.776778361211626, 0.14731564880900305, 2.6422111694584935], [63.65580326761851, 0.16958489829582368, 0.9422437750908604], [70.00003619469075, 0.1323724414495766, 0.5004576101254542], [74.54796540086404, 0.12128219813329966, 11.628771949776425]], "r_squared_": 0.9795783232097696, "error_": 0.03757568005817083}
{"freq_range": [2.0, 80.0], "freq_res": 1.0, "aperiodic_params_": [0.5240058439278655, 1.1676176166645578], "gaussian_params_": [[7.447547449906429, 0.6933586654331572, 0.29276366540210885], [10.074698277435441, 0.38749558650598265, 0.7585156747900157], [11.962979402452557, 0.2414903301650384, 1.644387697477325], [17.700836520765698, 0.2583725537474399, 1.5166179530976316], [22.558859246447174, 0.18066127062069987, 0.6029077091431331], [26.3863720596682, 0.1623972928889737, 1.4748320735624483], [53.64450112885486, 0.1806304134489859, 0.8551888390533109], [59.21991962985784, 0.11778077161123404, 1.710179248847699], [64.05241875971176, 0.18625108432029194, 0.659158370246715], [72.23470259928078, 0.11997016044954008, 4.2583155010722615], [79.51770923580243, 0.21059055476064378, 0.9327957498685546]], "peak_params_": [[7.447547449906429, 0.2181723102366611, 0.5855273308042177], [10.074698277435441, 0.5040510592861441, 1.5170313495800314], [11.962979402452557, 0.2571114350654998, 3.28877539495465], [17.700836520765698, 0.2536803050310462, 3.033235906195263], [22.558859246447174, 0.15044460516071756, 1.2058154182862661], [26.3863720596682, 0.15691910266457187, 2.9496641471248966], [53.64450112885486, 0.16680838723101088, 1.7103776781066218], [59.21991962985784, 0.11776934821559748, 3.420358497695398], [64.05241875971176, 0.2065267368846997, 1.31831674049343], [72.23470259928078, 0.11978807569386807, 8.516631002144523], [79.51770923580243, 0.2069920749396008, 1.8655914997371092]], "r_squared_": 0.9874574926854656, "error_": 0.0381149713195104}
{"freq_range": [2.0, 80.0], "freq_res": 1.0, "aperiodic_params_": [0.9587951542180048, 1.4077170105078973], "gaussian_params_": [[6.907135590690559, 0.17171488386088024, 0.6916149911358888], [10.73432293858101, 0.32932555549586867, 1.2680019663005506], [16.084127530691713, 0.1386553528384691, 0.2507841902986684], [54.24673813229997, 0.13697314216969556, 1.3422976046699049], [58.34318235635123, 0.16727416908772577, 0.4196765927126255], [59.77758272985043, 0.229143298746311, 0.2500088807741032], [63.59159117812625, 0.43780929721860196, 0.2838406691593015], [67.50378015881857, 0.14338024929574236, 3.310548590110195], [78.54796540086404, 0.17376005766862213, 4.062733870931627]], "peak_params_": [[6.907135590690559, 0.17448161146668714, 1.3832299822717775], [10.73432293858101, 0.32217556050108465, 2.5360039326011012], [16.084127530691713, 0.13112846998468775, 0.5015683805973368], [54.24673813229997, 0.1347134470972069, 2.6845952093398098], [58.34318235635123, 0.124811722762312, 0.839353185425251], [59.77758272985043, 0.16533213519569512, 0.5000177615482064], [63.59159117812625, 0.23767494516367993, 0.567681338318603], [67.50378015881857, 0.14775224452058144, 6.62109718022039], [78.54796540086404, 0.17303291764035622, 8.125467741863254]], "r_squared_": 0.9905995330985542, "error_": 0.038418238114225095}
{"freq_range": [2.0, 80.0], "freq_res": 1.0, "aperiodic_params_": [0.45643413218188755, 1.1903165208567545], "gaussian_params_": [[10.112592292528866, 0.4716951685566668, 2.2876738927950155], [16.327953841683165, 0.10890997403967362, 5.235458875762192], [53.45859062633995, 0.9657075806452344, 0.2500000695531522], [66.54796540081868, 0.13596462185296251, 5.999999999999999]], "peak_params_": [[10.112592292528866, 0.5235856010801433, 4.575347785590031], [16.327953841683165, 0.1258945071265588, 10.470917751524384], [53.45859062633995, 0.19016789400228173, 0.5000001391063044], [66.54796540081868, 0.13557930264259777, 11.999999999999998]], "r_squared_": 0.9789240505965925, "error_": 0.05693395520852586}
{"freq_range": [2.0, 80.0], "freq_res": 1.0, "aperiodic_params_": [0.4685275490719663, 1.1559782664720308], "gaussian_params_": [[10.248696591529347, 0.5777850763334327, 2.081208775853173], [13.650292851745636, 0.389844442071762, 0.2500194185330643], [17.68301284006024, 0.5542675456431506, 2.687691256707118], [25.511787676223225, 0.7235468599104599, 0.27927410686123555], [28.358200253421337, 0.40437397497018046, 0.2553217944932435], [53.36002718689226, 0.39254487003547506, 0.27544343145093647], [60.175796233891674, 0.18583889283380295, 0.5386609883049142]], "peak_params_": [[10.248696591529347, 0.5829918741987454, 4.162417551706346], [13.650292851745636, 0.47716325890769845, 0.5000388370661286], [17.68301284006024, 0.5509878933557486, 5.375382513414236], [25.511787676223225, 0.16160292661014952, 0.5585482137224711], [28.358200253421337, 0.1514927618989308, 0.510643588986487], [53.36002718689226, 0.1670710218979774, 0.5508868629018729], [60.175796233891674, 0.1762010041858122, 1.0773219766098283]], "r_squared_": 0.9907256248050139, "error_": 0.0411636687687956}
{"freq_range": [2.0, 80.0], "freq_res": 1.0, "aperiodic_params_": [0.5052103900778415, 1.170531709552469], "gaussian_params_": [[10.201718732740504, 0.5037048137588231, 1.8760008109561523], [14.214986628434323, 0.27209568339544443, 0.7572091643094659], [16.44585127203808, 0.5378485656463927, 0.3280918118756874], [18.90019582601825, 0.2661573147705641, 0.7673565150888358], [25.48412936527122, 0.7684405058977815, 0.27463446052581925], [53.46612622378718, 0.799149580021344, 0.2676632769269364], [63.61225822577474, 0.6083773612408777, 0.2500074923643607]], "peak_params_": [[10.201718732740504, 0.500801391419494, 3.7520016219123047], [14.214986628434323, 0.3262144320210083, 1.5144183286189319], [16.44585127203808, 0.2349886675498596, 0.6561836237513748], [18.90019582601825, 0.26392405515539563, 1.5347130301776717], [25.48412936527122, 0.16248849986665137, 0.5492689210516385], [53.46612622378718, 0.1754226131912222, 0.5353265538538728], [63.61225822577474, 0.18274979370546163, 0.5000149847287214]], "r_squared_": 0.9875266108632847, "error_": 0.043001833962886774}
{"freq_range": [2.0, 80.0], "freq_res": 1.0, "aperiodic_params_": [0.4500986844376475, 1.0579740312252637], "gaussian_params_": [[7.649859294399241, 0.44140820031760225, 0.307990434256667], [10.015527090455697, 0.4739805977478522, 0.743026309311722], [11.839779126331877, 0.2917701348516704, 0.7157576837654896], [13.601532575562139, 0.3770245250322119, 0.33264232779743746], [16.160416478242848, 0.18290943650653774, 1.0641782913578157], [18.908260823295038, 0.20974085968021777, 0.8957296314385932], [54.534431161061306, 0.1231311012992716, 1.4634974382485195], [60.21491015890379, 0.17775264150792908, 0.6015105947892673], [63.49903307329242, 0.15392166519351125, 1.0006518637075255], [66.74193931946654, 0.14798170206774613, 0.7228619070424908]], "peak_params_": [[7.649859294399241, 0.2432742596180001, 0.615980868513334], [10.015527090455697, 0.48460134085494183, 1.486052618623444], [11.839779126331877, 0.29803325147413023, 1.4315153675309793], [13.601532575562139, 0.2103493303271633, 0.6652846555948749], [16.160416478242848, 0.18192094888962362, 2.1283565827156314], [18.908260823295038, 0.21384540609091018, 1.7914592628771864], [54.534431161061306, 0.11705562627130184, 2.926994876497039], [60.21491015890379, 0.16721772080377817, 1.2030211895785345], [63.49903307329242, 0.1359272209630522, 2.001303727415051], [66.74193931946654, 0.13918414683219904, 1.4457238140849815]], "r_squared_": 0.9818521451638115, "error_": 0.04073459885170843}
{"freq_range": [2.0, 80.0], "freq_res": 1.0, "aperiodic_params_": [-0.2689190501316453, 0.3286422858089481], "gaussian_params_": [[2.4520345991359433, 2.2952220962806336, 0.25787680847613126], [8.363433174855075, 0.5173367799210425, 0.29374428358754967], [9.930065463237122, 0.3147320220841322, 1.2028988787357964], [23.346914638201987, 0.21235681390249864, 0.9680572231055647], [38.38345690352462, 0.27154461309883565, 0.2738537908934427], [43.54796531201237, 0.11346626734920243, 5.999991535669817], [53.42170354400506, 0.5330492502408621, 0.28163269892421866]], "peak_params_": [[2.4520345991359433, 0.4938539226936003, 0.5157536169522625], [8.363433174855075, 0.32751847426147795, 0.5874885671750993], [9.930065463237122, 0.3142006763375591, 2.4057977574715927], [23.346914638201987, 0.1994717917929879, 1.9361144462111295], [38.38345690352462, 0.1758772083299538, 0.5477075817868854], [43.54796531201237, 0.11314470669410381, 11.999983071339633], [53.42170354400506, 0.20655109378804748, 0.5632653978484373]], "r_squared_": 0.9086570005615785, "error_": 0.04070579540277369}
{"freq_range": [2.0, 80.0], "freq_res": 1.0, "aperiodic_params_": [0.063710224092633, 0.7604535671170912], "gaussian_params_": [[10.21079477819759, 0.2687661836246422, 0.65160195746907], [11.541808964626806, 0.1952344292529625, 1.1879877617179015], [17.242444514957995, 0.15488731227275362, 0.7230686790533136], [45.537795377970525, 0.5798823124206482, 0.32279844526366813], [48.502098082170036, 0.15713863881507584, 1.2268688467554856], [54.789088813487446, 0.10601921446608518, 1.1916047516673016], [60.91168907465142, 0.14413416030488038, 0.8149413547388116], [64.27947350490895, 0.22498302830885072, 0.25153904166346674], [65.50227480159485, 0.3562787442884461, 0.30742347684437865], [73.54796537046606, 0.1317582717372052, 5.999999556236793], [73.5564038854163, 0.41499412038411376, 0.27514766273462266]], "peak_params_": [[10.21079477819759, 0.3391649496128219, 1.30320391493814], [11.541808964626806, 0.18743679379656086, 2.375975523435803], [17.242444514957995, 0.14642593609340881, 1.4461373581066272], [45.537795377970525, 0.22767672922153415, 0.6455968905273363], [48.502098082170036, 0.1447481653031233, 2.453737693510971], [54.789088813487446, 0.10547987436261508, 2.3832095033346032], [60.91168907465142, 0.15808333374595418, 1.6298827094776231], [64.27947350490895, 0.15862143391480443, 0.5030780833269335], [65.50227480159485, 0.15579365028547598, 0.6148469536887573], [73.54796537046606, 0.24452782101079507, 11.999999112473587], [73.5564038854163, 0.24452782101079507, 0.5502953254692453]], "r_squared_": 0.9320619751879043, "error_": 0.04874279041869162}
{"freq_range": [2.0, 80.0], "freq_res": 1.0, "aperiodic_params_": [0.7328959809453606, 1.2514150862359128], "gaussian_params_": [[7.087806525021295, 0.1693068141180149, 0.44068495281206277], [10.291121557910975, 0.4198224653408654, 0.9606634424867563], [12.56353500872546, 0.1976589139443257, 0.884566665383059], [17.995399855345195, 0.29975713232919354, 1.9245851992640146], [53.47579782688313, 0.862668287176824, 0.26408249487639496], [75.17272604191528, 0.16281217287306227, 5.999999999999999]], "peak_params_": [[7.087806525021295, 0.16716625798036905, 0.8813699056241255], [10.291121557910975, 0.4040006142172379, 1.9213268849735126], [12.56353500872546, 0.19320722236585097, 1.769133330766118], [17.995399855345195, 0.2997562773064163, 3.8491703985280292], [53.47579782688313, 0.17037491400073135, 0.5281649897527899], [75.17272604191528, 0.16274472316985245, 11.999999999999998]], "r_squared_": 0.9834659693111724, "error_": 0.04743592449588335}
{"freq_range": [2.0, 80.0], "freq_res": 1.0, "aperiodic_params_": [0.6524739584658209, 1.2318601160124758], "gaussian_params_": [[7.415836009809938, 0.7914466847966224, 0.30226994156603154], [10.212001950288599, 0.5256530079437309, 0.9001701331867903], [12.576809833593833, 0.18934439709019135, 0.9708308410876222], [18.119321808990545, 0.4543772490658165, 2.6444403982804467], [53.46305740621991, 0.5456109870274878, 0.2966679574256619], [59.113866532172494, 0.11432797399970346, 1.9417395111959954], [64.10088746614193, 0.2333107718389097, 0.5897045381051342]], "peak_params_": [[7.415836009809938, 0.308191912508038, 0.6045398831320631], [10.212001950288599, 0.5209432294043701, 1.8003402663735806], [12.576809833593833, 0.24628903249171208, 1.9416616821752444], [18.119321808990545, 0.45391496614324006, 5.2888807965608935], [53.46305740621991, 0.1621843478668077, 0.5933359148513238], [59.113866532172494, 0.11413156587350315, 3.883479022391991], [64.10088746614193, 0.23474242536663947, 1.1794090762102685]], "r_squared_": 0.9873017745695823, "error_": 0.047302060424944885}
{"freq_range": [2.0, 80.0], "freq_res": 1.0, "aperiodic_params_": [0.6662083964933363, 1.2854944637342234], "gaussian_params_": [[7.481784915466201, 1.6643388183751306, 0.2520986168101324], [9.812206157644418, 0.5812352462632986, 0.6227022050013892], [11.459107742950605, 1.1511061008733279, 0.3207918940378387], [13.58671773328069, 0.34885508838108625, 0.7406406078844945], [17.75329093796882, 0.31507904317028246, 1.6800099544662805], [21.668840638367275, 0.17445961602531768, 0.5295846186187808], [53.48186251957057, 0.9624673547169331, 0.2564850698802809], [63.939918276503974, 0.1549832779391331, 0.6560969124384031], [66.59728150656261, 0.3420271731275398, 0.2501062713864932], [69.64278868020463, 0.11299244706361321, 0.25002801717288015], [75.54796540086404, 0.12388855221901604, 5.999999999999999]], "peak_params_": [[7.481784915466201, 0.2680351419092385, 0.5041972336202648], [9.812206157644418, 0.5554429364626855, 1.2454044100027784], [11.459107742950605, 0.508501893952115, 0.6415837880756774], [13.58671773328069, 0.3245379651823451, 1.481281215768989], [17.75329093796882, 0.31169998341921046, 3.360019908932561], [21.668840638367275, 0.1563874934558921, 1.0591692372375616], [53.48186251957057, 0.16490316863886534, 0.5129701397605618], [63.939918276503974, 0.17377266043896777, 1.3121938248768061], [66.59728150656261, 0.13846175288736506, 0.5002125427729864], [69.64278868020463, 0.1215137085142397, 0.5000560343457603], [75.54796540086404, 0.12353745618790035, 11.999999999999998]], "r_squared_": 0.992478773391232, "error_": 0.03309159812140159}
{"freq_range": [2.0, 80.0], "freq_res": 1.0, "aperiodic_params_": [0.49428833731846467, 1.202784041395945], "gaussian_params_": [[7.461511984796535, 1.0824257793931824, 0.28597660369849043], [10.47098533956214, 0.6854988210658037, 1.3666127984329128], [13.93140056225906, 0.37211586761535626, 0.8735878089606758], [16.00527454210924, 0.24278180528426976, 0.2500011997197777], [18.6793010336508, 0.2489299678684372, 1.2263850580332267], [60.46647865681506, 0.5528310098196018, 0.2881807737870826], [79.28645495794505, 0.15064048647791392, 5.999999999999999]], "peak_params_": [[7.461511984796535, 0.32159100682957686, 0.5719532073969809], [10.47098533956214, 0.6459890132678857, 2.7332255968658257], [13.93140056225906, 0.3955764104271793, 1.7471756179213516], [16.00527454210924, 0.28835666954027717, 0.5000023994395554], [18.6793010336508, 0.24056268953585958, 2.4527701160664535], [60.46647865681506, 0.15000995534535, 0.5763615475741652], [79.28645495794505, 0.15046890340296604, 11.999999999999998]], "r_squared_": 0.9906191618761151, "error_": 0.03731948057060302}
{"freq_range": [2.0, 80.0], "freq_res": 1.0, "aperiodic_params_": [0.4540648967902007, 1.165826041258135], "gaussian_params_": [[10.404172739782815, 0.6264777898014164, 2.020472868502272], [13.61453552536132, 0.6814201540514457, 0.30805278789006907], [15.531407052751778, 0.8544523560263121, 0.30480197711026075], [18.438263371033297, 0.35232789665537717, 1.5162560394380238], [63.96608381488713, 0.1871749076583911, 0.8366259874927631]], "peak_params_": [[10.404172739782815, 0.6140680129608905, 4.040945737004544], [13.61453552536132, 0.44490056765135017, 0.6161055757801381], [15.531407052751778, 0.3723238666666582, 0.6096039542205215], [18.438263371033297, 0.33844771841617494, 3.0325120788760476], [63.96608381488713, 0.1870211663744803, 1.6732519749855261]], "r_squared_": 0.9831678640273435, "error_": 0.054523732143346854}
{"freq_range": [2.0, 80.0], "freq_res": 1.0, "aperiodic_params_": [0.5860954479697147, 1.2374002939629387], "gaussian_params_": [[10.42662207069095, 0.48126688116980354, 2.569731505613311], [15.639509503082087, 0.3981587259037656, 0.2504962734854674], [18.917799649647918, 0.14925007000835522, 0.7162204458604677], [25.435986794455513, 0.6410439146467816, 0.2662625833739339], [53.474561260297534, 0.8022860661493616, 0.2641866715796036], [63.75687709764892, 0.18718607881206092, 0.2500549876913889], [74.54796540085559, 0.10804731500902107, 5.999999999999985]], "peak_params_": [[10.42662207069095, 0.4746800269960122, 5.139463011226622], [15.639509503082087, 0.18720901151559877, 0.5009925469709348], [18.917799649647918, 0.1501125985162568, 1.4324408917209355], [25.435986794455513, 0.16775540171381975, 0.5325251667478678], [53.474561260297534, 0.15999921442604292, 0.5283733431592073], [63.75687709764892, 0.13972221394987372, 0.5001099753827778], [74.54796540085559, 0.1077411125165848, 11.99999999999997]], "r_squared_": 0.988414561404316, "error_": 0.04195932373679117}
{"freq_range": [2.0, 80.0], "freq_res": 1.0, "aperiodic_params_": [0.5343678844558412, 1.1529415835299068], "gaussian_params_": [[10.208505062114208, 0.5010633103898547, 1.8965817424333422], [13.562005126387662, 0.7234491172101944, 0.2998034573694171], [16.4335708700818, 0.5355560887582934, 0.2844989581932104], [17.95299442838494, 0.5163491030096021, 2.475011160200934], [53.300397465354465, 0.18702447964111507, 0.46593449958548494], [64.18235776351139, 0.17995541399721562, 0.49664870780996295], [79.49307407902374, 0.29527923199309486, 0.5605047053592435]], "peak_params_": [[10.208505062114208, 0.5010011857236125, 3.7931634848666844], [13.562005126387662, 0.4609997344549768, 0.5996069147388342], [16.4335708700818, 0.5506225130349928, 0.5689979163864208], [17.95299442838494, 0.5163645387286029, 4.950022320401868], [53.300397465354465, 0.1519280926759332, 0.9318689991709699], [64.18235776351139, 0.16822456907843297, 0.9932974156199259], [79.49307407902374, 0.20053492295630182, 1.121009410718487]], "r_squared_": 0.9891166265459187, "error_": 0.042814007618921845}
{"freq_range": [2.0, 80.0], "freq_res": 1.0, "aperiodic_params_": [0.03410561662075192, 0.7127998234841041], "gaussian_params_": [[9.919352524649597, 0.30488264792196484, 1.6465444745174018], [15.752213518321822, 0.17301483299137072, 3.5620834310948317], [40.57512675608086, 0.5806302400600127, 0.2602708030730376], [53.43083132046964, 0.6502937331361286, 0.2534617632719694], [59.420351888502665, 0.08509812033648174, 5.999999999989541], [72.17836764152727, 0.23133961950331772, 0.2503582472099601]], "peak_params_": [[9.919352524649597, 0.35148742145652995, 3.2930889490348036], [15.752213518321822, 0.1729299069939172, 7.124166862189663], [40.57512675608086, 0.15395813877377618, 0.5205416061460753], [53.43083132046964, 0.2013637720348196, 0.5069235265439388], [59.420351888502665, 0.0848895364846265, 11.999999999979082], [72.17836764152727, 0.18893465931911635, 0.5007164944199202]], "r_squared_": 0.9476317436222919, "error_": 0.05054979156104558}
{"freq_range": [2.0, 80.0], "freq_res": 1.0, "aperiodic_params_": [0.32589716008241304, 1.005264701798504], "gaussian_params_": [[11.04698783397959, 0.47810415707951676, 1.9106436261142603], [15.873310795542869, 0.17387816758580368, 0.7561274890038343], [18.363151595619893, 0.49515871859321037, 0.2634754764916903], [45.11298822120594, 0.16324899037373902, 0.9485839168473708], [48.72332007012877, 0.14777344437065623, 0.5775253001494308], [53.4558311906129, 0.6251691771152316, 0.25000989465820567], [56.21819028516871, 0.1961363023979949, 0.43530827157447316], [60.470982840151855, 0.8204028248249794, 0.27456543714884857], [63.5522232717183, 0.7150215917818435, 0.2621773934507627], [74.12296766710006, 0.13598818497639362, 5.999999999999999]], "peak_params_": [[11.04698783397959, 0.47795960051001707, 3.8212872522285206], [15.873310795542869, 0.18806034331087806, 1.5122549780076686], [18.363151595619893, 0.1954890969495351, 0.5269509529833806], [45.11298822120594, 0.16209605836506946, 1.8971678336947415], [48.72332007012877, 0.13181019012740292, 1.1550506002988616], [53.4558311906129, 0.11889352258560404, 0.5000197893164113], [56.21819028516871, 0.17440329620209138, 0.8706165431489463], [60.470982840151855, 0.19691375863899352, 0.5491308742976971], [63.5522232717183, 0.1990687621531304, 0.5243547869015254], [74.12296766710006, 0.1359596284785114, 11.999999999999998]], "r_squared_": 0.9797335419997664, "error_": 0.039419813120905}
{"freq_range": [2.0, 80.0], "freq_res": 1.0, "aperiodic_params_": [0.7323022159717839, 1.3011871505199186], "gaussian_params_": [[10.60665723028877, 0.48460848467936507, 1.9022085464933876], [15.32933424351655, 0.18804467177597708, 1.426142491867066], [17.926327066521868, 0.32859122611918934, 0.668869476038953], [19.5837468618028, 0.45780790438034885, 0.27417669498199493], [22.85722249497022, 0.1984271224321152, 0.7663669732973574], [53.44296647619667, 0.6459715582136112, 0.25034573773673235], [56.50134929950204, 0.13172402132894045, 1.614348364544166], [60.53687906008972, 0.8189318481782163, 0.2564922862021869], [64.37091350696703, 0.1066124574729404, 1.7878100540361295], [70.36133467284213, 0.20997857883166235, 0.26005686225096886], [71.71604578988226, 0.06114807271404182, 0.2502599460248554], [76.54796540086404, 0.149995144789505, 5.999999999999999]], "peak_params_": [[10.60665723028877, 0.47623345132555167, 3.804417092986775], [15.32933424351655, 0.21677663629115318, 2.852284983734132], [17.926327066521868, 0.3594242269652764, 1.337738952077906], [19.5837468618028, 0.14836597632631332, 0.5483533899639899], [22.85722249497022, 0.195013295866155, 1.5327339465947147], [53.44296647619667, 0.14761249587060798, 0.5006914754734647], [56.50134929950204, 0.12635260630597456, 3.228696729088332], [60.53687906008972, 0.18639827166392053, 0.5129845724043738], [64.37091350696703, 0.12118557471610769, 3.575620108072259], [70.36133467284213, 0.1634166026131625, 0.5201137245019377], [71.71604578988226, 0.14467753101472103, 0.5005198920497108], [76.54796540086404, 0.14957006354603175, 11.999999999999998]], "r_squared_": 0.9925524746013379, "error_": 0.03056000985691058}
{"freq_range": [2.0, 80.0], "freq_res": 1.0, "aperiodic_params_": [0.636775694376815, 1.2498978106740535], "gaussian_params_": [[7.376443839792717, 0.47903585177535324, 0.276634341807514], [10.592582070577986, 0.5950482367433246, 1.2116530698974002], [13.48432433643339, 0.5119480490167178, 0.347965035632959], [17.922572922883816, 0.35080074046962056, 2.763936338340824], [53.95160532427357, 0.20460566500709176, 0.9212908912360739]], "peak_params_": [[7.376443839792717, 0.1972639733754083, 0.553268683615028], [10.592582070577986, 0.5775786612924675, 2.4233061397948004], [13.48432433643339, 0.34882015186897186, 0.695930071265918], [17.922572922883816, 0.35066312711543746, 5.527872676681648], [53.95160532427357, 0.2043235736907254, 1.8425817824721478]], "r_squared_": 0.983315290369227, "error_": 0.0529716604688307}
{"freq_range": [2.0, 80.0], "freq_res": 1.0, "aperiodic_params_": [0.5137012476949167, 1.222760037263346], "gaussian_params_": [[7.461111409632507, 1.2918596970373761, 0.2613194396351951], [10.536831987456, 0.7100378901938573, 1.4057860822246195], [13.530536894272062, 1.1574527364863603, 0.27172302092889433], [17.30287573481025, 0.29048286062802725, 2.724831511288457], [53.48857764116511, 1.062795726536908, 0.2566878106359082], [66.54796540086404, 0.11167502982434015, 5.999999999999999]], "peak_params_": [[7.461111409632507, 0.30253596452694886, 0.5226388792703902], [10.536831987456, 0.6925377618583873, 2.811572164449239], [13.530536894272062, 0.4336938014774937, 0.5434460418577887], [17.30287573481025, 0.2887121590642677, 5.449663022576914], [53.48857764116511, 0.18240480391265113, 0.5133756212718164], [66.54796540086404, 0.11135854650894284, 11.999999999999998]], "r_squared_": 0.9868887691377125, "error_": 0.043148205528599326}
{"freq_range": [2.0, 80.0], "freq_res": 1.0, "aperiodic_params_": [0.6088909464690042, 1.2603567763359884], "gaussian_params_": [[7.493702300562, 1.3120119168911748, 0.2500939105990172], [10.3926831839384, 0.5298706383363379, 1.1071878661415946], [15.130308759634936, 0.4069284266920663, 3.7582810382101313], [18.54351816545106, 0.70506296243167, 0.25012616837743623], [53.480008101665526, 0.9540851163680035, 0.2523997307987059], [64.01876347321628, 0.14874054237598094, 0.507521308884235], [74.54796540084865, 0.1056477409781606, 5.9999999992138875]], "peak_params_": [[7.493702300562, 0.23099603691029863, 0.5001878211980344], [10.3926831839384, 0.6578526988348055, 2.214375732283189], [15.130308759634936, 0.40677594429970665, 7.5165620764202625], [18.54351816545106, 0.3728482544262829, 0.5002523367548725], [53.480008101665526, 0.156560519464505, 0.5047994615974118], [64.01876347321628, 0.17116871626262609, 1.01504261776847], [74.54796540084865, 0.10534833879852723, 11.999999998427775]], "r_squared_": 0.9904818244890208, "error_": 0.04289428903051085}
{"freq_range": [2.0, 80.0], "freq_res": 1.0, "aperiodic_params_": [0.650146746796933, 1.2469930861931229], "gaussian_params_": [[10.527729831966179, 0.5410663408319132, 2.1385821352195418], [13.564887731021658, 0.8248487162845946, 0.26649460671900155], [17.301997132775043, 0.4761336369387613, 2.0470042428380073], [22.260259462825566, 0.09186308179434051, 2.472783750964428], [25.364455673793913, 0.2960794604395277, 0.2528116835309796], [53.381185131959974, 0.20899343209013477, 0.5314299392718901], [65.00752037018862, 0.09923702823118251, 1.2653858951819932], [70.27817721365726, 0.3231891745291212, 0.25667817563478124]], "peak_params_": [[10.527729831966179, 0.53220041699524, 4.2771642704390835], [13.564887731021658, 0.4923126768416985, 0.5329892134380031], [17.301997132775043, 0.4860915185841686, 4.094008485676015], [22.260259462825566, 0.1255497217893793, 4.945567501928856], [25.364455673793913, 0.15487260621380028, 0.5056233670619592], [53.381185131959974, 0.16158900238998175, 1.0628598785437802], [65.00752037018862, 0.09923527567326307, 2.5307717903639864], [70.27817721365726, 0.1796843133324444, 0.5133563512695625]], "r_squared_": 0.989625134647938, "error_": 0.042542573092346915}
{"freq_range": [2.0, 80.0], "freq_res": 1.0, "aperiodic_params_": [0.537328745066199, 1.178655016870899], "gaussian_params_": [[10.39959983620261, 0.5116690130504293, 1.7732665778275734], [12.518678336143992, 0.58351227392817, 0.28749539228065113], [14.15056966396814, 0.32344891337239084, 0.5568677005213303], [16.452285382737436, 0.9253084912507309, 0.2925286858728874], [18.525038886581367, 0.40801420809435623, 2.2179295653753224], [69.45203461233302, 0.08610266092385822, 5.999999999999999], [79.410536745869, 0.2240720954615738, 0.6569032790548976]], "peak_params_": [[10.39959983620261, 0.49909365368609204, 3.5465331556551467], [12.518678336143992, 0.3748705945739012, 0.5749907845613023], [14.15056966396814, 0.4278857644376381, 1.1137354010426606], [16.452285382737436, 0.49823625558926193, 0.5850573717457748], [18.525038886581367, 0.3987691649421281, 4.435859130750645], [69.45203461233302, 0.0858586488360582, 11.999999999999998], [79.410536745869, 0.20859489323074598, 1.3138065581097953]], "r_squared_": 0.9888225774415303, "error_": 0.04198781491570348}
{"freq_range": [2.0, 80.0], "freq_res": 1.0, "aperiodic_params_": [0.4136770886290455, 1.0514660030063023], "gaussian_params_": [[7.490751966427483, 1.3055806196811253, 0.25222377314805217], [9.849318790877609, 0.3425000663413305, 0.7417719066542882], [12.879910325644637, 0.37530539965356546, 1.7874314318580389], [16.520492790904303, 0.8436538498091565, 0.27114417878694774], [18.862507016281864, 0.1404383495503108, 1.763762809583005], [47.59163300517353, 0.18352161826625157, 0.8192376001084879], [60.61196079055842, 0.24811611281725773, 0.6312136074447078], [64.02756536787687, 0.16598085251705638, 0.7092627279064105], [74.54796540086404, 0.14586546163095546, 5.999999999999999]], "peak_params_": [[7.490751966427483, 0.1985612584251888, 0.5044475462961043], [9.849318790877609, 0.43799548911086916, 1.4835438133085763], [12.879910325644637, 0.375061021232668, 3.5748628637160778], [16.520492790904303, 0.283381259009017, 0.5422883575738955], [18.862507016281864, 0.1410805069297627, 3.52752561916601], [47.59163300517353, 0.1620890335688172, 1.6384752002169758], [60.61196079055842, 0.21681159515708237, 1.2624272148894156], [64.02756536787687, 0.19696205930934552, 1.418525455812821], [74.54796540086404, 0.1454520837704656, 11.999999999999998]], "r_squared_": 0.9796230122318988, "error_": 0.04221882002740646}
{"freq_range": [2.0, 80.0], "freq_res": 1.0, "aperiodic_params_": [0.35398669871341715, 1.0316564143025193], "gaussian_params_": [[9.818638998921834, 0.4622285462639257, 1.2498336118366726], [12.308754523484058, 0.38708862470682354, 2.2524573178588354], [16.127299032763112, 0.24374076596457156, 0.2501790002825314], [66.54796540032041, 0.1491336379831808, 5.999999999999999]], "peak_params_": [[9.818638998921834, 0.6863019353687807, 2.4996672236733453], [12.308754523484058, 0.48425376617000554, 4.504914635717671], [16.127299032763112, 0.3152233738729576, 0.5003580005650629], [66.54796540032041, 0.14871099821873424, 11.999999999999998]], "r_squared_": 0.9643460199312508, "error_": 0.06593909725409229}
{"freq_range": [2.0, 80.0], "freq_res": 1.0, "aperiodic_params_": [0.34531056848257435, 1.1736550140103723], "gaussian_params_": [[10.42580414893617, 0.7806747410138994, 1.721474457605117], [12.78172090116739, 0.2022976949009326, 0.6622359112230813], [15.319398370837607, 0.29779814366621205, 1.5197069058853507], [17.863427354841537, 0.25023452462237816, 0.4277416570271437], [19.59606304235512, 0.3915187760477573, 0.30346678535600907], [22.293330200566963, 0.14462979586453145, 1.229065698596259], [56.500241894365466, 0.1200307689548087, 2.130020253147868], [60.511884065142475, 0.4530770884633175, 0.3091126542258263], [63.896652196888496, 0.22979447415521287, 0.7670641413629739], [72.87242151025868, 0.17541361925448398, 3.4628539864692915], [78.99006887592513, 0.22780150330345897, 0.7155751674092743]], "peak_params_": [[10.42580414893617, 0.7578355959712301, 3.442948915210234], [12.78172090116739, 0.5397445384650357, 1.3244718224461627], [15.319398370837607, 0.31490679967466173, 3.0394138117707015], [17.863427354841537, 0.30102263990053646, 0.8554833140542873], [19.59606304235512, 0.18940363762300572, 0.6069335707120181], [22.293330200566963, 0.14058785375240168, 2.458131397192518], [56.500241894365466, 0.11677682173136872, 4.260040506295736], [60.511884065142475, 0.14379415035176657, 0.6182253084516526], [63.896652196888496, 0.23454711068053147, 1.5341282827259477], [72.87242151025868, 0.17529461225498966, 6.925707972938583], [78.99006887592513, 0.264434636374403, 1.4311503348185486]], "r_squared_": 0.9898932815856216, "error_": 0.03634767081966153}
{"freq_range": [2.0, 80.0], "freq_res": 1.0, "aperiodic_params_": [0.764546949951321, 1.350738932643747], "gaussian_params_": [[7.481278093207165, 0.6906201349032793, 0.29425537195558327], [10.326565937112179, 0.6027766569711009, 0.8820067207979502], [12.648944967140965, 0.329737578324036, 1.0085970195384268], [16.27816816603949, 0.18990965410688082, 3.4334872731439163], [54.00565543750956, 0.15088160498032632, 1.2827833032398335], [60.04925478560638, 0.16233649655523702, 0.7349404093101072], [64.46624303440107, 0.587887774246782, 0.2827224443197018], [69.59282902783536, 0.13734081616696536, 0.882557429381417], [75.33144389616605, 0.1350372926103117, 2.6581203433568756], [79.45966759853351, 0.6849093350448727, 0.28240002677028464]], "peak_params_": [[7.481278093207165, 0.18669940478110167, 0.5885107439111665], [10.326565937112179, 0.6090118178281432, 1.7640134415959003], [12.648944967140965, 0.43684720563277324, 2.0171940390768537], [16.27816816603949, 0.19060900048702467, 6.866974546287833], [54.00565543750956, 0.15088013865610805, 2.565566606479667], [60.04925478560638, 0.1619750805477076, 1.4698808186202144], [64.46624303440107, 0.15093370772743642, 0.5654448886394036], [69.59282902783536, 0.14154256162575818, 1.765114858762834], [75.33144389616605, 0.13399159262572025, 5.316240686713751], [79.45966759853351, 0.23419978504898742, 0.5648000535405693]], "r_squared_": 0.9931979810320104, "error_": 0.030515737831693035}
{"freq_range": [2.0, 80.0], "freq_res": 1.0, "aperiodic_params_": [0.48875310975867153, 1.2043532012757885], "gaussian_params_": [[10.422754202621274, 0.6136185407863809, 1.8443301172287052], [15.988103955350509, 0.2682466024540113, 4.178447162768838], [53.46756705011217, 0.9325720760288235, 0.26610471462853225], [63.9596789045961, 0.18191160025341804, 0.5330013749344812], [79.20150267341927, 0.1921698398388754, 0.7755152189086301]], "peak_params_": [[10.422754202621274, 0.6937737214959985, 3.6886602344574104], [15.988103955350509, 0.274586914068946, 8.356894325537676], [53.46756705011217, 0.19919472096930968, 0.5322094292570645], [63.9596789045961, 0.18139182309801338, 1.0660027498689624], [79.20150267341927, 0.18579121874880933, 1.5510304378172601]], "r_squared_": 0.9870939379424631, "error_": 0.049729674727952485}
{"freq_range": [2.0, 80.0], "freq_res": 1.0, "aperiodic_params_": [0.6421796338772728, 1.283141750108899], "gaussian_params_": [[10.78661991176367, 0.5734723552455612, 1.9656470480320045], [16.302438720874687, 0.3059936383431257, 0.2503809373597737], [17.58994483491149, 0.2663751701096319, 3.614409434927921], [53.20860697993077, 0.21501889877249286, 0.5706312406244983], [55.440733937883515, 0.3733330681369879, 0.3243996611281103], [60.19763246959026, 0.137275582574731, 0.987962786482178], [65.50853815171344, 0.13454347219471488, 1.588656311793356], [72.26253205268371, 0.15469671662570833, 1.844093849685897], [75.20881571952555, 0.22120075583280785, 0.2577436342762545], [76.65987150108313, 0.20330742229990695, 0.5241965300439064], [79.46781674066506, 0.29866527036741125, 0.4703233398298652]], "peak_params_": [[10.78661991176367, 0.620645081057254, 3.931294096064009], [16.302438720874687, 0.40636296846837683, 0.5007618747195474], [17.58994483491149, 0.2653491101905926, 7.228818869855842], [53.20860697993077, 0.20112052780518486, 1.1412624812489967], [55.440733937883515, 0.1499047246393932, 0.6487993222562206], [60.19763246959026, 0.134885943441037, 1.975925572964356], [65.50853815171344, 0.12874142329183424, 3.177312623586712], [72.26253205268371, 0.15316884220087212, 3.688187699371794], [75.20881571952555, 0.21206837749284424, 0.515487268552509], [76.65987150108313, 0.17042093802012537, 1.0483930600878129], [79.46781674066506, 0.18232003823867116, 0.9406466796597304]], "r_squared_": 0.9925243045371572, "error_": 0.03330090935518681}
{"freq_range": [2.0, 80.0], "freq_res": 1.0, "aperiodic_params_": [0.465796345754486, 1.1623049762539244], "gaussian_params_": [[10.256363591755193, 0.5509641839392581, 1.760300113867017], [12.460119447622105, 0.6180462856238054, 0.29476691191614757], [13.940424411499528, 0.3561293360890444, 0.7161743689064239], [16.727164001214952, 0.21876000717767174, 0.9342342415355337], [19.865371613518146, 0.17644401865458165, 1.9717328695520875], [53.93837097960534, 0.12143251266155278, 2.6804942926967823], [60.49923819515391, 0.532971387728398, 0.32066104286792607], [70.13036991398548, 0.1251568592973081, 4.612638246127186], [75.56043991425332, 0.6600149848530048, 0.2800132561864223], [79.3399565653558, 0.20225324014716312, 0.8771976167732838]], "peak_params_": [[10.256363591755193, 0.5451528421653292, 3.520600227734034], [12.460119447622105, 0.529247424203971, 0.5895338238322951], [13.940424411499528, 0.417512062568157, 1.4323487378128479], [16.727164001214952, 0.2714035488385118, 1.8684684830710674], [19.865371613518146, 0.17650648076476827, 3.943465739104175], [53.93837097960534, 0.1216770948483703, 5.360988585393565], [60.49923819515391, 0.179255403196511, 0.6413220857358521], [70.13036991398548, 0.12510688150800875, 9.225276492254372], [75.56043991425332, 0.24835178437169048, 0.5600265123728446], [79.3399565653558, 0.207324531068797, 1.7543952335465676]], "r_squared_": 0.9873405621164005, "error_": 0.038000035799297845}
{"freq_range": [2.0, 80.0], "freq_res": 1.0, "aperiodic_params_": [0.46435463470522165, 1.1154708019528239], "gaussian_params_": [[10.309029245793594, 0.6327242089593557, 1.390207838688306], [13.584244277600057, 0.2805386896471172, 1.3671253438546263], [18.31775548545558, 0.06513861348089948, 2.5106471658034564], [58.45203669207866, 0.1146436672055285, 5.999999950647701], [63.91515785156012, 0.09244180523119103, 0.25310642453320426], [70.77984119466628, 0.13807754666965735, 1.2193969193205934], [77.54796540084739, 0.17953897001177335, 3.740140812567254]], "peak_params_": [[10.309029245793594, 0.626577448141073, 2.780415677376612], [13.584244277600057, 0.3013521889708475, 2.7342506877092525], [18.31775548545558, 0.06614170972738553, 5.021294331606913], [58.45203669207866, 0.11431897796126056, 11.999999901295402], [63.91515785156012, 0.16240916921020032, 0.5062128490664085], [70.77984119466628, 0.1874953082961086, 2.4387938386411867], [77.54796540084739, 0.17880058191583292, 7.480281625134508]], "r_squared_": 0.9810502786401867, "error_": 0.04344589327336883}
{"freq_range": [2.0, 80.0], "freq_res": 1.0, "aperiodic_params_": [0.46091957174233444, 1.221519839262165], "gaussian_params_": [[10.746279053656888, 0.7951989914754115, 1.9544151608291156], [16.680623201109494, 0.1806506104183415, 4.4112467816299255], [72.33645521485091, 0.15322880814062345, 5.9999999998311475], [79.13704468740222, 0.14491480416022495, 0.9969393556712249]], "peak_params_": [[10.746279053656888, 0.8673650009297145, 3.908830321658231], [16.680623201109494, 0.18493305878260702, 8.822493563259851], [72.33645521485091, 0.15298808320025215, 11.999999999662295], [79.13704468740222, 0.2262525992043125, 1.9938787113424499]], "r_squared_": 0.9848811239469497, "error_": 0.049913891089122184}
{"freq_range": [2.0, 80.0], "freq_res": 1.0, "aperiodic_params_": [0.40166850295356876, 1.2079238312839844], "gaussian_params_": [[10.85943763250659, 0.8356448627532673, 2.110043724183587], [17.906785404095764, 0.18030407891775757, 4.578576107538243], [60.523846065163546, 0.8538752710117791, 0.2670885543890805], [73.59540617392008, 0.14342307403008722, 5.999999999999468]], "peak_params_": [[10.85943763250659, 0.8915851735288741, 4.220087448367174], [17.906785404095764, 0.1829909740447495, 9.157152215076486], [60.523846065163546, 0.19011983243386132, 0.534177108778161], [73.59540617392008, 0.1430973637772921, 11.999999999998936]], "r_squared_": 0.9846748043768734, "error_": 0.05201461654469534}
{"freq_range": [2.0, 80.0], "freq_res": 1.0, "aperiodic_params_": [0.45383535849272055, 1.2167961557343971], "gaussian_params_": [[10.434768525149106, 0.85592284361479, 1.7340740726935846], [12.238275725711096, 0.1208188025621154, 0.6166969455642465], [14.412220310695307, 0.501477353948385, 0.41210889398850614], [15.678063723280308, 0.4132232273172789, 0.25001171770450475], [19.478251165373003, 0.22239422008157853, 3.395844272128116], [53.85413461347674, 0.11410861170903713, 1.2415053351987955], [60.574253046897795, 0.5107517960622997, 0.25813675731007646], [64.26719737047131, 0.1920958418633007, 0.43283984420784727], [75.51723540776071, 0.1314041679390572, 5.745147202933912]], "peak_params_": [[10.434768525149106, 0.8341290546631607, 3.468148145387169], [12.238275725711096, 0.7013378633086111, 1.233393891128493], [14.412220310695307, 0.4700590990668308, 0.8242177879770123], [15.678063723280308, 0.3172342992527326, 0.5000234354090095], [19.478251165373003, 0.22020391644762327, 6.791688544256232], [53.85413461347674, 0.11344194870672619, 2.483010670397591], [60.574253046897795, 0.13647226453223604, 0.5162735146201529], [64.26719737047131, 0.17638750742672604, 0.8656796884156945], [75.51723540776071, 0.13094106106619696, 11.490294405867823]], "r_squared_": 0.9902066592208443, "error_": 0.03904362945179962}
{"freq_range": [2.0, 80.0], "freq_res": 1.0, "aperiodic_params_": [-0.9166011138273983, 0.8815004027920426], "gaussian_params_": [[10.340008563132091, 0.4305696130624503, 1.4030634277342542], [13.543633910116757, 0.6314380029153738, 0.2667422071463617], [18.10397477700059, 0.15285979181103618, 2.0930947028628646], [56.37462415531176, 0.15451668113979375, 1.7556731727050658], [60.52123151409453, 0.21958278107381193, 0.6332640780021896], [64.31493656099127, 0.21586631980585305, 0.9730242583392972]], "peak_params_": [[10.340008563132091, 0.4181957034639341, 2.8061268554685084], [13.543633910116757, 0.1828172824302623, 0.5334844142927234], [18.10397477700059, 0.15267145332776266, 4.186189405725729], [56.37462415531176, 0.15103879364105577, 3.5113463454101317], [60.52123151409453, 0.17045620129922856, 1.2665281560043793], [64.31493656099127, 0.20486262923571807, 1.9460485166785944]], "r_squared_": 0.9529807223171092, "error_": 0.05809233836638084}
{"freq_range": [2.0, 80.0], "freq_res": 1.0, "aperiodic_params_": [-0.5662594921143042, 0.6005081458866418], "gaussian_params_": [[2.0000000000000004, 0.37671464971255547, 1.8435424276752486], [6.652634357017558, 0.532902811514887, 0.26368675174274003], [9.611577460493614, 0.3833833362895006, 1.5085365815217746], [48.06333990172817, 0.15334533712109846, 0.25002198856648233], [51.80754149276428, 0.15241178025888089, 1.5916201021365226], [64.0388961350831, 0.08925258852406343, 0.25001181452100757], [68.54796540086404, 0.10142638470297456, 5.999999999999999]], "peak_params_": [[2.0000000000000004, 0.37671578558248764, 3.687084855350497], [6.652634357017558, 0.3189678071808353, 0.5273735034854801], [9.611577460493614, 0.37091367179617585, 3.0170731630435492], [48.06333990172817, 0.1575067246127806, 0.5000439771329647], [51.80754149276428, 0.15356317795592833, 3.183240204273045], [64.0388961350831, 0.16427951245855432, 0.5000236290420151], [68.54796540086404, 0.10113894570653947, 11.999999999999998]], "r_squared_": 0.9576964385173802, "error_": 0.04737576879264321}
{"freq_range": [2.0, 80.0], "freq_res": 1.0, "aperiodic_params_": [-0.4995741767213412, 0.7265824826816241], "gaussian_params_": [[9.883318073980309, 0.5027910699883519, 1.6264559557406582], [13.514133864617259, 1.2015473349689072, 0.2500000369866187], [50.452034599168044, 0.10025309879334746, 4.74461187160999], [61.51215544727928, 0.4685982024545897, 0.2501090530078835], [66.54796540044603, 0.1319961278878094, 5.999999946689912]], "peak_params_": [[9.883318073980309, 0.5014988946258373, 3.2529119114813163], [13.514133864617259, 0.20221757039069832, 0.5000000739732374], [50.452034599168044, 0.10274235791698305, 9.48922374321998], [61.51215544727928, 0.17415003651837258, 0.500218106015767], [66.54796540044603, 0.13185095712081263, 11.999999893379824]], "r_squared_": 0.942165960652241, "error_": 0.05537094465398866}
{"freq_range": [2.0, 80.0], "freq_res": 1.0, "aperiodic_params_": [-0.4437933234548422, 0.7226005453177784], "gaussian_params_": [[2.0000000000000004, 0.27126767416316555, 1.6754380752510967], [9.817254973512078, 0.4307283021895428, 1.922664859363427], [45.46019978104872, 0.1899693285779719, 0.8463741410313935], [51.87266137460094, 0.14908633614814504, 1.4209606733218578], [57.20166593253939, 0.16973227845780933, 0.8626690924294587], [59.21872292280342, 0.19044893545523817, 0.25005997643429934], [61.26513117406787, 0.15519782263989568, 0.437978163519612], [63.52394391997292, 0.7758829688701746, 0.26358248218430536], [65.78149470404271, 0.15146955634443862, 0.5069331829079045], [74.2315308345694, 0.12608336410014762, 5.999999998999262]], "peak_params_": [[2.0000000000000004, 0.27137847008084354, 3.3508761505021933], [9.817254973512078, 0.42879011062433503, 3.845329718726854], [45.46019978104872, 0.1638668073959404, 1.692748282062787], [51.87266137460094, 0.14862056326671902, 2.8419213466437157], [57.20166593253939, 0.16741921302200535, 1.7253381848589173], [59.21872292280342, 0.1542635129087917, 0.5001199528685987], [61.26513117406787, 0.140307604584182, 0.875956327039224], [63.52394391997292, 0.1816410070831045, 0.5271649643686107], [65.78149470404271, 0.18723083941683516, 1.013866365815809], [74.2315308345694, 0.12598952554712683, 11.999999997998524]], "r_squared_": 0.973476726310251, "error_": 0.03697005413579058}
