{"freq_range": [2.0, 80.0], "freq_res": 1.0, "aperiodic_params_": [-0.7502270766048907, -0.3354047461096207], "gaussian_params_": [[14.117247224863236, 0.18827949483923356, 0.7591486162214719], [17.490754602288927, 0.8090764016066924, 0.27052926777847436], [23.194910663048407, 0.609612153333826, 4.918072611099621], [36.80340968664837, 0.3559651946738345, 5.999999999999997], [45.45769508133931, 0.7308780755932041, 0.26123373690686535], [51.268540651854096, 0.266042666680024, 5.999999999999999]], "peak_params_": [[14.117247224863236, 0.2924823117664594, 1.5182972324429438], [17.490754602288927, 0.43352487674334905, 0.5410585355569487], [23.194910663048407, 0.6343800369370598, 9.836145222199242], [36.80340968664837, 0.38337086719748165, 11.999999999999995], [45.45769508133931, 0.4516860590762192, 0.5224674738137307], [51.268540651854096, 0.28743976181061726, 11.999999999999998]], "r_squared_": 0.8725853211696569, "error_": 0.06644297518578574}
{"freq_range": [2.0, 80.0], "freq_res": 1.0, "aperiodic_params_": [-0.6151581530869308, 0.002543381906271125], "gaussian_params_": [[10.493273503009641, 0.2823393126997222, 1.3540433548218371], [17.769597134782742, 0.34523335569437463, 2.1861122881603734], [24.420580770176734, 0.28670148161016945, 3.3573305829878857], [37.04897824549187, 0.2511745783740309, 5.999999999999999], [47.6376140083772, 0.2549593580952309, 0.3139596543717454], [54.19311858555108, 0.13304863425999972, 5.999999999999999]], "peak_params_": [[10.493273503009641, 0.2648744962526515, 2.7080867096436743], [17.769597134782742, 0.39100071055732855, 4.372224576320747], [24.420580770176734, 0.31400775156405036, 6.714661165975771], [37.04897824549187, 0.25361526715085564, 11.999999999999998], [47.6376140083772, 0.25656139300564135, 0.6279193087434908], [54.19311858555108, 0.13762270696573942, 11.999999999999998]], "r_squared_": 0.6977499724760227, "error_": 0.05269652394136543}
{"freq_range": [2.0, 80.0], "freq_res": 1.0, "aperiodic_params_": [-0.6802889577743972, -0.021755746844664876], "gaussian_params_": [[24.06450701271383, 0.49910371869474046, 5.9999999999999964], [38.44074762373248, 0.2893090699150144, 3.8870251386303565], [45.41043383997931, 0.6099627783098152, 0.27637008066259633], [51.03187798942655, 0.26627338722175137, 5.999999999999976]], "peak_params_": [[24.06450701271383, 0.4993765484144781, 11.999999999999993], [38.44074762373248, 0.3462650569787638, 7.774050277260713], [45.41043383997931, 0.4339272866648509, 0.5527401613251927], [51.03187798942655, 0.2678551485170108, 11.999999999999952]], "r_squared_": 0.7971843356246597, "error_": 0.06470973797205053}
{"freq_range": [2.0, 80.0], "freq_res": 1.0, "aperiodic_params_": [-0.5814347339911694, -0.012324807908935087], "gaussian_params_": [[9.32568155477711, 0.48832148093676464, 0.4881835398655922], [11.504694825599543, 0.8070194575338396, 0.29282853075174325], [16.66256784026077, 0.17857070171799885, 2.713443621340658], [21.16181068813078, 0.12749828230706237, 0.7731048352673257], [23.24272027103452, 0.16464665623722494, 1.1246128029571605], [25.976074369762635, 0.18190690507350918, 0.5598519403432438], [38.77221475039203, 0.16407377218086813, 2.883500242599656], [42.54978735667347, 0.36329730355795853, 0.263659225290598], [45.46783721245535, 0.4666575580001888, 0.27011596795745324], [52.008734636832784, 0.10333764472502797, 5.999999999999999], [61.548092350779356, 0.5316604162491322, 0.2690952082174499]], "peak_params_": [[9.32568155477711, 0.39420914126849216, 0.9763670797311844], [11.504694825599543, 0.23382940305906913, 0.5856570615034865], [16.66256784026077, 0.17719538986865135, 5.426887242681316], [21.16181068813078, 0.19704637655459756, 1.5462096705346513], [23.24272027103452, 0.18008266369242287, 2.249225605914321], [25.976074369762635, 0.19038937599743766, 1.1197038806864876], [38.77221475039203, 0.173414133868248, 5.767000485199312], [42.54978735667347, 0.17403144174663276, 0.527318450581196], [45.46783721245535, 0.1722975617132832, 0.5402319359149065], [52.008734636832784, 0.103341954281228, 11.999999999999998], [61.548092350779356, 0.15561519708747423, 0.5381904164348998]], "r_squared_": 0.5013706513782978, "error_": 0.046816063839983484}
{"freq_range": [2.0, 80.0], "freq_res": 1.0, "aperiodic_params_": [-0.35305702738340433, 0.387674882692027], "gaussian_params_": [[9.320449819048681, 0.6122006497152532, 0.6220796740474531], [11.493738871395506, 0.47354854669654106, 1.0556835038376926], [14.480013515840259, 0.6321064975635249, 0.2991693175308286], [17.721880234391573, 0.22809721933578456, 2.2139548461506062], [49.9444371807762, 0.16965085996558735, 1.5000048485362827], [60.470832125295075, 0.09568696167919831, 5.024215469014026]], "peak_params_": [[9.320449819048681, 0.5653162116358376, 1.2441593480949062], [11.493738871395506, 0.442756535890024, 2.111367007675385], [14.480013515840259, 0.2582890608533809, 0.5983386350616572], [17.721880234391573, 0.2263045371721718, 4.4279096923012125], [49.9444371807762, 0.18044147881578176, 3.0000096970725654], [60.470832125295075, 0.09526771922826882, 10.048430938028051]], "r_squared_": 0.921825257136533, "error_": 0.04493837333028239}
{"freq_range": [2.0, 80.0], "freq_res": 1.0, "aperiodic_params_": [-0.44448419641559356, 0.0869937472401891], "gaussian_params_": [[9.466003424767983, 0.9282207682065959, 0.2692828689200468], [21.931090262213974, 0.40868372484151533, 5.428004782852173], [36.74149651895089, 0.322717914799312, 5.999999999999999], [51.45203459913595, 0.23457816016187233, 5.721217338123219], [60.44744696869982, 0.30322591345233896, 0.2547023023707518]], "peak_params_": [[9.466003424767983, 0.23159929536250012, 0.5385657378400937], [21.931090262213974, 0.42442831753402477, 10.856009565704346], [36.74149651895089, 0.3407387332848416, 11.999999999999998], [51.45203459913595, 0.2530126108899538, 11.442434676246439], [60.44744696869982, 0.1418164971830207, 0.5094046047415036]], "r_squared_": 0.7609456611607708, "error_": 0.06559580463290948}
{"freq_range": [2.0, 80.0], "freq_res": 1.0, "aperiodic_params_": [-0.7132652664093582, 0.04949504737666795], "gaussian_params_": [[8.573334312857394, 1.2729498405565867, 0.26093306585878623], [11.552148095815864, 0.8287150423821945, 0.2991320698594512], [13.493591882087143, 0.7861279951805006, 0.2713170350375434], [22.509717460746547, 0.29487277662653943, 4.493627168491029], [35.445519162100815, 0.6362788714805904, 0.2603711058880898], [38.35889898118253, 0.2826704521768314, 1.208569149618216], [40.44893011673906, 0.8303871334158537, 0.28238701741787275], [44.67243828981545, 0.19094288118912367, 1.5445146708921353], [49.98546655760516, 0.19118300498696814, 1.276043538332871], [53.66921379529349, 0.158654460170797, 1.1580781199078558], [57.98671214858713, 0.17388959904681103, 0.7002270033690822]], "peak_params_": [[8.573334312857394, 0.3375765617749322, 0.5218661317175725], [11.552148095815864, 0.2893229585542021, 0.5982641397189024], [13.493591882087143, 0.18166986554813158, 0.5426340700750868], [22.509717460746547, 0.29312288308991763, 8.987254336982058], [35.445519162100815, 0.1593259430780013, 0.5207422117761796], [38.35889898118253, 0.2712692834911987, 2.417138299236432], [40.44893011673906, 0.3492268057634868, 0.5647740348357455], [44.67243828981545, 0.1867904673725833, 3.0890293417842707], [49.98546655760516, 0.1927172848722447, 2.552087076665742], [53.66921379529349, 0.1536683772779831, 2.3161562398157116], [57.98671214858713, 0.1740040672284836, 1.4004540067381643]], "r_squared_": 0.6796308303198676, "error_": 0.04619441691262301}
{"freq_range": [2.0, 80.0], "freq_res": 1.0, "aperiodic_params_": [-0.6403842840427125, -0.10168868317104893], "gaussian_params_": [[9.202422957023352, 0.3545399433510264, 0.45898487594280496], [12.770914310907067, 0.19142546956455686, 1.3251570532779122], [18.022105605236717, 0.23449227396564928, 0.4645272469490229], [20.43570431950383, 0.2903679386302875, 0.29491816389587805], [23.344552788163902, 0.3064626844564717, 5.115879417438527], [36.45135925580101, 0.7342928500588848, 0.2855822895225203], [38.596079978788474, 0.5783002091261232, 0.2921340628222601], [41.27330357863289, 0.18175757233001327, 0.6368700014751663], [44.66849714777249, 0.1736985435109962, 2.1189085552972866], [50.17878635176241, 0.20732962464361582, 1.4967893785896187], [52.68774731060752, 0.4188304436406823, 0.2543325636275129], [55.63105182146885, 0.5254374880818068, 0.2691446636328325]], "peak_params_": [[9.202422957023352, 0.33103722880851316, 0.9179697518856099], [12.770914310907067, 0.2282627379109008, 2.6503141065558244], [18.022105605236717, 0.411882419198357, 0.9290544938980458], [20.43570431950383, 0.3450215182224403, 0.5898363277917561], [23.344552788163902, 0.30576841805311045, 10.231758834877054], [36.45135925580101, 0.22500852621408263, 0.5711645790450406], [38.596079978788474, 0.23034274722018486, 0.5842681256445202], [41.27330357863289, 0.205370363065155, 1.2737400029503325], [44.66849714777249, 0.17214652991629442, 4.237817110594573], [50.17878635176241, 0.21318497546308712, 2.9935787571792374], [52.68774731060752, 0.23228670570099808, 0.5086651272550258], [55.63105182146885, 0.20544657125594573, 0.538289327265665]], "r_squared_": 0.6514067182873604, "error_": 0.044502035836374104}
{"freq_range": [2.0, 80.0], "freq_res": 1.0, "aperiodic_params_": [0.3210291719575313, 0.5537183398225884], "gaussian_params_": [[9.429511049742247, 1.0349046888708964, 0.2589329871318383], [17.851291972397522, 0.2700137423677014, 0.5292060018216571], [20.422407717714577, 0.16639678554045548, 0.7009295179100618], [24.671255314957094, 0.1782326567061752, 2.3590010473220278], [32.428676841423616, 0.7200804056917635, 0.25729479170956915], [36.183477445799994, 0.1971106932264409, 0.8827813436226858], [38.92917579179497, 0.21872735007406408, 0.49990242093698073], [41.45641286812234, 0.23564203541243486, 1.2051815040732619], [45.41264772529627, 0.29618249477852115, 0.6409344176449007], [50.106746943880175, 0.18917586094551925, 2.231978944099501], [55.888888976398775, 0.17003161649623827, 0.5124165879032709], [59.31236735301577, 0.11289871099848947, 1.8987380268400633], [65.7525042879874, 0.10356120998210118, 1.5774236790617864]], "peak_params_": [[9.429511049742247, 0.2614650620863214, 0.5178659742636766], [17.851291972397522, 0.2632535830256653, 1.0584120036433142], [20.422407717714577, 0.1639283441639134, 1.4018590358201235], [24.671255314957094, 0.1765103455163785, 4.7180020946440555], [32.428676841423616, 0.18115762102658234, 0.5145895834191383], [36.183477445799994, 0.19290909002408818, 1.7655626872453716], [38.92917579179497, 0.24728100515406576, 0.9998048418739615], [41.45641286812234, 0.21942281519536433, 2.4103630081465237], [45.41264772529627, 0.257674548808139, 1.2818688352898013], [50.106746943880175, 0.1889603050140103, 4.463957888199002], [55.888888976398775, 0.19652675580464296, 1.0248331758065419], [59.31236735301577, 0.11145961233416657, 3.7974760536801266], [65.7525042879874, 0.10252281867971413, 3.1548473581235728]], "r_squared_": 0.884898113327549, "error_": 0.04413414476257535}
{"freq_range": [2.0, 80.0], "freq_res": 1.0, "aperiodic_params_": [-0.009253555930912906, 0.6541519536568234], "gaussian_params_": [[9.239055938175825, 0.5874565899870835, 0.6574082064135102], [11.679834151922579, 0.3385106791726085, 1.4941513221899887], [18.576742953205837, 0.24778263833783024, 4.29974357256722], [25.965730882984452, 0.15937922585491915, 0.5883783178633941], [39.27816729384942, 0.26092565624622954, 0.4664502800066463], [41.90011108007171, 0.17190442072186282, 1.1727051037921143], [45.42330541854601, 0.2681190442335225, 0.560205024870912], [50.447194031320585, 0.17514328071337432, 1.940445727610192], [56.46385888506575, 0.6864814007194063, 0.2570543873002858], [61.54784563951765, 0.10176817415845595, 4.013285849761281]], "peak_params_": [[9.239055938175825, 0.6383868481157817, 1.3148164128270203], [11.679834151922579, 0.40783458326230865, 2.9883026443799774], [18.576742953205837, 0.24658711385300425, 8.59948714513444], [25.965730882984452, 0.2149357693939017, 1.1767566357267882], [39.27816729384942, 0.22650026884782948, 0.9329005600132926], [41.90011108007171, 0.17129619637193716, 2.3454102075842287], [45.42330541854601, 0.21018184930683792, 1.120410049741824], [50.447194031320585, 0.17217430935028366, 3.880891455220384], [56.46385888506575, 0.17681437072354678, 0.5141087746005716], [61.54784563951765, 0.10112433787357866, 8.026571699522561]], "r_squared_": 0.9643024365855886, "error_": 0.04273836536277371}
{"freq_range": [2.0, 80.0], "freq_res": 1.0, "aperiodic_params_": [0.1113450362661519, 0.8640473037967148], "gaussian_params_": [[9.241485283341467, 0.5619119792407941, 0.6901728776654523], [11.325298961045517, 0.4176831277573546, 1.4721784231120094], [17.03303064561, 0.32876479760970295, 4.100177201333529], [25.84655664404943, 0.21187450726247478, 0.39748902009288933], [50.9199700879959, 0.1690360557572805, 1.6853943277821237]], "peak_params_": [[9.241485283341467, 0.6967643554085134, 1.3803457553309046], [11.325298961045517, 0.5408513231953512, 2.944356846224019], [17.03303064561, 0.3290021220232471, 8.200354402667058], [25.84655664404943, 0.2267433131266855, 0.7949780401857787], [50.9199700879959, 0.16884559469931215, 3.3707886555642474]], "r_squared_": 0.9787090044908582, "error_": 0.04740282605652154}
{"freq_range": [2.0, 80.0], "freq_res": 1.0, "aperiodic_params_": [0.15798957239498201, 0.9219126861241859], "gaussian_params_": [[9.480977180110497, 0.785725165106268, 0.785948592363455], [11.523469665038695, 1.1965232111191384, 0.34491185283839637], [13.897093493650233, 0.25361917722990057, 0.9217247545567793], [17.754056239779974, 0.3275790850220461, 3.909763951239768], [26.31267604231151, 0.37218942342094946, 0.25429430927305136], [50.75049709624034, 0.15513822143977837, 1.8072260728451224], [59.63234697946886, 0.3234894249125488, 0.3027338076528474]], "peak_params_": [[9.480977180110497, 0.6782616622174027, 1.57189718472691], [11.523469665038695, 0.6067430813737634, 0.6898237056767927], [13.897093493650233, 0.4586388002383016, 1.8434495091135585], [17.754056239779974, 0.32694423786151683, 7.819527902479536], [26.31267604231151, 0.21020238738202912, 0.5085886185461027], [50.75049709624034, 0.15366676547899405, 3.6144521456902448], [59.63234697946886, 0.15473783705780364, 0.6054676153056948]], "r_squared_": 0.9889629204886263, "error_": 0.03636412716732604}
{"freq_range": [2.0, 80.0], "freq_res": 1.0, "aperiodic_params_": [-0.14763321878443036, 0.539646993660011], "gaussian_params_": [[9.411439620728217, 0.6449095937963532, 0.6511502754997867], [11.598063157850465, 0.49183937489121193, 0.8234112891349422], [14.456617796736571, 0.7951360191535064, 0.3257279480902464], [16.487922032020037, 0.3468326498122764, 0.43630353982645115], [18.666866554432513, 0.3016724203884577, 0.54013691966371], [23.539764884115815, 0.24813040902095151, 4.634849084156984], [29.434241954330243, 0.5498883553203279, 0.26026141868638225], [33.99608963207297, 0.23624421184301722, 1.0620585750821618], [37.68427133470511, 0.19824996006203538, 1.7512488155194024], [42.077413665859254, 0.22494754481729146, 0.7896676384086339], [44.495655889704615, 0.8446125058448829, 0.2691822076036526], [50.58120188881696, 0.2256306074965199, 2.950533211398441], [60.09164594718714, 0.11262871625972795, 2.429849279457221]], "peak_params_": [[9.411439620728217, 0.5334027696569671, 1.3023005509995733], [11.598063157850465, 0.44802063047278573, 1.6468225782698844], [14.456617796736571, 0.3344755768507393, 0.6514558961804928], [16.487922032020037, 0.25167641838654575, 0.8726070796529023], [18.666866554432513, 0.4030079360400888, 1.08027383932742], [23.539764884115815, 0.2469101046106651, 9.269698168313967], [29.434241954330243, 0.2606725931998596, 0.5205228373727645], [33.99608963207297, 0.27736410666319355, 2.1241171501643237], [37.68427133470511, 0.1971835390441561, 3.5024976310388047], [42.077413665859254, 0.2367600838003956, 1.5793352768172677], [44.495655889704615, 0.18570475209069115, 0.5383644152073052], [50.58120188881696, 0.2234718502187838, 5.901066422796882], [60.09164594718714, 0.1139308867399399, 4.859698558914442]], "r_squared_": 0.9578970508213314, "error_": 0.037689009583553396}
{"freq_range": [2.0, 80.0], "freq_res": 1.0, "aperiodic_params_": [-0.528906530899337, 0.11775898819975229], "gaussian_params_": [[9.427347317028596, 0.6225306229025878, 0.619615020038462], [11.510285173596394, 0.7966438484068639, 0.3522993680854455], [14.292556170889782, 0.21762176840733571, 0.5398018603291693], [17.715746775655344, 0.11094522355942639, 1.194514806061399], [25.073791043056733, 0.2775753832589233, 5.999901313405923], [28.999151108570953, 0.09392989016001971, 0.25000230342025265], [42.01077463251309, 0.07141935549734554, 0.25000065489090106], [42.643896202569664, 0.17931578499420012, 5.999999999999999], [44.344498908077846, 0.2184727589365953, 0.25263914432724044], [58.85630973618019, 0.17330978196759486, 1.3487133154288458]], "peak_params_": [[9.427347317028596, 0.4984297641921091, 1.239230040076924], [11.510285173596394, 0.3291511253668554, 0.704598736170891], [14.292556170889782, 0.2393224249368887, 1.0796037206583387], [17.715746775655344, 0.2464173964470029, 2.389029612122798], [25.073791043056733, 0.27993044129551664, 11.999802626811846], [28.999151108570953, 0.33151862514105596, 0.5000046068405053], [42.01077463251309, 0.2548298097241351, 0.5000013097818021], [42.643896202569664, 0.18222760650623304, 11.999999999999998], [44.344498908077846, 0.2629358064087712, 0.5052782886544809], [58.85630973618019, 0.1766937823528546, 2.6974266308576915]], "r_squared_": 0.7116679003315776, "error_": 0.0586795518419579}
{"freq_range": [2.0, 80.0], "freq_res": 1.0, "aperiodic_params_": [-0.671913322077299, -0.0774847562135072], "gaussian_params_": [[9.496654281709684, 0.38433939014974217, 0.8892480517198905], [24.548900991945068, 0.3537803778692146, 2.9931824841424732], [34.87203932747361, 0.1363908701244214, 4.40075640695493], [43.577063565319314, 0.9482419796056187, 0.28160608900991624], [48.34253613239031, 0.1777552746073447, 2.4244693472620766], [53.60199706627675, 0.4442225322372553, 0.3429673908994161]], "peak_params_": [[9.496654281709684, 0.3288364642182245, 1.778496103439781], [24.548900991945068, 0.36080213349301293, 5.9863649682849465], [34.87203932747361, 0.13713012991604856, 8.80151281390986], [43.577063565319314, 0.35859722376160186, 0.5632121780198325], [48.34253613239031, 0.17758369190845086, 4.848938694524153], [53.60199706627675, 0.2382438745058012, 0.6859347817988322]], "r_squared_": 0.4864532687509926, "error_": 0.06510816094183547}
{"freq_range": [2.0, 80.0], "freq_res": 1.0, "aperiodic_params_": [-0.7878840483299638, -0.19199052135608258], "gaussian_params_": [[8.547524991269649, 1.009006452908552, 0.2933431616510596], [24.88269243101223, 0.6586593118807038, 3.6576971380191927], [38.990883933186225, 0.14532711894867262, 0.25000065880347283], [46.64825154133143, 0.24934208887480752, 5.999999999999999], [53.286861279719176, 0.16470668259383964, 0.8917301620117066]], "peak_params_": [[8.547524991269649, 0.3071317258438453, 0.5866863233021192], [24.88269243101223, 0.658692176424735, 7.315394276038385], [38.990883933186225, 0.25626556123435384, 0.5000013176069457], [46.64825154133143, 0.24891398739973208, 11.999999999999998], [53.286861279719176, 0.29877867748324793, 1.7834603240234133]], "r_squared_": 0.7757378660577307, "error_": 0.06816000358532755}
{"freq_range": [2.0, 80.0], "freq_res": 1.0, "aperiodic_params_": [-0.35609929102019133, 0.4923374327419294], "gaussian_params_": [[8.576100326179883, 1.1377522753182314, 0.34272092437647605], [11.708931151931145, 0.44334273241338523, 1.6283411417291653], [17.87399873607434, 0.2679011096005538, 2.651813308720796], [24.121819084006777, 0.2318921692163235, 1.7448216320916254], [50.200043957116854, 0.13976319037848156, 5.999999999999999], [59.633756831474116, 0.1815198047388038, 0.9111124321697208]], "peak_params_": [[8.576100326179883, 0.6415814525697419, 0.6854418487529521], [11.708931151931145, 0.4593579584199937, 3.2566822834583307], [17.87399873607434, 0.2683455882211234, 5.303626617441592], [24.121819084006777, 0.2499216938655503, 3.489643264183251], [50.200043957116854, 0.13968553161017816, 11.999999999999998], [59.633756831474116, 0.204252497601209, 1.8222248643394416]], "r_squared_": 0.9172852665414154, "error_": 0.05494711549754787}
{"freq_range": [2.0, 80.0], "freq_res": 1.0, "aperiodic_params_": [-0.050687638705851794, 0.6757836914428511], "gaussian_params_": [[9.086963761750644, 0.6312435860149268, 0.6848427559882341], [11.99719826933142, 0.38744853232944715, 1.3725446342844099], [18.570459181053963, 0.29362881672174646, 4.52390177708828], [39.38597770050362, 0.6044959435390849, 0.2500841233787249], [56.45203459980554, 0.12081535792002444, 5.999999999993239]], "peak_params_": [[9.086963761750644, 0.6932120314547818, 1.3696855119764682], [11.99719826933142, 0.48979056311634744, 2.7450892685688197], [18.570459181053963, 0.29230907495730996, 9.04780355417656], [39.38597770050362, 0.18548022952731702, 0.5001682467574498], [56.45203459980554, 0.120472971218192, 11.999999999986478]], "r_squared_": 0.9562737603594005, "error_": 0.055020408010240864}
{"freq_range": [2.0, 80.0], "freq_res": 1.0, "aperiodic_params_": [0.21625095919302925, 0.9242112042061923], "gaussian_params_": [[9.166241312398608, 0.6585427245376364, 0.744826959117781], [12.180713394661739, 0.49956903781722894, 1.8186236662593969], [17.877260052761848, 0.3669764072301306, 2.6366844302280192], [23.233440775621165, 0.16232482147147836, 1.1865242591331733], [26.074306520981004, 0.1559008465155395, 0.7245335491235257], [39.392500376390174, 0.44147452179346225, 0.2719251780180625], [45.346295879095315, 0.13448316946036135, 1.1053114492840022], [50.292859102236726, 0.16524894773211865, 0.8890950557850207], [52.543347453656644, 0.5586109651024794, 0.2825979225954577], [56.278611838520156, 0.1494383166393928, 0.6804002366188534], [59.40825065836212, 0.1948739100359475, 0.6667229878984395]], "peak_params_": [[9.166241312398608, 0.7518452672047466, 1.489653918235562], [12.180713394661739, 0.5281823422061578, 3.6372473325187937], [17.877260052761848, 0.36957574710135344, 5.2733688604560385], [23.233440775621165, 0.21481808753034715, 2.3730485182663466], [26.074306520981004, 0.16898455192050332, 1.4490670982470515], [39.392500376390174, 0.1557729684122926, 0.543850356036125], [45.346295879095315, 0.12804222947957888, 2.2106228985680043], [50.292859102236726, 0.1565422192171615, 1.7781901115700414], [52.543347453656644, 0.1529964580688732, 0.5651958451909154], [56.278611838520156, 0.1374209502023267, 1.3608004732377068], [59.40825065836212, 0.1616111058090266, 1.333445975796879]], "r_squared_": 0.9867350157441407, "error_": 0.03577759450041252}
{"freq_range": [2.0, 80.0], "freq_res": 1.0, "aperiodic_params_": [0.35587928349501585, 1.0858231024854152], "gaussian_params_": [[9.204020471403213, 0.5671177093752168, 0.7776945194765245], [11.93171188566013, 0.4708351029153592, 2.161971531304615], [18.511790418818876, 0.39455118255525023, 4.132296467842646], [52.58100695845082, 0.5585189094481565, 0.25000003391029935], [59.04973955000285, 0.06936686209270919, 5.999999999999999]], "peak_params_": [[9.204020471403213, 0.7635789761930167, 1.555389038953049], [11.93171188566013, 0.585477576131279, 4.32394306260923], [18.511790418818876, 0.39405531731774635, 8.264592935685291], [52.58100695845082, 0.17884312639915545, 0.5000000678205987], [59.04973955000285, 0.06936447858920447, 11.999999999999998]], "r_squared_": 0.9902074197171616, "error_": 0.03850496073611596}
{"freq_range": [2.0, 80.0], "freq_res": 1.0, "aperiodic_params_": [0.2984331254729797, 1.0730939436998312], "gaussian_params_": [[9.264701920068998, 0.5203118506737271, 0.6465158892992069], [11.403585090030438, 0.49881770759888583, 1.76142395778406], [17.833039690341167, 0.44876843592555604, 4.353627258189682], [51.80092363646613, 0.15833525946836408, 1.4661671906830473], [59.67285931611233, 0.21902216062051189, 0.44741859228277076]], "peak_params_": [[9.264701920068998, 0.7323882063229011, 1.2930317785984138], [11.403585090030438, 0.6310335864599255, 3.52284791556812], [17.833039690341167, 0.4488878748238626, 8.707254516379365], [51.80092363646613, 0.15688241242155354, 2.9323343813660947], [59.67285931611233, 0.16764784464790994, 0.8948371845655415]], "r_squared_": 0.9899758118339477, "error_": 0.04020849178007834}
{"freq_range": [2.0, 80.0], "freq_res": 1.0, "aperiodic_params_": [0.05493568401097579, 0.8147750949197343], "gaussian_params_": [[9.383990739753608, 0.7634350795735039, 0.6851711414347433], [11.635835118839212, 0.4897334437849763, 0.7722730285433616], [16.814873227549583, 0.3812587636347699, 4.290642797383945], [23.01818650106799, 0.12444994056594663, 0.45831578388504185], [52.79830894495517, 0.2897387048751857, 0.750623336962141], [59.188206773509606, 0.10436822788356694, 1.9558773490103507]], "peak_params_": [[9.383990739753608, 0.7265170123138114, 1.3703422828694867], [11.635835118839212, 0.6418520083115397, 1.544546057086723], [16.814873227549583, 0.38090404708658643, 8.58128559476789], [23.01818650106799, 0.2592422782569479, 0.9166315677700837], [52.79830894495517, 0.2801654891417855, 1.501246673924282], [59.188206773509606, 0.1038861462016345, 3.9117546980207014]], "r_squared_": 0.9765057297407267, "error_": 0.04871743584864448}
{"freq_range": [2.0, 80.0], "freq_res": 1.0, "aperiodic_params_": [-0.370667584182492, 0.4209318041129569], "gaussian_params_": [[9.311452224525045, 0.715943776272533, 0.6877492430978134], [11.529762687932912, 0.46336949882635925, 0.9325250765597136], [14.39636848616498, 0.3663866270019263, 0.3290625585657403], [19.395430024016996, 0.1514067757441815, 4.638944258591161], [49.876457486572605, 0.21602453149248707, 0.6813617257226878], [52.93294527297295, 0.31753477693836496, 0.6488327914447968], [66.56957406986021, 0.6965605041902366, 0.2874820494212148], [77.34064789308842, 0.5281367263572974, 0.2774168846435983]], "peak_params_": [[9.311452224525045, 0.6701553162170694, 1.3754984861956268], [11.529762687932912, 0.4508799365216878, 1.8650501531194272], [14.39636848616498, 0.26822690451350606, 0.6581251171314806], [19.395430024016996, 0.15085770586191927, 9.277888517182323], [49.876457486572605, 0.21251416639556542, 1.3627234514453757], [52.93294527297295, 0.3158494779056267, 1.2976655828895935], [66.56957406986021, 0.22708175023213406, 0.5749640988424296], [77.34064789308842, 0.24850225318597796, 0.5548337692871966]], "r_squared_": 0.878453858080311, "error_": 0.062445395140462684}
{"freq_range": [2.0, 80.0], "freq_res": 1.0, "aperiodic_params_": [-0.6464606726474251, 0.029922613120692], "gaussian_params_": [[8.645853545409643, 0.8120791483102833, 0.3058537311507045], [10.406659974340059, 0.3732836185672677, 0.8356290525763078], [26.65525333247649, 0.34198638825967614, 4.000186188152035], [38.26716005966289, 0.19042402739724534, 4.969032421256454], [41.507263338264345, 0.6569723372616096, 0.28277273891852583], [45.97937377753191, 0.17363168883267263, 1.4279131583857814], [49.79597522104627, 0.205475153025723, 0.9878043752566527], [56.514600373583654, 0.1574235484585065, 3.763732598114132], [64.26137854812553, 0.21588293515568313, 1.2890431557638762]], "peak_params_": [[8.645853545409643, 0.5059316843608624, 0.611707462301409], [10.406659974340059, 0.33170195086881, 1.6712581051526156], [26.65525333247649, 0.35528237469886526, 8.00037237630407], [38.26716005966289, 0.19627973924838893, 9.938064842512908], [41.507263338264345, 0.2914415762407878, 0.5655454778370517], [45.97937377753191, 0.2336568582287919, 2.8558263167715627], [49.79597522104627, 0.25135564020999085, 1.9756087505133053], [56.514600373583654, 0.15627597834758555, 7.527465196228264], [64.26137854812553, 0.23327566158522262, 2.5780863115277524]], "r_squared_": 0.6893106257181459, "error_": 0.049734380736197015}
{"freq_range": [2.0, 80.0], "freq_res": 1.0, "aperiodic_params_": [-0.2754546231088556, 0.7310274519358292], "gaussian_params_": [[8.512773398136627, 2.1056679227722346, 0.3004432576374982], [11.30392933311205, 0.5115448134821344, 1.4390219823989716], [16.623238704135368, 0.21734132237378473, 2.5903249988980646], [60.65138006863708, 0.23709036070581857, 5.999999999999999], [67.00861880231943, 0.13703642266090008, 0.2500000153293063], [77.99432949435075, 0.22853566235162406, 5.999999999999999]], "peak_params_": [[8.512773398136627, 0.7102024849024436, 0.6008865152749964], [11.30392933311205, 0.5208587219658358, 2.878043964797943], [16.623238704135368, 0.21525703530618268, 5.180649997796129], [60.65138006863708, 0.2408295997549812, 11.999999999999998], [67.00861880231943, 0.31505468415054105, 0.5000000306586126], [77.99432949435075, 0.23216195285904373, 11.999999999999998]], "r_squared_": 0.9224756373442712, "error_": 0.06681681914721584}
{"freq_range": [2.0, 80.0], "freq_res": 1.0, "aperiodic_params_": [-0.11787343976090903, 0.8427792204594243], "gaussian_params_": [[8.666180571912502, 0.727726049517453, 0.586639692860528], [11.578295623267095, 0.5859851117755135, 1.4475492274171857], [16.94919062031029, 0.39738357338477726, 2.8525600778289415], [67.45203459913596, 0.19209481347160462, 5.999999999999999]], "peak_params_": [[8.666180571912502, 0.7470801668067432, 1.173279385721056], [11.578295623267095, 0.6498555368075051, 2.8950984548343714], [16.94919062031029, 0.3978473829912652, 5.705120155657883], [67.45203459913596, 0.1915504231675793, 11.999999999999998]], "r_squared_": 0.960144763584167, "error_": 0.06114810368235127}
{"freq_range": [2.0, 80.0], "freq_res": 1.0, "aperiodic_params_": [0.1470651035118931, 0.9824354990774279], "gaussian_params_": [[8.90169425904169, 0.6726535583673777, 0.7140878220164758], [11.645813189584167, 0.46140003269143937, 1.4072054357454917], [17.18293295608409, 0.5322429469173076, 3.8571903314947074], [59.46750622214084, 0.7159703590269394, 0.2675034737173444], [72.45203459913596, 0.09625611701805757, 5.999999999999999]], "peak_params_": [[8.90169425904169, 0.8011731005749597, 1.4281756440329516], [11.645813189584167, 0.6628634504334399, 2.8144108714909835], [17.18293295608409, 0.5319762047364381, 7.714380662989415], [59.46750622214084, 0.1632701052176222, 0.5350069474346888], [72.45203459913596, 0.09598333038805573, 11.999999999999998]], "r_squared_": 0.9851031647462676, "error_": 0.043898844320430716}
{"freq_range": [2.0, 80.0], "freq_res": 1.0, "aperiodic_params_": [0.34243054490582986, 1.1445741085575187], "gaussian_params_": [[8.924822252240991, 0.5999555057852988, 0.7552641965175666], [11.914712768201742, 0.527951205166915, 1.9187361444804736], [17.1477527946919, 0.5067967881034995, 3.1406898193127097], [23.17344413345923, 0.25506707309366144, 1.9596499125565654], [59.48830519860408, 0.6357171863986247, 0.2938153941150218]], "peak_params_": [[8.924822252240991, 0.7810397154172672, 1.5105283930351332], [11.914712768201742, 0.6598532502926113, 3.837472288960947], [17.1477527946919, 0.5237717809299525, 6.2813796386254195], [23.17344413345923, 0.3433741697613708, 3.919299825113131], [59.48830519860408, 0.15976791268468316, 0.5876307882300436]], "r_squared_": 0.9918434804107171, "error_": 0.03953076442608426}
{"freq_range": [2.0, 80.0], "freq_res": 1.0, "aperiodic_params_": [0.44219214227640774, 1.240304229053499], "gaussian_params_": [[9.073392577533273, 0.5252321036487306, 0.7084395088937426], [12.838362049067948, 0.6588228142352327, 2.683503918995654], [20.464489269205874, 0.5146701920426099, 3.416810486422725]], "peak_params_": [[9.073392577533273, 0.7611364713952015, 1.4168790177874853], [12.838362049067948, 0.7049618645775668, 5.367007837991308], [20.464489269205874, 0.5286510732870702, 6.83362097284545]], "r_squared_": 0.9922256285407497, "error_": 0.04110770873840255}
{"freq_range": [2.0, 80.0], "freq_res": 1.0, "aperiodic_params_": [0.4017378530715428, 1.2164261265254999], "gaussian_params_": [[9.583006850118963, 0.5397349842949554, 1.2788037804320134], [14.452034599135944, 0.666860149466738, 3.0735331447834193], [19.432576399793817, 0.4254292689983779, 0.3130884649039494], [21.845759383660376, 0.4354523275832357, 2.1265667799508052], [59.92967890990982, 0.18527299816028012, 0.4876192191380485]], "peak_params_": [[9.583006850118963, 0.7453626919705288, 2.5576075608640267], [14.452034599135944, 0.6615543304167537, 6.147066289566839], [19.432576399793817, 0.5647978975109176, 0.6261769298078989], [21.845759383660376, 0.46700002483869074, 4.2531335599016105], [59.92967890990982, 0.18335638000239718, 0.975238438276097]], "r_squared_": 0.9903648792826077, "error_": 0.041800371741132394}
{"freq_range": [2.0, 80.0], "freq_res": 1.0, "aperiodic_params_": [0.17862898948363745, 1.086619652247176], "gaussian_params_": [[9.302736468937386, 0.9207180762265007, 0.7825041660022317], [11.656355943082303, 0.6007376091735178, 0.7406634290373009], [14.799044719383405, 0.5799511029663325, 2.7025517032826363], [19.83872222109626, 0.02659939427474529, 0.251114555151288], [20.581007732410168, 0.43154467894837767, 2.770052187670169], [52.89496035133731, 0.25484853288001796, 0.6261468534283195], [59.75406598762939, 0.24009657154128544, 0.39424854093480693], [77.22573484441311, 0.2417066625776528, 0.6012237406954001]], "peak_params_": [[9.302736468937386, 0.9133844327504602, 1.5650083320044634], [11.656355943082303, 0.8846203037803609, 1.4813268580746017], [14.799044719383405, 0.6350700472593358, 5.4051034065652726], [19.83872222109626, 0.534826148189002, 0.502229110302576], [20.581007732410168, 0.46834175683211543, 5.540104375340338], [52.89496035133731, 0.2512876772351855, 1.252293706856639], [59.75406598762939, 0.19764553503458004, 0.7884970818696139], [77.22573484441311, 0.2252565860690785, 1.2024474813908002]], "r_squared_": 0.9889210860041137, "error_": 0.04700272690425875}
{"freq_range": [2.0, 80.0], "freq_res": 1.0, "aperiodic_params_": [-0.08352797486295041, 0.910618021796036], "gaussian_params_": [[9.101741003179423, 0.7419205386468961, 0.7376945253080456], [11.426929600833477, 0.6002330352238686, 1.3238495796993712], [16.739277323460506, 0.5213884495468744, 3.2960349576829024], [22.98490880334387, 0.18280960911791008, 0.40328587042307934], [53.25226413818082, 0.301404725327538, 0.6196139901266022], [66.45203465540432, 0.12271612955490985, 5.999999953135165], [77.41605583579819, 0.45242250744118667, 0.25023330483003386], [77.54796510637982, 0.10229746979263715, 4.769913560256687]], "peak_params_": [[9.101741003179423, 0.8798325201251179, 1.4753890506160912], [11.426929600833477, 0.7113801683819261, 2.6476991593987425], [16.739277323460506, 0.5198449279418688, 6.592069915365805], [22.98490880334387, 0.2685229723032967, 0.8065717408461587], [53.25226413818082, 0.28737236269638733, 1.2392279802532045], [66.45203465540432, 0.1278273374512069, 11.99999990627033], [77.41605583579819, 0.24135964648490704, 0.5004666096600677], [77.54796510637982, 0.15081168550763158, 9.539827120513374]], "r_squared_": 0.9772718321466392, "error_": 0.05122530106603539}
{"freq_range": [2.0, 80.0], "freq_res": 1.0, "aperiodic_params_": [-0.2993272052420348, 0.6301210224541445], "gaussian_params_": [[9.057332092057042, 0.5875052871194917, 0.8033568775073563], [11.545297603494236, 0.45514965448156, 1.542352803510572], [16.129282394401002, 0.15606523753726312, 2.151402851064961], [37.905120410100324, 0.24808563218160362, 0.2509767503043564], [50.716900103576506, 0.3011043734470428, 0.28351911429119414], [53.739186309189634, 0.27601982235739675, 1.3033430830576904], [60.38236545747623, 0.19924734081796747, 1.5019584697862054], [64.81466427886036, 0.3035631896868328, 0.7422348950208315], [67.84850184776256, 0.20855447150845008, 0.569256703475629], [72.12135223336035, 0.2659803968242477, 0.8315803263128826], [75.01057521391675, 0.31653593728132273, 0.25000007216049713], [79.54796521962861, 0.19124169223045254, 2.4105544369456817]], "peak_params_": [[9.057332092057042, 0.703276211681531, 1.6067137550147126], [11.545297603494236, 0.46124870676325225, 3.084705607021144], [16.129282394401002, 0.16280978897976306, 4.302805702129922], [37.905120410100324, 0.2309765859519477, 0.5019535006087128], [50.716900103576506, 0.2132243521718591, 0.5670382285823883], [53.739186309189634, 0.27057213627082133, 2.606686166115381], [60.38236545747623, 0.19289692446671047, 3.003916939572411], [64.81466427886036, 0.2960120921318543, 1.484469790041663], [67.84850184776256, 0.20133222528391115, 1.138513406951258], [72.12135223336035, 0.2645842223798789, 1.6631606526257652], [75.01057521391675, 0.3491749677154419, 0.5000001443209943], [79.54796521962861, 0.18790857945550665, 4.8211088738913634]], "r_squared_": 0.9445568155205465, "error_": 0.04543196005996291}
{"freq_range": [2.0, 80.0], "freq_res": 1.0, "aperiodic_params_": [-0.470257454506949, 0.7112030868533763], "gaussian_params_": [[8.588619543885622, 0.8104552007881293, 0.5987382958107809], [11.218375469238836, 0.6618762067414412, 1.5257594544379278], [16.07161550828603, 0.237791979156935, 2.3748491988729516], [58.62236969608652, 0.23511215356785056, 1.130474768202902], [61.939923878361554, 0.289040909521668, 1.9416957936998882], [68.66622091069145, 0.2182372267241333, 1.03575996887883], [78.56355298392086, 0.2837226037502331, 5.999999999999748]], "peak_params_": [[8.588619543885622, 0.8728844268458262, 1.1974765916215617], [11.218375469238836, 0.6796903223931617, 3.0515189088758556], [16.07161550828603, 0.24255984505286077, 4.749698397745903], [58.62236969608652, 0.3156125450944067, 2.260949536405804], [61.939923878361554, 0.29789284375044045, 3.8833915873997764], [68.66622091069145, 0.2872381800547834, 2.07151993775766], [78.56355298392086, 0.2829729682742119, 11.999999999999496]], "r_squared_": 0.9364461457737876, "error_": 0.06555797568667285}
{"freq_range": [2.0, 80.0], "freq_res": 1.0, "aperiodic_params_": [0.02788760490522844, 1.101650907905292], "gaussian_params_": [[8.975178559905853, 0.8134951426223869, 0.8842379427886319], [11.565757800693735, 0.6742441648986793, 0.8512878530928463], [13.475538517240576, 0.8177169689848031, 0.27984629743200423], [16.40276549794998, 0.5257679090928922, 3.281319772973189], [59.452095486901335, 0.4921860814166687, 0.2500000266594343], [60.69090256710495, 0.24640029648158054, 2.567638719171353], [73.93482755681927, 0.1728136604842997, 5.999999999999999]], "peak_params_": [[8.975178559905853, 0.8616218198379232, 1.7684758855772638], [11.565757800693735, 0.8080571677209045, 1.7025757061856925], [13.475538517240576, 0.6632257236399302, 0.5596925948640085], [16.40276549794998, 0.5218229593864586, 6.562639545946378], [59.452095486901335, 0.30210928966901696, 0.5000000533188687], [60.69090256710495, 0.2615408635919909, 5.135277438342706], [73.93482755681927, 0.17280382702409125, 11.999999999999998]], "r_squared_": 0.9801360310945316, "error_": 0.054916294105139964}
{"freq_range": [2.0, 80.0], "freq_res": 1.0, "aperiodic_params_": [0.22547165850551187, 1.1953843946204492], "gaussian_params_": [[10.137190458945811, 0.5961130648586854, 1.9711915376041718], [16.293293756076796, 0.7102604937650554, 4.34994989777768], [62.547965400860974, 0.12677678486622918, 5.999998875845756]], "peak_params_": [[10.137190458945811, 0.8440784887484302, 3.9423830752083435], [16.293293756076796, 0.7157996418152632, 8.69989979555536], [62.547965400860974, 0.12641750354553527, 11.999997751691511]], "r_squared_": 0.9853787300670095, "error_": 0.05922102640956408}
{"freq_range": [2.0, 80.0], "freq_res": 1.0, "aperiodic_params_": [0.36241274795118045, 1.2642200164673612], "gaussian_params_": [[8.865450036345276, 0.4611811789677291, 0.7667089384084318], [12.018363716298117, 0.5782984242959274, 2.445500878710006], [18.501782835273264, 0.556000684255058, 4.264943292243116]], "peak_params_": [[8.865450036345276, 0.7706095872487232, 1.5334178768168636], [12.018363716298117, 0.7523395868146047, 4.891001757420012], [18.501782835273264, 0.5620445742886687, 8.529886584486231]], "r_squared_": 0.9914194690083256, "error_": 0.045792278146956994}
{"freq_range": [2.0, 80.0], "freq_res": 1.0, "aperiodic_params_": [0.45301349168239463, 1.306708332088922], "gaussian_params_": [[8.90957664617303, 0.41147467026523615, 0.7809775657534531], [12.79640222818721, 0.7098588844122983, 2.888162940806303], [20.46716406717204, 0.5055582667623945, 3.7124151781558044]], "peak_params_": [[8.90957664617303, 0.712222444421942, 1.5619551315069062], [12.79640222818721, 0.7749705078948322, 5.776325881612606], [20.46716406717204, 0.5332168601900683, 7.424830356311609]], "r_squared_": 0.9924555224507918, "error_": 0.0420795969259076}
{"freq_range": [2.0, 80.0], "freq_res": 1.0, "aperiodic_params_": [0.4232249159389929, 1.2824995103282824], "gaussian_params_": [[10.946288039413604, 0.5878643438840528, 2.1980019199533762], [17.63601488500497, 0.5913467218923978, 4.442837549168308]], "peak_params_": [[10.946288039413604, 0.7815063959994486, 4.3960038399067525], [17.63601488500497, 0.5927771194041415, 8.885675098336616]], "r_squared_": 0.9861464582240468, "error_": 0.056920661014016806}
{"freq_range": [2.0, 80.0], "freq_res": 1.0, "aperiodic_params_": [0.21931396809570414, 1.1980897600529081], "gaussian_params_": [[10.492106086498767, 0.6998846002005952, 1.8077705421799768], [16.77728661255605, 0.7492176435013457, 4.284621162152176]], "peak_params_": [[10.492106086498767, 0.8888678205422165, 3.6155410843599536], [16.77728661255605, 0.7492798363401073, 8.569242324304351]], "r_squared_": 0.9827288846504282, "error_": 0.06332187401881736}
{"freq_range": [2.0, 80.0], "freq_res": 1.0, "aperiodic_params_": [0.015953732807678176, 1.076324606955506], "gaussian_params_": [[10.479765808983196, 0.7279859273412971, 1.787566348251069], [16.312092167624538, 0.5637198380611775, 3.9387818293601917], [16.982312756066044, 0.13114721880613175, 0.2500008794368427], [53.43973357639187, 1.3073752035080917, 0.25056912540552634], [62.45274447707453, 0.14932399750677355, 5.068715319254935], [73.63593597365355, 0.046895571023095044, 1.4225982558699601], [77.2812141741261, 0.1875892682747904, 5.999999999817675]], "peak_params_": [[10.479765808983196, 0.858329438126563, 3.575132696502138], [16.312092167624538, 0.5681955537479425, 7.877563658720383], [16.982312756066044, 0.6869468814665971, 0.5000017588736854], [53.43973357639187, 0.30659169484388404, 0.5011382508110527], [62.45274447707453, 0.1560522430925022, 10.13743063850987], [73.63593597365355, 0.21806660424343471, 2.8451965117399203], [77.2812141741261, 0.19267595354422973, 11.99999999963535]], "r_squared_": 0.9784888938661106, "error_": 0.056190597869763007}
{"freq_range": [2.0, 80.0], "freq_res": 1.0, "aperiodic_params_": [-0.3830030248021409, 0.6972526757025689], "gaussian_params_": [[10.063124050769817, 0.6103312879785556, 1.6671556215320436], [14.996836794029681, 0.32789139046628696, 3.5987057462639602], [52.967831679681616, 0.24766156168960174, 0.7644248329304463], [58.60786760701226, 0.5816813244977389, 0.29330024547022465], [63.32731860089716, 0.19186911536792106, 3.959189391816507], [70.00176694543532, 0.16283133007763864, 0.2500264855248321], [74.77663330068958, 0.2441224676335208, 2.9084787486095838]], "peak_params_": [[10.063124050769817, 0.7349426465182523, 3.334311243064087], [14.996836794029681, 0.3355013989914404, 7.1974114925279205], [52.967831679681616, 0.25383296178295156, 1.5288496658608925], [58.60786760701226, 0.343563778153273, 0.5866004909404493], [63.32731860089716, 0.1912817545261687, 7.918378783633014], [70.00176694543532, 0.2725693806485745, 0.5000529710496642], [74.77663330068958, 0.24588973097576483, 5.8169574972191675]], "r_squared_": 0.9350257714251422, "error_": 0.06472980466725389}
{"freq_range": [2.0, 80.0], "freq_res": 1.0, "aperiodic_params_": [-0.44075139927662155, 0.7663450698858123], "gaussian_params_": [[9.022814664244361, 0.5814131008875578, 0.7716842503858194], [11.779492067878866, 0.6381972366713791, 2.015241616775043], [15.595633813236688, 0.6216626909824143, 0.2800150420521994], [18.078244827403566, 0.313097453155877, 1.0140053935250906], [44.50229535805005, 0.12873941395714625, 3.0608673628095557], [57.464001825429506, 1.102172094632522, 0.2795363453946261], [59.66339511718447, 0.4258129856833939, 0.6296356780207993], [61.548660536495326, 1.1268495750753313, 0.33872306704216326], [63.99036113165896, 0.31117898850624687, 0.6584181533530612], [68.51453047865917, 0.2666392688655254, 1.1275756902010343], [72.05479444948995, 0.10307257759213415, 0.25025837406196233], [77.54796540086404, 0.22586250590840715, 5.99999965917235]], "peak_params_": [[9.022814664244361, 0.8276937160417732, 1.543368500771639], [11.779492067878866, 0.634728862189414, 4.030483233550086], [15.595633813236688, 0.3286760468253107, 0.5600300841043988], [18.078244827403566, 0.31761168365051584, 2.028010787050181], [44.50229535805005, 0.12704879871814434, 6.1217347256191115], [57.464001825429506, 0.2786682220209, 0.5590726907892521], [59.66339511718447, 0.37228146006579, 1.2592713560415987], [61.548660536495326, 0.4753194817738504, 0.6774461340843265], [63.99036113165896, 0.32888237350286165, 1.3168363067061224], [68.51453047865917, 0.32490395380604764, 2.2551513804020686], [72.05479444948995, 0.25016915439370035, 0.5005167481239247], [77.54796540086404, 0.22522241901596818, 11.9999993183447]], "r_squared_": 0.94849678434232, "error_": 0.058071211638928394}
{"freq_range": [2.0, 80.0], "freq_res": 1.0, "aperiodic_params_": [-0.016404194920426156, 1.109705980323291], "gaussian_params_": [[10.20490774150573, 0.7230075459667387, 1.932293207958466], [15.626594904787893, 0.5536491839826481, 3.613958569878016], [59.79166041178833, 0.3103540538243231, 1.6507709067510807], [61.647924354316196, 0.8255897924228766, 0.2517850436855816], [64.03120755293583, 0.3254980915077898, 0.2501185958605345], [68.26635081419157, 0.0998497565597634, 2.8864569918119516], [77.54796540043212, 0.2240964923234191, 5.999999999976853]], "peak_params_": [[10.20490774150573, 0.8837240763319385, 3.864586415916932], [15.626594904787893, 0.5587559804165808, 7.227917139756032], [59.79166041178833, 0.3126576029957293, 3.3015418135021615], [61.647924354316196, 0.45468517460557223, 0.5035700873711632], [64.03120755293583, 0.38601761076543406, 0.500237191721069], [68.26635081419157, 0.1626022855043472, 5.772913983623903], [77.54796540043212, 0.2238002838125881, 11.999999999953706]], "r_squared_": 0.9740809955525711, "error_": 0.06781110764381267}
{"freq_range": [2.0, 80.0], "freq_res": 1.0, "aperiodic_params_": [0.2262725175717077, 1.2635523262060435], "gaussian_params_": [[10.412548358002079, 0.7127044027985293, 2.1010966402592994], [16.418159808414394, 0.677692772284935, 4.158035784524218], [59.86129424810094, 0.28483533902531705, 0.8924668314635792], [61.954383019712346, 0.2184737672056271, 0.25141377691321903], [64.40621533784395, 0.606761939646942, 0.30414958594210145]], "peak_params_": [[10.412548358002079, 0.905001934731851, 4.202193280518599], [16.418159808414394, 0.6950363920175843, 8.316071569048436], [59.86129424810094, 0.2814159484920249, 1.7849336629271584], [61.954383019712346, 0.23103488099407965, 0.5028275538264381], [64.40621533784395, 0.24870747703199747, 0.6082991718842029]], "r_squared_": 0.9867849987283528, "error_": 0.059491386037197315}
{"freq_range": [2.0, 80.0], "freq_res": 1.0, "aperiodic_params_": [0.36049198024137524, 1.321205281361165], "gaussian_params_": [[11.05014941592373, 0.6618052009331131, 2.4983283481755416], [17.31370539450682, 0.5679742121198692, 4.139554872649809]], "peak_params_": [[11.05014941592373, 0.8391660507975718, 4.996656696351083], [17.31370539450682, 0.6051728716416375, 8.279109745299618]], "r_squared_": 0.9888707805877985, "error_": 0.05361495697652051}
{"freq_range": [2.0, 80.0], "freq_res": 1.0, "aperiodic_params_": [0.45274396991948357, 1.2460711245681315], "gaussian_params_": [[11.892028679773174, 0.8067134744628575, 2.7324803308957124], [16.602508377124703, 0.7283845742685706, 0.31765866272550325], [18.959942708752184, 0.2154027932616098, 0.5281217224606369], [20.452034599135946, 0.24884417531479347, 3.40716709754695], [20.5006519034674, 0.4292708878880647, 0.2709432864037874], [76.71201914957489, 0.20144828028930284, 0.5223402156122902]], "peak_params_": [[11.892028679773174, 0.8175567644711264, 5.464960661791425], [16.602508377124703, 0.6226673474451058, 0.6353173254510065], [18.959942708752184, 0.4694009329623251, 1.0562434449212739], [20.452034599135946, 0.36538300819881697, 6.8143341950939], [20.5006519034674, 0.3274428072753638, 0.5418865728075748], [76.71201914957489, 0.173044939309698, 1.0446804312245803]], "r_squared_": 0.9903811494853787, "error_": 0.0432732960198003}
{"freq_range": [2.0, 80.0], "freq_res": 1.0, "aperiodic_params_": [0.2523435731918713, 1.2259100270144143], "gaussian_params_": [[10.872186156943762, 0.7168323295341847, 2.0901350155172427], [16.454950079882796, 0.6405109304225287, 4.07414926934813], [53.29172540856503, 0.3993594862508704, 0.2602937586592558]], "peak_params_": [[10.872186156943762, 0.9768578197471851, 4.180270031034485], [16.454950079882796, 0.6718835147720579, 8.14829853869626], [53.29172540856503, 0.2131117388211461, 0.5205875173185116]], "r_squared_": 0.9892932728963207, "error_": 0.052519063444499324}
{"freq_range": [2.0, 80.0], "freq_res": 1.0, "aperiodic_params_": [0.07565514111625192, 1.1649566683349073], "gaussian_params_": [[10.996598843224715, 0.8239746436664157, 2.2159289367478117], [16.60671501499051, 0.510800706913127, 0.25391398483861266], [16.700987516250557, 0.5304447321223835, 3.7180619459578508], [23.70345398159781, 0.12647669596817365, 0.7888185616936155], [53.345954105521095, 0.3744498500716657, 0.4963717327649888], [58.51830684244692, 0.2787679551016795, 0.8166305578478407], [63.48252245675851, 0.12719887427444315, 3.608760465020791], [69.6321702850587, 0.263445021265743, 0.25094573508719187], [75.77528948453667, 0.21049328262271116, 4.898260038805847]], "peak_params_": [[10.996598843224715, 0.987696847823943, 4.431857873495623], [16.60671501499051, 0.7036487924439772, 0.5078279696772253], [16.700987516250557, 0.7036487924439772, 7.4361238919157016], [23.70345398159781, 0.19507796624788343, 1.577637123387231], [53.345954105521095, 0.2955816162994449, 0.9927434655299776], [58.51830684244692, 0.2936641009439962, 1.6332611156956813], [63.48252245675851, 0.13308365362344254, 7.217520930041582], [69.6321702850587, 0.219925478534432, 0.5018914701743837], [75.77528948453667, 0.2105822774860462, 9.796520077611694]], "r_squared_": 0.9878009328704288, "error_": 0.046368398474201274}
{"freq_range": [2.0, 80.0], "freq_res": 1.0, "aperiodic_params_": [-0.23299768064720536, 0.909374982912076], "gaussian_params_": [[10.564559972296632, 0.628342002939363, 1.9522734240758806], [15.28642265708398, 0.4709587851270625, 3.4820607254478557], [29.968227112411746, 0.21007353223645012, 0.25000000000000006], [53.404544657027536, 0.7381570494186739, 0.34341321979931433], [58.78642662928207, 0.5242331389313825, 0.9146858215402912], [61.76674463932839, 0.4149754892806785, 0.5767851919971707], [66.0058422276446, 0.20131994417862165, 1.5994220781416288], [69.6093007345997, 0.9844166229454783, 0.2805537872419478], [72.51885311968653, 0.935022534677941, 0.3084820232084142], [74.52568173148356, 1.5231046916720485, 0.29599326183887964], [78.76965462291219, 0.22768759722498474, 2.549222316422255]], "peak_params_": [[10.564559972296632, 0.8336680303682469, 3.904546848151761], [15.28642265708398, 0.5169398988379696, 6.964121450895711], [29.968227112411746, 0.20844626940089284, 0.5000000000000001], [53.404544657027536, 0.36881725791329645, 0.6868264395986287], [58.78642662928207, 0.5101536551616255, 1.8293716430805824], [61.76674463932839, 0.39223200552941795, 1.1535703839943414], [66.0058422276446, 0.20131941133551146, 3.1988441562832577], [69.6093007345997, 0.3828191054717678, 0.5611075744838956], [72.51885311968653, 0.2946466585356011, 0.6169640464168284], [74.52568173148356, 0.4981096509590688, 0.5919865236777593], [78.76965462291219, 0.2267599843244512, 5.09844463284451]], "r_squared_": 0.9707812243556903, "error_": 0.05436581694131745}
{"freq_range": [2.0, 80.0], "freq_res": 1.0, "aperiodic_params_": [-0.6657027222997504, 1.1791995931750416], "gaussian_params_": [[9.538021214251184, 0.8142972716366651, 1.3924767843741919], [12.88657787971163, 0.6066519625912581, 1.5848534915318124], [17.465507444521947, 0.4655412798727061, 2.498406887113444], [61.184607730677016, 0.23063087762651055, 2.9444216294213894], [76.54796540086404, 0.2272855282949309, 5.999999999999999]], "peak_params_": [[9.538021214251184, 0.8915549839346477, 2.7849535687483837], [12.88657787971163, 0.7363759597449553, 3.169706983063625], [17.465507444521947, 0.4784307222876756, 4.996813774226888], [61.184607730677016, 0.2380926895185591, 5.888843258842779], [76.54796540086404, 0.22664153399575104, 11.999999999999998]], "r_squared_": 0.9801230773649172, "error_": 0.05928193457832663}
{"freq_range": [2.0, 80.0], "freq_res": 1.0, "aperiodic_params_": [-0.07396961019290105, 1.1633399338903234], "gaussian_params_": [[9.265797785876448, 0.6261422046873624, 1.259759505304081], [12.409536885151288, 0.6646953834887157, 2.004273772081605], [17.58917608536686, 0.45362232500482425, 2.4770258881084746], [43.64984336500625, 0.580455834074434, 0.2645965776779094], [60.27729404329226, 0.22414717348681668, 2.359791278751608], [63.970330514947285, 0.18246747174830139, 0.25001572079721757], [68.00293350549433, 0.1444155828186345, 0.25000730472186894], [72.54796540086404, 0.23056797378569815, 5.999999999999999]], "peak_params_": [[9.265797785876448, 0.7698678637575841, 2.519519010608162], [12.409536885151288, 0.7459318610434531, 4.00854754416321], [17.58917608536686, 0.4610157340436669, 4.954051776216949], [43.64984336500625, 0.2418176436316506, 0.5291931553558188], [60.27729404329226, 0.2484914444559596, 4.719582557503216], [63.970330514947285, 0.32934334886520444, 0.5000314415944351], [68.00293350549433, 0.3184605207873774, 0.5000146094437379], [72.54796540086404, 0.2299146611079621, 11.999999999999998]], "r_squared_": 0.9804443521682412, "error_": 0.058446311425023}
{"freq_range": [2.0, 80.0], "freq_res": 1.0, "aperiodic_params_": [0.22066570290717447, 1.326056703492932], "gaussian_params_": [[10.627708832266766, 0.8261703254892907, 2.3383015399617704], [16.878974921695264, 0.5745126550098796, 3.735653957020987], [59.87077169708328, 0.20050965130799323, 0.768059823048568], [61.97384595758539, 0.20080685093033251, 0.2501852901359266], [64.35477122374235, 0.5087307350826913, 0.2801930114075931], [70.02706123211908, 0.10342454692867996, 0.25007724812863164], [76.10609096723847, 0.19240791247266922, 5.999999999999999]], "peak_params_": [[10.627708832266766, 0.9822961129070544, 4.676603079923541], [16.878974921695264, 0.5943671856801737, 7.471307914041974], [59.87077169708328, 0.20293379288650404, 1.536119646097136], [61.97384595758539, 0.21614475244778775, 0.5003705802718532], [64.35477122374235, 0.25335533017307865, 0.5603860228151862], [70.02706123211908, 0.21745879944539226, 0.5001544962572633], [76.10609096723847, 0.19237783694162847, 11.999999999999998]], "r_squared_": 0.9894771798475768, "error_": 0.048737401613670045}
{"freq_range": [2.0, 80.0], "freq_res": 1.0, "aperiodic_params_": [0.17812094399692086, 1.300837243791032], "gaussian_params_": [[10.983474220562874, 0.8571127139776592, 2.5328828061401096], [17.47634017579394, 0.564356598435657, 3.8572490244469115]], "peak_params_": [[10.983474220562874, 0.9949432830691374, 5.065765612280219], [17.47634017579394, 0.6110982226559667, 7.714498048893823]], "r_squared_": 0.9845312151157978, "error_": 0.06803661037175326}
{"freq_range": [2.0, 80.0], "freq_res": 1.0, "aperiodic_params_": [0.06165778856343757, 1.174897770209309], "gaussian_params_": [[13.32770306979209, 0.9030426347147484, 4.443890148323487]], "peak_params_": [[13.32770306979209, 0.9005906239865255, 8.887780296646975]], "r_squared_": 0.9739968956455375, "error_": 0.08449106162131129}
{"freq_range": [2.0, 80.0], "freq_res": 1.0, "aperiodic_params_": [-0.05226571642569967, 1.10596864708249], "gaussian_params_": [[12.899546151111805, 0.8883934924595701, 3.962177129426765], [53.398458497961585, 0.6940474742204119, 0.25421644364060597], [58.64636980671184, 0.22046132418314396, 1.4560889342367267], [62.54796540086405, 0.1390562005492558, 5.713432881530711], [69.5412663920728, 0.6964127622603193, 0.2891406749580928], [76.02624910427974, 0.19582363302682215, 3.0026646811958657]], "peak_params_": [[12.899546151111805, 0.888108015557929, 7.92435425885353], [53.398458497961585, 0.23773160633262913, 0.5084328872812119], [58.64636980671184, 0.32872546934360614, 2.9121778684734534], [62.54796540086405, 0.1411616531842308, 11.426865763061421], [69.5412663920728, 0.2833591550350738, 0.5782813499161856], [76.02624910427974, 0.2045145865741409, 6.005329362391731]], "r_squared_": 0.9782982058262274, "error_": 0.061838116708555116}
{"freq_range": [2.0, 80.0], "freq_res": 1.0, "aperiodic_params_": [-0.41570560256003874, 0.9801475202137232], "gaussian_params_": [[11.464113151280161, 0.7064562739554057, 2.59655796164714], [18.041178788346453, 0.2831991962089895, 2.1821378240395375], [24.266788070207365, 0.2668429468345476, 0.2501940859866576], [55.69385925974107, 0.37710495381749437, 0.3053164640736304], [57.983910704318056, 0.21310617074357804, 0.6912000591043214], [64.57120856548916, 0.15456049689571635, 1.514063070394503], [78.14756017262869, 0.1961977503298119, 2.2257464012135824]], "peak_params_": [[11.464113151280161, 0.6968138764006762, 5.19311592329428], [18.041178788346453, 0.31288235677619447, 4.364275648079075], [24.266788070207365, 0.15794093034029189, 0.5003881719733152], [55.69385925974107, 0.23157301355847348, 0.6106329281472608], [57.983910704318056, 0.21306099844635473, 1.3824001182086427], [64.57120856548916, 0.14848483909510746, 3.028126140789006], [78.14756017262869, 0.19576705134043282, 4.451492802427165]], "r_squared_": 0.9868878648177437, "error_": 0.04090449542476913}
{"freq_range": [2.0, 80.0], "freq_res": 1.0, "aperiodic_params_": [0.09457256411701692, 1.2761539970620202], "gaussian_params_": [[10.605066415104027, 0.7088422297116531, 2.3747407346425597], [16.759902889803744, 0.4925785488899497, 3.666912193772861], [53.01051043268224, 0.19973536773630343, 0.2500000000008551], [71.45210603789953, 0.169710405206252, 5.999999999999999], [76.48346547626171, 0.426034911396901, 0.2911206110645158]], "peak_params_": [[10.605066415104027, 0.8425567346439193, 4.7494814692851195], [16.759902889803744, 0.510397771083751, 7.333824387545722], [53.01051043268224, 0.2010585336288322, 0.5000000000017102], [71.45210603789953, 0.1692292997553082, 11.999999999999998], [76.48346547626171, 0.23462707009293293, 0.5822412221290316]], "r_squared_": 0.986220078860035, "error_": 0.05387424574416731}
{"freq_range": [2.0, 80.0], "freq_res": 1.0, "aperiodic_params_": [0.05529455576118119, 1.239780784609827], "gaussian_params_": [[12.94907300386808, 0.7864447815910708, 4.289910450171851], [74.45203459913596, 0.168441019996674, 5.999999999999999]], "peak_params_": [[12.94907300386808, 0.7863893671947643, 8.579820900343702], [74.45203459913596, 0.16796366375561167, 11.999999999999998]], "r_squared_": 0.9783276527299338, "error_": 0.06589720776455558}
{"freq_range": [2.0, 80.0], "freq_res": 1.0, "aperiodic_params_": [0.17614298983480708, 1.1205288512346543], "gaussian_params_": [[11.557895026386005, 0.6533266795188456, 2.688594164058363], [17.464688967613252, 0.6536734956640677, 0.2705982642243825], [18.72281934229689, 0.19878887643336188, 4.171694845028158], [72.05923296423427, 0.0826179546324883, 5.999999999999999]], "peak_params_": [[11.557895026386005, 0.6988099363596918, 5.377188328116726], [17.464688967613252, 0.41638643954938126, 0.541196528448765], [18.72281934229689, 0.21252005915974692, 8.343389690056316], [72.05923296423427, 0.08261392877594931, 11.999999999999998]], "r_squared_": 0.9867415916024268, "error_": 0.04619521298326909}
{"freq_range": [2.0, 80.0], "freq_res": 1.0, "aperiodic_params_": [-1.2630917008561797, 0.6814389635926801], "gaussian_params_": [[8.491056471275197, 0.8940873076209622, 0.36689660436190197], [10.552904654637295, 0.5003140105473103, 1.4504899706475447], [14.888996660703771, 0.21647383165086312, 3.056903772460805], [59.10629347070381, 0.43536013118462036, 1.1990083923143737], [61.74821800239398, 0.5203901278178981, 0.5436566092449943], [74.82016697090339, 0.35440996812546866, 0.7077096904732777]], "peak_params_": [[8.491056471275197, 0.4884847931558778, 0.7337932087238039], [10.552904654637295, 0.5734747952995087, 2.9009799412950894], [14.888996660703771, 0.22088187182710528, 6.11380754492161], [59.10629347070381, 0.43365420504671537, 2.3980167846287475], [61.74821800239398, 0.49113248561284184, 1.0873132184899885], [74.82016697090339, 0.3431506299263125, 1.4154193809465554]], "r_squared_": 0.9088510030418934, "error_": 0.0790687719063479}
{"freq_range": [2.0, 80.0], "freq_res": 1.0, "aperiodic_params_": [-0.552241652094143, 0.7509594859027646], "gaussian_params_": [[8.89135594484486, 0.5021697286253832, 0.5767709372852265], [11.064289794057917, 0.47950206751434477, 1.1223318474235648], [13.531424309211417, 0.7665920593115244, 0.3077368954613684], [16.880786953104792, 0.250323131579012, 1.2598738481530942], [26.571444617777907, 0.37724363898462215, 0.3315973929244492], [43.656611192412186, 0.38559342481898523, 0.26943792277658485], [58.969660153975234, 0.1538960294749984, 3.376056617615719], [61.766727071172625, 0.15226347077633404, 0.26256174492032397], [70.00822611230514, 0.19923309262126832, 0.2500000000312379], [74.21965818703305, 0.3406498631227241, 0.7667773691618682]], "peak_params_": [[8.89135594484486, 0.5816853480154571, 1.153541874570453], [11.064289794057917, 0.47934941444339296, 2.2446636948471297], [13.531424309211417, 0.2745008736314203, 0.6154737909227368], [16.880786953104792, 0.24920540518922385, 2.5197476963061884], [26.571444617777907, 0.1636527161257746, 0.6631947858488983], [43.656611192412186, 0.17117787449951627, 0.5388758455531697], [58.969660153975234, 0.15388981512151378, 6.752113235231438], [61.766727071172625, 0.20547753509078492, 0.5251234898406479], [70.00822611230514, 0.1998653567863693, 0.5000000000624758], [74.21965818703305, 0.3269627321332145, 1.5335547383237365]], "r_squared_": 0.9676677637298374, "error_": 0.03822406513536561}
{"freq_range": [2.0, 80.0], "freq_res": 1.0, "aperiodic_params_": [-0.6087593134319605, 0.7142922104794545], "gaussian_params_": [[8.509866057788132, 0.9948050473861639, 0.2992996215917549], [12.427715300977287, 0.4639347876739072, 2.4091972709013794], [44.356096982506344, 0.4045541999621699, 0.2803306915779726], [52.78259473927576, 0.19963854794409264, 0.8032084542892651], [58.50855094183497, 0.22322603728300514, 1.5616560979178578], [61.93975267018758, 0.27730502947884444, 0.8214790803485089], [69.93588524441347, 0.2703154020785183, 0.2500000000077942], [74.43393492132985, 0.32694538121396904, 0.7798801680576662]], "peak_params_": [[8.509866057788132, 0.428873350970455, 0.5985992431835098], [12.427715300977287, 0.4566808434194912, 4.818394541802759], [44.356096982506344, 0.18054622248492702, 0.5606613831559452], [52.78259473927576, 0.1929013507316515, 1.6064169085785303], [58.50855094183497, 0.21290098967952553, 3.1233121958357155], [61.93975267018758, 0.2948974117001655, 1.6429581606970178], [69.93588524441347, 0.2615705240664856, 0.5000000000155884], [74.43393492132985, 0.2800577413096117, 1.5597603361153325]], "r_squared_": 0.9438994008648314, "error_": 0.05418901114824937}
{"freq_range": [2.0, 80.0], "freq_res": 1.0, "aperiodic_params_": [-0.6402248241427408, 0.5478740217807351], "gaussian_params_": [[8.622962609090271, 0.9387434413582374, 0.3408369519612208], [10.657360349575928, 0.5386904412271631, 1.0649307754896111], [13.682002892983544, 0.244500126404986, 0.8331185747315158], [17.109196836550748, 0.17090860115579548, 0.5911657420323395], [26.536760693351145, 0.1470120259584149, 2.411772462427091], [43.70453422007891, 0.42268421365328585, 0.2677350646037312], [49.13048666017736, 0.14208493286955956, 1.8117993520011269], [61.45203459936508, 0.07756429383376476, 3.9357889668556183], [65.99254019885633, 0.12589435903738147, 0.25000543948437554]], "peak_params_": [[8.622962609090271, 0.6695918251858227, 0.6816739039224416], [10.657360349575928, 0.51289030329649, 2.1298615509792223], [13.682002892983544, 0.23123092820933078, 1.6662371494630317], [17.109196836550748, 0.16816475927886532, 1.182331484064679], [26.536760693351145, 0.14432506341071316, 4.823544924854182], [43.70453422007891, 0.23249210651886387, 0.5354701292074624], [49.13048666017736, 0.14223703627769324, 3.6235987040022537], [61.45203459936508, 0.07705439957445082, 7.871577933711237], [65.99254019885633, 0.1656225221848362, 0.5000108789687511]], "r_squared_": 0.9293578080044094, "error_": 0.04768169876840405}
