{"freq_range": [2.0, 80.0], "freq_res": 1.0, "aperiodic_params_": [-0.3097564898374411, 0.10009337759434904], "gaussian_params_": [[13.589214426654316, 0.6965269344125391, 0.25021656413066723], [24.25695824273856, 0.2870987360886596, 2.2167192079461686], [28.747550125885347, 0.2788693004740843, 1.0154042835705686], [31.062118523617166, 0.3850073281607001, 4.517711127203738], [40.90777611912132, 0.11625349857505989, 0.42384071681906565], [47.111487353744806, 0.1636031928859569, 1.5730637062035435], [51.52499939739702, 1.0102830121540338, 0.28410684696871813], [55.31589156270742, 0.20612401349392317, 1.4202190200021667], [58.57127433119952, 0.4530750805505864, 0.31615693762764485], [60.592282057005775, 0.552157834139106, 0.25487656895145305]], "peak_params_": [[13.589214426654316, 0.18131180204756334, 0.5004331282613345], [24.25695824273856, 0.39864173060097996, 4.433438415892337], [28.747550125885347, 0.6464002842283862, 2.030808567141137], [31.062118523617166, 0.4115972194826323, 9.035422254407475], [40.90777611912132, 0.1478736306005623, 0.8476814336381313], [47.111487353744806, 0.16395647101188893, 3.146127412407087], [51.52499939739702, 0.26454106396746047, 0.5682136939374363], [55.31589156270742, 0.20108868019117465, 2.8404380400043334], [58.57127433119952, 0.18778755782282164, 0.6323138752552897], [60.592282057005775, 0.15367050726102233, 0.5097531379029061]], "r_squared_": 0.8350287829978975, "error_": 0.044027682946672794}
{"freq_range": [2.0, 80.0], "freq_res": 1.0, "aperiodic_params_": [-0.33984141008168434, 0.0840623249492477], "gaussian_params_": [[14.209160376959746, 0.18752140165122222, 0.2500077122692441], [28.429813776009826, 0.45902706440010466, 3.5379027450743212], [48.93723843087818, 0.1276313576692552, 0.5291595089779613], [53.67277767482098, 0.1947586838873639, 1.8647943187483618], [58.531373910175894, 0.8386289949456976, 0.2732586065827396], [62.76991489846145, 0.12430868294061508, 1.5156877969839868]], "peak_params_": [[14.209160376959746, 0.13226108135363646, 0.5000154245384882], [28.429813776009826, 0.45565204959984273, 7.0758054901486425], [48.93723843087818, 0.13517085257607153, 1.0583190179559225], [53.67277767482098, 0.19178324499447147, 3.7295886374967235], [58.531373910175894, 0.20164846698718908, 0.5465172131654792], [62.76991489846145, 0.12288533881970704, 3.0313755939679736]], "r_squared_": 0.6546135426442178, "error_": 0.05200384518225569}
{"freq_range": [2.0, 80.0], "freq_res": 1.0, "aperiodic_params_": [-0.4450432812398649, -0.15428321251076196], "gaussian_params_": [[29.486937611919352, 0.6769034943728214, 5.445179609098383]], "peak_params_": [[29.486937611919352, 0.6742023299548943, 10.890359218196766]], "r_squared_": 0.7383428542781542, "error_": 0.08733679911368648}
{"freq_range": [2.0, 80.0], "freq_res": 1.0, "aperiodic_params_": [-0.20062325565441824, 0.005243543047856236], "gaussian_params_": [[17.603369880948584, 0.4748254675714205, 0.2500045168994764], [25.871414513776354, 0.42635965707031925, 4.0802758085776], [46.54796540086398, 0.1458963821249402, 5.999999999999821]], "peak_params_": [[17.603369880948584, 0.20121340928814685, 0.5000090337989528], [25.871414513776354, 0.4265622578476207, 8.1605516171552], [46.54796540086398, 0.14548355812298136, 11.999999999999641]], "r_squared_": 0.5790192053093769, "error_": 0.06319030044569708}
{"freq_range": [2.0, 80.0], "freq_res": 1.0, "aperiodic_params_": [-0.21759599726249784, 0.024290740622472384], "gaussian_params_": [[14.267721655991199, 0.24529616202447002, 0.267124449171609], [16.569629583500657, 0.4238428597022699, 0.31629057740823285], [19.297582521902157, 0.15703427867623454, 1.1177197991947414], [26.239730013578118, 0.3463586424846284, 3.777449084683243], [42.027209292545436, 0.21017132792211204, 0.25000242739675504], [44.64847910887653, 0.15788004489246033, 0.7476895864733551], [49.22962337736177, 0.1715556216635409, 2.574130069415685], [56.747890368146216, 0.21247928698344903, 0.7878903808022163], [72.01431729521131, 0.14837083222968386, 0.25004358532307563]], "peak_params_": [[14.267721655991199, 0.1502675635503494, 0.534248898343218], [16.569629583500657, 0.2043225884293547, 0.6325811548164657], [19.297582521902157, 0.2067605835729513, 2.235439598389483], [26.239730013578118, 0.3456618477289748, 7.554898169366486], [42.027209292545436, 0.21260840816841067, 0.5000048547935101], [44.64847910887653, 0.18583981264603638, 1.4953791729467103], [49.22962337736177, 0.1708744208233173, 5.14826013883137], [56.747890368146216, 0.20367724912118793, 1.5757807616044326], [72.01431729521131, 0.14812780600567968, 0.5000871706461513]], "r_squared_": 0.562292193053379, "error_": 0.047896155159258096}
{"freq_range": [2.0, 80.0], "freq_res": 1.0, "aperiodic_params_": [-0.2604630383510878, 0.35601220650377585], "gaussian_params_": [[11.971042713104996, 0.22492689998425666, 1.7461771250527494], [23.814208590975884, 0.1532462150922054, 4.599370049651942], [29.85393738265681, 0.27415626589427194, 2.1517008782351477], [49.63360588529171, 1.0110067727227547, 0.27105530074669654], [54.44712454868051, 0.999131875257935, 0.292115917325549], [61.39858258867131, 0.7938715182738236, 0.2502102838847894], [64.08194253428093, 0.21809682491250496, 0.7896550640394073], [68.66982739942291, 0.24159144680189681, 0.9147973824275349], [71.81364563204164, 0.2862613102884139, 0.5015028863288653]], "peak_params_": [[11.971042713104996, 0.23055382420682824, 3.4923542501054987], [23.814208590975884, 0.15989353647515114, 9.198740099303883], [29.85393738265681, 0.3355566301991024, 4.303401756470295], [49.63360588529171, 0.4054965226184805, 0.5421106014933931], [54.44712454868051, 0.30965417488814473, 0.584231834651098], [61.39858258867131, 0.22331723427963657, 0.5004205677695788], [64.08194253428093, 0.21692625337616778, 1.5793101280788147], [68.66982739942291, 0.22635738009900042, 1.8295947648550699], [71.81364563204164, 0.2674847753292984, 1.0030057726577306]], "r_squared_": 0.760016397714966, "error_": 0.057651031695477084}
{"freq_range": [2.0, 80.0], "freq_res": 1.0, "aperiodic_params_": [-0.18447927920317816, 0.20488693288733198], "gaussian_params_": [[10.937568749954096, 0.1585968360400934, 1.431459191452709], [25.11115090732664, 0.3096281449692939, 3.5688204309334135], [29.47005767593308, 0.7270975593043217, 0.3121349264945646], [31.60971009194239, 0.3333488744243907, 0.44393967161637654], [34.021514431964064, 0.250740731174476, 0.34662156082753337], [48.60597221719014, 0.5520722750813175, 0.3094273535914665], [65.7582984261841, 0.2954127534664962, 0.6181829169864752], [68.61910717717002, 0.8688054704219343, 0.27977554182048847], [72.42837027133874, 0.2699840138778504, 0.6792607824075136], [76.44721685634171, 0.1739748831673386, 1.1929731462214899]], "peak_params_": [[10.937568749954096, 0.15857078472685482, 2.862918382905418], [25.11115090732664, 0.30947801003672987, 7.137640861866827], [29.47005767593308, 0.4049570872412399, 0.6242698529891292], [31.60971009194239, 0.2745541286686709, 0.8878793432327531], [34.021514431964064, 0.26418199550001054, 0.6932431216550667], [48.60597221719014, 0.2454008222841388, 0.618854707182933], [65.7582984261841, 0.2736741236767114, 1.2363658339729504], [68.61910717717002, 0.3439121851875205, 0.5595510836409769], [72.42837027133874, 0.22146459569746324, 1.3585215648150273], [76.44721685634171, 0.16217023680479337, 2.3859462924429797]], "r_squared_": 0.7100905110006007, "error_": 0.052104081449720833}
{"freq_range": [2.0, 80.0], "freq_res": 1.0, "aperiodic_params_": [-0.36943406359520903, -0.17344719860160113], "gaussian_params_": [[23.820651179616767, 0.38130424535299534, 3.4349864783995705], [30.72734101314044, 0.3794243790589108, 2.9718823466784148]], "peak_params_": [[23.820651179616767, 0.41005504475381616, 6.869972956799141], [30.72734101314044, 0.42075392659024624, 5.9437646933568296]], "r_squared_": 0.6222291591222826, "error_": 0.07682020896980785}
{"freq_range": [2.0, 80.0], "freq_res": 1.0, "aperiodic_params_": [0.11539266099965799, 0.36605657617729837], "gaussian_params_": [[26.742735056191147, 0.3916115360786384, 5.892225239348269], [29.706771396249657, 0.2166162321546182, 1.050699450109955]], "peak_params_": [[26.742735056191147, 0.3990830241666192, 11.784450478696538], [29.706771396249657, 0.544464168929792, 2.10139890021991]], "r_squared_": 0.8614376780974905, "error_": 0.05969346204428024}
{"freq_range": [2.0, 80.0], "freq_res": 1.0, "aperiodic_params_": [0.5014148428211266, 0.8595834581261198], "gaussian_params_": [[11.699648096751405, 0.19260449386570183, 1.8585271284109872], [13.675702417049322, 0.45594239129501357, 0.2500120654795637], [17.01297371256536, 0.2249498628642467, 1.2400925011164072], [20.812329306786765, 0.20034304057221433, 0.612705345983005], [28.740415754658223, 0.6558485211563088, 3.341301292198498], [65.40289448062742, 0.6634011711396478, 0.2549832470408531]], "peak_params_": [[11.699648096751405, 0.19017167188948872, 3.7170542568219744], [13.675702417049322, 0.297916713357497, 0.5000241309591275], [17.01297371256536, 0.22960486676408493, 2.4801850022328145], [20.812329306786765, 0.23726295893417415, 1.22541069196601], [28.740415754658223, 0.6538722625119192, 6.682602584396996], [65.40289448062742, 0.19038532984342416, 0.5099664940817062]], "r_squared_": 0.9750212980513616, "error_": 0.04500471417269094}
{"freq_range": [2.0, 80.0], "freq_res": 1.0, "aperiodic_params_": [0.5518787382258667, 0.9238723482190653], "gaussian_params_": [[9.02465069835358, 0.15622035498757963, 0.5026304929190264], [11.727249430578869, 0.23589254287947808, 1.0516220069006774], [13.729979390376156, 0.35472530409015307, 0.4026619014195353], [16.991195925612246, 0.25451413529016637, 1.5319406641083746], [20.59893297766038, 0.5364119658862697, 0.2824087074540261], [22.999614379997446, 0.11490886893973173, 1.0489325474662072], [28.796348186034734, 0.6775779422609706, 2.8615331444402288]], "peak_params_": [[9.02465069835358, 0.16420382618247106, 1.0052609858380528], [11.727249430578869, 0.22938610160565553, 2.103244013801355], [13.729979390376156, 0.3439583668418265, 0.8053238028390706], [16.991195925612246, 0.25464903571921005, 3.063881328216749], [20.59893297766038, 0.23920416809255096, 0.5648174149080522], [22.999614379997446, 0.20211812413948704, 2.0978650949324145], [28.796348186034734, 0.6758641578912862, 5.7230662888804575]], "r_squared_": 0.9788626945422696, "error_": 0.045654412046814134}
{"freq_range": [2.0, 80.0], "freq_res": 1.0, "aperiodic_params_": [0.492543278669433, 0.8306608162088225], "gaussian_params_": [[9.363141280967742, 0.36290720055956516, 0.27386690219025406], [11.777610524502428, 0.21233702370700405, 0.9456081274038305], [13.941374310172613, 0.2812176449658222, 0.5654716014776824], [17.029134113719135, 0.2691714172964215, 1.3090156797358097], [20.875157221432026, 0.25955237685916316, 0.749515599664136], [23.41311308656946, 0.440541407203997, 0.2920614855262055], [24.53343496210121, 0.821061338053183, 0.2673290964750903], [28.8870771132258, 0.6667543445464128, 2.763395178741706], [50.26425122752969, 0.15214019408026197, 0.642145376006276], [68.27775174990089, 0.24535813673038526, 0.6602167750921599], [71.581460546327, 0.7925049153899392, 0.25295345241684886]], "peak_params_": [[9.363141280967742, 0.15350282942963428, 0.5477338043805081], [11.777610524502428, 0.20748856750545244, 1.891216254807661], [13.941374310172613, 0.3116288815047405, 1.1309432029553648], [17.029134113719135, 0.2691692973696587, 2.6180313594716194], [20.875157221432026, 0.2700318844451903, 1.499031199328272], [23.41311308656946, 0.23561682402123707, 0.584122971052411], [24.53343496210121, 0.42695947663561656, 0.5346581929501806], [28.8870771132258, 0.6661978863777168, 5.526790357483412], [50.26425122752969, 0.13978854862079682, 1.284290752012552], [68.27775174990089, 0.22457856536491616, 1.3204335501843198], [71.581460546327, 0.20160912682898835, 0.5059069048336977]], "r_squared_": 0.9777252431278624, "error_": 0.03729503255893401}
{"freq_range": [2.0, 80.0], "freq_res": 1.0, "aperiodic_params_": [0.05474486640287354, 0.2584440110361962], "gaussian_params_": [[13.952570153270441, 0.18449358794726314, 0.4964564511210374], [17.062351720484514, 0.21149524372531184, 1.1623514251186655], [20.937886278396004, 0.46143597468929115, 1.2844399352715412], [24.44210055365584, 0.3361068796552566, 1.1358180324396137], [28.500043569890405, 0.41403383862826454, 2.4910516283598256], [40.42693459706705, 0.639329397551655, 0.2641524812967074], [44.532261240417476, 0.13124109915533377, 2.251775155326453], [50.153589084036, 0.2176059089719424, 0.7836872699041039], [68.48035286946315, 0.7348188939800379, 0.26887526384414906]], "peak_params_": [[13.952570153270441, 0.19023089668335905, 0.9929129022420748], [17.062351720484514, 0.21539913301597993, 2.324702850237331], [20.937886278396004, 0.4694363313104568, 2.5688798705430824], [24.44210055365584, 0.4194836494088108, 2.2716360648792273], [28.500043569890405, 0.4058855121282014, 4.982103256719651], [40.42693459706705, 0.19049707867962237, 0.5283049625934148], [44.532261240417476, 0.12844005319929422, 4.503550310652906], [50.153589084036, 0.2203492477367229, 1.5673745398082077], [68.48035286946315, 0.1489759719695697, 0.5377505276882981]], "r_squared_": 0.8525600098067516, "error_": 0.04340382057175767}
{"freq_range": [2.0, 80.0], "freq_res": 1.0, "aperiodic_params_": [-0.008817495690018606, 0.270252316243898], "gaussian_params_": [[27.64516250567717, 0.40247261986529137, 3.6851699632848405], [49.5292969222008, 2.6254774459162395, 0.2645386714210937], [54.495047957984724, 1.838035820919273, 0.2646366087152964], [68.67713369447414, 0.4294618771071674, 0.5766886583227853], [71.59484025653612, 1.504168325166822, 0.25592078123956685], [75.4059948647842, 1.4574143381115334, 0.25000332459217994]], "peak_params_": [[27.64516250567717, 0.40061120117686105, 7.370339926569681], [49.5292969222008, 0.5391535700919575, 0.5290773428421874], [54.495047957984724, 0.31949713350140946, 0.5292732174305927], [68.67713369447414, 0.3671645137498888, 1.1533773166455705], [71.59484025653612, 0.42958567436481987, 0.5118415624791337], [75.4059948647842, 0.38986462859223586, 0.5000066491843599]], "r_squared_": 0.6987904236979523, "error_": 0.07274892086843189}
{"freq_range": [2.0, 80.0], "freq_res": 1.0, "aperiodic_params_": [-0.23750335712560044, 0.055902826316131075], "gaussian_params_": [[11.32989656557315, 0.2532215463998508, 1.4769820168413257], [25.357139400919156, 0.2356718462445297, 2.34279924469981], [28.559315010609797, 0.6099497708325, 0.3286240245814727], [31.049249163449694, 0.35510448585453763, 1.0223978339927202], [56.54796540086403, 0.1147324996079166, 5.999999999999999], [61.69108804005534, 0.2217612371223247, 0.40624127417724615]], "peak_params_": [[11.32989656557315, 0.24698318766394092, 2.9539640336826514], [25.357139400919156, 0.23294950300456677, 4.68559848939962], [28.559315010609797, 0.36619913563743695, 0.6572480491629454], [31.049249163449694, 0.36766472545698164, 2.0447956679854404], [56.54796540086403, 0.11440735152497589, 11.999999999999998], [61.69108804005534, 0.24200879408788883, 0.8124825483544923]], "r_squared_": 0.516982766736755, "error_": 0.05070766504552907}
{"freq_range": [2.0, 80.0], "freq_res": 1.0, "aperiodic_params_": [-0.2617523442448605, -0.009980972776812091], "gaussian_params_": [[9.372876882949594, 0.4326401713931782, 0.26931458908392264], [11.425043715874601, 0.5375058305190542, 0.31884630411430986], [16.470170649796025, 0.6665551620134449, 0.2841769018935736], [17.74073781015339, 0.2826155326740954, 0.2502673541324738], [20.30708271068015, 0.37900775818038435, 0.2604193789864747], [23.694239230723056, 0.5193123153385183, 2.1912505969157356], [30.140271396806302, 0.239562438359034, 2.9481234398849976], [40.9687546739531, 0.2093164998584105, 0.6494686004537698], [46.70971549553978, 0.1883059894798714, 3.2463186006470197], [53.527486305065715, 0.46277841512350926, 0.28206804761908366], [54.095617757661614, 0.062031959445161766, 4.350824420114674], [75.97621013675989, 0.1597575035649865, 0.25000000000000006]], "peak_params_": [[9.372876882949594, 0.16590752365549358, 0.5386291781678453], [11.425043715874601, 0.22105354971282973, 0.6376926082286197], [16.470170649796025, 0.17069330837761823, 0.5683538037871472], [17.74073781015339, 0.18305148574848532, 0.5005347082649476], [20.30708271068015, 0.3151366033580186, 0.5208387579729494], [23.694239230723056, 0.5416620022928321, 4.382501193831471], [30.140271396806302, 0.24755593261451783, 5.896246879769995], [40.9687546739531, 0.25011244865220106, 1.2989372009075395], [46.70971549553978, 0.20396294664932918, 6.492637201294039], [53.527486305065715, 0.19090939056957776, 0.5641360952381673], [54.095617757661614, 0.19090939056957776, 8.701648840229348], [75.97621013675989, 0.1590360052037882, 0.5000000000000001]], "r_squared_": 0.7492955944411018, "error_": 0.045377502825838356}
{"freq_range": [2.0, 80.0], "freq_res": 1.0, "aperiodic_params_": [0.1474985042618209, 0.45900259397529924], "gaussian_params_": [[25.885640437028805, 0.3981626992483793, 5.211674071479477], [32.03142200386784, 0.16910426686462338, 2.69635665848293], [48.79903088545427, 0.41411344133440003, 0.5039775532125722], [59.49876866301253, 0.7902856398871225, 0.5489844364844273], [63.547504810899895, 0.6817487909098876, 0.402551836970306], [65.50670683584714, 0.9639020467356288, 0.5344145226738499], [67.80125310579338, 0.4506295623114955, 0.2681631156901548], [70.6722971709045, 0.5849085707145194, 0.7912071317660809], [73.57677663492824, 1.2923017381540514, 0.26272585760238454], [78.34404275145886, 0.7218593514861442, 0.5096229454445317]], "peak_params_": [[25.885640437028805, 0.4119226412769579, 10.423348142958954], [32.03142200386784, 0.36916058174429534, 5.39271331696586], [48.79903088545427, 0.3824846501839573, 1.0079551064251444], [59.49876866301253, 0.5230522413443282, 1.0979688729688546], [63.547504810899895, 0.3805665440241702, 0.805103673940612], [65.50670683584714, 0.6295314956201901, 1.0688290453476998], [67.80125310579338, 0.3443748716574887, 0.5363262313803095], [70.6722971709045, 0.5368306407065866, 1.5824142635321619], [73.57677663492824, 0.3531631444752409, 0.5254517152047691], [78.34404275145886, 0.5747615223058701, 1.0192458908890634]], "r_squared_": 0.8391980301975985, "error_": 0.06784843449580467}
{"freq_range": [2.0, 80.0], "freq_res": 1.0, "aperiodic_params_": [0.4534027380916316, 0.7943483629771633], "gaussian_params_": [[11.411521403560702, 0.21157598325029636, 1.4086228564409264], [13.618206959892692, 0.36855028065675244, 0.2740693300136324], [20.552440782627684, 0.19666605385007652, 5.011455882435815], [29.450100931025247, 0.5861496207049133, 3.3624361135992693], [48.94820411421903, 0.19280035743223947, 0.25000656955552547], [59.353948570828685, 0.28380629025875104, 0.7708687252091099], [65.36412771808163, 0.3748440266894279, 0.6375343511034658], [68.04807086532196, 0.2037398437635206, 0.5618549546630837], [70.37702641847743, 0.2927993591910812, 0.7649777739493825], [73.98269170426886, 0.17878648038142841, 0.2500009725968275], [77.96356407700053, 0.24100191081364986, 0.25000725099756865]], "peak_params_": [[11.411521403560702, 0.23470919648999453, 2.817245712881853], [13.618206959892692, 0.26244620524505946, 0.5481386600272647], [20.552440782627684, 0.22080573628580008, 10.02291176487163], [29.450100931025247, 0.6284248149751067, 6.724872227198539], [48.94820411421903, 0.18870672690951695, 0.5000131391110509], [59.353948570828685, 0.25541254682904135, 1.5417374504182197], [65.36412771808163, 0.31843046576913236, 1.2750687022069316], [68.04807086532196, 0.20541211168655538, 1.1237099093261673], [70.37702641847743, 0.2597999604956178, 1.529955547898765], [73.98269170426886, 0.1783624579058265, 0.500001945193655], [77.96356407700053, 0.238456014160924, 0.5000145019951373]], "r_squared_": 0.9737859622524352, "error_": 0.04177446201763157}
{"freq_range": [2.0, 80.0], "freq_res": 1.0, "aperiodic_params_": [0.6449520615983442, 0.9821708506178687], "gaussian_params_": [[11.71540892632256, 0.2466211231767778, 1.8468558082295121], [13.637082978840594, 0.5341015903097018, 0.2707503461053593], [16.749899888325835, 0.24725414993042674, 1.1154559018811474], [21.168640643983984, 0.1895621453550973, 2.197012930307327], [29.147790119778083, 0.6808586997765982, 3.2219131713871314], [65.32730110178642, 0.4580289100965394, 0.2586887402958765], [69.23538096060062, 0.1412794398812155, 1.6866855765666382]], "peak_params_": [[11.71540892632256, 0.24377076735410877, 3.6937116164590242], [13.637082978840594, 0.34503384215557253, 0.5415006922107186], [16.749899888325835, 0.2771183173934292, 2.230911803762295], [21.168640643983984, 0.21699980732232615, 4.394025860614654], [29.147790119778083, 0.680472908542685, 6.443826342774263], [65.32730110178642, 0.21175990832911396, 0.517377480591753], [69.23538096060062, 0.13991041724927866, 3.3733711531332764]], "r_squared_": 0.9806905753487393, "error_": 0.0464527860753506}
{"freq_range": [2.0, 80.0], "freq_res": 1.0, "aperiodic_params_": [0.6996776388966628, 1.0404928525918375], "gaussian_params_": [[9.059304338217864, 0.17239664159856988, 0.6699662562224945], [11.647281120672245, 0.27865996422576306, 0.9036169201425168], [13.589055071203411, 0.7946364388264179, 0.29769494458997303], [16.984292276010656, 0.2899481612964687, 1.6964872318653959], [21.18700127067275, 0.24862568218997477, 0.675191311554856], [23.326235949995482, 0.2363088545171385, 0.3724134111386], [24.538488827416987, 0.413021310540536, 0.2966820593635016], [28.999745872109777, 0.6873966940551248, 2.817886685181999], [36.22941132428166, 0.14146142266355377, 0.6018906725906126], [57.89504942270977, 0.15230890169818628, 0.5127016579870342], [64.98279293675134, 0.13120149743941567, 0.25000000000000083], [68.43378259562354, 0.12718223565376793, 1.1844357140696617], [71.9181486089778, 0.1272974599219836, 0.250000086351765]], "peak_params_": [[9.059304338217864, 0.17554062816908272, 1.339932512444989], [11.647281120672245, 0.26210305424133185, 1.8072338402850336], [13.589055071203411, 0.37757457640066105, 0.5953898891799461], [16.984292276010656, 0.2900150692614721, 3.3929744637307917], [21.18700127067275, 0.26909700862666114, 1.350382623109712], [23.326235949995482, 0.2395592894232117, 0.7448268222772], [24.538488827416987, 0.3742101608729855, 0.5933641187270032], [28.999745872109777, 0.6873966912634907, 5.635773370363998], [36.22941132428166, 0.16296363212036025, 1.2037813451812251], [57.89504942270977, 0.14915103389997497, 1.0254033159740683], [64.98279293675134, 0.13279378021094645, 0.5000000000000017], [68.43378259562354, 0.11893257132158519, 2.3688714281393235], [71.9181486089778, 0.12202162718385678, 0.50000017270353]], "r_squared_": 0.9896003740606497, "error_": 0.03185979350957012}
{"freq_range": [2.0, 80.0], "freq_res": 1.0, "aperiodic_params_": [0.6111167299919638, 0.9614915559371655], "gaussian_params_": [[14.808201940596447, 0.2960782335689888, 3.9740361930126746], [20.645866057641868, 0.3881757763863074, 0.2508014684940798], [28.55227130982351, 0.6332961269275708, 3.475879194329675], [68.47663623039062, 0.17325684698524554, 0.8807200215423933], [71.60825040206987, 0.8639337283916017, 0.250587186919971]], "peak_params_": [[14.808201940596447, 0.2960502571714481, 7.948072386025349], [20.645866057641868, 0.29097279928579517, 0.5016029369881596], [28.55227130982351, 0.6285676710468655, 6.95175838865935], [68.47663623039062, 0.14965493970809884, 1.7614400430847865], [71.60825040206987, 0.25460897600956667, 0.501174373839942]], "r_squared_": 0.9806533524436459, "error_": 0.04549038674586608}
{"freq_range": [2.0, 80.0], "freq_res": 1.0, "aperiodic_params_": [0.3518317959761096, 0.7070851290834684], "gaussian_params_": [[14.809620093230155, 0.30318220017585673, 3.9170752299346945], [20.85700466329222, 0.190238732454969, 1.0555443341131205], [24.18576865341147, 0.2632908495532718, 0.9304334883923021], [29.151184250470443, 0.5960830762196064, 3.0668944617597838], [50.4667232052513, 1.2626842145155612, 0.26923160080428604], [68.53572547327087, 1.2097929225132247, 0.28267952544941655], [71.87120204424487, 0.49495487016641254, 0.5944937298517288]], "peak_params_": [[14.809620093230155, 0.30283855508549323, 7.834150459869389], [20.85700466329222, 0.29365517169189465, 2.111088668226241], [24.18576865341147, 0.4251403525714026, 1.8608669767846042], [29.151184250470443, 0.5957880909471246, 6.1337889235195675], [50.4667232052513, 0.2810178246280314, 0.5384632016085721], [68.53572547327087, 0.31402400956783405, 0.5653590508988331], [71.87120204424487, 0.4834740545602482, 1.1889874597034575]], "r_squared_": 0.9558282136044456, "error_": 0.05270083792409417}
{"freq_range": [2.0, 80.0], "freq_res": 1.0, "aperiodic_params_": [-0.04987737044719365, 0.2856319262589542], "gaussian_params_": [[13.636377792291427, 0.2448290569472866, 3.3428994243763683], [28.29437321538292, 0.2617769762631111, 4.240830797075134], [45.52459112636918, 1.6571877603680472, 0.25000000000000006], [49.62770343958234, 1.063247523926371, 0.25000000000000006], [54.11910997613486, 0.3090676929024158, 0.509109262726935], [69.03589770361741, 0.20994788055788333, 0.8812952822900915], [72.36447773241092, 0.3576087447854618, 0.5850668683273212], [79.99999999999999, 0.21694152431359628, 2.504305171201716]], "peak_params_": [[13.636377792291427, 0.24427794407898548, 6.685798848752737], [28.29437321538292, 0.26117105505993826, 8.481661594150268], [45.52459112636918, 0.2717619670639547, 0.5000000000000001], [49.62770343958234, 0.3508107495621358, 0.5000000000000001], [54.11910997613486, 0.3007238061565385, 1.01821852545387], [69.03589770361741, 0.2097878290501542, 1.762590564580183], [72.36447773241092, 0.29658769756507974, 1.1701337366546425], [79.99999999999999, 0.21694152431359626, 5.008610342403432]], "r_squared_": 0.6911941832676753, "error_": 0.0651899875876622}
{"freq_range": [2.0, 80.0], "freq_res": 1.0, "aperiodic_params_": [-0.059199863444555245, 0.27543356105804806], "gaussian_params_": [[12.52640548596517, 0.3345312853940527, 2.4279686276610897], [21.59794658508731, 0.15906188919350567, 1.0856864928197256], [25.095245118441895, 0.2464929062383069, 1.0954466253706965], [28.616780955322234, 0.30682317503343015, 1.8344687391046577], [47.86848462512523, 0.14394818429100706, 2.1284609770489937], [53.620573458010796, 0.15637678234129898, 1.7256332819508997], [70.45203459913596, 0.09298194816140476, 5.417767061388663]], "peak_params_": [[12.52640548596517, 0.32822738253857303, 4.855937255322179], [21.59794658508731, 0.15369655693538525, 2.1713729856394512], [25.095245118441895, 0.2906726037908646, 2.190893250741393], [28.616780955322234, 0.30063026971980117, 3.6689374782093154], [47.86848462512523, 0.14446816271761675, 4.2569219540979875], [53.620573458010796, 0.15583756259452008, 3.4512665639017994], [70.45203459913596, 0.09265886395567441, 10.835534122777325]], "r_squared_": 0.7775555346374665, "error_": 0.05492782947409078}
{"freq_range": [2.0, 80.0], "freq_res": 1.0, "aperiodic_params_": [-0.20218230468031784, 0.23061455917004542], "gaussian_params_": [[11.12675530615122, 0.34559104990514483, 1.438834853816959], [13.730447889405879, 0.3310991901759411, 0.2500271772158986], [16.951739049540606, 0.2042234797738118, 1.2365860529778148], [19.6611666237212, 0.5904338134238477, 0.2664435274108199], [23.242396755362726, 0.35822368752698464, 1.6888010802687419], [25.698908786927053, 0.20863405393157214, 0.4477349756986533], [28.666401815467456, 0.23424477711767902, 1.9819087817210943], [31.566463589603913, 0.39288871746740656, 0.3226207513878423], [34.09095403858111, 0.18955802732746482, 0.4960778793766816], [41.076562167625575, 0.1480368750893129, 0.4784070330506565], [46.27867953228872, 0.23452443781864618, 0.5276301513222065], [48.97344714996504, 0.26981953095338596, 0.5180727128156339]], "peak_params_": [[11.12675530615122, 0.3442545095208729, 2.877669707633918], [13.730447889405879, 0.24405589799047359, 0.5000543544317972], [16.951739049540606, 0.20453787714329036, 2.4731721059556295], [19.6611666237212, 0.32954747892884373, 0.5328870548216398], [23.242396755362726, 0.3584863661817958, 3.3776021605374837], [25.698908786927053, 0.3556180172648604, 0.8954699513973066], [28.666401815467456, 0.23202186041850303, 3.9638175634421886], [31.566463589603913, 0.2162295574711044, 0.6452415027756846], [34.09095403858111, 0.1926652370381402, 0.9921557587533631], [41.076562167625575, 0.1461532464800288, 0.956814066101313], [46.27867953228872, 0.20399122883686704, 1.055260302644413], [48.97344714996504, 0.26946576380884096, 1.0361454256312679]], "r_squared_": 0.8405828849655183, "error_": 0.0429303366492707}
{"freq_range": [2.0, 80.0], "freq_res": 1.0, "aperiodic_params_": [-0.059336458859799074, 0.2703704615669926], "gaussian_params_": [[11.813303245076641, 0.2521686146680845, 1.5674083315879572], [19.647987098149148, 0.45768173500084264, 0.25002953533436684], [26.09229582858739, 0.274395423822001, 4.042908410719175], [48.60849979466774, 0.9546810729873225, 0.26754900031566564], [59.67279556967138, 0.2968906472444786, 1.0894076684815384], [65.26228569416112, 0.35662877334823, 0.7380846279619636], [70.13494332791115, 0.24211692211950114, 1.5219290128299854], [73.68329725144477, 0.29817795153072946, 0.5089894353076364], [77.5192851959542, 0.6838847720994277, 0.3053516799385907]], "peak_params_": [[11.813303245076641, 0.2510171270716033, 3.1348166631759145], [19.647987098149148, 0.25804478926946933, 0.5000590706687337], [26.09229582858739, 0.27432393031102487, 8.08581682143835], [48.60849979466774, 0.3272672780833627, 0.5350980006313313], [59.67279556967138, 0.28379682808569934, 2.1788153369630767], [65.26228569416112, 0.33562593064173074, 1.4761692559239272], [70.13494332791115, 0.2411670706140449, 3.0438580256599708], [73.68329725144477, 0.25532845184926845, 1.0179788706152728], [77.5192851959542, 0.1980625559102389, 0.6107033598771814]], "r_squared_": 0.7237646239649214, "error_": 0.05645397653600011}
{"freq_range": [2.0, 80.0], "freq_res": 1.0, "aperiodic_params_": [0.43442116704611805, 0.8156032503450797], "gaussian_params_": [[12.109459553597222, 0.34206177186965514, 1.8623937715342098], [16.442141346135966, 0.46792043824584767, 0.28889873008488387], [19.606615414374563, 0.25609092710055625, 2.9810334664926925], [29.146327750806236, 0.5027221611074589, 3.363233105195711], [48.96022660609194, 0.26661860624891165, 0.2500000000000007], [59.633926266457244, 0.3220987538749905, 0.918996315525983], [65.34108371702142, 0.38101067697199, 0.7719096381524093], [67.62930431777745, 0.47291644262866656, 0.29088674993766117], [70.31212042792242, 0.3535554785052482, 0.8722504952561866], [73.65251858198667, 0.6657965299583086, 0.2642831680102349], [77.63060585801996, 0.6173280557664197, 0.2679095924303762]], "peak_params_": [[12.109459553597222, 0.3513477720147961, 3.7247875430684196], [16.442141346135966, 0.30707946622665533, 0.5777974601697677], [19.606615414374563, 0.2663698718784416, 5.962066932985385], [29.146327750806236, 0.5040343534448141, 6.726466210391422], [48.96022660609194, 0.26326572018746164, 0.5000000000000014], [59.633926266457244, 0.29753161508946824, 1.837992631051966], [65.34108371702142, 0.34557264883313743, 1.5438192763048186], [67.62930431777745, 0.22150613411496678, 0.5817734998753223], [70.31212042792242, 0.33162938295366917, 1.7445009905123732], [73.65251858198667, 0.28056083275505994, 0.5285663360204698], [77.63060585801996, 0.23861558351478807, 0.5358191848607524]], "r_squared_": 0.9696204739106459, "error_": 0.0453593852829629}
{"freq_range": [2.0, 80.0], "freq_res": 1.0, "aperiodic_params_": [0.6589578594113398, 1.0147493228297284], "gaussian_params_": [[11.651725949068785, 0.284226877380943, 1.7366760680038265], [13.619028679804197, 0.6084588682498594, 0.28098034775303604], [16.711659005506856, 0.2586632686641187, 1.2272272291103836], [20.941388461174164, 0.21579118144821413, 2.7219076274760035], [29.19312841947341, 0.5722785966691956, 2.8868960893746607], [65.03502914142506, 0.18375843888531448, 0.25000088109673424], [69.16068123957403, 0.12159532605743904, 1.9464292597826802]], "peak_params_": [[11.651725949068785, 0.27971063546159014, 3.473352136007653], [13.619028679804197, 0.38748475337882227, 0.5619606955060721], [16.711659005506856, 0.3298121625940405, 2.4544544582207672], [20.941388461174164, 0.22651846075297588, 5.443815254952007], [29.19312841947341, 0.5736949671677931, 5.773792178749321], [65.03502914142506, 0.19434289757781853, 0.5000017621934685], [69.16068123957403, 0.12118170724209976, 3.8928585195653604]], "r_squared_": 0.982186875584812, "error_": 0.04613115002090862}
{"freq_range": [2.0, 80.0], "freq_res": 1.0, "aperiodic_params_": [0.7139576501145368, 1.0495120871296693], "gaussian_params_": [[9.222972104588075, 0.1707659597935832, 0.6687056948389307], [11.64429035422687, 0.30460569894971934, 0.8409729880550307], [13.566081446719378, 0.884786842859436, 0.298174758715842], [17.002633379260647, 0.32017408619522625, 1.829970999065147], [21.219625166883667, 0.19462385400089974, 0.734151415919402], [28.716455511863547, 0.5179492281126968, 3.4118831686653426]], "peak_params_": [[9.222972104588075, 0.1637265500721972, 1.3374113896778614], [11.64429035422687, 0.28620683666199004, 1.6819459761100615], [13.566081446719378, 0.39627981511302857, 0.596349517431684], [17.002633379260647, 0.32159802510297175, 3.659941998130294], [21.219625166883667, 0.25570840114096516, 1.468302831838804], [28.716455511863547, 0.5161637208004902, 6.823766337330685]], "r_squared_": 0.9842005566841809, "error_": 0.043604923374114035}
{"freq_range": [2.0, 80.0], "freq_res": 1.0, "aperiodic_params_": [0.5955913154588146, 0.9591522891272442], "gaussian_params_": [[14.877208599259287, 0.33630030509827585, 3.935254882755305], [20.978746644406478, 0.1070120338239204, 0.5215024648465073], [28.48664670648538, 0.4699747373129369, 3.3187479179482344], [68.72180674541944, 0.12404123313204193, 1.2951064264617533], [71.65552217572858, 0.6560663336898296, 0.2500001156278216]], "peak_params_": [[14.877208599259287, 0.3362585421854415, 7.87050976551061], [20.978746644406478, 0.2440686901052399, 1.0430049296930146], [28.48664670648538, 0.4662434131454851, 6.637495835896469], [68.72180674541944, 0.12121232826093942, 2.5902128529235067], [71.65552217572858, 0.25893903948838126, 0.5000002312556432]], "r_squared_": 0.9825657166880215, "error_": 0.04307625621210307}
{"freq_range": [2.0, 80.0], "freq_res": 1.0, "aperiodic_params_": [0.3213609013754275, 0.64833205152088], "gaussian_params_": [[9.334427944922345, 0.2585015896721409, 0.28405442126674135], [12.431730215925135, 0.21789216267492856, 1.462774202148977], [17.435489598778858, 0.2818006099958251, 3.5915494118270486], [28.616062090679055, 0.3369475363658717, 3.3181142575352167], [50.427248536088705, 0.7704097217300091, 0.2742570700440894], [69.13401403456447, 0.1614642126460627, 0.6894029460445688], [71.80330563422156, 0.40638862584361407, 0.46098283220431197], [74.75935897589491, 0.17873071453643957, 0.5196310642729479], [76.91825543681455, 0.14278960202603333, 0.6141250669957086]], "peak_params_": [[9.334427944922345, 0.16103163198833736, 0.5681088425334827], [12.431730215925135, 0.29826395090132396, 2.925548404297954], [17.435489598778858, 0.282132552812712, 7.183098823654097], [28.616062090679055, 0.3362791433488126, 6.636228515070433], [50.427248536088705, 0.22894694700001084, 0.5485141400881788], [69.13401403456447, 0.15844214828646286, 1.3788058920891375], [71.80330563422156, 0.3710575600720234, 0.9219656644086239], [74.75935897589491, 0.16164370277763773, 1.0392621285458958], [76.91825543681455, 0.14154664210254497, 1.2282501339914171]], "r_squared_": 0.9615862246853295, "error_": 0.04078831870220392}
{"freq_range": [2.0, 80.0], "freq_res": 1.0, "aperiodic_params_": [0.21059644277374265, 0.5755917470934829], "gaussian_params_": [[12.23504337495883, 0.26279122866398663, 1.7458860377646392], [17.224741827100804, 0.2862535323551895, 2.9606580227783317], [28.864474218538348, 0.32850613282408303, 3.642903427104403], [45.52924433214108, 0.9749363388744161, 0.2731766054477163], [49.62343303601791, 0.998938739074749, 0.2602784359862771], [54.43561349302963, 0.5509708204886359, 0.27126543204221465], [56.57182564791834, 0.18362744368874678, 0.9215728732562536], [63.5355441423408, 0.6945885516131737, 0.28227154716855585], [68.83686202897272, 0.2790084301696457, 0.775470169821045], [71.90617901390678, 0.43803411831305883, 0.6481584632944507], [75.05338915811984, 0.19341074534908168, 0.638949960555245], [77.50387527568185, 0.7394218926311725, 0.3024024017823254]], "peak_params_": [[12.23504337495883, 0.3207532504829051, 3.4917720755292785], [17.224741827100804, 0.2934043718610869, 5.921316045556663], [28.864474218538348, 0.3283840299691055, 7.285806854208806], [45.52924433214108, 0.2208700384415424, 0.5463532108954327], [49.62343303601791, 0.3507591944784044, 0.5205568719725542], [54.43561349302963, 0.15549837892785645, 0.5425308640844293], [56.57182564791834, 0.16484019951091988, 1.8431457465125072], [63.5355441423408, 0.17939904536715534, 0.5645430943371117], [68.83686202897272, 0.27292110974272676, 1.55094033964209], [71.90617901390678, 0.43353925188040326, 1.2963169265889014], [75.05338915811984, 0.19274168073250608, 1.27789992111049], [77.50387527568185, 0.19249891920439788, 0.6048048035646508]], "r_squared_": 0.944197746628222, "error_": 0.04229364119936638}
{"freq_range": [2.0, 80.0], "freq_res": 1.0, "aperiodic_params_": [-0.20955580062115323, 0.011921583108545186], "gaussian_params_": [[9.548718071777634, 0.44465794217278876, 0.297924885718168], [12.05815880404527, 0.19865289619728643, 0.7038060517085063], [13.559248036027768, 0.31975080804896483, 0.33385641427671625], [15.57146043270835, 0.22586200096585754, 0.7667784390431794], [19.256119009522386, 0.16534457414022674, 1.525218278309065], [25.688983632458626, 0.11896000983237437, 0.8397242105854488], [28.903834066865542, 0.23433479900774307, 0.9031334888045205], [36.41110046687357, 0.3800055107362554, 0.2563918556782744], [48.46408244778494, 0.3629172143827024, 0.31526049497660436], [56.89461591682362, 0.10781552452101158, 2.671587957013678], [62.019843907116275, 0.1138305146752017, 0.630937897829054], [66.83589825670342, 0.09606498056162635, 2.155365364605014]], "peak_params_": [[9.548718071777634, 0.14394625540600334, 0.595849771436336], [12.05815880404527, 0.19798807388103426, 1.4076121034170126], [13.559248036027768, 0.16627542287917443, 0.6677128285534325], [15.57146043270835, 0.21013690478854802, 1.5335568780863589], [19.256119009522386, 0.16304002072893073, 3.05043655661813], [25.688983632458626, 0.11241681454180683, 1.6794484211708975], [28.903834066865542, 0.23306015565881733, 1.806266977609041], [36.41110046687357, 0.10508073229668634, 0.5127837113565488], [48.46408244778494, 0.12323922002027453, 0.6305209899532087], [56.89461591682362, 0.10773456346859414, 5.343175914027356], [62.019843907116275, 0.13889216567458865, 1.261875795658108], [66.83589825670342, 0.09587125103867616, 4.310730729210028]], "r_squared_": 0.3717524477330715, "error_": 0.03874763849749181}
{"freq_range": [2.0, 80.0], "freq_res": 1.0, "aperiodic_params_": [-0.10067869425169519, 0.38839400331296947], "gaussian_params_": [[10.999471442534846, 0.3732967508636029, 1.3761744082916147], [13.550908018848402, 0.6501723374152684, 0.2705131100772362], [19.567796142177468, 0.27810387939597336, 4.013407930405367], [26.49369748460647, 0.5253667125951512, 0.31263114487772553], [29.523175805250364, 0.24384683951187003, 1.2607762299669738], [33.99773788613065, 0.18077290982086308, 0.25000000000000006], [36.98930474254303, 0.13641861642005748, 0.8936572395402536], [48.912098991595855, 0.3035474069847758, 0.49396692645677875], [60.58089987963934, 0.611917369135117, 0.26676639847346156], [69.93150625184313, 0.12535040651924087, 2.3640473597414786]], "peak_params_": [[10.999471442534846, 0.40178018452230796, 2.7523488165832295], [13.550908018848402, 0.30478332167365096, 0.5410262201544724], [19.567796142177468, 0.27649594200567756, 8.026815860810734], [26.49369748460647, 0.23289543061072115, 0.6252622897554511], [29.523175805250364, 0.23650163155982917, 2.5215524599339476], [33.99773788613065, 0.18215132291800318, 0.5000000000000001], [36.98930474254303, 0.1364311126032386, 1.7873144790805071], [48.912098991595855, 0.29877920156966664, 0.9879338529135575], [60.58089987963934, 0.17823032673966754, 0.5335327969469231], [69.93150625184313, 0.12529780550319447, 4.728094719482957]], "r_squared_": 0.9259659431258717, "error_": 0.03869659955705633}
{"freq_range": [2.0, 80.0], "freq_res": 1.0, "aperiodic_params_": [0.3256327649229982, 0.7545331018062722], "gaussian_params_": [[11.46884500121703, 0.40282820820835724, 1.889279052496645], [18.668459220993014, 0.53031126836422, 3.464842662543251], [28.730864439154537, 0.34962703254550476, 3.0469650342934465], [34.02635447415432, 0.15366955585514933, 0.25000003155759676], [48.97732127015793, 0.2742835017236587, 0.2500000000000009], [67.62251024993941, 0.4645027081134176, 0.32479491304419184], [70.22814119786014, 0.22266881445103817, 0.6649796658110125], [73.8945274592585, 0.21109931279587682, 0.5347973380347393], [77.55090717446872, 0.5765049299918411, 0.2932070933979628]], "peak_params_": [[11.46884500121703, 0.43641379740019326, 3.77855810499329], [18.668459220993014, 0.5301641971923928, 6.929685325086502], [28.730864439154537, 0.3544861998708722, 6.093930068586893], [34.02635447415432, 0.23123154860298867, 0.5000000631151935], [48.97732127015793, 0.2731572539978726, 0.5000000000000018], [67.62251024993941, 0.23722195076698316, 0.6495898260883837], [70.22814119786014, 0.20994248257956438, 1.329959331622025], [73.8945274592585, 0.20703358292504548, 1.0695946760694786], [77.55090717446872, 0.1783943657076602, 0.5864141867959256]], "r_squared_": 0.9749506042136576, "error_": 0.04582462743680356}
{"freq_range": [2.0, 80.0], "freq_res": 1.0, "aperiodic_params_": [0.5254724044214479, 0.9305376678710188], "gaussian_params_": [[11.473662637180487, 0.34786415201261317, 1.8914262520422622], [18.59969094565084, 0.47737319949935975, 3.849354662299825], [29.32504949928033, 0.37330512350792155, 2.5210563857006347], [34.02682507190331, 0.14761183909788061, 0.25000000705082903], [48.98949753529132, 0.20076393010954957, 0.25000000000000205], [65.39608878176814, 0.42953051472917864, 0.28691128173374225], [67.58867772052724, 0.4285559363553874, 0.3117053035642369], [70.1835571699797, 0.20006541283661414, 0.7230993204940437], [74.34300878906194, 0.3587283172738666, 0.2774969894230398], [77.60124520013562, 0.3877037745612268, 0.2830551295522428]], "peak_params_": [[11.473662637180487, 0.40511920659080974, 3.7828525040845244], [18.59969094565084, 0.47501070963229586, 7.69870932459965], [29.32504949928033, 0.3826232003739516, 5.0421127714012695], [34.02682507190331, 0.21381538500095776, 0.5000000141016581], [48.98949753529132, 0.20058685132284015, 0.5000000000000041], [65.39608878176814, 0.16563148248621107, 0.5738225634674845], [67.58867772052724, 0.18152106454576955, 0.6234106071284738], [70.1835571699797, 0.193722171136831, 1.4461986409880874], [74.34300878906194, 0.1671042935270799, 0.5549939788460796], [77.60124520013562, 0.14373177500172685, 0.5661102591044856]], "r_squared_": 0.9838784336800463, "error_": 0.04037822816690828}
{"freq_range": [2.0, 80.0], "freq_res": 1.0, "aperiodic_params_": [0.6153582856635673, 1.0184751405140637], "gaussian_params_": [[11.558800880673363, 0.24919169873729638, 2.057924630109644], [18.038676558692043, 0.380875851284421, 4.146115618094849], [29.33085331806354, 0.3914415603106711, 2.802255967958845], [70.54577318907279, 0.08877070880151769, 5.415540210323759]], "peak_params_": [[11.558800880673363, 0.3754015297034666, 4.115849260219288], [18.038676558692043, 0.38282833119621607, 8.292231236189698], [29.33085331806354, 0.40028501411289963, 5.60451193591769], [70.54577318907279, 0.08845900789550654, 10.831080420647519]], "r_squared_": 0.9823171111317623, "error_": 0.04592179565615851}
{"freq_range": [2.0, 80.0], "freq_res": 1.0, "aperiodic_params_": [0.6431442294399471, 1.0267448504124836], "gaussian_params_": [[11.840731360292656, 0.2179158424681519, 2.3401062589214243], [18.165306577382186, 0.34300576363018404, 4.519474856984251], [29.26795151931005, 0.36844443143540107, 2.509413662969548]], "peak_params_": [[11.840731360292656, 0.35268201404097277, 4.680212517842849], [18.165306577382186, 0.3496146487876984, 9.038949713968503], [29.26795151931005, 0.3857280128663479, 5.018827325939096]], "r_squared_": 0.9850216023350197, "error_": 0.044940602643883644}
{"freq_range": [2.0, 80.0], "freq_res": 1.0, "aperiodic_params_": [0.5538944058509506, 0.9487687601317996], "gaussian_params_": [[16.14371499305913, 0.42405296722731695, 4.9768615984287], [28.793074036711324, 0.3627604763730733, 2.7062232360998233], [71.6015260235558, 0.6468771985879108, 0.25920806005775177]], "peak_params_": [[16.14371499305913, 0.42388129694778437, 9.9537231968574], [28.793074036711324, 0.37678154999715796, 5.412446472199647], [71.6015260235558, 0.19845250865257835, 0.5184161201155035]], "r_squared_": 0.9854118174015329, "error_": 0.04221973183099933}
{"freq_range": [2.0, 80.0], "freq_res": 1.0, "aperiodic_params_": [0.4602114507662077, 0.8189338819679346], "gaussian_params_": [[16.770189890604474, 0.4984374629408737, 5.021179103214535], [28.802641198395545, 0.35857731730736314, 2.5745019438436505], [49.98705006249938, 0.14156583657176391, 0.2500000072919607], [71.60585632628515, 0.6840241341411806, 0.29366112550672724], [74.55994289839572, 0.40798023133899547, 0.3143442009653384]], "peak_params_": [[16.770189890604474, 0.4979254818225196, 10.04235820642907], [28.802641198395545, 0.38319452829348233, 5.149003887687301], [49.98705006249938, 0.14137603835820378, 0.5000000145839214], [71.60585632628515, 0.27790537155406203, 0.5873222510134545], [74.55994289839572, 0.1531364079612303, 0.6286884019306768]], "r_squared_": 0.9811410413579779, "error_": 0.04247743946476015}
{"freq_range": [2.0, 80.0], "freq_res": 1.0, "aperiodic_params_": [0.20026380814999567, 0.5214440389344864], "gaussian_params_": [[11.936147832185211, 0.21755909840823232, 1.635232557489585], [17.91795521243419, 0.3492966589528943, 4.0861266868447546], [26.931958032097423, 0.3933879611572998, 0.7905479558501493], [29.34993428069649, 0.40064391835643515, 0.6059958557391572], [31.486307590114762, 0.8554693444302551, 0.2808816671923085], [49.693593110560485, 0.49268943985952035, 0.2500489869591538], [71.45390596630686, 0.2523162728228342, 1.4399949340786582], [74.53736744918528, 0.6643367425129432, 0.3042640909149968]], "peak_params_": [[11.936147832185211, 0.33977303662133357, 3.27046511497917], [17.91795521243419, 0.3494509318206363, 8.172253373689509], [26.931958032097423, 0.421693453503055, 1.5810959117002985], [29.34993428069649, 0.3607952385665681, 1.2119917114783143], [31.486307590114762, 0.20302208084354628, 0.561763334384617], [49.693593110560485, 0.23254688021314196, 0.5000979739183076], [71.45390596630686, 0.24008752616890383, 2.8799898681573164], [74.53736744918528, 0.22126929913687254, 0.6085281818299936]], "r_squared_": 0.9308370055466209, "error_": 0.052751793714729815}
{"freq_range": [2.0, 80.0], "freq_res": 1.0, "aperiodic_params_": [-0.09529346812905529, 0.25315404498822613], "gaussian_params_": [[12.439254608171801, 0.22240218172059897, 1.9776055376064592], [17.8649652731704, 0.21965200718590103, 1.6590388689751414], [26.562180283401002, 0.43451332628533895, 0.250002961070033], [30.625944362834062, 0.16046354105273716, 3.686537823028369], [49.530684341209565, 0.8983921152800419, 0.2500190235936502], [64.92727038691427, 0.11618130607474995, 1.6382235667976925]], "peak_params_": [[12.439254608171801, 0.2174082604449013, 3.9552110752129184], [17.8649652731704, 0.22364921229589646, 3.318077737950283], [26.562180283401002, 0.19268901622865148, 0.500005922140066], [30.625944362834062, 0.15963966081031666, 7.373075646056738], [49.530684341209565, 0.15428758676950083, 0.5000380471873004], [64.92727038691427, 0.11606686853863196, 3.276447133595385]], "r_squared_": 0.755886817392436, "error_": 0.05381959680575554}
{"freq_range": [2.0, 80.0], "freq_res": 1.0, "aperiodic_params_": [0.06819583323210743, 0.5456168681205208], "gaussian_params_": [[10.389232067121545, 0.4150218421333822, 1.3438060195476154], [13.243242577057023, 0.2188470075949772, 0.8514038400683686], [17.572883375352276, 0.3119018286812718, 3.0225684722332633], [27.059880916374297, 0.2797360624793546, 5.170810921000052], [48.774164401350376, 0.22654256229746736, 0.5002951962442208], [67.9170803969951, 0.26775890822150816, 0.5862803262377662]], "peak_params_": [[10.389232067121545, 0.4128563445735146, 2.6876120390952307], [13.243242577057023, 0.37921284989721654, 1.7028076801367371], [17.572883375352276, 0.36907634121035227, 6.045136944466527], [27.059880916374297, 0.2821255334061569, 10.341621842000103], [48.774164401350376, 0.20463300427643172, 1.0005903924884416], [67.9170803969951, 0.2650942121095067, 1.1725606524755323]], "r_squared_": 0.9589848053683332, "error_": 0.04597592642393257}
{"freq_range": [2.0, 80.0], "freq_res": 1.0, "aperiodic_params_": [0.39924847272697295, 0.8534913061841628], "gaussian_params_": [[9.933267554695071, 0.3127100773200086, 1.4470065509359018], [12.65044889376318, 0.3335947446875179, 1.8815564883093026], [18.676417051886652, 0.5238381685327785, 3.2295497744599047], [28.153237703985774, 0.4006512088403291, 3.8128150236943013], [48.98307638947422, 0.2166068067041581, 0.25000004498975764], [67.91798044616517, 0.21936956858375048, 0.5834950966398668], [74.375253134633, 0.3440735278893818, 0.28679218159188286], [77.56909168801818, 0.44580508276637804, 0.285156760744047]], "peak_params_": [[9.933267554695071, 0.4502604862119872, 2.8940131018718036], [12.65044889376318, 0.4729109787483002, 3.763112976618605], [18.676417051886652, 0.544793576093079, 6.459099548919809], [28.153237703985774, 0.40844436920931215, 7.6256300473886025], [48.98307638947422, 0.21611119984878258, 0.5000000899795153], [67.91798044616517, 0.21721300011313938, 1.1669901932797335], [74.375253134633, 0.14617946983713082, 0.5735843631837657], [77.56909168801818, 0.1423271370513679, 0.570313521488094]], "r_squared_": 0.9856016690374458, "error_": 0.039576320012055397}
{"freq_range": [2.0, 80.0], "freq_res": 1.0, "aperiodic_params_": [0.5425355460601331, 0.9821970711769438], "gaussian_params_": [[10.973078379077037, 0.3800654031290524, 2.075943936955439], [18.60094207202225, 0.5333115613458563, 4.076398013717917], [29.13655446969003, 0.32576753991259483, 2.9355445566462306], [34.02411720183785, 0.11340925763731967, 0.25000066654024544], [48.996116744259616, 0.1815396780304088, 0.2500000468571207], [67.58758608018262, 0.3476078430929619, 0.32441354464146055], [70.02440915591657, 0.1527379450016294, 0.5143685524904487], [74.39591199300571, 0.4173696075013317, 0.2788789834577955], [77.39013613210771, 0.14009390922984258, 0.8922150598779286]], "peak_params_": [[10.973078379077037, 0.4737896559883206, 4.151887873910878], [18.60094207202225, 0.5318166315962256, 8.152796027435834], [29.13655446969003, 0.3460134138774401, 5.871089113292461], [34.02411720183785, 0.19588895667427442, 0.5000013330804909], [48.996116744259616, 0.18151777892226184, 0.5000000937142414], [67.58758608018262, 0.15500398448076402, 0.6488270892829211], [70.02440915591657, 0.15256606348632484, 1.0287371049808973], [74.39591199300571, 0.1524650243284884, 0.557757966915591], [77.39013613210771, 0.12732104344682948, 1.7844301197558572]], "r_squared_": 0.9886624285920481, "error_": 0.037149092679397935}
{"freq_range": [2.0, 80.0], "freq_res": 1.0, "aperiodic_params_": [0.5881198140714095, 1.019049000028079], "gaussian_params_": [[11.224415770409923, 0.28532495373611017, 2.3640901619831767], [18.26093530257427, 0.4501027741785988, 4.243751193579466], [28.355783792477165, 0.246421063464814, 2.3924331562415846], [29.803051993553392, 0.20955525881817744, 0.3818887106812403], [31.78106407617388, 0.14964274491168203, 0.2592126162189259]], "peak_params_": [[11.224415770409923, 0.3881853049298443, 4.728180323966353], [18.26093530257427, 0.4539689189938461, 8.487502387158932], [28.355783792477165, 0.2760492417095636, 4.784866312483169], [29.803051993553392, 0.3878598947042997, 0.7637774213624806], [31.78106407617388, 0.18437362143542413, 0.5184252324378518]], "r_squared_": 0.9877579026322683, "error_": 0.042021989322175796}
{"freq_range": [2.0, 80.0], "freq_res": 1.0, "aperiodic_params_": [0.5568674156805209, 0.977722107093893], "gaussian_params_": [[16.730089117826488, 0.5173548012030242, 5.551268821830075], [27.218649302355267, 0.2737009700519105, 1.2200648157853242], [29.960025552944852, 0.3419913803693447, 0.9035259849597443], [31.91606871640529, 0.16741565519401988, 0.2500107627625821], [71.59509257708504, 0.6171081588897097, 0.2610487954955314]], "peak_params_": [[16.730089117826488, 0.5167436367140198, 11.10253764366015], [27.218649302355267, 0.36439128632356865, 2.4401296315706484], [29.960025552944852, 0.3917320407663612, 1.8070519699194887], [31.91606871640529, 0.1968738265559351, 0.5000215255251642], [71.59509257708504, 0.18532676640207368, 0.5220975909910628]], "r_squared_": 0.9865712752350518, "error_": 0.04374374470471595}
{"freq_range": [2.0, 80.0], "freq_res": 1.0, "aperiodic_params_": [0.5141351380487865, 0.9308700675970619], "gaussian_params_": [[16.65943841423498, 0.5819197089779269, 5.310153427678726], [28.68474096435046, 0.40254271406155046, 2.7055700141532895], [71.78886353625757, 0.2225559479125823, 0.5083155801846656]], "peak_params_": [[16.65943841423498, 0.5807600313029898, 10.620306855357452], [28.68474096435046, 0.43891237386543097, 5.411140028306579], [71.78886353625757, 0.20416214571981706, 1.0166311603693312]], "r_squared_": 0.9838638516168774, "error_": 0.04980090448466714}
{"freq_range": [2.0, 80.0], "freq_res": 1.0, "aperiodic_params_": [0.4391166369829138, 0.8695747054711227], "gaussian_params_": [[16.200717327464567, 0.5452912686815327, 5.132385794398523], [28.320894243739975, 0.44493896180099374, 3.0164442748456977], [71.81445545973281, 0.11219950990212492, 4.1606381741072]], "peak_params_": [[16.200717327464567, 0.5449804739472356, 10.264771588797046], [28.320894243739975, 0.48123736493437663, 6.032888549691395], [71.81445545973281, 0.1120879979243734, 8.3212763482144]], "r_squared_": 0.9758273088927326, "error_": 0.05669613319754083}
{"freq_range": [2.0, 80.0], "freq_res": 1.0, "aperiodic_params_": [0.14207064876475395, 0.6173448760278107], "gaussian_params_": [[11.739499107610404, 0.33571291360725647, 1.8469860296531162], [17.76043895039856, 0.3422554870647867, 2.7229671548935577], [23.1977710148378, 0.11193520965682255, 0.6398086319461791], [28.710527350150784, 0.33600357827120053, 2.9445139422601687], [49.58780426259824, 0.42774418464346503, 0.287812690491205], [54.52277128301921, 0.20065270366814097, 0.6966839517174236], [68.01567266484794, 0.16403837171101154, 0.25006512015655824]], "peak_params_": [[11.739499107610404, 0.3689113425682624, 3.6939720593062324], [17.76043895039856, 0.34245781340858733, 5.445934309787115], [23.1977710148378, 0.21169942605353476, 1.2796172638923582], [28.710527350150784, 0.33445214402336876, 5.889027884520337], [49.58780426259824, 0.15338861348206223, 0.57562538098241], [54.52277128301921, 0.1586916267497155, 1.3933679034348472], [68.01567266484794, 0.16371651060938042, 0.5001302403131165]], "r_squared_": 0.9585335797457633, "error_": 0.049706476201545766}
{"freq_range": [2.0, 80.0], "freq_res": 1.0, "aperiodic_params_": [-0.30452973514402537, 0.2046336056534876], "gaussian_params_": [[9.400005609099871, 0.33705914173973245, 0.6966380742702596], [14.038348577917247, 0.25459998210954365, 3.0411748359088406], [27.708235702036507, 0.18927785516270956, 0.7133097347610068], [35.62633389337859, 0.36701996833382977, 0.2951822549958703], [52.216128182914424, 0.2017721035939618, 0.3695535525958882], [56.45850744472637, 0.4739513323355186, 0.30947673230664763], [77.91899682425158, 0.1540621529084642, 0.6540319097080008]], "peak_params_": [[9.400005609099871, 0.3503773494161337, 1.3932761485405192], [14.038348577917247, 0.2545797414622234, 6.082349671817681], [27.708235702036507, 0.17409524136015148, 1.4266194695220136], [35.62633389337859, 0.1647100681232545, 0.5903645099917406], [52.216128182914424, 0.17005507379201645, 0.7391071051917764], [56.45850744472637, 0.1581586980783124, 0.6189534646132953], [77.91899682425158, 0.15288506797295343, 1.3080638194160017]], "r_squared_": 0.7873975020884598, "error_": 0.046204865102618155}
{"freq_range": [2.0, 80.0], "freq_res": 1.0, "aperiodic_params_": [0.2767975939254948, 0.7906333231393431], "gaussian_params_": [[9.502444437727938, 0.35780732876126037, 1.0254405536451057], [12.370117830675701, 0.3452407208425726, 1.9323634362192792], [18.221868534514336, 0.37220497296835237, 3.493295750681382], [27.82200372820432, 0.3033032253533394, 4.005700807482069], [48.630698009054036, 0.49985845678629776, 0.25123683060695534], [67.95107206970297, 0.15820622133842016, 0.5433083343300015]], "peak_params_": [[9.502444437727938, 0.5041388843252952, 2.0508811072902113], [12.370117830675701, 0.4337149247206903, 3.8647268724385584], [18.221868534514336, 0.39141622502624956, 6.986591501362764], [27.82200372820432, 0.3104072356463291, 8.011401614964138], [48.630698009054036, 0.1696896171847576, 0.5024736612139107], [67.95107206970297, 0.1575659938995726, 1.086616668660003]], "r_squared_": 0.9815728724257797, "error_": 0.04113647911030235}
{"freq_range": [2.0, 80.0], "freq_res": 1.0, "aperiodic_params_": [0.526245587280079, 1.0020484795506623], "gaussian_params_": [[9.836492552568755, 0.415232779272782, 1.3172316022272823], [13.05206994305358, 0.3290327030879089, 1.4579789348755836], [18.755032180129316, 0.4799178585378576, 3.426324114298662], [28.57620258390766, 0.3099997396667151, 3.7210529494897577], [49.01247870564841, 0.1516689790310662, 0.2500000000007904], [57.62826652701362, 0.31937857750992643, 0.2784126674893773], [67.6407230482677, 0.27429571694058036, 0.3123340777102377], [69.7433353611193, 0.20305688909533454, 0.31756871156454464], [74.43101024474485, 0.40763006249145367, 0.2766180222830341], [77.58360652201173, 0.3021602097728196, 0.3069411252418134]], "peak_params_": [[9.836492552568755, 0.46717104737106013, 2.6344632044545646], [13.05206994305358, 0.46918591063042614, 2.915957869751167], [18.755032180129316, 0.4900758932352209, 6.852648228597324], [28.57620258390766, 0.3134879456557992, 7.4421058989795155], [49.01247870564841, 0.15148024487300993, 0.5000000000015808], [57.62826652701362, 0.13097580458158897, 0.5568253349787546], [67.6407230482677, 0.14154470482423842, 0.6246681554204754], [69.7433353611193, 0.14647844637735896, 0.6351374231290893], [74.43101024474485, 0.12108058570679692, 0.5532360445660682], [77.58360652201173, 0.12039622757844493, 0.6138822504836268]], "r_squared_": 0.9904703364101953, "error_": 0.03298005035550962}
{"freq_range": [2.0, 80.0], "freq_res": 1.0, "aperiodic_params_": [0.55574969622247, 1.0140907587417096], "gaussian_params_": [[11.140914324843179, 0.36257347312315813, 2.389998123508095], [18.720286575523122, 0.44059811596420156, 4.421091678967494], [26.327860197349406, 0.3619046982889211, 0.2625397210336099], [27.549374996347627, 0.20291652672027102, 0.2960149736803577], [29.70525667548168, 0.25964855307696927, 1.8201028282812761]], "peak_params_": [[11.140914324843179, 0.45785823397114633, 4.77999624701619], [18.720286575523122, 0.44134411269614027, 8.842183357934989], [26.327860197349406, 0.3122151005005439, 0.5250794420672198], [27.549374996347627, 0.2797843289904157, 0.5920299473607153], [29.70525667548168, 0.2732705162108999, 3.6402056565625522]], "r_squared_": 0.9869115475305847, "error_": 0.043708762940075196}
{"freq_range": [2.0, 80.0], "freq_res": 1.0, "aperiodic_params_": [0.5129073090319207, 0.9764491040767342], "gaussian_params_": [[13.859507968699376, 0.5330065499797013, 3.9417693531858453], [19.555038750845583, 0.5819190719886678, 0.2939904988921768], [25.466950074311875, 0.33369316860464693, 4.6350772793773825], [29.780465097623743, 0.20801197747819006, 0.589764379629297], [31.933267358414746, 0.09187943711372687, 0.2500187602670669]], "peak_params_": [[13.859507968699376, 0.5483108525622685, 7.883538706371691], [19.555038750845583, 0.5099585533784933, 0.5879809977843536], [25.466950074311875, 0.34182628253691205, 9.270154558754765], [29.780465097623743, 0.40105979537493275, 1.179528759258594], [31.933267358414746, 0.21243442313784866, 0.5000375205341338]], "r_squared_": 0.983588710448161, "error_": 0.04907849672064559}
{"freq_range": [2.0, 80.0], "freq_res": 1.0, "aperiodic_params_": [0.3579408314835157, 0.8554846979722114], "gaussian_params_": [[11.452686166312503, 0.45401150147773467, 2.0582212290922577], [17.45203463762136, 0.397444973465493, 3.433792307268862], [23.24089726796185, 0.25898415277606207, 0.7786467608776574], [26.179956340883322, 0.3037147819614773, 0.632368175491659], [27.479498735287674, 0.32123367443269724, 0.29209520628991137], [29.578169880019672, 0.32261892024978817, 1.7885508126982381]], "peak_params_": [[11.452686166312503, 0.5111799026131059, 4.116442458184515], [17.45203463762136, 0.4060300590713001, 6.867584614537724], [23.24089726796185, 0.3550059432531819, 1.5572935217553148], [26.179956340883322, 0.3536911090231607, 1.264736350983318], [27.479498735287674, 0.33698176568831184, 0.5841904125798227], [29.578169880019672, 0.31427036367182626, 3.5771016253964762]], "r_squared_": 0.9787491514391634, "error_": 0.04674680737107117}
{"freq_range": [2.0, 80.0], "freq_res": 1.0, "aperiodic_params_": [0.06553832832481402, 0.6757937092237397], "gaussian_params_": [[12.325215807116768, 0.39787522562335803, 3.093482382143835], [19.597096335140005, 0.608896100444659, 0.26894073084162706], [27.18291083231662, 0.09430019750583907, 1.176458385047969], [64.58559121524435, 0.37685157305212286, 0.2933841925713549], [76.24252689433223, 0.09091623768423233, 4.445617836897223]], "peak_params_": [[12.325215807116768, 0.3956825949859417, 6.18696476428767], [19.597096335140005, 0.21657018165402786, 0.5378814616832541], [27.18291083231662, 0.09317247738912826, 2.352916770095938], [64.58559121524435, 0.14268428643218467, 0.5867683851427098], [76.24252689433223, 0.0907810478840283, 8.891235673794446]], "r_squared_": 0.9613016478003316, "error_": 0.04732737348013901}
{"freq_range": [2.0, 80.0], "freq_res": 1.0, "aperiodic_params_": [0.4530184847007843, 0.9787542237304643], "gaussian_params_": [[9.429550469121748, 0.28857057994927654, 0.815664981542314], [12.063091427246174, 0.3903676900656308, 2.163669763080564], [18.25221695837511, 0.39117421898939736, 3.449428218602282], [28.28679719225983, 0.2751914588532026, 4.44084351300112], [49.02151518411726, 0.1532010250038551, 0.25000112293454996], [57.569430512097696, 0.48045095303975927, 0.28046614628035416]], "peak_params_": [[9.429550469121748, 0.4052538458251241, 1.631329963084628], [12.063091427246174, 0.4682241476954871, 4.327339526161128], [18.25221695837511, 0.4179921855679601, 6.898856437204564], [28.28679719225983, 0.28183389132356373, 8.88168702600224], [49.02151518411726, 0.15263993593229053, 0.5000022458690999], [57.569430512097696, 0.1478676093143747, 0.5609322925607083]], "r_squared_": 0.9878598563165136, "error_": 0.04160696237710261}
{"freq_range": [2.0, 80.0], "freq_res": 1.0, "aperiodic_params_": [0.5068953322977898, 1.0076760513108631], "gaussian_params_": [[11.279965894289907, 0.3769514891927519, 2.2278855996182454], [18.758018807737447, 0.3489595272596617, 4.959690313989125], [26.274288264413524, 0.3660466515882544, 0.2500018235487961], [27.6462357748809, 0.39953461149824043, 0.31060451774787473], [29.828729514166128, 0.27187866268052224, 0.7288227572695181], [57.58059532202649, 0.4370772532425146, 0.2873108060203564]], "peak_params_": [[11.279965894289907, 0.4766622976382021, 4.455771199236491], [18.758018807737447, 0.3494753098203415, 9.91938062797825], [26.274288264413524, 0.32068760385952744, 0.5000036470975922], [27.6462357748809, 0.28202546289895003, 0.6212090354957495], [29.828729514166128, 0.2912116549073439, 1.4576455145390361], [57.58059532202649, 0.15060508267670158, 0.5746216120407128]], "r_squared_": 0.9868160071412116, "error_": 0.043280920540687676}
{"freq_range": [2.0, 80.0], "freq_res": 1.0, "aperiodic_params_": [0.4822386866537078, 0.9821013837034657], "gaussian_params_": [[11.56788481434026, 0.5086213745606429, 2.215881011352779], [17.885722246883944, 0.34102589008360745, 3.7773060720327862], [23.287637108085367, 0.19970424108511242, 0.6890345458400283], [26.29479306723157, 0.32535901721697275, 0.43088691715993327], [27.617496284517653, 0.5585699930312282, 0.2527888612402055], [29.946864417103008, 0.2191504112768751, 1.7351377134255475]], "peak_params_": [[11.56788481434026, 0.6003326082537278, 4.431762022705558], [17.885722246883944, 0.3483989069296519, 7.5546121440655725], [23.287637108085367, 0.31948321501104204, 1.3780690916800566], [26.29479306723157, 0.3079853114620956, 0.8617738343198665], [27.617496284517653, 0.3041569673300343, 0.505577722480411], [29.946864417103008, 0.22103969055003292, 3.470275426851095]], "r_squared_": 0.9861810562252062, "error_": 0.04129291782522559}
{"freq_range": [2.0, 80.0], "freq_res": 1.0, "aperiodic_params_": [-0.9727967477706102, 0.2431438845966351], "gaussian_params_": [[10.577938016508373, 0.2847788964461331, 1.7410811777517643], [18.997196386670904, 0.08467086856854368, 0.2500717123489194], [23.085251345735966, 0.10669266532166792, 4.1154916826357715], [28.348972642500936, 0.4828550189381399, 0.26027396283657167], [40.54796540086405, 0.12519655849634834, 5.999999999999999]], "peak_params_": [[10.577938016508373, 0.277964850821802, 3.4821623555035286], [18.997196386670904, 0.15005388666901998, 0.5001434246978388], [23.085251345735966, 0.1084083491770258, 8.230983365271543], [28.348972642500936, 0.26288886525067, 0.5205479256731433], [40.54796540086405, 0.12484994951153094, 11.999999999999998]], "r_squared_": 0.7804311952403399, "error_": 0.049293965261927405}
{"freq_range": [2.0, 80.0], "freq_res": 1.0, "aperiodic_params_": [-0.5840170353890917, 0.3849702529547184], "gaussian_params_": [[13.629047857384627, 0.5905907214544894, 0.2783439610553627], [28.776830202873455, 0.13360775145534035, 2.98730607905721], [49.386930345110216, 0.19162017613408197, 0.98180597575579], [54.75315075503152, 0.1996516730567119, 1.1352266952397014], [61.017806507783234, 0.16966732613570631, 0.2500000857783061], [65.01941742272466, 0.1648479625723917, 0.4182534847010587], [68.50027944869207, 0.2675931692070586, 0.8475115374947466]], "peak_params_": [[13.629047857384627, 0.24300116200411204, 0.5566879221107254], [28.776830202873455, 0.13323543927563053, 5.97461215811442], [49.386930345110216, 0.17730306427947284, 1.96361195151158], [54.75315075503152, 0.19498705107893133, 2.270453390479403], [61.017806507783234, 0.16923755121300266, 0.5000001715566122], [65.01941742272466, 0.16472331627942371, 0.8365069694021174], [68.50027944869207, 0.22489517772456313, 1.6950230749894932]], "r_squared_": 0.7935573021946573, "error_": 0.0482512874845225}
{"freq_range": [2.0, 80.0], "freq_res": 1.0, "aperiodic_params_": [-0.42207110744379356, 0.46142633084279966], "gaussian_params_": [[9.423347223842697, 0.6069907279739722, 0.27186831797007244], [11.439519501917525, 0.2757522614947365, 0.6299339128136344], [13.591054767142912, 0.5463311246589448, 0.2580355654941038], [28.803092807383436, 0.28072618718518244, 2.962873402526601], [69.03854306662058, 0.1729516760065084, 1.7126546489031031]], "peak_params_": [[9.423347223842697, 0.1807216477110114, 0.5437366359401449], [11.439519501917525, 0.21617628083525708, 1.2598678256272688], [13.591054767142912, 0.15568428726300376, 0.5160711309882076], [28.803092807383436, 0.2801069308567241, 5.925746805053202], [69.03854306662058, 0.17290788421351921, 3.4253092978062063]], "r_squared_": 0.9050799526352246, "error_": 0.044455557191830856}
{"freq_range": [2.0, 80.0], "freq_res": 1.0, "aperiodic_params_": [-0.4158784602492488, 0.5368802572195311], "gaussian_params_": [[13.280840004807546, 0.29410882313887765, 3.271645629925153], [27.200131061104887, 0.20408097630693392, 3.4338864537284834], [28.860331924026156, 0.2739143476740786, 0.7189289943362049], [31.522453894127498, 0.7301871362654934, 0.2542891010413915], [55.54082646294784, 0.866577067712924, 0.26245780696859894], [63.542658701205525, 0.6862059845934236, 0.28202313834293324], [75.47263153234758, 0.17940222771396347, 0.7154034849132141]], "peak_params_": [[13.280840004807546, 0.29306671642622795, 6.543291259850306], [27.200131061104887, 0.21340918799614372, 6.867772907456967], [28.860331924026156, 0.4466840426943617, 1.4378579886724099], [31.522453894127498, 0.2020517414502392, 0.508578202082783], [55.54082646294784, 0.1875699606768586, 0.5249156139371979], [63.542658701205525, 0.18425344912218367, 0.5640462766858665], [75.47263153234758, 0.14422880362920565, 1.4308069698264283]], "r_squared_": 0.9305638725777098, "error_": 0.04860886180660763}
