{"freq_range": [2.0, 80.0], "freq_res": 1.0, "aperiodic_params_": [0.08069345384092841, 0.7613763587564869], "gaussian_params_": [[8.040374932388309, 0.5078413395011702, 0.826535133531012], [11.714073611914726, 0.21009327176000533, 2.7689154719458022], [14.7296662215672, 0.26557263467140924, 0.40915643501768484], [17.53178172529874, 0.2862913978239533, 0.2770886140771764], [20.9609129142496, 0.23905099789770973, 4.73415576554742], [44.47576811765528, 0.6946987772934954, 0.2508558280279877]], "peak_params_": [[8.040374932388309, 0.5983224520138972, 1.653070267062024], [11.714073611914726, 0.24883806314313656, 5.5378309438916045], [14.7296662215672, 0.42559247341576456, 0.8183128700353697], [17.53178172529874, 0.2812257427872231, 0.5541772281543528], [20.9609129142496, 0.2398017574832889, 9.46831153109484], [44.47576811765528, 0.11500615717019858, 0.5017116560559755]], "r_squared_": 0.9829833729197405, "error_": 0.03569434300343729}
{"freq_range": [2.0, 80.0], "freq_res": 1.0, "aperiodic_params_": [0.06021695160172817, 0.45115865496443874], "gaussian_params_": [[8.074538509590528, 0.39815508928192883, 1.0682743004107758], [21.494237333433038, 0.5534994118282495, 2.3171989582543184], [44.29747463761, 0.3231769743897946, 3.3345753353471688], [62.45203459914095, 0.10430338044725135, 4.913785593789467], [68.39291146624736, 0.12584551218673834, 3.0634399076821004]], "peak_params_": [[8.074538509590528, 0.39718708137747644, 2.1365486008215515], [21.494237333433038, 0.5410513528112284, 4.634397916508637], [44.29747463761, 0.3219839836112993, 6.6691506706943375], [62.45203459914095, 0.11812527024867059, 9.827571187578934], [68.39291146624736, 0.17995679511039464, 6.126879815364201]], "r_squared_": 0.904155131151625, "error_": 0.053253353061843874}
{"freq_range": [2.0, 80.0], "freq_res": 1.0, "aperiodic_params_": [0.010895374424066516, 0.626023137655353], "gaussian_params_": [[7.8678211592145155, 0.5178756864025399, 0.7015545177328825], [9.67286186939991, 0.27883173675182177, 1.1630302823056364], [13.268593006798614, 0.21823754594518593, 1.4920024738368898], [14.68029839914861, 0.2200720269214916, 0.31859423750853244], [17.119211902243666, 0.22013472849571478, 0.6207520726056205], [22.177714694567953, 0.21071592985393967, 3.175751300832847], [31.8909723090321, 0.08718660452986722, 0.8781289528093562], [42.55209900399889, 0.2637714233511128, 0.3335189278287069], [48.90897094546443, 0.07127474348468009, 3.7721068284977903], [59.33461673335062, 0.2060658774788389, 0.2865576212076145]], "peak_params_": [[7.8678211592145155, 0.6083059373758479, 1.403109035465765], [9.67286186939991, 0.29306677918080315, 2.326060564611273], [13.268593006798614, 0.2226253116537158, 2.9840049476737796], [14.68029839914861, 0.2613597979133808, 0.6371884750170649], [17.119211902243666, 0.28145923758894975, 1.241504145211241], [22.177714694567953, 0.21038626654727277, 6.351502601665694], [31.8909723090321, 0.0882841006777414, 1.7562579056187124], [42.55209900399889, 0.12794918981049985, 0.6670378556574138], [48.90897094546443, 0.07125399269940913, 7.544213656995581], [59.33461673335062, 0.10620156002303938, 0.573115242415229]], "r_squared_": 0.9833470860017698, "error_": 0.029504549927280996}
{"freq_range": [2.0, 80.0], "freq_res": 1.0, "aperiodic_params_": [0.33597028274861823, 1.0208092225061185], "gaussian_params_": [[8.015319777859693, 0.5968054322676423, 0.9871149838984252], [13.435842268536868, 0.320714332315678, 3.4426791968230765], [20.798689287829664, 0.304625485568952, 5.617901202339735]], "peak_params_": [[8.015319777859693, 0.7116740167329428, 1.9742299677968504], [13.435842268536868, 0.4343841842274461, 6.885358393646153], [20.798689287829664, 0.33312628642510145, 11.23580240467947]], "r_squared_": 0.989899368427292, "error_": 0.04088760935998918}
{"freq_range": [2.0, 80.0], "freq_res": 1.0, "aperiodic_params_": [0.2974904561365816, 0.8878055945270253], "gaussian_params_": [[8.108269327866978, 0.613421024378422, 1.1187990027229695], [12.388062529890199, 0.2783114151906843, 1.5451284639823584], [15.05365210372148, 0.2579683779109657, 0.477384092900964], [20.46869390973966, 0.3486214398533041, 4.703823759934176]], "peak_params_": [[8.108269327866978, 0.6258781164724776, 2.237598005445939], [12.388062529890199, 0.3400611664162684, 3.0902569279647167], [15.05365210372148, 0.5003840212591236, 0.954768185801928], [20.46869390973966, 0.34689660702325686, 9.407647519868352]], "r_squared_": 0.9772027166328279, "error_": 0.049003963957486206}
{"freq_range": [2.0, 80.0], "freq_res": 1.0, "aperiodic_params_": [0.1056156118207671, 0.5967708658736657], "gaussian_params_": [[8.033607236619416, 0.4736912274377437, 0.875649049976814], [11.414694240875436, 0.24185986696968467, 1.8781300977204438], [14.66607407269112, 0.276695860087927, 0.6370134085169546], [19.777660975945935, 0.22876995559654836, 2.1894132675553974], [25.991394481700663, 0.12734698331713418, 0.7340633318070905], [41.45206720872526, 0.0670947481849026, 5.999999999999999], [50.042687562316054, 0.1379414975921626, 1.3646451691253094], [59.02080842865897, 0.22487672313046383, 0.567629715210093]], "peak_params_": [[8.033607236619416, 0.5196615482420937, 1.751298099953628], [11.414694240875436, 0.23763530178630776, 3.7562601954408876], [14.66607407269112, 0.3014379244561284, 1.2740268170339093], [19.777660975945935, 0.2277128085461253, 4.378826535110795], [25.991394481700663, 0.13380488367249566, 1.468126663614181], [41.45206720872526, 0.06690457654734294, 11.999999999999998], [50.042687562316054, 0.1621936639226793, 2.729290338250619], [59.02080842865897, 0.22565741679344975, 1.135259430420186]], "r_squared_": 0.9678900382655031, "error_": 0.03842353505235662}
{"freq_range": [2.0, 80.0], "freq_res": 1.0, "aperiodic_params_": [0.10416858104079331, 0.8749497721075511], "gaussian_params_": [[8.100569981081216, 0.6983943535311702, 0.9855636116428782], [12.336184996991014, 0.3948614595090616, 2.963281314521476], [21.82101938328652, 0.2944352703547852, 4.580413762252843]], "peak_params_": [[8.100569981081216, 0.8332269697625335, 1.9711272232857564], [12.336184996991014, 0.42216647370506777, 5.926562629042952], [21.82101938328652, 0.2961470385704831, 9.160827524505686]], "r_squared_": 0.9838376996640065, "error_": 0.04320128488710679}
{"freq_range": [2.0, 80.0], "freq_res": 1.0, "aperiodic_params_": [0.3241151990191969, 0.9802905934466943], "gaussian_params_": [[8.032563090621538, 0.5925542402319577, 0.8712001835844976], [12.700647239364534, 0.3072016807795649, 3.0346644829872305], [20.60492495365182, 0.362705319436962, 5.174857624087804], [26.517671516043656, 0.247181947806203, 0.3271523242939552], [31.46842701445584, 0.15565582463407918, 0.9529482381949792]], "peak_params_": [[8.032563090621538, 0.7033698522449321, 1.7424003671689952], [12.700647239364534, 0.4289024105868735, 6.069328965974461], [20.60492495365182, 0.3689493000836298, 10.349715248175608], [26.517671516043656, 0.25239495380451693, 0.6543046485879104], [31.46842701445584, 0.186174022709793, 1.9058964763899584]], "r_squared_": 0.9852767944708062, "error_": 0.046439078887827105}
{"freq_range": [2.0, 80.0], "freq_res": 1.0, "aperiodic_params_": [0.4832297709696132, 1.123207128833254], "gaussian_params_": [[7.9848041440044115, 0.6137601547141376, 0.9720580032390478], [13.590731618735337, 0.366146770748101, 3.3638642839785913], [21.689017733719268, 0.3379882570685387, 5.777591253290877], [31.259743288440593, 0.2269500600703408, 0.2500982558266553]], "peak_params_": [[7.9848041440044115, 0.7261095852229197, 1.9441160064780956], [13.590731618735337, 0.5028612252425031, 6.7277285679571825], [21.689017733719268, 0.3535910603208636, 11.555182506581755], [31.259743288440593, 0.22459058853863345, 0.5001965116533106]], "r_squared_": 0.9886927918665812, "error_": 0.045329054101257205}
{"freq_range": [2.0, 80.0], "freq_res": 1.0, "aperiodic_params_": [0.5617307009216452, 1.1730535167139569], "gaussian_params_": [[7.934833586991821, 0.6354698834547589, 1.0472595353845964], [13.483808215805048, 0.3808704593272472, 3.119714342961101], [21.69377526967069, 0.36289971492517487, 5.622366100860603]], "peak_params_": [[7.934833586991821, 0.7341834947773829, 2.0945190707691927], [13.483808215805048, 0.4861197597928977, 6.239428685922202], [21.69377526967069, 0.37153754994541766, 11.244732201721206]], "r_squared_": 0.9883824212619383, "error_": 0.04744470812211185}
{"freq_range": [2.0, 80.0], "freq_res": 1.0, "aperiodic_params_": [0.5814579600068868, 1.1904244303756777], "gaussian_params_": [[7.94934847392545, 0.6479118667746421, 1.0652918991544644], [13.429944910066991, 0.3739863702171798, 3.0661795629755844], [21.586135938128937, 0.3773300967258429, 5.846530023883626]], "peak_params_": [[7.94934847392545, 0.7504945935387766, 2.130583798308929], [13.429944910066991, 0.4986844388809719, 6.132359125951169], [21.586135938128937, 0.3839101400957402, 11.693060047767252]], "r_squared_": 0.9884644024120341, "error_": 0.04883696305896979}
{"freq_range": [2.0, 80.0], "freq_res": 1.0, "aperiodic_params_": [0.5392219163037976, 1.1485083196423787], "gaussian_params_": [[7.992200222857611, 0.6542955143587209, 1.0887676358758178], [13.427663146092465, 0.36953317547657744, 2.7273893074612685], [21.395265267541465, 0.3909080994828929, 5.999999999999999]], "peak_params_": [[7.992200222857611, 0.7376327605382255, 2.1775352717516356], [13.427663146092465, 0.5119090340393848, 5.454778614922537], [21.395265267541465, 0.39789129538448853, 11.999999999999998]], "r_squared_": 0.9891289923681441, "error_": 0.046565143137557094}
{"freq_range": [2.0, 80.0], "freq_res": 1.0, "aperiodic_params_": [0.38938647623031053, 1.01346991257577], "gaussian_params_": [[8.031857662362391, 0.6247909465820771, 1.1398765787689167], [13.321948391660943, 0.34928217699540287, 2.6451866237121084], [21.522718393395863, 0.37979107755294195, 5.999999999999999]], "peak_params_": [[8.031857662362391, 0.7006581929208348, 2.2797531575378334], [13.321948391660943, 0.4852387179817238, 5.290373247424217], [21.522718393395863, 0.3801984195825603, 11.999999999999998]], "r_squared_": 0.9874715824961735, "error_": 0.04424838987113052}
{"freq_range": [2.0, 80.0], "freq_res": 1.0, "aperiodic_params_": [0.19754720790670663, 0.8691978205235227], "gaussian_params_": [[8.150664937273643, 0.6297084107097192, 1.2384391567886375], [13.457187216331732, 0.384118088958969, 2.690417302038555], [22.827029740109314, 0.31870904083490664, 5.935615889920693], [39.53901185852208, 0.12985035394843658, 2.749530225308118]], "peak_params_": [[8.150664937273643, 0.6882362396945568, 2.476878313577275], [13.457187216331732, 0.4598515124197806, 5.38083460407711], [22.827029740109314, 0.31928585482287386, 11.871231779841386], [39.53901185852208, 0.1328879406545922, 5.499060450616236]], "r_squared_": 0.9854209413072037, "error_": 0.04282546917488644}
{"freq_range": [2.0, 80.0], "freq_res": 1.0, "aperiodic_params_": [0.044457839465748966, 0.757010167298323], "gaussian_params_": [[8.188319248103078, 0.8247158145948745, 1.003717510918827], [10.497703983792196, 1.3853768147259502, 0.2958030789965183], [12.365532377059571, 0.6940429225963148, 0.32591189051883507], [14.625727755709669, 0.48090162476003045, 1.116373090947428], [18.45852297533438, 0.22097835740372274, 1.4378359264763647], [23.7239800027149, 0.1668579750631354, 3.2751531153986906], [45.7305590542482, 0.12593650656276462, 1.1555944880921225], [69.4080705314351, 0.4253143880552413, 0.26079691815531525], [76.76478373441674, 0.13904478249660093, 1.8811422610432182]], "peak_params_": [[8.188319248103078, 0.8103286817188075, 2.007435021837654], [10.497703983792196, 0.49824859787051573, 0.5916061579930366], [12.365532377059571, 0.401179552764681, 0.6518237810376701], [14.625727755709669, 0.47167098159200727, 2.232746181894856], [18.45852297533438, 0.25124595342894773, 2.8756718529527294], [23.7239800027149, 0.16639796275622887, 6.550306230797381], [45.7305590542482, 0.12255936926416644, 2.311188976184245], [69.4080705314351, 0.12507305476550545, 0.5215938363106305], [76.76478373441674, 0.1379620536572379, 3.7622845220864365]], "r_squared_": 0.9854442432048013, "error_": 0.03685642140227935}
{"freq_range": [2.0, 80.0], "freq_res": 1.0, "aperiodic_params_": [0.12392858287348718, 0.8994248954341878], "gaussian_params_": [[8.202991259778605, 0.711441809693791, 1.0634179047918313], [13.110174439755161, 0.5077287438212639, 3.9144246836673426]], "peak_params_": [[8.202991259778605, 0.9151468665185001, 2.1268358095836626], [13.110174439755161, 0.5075548103398073, 7.828849367334685]], "r_squared_": 0.9754745742392047, "error_": 0.05900157601504173}
{"freq_range": [2.0, 80.0], "freq_res": 1.0, "aperiodic_params_": [0.1619330703646044, 0.9122276196658543], "gaussian_params_": [[8.282626120712303, 0.5795314287262552, 1.0019743219976296], [15.732545724466336, 0.4100201557875785, 5.999999999999999]], "peak_params_": [[8.282626120712303, 0.7356382372866503, 2.003948643995259], [15.732545724466336, 0.4096130042470342, 11.999999999999998]], "r_squared_": 0.9766132733287828, "error_": 0.05817809400375814}
{"freq_range": [2.0, 80.0], "freq_res": 1.0, "aperiodic_params_": [0.39740866049075946, 1.0932509052941], "gaussian_params_": [[7.995827322550661, 0.6174671988064243, 0.9720915486783186], [13.399937834938484, 0.45372446144349277, 3.465378414837638], [22.78676883954971, 0.32964150044706836, 4.733809827369176], [31.367833874987806, 0.4408772384715262, 0.2582957501618431], [75.60717340179473, 0.18982427288953688, 1.268659929985344], [79.3999573754886, 0.4289200565137394, 0.2952522863426404]], "peak_params_": [[7.995827322550661, 0.7547182389827447, 1.9441830973566372], [13.399937834938484, 0.4896100589685724, 6.930756829675276], [22.78676883954971, 0.33908656645662805, 9.467619654738352], [31.367833874987806, 0.23311158439536395, 0.5165915003236862], [75.60717340179473, 0.18093911763177295, 2.537319859970688], [79.3999573754886, 0.17667139132981835, 0.5905045726852808]], "r_squared_": 0.990772095473894, "error_": 0.03902713059696317}
{"freq_range": [2.0, 80.0], "freq_res": 1.0, "aperiodic_params_": [0.613510031165723, 1.2292473419018892], "gaussian_params_": [[7.958539882714191, 0.6658092949075595, 1.0941655493190892], [13.719172436776342, 0.5083635130993697, 3.0998673339715084], [18.273128567927678, 0.12265426560841702, 0.8560747433763807], [23.584921823488404, 0.3867474843027236, 4.149022050494307], [31.394948051261682, 0.6016786992216936, 0.2500000599635258], [75.03573347738568, 0.12042040766457777, 4.99036119851247], [79.34360430397008, 0.2459525066729543, 0.25000000000000155]], "peak_params_": [[7.958539882714191, 0.7583528192041123, 2.1883310986381783], [13.719172436776342, 0.5331075424980127, 6.199734667943017], [18.273128567927678, 0.46878224684958253, 1.7121494867527614], [23.584921823488404, 0.3868951048745285, 8.298044100988614], [31.394948051261682, 0.2510674126960253, 0.5000001199270516], [75.03573347738568, 0.12041732056149046, 9.98072239702494], [79.34360430397008, 0.18347891872726052, 0.5000000000000031]], "r_squared_": 0.9929924732176185, "error_": 0.035192953827919496}
{"freq_range": [2.0, 80.0], "freq_res": 1.0, "aperiodic_params_": [0.6826097075388114, 1.26831412243605], "gaussian_params_": [[7.9467106604616085, 0.6547273160418035, 1.07615918747463], [14.012720991487058, 0.5072742115603625, 3.50925268458901], [24.100719876784268, 0.38050247871336634, 4.876163249872094], [76.96704226608338, 0.13224849725778776, 5.89293216501913]], "peak_params_": [[7.9467106604616085, 0.7724434979436129, 2.15231837494926], [14.012720991487058, 0.5517956514945227, 7.01850536917802], [24.100719876784268, 0.3892608807655724, 9.752326499744187], [76.96704226608338, 0.1322464289786245, 11.78586433003826]], "r_squared_": 0.9921482547014406, "error_": 0.04153309028411363}
{"freq_range": [2.0, 80.0], "freq_res": 1.0, "aperiodic_params_": [0.5421587784535975, 1.1704311603815543], "gaussian_params_": [[7.9772247310649655, 0.6673800251461786, 1.0787116479149603], [14.2177817222622, 0.5430868033891412, 3.6541506314109538], [24.31561215525129, 0.3656016497991481, 4.890299917089092]], "peak_params_": [[7.9772247310649655, 0.7963205073777404, 2.1574232958299207], [14.2177817222622, 0.5816411815366042, 7.3083012628219075], [24.31561215525129, 0.37993150094619055, 9.780599834178185]], "r_squared_": 0.9904454331966134, "error_": 0.044666549089666045}
{"freq_range": [2.0, 80.0], "freq_res": 1.0, "aperiodic_params_": [0.3785166424889332, 1.03789358668005], "gaussian_params_": [[8.032937055595177, 0.6349837257467189, 1.1390563585637772], [14.084721437358182, 0.5076554024400808, 3.4459542355403636], [23.820523585636042, 0.30647165559846834, 4.800605111905305]], "peak_params_": [[8.032937055595177, 0.7428499749418151, 2.2781127171275544], [14.084721437358182, 0.5453179530558986, 6.891908471080727], [23.820523585636042, 0.3143439146855723, 9.60121022381061]], "r_squared_": 0.9892104111753155, "error_": 0.043900029239256254}
{"freq_range": [2.0, 80.0], "freq_res": 1.0, "aperiodic_params_": [0.026766250810133382, 0.734005786763354], "gaussian_params_": [[8.191626433495504, 0.6581802088233006, 1.2178633646945518], [13.490004961557702, 0.43758478249537336, 2.9188115671714954], [22.19226772545382, 0.27253975891830784, 4.125767523918346]], "peak_params_": [[8.191626433495504, 0.7254343837613366, 2.4357267293891036], [13.490004961557702, 0.4545102655494174, 5.837623134342991], [22.19226772545382, 0.2784841076792577, 8.251535047836692]], "r_squared_": 0.9817060172701684, "error_": 0.04290052033487656}
{"freq_range": [2.0, 80.0], "freq_res": 1.0, "aperiodic_params_": [-0.060755699498530075, 0.518233918373559], "gaussian_params_": [[7.795915366507538, 0.6046192297974613, 0.6863672075745342], [9.7382455221847, 0.44586849942301376, 1.1462278238474752], [12.439456584276545, 0.31590574318088965, 0.3615785283226685], [14.45749483150531, 0.30190240493478854, 1.433740640034258], [19.10681256393409, 0.27378834160739934, 1.1701333200734434], [22.0080102733792, 0.19430191472576716, 0.6090025549563726], [23.870958603464675, 0.27995445942475145, 1.1537716337454103], [43.49954118626483, 0.4696137313432858, 0.3352473864816069], [52.01956295069607, 0.09667801068392601, 1.086353439258263], [55.43733563947371, 0.5244686942312877, 0.2836719012712955], [60.86258939251096, 0.15328766348323755, 0.49572224232848605], [76.52469527961127, 0.3956689753867057, 0.2827788324592643]], "peak_params_": [[7.795915366507538, 0.719681799771604, 1.3727344151490684], [9.7382455221847, 0.44028247913084834, 2.2924556476949505], [12.439456584276545, 0.2840632646441104, 0.723157056645337], [14.45749483150531, 0.28740978093971814, 2.867481280068516], [19.10681256393409, 0.27468462652053516, 2.340266640146887], [22.0080102733792, 0.28234103000651034, 1.2180051099127451], [23.870958603464675, 0.27917575371336006, 2.3075432674908205], [43.49954118626483, 0.15474214456556923, 0.6704947729632138], [52.01956295069607, 0.09666233635576305, 2.172706878516526], [55.43733563947371, 0.16205131338782475, 0.567343802542591], [60.86258939251096, 0.14751035866727302, 0.9914444846569721], [76.52469527961127, 0.09634869324454554, 0.5655576649185285]], "r_squared_": 0.985985521428764, "error_": 0.020577187668100686}
{"freq_range": [2.0, 80.0], "freq_res": 1.0, "aperiodic_params_": [-0.24371499000842448, 0.2609861062700427], "gaussian_params_": [[8.357356402592973, 0.6108747609695276, 1.1630741745920612], [13.689061249088512, 0.33417890808514067, 3.529983612405103]], "peak_params_": [[8.357356402592973, 0.6739039913579981, 2.3261483491841224], [13.689061249088512, 0.33288970794025335, 7.059967224810206]], "r_squared_": 0.8956636036332373, "error_": 0.056648760160863815}
{"freq_range": [2.0, 80.0], "freq_res": 1.0, "aperiodic_params_": [0.05226746562394263, 0.7867452888640236], "gaussian_params_": [[8.284337885114642, 0.6253157965320462, 1.1678729295759236], [13.772001613737645, 0.5341765588451012, 3.346568260003291], [22.625619193892984, 0.17223632620982898, 3.9584926698500493]], "peak_params_": [[8.284337885114642, 0.727945620138489, 2.335745859151847], [13.772001613737645, 0.5489778364643734, 6.693136520006582], [22.625619193892984, 0.18339657122029218, 7.916985339700099]], "r_squared_": 0.979960300137089, "error_": 0.04738212660643974}
{"freq_range": [2.0, 80.0], "freq_res": 1.0, "aperiodic_params_": [0.40579935146326684, 1.1080021935708684], "gaussian_params_": [[7.949433207135247, 0.6623691385943135, 1.0771909013483603], [11.587019688332436, 0.28159789567334437, 2.3918971276656813], [16.756816846594134, 0.5523088403242623, 3.453896974306395], [25.807774619492232, 0.29376247235514097, 3.0948600416787886], [31.398966896072952, 0.6330642273356376, 0.26405784245527036], [76.50399646439426, 0.10509415100185854, 5.999242696504004], [79.42998140450764, 0.3132693030236852, 0.25496095580758754]], "peak_params_": [[7.949433207135247, 0.7753092337021572, 2.1543818026967205], [11.587019688332436, 0.4919548700752295, 4.783794255331363], [16.756816846594134, 0.5778149616527367, 6.90779394861279], [25.807774619492232, 0.30857825320761445, 6.189720083357577], [31.398966896072952, 0.274202774051012, 0.5281156849105407], [76.50399646439426, 0.10473557330167749, 11.998485393008009], [79.42998140450764, 0.17194550137493292, 0.5099219116151751]], "r_squared_": 0.9905003139664295, "error_": 0.04147743653876426}
{"freq_range": [2.0, 80.0], "freq_res": 1.0, "aperiodic_params_": [0.5642093525059646, 1.2020391793539968], "gaussian_params_": [[7.963499105326545, 0.6885037101298328, 1.1193903540375532], [12.3749849836816, 0.3499482638589395, 2.492654970796684], [17.37948128662323, 0.4926343530859675, 3.2679691359531433], [25.853746593558405, 0.33857456927592444, 3.0030041229963493], [31.40556076134078, 0.7930641257521994, 0.266928696467452], [76.06664671226912, 0.10737482829673448, 5.829195318565212], [79.448612238667, 0.4584545364790988, 0.2500069453338927]], "peak_params_": [[7.963499105326545, 0.7711514402923253, 2.2387807080751063], [12.3749849836816, 0.47414365541273845, 4.985309941593368], [17.37948128662323, 0.5562892374501699, 6.535938271906287], [25.853746593558405, 0.3533621360299183, 6.006008245992699], [31.40556076134078, 0.32810983544948824, 0.533857392934904], [76.06664671226912, 0.10736781053628364, 11.658390637130424], [79.448612238667, 0.18625056808188223, 0.5000138906677855]], "r_squared_": 0.9911000750187029, "error_": 0.0429959305368021}
{"freq_range": [2.0, 80.0], "freq_res": 1.0, "aperiodic_params_": [0.6550780729298507, 1.2449427653248675], "gaussian_params_": [[7.981379231671918, 0.6855812072083076, 1.1103593652040165], [14.50384960952832, 0.6006856746483722, 3.555875488402756], [18.53126756694961, 0.7883149393478911, 0.2911681043331085], [25.67736798532172, 0.436530490020308, 3.985796648588752], [31.297674386325767, 0.37274136145574993, 0.25000195104277984], [75.2269268129246, 0.15504655011859178, 0.9537166178032017], [79.17614255586271, 0.20336068394246729, 0.5890337996707204]], "peak_params_": [[7.981379231671918, 0.798280672320886, 2.220718730408033], [14.50384960952832, 0.6069368686060503, 7.111750976805512], [18.53126756694961, 0.5931114298674618, 0.582336208666217], [25.67736798532172, 0.4383309146009057, 7.971593297177504], [31.297674386325767, 0.36244508197416225, 0.5000039020855597], [75.2269268129246, 0.15071909448868626, 1.9074332356064034], [79.17614255586271, 0.19453033714326207, 1.178067599341441]], "r_squared_": 0.9939125939515789, "error_": 0.03576102650049447}
{"freq_range": [2.0, 80.0], "freq_res": 1.0, "aperiodic_params_": [0.5949314002445062, 1.2041903876080038], "gaussian_params_": [[7.992251755941468, 0.6641157930076605, 1.0920275242067317], [15.328032685696682, 0.6321988410878808, 4.223916126099278], [26.648022720141498, 0.32370482718983445, 3.686445848549426], [75.52662381468683, 0.17958305841963187, 1.064108028268377], [79.3420385194317, 0.1972481886924586, 0.5585864490544055]], "peak_params_": [[7.992251755941468, 0.8044698840830693, 2.1840550484134633], [15.328032685696682, 0.6324942809072697, 8.447832252198555], [26.648022720141498, 0.3361242119858918, 7.372891697098852], [75.52662381468683, 0.16266434588700696, 2.128216056536754], [79.3420385194317, 0.16440118825316996, 1.117172898108811]], "r_squared_": 0.9930734621335477, "error_": 0.03814826931690148}
{"freq_range": [2.0, 80.0], "freq_res": 1.0, "aperiodic_params_": [0.3749107254436435, 1.0551317412630337], "gaussian_params_": [[8.028232556865548, 0.6797499052866789, 1.2300289090936705], [14.721863052288853, 0.6266624959917481, 3.5942599019383885], [18.731856687156004, 0.2659365805210667, 0.5770554018016912], [25.478611754697702, 0.28818991171224695, 4.339163964760464]], "peak_params_": [[8.028232556865548, 0.7886898962003924, 2.460057818187341], [14.721863052288853, 0.6403968363257935, 7.188519803876777], [18.731856687156004, 0.6418576755758919, 1.1541108036033825], [25.478611754697702, 0.2969461757009052, 8.678327929520927]], "r_squared_": 0.9904277986378635, "error_": 0.04218396401149356}
{"freq_range": [2.0, 80.0], "freq_res": 1.0, "aperiodic_params_": [0.10434243518329651, 0.7956279855338882], "gaussian_params_": [[8.211100255522425, 0.6657168267812033, 1.2608510596463292], [14.013184382838983, 0.4844538703444449, 2.979699838606277], [18.757096178332965, 0.23138754111913995, 0.5711587254478967], [22.632676035717605, 0.24196549316392982, 4.470675774325928]], "peak_params_": [[8.211100255522425, 0.7208216128752386, 2.5217021192926583], [14.013184382838983, 0.5219727285841853, 5.959399677212554], [18.757096178332965, 0.5047235777039144, 1.1423174508957934], [22.632676035717605, 0.2462788484971271, 8.941351548651856]], "r_squared_": 0.9825532309259801, "error_": 0.044364471048841926}
{"freq_range": [2.0, 80.0], "freq_res": 1.0, "aperiodic_params_": [-0.4309687172084207, 0.11173086188925414], "gaussian_params_": [[7.799841892495937, 0.6096647390508398, 0.717311193957947], [9.508664431080817, 0.3976651063304106, 0.8708951559505096], [12.913754901960964, 0.334668517143269, 1.6780604809656026], [21.707782639072995, 0.4327364385752361, 2.9721242464198707], [39.48371793520821, 0.7322846783952184, 0.2727077120906089], [45.753668092462256, 0.19097300799700445, 5.041895994050494]], "peak_params_": [[7.799841892495937, 0.6796857031548794, 1.434622387915894], [9.508664431080817, 0.41898128697666165, 1.7417903119010192], [12.913754901960964, 0.3402747879803983, 3.356120961931205], [21.707782639072995, 0.43065295484219535, 5.944248492839741], [39.48371793520821, 0.22974097957986483, 0.5454154241812178], [45.753668092462256, 0.1907452170671412, 10.083791988100987]], "r_squared_": 0.8894529791418556, "error_": 0.04644629839892453}
{"freq_range": [2.0, 80.0], "freq_res": 1.0, "aperiodic_params_": [0.11748504110137602, 0.6455911139783926], "gaussian_params_": [[7.80440250235395, 0.8160631452959408, 0.7642624902973633], [10.010947678877766, 0.4486825770391605, 1.0412653468700128], [13.96096668083919, 0.6088549922473535, 3.3369018476355365], [45.39137661294365, 0.7103827735998794, 0.26940437849904986]], "peak_params_": [[7.80440250235395, 0.9827493560387497, 1.5285249805947265], [10.010947678877766, 0.7628160971428898, 2.0825306937400256], [13.96096668083919, 0.609105095238163, 6.673803695271073], [45.39137661294365, 0.2472910258904406, 0.5388087569980997]], "r_squared_": 0.9638659497890563, "error_": 0.06575767059401338}
{"freq_range": [2.0, 80.0], "freq_res": 1.0, "aperiodic_params_": [0.13757362725097425, 0.8335763394899914], "gaussian_params_": [[8.115459661125843, 0.566839013030557, 1.0844911000753155], [15.0258380210771, 0.602198380322723, 3.9383893092887896], [23.93697557278674, 0.14630968435897293, 0.2500042172777798], [26.84163141243743, 0.1538522855185973, 3.6780903198706523], [42.611286113374994, 0.5101907909669275, 0.3185487237055364], [45.04367172448185, 0.26622553819839506, 0.6839541376525079]], "peak_params_": [[8.115459661125843, 0.6862904467611338, 2.168982200150631], [15.0258380210771, 0.6030490488644513, 7.876778618577579], [23.93697557278674, 0.30079037540611164, 0.5000084345555597], [26.84163141243743, 0.15963165801483592, 7.3561806397413045], [42.611286113374994, 0.24539589646010218, 0.6370974474110728], [45.04367172448185, 0.265684167186397, 1.3679082753050158]], "r_squared_": 0.9779595835069295, "error_": 0.054773809637637914}
{"freq_range": [2.0, 80.0], "freq_res": 1.0, "aperiodic_params_": [0.3152674061903178, 1.0047777343009285], "gaussian_params_": [[7.918376853145847, 0.5484578706823432, 0.9594800607037607], [16.316097758748402, 0.6835032651659366, 5.456876491839369], [31.031385086045464, 0.19518246599279837, 0.5298660535859511], [74.91073077166685, 0.17756330161772158, 0.7738344847033783]], "peak_params_": [[7.918376853145847, 0.7604807852663029, 1.9189601214075214], [16.316097758748402, 0.6823574860113034, 10.913752983678737], [31.031385086045464, 0.21313785268687568, 1.0597321071719021], [74.91073077166685, 0.17638573214157516, 1.5476689694067567]], "r_squared_": 0.9833824287201454, "error_": 0.05558111595596122}
{"freq_range": [2.0, 80.0], "freq_res": 1.0, "aperiodic_params_": [0.4982713725339877, 1.1547736276079434], "gaussian_params_": [[7.950852968670407, 0.6630506927256907, 1.1129372599085692], [15.882814244300102, 0.7666281504980943, 4.3056780308627145], [26.38904660254194, 0.25911002514272535, 3.313666073541905], [31.41172959637619, 0.7251428032238696, 0.257620932738647]], "peak_params_": [[7.950852968670407, 0.8058703365000468, 2.2258745198171384], [15.882814244300102, 0.7682454464741056, 8.611356061725429], [26.38904660254194, 0.305821599459804, 6.62733214708381], [31.41172959637619, 0.3022197586176196, 0.515241865477294]], "r_squared_": 0.9892703836985087, "error_": 0.04857022087261864}
{"freq_range": [2.0, 80.0], "freq_res": 1.0, "aperiodic_params_": [0.5722457331643265, 1.1997270298244378], "gaussian_params_": [[7.960720238674185, 0.6741723766048399, 1.1181025930030708], [15.71470902465397, 0.7348155247156942, 4.2703304545249985], [26.510858855390488, 0.2901677043621405, 3.6037494105585712], [30.049601723825415, 0.006275361865897708, 0.2583634150178623], [31.35578686599914, 0.34705669168471, 0.31962741071336614], [75.13373639926877, 0.17822530682549362, 0.9055070096572215]], "peak_params_": [[7.960720238674185, 0.81745982886975, 2.2362051860061416], [15.71470902465397, 0.7373024434400414, 8.540660909049997], [26.510858855390488, 0.3098751398661286, 7.2074988211171425], [30.049601723825415, 0.19052455366640442, 0.5167268300357246], [31.35578686599914, 0.32157135182233587, 0.6392548214267323], [75.13373639926877, 0.17629205321830344, 1.811014019314443]], "r_squared_": 0.9908046807815922, "error_": 0.04565614950834478}
{"freq_range": [2.0, 80.0], "freq_res": 1.0, "aperiodic_params_": [0.5221265975073138, 1.162881862063233], "gaussian_params_": [[7.9817667091047575, 0.6558108470906393, 1.1206197744642552], [16.03290465955232, 0.7387229879845097, 4.675625708000773], [28.452034599135946, 0.24458175644573446, 3.1922655964030575]], "peak_params_": [[7.9817667091047575, 0.8245882674842796, 2.2412395489285104], [16.03290465955232, 0.7388261591928578, 9.351251416001546], [28.452034599135946, 0.2700661428243005, 6.384531192806115]], "r_squared_": 0.9903933053850006, "error_": 0.046499486979718424}
{"freq_range": [2.0, 80.0], "freq_res": 1.0, "aperiodic_params_": [0.4301918876599785, 1.08831302841344], "gaussian_params_": [[8.011760255780402, 0.6666486371640191, 1.1967650307343263], [14.264756234372115, 0.6171839972895569, 3.423592075333091], [18.491908198324612, 0.2726701212268066, 1.0324542423033964], [24.063207386806234, 0.25027936356511027, 5.161968791960585], [79.38426927312845, 0.18742236725513925, 0.688442754302042]], "peak_params_": [[8.011760255780402, 0.784284942281013, 2.3935300614686525], [14.264756234372115, 0.6527892067738111, 6.847184150666182], [18.491908198324612, 0.7093251949152116, 2.064908484606793], [24.063207386806234, 0.2610895393121089, 10.32393758392117], [79.38426927312845, 0.16038655759858722, 1.376885508604084]], "r_squared_": 0.9909212608042968, "error_": 0.04211515493561156}
{"freq_range": [2.0, 80.0], "freq_res": 1.0, "aperiodic_params_": [0.1499835113902826, 0.8251534879631259], "gaussian_params_": [[8.174587206601311, 0.6126937294610131, 1.2339350599176862], [13.781770552597434, 0.5369854047038966, 2.955099998543431], [18.628303933762414, 0.35657673936519246, 1.1551488575131306], [23.71816447758928, 0.26327559421375246, 1.913142968824614], [26.983213986291208, 0.20925222487431253, 0.25035759376282], [30.221683805793703, 0.18538548946819328, 1.3880170112249508]], "peak_params_": [[8.174587206601311, 0.6857892766132071, 2.4678701198353723], [13.781770552597434, 0.5356491332885182, 5.910199997086862], [18.628303933762414, 0.46410993840816417, 2.310297715026261], [23.71816447758928, 0.2618097452652106, 3.826285937649228], [26.983213986291208, 0.28179817233355386, 0.50071518752564], [30.221683805793703, 0.18423641047620698, 2.7760340224499016]], "r_squared_": 0.974516407763871, "error_": 0.053726558333242115}
{"freq_range": [2.0, 80.0], "freq_res": 1.0, "aperiodic_params_": [-0.01560429452360948, 0.6129461029517084], "gaussian_params_": [[8.27244679650653, 0.6128924928802972, 1.275171756534588], [12.893315662189627, 0.47842363510334124, 2.336009455602497], [15.464863853089952, 0.34487715165287386, 0.30402765011244903], [17.492356813290563, 0.480072801777793, 0.3860220068518202], [18.68284935036282, 0.7337037696579284, 0.2501910223520484], [23.547965400864054, 0.3786738590878366, 5.999997240426694], [23.564716681920252, 0.44355276342788874, 0.2942445015087191], [26.573281299438786, 0.7273284201400056, 0.29093993301480403], [31.262223894724016, 0.34335013144556814, 0.7617401734170309], [35.77751633764291, 0.34282386637049655, 1.7932971245524738], [44.19784110221642, 0.29310517831566335, 3.3002830695244723], [54.939389124519614, 0.1519987988394545, 5.999999999999999]], "peak_params_": [[8.27244679650653, 0.6655808794268727, 2.550343513069176], [12.893315662189627, 0.5593135072189668, 4.672018911204994], [15.464863853089952, 0.5629789484777192, 0.6080553002248981], [17.492356813290563, 0.5236241952889872, 0.7720440137036404], [18.68284935036282, 0.6285927599417639, 0.5003820447040968], [23.547965400864054, 0.5261113576161731, 11.999994480853388], [23.564716681920252, 0.5261113576161731, 0.5884890030174382], [26.573281299438786, 0.5690069565646099, 0.5818798660296081], [31.262223894724016, 0.5087140347601408, 1.5234803468340619], [35.77751633764291, 0.39859566804374247, 3.5865942491049476], [44.19784110221642, 0.32256456739100237, 6.6005661390489445], [54.939389124519614, 0.15337401288883978, 11.999999999999998]], "r_squared_": 0.9714984297702758, "error_": 0.047755631536262076}
{"freq_range": [2.0, 80.0], "freq_res": 1.0, "aperiodic_params_": [0.17807477302229008, 0.5231266738969211], "gaussian_params_": [[4.542061163706751, 0.22175347072873489, 1.6313794116364937], [8.164720783355902, 0.4408446441709701, 0.6207023921100733], [10.288890199023212, 0.3139963087754792, 1.4286103329278657], [14.850725260448838, 0.24294004979586908, 1.5363025324167965], [40.82800190266011, 0.21675435939864643, 0.3862966022576863], [42.8827704016355, 0.2862293647633043, 0.5504371796261861], [44.627928964861, 0.678027530396026, 0.28961605734549956], [49.26814864536777, 0.19944675614223148, 1.8867798376769178], [53.44109055972873, 0.9552175804157882, 0.2789744927471261], [58.38494863791866, 0.2937972915261547, 1.7942262386393877], [63.97437712133167, 0.08902830074929616, 0.25000000160072683], [64.95118405132517, 0.2336056256159268, 3.5290001121812677], [74.3062239043136, 0.38396043819161324, 0.8010691330313621]], "peak_params_": [[4.542061163706751, 0.21351939219225635, 3.2627588232729874], [8.164720783355902, 0.5360576898087004, 1.2414047842201466], [10.288890199023212, 0.3156969031104736, 2.8572206658557313], [14.850725260448838, 0.24316212109713578, 3.072605064833593], [40.82800190266011, 0.19713735814343392, 0.7725932045153726], [42.8827704016355, 0.280611378175364, 1.1008743592523722], [44.627928964861, 0.3126810420172771, 0.5792321146909991], [49.26814864536777, 0.19745156574049316, 3.7735596753538356], [53.44109055972873, 0.3058970785883037, 0.5579489854942522], [58.38494863791866, 0.3206897407762845, 3.5884524772787754], [63.97437712133167, 0.3160288199396346, 0.5000000032014537], [64.95118405132517, 0.2339313823791478, 7.0580002243625355], [74.3062239043136, 0.36563233700779646, 1.6021382660627241]], "r_squared_": 0.8891083959156857, "error_": 0.055923785760384086}
{"freq_range": [2.0, 80.0], "freq_res": 1.0, "aperiodic_params_": [0.11409869251170807, 0.6969640212288508], "gaussian_params_": [[8.025921109993858, 0.4663722376498122, 0.9182823578748613], [15.132583157594306, 0.43563718795941475, 4.538138928324406], [23.957767747393273, 0.2100593881987201, 0.2500010318300075], [43.826434541938134, 0.2010566384783305, 2.5074023551310507], [44.99635480717963, 0.1420558258966023, 0.25007059347307986], [53.033427688621046, 0.21793730859341512, 0.2500000065546777], [59.711540173281314, 0.15724245457024102, 1.6783921440533085], [64.72325129339131, 0.15513141286269364, 1.5993119018218382]], "peak_params_": [[8.025921109993858, 0.5928700782155764, 1.8365647157497227], [15.132583157594306, 0.43545131191413844, 9.076277856648812], [23.957767747393273, 0.2716565448157825, 0.500002063660015], [43.826434541938134, 0.20062626449909238, 5.014804710262101], [44.99635480717963, 0.32223864920351897, 0.5001411869461597], [53.033427688621046, 0.21630009995052657, 0.5000000131093554], [59.711540173281314, 0.15691754593877372, 3.356784288106617], [64.72325129339131, 0.15392431735509582, 3.1986238036436765]], "r_squared_": 0.9664664845886601, "error_": 0.05062563648822691}
{"freq_range": [2.0, 80.0], "freq_res": 1.0, "aperiodic_params_": [0.3675675830464, 0.9878238285314882], "gaussian_params_": [[7.9181595996293845, 0.5268672484009393, 0.9927413570308925], [15.850383485048447, 0.6502240100551, 4.477194405845052], [21.990944611984293, 0.07442184926680755, 0.25008088125287486]], "peak_params_": [[7.9181595996293845, 0.6648618610112063, 1.985482714061785], [15.850383485048447, 0.6498610499191644, 8.954388811690103], [21.990944611984293, 0.3275294866366356, 0.5001617625057497]], "r_squared_": 0.9839826398000201, "error_": 0.05189113881777566}
{"freq_range": [2.0, 80.0], "freq_res": 1.0, "aperiodic_params_": [0.5261887709650787, 1.148382500327791], "gaussian_params_": [[7.903447212530962, 0.5905340903695873, 0.9862276014287528], [15.998798523231056, 0.7204723449021424, 5.058608134594054], [30.89211716554596, 0.21098278539743204, 0.7049482395462547]], "peak_params_": [[7.903447212530962, 0.7941014391451511, 1.9724552028575055], [15.998798523231056, 0.7204723245806329, 10.117216269188107], [30.89211716554596, 0.21739830852699926, 1.4098964790925095]], "r_squared_": 0.9868386846200774, "error_": 0.05464702406185092}
{"freq_range": [2.0, 80.0], "freq_res": 1.0, "aperiodic_params_": [0.5046666729972251, 1.1099512188593246], "gaussian_params_": [[7.7951381138625315, 0.6588950534103689, 0.8513153158565034], [10.113678497209726, 0.23854152974646473, 0.670140687092265], [16.064568217913333, 0.6800012604425411, 4.67591565130186]], "peak_params_": [[7.7951381138625315, 0.7954081110163854, 1.7026306317130069], [10.113678497209726, 0.5514079368644731, 1.34028137418453], [16.064568217913333, 0.6799364323441185, 9.35183130260372]], "r_squared_": 0.9867580551225379, "error_": 0.05375563716248535}
{"freq_range": [2.0, 80.0], "freq_res": 1.0, "aperiodic_params_": [0.3819726289787912, 0.9979074467558566], "gaussian_params_": [[7.7747905704541935, 0.5443099614326559, 0.9380651895775882], [10.34812114215362, 0.24200065117190447, 1.8959940833833129], [16.03256797521514, 0.5742859843524445, 4.100296959051193], [66.29284747428727, 0.08108088401173731, 5.999999999611697]], "peak_params_": [[7.7747905704541935, 0.725533657017676, 1.8761303791551764], [10.34812114215362, 0.4651903483811868, 3.7919881667666258], [16.03256797521514, 0.5771137850013419, 8.200593918102387], [66.29284747428727, 0.08098436556495381, 11.999999999223395]], "r_squared_": 0.9840786392585459, "error_": 0.047587288628619114}
{"freq_range": [2.0, 80.0], "freq_res": 1.0, "aperiodic_params_": [0.28277938363106936, 0.8704368664265477], "gaussian_params_": [[7.979613638185047, 0.5490333969135093, 1.103456476349336], [12.916714975668647, 0.5225298270698046, 2.7717594683680553], [17.668852647258532, 0.25763132055393667, 1.576345343644937], [21.547940320265123, 0.10742723616811178, 2.9462627040328333], [63.929875469357796, 0.12428285243472217, 5.999999999999999]], "peak_params_": [[7.979613638185047, 0.6572951224907724, 2.206912952698672], [12.916714975668647, 0.5271155148184358, 5.543518936736111], [17.668852647258532, 0.4012556974388505, 3.152690687289874], [21.547940320265123, 0.11451447873088749, 5.892525408065667], [63.929875469357796, 0.12427436446503104, 11.999999999999998]], "r_squared_": 0.974542932033414, "error_": 0.053530010319778415}
{"freq_range": [2.0, 80.0], "freq_res": 1.0, "aperiodic_params_": [0.29314933310593616, 0.7562466706145766], "gaussian_params_": [[8.058117627590416, 0.4922636354086705, 1.0071225114835813], [10.489407697826447, 0.6223275278026463, 0.30300360968991985], [13.191724280555077, 0.271762576136099, 2.398361570806242], [23.8839954849022, 0.1828719808070396, 0.25013965159827756], [44.456420231872876, 0.8098089244788886, 0.2853265387884881], [46.433699834001104, 0.35266456493571274, 0.3916236154410453], [48.7284047144351, 0.17319482760385987, 0.7520078039078388], [56.88748981067917, 0.16597999362748125, 2.907906984152985], [64.02178960326921, 0.20251368578341059, 0.44720494331122623], [68.18485818273861, 0.14558559420488326, 4.641271705215895], [71.99046822784415, 0.10704187445183502, 0.25000000000008454], [79.13627127962964, 0.1777863782025886, 0.643303498275528]], "peak_params_": [[8.058117627590416, 0.5175456922794088, 2.0142450229671627], [10.489407697826447, 0.357678217412812, 0.6060072193798397], [13.191724280555077, 0.27089854125602153, 4.796723141612484], [23.8839954849022, 0.16423765947372593, 0.5002793031965551], [44.456420231872876, 0.2252953863881757, 0.5706530775769763], [46.433699834001104, 0.19139793511000858, 0.7832472308820906], [48.7284047144351, 0.16648041044439743, 1.5040156078156777], [56.88748981067917, 0.173836528157447, 5.81581396830597], [64.02178960326921, 0.3075665517041899, 0.8944098866224525], [68.18485818273861, 0.14558208186587107, 9.28254341043179], [71.99046822784415, 0.21081139052207387, 0.5000000000001691], [79.13627127962964, 0.18348101662001026, 1.286606996551056]], "r_squared_": 0.9696733747196802, "error_": 0.038662552011573516}
{"freq_range": [2.0, 80.0], "freq_res": 1.0, "aperiodic_params_": [-0.6677613181394836, 0.19481441708068467], "gaussian_params_": [[8.12971759034645, 0.49734248570648776, 0.6345399596161642], [10.378706056894195, 0.17101866825352713, 2.086709692477928], [35.61780654758035, 0.4589143455050969, 0.2500024052705784], [39.490666107082724, 0.15522664640977438, 1.124709125594058], [46.57277697583295, 0.19129030748443848, 2.906880368327218], [59.385895324988134, 0.2580370340343222, 0.5547371944617346], [63.013528636918004, 0.14807866911043763, 0.8404847111698501], [66.39763601160477, 0.5189639624079008, 0.2752323448007395], [67.65272129441333, 0.49194067292638083, 0.25015978002915945], [74.54796426561896, 0.10624048622546976, 3.8971735683740523]], "peak_params_": [[8.12971759034645, 0.5763625655242688, 1.2690799192323283], [10.378706056894195, 0.1746845820708307, 4.173419384955856], [35.61780654758035, 0.1441516206003436, 0.5000048105411568], [39.490666107082724, 0.1475628134461967, 2.249418251188116], [46.57277697583295, 0.18923548240223842, 5.813760736654436], [59.385895324988134, 0.20264207180104044, 1.1094743889234693], [63.013528636918004, 0.14937674510817134, 1.6809694223397003], [66.39763601160477, 0.19262138439343368, 0.550464689601479], [67.65272129441333, 0.21358483719703325, 0.5003195600583189], [74.54796426561896, 0.10552821371935939, 7.7943471367481045]], "r_squared_": 0.8500044721192147, "error_": 0.03622777216726125}
{"freq_range": [2.0, 80.0], "freq_res": 1.0, "aperiodic_params_": [-0.11988026278058857, 0.49169918393756346], "gaussian_params_": [[8.100318278334019, 0.5328705300440707, 0.8722886465678737], [10.36225119422853, 0.33805606953765716, 0.9311932733207782], [14.010367727752975, 0.24623026927458339, 1.551272095811087], [18.251124951248052, 0.17002164023165373, 2.107734226373388], [41.97798692587554, 0.17306330545462903, 3.092779601566605], [47.059707640899774, 0.23750360480163046, 1.3656049014528364], [59.28313808894768, 0.3036508505555028, 0.49824193469669137], [62.978269550930094, 0.19158717769516534, 0.522128832008479], [67.5915401467877, 0.8693776955924019, 0.26139382394773325]], "peak_params_": [[8.100318278334019, 0.5430332934277609, 1.7445772931357475], [10.36225119422853, 0.37195279949382765, 1.8623865466415563], [14.010367727752975, 0.2686301107015573, 3.102544191622174], [18.251124951248052, 0.17783579414888095, 4.215468452746776], [41.97798692587554, 0.17330707389958844, 6.18555920313321], [47.059707640899774, 0.2835847834155756, 2.731209802905673], [59.28313808894768, 0.2583747002630725, 0.9964838693933827], [62.978269550930094, 0.19142132199501583, 1.044257664016958], [67.5915401467877, 0.2564370534504976, 0.5227876478954665]], "r_squared_": 0.9517605052173627, "error_": 0.03854856637998904}
{"freq_range": [2.0, 80.0], "freq_res": 1.0, "aperiodic_params_": [0.29831743522753146, 0.8964591931471629], "gaussian_params_": [[8.082226399149288, 0.5836824996713715, 1.1412021251031286], [10.888023911494777, 0.31437063192650794, 0.7671331039515678], [13.650834846337553, 0.24589729108223693, 0.7519402738337587], [15.528034079505687, 0.2388363847805431, 0.3285546665597109], [16.700986970290373, 0.44253862927975246, 3.3497603745702236], [38.42918875436025, 0.48322746706594194, 0.28162756540409617], [59.38611675586142, 0.40562599627045215, 0.30076733503719905], [63.58735985124136, 0.4122011815968472, 0.3207946982358664], [65.75972334899106, 0.20215362575842302, 0.6305063652044404], [67.76335957985106, 0.34908627173147333, 0.2500110721132872]], "peak_params_": [[8.082226399149288, 0.5975979826846358, 2.282404250206257], [10.888023911494777, 0.4377370876609157, 1.5342662079031355], [13.650834846337553, 0.5405767421316764, 1.5038805476675174], [15.528034079505687, 0.5199388897757184, 0.6571093331194218], [16.700986970290373, 0.4408016144487238, 6.699520749140447], [38.42918875436025, 0.15129968891424772, 0.5632551308081923], [59.38611675586142, 0.1779310222267778, 0.6015346700743981], [63.58735985124136, 0.18434100838462109, 0.6415893964717329], [65.75972334899106, 0.18799492410862562, 1.2610127304088807], [67.76335957985106, 0.22341068609784376, 0.5000221442265744]], "r_squared_": 0.9842986016844287, "error_": 0.04160070584756017}
{"freq_range": [2.0, 80.0], "freq_res": 1.0, "aperiodic_params_": [0.2796198335341623, 0.8768743577826885], "gaussian_params_": [[8.03126286332447, 0.5070807868229527, 1.116488003374587], [15.130550107641616, 0.5115756667777074, 3.844016079219434]], "peak_params_": [[8.03126286332447, 0.5984453889098513, 2.232976006749174], [15.130550107641616, 0.5112807251003677, 7.688032158438868]], "r_squared_": 0.9717032281878754, "error_": 0.05986107351304858}
{"freq_range": [2.0, 80.0], "freq_res": 1.0, "aperiodic_params_": [0.33925498492160966, 0.8631659295256152], "gaussian_params_": [[7.997809221907914, 0.4966402594001444, 1.113052686751955], [14.282756246531475, 0.454139385922485, 3.5566592378892437], [59.10441577867962, 0.1933375169207791, 0.4250229465362581], [64.42667636550179, 0.6996024804521925, 0.26223181078348123], [71.40033928795908, 0.1398311856064789, 5.388557576535932], [79.48754246092551, 0.6768501480776162, 0.2926301936118291]], "peak_params_": [[7.997809221907914, 0.5920493473162414, 2.22610537350391], [14.282756246531475, 0.45270673603359607, 7.113318475778487], [59.10441577867962, 0.19749088863474562, 0.8500458930725162], [64.42667636550179, 0.24065079549466728, 0.5244636215669625], [71.40033928795908, 0.13944580818771302, 10.777115153071865], [79.48754246092551, 0.22066560642931066, 0.5852603872236583]], "r_squared_": 0.9684801690757261, "error_": 0.050778469077077094}
{"freq_range": [2.0, 80.0], "freq_res": 1.0, "aperiodic_params_": [-0.04193091259891562, 0.4870755211094859], "gaussian_params_": [[7.904694610446031, 0.4709350260890595, 1.158771760635034], [13.434881756949435, 0.34025435142215604, 3.2060506007600047], [41.357449759244794, 0.522261540121092, 0.2500636172236798], [45.33929673825856, 0.12530226252043103, 4.276204462051272], [52.01763021933826, 0.1674448200921056, 1.5290847399148464], [59.65884674710953, 0.19827140376513522, 1.190029300071607], [64.33733972952699, 0.48847447395173105, 0.28550704305037744], [75.58101972177849, 0.8877556988680172, 0.26441523661522826]], "peak_params_": [[7.904694610446031, 0.5502154528841413, 2.317543521270068], [13.434881756949435, 0.337168296129893, 6.412101201520009], [41.357449759244794, 0.26289420116015116, 0.5001272344473596], [45.33929673825856, 0.1249129194963795, 8.552408924102544], [52.01763021933826, 0.20468318164130117, 3.058169479829693], [59.65884674710953, 0.1906406396824567, 2.380058600143214], [64.33733972952699, 0.24331344442392466, 0.5710140861007549], [75.58101972177849, 0.2529749717458831, 0.5288304732304565]], "r_squared_": 0.9086253685503431, "error_": 0.05736753568153391}
{"freq_range": [2.0, 80.0], "freq_res": 1.0, "aperiodic_params_": [-0.3544248256207375, 0.24233914902396503], "gaussian_params_": [[8.132628522429503, 0.563490021436741, 0.9595068210317181], [10.531676402101137, 0.7560155551615614, 0.33365034776601504], [13.455432891652821, 0.2286426111642866, 1.5187930211693705], [17.547965400794304, 0.08531176940074774, 1.021379670031461], [41.0365500303989, 0.21104638911580761, 0.5609623800529138], [44.170382289143454, 0.22769735129965088, 0.2500501675467673], [45.871977529302896, 0.1569541355099104, 0.5276292030141678], [50.661466479246506, 0.11594595201196194, 3.4042802314492646], [59.30233525307755, 0.27635582607479026, 0.46318241568312146], [63.938757486694655, 0.26281578305548214, 0.38748563191869134]], "peak_params_": [[8.132628522429503, 0.5584935248303979, 1.9190136420634363], [10.531676402101137, 0.3506663541589758, 0.6673006955320301], [13.455432891652821, 0.2185962885882592, 3.037586042338741], [17.547965400794304, 0.07995270242015484, 2.042759340062922], [41.0365500303989, 0.21266548296543863, 1.1219247601058275], [44.170382289143454, 0.19790718717620337, 0.5001003350935346], [45.871977529302896, 0.19780705673025234, 1.0552584060283356], [50.661466479246506, 0.11537407175687964, 6.808560462898529], [59.30233525307755, 0.2291051683586076, 0.9263648313662429], [63.938757486694655, 0.2596073890330013, 0.7749712638373827]], "r_squared_": 0.8550571360320262, "error_": 0.0472548805515007}
{"freq_range": [2.0, 80.0], "freq_res": 1.0, "aperiodic_params_": [-0.11780334156228453, 0.4444961143847379], "gaussian_params_": [[8.13487310734281, 0.40536388212279123, 1.0702396725863312], [14.146955935406806, 0.1679973846893997, 2.7817303798032804], [38.68818283545653, 0.3013084382398272, 0.6021808110829876], [42.43033179088426, 0.16608588704226512, 1.2512704864021489], [47.03534929815738, 0.2242103474003049, 1.2468375302174843], [58.981414578559914, 0.3203933902424738, 0.5653870319884674], [63.47133603947326, 0.9446599021795016, 0.25971994926762054], [67.56573058867052, 1.2431159982586117, 0.2503315839684926]], "peak_params_": [[8.13487310734281, 0.4167783237479177, 2.1404793451726625], [14.146955935406806, 0.16776323827266448, 5.563460759606561], [38.68818283545653, 0.26737958287066965, 1.2043616221659752], [42.43033179088426, 0.1566130314016949, 2.5025409728042978], [47.03534929815738, 0.22433120755198055, 2.4936750604349687], [58.981414578559914, 0.3202203331602874, 1.1307740639769348], [63.47133603947326, 0.18201725231167665, 0.5194398985352411], [67.56573058867052, 0.27606910766819515, 0.5006631679369852]], "r_squared_": 0.9290366838024346, "error_": 0.04127734106925302}
{"freq_range": [2.0, 80.0], "freq_res": 1.0, "aperiodic_params_": [-0.22597607450374124, 0.3317254933916007], "gaussian_params_": [[8.063814072400705, 0.43739001722888715, 1.289934248667494], [38.53972591261726, 0.5498224248703928, 0.29171593692883097], [44.77571419600923, 0.108283897239844, 5.409786360062165], [58.976629572183654, 0.16100739955593246, 0.2500048802188228], [66.54796540086404, 0.10423792653865296, 5.999999999999999]], "peak_params_": [[8.063814072400705, 0.4368551192642838, 2.579868497334988], [38.53972591261726, 0.21960004724357574, 0.5834318738576619], [44.77571419600923, 0.10835581957540596, 10.81957272012433], [58.976629572183654, 0.21096736823738127, 0.5000097604376456], [66.54796540086404, 0.10396594952991889, 11.999999999999998]], "r_squared_": 0.7501378896388188, "error_": 0.06409782688859511}
{"freq_range": [2.0, 80.0], "freq_res": 1.0, "aperiodic_params_": [-0.2580531722245119, 0.22629665785901204], "gaussian_params_": [[8.13973119893196, 0.4156288265644431, 1.4650868400817147], [41.00068474699915, 0.17156960624714102, 0.25000012636717694], [47.1858075830521, 0.13004668114719725, 5.999996556918629], [59.428958435642606, 0.5575859592860845, 0.2935502727276655], [64.41595055663954, 0.7200708488239577, 0.2868442300823885]], "peak_params_": [[8.13973119893196, 0.4137427971920977, 2.9301736801634295], [41.00068474699915, 0.24800432334501538, 0.5000002527343539], [47.1858075830521, 0.129984337813147, 11.999993113837258], [59.428958435642606, 0.2104190451581764, 0.587100545455331], [64.41595055663954, 0.2541947972819631, 0.573688460164777]], "r_squared_": 0.6066475782867193, "error_": 0.0729767479458833}
{"freq_range": [2.0, 80.0], "freq_res": 1.0, "aperiodic_params_": [-0.8038956768309239, 0.6299184310666393], "gaussian_params_": [[7.948035644900408, 0.9598229480100018, 0.8521126802888566], [10.255863165920381, 0.48052627130618664, 0.7695748233077478], [13.603103993961854, 0.495682636073069, 2.3789194823936244], [73.59396666912609, 0.22101489814577494, 5.999999999999999]], "peak_params_": [[7.948035644900408, 0.995528218903767, 1.7042253605777131], [10.255863165920381, 0.6649527650593638, 1.5391496466154957], [13.603103993961854, 0.4888351958996564, 4.757838964787249], [73.59396666912609, 0.22050940496228, 11.999999999999998]], "r_squared_": 0.9646088486684292, "error_": 0.046581580055561}
{"freq_range": [2.0, 80.0], "freq_res": 1.0, "aperiodic_params_": [-0.7931185953296315, 0.6777015962665671], "gaussian_params_": [[8.214470663703695, 0.6666013761426656, 1.2978416479051142], [13.621117828373553, 0.522745131473365, 3.4271725441933745], [22.572404641715895, 0.166723173331813, 2.2036903213976697], [51.36811935678056, 0.4902054376035144, 0.27423685857584734]], "peak_params_": [[8.214470663703695, 0.7937483451789209, 2.5956832958102285], [13.621117828373553, 0.519678993502847, 6.854345088386749], [22.572404641715895, 0.17597487616097762, 4.4073806427953395], [51.36811935678056, 0.19911548681823055, 0.5484737171516947]], "r_squared_": 0.974842224441729, "error_": 0.0518142124649928}
{"freq_range": [2.0, 80.0], "freq_res": 1.0, "aperiodic_params_": [-0.21559802761090563, 0.9016010069015414], "gaussian_params_": [[7.636997663652177, 0.7405008131886458, 0.8213828383273406], [9.694158196211852, 0.523510716878296, 1.484338240567929], [14.375543866378457, 0.441096050978384, 3.198866773269953], [22.649414433490065, 0.19102589906512432, 2.5467233537781166]], "peak_params_": [[7.636997663652177, 1.0050625954000674, 1.6427656766546812], [9.694158196211852, 0.6974107599413116, 2.968676481135858], [14.375543866378457, 0.44645626741783395, 6.397733546539906], [22.649414433490065, 0.20086842774039315, 5.093446707556233]], "r_squared_": 0.9816875825659859, "error_": 0.05512309116426676}
{"freq_range": [2.0, 80.0], "freq_res": 1.0, "aperiodic_params_": [-0.3097515810331964, 0.7902314618290086], "gaussian_params_": [[8.143416164106242, 0.9826553246219207, 0.994921606145256], [10.467595332376986, 1.7612459527909285, 0.2943129150398157], [12.05614156596972, 0.4623777204063773, 0.6436644347135889], [14.718110194344717, 0.5669324569643812, 1.3977184711562174], [18.13418058631201, 0.2412023831747619, 0.8042508287839838], [20.031714134147265, 0.24183825183492696, 0.5687141494558312], [21.599412418881375, 0.6743075642161868, 0.263888879981943], [23.92122436541037, 0.2728806795288022, 1.028165709285886], [55.400531736979424, 0.47676281947099836, 0.2506676876351926], [59.399960059789386, 0.4730329649440857, 0.25001288263908944], [73.30365141067126, 0.1164018044975509, 5.999999999999999]], "peak_params_": [[8.143416164106242, 0.9725044799222242, 1.989843212290512], [10.467595332376986, 0.6755424492580451, 0.5886258300796314], [12.05614156596972, 0.5467330580895108, 1.2873288694271778], [14.718110194344717, 0.5556539159692228, 2.795436942312435], [18.13418058631201, 0.2742813645815114, 1.6085016575679676], [20.031714134147265, 0.2584567691045174, 1.1374282989116624], [21.599412418881375, 0.26127142036226947, 0.527777759963886], [23.92122436541037, 0.27208091323537564, 2.056331418571772], [55.400531736979424, 0.13412184843641617, 0.5013353752703852], [59.399960059789386, 0.138361832589863, 0.5000257652781789], [73.30365141067126, 0.11625283417071475, 11.999999999999998]], "r_squared_": 0.9872829699926294, "error_": 0.032974544572255765}
