%!PS-Adobe-3.0 EPSF-3.0
%%Creator: (MATLAB, The Mathworks, Inc. Version 9.3.0.713579 \(R2017b\). Operating System: Mac OS X)
%%Title: /Users/kosciessa/Desktop/mntTardisLNDG/kosciessa/A2_MSE_phaseShuffled/C_figures/Z_shuffledTraces.eps
%%CreationDate: 2020-03-25T09:57:23
%%Pages: (atend)
%%BoundingBox: 0 0 348 420
%%LanguageLevel: 3
%%EndComments
%%BeginProlog
%%BeginResource: procset (Apache XML Graphics Std ProcSet) 1.2 0
%%Version: 1.2 0
%%Copyright: (Copyright 2001-2003,2010 The Apache Software Foundation. License terms: http://www.apache.org/licenses/LICENSE-2.0)
/bd{bind def}bind def
/ld{load def}bd
/GR/grestore ld
/GS/gsave ld
/RM/rmoveto ld
/C/curveto ld
/t/show ld
/L/lineto ld
/ML/setmiterlimit ld
/CT/concat ld
/f/fill ld
/N/newpath ld
/S/stroke ld
/CC/setcmykcolor ld
/A/ashow ld
/cp/closepath ld
/RC/setrgbcolor ld
/LJ/setlinejoin ld
/GC/setgray ld
/LW/setlinewidth ld
/M/moveto ld
/re {4 2 roll M
1 index 0 rlineto
0 exch rlineto
neg 0 rlineto
cp } bd
/_ctm matrix def
/_tm matrix def
/BT { _ctm currentmatrix pop matrix _tm copy pop 0 0 moveto } bd
/ET { _ctm setmatrix } bd
/iTm { _ctm setmatrix _tm concat } bd
/Tm { _tm astore pop iTm 0 0 moveto } bd
/ux 0.0 def
/uy 0.0 def
/F {
  /Tp exch def
  /Tf exch def
  Tf findfont Tp scalefont setfont
  /cf Tf def  /cs Tp def
} bd
/ULS {currentpoint /uy exch def /ux exch def} bd
/ULE {
  /Tcx currentpoint pop def
  gsave
  newpath
  cf findfont cs scalefont dup
  /FontMatrix get 0 get /Ts exch def /FontInfo get dup
  /UnderlinePosition get Ts mul /To exch def
  /UnderlineThickness get Ts mul /Tt exch def
  ux uy To add moveto  Tcx uy To add lineto
  Tt setlinewidth stroke
  grestore
} bd
/OLE {
  /Tcx currentpoint pop def
  gsave
  newpath
  cf findfont cs scalefont dup
  /FontMatrix get 0 get /Ts exch def /FontInfo get dup
  /UnderlinePosition get Ts mul /To exch def
  /UnderlineThickness get Ts mul /Tt exch def
  ux uy To add cs add moveto Tcx uy To add cs add lineto
  Tt setlinewidth stroke
  grestore
} bd
/SOE {
  /Tcx currentpoint pop def
  gsave
  newpath
  cf findfont cs scalefont dup
  /FontMatrix get 0 get /Ts exch def /FontInfo get dup
  /UnderlinePosition get Ts mul /To exch def
  /UnderlineThickness get Ts mul /Tt exch def
  ux uy To add cs 10 mul 26 idiv add moveto Tcx uy To add cs 10 mul 26 idiv add lineto
  Tt setlinewidth stroke
  grestore
} bd
/QT {
/Y22 exch store
/X22 exch store
/Y21 exch store
/X21 exch store
currentpoint
/Y21 load 2 mul add 3 div exch
/X21 load 2 mul add 3 div exch
/X21 load 2 mul /X22 load add 3 div
/Y21 load 2 mul /Y22 load add 3 div
/X22 load /Y22 load curveto
} bd
/SSPD {
dup length /d exch dict def
{
/v exch def
/k exch def
currentpagedevice k known {
/cpdv currentpagedevice k get def
v cpdv ne {
/upd false def
/nullv v type /nulltype eq def
/nullcpdv cpdv type /nulltype eq def
nullv nullcpdv or
{
/upd true def
} {
/sametype v type cpdv type eq def
sametype {
v type /arraytype eq {
/vlen v length def
/cpdvlen cpdv length def
vlen cpdvlen eq {
0 1 vlen 1 sub {
/i exch def
/obj v i get def
/cpdobj cpdv i get def
obj cpdobj ne {
/upd true def
exit
} if
} for
} {
/upd true def
} ifelse
} {
v type /dicttype eq {
v {
/dv exch def
/dk exch def
/cpddv cpdv dk get def
dv cpddv ne {
/upd true def
exit
} if
} forall
} {
/upd true def
} ifelse
} ifelse
} if
} ifelse
upd true eq {
d k v put
} if
} if
} if
} forall
d length 0 gt {
d setpagedevice
} if
} bd
/RE { % /NewFontName [NewEncodingArray] /FontName RE -
  findfont dup length dict begin
  {
    1 index /FID ne
    {def} {pop pop} ifelse
  } forall
  /Encoding exch def
  /FontName 1 index def
  currentdict definefont pop
  end
} bind def
%%EndResource
%%BeginResource: procset (Apache XML Graphics EPS ProcSet) 1.0 0
%%Version: 1.0 0
%%Copyright: (Copyright 2002-2003 The Apache Software Foundation. License terms: http://www.apache.org/licenses/LICENSE-2.0)
/BeginEPSF { %def
/b4_Inc_state save def         % Save state for cleanup
/dict_count countdictstack def % Count objects on dict stack
/op_count count 1 sub def      % Count objects on operand stack
userdict begin                 % Push userdict on dict stack
/showpage { } def              % Redefine showpage, { } = null proc
0 setgray 0 setlinecap         % Prepare graphics state
1 setlinewidth 0 setlinejoin
10 setmiterlimit [ ] 0 setdash newpath
/languagelevel where           % If level not equal to 1 then
{pop languagelevel             % set strokeadjust and
1 ne                           % overprint to their defaults.
{false setstrokeadjust false setoverprint
} if
} if
} bd
/EndEPSF { %def
count op_count sub {pop} repeat            % Clean up stacks
countdictstack dict_count sub {end} repeat
b4_Inc_state restore
} bd
%%EndResource
%FOPBeginFontDict
%%IncludeResource: font Courier-Oblique
%%IncludeResource: font Courier-BoldOblique
%%IncludeResource: font Courier-Bold
%%IncludeResource: font ZapfDingbats
%%IncludeResource: font Symbol
%%IncludeResource: font Helvetica
%%IncludeResource: font Helvetica-Oblique
%%IncludeResource: font Helvetica-Bold
%%IncludeResource: font Helvetica-BoldOblique
%%IncludeResource: font Times-Roman
%%IncludeResource: font Times-Italic
%%IncludeResource: font Times-Bold
%%IncludeResource: font Times-BoldItalic
%%IncludeResource: font Courier
%FOPEndFontDict
%%BeginResource: encoding WinAnsiEncoding
/WinAnsiEncoding [
/.notdef /.notdef /.notdef /.notdef /.notdef
/.notdef /.notdef /.notdef /.notdef /.notdef
/.notdef /.notdef /.notdef /.notdef /.notdef
/.notdef /.notdef /.notdef /.notdef /.notdef
/.notdef /.notdef /.notdef /.notdef /.notdef
/.notdef /.notdef /.notdef /.notdef /.notdef
/.notdef /.notdef /space /exclam /quotedbl
/numbersign /dollar /percent /ampersand /quotesingle
/parenleft /parenright /asterisk /plus /comma
/hyphen /period /slash /zero /one
/two /three /four /five /six
/seven /eight /nine /colon /semicolon
/less /equal /greater /question /at
/A /B /C /D /E
/F /G /H /I /J
/K /L /M /N /O
/P /Q /R /S /T
/U /V /W /X /Y
/Z /bracketleft /backslash /bracketright /asciicircum
/underscore /quoteleft /a /b /c
/d /e /f /g /h
/i /j /k /l /m
/n /o /p /q /r
/s /t /u /v /w
/x /y /z /braceleft /bar
/braceright /asciitilde /bullet /Euro /bullet
/quotesinglbase /florin /quotedblbase /ellipsis /dagger
/daggerdbl /circumflex /perthousand /Scaron /guilsinglleft
/OE /bullet /Zcaron /bullet /bullet
/quoteleft /quoteright /quotedblleft /quotedblright /bullet
/endash /emdash /asciitilde /trademark /scaron
/guilsinglright /oe /bullet /zcaron /Ydieresis
/space /exclamdown /cent /sterling /currency
/yen /brokenbar /section /dieresis /copyright
/ordfeminine /guillemotleft /logicalnot /sfthyphen /registered
/macron /degree /plusminus /twosuperior /threesuperior
/acute /mu /paragraph /middot /cedilla
/onesuperior /ordmasculine /guillemotright /onequarter /onehalf
/threequarters /questiondown /Agrave /Aacute /Acircumflex
/Atilde /Adieresis /Aring /AE /Ccedilla
/Egrave /Eacute /Ecircumflex /Edieresis /Igrave
/Iacute /Icircumflex /Idieresis /Eth /Ntilde
/Ograve /Oacute /Ocircumflex /Otilde /Odieresis
/multiply /Oslash /Ugrave /Uacute /Ucircumflex
/Udieresis /Yacute /Thorn /germandbls /agrave
/aacute /acircumflex /atilde /adieresis /aring
/ae /ccedilla /egrave /eacute /ecircumflex
/edieresis /igrave /iacute /icircumflex /idieresis
/eth /ntilde /ograve /oacute /ocircumflex
/otilde /odieresis /divide /oslash /ugrave
/uacute /ucircumflex /udieresis /yacute /thorn
/ydieresis
] def
%%EndResource
%FOPBeginFontReencode
/Courier-Oblique findfont
dup length dict begin
  {1 index /FID ne {def} {pop pop} ifelse} forall
  /Encoding WinAnsiEncoding def
  currentdict
end
/Courier-Oblique exch definefont pop
/Courier-BoldOblique findfont
dup length dict begin
  {1 index /FID ne {def} {pop pop} ifelse} forall
  /Encoding WinAnsiEncoding def
  currentdict
end
/Courier-BoldOblique exch definefont pop
/Courier-Bold findfont
dup length dict begin
  {1 index /FID ne {def} {pop pop} ifelse} forall
  /Encoding WinAnsiEncoding def
  currentdict
end
/Courier-Bold exch definefont pop
/Helvetica findfont
dup length dict begin
  {1 index /FID ne {def} {pop pop} ifelse} forall
  /Encoding WinAnsiEncoding def
  currentdict
end
/Helvetica exch definefont pop
/Helvetica-Oblique findfont
dup length dict begin
  {1 index /FID ne {def} {pop pop} ifelse} forall
  /Encoding WinAnsiEncoding def
  currentdict
end
/Helvetica-Oblique exch definefont pop
/Helvetica-Bold findfont
dup length dict begin
  {1 index /FID ne {def} {pop pop} ifelse} forall
  /Encoding WinAnsiEncoding def
  currentdict
end
/Helvetica-Bold exch definefont pop
/Helvetica-BoldOblique findfont
dup length dict begin
  {1 index /FID ne {def} {pop pop} ifelse} forall
  /Encoding WinAnsiEncoding def
  currentdict
end
/Helvetica-BoldOblique exch definefont pop
/Times-Roman findfont
dup length dict begin
  {1 index /FID ne {def} {pop pop} ifelse} forall
  /Encoding WinAnsiEncoding def
  currentdict
end
/Times-Roman exch definefont pop
/Times-Italic findfont
dup length dict begin
  {1 index /FID ne {def} {pop pop} ifelse} forall
  /Encoding WinAnsiEncoding def
  currentdict
end
/Times-Italic exch definefont pop
/Times-Bold findfont
dup length dict begin
  {1 index /FID ne {def} {pop pop} ifelse} forall
  /Encoding WinAnsiEncoding def
  currentdict
end
/Times-Bold exch definefont pop
/Times-BoldItalic findfont
dup length dict begin
  {1 index /FID ne {def} {pop pop} ifelse} forall
  /Encoding WinAnsiEncoding def
  currentdict
end
/Times-BoldItalic exch definefont pop
/Courier findfont
dup length dict begin
  {1 index /FID ne {def} {pop pop} ifelse} forall
  /Encoding WinAnsiEncoding def
  currentdict
end
/Courier exch definefont pop
%FOPEndFontReencode
%%EndProlog
%%Page: 1 1
%%PageBoundingBox: 0 0 348 420
%%BeginPageSetup
[1 0 0 -1 0 420] CT
%%EndPageSetup
GS
1 GC
N
0 0 348 420 re
f
GR
GS
1 GC
N
0 0 348 420 re
f
GR
GS
1 LJ
2 LW
N
45.18 83.28 M
45.36 86.227 L
45.54 85.87 L
45.72 84.927 L
45.9 86.601 L
46.08 89.441 L
46.26 90.882 L
46.44 91.161 L
46.62 91.693 L
46.8 92.145 L
46.98 91.511 L
47.16 91.549 L
47.34 93.807 L
47.52 95.23 L
47.7 93.217 L
47.88 89.328 L
48.06 85.249 L
48.24 81.828 L
48.42 80.767 L
48.6 82.198 L
48.78 83.504 L
48.96 83.602 L
49.14 83.804 L
49.32 83.864 L
49.5 82.871 L
49.68 80.67 L
49.86 77.879 L
50.04 75.995 L
50.22 74.58 L
50.4 71.691 L
50.58 67.011 L
50.76 62.099 L
50.94 59.267 L
51.12 59.142 L
51.3 58.697 L
51.48 55.604 L
51.66 51.986 L
51.84 50.488 L
52.02 50.563 L
52.2 51.412 L
52.38 54.119 L
52.56 57.325 L
52.74 58.059 L
52.92 56.98 L
53.1 56.662 L
53.28 58.496 L
53.46 62.738 L
53.64 67.05 L
53.82 68.33 L
54 68.029 L
54.18 69.901 L
54.36 74.273 L
54.54 78.443 L
54.72 79.741 L
54.9 78.102 L
55.08 76.814 L
55.26 78.291 L
55.44 81.491 L
55.62 84.445 L
55.8 86.655 L
55.98 88.718 L
56.16 90.514 L
56.34 91.485 L
56.52 92.279 L
56.7 93.454 L
56.88 93.579 L
57.06 92.018 L
57.24 91.102 L
57.42 92.536 L
57.6 94.326 L
57.78 93.346 L
57.96 89.401 L
58.14 85.086 L
58.32 82.078 L
58.5 79.858 L
58.68 77.633 L
58.86 75.364 L
59.04 72.499 L
59.22 68.013 L
59.4 62.262 L
59.58 57.462 L
59.76 56.204 L
59.94 58.123 L
60.12 60.2 L
60.3 60.483 L
60.48 58.555 L
60.66 56.093 L
60.84 56.096 L
61.02 57.658 L
61.2 57.838 L
61.38 57.428 L
61.56 57.52 L
61.74 57.573 L
61.92 58.664 L
62.1 61.849 L
62.28 66.453 L
62.46 71.905 L
62.64 77.202 L
62.82 80.176 L
63 80.717 L
63.18 81.58 L
63.36 84.578 L
63.54 89.715 L
63.72 96.122 L
63.9 101.767 L
64.08 104.855 L
64.26 106.364 L
64.44 108.742 L
64.62 110.968 L
64.8 110.819 L
64.98 110.105 L
65.16 111.076 L
65.34 113.052 L
65.52 114.235 L
65.7 113.674 L
65.88 112.262 L
66.06 111.641 L
66.24 111.927 L
66.42 111.068 L
66.6 107.068 L
66.78 100.868 L
66.96 95.782 L
67.14 93.398 L
67.32 91.764 L
67.5 88.455 L
67.68 82.953 L
67.86 76.765 L
68.04 72.007 L
68.22 69.495 L
68.4 68.731 L
68.58 67.933 L
68.76 65.169 L
68.94 61.355 L
69.12 58.489 L
69.3 56.413 L
69.48 54.898 L
69.66 54.787 L
69.84 56.114 L
70.02 57.56 L
70.2 57.402 L
70.38 56.043 L
70.56 56.122 L
70.74 59.13 L
70.92 63.472 L
71.1 66.544 L
71.28 68.134 L
71.46 68.939 L
71.64 69.467 L
71.82 71.818 L
72 76.028 L
72.18 80.26 L
72.36 86.154 L
72.54 94.678 L
72.72 102.721 L
72.9 108.049 L
73.08 110.962 L
73.26 112.169 L
73.44 112.279 L
73.62 111.563 L
73.8 110.484 L
73.98 110.797 L
74.16 113.078 L
74.34 115.64 L
74.52 117.275 L
74.7 118.267 L
74.88 118.857 L
75.06 117.986 L
75.24 115.027 L
75.42 111.935 L
75.6 110.268 L
75.78 108.148 L
75.96 104.248 L
76.14 99.788 L
76.32 93.433 L
76.5 82.855 L
76.68 71.311 L
76.86 62.676 L
77.04 56.471 L
77.22 52.262 L
77.4 50.759 L
77.58 50.846 L
77.76 50.904 L
77.94 51.044 L
78.12 51.44 L
78.3 51.973 L
78.48 53.032 L
78.66 54.19 L
78.84 55.432 L
79.02 58.362 L
79.2 63.423 L
79.38 69.761 L
79.56 76.405 L
79.74 81.058 L
79.92 83.25 L
80.1 86.678 L
80.28 93.272 L
80.46 100.084 L
80.64 104.177 L
80.82 107.328 L
81 112.499 L
81.18 117.821 L
81.36 119.98 L
81.54 120.354 L
81.72 122.706 L
81.9 127.043 L
82.08 130.179 L
82.26 131.808 L
82.44 135.166 L
82.62 141.128 L
82.8 145.147 L
82.98 142.394 L
83.16 135.088 L
83.34 131.04 L
83.52 132.945 L
83.7 134.563 L
83.88 131.297 L
84.06 125.532 L
84.24 119.358 L
84.42 111.411 L
84.6 102.432 L
84.78 95.633 L
84.96 90.899 L
85.14 86.682 L
85.32 83.47 L
85.5 80.837 L
85.68 77.087 L
85.86 70.813 L
86.04 63.224 L
86.22 57.705 L
86.4 54.949 L
86.58 53.549 L
86.76 52.704 L
86.94 52.579 L
87.12 53.906 L
87.3 54.703 L
87.48 52.942 L
87.66 52.156 L
87.84 55.464 L
88.02 60.459 L
88.2 65.078 L
88.38 70.221 L
88.56 75.488 L
88.74 79.684 L
88.92 84.171 L
89.1 90.98 L
89.28 99.27 L
89.46 105.619 L
89.64 108.254 L
89.82 109.729 L
90 113.819 L
90.18 120.281 L
90.36 126.305 L
90.54 131.602 L
90.72 137.062 L
90.9 141.229 L
91.08 143.435 L
91.26 146.298 L
91.44 150.439 L
91.62 152.952 L
91.8 152.044 L
91.98 148.632 L
92.16 144.6 L
92.34 140.776 L
92.52 136.294 L
92.7 129.786 L
92.88 121.632 L
93.06 113.439 L
93.24 105.456 L
93.42 98.149 L
93.6 93.611 L
93.78 92.421 L
93.96 92.238 L
94.14 90.106 L
94.32 84.275 L
94.5 76.039 L
94.68 68.653 L
94.86 63.271 L
95.04 58.56 L
95.22 53.285 L
95.4 49.183 L
95.58 48.517 L
95.76 49.893 L
95.94 50.809 L
96.12 50.939 L
96.3 51.538 L
96.48 53.655 L
96.66 57.967 L
96.84 63.961 L
97.02 69.485 L
97.2 74.655 L
97.38 81.306 L
97.56 88.11 L
97.74 93.622 L
97.92 99.501 L
98.1 106.135 L
98.28 111.289 L
98.46 114.968 L
98.64 120.252 L
98.82 127.338 L
99 132.014 L
99.18 132.471 L
99.36 131.56 L
99.54 131.633 L
99.72 132.144 L
99.9 131.56 L
100.08 129.203 L
100.26 125.16 L
100.44 119.844 L
100.62 115.008 L
100.8 111.942 L
100.98 108.816 L
101.16 103.276 L
101.34 95.958 L
101.52 89.967 L
101.7 86.532 L
101.88 83.348 L
102.06 79.078 L
102.24 74.409 L
102.42 70.21 L
102.6 67.6 L
102.78 66.526 L
102.96 64.775 L
103.14 60.281 L
103.32 55.207 L
103.5 53.328 L
103.68 53.343 L
103.86 51.085 L
104.04 46.979 L
104.22 44.733 L
104.4 44.906 L
104.58 46.402 L
104.76 49.532 L
104.94 53.803 L
105.12 57.607 L
105.3 61.39 L
105.48 68.263 L
105.66 79.07 L
105.84 90.689 L
106.02 100.799 L
106.2 110.38 L
106.38 121.168 L
106.56 133.084 L
106.74 144.359 L
106.92 153.076 L
107.1 158.598 L
107.28 161.933 L
107.46 164.787 L
107.64 167.695 L
107.82 168.584 L
108 164.742 L
108.18 156.949 L
108.36 148.574 L
108.54 140.663 L
108.72 131.909 L
108.9 122.612 L
109.08 114.599 L
109.26 108.131 L
109.44 102.079 L
109.62 96.638 L
109.8 92.463 L
109.98 87.747 L
110.16 81.158 L
110.34 74.913 L
110.52 71.295 L
110.7 68.233 L
110.88 62.297 L
111.06 55.932 L
111.24 54.113 L
111.42 55.859 L
111.6 56.13 L
111.78 52.753 L
111.96 47.662 L
112.14 43.931 L
112.32 43.225 L
112.5 44.599 L
112.68 46.127 L
112.86 47.383 L
113.04 49.059 L
113.22 52.906 L
113.4 59.694 L
113.58 66.569 L
113.76 71.983 L
113.94 78.173 L
114.12 86.858 L
114.3 97.15 L
114.48 107.408 L
114.66 116.724 L
114.84 123.999 L
115.02 129.477 L
115.2 135.025 L
115.38 139.645 L
115.56 141.219 L
115.74 142.021 L
115.92 145.377 L
116.1 150.36 L
116.28 154.811 L
116.46 157.609 L
116.64 156.647 L
116.82 151.898 L
117 145.886 L
117.18 139.568 L
117.36 134.346 L
117.54 132.139 L
117.72 130.105 L
117.9 124.031 L
118.08 116.357 L
118.26 111.271 L
118.44 107.546 L
118.62 102.235 L
118.8 94.734 L
118.98 87.029 L
119.16 81.475 L
119.34 77.367 L
119.52 72.414 L
119.7 66.619 L
119.88 61.457 L
120.06 57.049 L
120.24 52.429 L
120.42 48.673 L
120.6 47.196 L
120.78 45.979 L
120.96 45.007 L
121.14 47.64 L
121.32 53.212 L
121.5 58.362 L
121.68 61.808 L
121.86 63.445 L
122.04 64.675 L
122.22 69.024 L
122.4 77.924 L
122.58 87.336 L
122.76 93.464 L
122.94 98.349 L
123.12 105.27 L
123.3 113.002 L
123.48 118.31 L
123.66 121.392 L
123.84 124.083 L
124.02 126.596 L
124.2 129.178 L
124.38 132.123 L
124.56 134.466 L
124.74 134.866 L
124.92 132.27 L
125.1 126.408 L
125.28 119.109 L
125.46 113.678 L
125.64 110.528 L
125.82 106.789 L
126 101.979 L
126.18 97.69 L
126.36 93.025 L
126.54 86.745 L
126.72 81.361 L
126.9 78.52 L
127.08 75.192 L
127.26 70.239 L
127.44 66.834 L
127.62 65.123 L
127.8 61.174 L
127.98 54.951 L
128.16 50.516 L
128.34 49.509 L
128.52 50.51 L
128.7 51.513 L
128.88 50.806 L
129.06 48.158 L
129.24 44.73 L
129.42 42.125 L
129.6 41.898 L
129.78 45.531 L
129.96 52.424 L
130.14 58.47 L
130.32 61.434 L
130.5 63.506 L
130.68 66.793 L
130.86 71.847 L
131.04 79.071 L
131.22 87.312 L
131.4 93.482 L
131.58 97.416 L
131.76 102.643 L
131.94 110.451 L
132.12 117.38 L
132.3 119.541 L
132.48 117.313 L
132.66 114.2 L
132.84 112.214 L
133.02 109.693 L
133.2 105.179 L
133.38 101.39 L
133.56 101.395 L
133.74 102.843 L
133.92 102.058 L
134.1 101.072 L
134.28 102.24 L
134.46 101.781 L
134.64 97.802 L
134.82 94.288 L
135 91.139 L
135.18 84.932 L
135.36 78.302 L
135.54 74.857 L
135.72 72.435 L
135.9 68.636 L
136.08 64.866 L
136.26 62.506 L
136.44 60.684 L
136.62 58.971 L
136.8 58.3 L
136.98 58.417 L
137.16 57.956 L
137.34 57.573 L
137.52 59.569 L
137.7 62.236 L
137.88 61.842 L
138.06 60.215 L
138.24 61.078 L
138.42 64.677 L
138.6 70.405 L
138.78 76.966 L
138.96 81.522 L
139.14 84.478 L
139.32 89.852 L
139.5 98.051 L
139.68 105.273 L
139.86 110.1 L
140.04 113.951 L
140.22 117.955 L
140.4 123.183 L
140.58 129.256 L
140.76 132.592 L
140.94 131.601 L
141.12 129.539 L
141.3 128.798 L
141.48 128.345 L
141.66 126.87 L
141.84 124.173 L
142.02 120.272 L
142.2 116.504 L
142.38 114.754 L
142.56 113.165 L
142.74 108.148 L
142.92 100.244 L
143.1 93.264 L
143.28 89.743 L
143.46 87.235 L
143.64 80.464 L
143.82 70.656 L
144 64.826 L
144.18 64.051 L
144.36 61.709 L
144.54 53.971 L
144.72 45.717 L
144.9 43.572 L
145.08 46.688 L
145.26 48.99 L
145.44 47.721 L
145.62 44.393 L
145.8 40.726 L
145.98 38.459 L
146.16 39.31 L
146.34 41.817 L
146.52 43.951 L
146.7 47.146 L
146.88 52.499 L
147.06 57.499 L
147.24 60.35 L
147.42 64.041 L
147.6 70.793 L
147.78 77.988 L
147.96 84.403 L
148.14 91.447 L
148.32 98.047 L
148.5 102.353 L
148.68 105.163 L
148.86 107.38 L
149.04 108.487 L
149.22 109.513 L
149.4 112.385 L
149.58 116.356 L
149.76 118.609 L
149.94 117.952 L
150.12 116.792 L
150.3 117.31 L
150.48 117.564 L
150.66 115.337 L
150.84 111.812 L
151.02 109.254 L
151.2 109.238 L
151.38 111.54 L
151.56 113.002 L
151.74 110.888 L
151.92 105.914 L
152.1 100.777 L
152.28 96.751 L
152.46 92.262 L
152.64 85.067 L
152.82 76.62 L
153 71.45 L
153.18 70.398 L
153.36 69.712 L
153.54 66.579 L
153.72 62.779 L
153.9 62.105 L
154.08 63.711 L
154.26 62.004 L
154.44 56.327 L
154.62 51.587 L
154.8 49.217 L
154.98 47.686 L
155.16 47.11 L
155.34 48.635 L
155.52 52.784 L
155.7 59.028 L
155.88 66.251 L
156.06 73.767 L
156.24 80.403 L
156.42 83.848 L
156.6 83.599 L
156.78 83.752 L
156.96 88.413 L
157.14 95.081 L
157.32 99.808 L
157.5 103.699 L
157.68 108.558 L
157.86 113.004 L
158.04 114.886 L
158.22 115.473 L
158.4 118.638 L
158.58 124.565 L
158.76 129.169 L
158.94 129.787 L
159.12 127.748 L
159.3 125.26 L
159.48 121.444 L
159.66 114.413 L
159.84 105.934 L
160.02 99.742 L
160.2 96.471 L
160.38 93.1 L
160.56 88.174 L
160.74 84.497 L
160.92 83.052 L
161.1 80.503 L
161.28 74.326 L
161.46 65.944 L
161.64 59.264 L
161.82 56.34 L
162 54.698 L
162.18 49.996 L
162.36 41.768 L
162.54 35.551 L
162.72 36.866 L
162.9 43.79 L
163.08 49.55 L
163.26 51.848 L
163.44 54.695 L
163.62 60.579 L
163.8 66.829 L
163.98 70.871 L
164.16 73.709 L
164.34 77.367 L
164.52 81.15 L
164.7 83.16 L
164.88 85.235 L
165.06 90.633 L
165.24 97.407 L
165.42 101.806 L
165.6 104.429 L
165.78 106.688 L
165.96 107.526 L
166.14 107.464 L
166.32 109.962 L
166.5 116.312 L
166.68 122.112 L
166.86 122.411 L
167.04 119.113 L
167.22 117.236 L
167.4 117.298 L
167.58 116.746 L
167.76 114.822 L
167.94 112.904 L
168.12 111.511 L
168.3 108.583 L
168.48 102.407 L
168.66 95.489 L
168.84 91.327 L
169.02 89.073 L
169.2 85.551 L
169.38 79.873 L
169.56 73.606 L
169.74 68.119 L
169.92 63.95 L
170.1 60.927 L
170.28 57.804 L
170.46 53.329 L
170.64 48.839 L
170.82 47.042 L
171 47.076 L
171.18 46.156 L
171.36 45.135 L
171.54 45.475 L
171.72 44.712 L
171.9 42.448 L
172.08 43.088 L
172.26 48.246 L
172.44 53.847 L
172.62 56.637 L
172.8 58.663 L
172.98 63.422 L
173.16 70.513 L
173.34 77.041 L
173.52 82.656 L
173.7 88.416 L
173.88 93.092 L
174.06 96.758 L
174.24 101.797 L
174.42 106.926 L
174.6 108.447 L
174.78 106.829 L
174.96 106.88 L
175.14 111.291 L
175.32 117.418 L
175.5 121.79 L
175.68 124.383 L
175.86 126.86 L
176.04 128.339 L
176.22 126.725 L
176.4 122.76 L
176.58 117.872 L
176.76 111.026 L
176.94 103.054 L
177.12 97.519 L
177.3 94.988 L
177.48 92.94 L
177.66 88.787 L
177.84 81.813 L
178.02 73.925 L
178.2 68.186 L
178.38 65.63 L
178.56 64.027 L
178.74 62.203 L
178.92 61.26 L
179.1 60.592 L
179.28 58.664 L
179.46 55.448 L
179.64 52.602 L
179.82 51.373 L
180 50.626 L
180.18 49.274 L
180.36 48.005 L
180.54 49.3 L
180.72 54.954 L
180.9 62.748 L
181.08 68.279 L
181.26 71.074 L
181.44 74.776 L
181.62 80.35 L
181.8 85.644 L
181.98 89.885 L
182.16 93.844 L
182.34 96.491 L
182.52 96.874 L
182.7 98.14 L
182.88 103.059 L
183.06 109.086 L
183.24 112.057 L
183.42 111.656 L
183.6 110.288 L
183.78 109.646 L
183.96 110.976 L
184.14 113.85 L
184.32 114.69 L
184.5 111.44 L
184.68 106.727 L
184.86 103.889 L
185.04 102.533 L
185.22 98.684 L
185.4 90.326 L
185.58 81.514 L
185.76 76.711 L
185.94 74.325 L
186.12 70.995 L
186.3 66.853 L
186.48 63.351 L
186.66 61.151 L
186.84 59.549 L
187.02 57.148 L
187.2 53.59 L
187.38 49.078 L
187.56 44.13 L
187.74 40.233 L
187.92 38.338 L
188.1 37.272 L
188.28 36.212 L
188.46 36.088 L
188.64 37.64 L
188.82 41.169 L
189 46.568 L
189.18 52.932 L
189.36 58.724 L
189.54 62.443 L
189.72 64.544 L
189.9 68.249 L
190.08 75.676 L
190.26 84.554 L
190.44 91.776 L
190.62 96.888 L
190.8 99.954 L
190.98 101.858 L
191.16 105.941 L
191.34 113.015 L
191.52 119.034 L
191.7 121.263 L
191.88 121.356 L
192.06 120.936 L
192.24 120.316 L
192.42 120.493 L
192.6 120.362 L
192.78 116.679 L
192.96 109.623 L
193.14 102.38 L
193.32 96.555 L
193.5 91.963 L
193.68 88.814 L
193.86 86.717 L
194.04 83.355 L
194.22 78.544 L
194.4 74.778 L
194.58 71.724 L
194.76 67.383 L
194.94 62.494 L
195.12 58.894 L
195.3 56.758 L
195.48 55.27 L
195.66 53.657 L
195.84 51.126 L
196.02 47.523 L
196.2 43.838 L
196.38 40.317 L
196.56 37.173 L
196.74 35.902 L
196.92 36.68 L
197.1 38.039 L
197.28 39.357 L
197.46 41.935 L
197.64 48.221 L
197.82 56.758 L
198 62.545 L
198.18 65.156 L
198.36 68.584 L
198.54 74.326 L
198.72 78.975 L
198.9 79.274 L
199.08 77.665 L
199.26 79.561 L
199.44 85.88 L
199.62 92.368 L
199.8 95.908 L
199.98 97.054 L
200.16 97.763 L
200.34 98.748 L
200.52 98.604 L
200.7 96.162 L
200.88 91.503 L
201.06 84.946 L
201.24 78.561 L
201.42 75.669 L
201.6 76.155 L
201.78 76.035 L
201.96 71.975 L
202.14 64.688 L
202.32 57.403 L
202.5 51.857 L
202.68 48.296 L
202.86 46.956 L
203.04 46.674 L
203.22 45.332 L
203.4 43.411 L
203.58 41.839 L
203.76 39.425 L
203.94 36.732 L
204.12 36.821 L
204.3 40.367 L
204.48 43.717 L
204.66 44.665 L
204.84 45.809 L
205.02 49.382 L
205.2 53.519 L
205.38 54.812 L
205.56 53.53 L
205.74 55.195 L
205.92 63.18 L
206.1 72.471 L
206.28 76.788 L
206.46 76.622 L
206.64 75.895 L
206.82 75.823 L
207 75.801 L
207.18 76.682 L
207.36 78.524 L
207.54 79.07 L
207.72 77.474 L
207.9 75.696 L
208.08 74.61 L
208.26 72.257 L
208.44 68.51 L
208.62 67.457 L
208.8 70.087 L
208.98 71.187 L
209.16 68.343 L
209.34 65.655 L
209.52 65.77 L
209.7 65.439 L
209.88 61.573 L
210.06 56.377 L
210.24 53.985 L
210.42 54.414 L
210.6 54.485 L
210.78 52.695 L
210.96 49.738 L
211.14 47.16 L
211.32 46.315 L
211.5 46.287 L
211.68 44.67 L
211.86 42.09 L
212.04 41.711 L
212.22 44.082 L
212.4 47.345 L
212.58 50.737 L
212.76 53.872 L
212.94 55.949 L
213.12 57.408 L
213.3 59.352 L
213.48 62.864 L
213.66 67.772 L
213.84 71.277 L
214.02 71.649 L
214.2 70.382 L
214.38 69.354 L
214.56 69.772 L
214.74 72.081 L
214.92 74.71 L
215.1 76.029 L
215.28 78.157 L
215.46 83.183 L
215.64 87.879 L
215.82 88.636 L
216 86.342 L
216.18 83.695 L
216.36 80.814 L
216.54 75.136 L
216.72 66.68 L
216.9 59.339 L
217.08 55.267 L
217.26 52.742 L
217.44 50.036 L
217.62 47.524 L
217.8 45.093 L
217.98 41.051 L
218.16 36.015 L
218.34 33.922 L
218.52 36.872 L
218.7 41.044 L
218.88 41.446 L
219.06 38.527 L
219.24 35.701 L
219.42 34.8 L
219.6 36.041 L
219.78 38.197 L
219.96 39.593 L
220.14 39.763 L
220.32 39.385 L
220.5 39.52 L
220.68 40.368 L
220.86 41.41 L
221.04 42.792 L
221.22 44.481 L
221.4 45.988 L
221.58 47.794 L
221.76 50.551 L
221.94 52.41 L
222.12 51.881 L
222.3 52.288 L
222.48 56.29 L
222.66 60.372 L
222.84 61.053 L
223.02 60.339 L
223.2 59.934 L
223.38 58.093 L
223.56 55.319 L
223.74 54.642 L
223.92 56.665 L
224.1 59.019 L
224.28 60.146 L
224.46 61.222 L
224.64 62.673 L
224.82 62.524 L
225 60.718 L
225.18 59.794 L
225.36 60.051 L
225.54 58.502 L
225.72 55.06 L
225.9 54.129 L
226.08 57.192 L
226.26 60.08 L
226.44 58.953 L
226.62 55.162 L
226.8 52.855 L
226.98 52.767 L
227.16 51.863 L
227.34 50.128 L
227.52 49.977 L
227.7 50.849 L
227.88 51.48 L
228.06 52.494 L
228.24 54.318 L
228.42 56.937 L
228.6 59.655 L
228.78 59.763 L
228.96 56.957 L
229.14 55.462 L
229.32 57.366 L
229.5 59.338 L
229.68 58.708 L
229.86 57.196 L
230.04 57.274 L
230.22 58.933 L
230.4 60.223 L
230.58 60.457 L
230.76 61.107 L
230.94 63.537 L
231.12 67.29 L
231.3 70.022 L
231.48 69.852 L
231.66 67.908 L
231.84 66.527 L
232.02 65.939 L
232.2 64.557 L
232.38 63.119 L
232.56 64.215 L
232.74 66.092 L
232.92 64.71 L
233.1 61.03 L
233.28 59.362 L
233.46 61.229 L
233.64 64.426 L
233.82 65.424 L
234 63.154 L
234.18 60.704 L
234.36 60.332 L
234.54 60.539 L
234.72 60.619 L
234.9 61.182 L
235.08 61.769 L
235.26 63.224 L
235.44 65.818 L
235.62 66.403 L
235.8 64.617 L
235.98 64.736 L
236.16 68.335 L
236.34 71.706 L
236.52 71.154 L
236.7 68.321 L
236.88 67.177 L
237.06 67.126 L
237.24 65.167 L
237.42 61.619 L
237.6 59.642 L
237.78 61.605 L
237.96 66.4 L
238.14 70.906 L
238.32 73.213 L
238.5 73.421 L
238.68 73.14 L
238.86 73.678 L
239.04 74.251 L
239.22 73.384 L
239.4 71.133 L
239.58 68.872 L
239.76 69.002 L
239.94 72.556 L
240.12 76.764 L
240.3 78.502 L
240.48 77.79 L
240.66 76.522 L
240.84 75.289 L
241.02 73.397 L
241.2 71.476 L
241.38 71.727 L
241.56 74.332 L
241.74 76.261 L
241.92 75.513 L
242.1 73.543 L
242.28 72.194 L
242.46 71.287 L
242.64 70.872 L
242.82 71.585 L
243 72.776 L
243.18 73.596 L
243.36 73.476 L
243.54 71.468 L
243.72 68.674 L
243.9 68.484 L
244.08 70.658 L
244.26 70.688 L
244.44 68.163 L
244.62 68.196 L
244.8 71.861 L
244.98 74.923 L
245.16 76.303 L
245.34 77.642 L
245.52 78.492 L
245.7 77.793 L
245.88 75.48 L
246.06 72.554 L
246.24 71.213 L
246.42 72.793 L
246.6 75.937 L
246.78 78.592 L
246.96 80.222 L
247.14 79.861 L
247.32 77.216 L
247.5 75.342 L
247.68 76.176 L
247.86 77.067 L
248.04 75.655 L
248.22 73.376 L
248.4 72.006 L
248.58 71.499 L
248.76 71.133 L
248.94 69.764 L
249.12 67.543 L
249.3 67.33 L
249.48 70.446 L
249.66 73.908 L
249.84 75.72 L
250.02 77.137 L
250.2 77.945 L
250.38 76.913 L
250.56 75.451 L
250.74 75.406 L
250.92 76.183 L
251.1 76.239 L
251.28 75.897 L
251.46 77.253 L
251.64 79.66 L
251.82 79.617 L
252 76.73 L
252.18 74.359 L
252.36 74.701 L
252.54 75.486 L
252.72 74.197 L
252.9 73.427 L
253.08 75.487 L
253.26 77.538 L
253.44 76.954 L
253.62 74.639 L
253.8 71.959 L
253.98 69.588 L
254.16 68.55 L
254.34 69.875 L
254.52 72.403 L
254.7 72.362 L
254.88 69.109 L
255.06 66.897 L
255.24 67.845 L
255.42 69.217 L
255.6 69.485 L
255.78 71.497 L
255.96 76.324 L
256.14 80.784 L
256.32 83.677 L
256.5 85.823 L
256.68 85.616 L
256.86 81.731 L
257.04 77.068 L
257.22 75.814 L
257.4 77.695 L
257.58 79.231 L
257.76 79.243 L
257.94 79.907 L
258.12 82.783 L
258.3 84.637 L
258.48 81.549 L
258.66 76.727 L
258.84 77.184 L
259.02 82.793 L
259.2 86.225 L
259.38 83.702 L
259.56 78.699 L
259.74 76.104 L
259.92 76.753 L
260.1 77.654 L
260.28 75.912 L
260.46 72.381 L
260.64 70.719 L
260.82 71.53 L
261 71.65 L
261.18 69.803 L
261.36 68.613 L
261.54 69.919 L
261.72 71.386 L
261.9 70.216 L
262.08 67.765 L
262.26 67.844 L
262.44 70.784 L
262.62 72.679 L
262.8 72.788 L
262.98 74.968 L
263.16 78.771 L
263.34 79.611 L
263.52 77.419 L
263.7 75.575 L
263.88 74.51 L
264.06 72.13 L
264.24 68.74 L
264.42 68.692 L
264.6 72.923 L
264.78 74.349 L
264.96 68.74 L
265.14 62.952 L
265.32 63.848 L
265.5 67.789 L
265.68 68.901 L
265.86 68.443 L
266.04 69.528 L
266.22 71.099 L
266.4 70.893 L
266.58 69.443 L
266.76 68.971 L
266.94 69.196 L
267.12 69.019 L
267.3 69.785 L
267.48 71.356 L
267.66 70.544 L
267.84 67.89 L
268.02 67.801 L
268.2 70.385 L
268.38 71.458 L
268.56 70.062 L
268.74 69.291 L
268.92 70.564 L
269.1 71.461 L
269.28 71.072 L
269.46 72.426 L
269.64 75.376 L
269.82 76.08 L
270 74.498 L
270.18 75.122 L
270.36 79.85 L
270.54 83.604 L
270.72 82.267 L
270.9 79.401 L
271.08 78.832 L
271.26 79.716 L
271.44 80.918 L
271.62 82.277 L
271.8 82.531 L
271.98 81.003 L
272.16 78.554 L
272.34 76.048 L
272.52 74.723 L
272.7 75.948 L
272.88 79.028 L
273.06 81.547 L
273.24 82.941 L
273.42 84.309 L
273.6 85.81 L
273.78 86.779 L
273.96 86.144 L
274.14 84.159 L
274.32 82.935 L
274.5 83.237 L
274.68 83.85 L
274.86 84.619 L
275.04 86.113 L
275.22 87.156 L
275.4 86.367 L
275.58 84.592 L
275.76 84.284 L
275.94 84.974 L
276.12 82.019 L
276.3 75.367 L
276.48 72.095 L
276.66 74.682 L
276.84 76.766 L
277.02 75.235 L
277.2 75.548 L
277.38 80.039 L
277.56 83.636 L
277.74 84.057 L
277.92 84.809 L
278.1 87.154 L
278.28 87.487 L
278.46 83.848 L
278.64 79.279 L
278.82 77.869 L
279 79.63 L
279.18 81.293 L
279.36 81.518 L
279.54 81.517 L
279.72 81.667 L
279.9 80.629 L
280.08 77.883 L
280.26 74.652 L
280.44 72.77 L
280.62 74.673 L
280.8 79.376 L
280.98 81.926 L
281.16 82.18 L
281.34 84.658 L
281.52 88.573 L
281.7 89.576 L
281.88 88.869 L
282.06 89.413 L
282.24 88.493 L
282.42 83.44 L
282.6 77.408 L
282.78 75.273 L
282.96 78.654 L
283.14 82.829 L
283.32 81.814 L
283.5 78.358 L
283.68 79.969 L
283.86 86.985 L
284.04 93.477 L
284.22 95.732 L
284.4 94.086 L
284.58 90.694 L
284.76 88.609 L
284.94 89.548 L
285.12 91.115 L
285.3 90.656 L
285.48 88.565 L
285.66 86.934 L
285.84 88.526 L
286.02 92.631 L
286.2 94.68 L
286.38 93.553 L
286.56 92.017 L
286.74 90.07 L
286.92 86.265 L
287.1 82.244 L
287.28 80.414 L
287.46 80.018 L
287.64 78.834 L
287.82 77.248 L
288 76.971 L
288.18 78.12 L
288.36 79.492 L
288.54 79.892 L
288.72 79.389 L
288.9 78.634 L
289.08 77.623 L
289.26 76.682 L
289.44 76.545 L
289.62 76.934 L
289.8 77.917 L
289.98 81.057 L
290.16 86.035 L
290.34 88.961 L
290.52 88.424 L
290.7 87.19 L
290.88 87.192 L
291.06 89.263 L
291.24 92.056 L
291.42 90.908 L
291.6 85.505 L
291.78 82.832 L
291.96 86.331 L
292.14 91.525 L
292.32 93.623 L
292.5 92.474 L
292.68 90.648 L
292.86 89.835 L
293.04 89.903 L
293.22 89.987 L
293.4 90.655 L
293.58 92.01 L
293.76 90.568 L
293.94 85.255 L
294.12 80.983 L
294.3 80.392 L
294.48 80.626 L
294.66 80.519 L
294.84 81.182 L
295.02 80.831 L
295.2 77.326 L
295.38 72.963 L
295.56 71.54 L
295.74 72.603 L
295.92 72.793 L
296.1 71.614 L
296.28 71.416 L
296.46 73.002 L
296.64 74.676 L
296.82 75.505 L
297 76.427 L
297.18 77.396 L
297.36 77.252 L
297.54 76.328 L
297.72 76.831 L
297.9 79.572 L
298.08 82.624 L
298.26 85.119 L
298.44 87.354 L
298.62 87.34 L
298.8 84.397 L
298.98 82.477 L
299.16 83.764 L
299.34 85.647 L
299.52 86.405 L
299.7 87.394 L
299.88 90.294 L
300.06 93.526 L
300.24 93.634 L
300.42 91.523 L
300.6 91.261 L
300.78 93.948 L
300.96 97.022 L
301.14 97.215 L
301.32 93.498 L
301.5 88.218 L
301.68 85.61 L
301.86 86.996 L
302.04 88.183 L
302.22 85.707 L
302.4 82.046 L
302.58 81.719 L
302.76 85.093 L
302.94 88.484 L
303.12 88.233 L
303.3 84.369 L
303.48 79.979 L
303.66 77.02 L
303.84 76.699 L
304.02 79.743 L
304.2 84.427 L
304.38 88.139 L
304.56 89.882 L
304.74 91.029 L
304.92 93.678 L
305.1 96.724 L
305.28 97.2 L
305.46 95.675 L
305.64 94.133 L
305.82 92.453 L
306 90.704 L
306.18 89.022 L
306.36 86.594 L
306.54 84.326 L
306.72 84.515 L
306.9 86.379 L
307.08 87.383 L
307.26 87.346 L
307.44 85.977 L
307.62 83.063 L
307.8 81.712 L
307.98 84.131 L
308.16 87.359 L
308.34 87.998 L
308.52 87.003 L
308.7 86.793 L
308.88 88.046 L
309.06 89.401 L
309.24 88.637 L
309.42 86.33 L
309.6 84.38 L
309.78 83.108 L
309.96 82.604 L
310.14 83.095 L
310.32 84.498 L
310.5 85.03 L
310.68 84.153 L
310.86 84.411 L
311.04 85.942 L
311.22 86.694 L
311.4 86.153 L
311.58 83.943 L
311.76 80.319 L
311.94 77.991 L
312.12 78.751 L
312.3 81.082 L
312.48 82.14 L
312.66 80.112 L
312.84 75.981 L
313.02 72.32 L
313.2 70.633 L
313.38 70.792 L
313.56 70.715 L
313.74 69.039 L
313.92 68.08 L
314.1 68.345 L
314.28 66.891 L
314.46 64.794 L
314.64 65.022 L
314.82 66.265 L
315 66.458 L
S
GR
GS
1 0 0 RC
1 LJ
2 LW
N
45.18 290.795 M
45.36 291.347 L
45.54 290.002 L
45.72 288.136 L
45.9 286.875 L
46.08 287.953 L
46.26 289.147 L
46.44 289.212 L
46.62 288.986 L
46.8 289.847 L
46.98 293.477 L
47.16 297.793 L
47.34 298.147 L
47.52 293.766 L
47.7 289.293 L
47.88 287.2 L
48.06 286.613 L
48.24 284.736 L
48.42 282.396 L
48.6 280.023 L
48.78 278.547 L
48.96 275.732 L
49.14 271.515 L
49.32 269.424 L
49.5 271.411 L
49.68 273.122 L
49.86 273.409 L
50.04 273.507 L
50.22 274.793 L
50.4 277.261 L
50.58 280.111 L
50.76 281.98 L
50.94 280.268 L
51.12 277.733 L
51.3 276.632 L
51.48 277.294 L
51.66 279.218 L
51.84 282.459 L
52.02 285.429 L
52.2 286.694 L
52.38 284.787 L
52.56 282.057 L
52.74 280.292 L
52.92 282.044 L
53.1 283.462 L
53.28 281.827 L
53.46 279.467 L
53.64 280.16 L
53.82 283.593 L
54 286.854 L
54.18 289.112 L
54.36 289.325 L
54.54 289.558 L
54.72 289.336 L
54.9 287.479 L
55.08 286.37 L
55.26 285.82 L
55.44 284.977 L
55.62 282.392 L
55.8 279.063 L
55.98 275.693 L
56.16 272.336 L
56.34 268.855 L
56.52 266.709 L
56.7 265.302 L
56.88 264.754 L
57.06 263.314 L
57.24 260.389 L
57.42 257.522 L
57.6 255.263 L
57.78 255.408 L
57.96 258.39 L
58.14 262.567 L
58.32 264.931 L
58.5 266.527 L
58.68 266.433 L
58.86 265.209 L
59.04 265.776 L
59.22 269.135 L
59.4 273.584 L
59.58 275.753 L
59.76 275.332 L
59.94 276.864 L
60.12 282.045 L
60.3 287.217 L
60.48 292.185 L
60.66 297.949 L
60.84 303.845 L
61.02 306.783 L
61.2 307.771 L
61.38 308.766 L
61.56 308.719 L
61.74 306.242 L
61.92 304.161 L
62.1 304.456 L
62.28 306.74 L
62.46 306.533 L
62.64 303.123 L
62.82 298.773 L
63 295.502 L
63.18 292.352 L
63.36 288.931 L
63.54 284.675 L
63.72 281.867 L
63.9 278.822 L
64.08 276.128 L
64.26 274.307 L
64.44 273.659 L
64.62 273.638 L
64.8 272.898 L
64.98 270.949 L
65.16 267.19 L
65.34 265.475 L
65.52 264.587 L
65.7 264.35 L
65.88 262.293 L
66.06 258.26 L
66.24 257.148 L
66.42 258.985 L
66.6 260.871 L
66.78 261.138 L
66.96 261.965 L
67.14 264.446 L
67.32 267.619 L
67.5 270.366 L
67.68 271.262 L
67.86 271.89 L
68.04 272.479 L
68.22 272.259 L
68.4 270.063 L
68.58 267.844 L
68.76 270.041 L
68.94 274.258 L
69.12 277.991 L
69.3 281.266 L
69.48 284.138 L
69.66 286.743 L
69.84 288.082 L
70.02 286.83 L
70.2 284.127 L
70.38 282.904 L
70.56 285.115 L
70.74 286.817 L
70.92 285.29 L
71.1 281.524 L
71.28 278.874 L
71.46 279.564 L
71.64 280.807 L
71.82 281.325 L
72 280.351 L
72.18 279.184 L
72.36 277.427 L
72.54 276.431 L
72.72 276.117 L
72.9 274.413 L
73.08 271.079 L
73.26 267.211 L
73.44 265.801 L
73.62 266.498 L
73.8 267.183 L
73.98 267.689 L
74.16 267.532 L
74.34 267.697 L
74.52 268.507 L
74.7 270.073 L
74.88 271.794 L
75.06 273.816 L
75.24 276.873 L
75.42 280.23 L
75.6 283.947 L
75.78 285.549 L
75.96 286.409 L
76.14 289.196 L
76.32 293.761 L
76.5 299.413 L
76.68 301.648 L
76.86 302.782 L
77.04 304.968 L
77.22 306.511 L
77.4 306.985 L
77.58 307.006 L
77.76 307.928 L
77.94 307.993 L
78.12 306.682 L
78.3 303.26 L
78.48 302.441 L
78.66 302.403 L
78.84 301.17 L
79.02 297.52 L
79.2 292.465 L
79.38 288.345 L
79.56 285.596 L
79.74 282.71 L
79.92 278.766 L
80.1 272.396 L
80.28 264.044 L
80.46 256.943 L
80.64 254.412 L
80.82 255.066 L
81 257.819 L
81.18 260.837 L
81.36 262.548 L
81.54 262.117 L
81.72 260.58 L
81.9 260.141 L
82.08 262.241 L
82.26 264.049 L
82.44 264.389 L
82.62 263.948 L
82.8 264.199 L
82.98 265.486 L
83.16 268.213 L
83.34 272.119 L
83.52 276.771 L
83.7 282.119 L
83.88 285.127 L
84.06 284.208 L
84.24 282.572 L
84.42 282.431 L
84.6 283.06 L
84.78 283.109 L
84.96 280.744 L
85.14 277.236 L
85.32 274.548 L
85.5 274.073 L
85.68 274.785 L
85.86 275.344 L
86.04 274.275 L
86.22 272.755 L
86.4 272.335 L
86.58 273.597 L
86.76 276.499 L
86.94 276.717 L
87.12 275.09 L
87.3 273.368 L
87.48 273.11 L
87.66 273.888 L
87.84 275.103 L
88.02 274.742 L
88.2 273.632 L
88.38 274.485 L
88.56 276.796 L
88.74 279.867 L
88.92 281.421 L
89.1 279.562 L
89.28 276.065 L
89.46 272.851 L
89.64 271.897 L
89.82 270.123 L
90 267.971 L
90.18 266.506 L
90.36 265.478 L
90.54 264.91 L
90.72 265.158 L
90.9 265.005 L
91.08 264.406 L
91.26 263.994 L
91.44 263.91 L
91.62 265.182 L
91.8 267.42 L
91.98 269.258 L
92.16 271.71 L
92.34 273.133 L
92.52 273.081 L
92.7 271.609 L
92.88 269.099 L
93.06 269.091 L
93.24 270.294 L
93.42 271.057 L
93.6 271.762 L
93.78 274.348 L
93.96 277.76 L
94.14 278.994 L
94.32 278.951 L
94.5 280.66 L
94.68 286.418 L
94.86 292.602 L
95.04 296.491 L
95.22 297.482 L
95.4 296.514 L
95.58 295.215 L
95.76 295.522 L
95.94 298.247 L
96.12 300.143 L
96.3 299.604 L
96.48 299.962 L
96.66 299.891 L
96.84 296.787 L
97.02 291.39 L
97.2 286.37 L
97.38 283.202 L
97.56 280.781 L
97.74 277.445 L
97.92 275.683 L
98.1 276.528 L
98.28 277.543 L
98.46 275.115 L
98.64 271.09 L
98.82 269.141 L
99 270.224 L
99.18 271.954 L
99.36 272.967 L
99.54 275.287 L
99.72 277.381 L
99.9 278.649 L
100.08 279.35 L
100.26 280.094 L
100.44 278.964 L
100.62 274.689 L
100.8 270.682 L
100.98 269.19 L
101.16 271.22 L
101.34 272.397 L
101.52 272.445 L
101.7 270.85 L
101.88 270.04 L
102.06 270.424 L
102.24 271.227 L
102.42 271.754 L
102.6 271.87 L
102.78 271.743 L
102.96 271.611 L
103.14 272.141 L
103.32 273.082 L
103.5 273.356 L
103.68 274.988 L
103.86 277.189 L
104.04 279.417 L
104.22 281.657 L
104.4 285.6 L
104.58 290.702 L
104.76 292.769 L
104.94 289.169 L
105.12 283.825 L
105.3 278.898 L
105.48 275.826 L
105.66 275.275 L
105.84 277.075 L
106.02 279.319 L
106.2 278.777 L
106.38 276.343 L
106.56 275.399 L
106.74 276.106 L
106.92 276.033 L
107.1 272.967 L
107.28 270.492 L
107.46 270.369 L
107.64 271.975 L
107.82 271.818 L
108 269.31 L
108.18 267.245 L
108.36 268.27 L
108.54 271.663 L
108.72 272.782 L
108.9 272.503 L
109.08 271.081 L
109.26 269.482 L
109.44 270.836 L
109.62 272.236 L
109.8 271.004 L
109.98 266.607 L
110.16 263.622 L
110.34 265.426 L
110.52 271.384 L
110.7 275.587 L
110.88 277.527 L
111.06 279.772 L
111.24 282.744 L
111.42 285.701 L
111.6 289.267 L
111.78 291.672 L
111.96 289.522 L
112.14 285.116 L
112.32 283.068 L
112.5 285.567 L
112.68 287.677 L
112.86 286.009 L
113.04 281.691 L
113.22 278.245 L
113.4 276.545 L
113.58 273.593 L
113.76 272.627 L
113.94 272.931 L
114.12 274.239 L
114.3 273.835 L
114.48 272.916 L
114.66 271.695 L
114.84 269.911 L
115.02 267.721 L
115.2 267.07 L
115.38 267.441 L
115.56 268.502 L
115.74 270.04 L
115.92 270.628 L
116.1 268.927 L
116.28 267.001 L
116.46 266.259 L
116.64 266.227 L
116.82 266.347 L
117 265.589 L
117.18 263.977 L
117.36 264.367 L
117.54 267.673 L
117.72 271.195 L
117.9 272.648 L
118.08 275.43 L
118.26 279.155 L
118.44 282.308 L
118.62 284.528 L
118.8 289.663 L
118.98 297.495 L
119.16 303.763 L
119.34 307.977 L
119.52 312.438 L
119.7 315.966 L
119.88 317.504 L
120.06 317.159 L
120.24 316.882 L
120.42 314.824 L
120.6 313.027 L
120.78 309.564 L
120.96 306.603 L
121.14 305.82 L
121.32 304.202 L
121.5 300.569 L
121.68 292.914 L
121.86 287.49 L
122.04 286.622 L
122.22 289.191 L
122.4 290.945 L
122.58 289.338 L
122.76 286.597 L
122.94 284.13 L
123.12 282.081 L
123.3 277.008 L
123.48 271.528 L
123.66 267.438 L
123.84 266.587 L
124.02 266.161 L
124.2 266.37 L
124.38 267.131 L
124.56 268.095 L
124.74 267.796 L
124.92 266.507 L
125.1 265.499 L
125.28 265.93 L
125.46 266.869 L
125.64 267.025 L
125.82 267.173 L
126 268.185 L
126.18 271.165 L
126.36 274.958 L
126.54 279.409 L
126.72 283.889 L
126.9 288.807 L
127.08 295.456 L
127.26 302.079 L
127.44 305.443 L
127.62 306.198 L
127.8 306.676 L
127.98 308.099 L
128.16 309.153 L
128.34 309.392 L
128.52 310.468 L
128.7 310.682 L
128.88 308.73 L
129.06 307.641 L
129.24 308.792 L
129.42 309.665 L
129.6 307.003 L
129.78 298.558 L
129.96 291.622 L
130.14 286.976 L
130.32 284.501 L
130.5 282.315 L
130.68 279.578 L
130.86 278.655 L
131.04 277.206 L
131.22 274.784 L
131.4 271.538 L
131.58 266.813 L
131.76 260.883 L
131.94 256.174 L
132.12 252.379 L
132.3 248.999 L
132.48 247.687 L
132.66 249.043 L
132.84 253.08 L
133.02 256.974 L
133.2 262.172 L
133.38 267.575 L
133.56 274.206 L
133.74 279.313 L
133.92 282.87 L
134.1 286.228 L
134.28 288.74 L
134.46 290.393 L
134.64 293.13 L
134.82 298.095 L
135 303.863 L
135.18 308.214 L
135.36 312.027 L
135.54 316.207 L
135.72 324.892 L
135.9 330.06 L
136.08 328.659 L
136.26 325.501 L
136.44 324.059 L
136.62 324.512 L
136.8 322.585 L
136.98 318.474 L
137.16 313.667 L
137.34 310.405 L
137.52 307.656 L
137.7 306.002 L
137.88 301.628 L
138.06 294.398 L
138.24 289.178 L
138.42 283.897 L
138.6 280.118 L
138.78 278.318 L
138.96 276.482 L
139.14 273.347 L
139.32 269.965 L
139.5 266.402 L
139.68 264.158 L
139.86 260.402 L
140.04 254.269 L
140.22 248.213 L
140.4 246.473 L
140.58 248.456 L
140.76 251.573 L
140.94 252.907 L
141.12 253.143 L
141.3 253.235 L
141.48 255.356 L
141.66 258.666 L
141.84 262.605 L
142.02 267.1 L
142.2 273.188 L
142.38 280.524 L
142.56 285.457 L
142.74 287.225 L
142.92 290.395 L
143.1 298.121 L
143.28 307.255 L
143.46 313.586 L
143.64 318.42 L
143.82 323.462 L
144 327.011 L
144.18 330.581 L
144.36 340.861 L
144.54 341.6 L
144.72 330.88 L
144.9 328.186 L
145.08 327.985 L
145.26 327.523 L
145.44 322.31 L
145.62 315.995 L
145.8 314.323 L
145.98 313.981 L
146.16 312.46 L
146.34 308.879 L
146.52 305.36 L
146.7 302.64 L
146.88 297.954 L
147.06 289.349 L
147.24 279.998 L
147.42 271.2 L
147.6 263.257 L
147.78 258.157 L
147.96 256.294 L
148.14 256.047 L
148.32 254.014 L
148.5 251.146 L
148.68 249.586 L
148.86 250.501 L
149.04 251.176 L
149.22 250.984 L
149.4 252.091 L
149.58 254.685 L
149.76 259.138 L
149.94 263.605 L
150.12 266.786 L
150.3 270.637 L
150.48 274.005 L
150.66 277.854 L
150.84 281.868 L
151.02 287.237 L
151.2 294.063 L
151.38 301.849 L
151.56 307.277 L
151.74 312.218 L
151.92 316.068 L
152.1 318.897 L
152.28 322.758 L
152.46 327.274 L
152.64 330.803 L
152.82 340.073 L
153 348.667 L
153.18 354.312 L
153.36 352.663 L
153.54 342.012 L
153.72 327.837 L
153.9 321.246 L
154.08 322.122 L
154.26 322.575 L
154.44 319.745 L
154.62 315.255 L
154.8 310.741 L
154.98 304.801 L
155.16 295.669 L
155.34 287.731 L
155.52 279.519 L
155.7 272.68 L
155.88 268.149 L
156.06 266.847 L
156.24 264.454 L
156.42 258.011 L
156.6 251.918 L
156.78 248.124 L
156.96 247.87 L
157.14 248.467 L
157.32 247.977 L
157.5 246.34 L
157.68 244.774 L
157.86 243.72 L
158.04 243.097 L
158.22 243.435 L
158.4 244.792 L
158.58 247.088 L
158.76 250.663 L
158.94 256.054 L
159.12 263.963 L
159.3 271.202 L
159.48 278.569 L
159.66 287.161 L
159.84 295.798 L
160.02 305.676 L
160.2 313.094 L
160.38 319.888 L
160.56 327.623 L
160.74 336.933 L
160.92 346.153 L
161.1 350.526 L
161.28 348.79 L
161.46 344.346 L
161.64 332.009 L
161.82 330.739 L
162 340.314 L
162.18 346.074 L
162.36 336.842 L
162.54 324.97 L
162.72 316.65 L
162.9 312.393 L
163.08 307.527 L
163.26 300.985 L
163.44 291.446 L
163.62 282.949 L
163.8 275.975 L
163.98 269.622 L
164.16 263.794 L
164.34 259.741 L
164.52 256.865 L
164.7 253.287 L
164.88 248.569 L
165.06 245.842 L
165.24 244.232 L
165.42 243.059 L
165.6 241.246 L
165.78 240.85 L
165.96 240.447 L
166.14 239.796 L
166.32 240.314 L
166.5 243.509 L
166.68 247.571 L
166.86 250.527 L
167.04 255.076 L
167.22 263.486 L
167.4 270.212 L
167.58 274.465 L
167.76 278.544 L
167.94 286.362 L
168.12 295.958 L
168.3 306.165 L
168.48 310.313 L
168.66 314.024 L
168.84 319.797 L
169.02 324.917 L
169.2 327.316 L
169.38 328.799 L
169.56 337.735 L
169.74 352.361 L
169.92 360.457 L
170.1 363.409 L
170.28 364.299 L
170.46 360.502 L
170.64 357.647 L
170.82 353.324 L
171 347.759 L
171.18 332.777 L
171.36 327.315 L
171.54 323.052 L
171.72 318.126 L
171.9 313.133 L
172.08 305.337 L
172.26 293.404 L
172.44 283.073 L
172.62 276.234 L
172.8 269.32 L
172.98 261.484 L
173.16 253.419 L
173.34 248.294 L
173.52 244.932 L
173.7 241.693 L
173.88 237.531 L
174.06 235.947 L
174.24 235.139 L
174.42 235.099 L
174.6 236.031 L
174.78 238.162 L
174.96 242.389 L
175.14 247.252 L
175.32 253.681 L
175.5 262.84 L
175.68 273.379 L
175.86 280.646 L
176.04 284.288 L
176.22 287.239 L
176.4 291.203 L
176.58 292.736 L
176.76 293.121 L
176.94 298.067 L
177.12 306.69 L
177.3 313.535 L
177.48 315.695 L
177.66 314.748 L
177.84 315.559 L
178.02 320.279 L
178.2 327.854 L
178.38 335.359 L
178.56 341.091 L
178.74 336.491 L
178.92 335.283 L
179.1 338.108 L
179.28 344.289 L
179.46 336.943 L
179.64 326.754 L
179.82 317.826 L
180 312.071 L
180.18 305.982 L
180.36 298.435 L
180.54 290.448 L
180.72 282.408 L
180.9 273.702 L
181.08 266.586 L
181.26 261.532 L
181.44 257.069 L
181.62 253.176 L
181.8 248.746 L
181.98 246.521 L
182.16 244.01 L
182.34 242.283 L
182.52 241.702 L
182.7 242.001 L
182.88 240.807 L
183.06 239.431 L
183.24 241.047 L
183.42 246.202 L
183.6 249.369 L
183.78 252.041 L
183.96 256.744 L
184.14 263.834 L
184.32 268.49 L
184.5 272.685 L
184.68 277.912 L
184.86 282.717 L
185.04 285.617 L
185.22 288.167 L
185.4 293.516 L
185.58 303.095 L
185.76 307.883 L
185.94 311.187 L
186.12 320.097 L
186.3 336.377 L
186.48 347.612 L
186.66 339.149 L
186.84 328.307 L
187.02 325.893 L
187.2 325.501 L
187.38 322.439 L
187.56 317.07 L
187.74 314.571 L
187.92 313.012 L
188.1 307.125 L
188.28 298.99 L
188.46 292.438 L
188.64 287.725 L
188.82 281.749 L
189 273.337 L
189.18 264.298 L
189.36 255.477 L
189.54 249.699 L
189.72 247.126 L
189.9 245.607 L
190.08 242.86 L
190.26 239.645 L
190.44 237.125 L
190.62 235.071 L
190.8 234.052 L
190.98 235.477 L
191.16 236.083 L
191.34 234.173 L
191.52 232.535 L
191.7 233.354 L
191.88 237.482 L
192.06 240.62 L
192.24 242.116 L
192.42 243.873 L
192.6 246.758 L
192.78 250.032 L
192.96 254.857 L
193.14 262.258 L
193.32 269.988 L
193.5 275.326 L
193.68 280.641 L
193.86 288.177 L
194.04 297.105 L
194.22 303.178 L
194.4 305.227 L
194.58 307.37 L
194.76 314.827 L
194.94 324.884 L
195.12 327.348 L
195.3 325.819 L
195.48 324.053 L
195.66 320.874 L
195.84 317.346 L
196.02 314.352 L
196.2 313.024 L
196.38 312.071 L
196.56 308.618 L
196.74 301.655 L
196.92 294.318 L
197.1 290.04 L
197.28 285.784 L
197.46 280.04 L
197.64 273.252 L
197.82 265.518 L
198 257.976 L
198.18 252.989 L
198.36 250.409 L
198.54 248.498 L
198.72 246.23 L
198.9 242.694 L
199.08 239.844 L
199.26 238.802 L
199.44 239.125 L
199.62 240.107 L
199.8 238.94 L
199.98 236.883 L
200.16 236.441 L
200.34 239.552 L
200.52 242.875 L
200.7 244.387 L
200.88 245.75 L
201.06 248.002 L
201.24 250.665 L
201.42 254.131 L
201.6 258.493 L
201.78 263.097 L
201.96 265.936 L
202.14 270.49 L
202.32 277.232 L
202.5 283.853 L
202.68 286.404 L
202.86 287.859 L
203.04 293.863 L
203.22 303.968 L
203.4 310.127 L
203.58 311.355 L
203.76 311.051 L
203.94 310.722 L
204.12 310.536 L
204.3 309.914 L
204.48 309.533 L
204.66 307.649 L
204.84 302.543 L
205.02 293.855 L
205.2 289.241 L
205.38 288.815 L
205.56 287.263 L
205.74 282.906 L
205.92 278.585 L
206.1 275.621 L
206.28 273.705 L
206.46 270.906 L
206.64 265.634 L
206.82 262.764 L
207 262.543 L
207.18 262.333 L
207.36 260.332 L
207.54 256.937 L
207.72 253.373 L
207.9 249.904 L
208.08 248.208 L
208.26 246.225 L
208.44 243.4 L
208.62 241.841 L
208.8 242.911 L
208.98 246.266 L
209.16 248.418 L
209.34 249.304 L
209.52 250.412 L
209.7 252.185 L
209.88 256.253 L
210.06 262.508 L
210.24 268.485 L
210.42 273.504 L
210.6 277.263 L
210.78 280.213 L
210.96 284.169 L
211.14 287.407 L
211.32 289.8 L
211.5 291.837 L
211.68 294.462 L
211.86 300.893 L
212.04 304.272 L
212.22 306.094 L
212.4 306.79 L
212.58 307.356 L
212.76 307.154 L
212.94 305.814 L
213.12 300.987 L
213.3 297.511 L
213.48 297.772 L
213.66 300.877 L
213.84 298.769 L
214.02 292.929 L
214.2 287.732 L
214.38 283.712 L
214.56 279.07 L
214.74 274.785 L
214.92 271.37 L
215.1 268.393 L
215.28 265.953 L
215.46 263.516 L
215.64 260.54 L
215.82 259.562 L
216 258.939 L
216.18 257.95 L
216.36 256.172 L
216.54 254.379 L
216.72 254.438 L
216.9 258.868 L
217.08 264.739 L
217.26 267.364 L
217.44 267.328 L
217.62 267.176 L
217.8 268.507 L
217.98 272.413 L
218.16 277.228 L
218.34 282.369 L
218.52 288.189 L
218.7 294.985 L
218.88 303.862 L
219.06 309.95 L
219.24 313.278 L
219.42 313.669 L
219.6 313.701 L
219.78 317.106 L
219.96 319.713 L
220.14 318.326 L
220.32 315.986 L
220.5 316.03 L
220.68 316.977 L
220.86 315.072 L
221.04 312.951 L
221.22 308.716 L
221.4 305.408 L
221.58 304.531 L
221.76 304.298 L
221.94 301.334 L
222.12 298.357 L
222.3 296.582 L
222.48 292.865 L
222.66 286.04 L
222.84 278.497 L
223.02 272.425 L
223.2 266.43 L
223.38 260.737 L
223.56 256.398 L
223.74 254.377 L
223.92 253.518 L
224.1 252.862 L
224.28 251.319 L
224.46 250.909 L
224.64 252.005 L
224.82 251.807 L
225 249.833 L
225.18 249.244 L
225.36 250.2 L
225.54 250.417 L
225.72 249.518 L
225.9 250.129 L
226.08 251.758 L
226.26 254.185 L
226.44 257.424 L
226.62 262.892 L
226.8 270.324 L
226.98 277.792 L
227.16 284.583 L
227.34 292.205 L
227.52 302.504 L
227.7 312.506 L
227.88 320.975 L
228.06 325.253 L
228.24 327.274 L
228.42 327.858 L
228.6 330.18 L
228.78 330.277 L
228.96 327.728 L
229.14 325.191 L
229.32 322.019 L
229.5 316.076 L
229.68 312.989 L
229.86 310.601 L
230.04 309.388 L
230.22 308.716 L
230.4 307.225 L
230.58 303.24 L
230.76 297.11 L
230.94 292.269 L
231.12 287.77 L
231.3 283.76 L
231.48 279.479 L
231.66 275.89 L
231.84 272.468 L
232.02 268.677 L
232.2 264.265 L
232.38 258.579 L
232.56 255.508 L
232.74 254.742 L
232.92 253.552 L
233.1 250.668 L
233.28 246.799 L
233.46 243.239 L
233.64 240.426 L
233.82 238.506 L
234 237.161 L
234.18 237.649 L
234.36 239.665 L
234.54 242.824 L
234.72 247.154 L
234.9 251.664 L
235.08 254.204 L
235.26 255.794 L
235.44 259.929 L
235.62 266.62 L
235.8 272.668 L
235.98 276.178 L
236.16 277.958 L
236.34 280.333 L
236.52 282.494 L
236.7 284.198 L
236.88 287.041 L
237.06 291.876 L
237.24 297.693 L
237.42 303.043 L
237.6 304.952 L
237.78 302.594 L
237.96 297.572 L
238.14 293.233 L
238.32 292.472 L
238.5 292.588 L
238.68 291.497 L
238.86 289.06 L
239.04 288.655 L
239.22 287.976 L
239.4 285.042 L
239.58 281.537 L
239.76 279.391 L
239.94 278.507 L
240.12 275.374 L
240.3 270.387 L
240.48 265.2 L
240.66 261.806 L
240.84 258.939 L
241.02 256.768 L
241.2 254.379 L
241.38 251.837 L
241.56 248.62 L
241.74 247.577 L
241.92 246.84 L
242.1 245.097 L
242.28 242.79 L
242.46 241.189 L
242.64 242.402 L
242.82 243.96 L
243 244.704 L
243.18 245.691 L
243.36 247.595 L
243.54 250.774 L
243.72 254.733 L
243.9 258.894 L
244.08 260.881 L
244.26 263.558 L
244.44 266.278 L
244.62 268.268 L
244.8 271.626 L
244.98 274.017 L
245.16 274.945 L
245.34 272.801 L
245.52 272.529 L
245.7 274.547 L
245.88 279.562 L
246.06 284.279 L
246.24 285.681 L
246.42 283.932 L
246.6 280.833 L
246.78 279.989 L
246.96 280.142 L
247.14 280.211 L
247.32 280.372 L
247.5 280.949 L
247.68 279.885 L
247.86 278.667 L
248.04 278.339 L
248.22 276.384 L
248.4 270.39 L
248.58 262.394 L
248.76 255.86 L
248.94 253.117 L
249.12 251.811 L
249.3 248.646 L
249.48 245.015 L
249.66 242.756 L
249.84 240.379 L
250.02 236.766 L
250.2 231.926 L
250.38 229.637 L
250.56 230.514 L
250.74 231.802 L
250.92 232.446 L
251.1 231.416 L
251.28 231.265 L
251.46 232.58 L
251.64 237.612 L
251.82 240.196 L
252 240.384 L
252.18 243.355 L
252.36 249.263 L
252.54 255.053 L
252.72 258.462 L
252.9 261.154 L
253.08 264.615 L
253.26 268.076 L
253.44 270.437 L
253.62 271.289 L
253.8 271.435 L
253.98 272.545 L
254.16 276.551 L
254.34 281.858 L
254.52 284.323 L
254.7 285.262 L
254.88 285.155 L
255.06 284.432 L
255.24 284.35 L
255.42 286.282 L
255.6 288.978 L
255.78 288.251 L
255.96 283.054 L
256.14 276.698 L
256.32 272.782 L
256.5 270.572 L
256.68 264.733 L
256.86 257.32 L
257.04 252.651 L
257.22 249.561 L
257.4 247.7 L
257.58 245.71 L
257.76 243.936 L
257.94 241.523 L
258.12 237.804 L
258.3 236.081 L
258.48 235.024 L
258.66 232.887 L
258.84 232.986 L
259.02 235.307 L
259.2 235.234 L
259.38 233.912 L
259.56 234.241 L
259.74 237.553 L
259.92 240.721 L
260.1 243.376 L
260.28 246.524 L
260.46 249.371 L
260.64 252.91 L
260.82 254.211 L
261 254.647 L
261.18 255.765 L
261.36 255.996 L
261.54 256.418 L
261.72 259.159 L
261.9 263.005 L
262.08 265.924 L
262.26 268.117 L
262.44 271.742 L
262.62 274.216 L
262.8 275.573 L
262.98 273.871 L
263.16 272.478 L
263.34 271.202 L
263.52 270.416 L
263.7 270.396 L
263.88 271.39 L
264.06 270.354 L
264.24 266.12 L
264.42 261.658 L
264.6 259.22 L
264.78 258.208 L
264.96 255.369 L
265.14 252.472 L
265.32 249.058 L
265.5 246.653 L
265.68 244.349 L
265.86 242.03 L
266.04 240.445 L
266.22 239.504 L
266.4 237.426 L
266.58 233.753 L
266.76 232.395 L
266.94 231.616 L
267.12 231.73 L
267.3 231.756 L
267.48 232.587 L
267.66 236.758 L
267.84 237.839 L
268.02 239.286 L
268.2 241.87 L
268.38 246.451 L
268.56 249.233 L
268.74 249.685 L
268.92 250.922 L
269.1 253.671 L
269.28 256.792 L
269.46 257.813 L
269.64 257.556 L
269.82 259.252 L
270 263.171 L
270.18 263.901 L
270.36 260.45 L
270.54 259.675 L
270.72 263.503 L
270.9 268.035 L
271.08 271.651 L
271.26 272.038 L
271.44 271.121 L
271.62 269.111 L
271.8 267.908 L
271.98 268.14 L
272.16 268.716 L
272.34 267.809 L
272.52 265.737 L
272.7 263.48 L
272.88 259.425 L
273.06 255.937 L
273.24 253.773 L
273.42 252.376 L
273.6 250.613 L
273.78 248.139 L
273.96 246.564 L
274.14 247.562 L
274.32 248.481 L
274.5 248.409 L
274.68 246.618 L
274.86 245.452 L
275.04 245.223 L
275.22 245.246 L
275.4 244.897 L
275.58 244.988 L
275.76 244.553 L
275.94 242.67 L
276.12 241.432 L
276.3 243.238 L
276.48 247.301 L
276.66 249.827 L
276.84 250.356 L
277.02 251.162 L
277.2 253.288 L
277.38 254.981 L
277.56 255.284 L
277.74 254.608 L
277.92 254.668 L
278.1 255.052 L
278.28 255.929 L
278.46 256.065 L
278.64 255.648 L
278.82 254.845 L
279 254.076 L
279.18 253.274 L
279.36 252.128 L
279.54 251.844 L
279.72 252.054 L
279.9 252.351 L
280.08 253.122 L
280.26 256.433 L
280.44 262.241 L
280.62 263.877 L
280.8 260.425 L
280.98 256.641 L
281.16 256.333 L
281.34 259.186 L
281.52 261.653 L
281.7 260.792 L
281.88 259.664 L
282.06 259.065 L
282.24 258.22 L
282.42 257.563 L
282.6 257.917 L
282.78 258.453 L
282.96 258.238 L
283.14 256.197 L
283.32 254.978 L
283.5 257.105 L
283.68 260.489 L
283.86 261.344 L
284.04 257.334 L
284.22 253.322 L
284.4 253.039 L
284.58 253.808 L
284.76 254.077 L
284.94 254.274 L
285.12 255.915 L
285.3 257.171 L
285.48 256.888 L
285.66 256.896 L
285.84 258.833 L
286.02 261.369 L
286.2 262.283 L
286.38 262.611 L
286.56 264.327 L
286.74 265.243 L
286.92 265.068 L
287.1 263.647 L
287.28 262.115 L
287.46 260.508 L
287.64 261.979 L
287.82 263.848 L
288 263.743 L
288.18 260.259 L
288.36 259.136 L
288.54 263.727 L
288.72 267.561 L
288.9 267.406 L
289.08 266.112 L
289.26 267.364 L
289.44 270.987 L
289.62 272.042 L
289.8 272.441 L
289.98 275.458 L
290.16 281.219 L
290.34 283.098 L
290.52 280.306 L
290.7 277.64 L
290.88 278.809 L
291.06 280.8 L
291.24 280.969 L
291.42 279.657 L
291.6 277.981 L
291.78 276.896 L
291.96 277.529 L
292.14 280.126 L
292.32 282.508 L
292.5 282.648 L
292.68 281.33 L
292.86 280.192 L
293.04 279.845 L
293.22 278.192 L
293.4 275.455 L
293.58 272.48 L
293.76 269.639 L
293.94 268.128 L
294.12 267.164 L
294.3 266.1 L
294.48 264.823 L
294.66 264.059 L
294.84 263.56 L
295.02 260.391 L
295.2 254.423 L
295.38 249.843 L
295.56 248.926 L
295.74 250.877 L
295.92 252.694 L
296.1 252.764 L
296.28 251.828 L
296.46 251.647 L
296.64 253.837 L
296.82 257.484 L
297 260.271 L
297.18 262.725 L
297.36 265.199 L
297.54 267.009 L
297.72 266.927 L
297.9 265.615 L
298.08 264.057 L
298.26 264.035 L
298.44 264.716 L
298.62 266.096 L
298.8 267.213 L
298.98 270.046 L
299.16 274.158 L
299.34 279.316 L
299.52 282.093 L
299.7 281.584 L
299.88 281.362 L
300.06 283.051 L
300.24 284.24 L
300.42 280.964 L
300.6 277.02 L
300.78 274.269 L
300.96 272.963 L
301.14 271.749 L
301.32 268.317 L
301.5 265.566 L
301.68 264.653 L
301.86 266.372 L
302.04 266.902 L
302.22 264.454 L
302.4 259.765 L
302.58 256.087 L
302.76 253.213 L
302.94 251.033 L
303.12 249.043 L
303.3 248.316 L
303.48 248.143 L
303.66 247.194 L
303.84 246.561 L
304.02 245.264 L
304.2 246.278 L
304.38 247.227 L
304.56 248.656 L
304.74 249.62 L
304.92 252.672 L
305.1 257.718 L
305.28 264.224 L
305.46 266.991 L
305.64 266.848 L
305.82 267.72 L
306 272.018 L
306.18 275.206 L
306.36 275.575 L
306.54 275.607 L
306.72 276.773 L
306.9 277.434 L
307.08 278.371 L
307.26 279.873 L
307.44 281.942 L
307.62 281.939 L
307.8 280.688 L
307.98 281.594 L
308.16 282.7 L
308.34 283.026 L
308.52 282.868 L
308.7 282.247 L
308.88 280.083 L
309.06 277.895 L
309.24 276.218 L
309.42 275.564 L
309.6 274.993 L
309.78 272.734 L
309.96 269.393 L
310.14 267.254 L
310.32 267.299 L
310.5 266.789 L
310.68 263.045 L
310.86 256.822 L
311.04 253.116 L
311.22 251.179 L
311.4 250.982 L
311.58 252.472 L
311.76 254.216 L
311.94 256.306 L
312.12 257.287 L
312.3 258.387 L
312.48 259.755 L
312.66 262.168 L
312.84 264.685 L
313.02 268.637 L
313.2 273.04 L
313.38 276.34 L
313.56 275.937 L
313.74 274.234 L
313.92 274.369 L
314.1 277.232 L
314.28 281.358 L
314.46 284.351 L
314.64 286.347 L
314.82 287.994 L
315 289.393 L
S
GR
GS
[1 0 0 1 117 184.5] CT
/Helvetica 20 F
GS
[1 0 0 1 0 0] CT
0 7.5 moveto 
1 -1 scale
(Original signal) t 
GR
GR
GS
1 LJ
2 LW
N
84 184.5 M
114 184.5 L
S
GR
GS
[1 0 0 1 117 209] CT
/Helvetica 20 F
GS
[1 0 0 1 0 0] CT
0 7.5 moveto 
1 -1 scale
(Surrogate signal) t 
GR
GR
GS
1 0 0 RC
1 LJ
2 LW
N
84 209 M
114 209 L
S
GR
%%Trailer
%%Pages: 1
%%EOF
