%!PS-Adobe-3.0 EPSF-3.0
%%Creator: (MATLAB, The Mathworks, Inc. Version 9.8.0.1323502 \(R2020a\). Operating System: Mac OS X)
%%Title: /Users/ddg/Volumes/tardis_mpib.localized/stateswitch/stsw_beh_task/hddm_matched/figures/a03s_mediansplit_rt_yaoa_featurespecific.eps
%%CreationDate: 2024-05-03T17:10:31
%%Pages: (atend)
%%BoundingBox:    20     0   348   273
%%LanguageLevel: 3
%%EndComments
%%BeginProlog
%%BeginResource: procset (Apache XML Graphics Std ProcSet) 1.2 0
%%Version: 1.2 0
%%Copyright: (Copyright 2001-2003,2010 The Apache Software Foundation. License terms: http://www.apache.org/licenses/LICENSE-2.0)
/bd{bind def}bind def
/ld{load def}bd
/GR/grestore ld
/GS/gsave ld
/RM/rmoveto ld
/C/curveto ld
/t/show ld
/L/lineto ld
/ML/setmiterlimit ld
/CT/concat ld
/f/fill ld
/N/newpath ld
/S/stroke ld
/CC/setcmykcolor ld
/A/ashow ld
/cp/closepath ld
/RC/setrgbcolor ld
/LJ/setlinejoin ld
/GC/setgray ld
/LW/setlinewidth ld
/M/moveto ld
/re {4 2 roll M
1 index 0 rlineto
0 exch rlineto
neg 0 rlineto
cp } bd
/_ctm matrix def
/_tm matrix def
/BT { _ctm currentmatrix pop matrix _tm copy pop 0 0 moveto } bd
/ET { _ctm setmatrix } bd
/iTm { _ctm setmatrix _tm concat } bd
/Tm { _tm astore pop iTm 0 0 moveto } bd
/ux 0.0 def
/uy 0.0 def
/F {
  /Tp exch def
  /Tf exch def
  Tf findfont Tp scalefont setfont
  /cf Tf def  /cs Tp def
} bd
/ULS {currentpoint /uy exch def /ux exch def} bd
/ULE {
  /Tcx currentpoint pop def
  gsave
  newpath
  cf findfont cs scalefont dup
  /FontMatrix get 0 get /Ts exch def /FontInfo get dup
  /UnderlinePosition get Ts mul /To exch def
  /UnderlineThickness get Ts mul /Tt exch def
  ux uy To add moveto  Tcx uy To add lineto
  Tt setlinewidth stroke
  grestore
} bd
/OLE {
  /Tcx currentpoint pop def
  gsave
  newpath
  cf findfont cs scalefont dup
  /FontMatrix get 0 get /Ts exch def /FontInfo get dup
  /UnderlinePosition get Ts mul /To exch def
  /UnderlineThickness get Ts mul /Tt exch def
  ux uy To add cs add moveto Tcx uy To add cs add lineto
  Tt setlinewidth stroke
  grestore
} bd
/SOE {
  /Tcx currentpoint pop def
  gsave
  newpath
  cf findfont cs scalefont dup
  /FontMatrix get 0 get /Ts exch def /FontInfo get dup
  /UnderlinePosition get Ts mul /To exch def
  /UnderlineThickness get Ts mul /Tt exch def
  ux uy To add cs 10 mul 26 idiv add moveto Tcx uy To add cs 10 mul 26 idiv add lineto
  Tt setlinewidth stroke
  grestore
} bd
/QT {
/Y22 exch store
/X22 exch store
/Y21 exch store
/X21 exch store
currentpoint
/Y21 load 2 mul add 3 div exch
/X21 load 2 mul add 3 div exch
/X21 load 2 mul /X22 load add 3 div
/Y21 load 2 mul /Y22 load add 3 div
/X22 load /Y22 load curveto
} bd
/SSPD {
dup length /d exch dict def
{
/v exch def
/k exch def
currentpagedevice k known {
/cpdv currentpagedevice k get def
v cpdv ne {
/upd false def
/nullv v type /nulltype eq def
/nullcpdv cpdv type /nulltype eq def
nullv nullcpdv or
{
/upd true def
} {
/sametype v type cpdv type eq def
sametype {
v type /arraytype eq {
/vlen v length def
/cpdvlen cpdv length def
vlen cpdvlen eq {
0 1 vlen 1 sub {
/i exch def
/obj v i get def
/cpdobj cpdv i get def
obj cpdobj ne {
/upd true def
exit
} if
} for
} {
/upd true def
} ifelse
} {
v type /dicttype eq {
v {
/dv exch def
/dk exch def
/cpddv cpdv dk get def
dv cpddv ne {
/upd true def
exit
} if
} forall
} {
/upd true def
} ifelse
} ifelse
} if
} ifelse
upd true eq {
d k v put
} if
} if
} if
} forall
d length 0 gt {
d setpagedevice
} if
} bd
/RE { % /NewFontName [NewEncodingArray] /FontName RE -
  findfont dup length dict begin
  {
    1 index /FID ne
    {def} {pop pop} ifelse
  } forall
  /Encoding exch def
  /FontName 1 index def
  currentdict definefont pop
  end
} bind def
%%EndResource
%%BeginResource: procset (Apache XML Graphics EPS ProcSet) 1.0 0
%%Version: 1.0 0
%%Copyright: (Copyright 2002-2003 The Apache Software Foundation. License terms: http://www.apache.org/licenses/LICENSE-2.0)
/BeginEPSF { %def
/b4_Inc_state save def         % Save state for cleanup
/dict_count countdictstack def % Count objects on dict stack
/op_count count 1 sub def      % Count objects on operand stack
userdict begin                 % Push userdict on dict stack
/showpage { } def              % Redefine showpage, { } = null proc
0 setgray 0 setlinecap         % Prepare graphics state
1 setlinewidth 0 setlinejoin
10 setmiterlimit [ ] 0 setdash newpath
/languagelevel where           % If level not equal to 1 then
{pop languagelevel             % set strokeadjust and
1 ne                           % overprint to their defaults.
{false setstrokeadjust false setoverprint
} if
} if
} bd
/EndEPSF { %def
count op_count sub {pop} repeat            % Clean up stacks
countdictstack dict_count sub {end} repeat
b4_Inc_state restore
} bd
%%EndResource
%FOPBeginFontDict
%%IncludeResource: font Courier-Oblique
%%IncludeResource: font Courier-BoldOblique
%%IncludeResource: font Courier-Bold
%%IncludeResource: font ZapfDingbats
%%IncludeResource: font Symbol
%%IncludeResource: font Helvetica
%%IncludeResource: font Helvetica-Oblique
%%IncludeResource: font Helvetica-Bold
%%IncludeResource: font Helvetica-BoldOblique
%%IncludeResource: font Times-Roman
%%IncludeResource: font Times-Italic
%%IncludeResource: font Times-Bold
%%IncludeResource: font Times-BoldItalic
%%IncludeResource: font Courier
%FOPEndFontDict
%%BeginResource: encoding WinAnsiEncoding
/WinAnsiEncoding [
/.notdef /.notdef /.notdef /.notdef /.notdef
/.notdef /.notdef /.notdef /.notdef /.notdef
/.notdef /.notdef /.notdef /.notdef /.notdef
/.notdef /.notdef /.notdef /.notdef /.notdef
/.notdef /.notdef /.notdef /.notdef /.notdef
/.notdef /.notdef /.notdef /.notdef /.notdef
/.notdef /.notdef /space /exclam /quotedbl
/numbersign /dollar /percent /ampersand /quotesingle
/parenleft /parenright /asterisk /plus /comma
/hyphen /period /slash /zero /one
/two /three /four /five /six
/seven /eight /nine /colon /semicolon
/less /equal /greater /question /at
/A /B /C /D /E
/F /G /H /I /J
/K /L /M /N /O
/P /Q /R /S /T
/U /V /W /X /Y
/Z /bracketleft /backslash /bracketright /asciicircum
/underscore /quoteleft /a /b /c
/d /e /f /g /h
/i /j /k /l /m
/n /o /p /q /r
/s /t /u /v /w
/x /y /z /braceleft /bar
/braceright /asciitilde /bullet /Euro /bullet
/quotesinglbase /florin /quotedblbase /ellipsis /dagger
/daggerdbl /circumflex /perthousand /Scaron /guilsinglleft
/OE /bullet /Zcaron /bullet /bullet
/quoteleft /quoteright /quotedblleft /quotedblright /bullet
/endash /emdash /asciitilde /trademark /scaron
/guilsinglright /oe /bullet /zcaron /Ydieresis
/space /exclamdown /cent /sterling /currency
/yen /brokenbar /section /dieresis /copyright
/ordfeminine /guillemotleft /logicalnot /sfthyphen /registered
/macron /degree /plusminus /twosuperior /threesuperior
/acute /mu /paragraph /middot /cedilla
/onesuperior /ordmasculine /guillemotright /onequarter /onehalf
/threequarters /questiondown /Agrave /Aacute /Acircumflex
/Atilde /Adieresis /Aring /AE /Ccedilla
/Egrave /Eacute /Ecircumflex /Edieresis /Igrave
/Iacute /Icircumflex /Idieresis /Eth /Ntilde
/Ograve /Oacute /Ocircumflex /Otilde /Odieresis
/multiply /Oslash /Ugrave /Uacute /Ucircumflex
/Udieresis /Yacute /Thorn /germandbls /agrave
/aacute /acircumflex /atilde /adieresis /aring
/ae /ccedilla /egrave /eacute /ecircumflex
/edieresis /igrave /iacute /icircumflex /idieresis
/eth /ntilde /ograve /oacute /ocircumflex
/otilde /odieresis /divide /oslash /ugrave
/uacute /ucircumflex /udieresis /yacute /thorn
/ydieresis
] def
%%EndResource
%FOPBeginFontReencode
/Courier-Oblique findfont
dup length dict begin
  {1 index /FID ne {def} {pop pop} ifelse} forall
  /Encoding WinAnsiEncoding def
  currentdict
end
/Courier-Oblique exch definefont pop
/Courier-BoldOblique findfont
dup length dict begin
  {1 index /FID ne {def} {pop pop} ifelse} forall
  /Encoding WinAnsiEncoding def
  currentdict
end
/Courier-BoldOblique exch definefont pop
/Courier-Bold findfont
dup length dict begin
  {1 index /FID ne {def} {pop pop} ifelse} forall
  /Encoding WinAnsiEncoding def
  currentdict
end
/Courier-Bold exch definefont pop
/Helvetica findfont
dup length dict begin
  {1 index /FID ne {def} {pop pop} ifelse} forall
  /Encoding WinAnsiEncoding def
  currentdict
end
/Helvetica exch definefont pop
/Helvetica-Oblique findfont
dup length dict begin
  {1 index /FID ne {def} {pop pop} ifelse} forall
  /Encoding WinAnsiEncoding def
  currentdict
end
/Helvetica-Oblique exch definefont pop
/Helvetica-Bold findfont
dup length dict begin
  {1 index /FID ne {def} {pop pop} ifelse} forall
  /Encoding WinAnsiEncoding def
  currentdict
end
/Helvetica-Bold exch definefont pop
/Helvetica-BoldOblique findfont
dup length dict begin
  {1 index /FID ne {def} {pop pop} ifelse} forall
  /Encoding WinAnsiEncoding def
  currentdict
end
/Helvetica-BoldOblique exch definefont pop
/Times-Roman findfont
dup length dict begin
  {1 index /FID ne {def} {pop pop} ifelse} forall
  /Encoding WinAnsiEncoding def
  currentdict
end
/Times-Roman exch definefont pop
/Times-Italic findfont
dup length dict begin
  {1 index /FID ne {def} {pop pop} ifelse} forall
  /Encoding WinAnsiEncoding def
  currentdict
end
/Times-Italic exch definefont pop
/Times-Bold findfont
dup length dict begin
  {1 index /FID ne {def} {pop pop} ifelse} forall
  /Encoding WinAnsiEncoding def
  currentdict
end
/Times-Bold exch definefont pop
/Times-BoldItalic findfont
dup length dict begin
  {1 index /FID ne {def} {pop pop} ifelse} forall
  /Encoding WinAnsiEncoding def
  currentdict
end
/Times-BoldItalic exch definefont pop
/Courier findfont
dup length dict begin
  {1 index /FID ne {def} {pop pop} ifelse} forall
  /Encoding WinAnsiEncoding def
  currentdict
end
/Courier exch definefont pop
%FOPEndFontReencode
%%EndProlog
%%Page: 1 1
%%PageBoundingBox: 0 0 384 288
%%BeginPageSetup
[1 0 0 -1 0 288] CT
%%EndPageSetup
GS
1 GC
N
0 0 384 288 re
f
GR
GS
1 GC
N
0 0 384 288 re
f
GR
GS
1 GC
N
71.5 238.5 M
178.5 238.5 L
178.5 21.5 L
71.5 21.5 L
cp
f
GR
GS
0.149 GC
2 setlinecap
1 LJ
0.5 LW
N
71.5 238.5 M
178.5 238.5 L
S
GR
GS
0.149 GC
2 setlinecap
1 LJ
0.5 LW
N
84.875 238.5 M
84.875 236.33 L
S
GR
GS
0.149 GC
2 setlinecap
1 LJ
0.5 LW
N
111.625 238.5 M
111.625 236.33 L
S
GR
GS
0.149 GC
2 setlinecap
1 LJ
0.5 LW
N
138.375 238.5 M
138.375 236.33 L
S
GR
GS
0.149 GC
2 setlinecap
1 LJ
0.5 LW
N
165.125 238.5 M
165.125 236.33 L
S
GR
GS
[1 0 0 1 84.875 244.09999] CT
0.149 GC
/Helvetica 18 F
GS
[1 0 0 1 0 0] CT
-5.5 18 moveto 
1 -1 scale
(1) t 
GR
GR
GS
[1 0 0 1 111.625 244.09999] CT
0.149 GC
/Helvetica 18 F
GS
[1 0 0 1 0 0] CT
-5.5 18 moveto 
1 -1 scale
(2) t 
GR
GR
GS
[1 0 0 1 138.375 244.09999] CT
0.149 GC
/Helvetica 18 F
GS
[1 0 0 1 0 0] CT
-5.5 18 moveto 
1 -1 scale
(3) t 
GR
GR
GS
[1 0 0 1 165.125 244.09999] CT
0.149 GC
/Helvetica 18 F
GS
[1 0 0 1 0 0] CT
-5.5 18 moveto 
1 -1 scale
(4) t 
GR
GR
GS
[1 0 0 1 125.00005 266.60001] CT
0.149 GC
/Helvetica 18 F
GS
[1 0 0 1 0 0] CT
-67.5 18 moveto 
1 -1 scale
(preferred feature) t 
GR
GR
GS
0.149 GC
2 setlinecap
1 LJ
0.5 LW
N
71.5 238.5 M
71.5 21.5 L
S
GR
GS
0.149 GC
2 setlinecap
1 LJ
0.5 LW
N
71.5 238.5 M
73.67 238.5 L
S
GR
GS
0.149 GC
2 setlinecap
1 LJ
0.5 LW
N
71.5 184.25 M
73.67 184.25 L
S
GR
GS
0.149 GC
2 setlinecap
1 LJ
0.5 LW
N
71.5 130 M
73.67 130 L
S
GR
GS
0.149 GC
2 setlinecap
1 LJ
0.5 LW
N
71.5 75.75 M
73.67 75.75 L
S
GR
GS
0.149 GC
2 setlinecap
1 LJ
0.5 LW
N
71.5 21.5 M
73.67 21.5 L
S
GR
GS
[1 0 0 1 65.9 238.5] CT
0.149 GC
/Helvetica 18 F
GS
[1 0 0 1 0 0] CT
-26 7 moveto 
1 -1 scale
(0.3) t 
GR
GR
GS
[1 0 0 1 65.9 184.25] CT
0.149 GC
/Helvetica 18 F
GS
[1 0 0 1 0 0] CT
-26 7 moveto 
1 -1 scale
(0.4) t 
GR
GR
GS
[1 0 0 1 65.9 130] CT
0.149 GC
/Helvetica 18 F
GS
[1 0 0 1 0 0] CT
-26 7 moveto 
1 -1 scale
(0.5) t 
GR
GR
GS
[1 0 0 1 65.9 75.74998] CT
0.149 GC
/Helvetica 18 F
GS
[1 0 0 1 0 0] CT
-26 7 moveto 
1 -1 scale
(0.6) t 
GR
GR
GS
[1 0 0 1 65.9 21.50001] CT
0.149 GC
/Helvetica 18 F
GS
[1 0 0 1 0 0] CT
-26 7 moveto 
1 -1 scale
(0.7) t 
GR
GR
GS
[0 -1 1 0 37.4 129.99991] CT
0.149 GC
/Helvetica 18 F
GS
[1 0 0 1 0 0] CT
-11.5 -4 moveto 
1 -1 scale
(RT) t 
GR
GR
GS
1 LJ
2 LW
N
84.875 202.836 M
84.875 209.569 L
S
GR
GS
1 LJ
2 LW
N
111.625 198.847 M
111.625 206.323 L
S
GR
GS
1 LJ
2 LW
N
138.375 192.324 M
138.375 199.938 L
S
GR
GS
1 LJ
2 LW
N
165.125 183.093 M
165.125 190.711 L
S
GR
GS
1 LJ
2 LW
N
84.875 202.836 M
84.875 196.102 L
S
GR
GS
1 LJ
2 LW
N
111.625 198.847 M
111.625 191.371 L
S
GR
GS
1 LJ
2 LW
N
138.375 192.324 M
138.375 184.71 L
S
GR
GS
1 LJ
2 LW
N
165.125 183.093 M
165.125 175.475 L
S
GR
GS
1 LJ
2 LW
N
84.875 202.836 M
111.625 198.847 L
138.375 192.324 L
165.125 183.093 L
S
GR
GS
[1 0 0 1 84.875 209.56886] CT
N
-3 0 M
3 0 L
f
GR
GS
[1 0 0 1 84.875 209.56886] CT
10.0 ML
2 LW
N
-3 0 M
3 0 L
S
GR
GS
[1 0 0 1 111.625 206.32344] CT
N
/f1394637256{-3 0 M
3 0 L}def
f1394637256
f
GR
GS
[1 0 0 1 111.625 206.32344] CT
10.0 ML
2 LW
N
-3 0 M
3 0 L
S
GR
GS
[1 0 0 1 138.375 199.93759] CT
N
f1394637256
f
GR
GS
[1 0 0 1 138.375 199.93759] CT
10.0 ML
2 LW
N
-3 0 M
3 0 L
S
GR
GS
[1 0 0 1 165.125 190.71098] CT
N
f1394637256
f
GR
GS
[1 0 0 1 165.125 190.71098] CT
10.0 ML
2 LW
N
-3 0 M
3 0 L
S
GR
GS
[1 0 0 1 84.875 196.10245] CT
N
f1394637256
f
GR
GS
[1 0 0 1 84.875 196.10245] CT
10.0 ML
2 LW
N
-3 0 M
3 0 L
S
GR
GS
[1 0 0 1 111.625 191.37086] CT
N
f1394637256
f
GR
GS
[1 0 0 1 111.625 191.37086] CT
10.0 ML
2 LW
N
-3 0 M
3 0 L
S
GR
GS
[1 0 0 1 138.375 184.71034] CT
N
f1394637256
f
GR
GS
[1 0 0 1 138.375 184.71034] CT
10.0 ML
2 LW
N
-3 0 M
3 0 L
S
GR
GS
[1 0 0 1 165.125 175.47493] CT
N
f1394637256
f
GR
GS
[1 0 0 1 165.125 175.47493] CT
10.0 ML
2 LW
N
-3 0 M
3 0 L
S
GR
GS
1 LJ
2 LW
N
84.875 156.701 M
84.875 176.673 L
S
GR
GS
1 LJ
2 LW
N
111.625 150.076 M
111.625 170.684 L
S
GR
GS
1 LJ
2 LW
N
138.375 158.482 M
138.375 176.904 L
S
GR
GS
1 LJ
2 LW
N
165.125 136.787 M
165.125 159.286 L
S
GR
GS
1 LJ
2 LW
N
84.875 156.701 M
84.875 136.729 L
S
GR
GS
1 LJ
2 LW
N
111.625 150.076 M
111.625 129.469 L
S
GR
GS
1 LJ
2 LW
N
138.375 158.482 M
138.375 140.06 L
S
GR
GS
1 LJ
2 LW
N
165.125 136.787 M
165.125 114.288 L
S
GR
GS
[8 8] 0 setdash
2 LJ
2 LW
N
84.875 156.701 M
111.625 150.076 L
138.375 158.482 L
165.125 136.787 L
S
GR
GS
[1 0 0 1 84.875 176.67259] CT
N
f1394637256
f
GR
GS
[1 0 0 1 84.875 176.67259] CT
10.0 ML
2 LW
N
-3 0 M
3 0 L
S
GR
GS
[1 0 0 1 111.625 170.68353] CT
N
f1394637256
f
GR
GS
[1 0 0 1 111.625 170.68353] CT
10.0 ML
2 LW
N
-3 0 M
3 0 L
S
GR
GS
[1 0 0 1 138.375 176.90437] CT
N
f1394637256
f
GR
GS
[1 0 0 1 138.375 176.90437] CT
10.0 ML
2 LW
N
-3 0 M
3 0 L
S
GR
GS
[1 0 0 1 165.125 159.28571] CT
N
f1394637256
f
GR
GS
[1 0 0 1 165.125 159.28571] CT
10.0 ML
2 LW
N
-3 0 M
3 0 L
S
GR
GS
[1 0 0 1 84.875 136.72873] CT
N
f1394637256
f
GR
GS
[1 0 0 1 84.875 136.72873] CT
10.0 ML
2 LW
N
-3 0 M
3 0 L
S
GR
GS
[1 0 0 1 111.625 129.46918] CT
N
f1394637256
f
GR
GS
[1 0 0 1 111.625 129.46918] CT
10.0 ML
2 LW
N
-3 0 M
3 0 L
S
GR
GS
[1 0 0 1 138.375 140.06004] CT
N
f1394637256
f
GR
GS
[1 0 0 1 138.375 140.06004] CT
10.0 ML
2 LW
N
-3 0 M
3 0 L
S
GR
GS
[1 0 0 1 165.125 114.28762] CT
N
f1394637256
f
GR
GS
[1 0 0 1 165.125 114.28762] CT
10.0 ML
2 LW
N
-3 0 M
3 0 L
S
GR
GS
1 0 0 RC
1 LJ
2 LW
N
84.875 122.538 M
84.875 135.541 L
S
GR
GS
1 0 0 RC
1 LJ
2 LW
N
111.625 117.03 M
111.625 132.69 L
S
GR
GS
1 0 0 RC
1 LJ
2 LW
N
138.375 104.34 M
138.375 115.993 L
S
GR
GS
1 0 0 RC
1 LJ
2 LW
N
165.125 66.186 M
165.125 83.043 L
S
GR
GS
1 0 0 RC
1 LJ
2 LW
N
84.875 122.538 M
84.875 109.535 L
S
GR
GS
1 0 0 RC
1 LJ
2 LW
N
111.625 117.03 M
111.625 101.37 L
S
GR
GS
1 0 0 RC
1 LJ
2 LW
N
138.375 104.34 M
138.375 92.688 L
S
GR
GS
1 0 0 RC
1 LJ
2 LW
N
165.125 66.186 M
165.125 49.329 L
S
GR
GS
1 0 0 RC
1 LJ
2 LW
N
84.875 122.538 M
111.625 117.03 L
138.375 104.34 L
165.125 66.186 L
S
GR
GS
[1 0 0 1 84.875 135.54074] CT
1 0 0 RC
N
f1394637256
f
GR
GS
[1 0 0 1 84.875 135.54074] CT
1 0 0 RC
10.0 ML
2 LW
N
-3 0 M
3 0 L
S
GR
GS
[1 0 0 1 111.625 132.69019] CT
1 0 0 RC
N
f1394637256
f
GR
GS
[1 0 0 1 111.625 132.69019] CT
1 0 0 RC
10.0 ML
2 LW
N
-3 0 M
3 0 L
S
GR
GS
[1 0 0 1 138.375 115.99284] CT
1 0 0 RC
N
f1394637256
f
GR
GS
[1 0 0 1 138.375 115.99284] CT
1 0 0 RC
10.0 ML
2 LW
N
-3 0 M
3 0 L
S
GR
GS
[1 0 0 1 165.125 83.0434] CT
1 0 0 RC
N
f1394637256
f
GR
GS
[1 0 0 1 165.125 83.0434] CT
1 0 0 RC
10.0 ML
2 LW
N
-3 0 M
3 0 L
S
GR
GS
[1 0 0 1 84.875 109.5355] CT
1 0 0 RC
N
f1394637256
f
GR
GS
[1 0 0 1 84.875 109.5355] CT
1 0 0 RC
10.0 ML
2 LW
N
-3 0 M
3 0 L
S
GR
GS
[1 0 0 1 111.625 101.37029] CT
1 0 0 RC
N
f1394637256
f
GR
GS
[1 0 0 1 111.625 101.37029] CT
1 0 0 RC
10.0 ML
2 LW
N
-3 0 M
3 0 L
S
GR
GS
[1 0 0 1 138.375 92.68798] CT
1 0 0 RC
N
f1394637256
f
GR
GS
[1 0 0 1 138.375 92.68798] CT
1 0 0 RC
10.0 ML
2 LW
N
-3 0 M
3 0 L
S
GR
GS
[1 0 0 1 165.125 49.32941] CT
1 0 0 RC
N
f1394637256
f
GR
GS
[1 0 0 1 165.125 49.32941] CT
1 0 0 RC
10.0 ML
2 LW
N
-3 0 M
3 0 L
S
GR
GS
1 0 0 RC
1 LJ
2 LW
N
84.875 104.18 M
84.875 127.672 L
S
GR
GS
1 0 0 RC
1 LJ
2 LW
N
111.625 75.968 M
111.625 105.037 L
S
GR
GS
1 0 0 RC
1 LJ
2 LW
N
138.375 83.346 M
138.375 108.357 L
S
GR
GS
1 0 0 RC
1 LJ
2 LW
N
165.125 72.792 M
165.125 98.134 L
S
GR
GS
1 0 0 RC
1 LJ
2 LW
N
84.875 104.18 M
84.875 80.687 L
S
GR
GS
1 0 0 RC
1 LJ
2 LW
N
111.625 75.968 M
111.625 46.899 L
S
GR
GS
1 0 0 RC
1 LJ
2 LW
N
138.375 83.346 M
138.375 58.336 L
S
GR
GS
1 0 0 RC
1 LJ
2 LW
N
165.125 72.792 M
165.125 47.45 L
S
GR
GS
1 0 0 RC
[8 8] 0 setdash
2 LJ
2 LW
N
84.875 104.18 M
111.625 75.968 L
138.375 83.346 L
165.125 72.792 L
S
GR
GS
[1 0 0 1 84.875 127.67242] CT
1 0 0 RC
N
f1394637256
f
GR
GS
[1 0 0 1 84.875 127.67242] CT
1 0 0 RC
10.0 ML
2 LW
N
-3 0 M
3 0 L
S
GR
GS
[1 0 0 1 111.625 105.03662] CT
1 0 0 RC
N
f1394637256
f
GR
GS
[1 0 0 1 111.625 105.03662] CT
1 0 0 RC
10.0 ML
2 LW
N
-3 0 M
3 0 L
S
GR
GS
[1 0 0 1 138.375 108.35706] CT
1 0 0 RC
N
f1394637256
f
GR
GS
[1 0 0 1 138.375 108.35706] CT
1 0 0 RC
10.0 ML
2 LW
N
-3 0 M
3 0 L
S
GR
GS
[1 0 0 1 165.125 98.13357] CT
1 0 0 RC
N
f1394637256
f
GR
GS
[1 0 0 1 165.125 98.13357] CT
1 0 0 RC
10.0 ML
2 LW
N
-3 0 M
3 0 L
S
GR
GS
[1 0 0 1 84.875 80.68658] CT
1 0 0 RC
N
f1394637256
f
GR
GS
[1 0 0 1 84.875 80.68658] CT
1 0 0 RC
10.0 ML
2 LW
N
-3 0 M
3 0 L
S
GR
GS
[1 0 0 1 111.625 46.89911] CT
1 0 0 RC
N
f1394637256
f
GR
GS
[1 0 0 1 111.625 46.89911] CT
1 0 0 RC
10.0 ML
2 LW
N
-3 0 M
3 0 L
S
GR
GS
[1 0 0 1 138.375 58.33566] CT
1 0 0 RC
N
f1394637256
f
GR
GS
[1 0 0 1 138.375 58.33566] CT
1 0 0 RC
10.0 ML
2 LW
N
-3 0 M
3 0 L
S
GR
GS
[1 0 0 1 165.125 47.45042] CT
1 0 0 RC
N
f1394637256
f
GR
GS
[1 0 0 1 165.125 47.45042] CT
1 0 0 RC
10.0 ML
2 LW
N
-3 0 M
3 0 L
S
GR
GS
1 GC
N
/f509648754{241 238.5 M
347.5 238.5 L
347.5 21.5 L
241 21.5 L
cp}def
f509648754
f
GR
GS
0.149 GC
2 setlinecap
1 LJ
0.5 LW
N
241 238.5 M
347.5 238.5 L
S
GR
GS
0.149 GC
2 setlinecap
1 LJ
0.5 LW
N
254.313 238.5 M
254.313 236.33 L
S
GR
GS
0.149 GC
2 setlinecap
1 LJ
0.5 LW
N
280.938 238.5 M
280.938 236.33 L
S
GR
GS
0.149 GC
2 setlinecap
1 LJ
0.5 LW
N
307.563 238.5 M
307.563 236.33 L
S
GR
GS
0.149 GC
2 setlinecap
1 LJ
0.5 LW
N
334.188 238.5 M
334.188 236.33 L
S
GR
GS
[1 0 0 1 254.3125 244.09999] CT
0.149 GC
/Helvetica 18 F
GS
[1 0 0 1 0 0] CT
-5.5 18 moveto 
1 -1 scale
(1) t 
GR
GR
GS
[1 0 0 1 280.9375 244.09999] CT
0.149 GC
/Helvetica 18 F
GS
[1 0 0 1 0 0] CT
-5.5 18 moveto 
1 -1 scale
(2) t 
GR
GR
GS
[1 0 0 1 307.5625 244.09999] CT
0.149 GC
/Helvetica 18 F
GS
[1 0 0 1 0 0] CT
-5.5 18 moveto 
1 -1 scale
(3) t 
GR
GR
GS
[1 0 0 1 334.1875 244.09999] CT
0.149 GC
/Helvetica 18 F
GS
[1 0 0 1 0 0] CT
-5.5 18 moveto 
1 -1 scale
(4) t 
GR
GR
GS
[1 0 0 1 294.25006 266.60001] CT
0.149 GC
/Helvetica 18 F
GS
[1 0 0 1 0 0] CT
-28 18 moveto 
1 -1 scale
(feature) t 
GR
GR
GS
0.149 GC
2 setlinecap
1 LJ
0.5 LW
N
241 238.5 M
241 21.5 L
S
GR
GS
0.149 GC
2 setlinecap
1 LJ
0.5 LW
N
241 238.5 M
243.17 238.5 L
S
GR
GS
0.149 GC
2 setlinecap
1 LJ
0.5 LW
N
241 184.25 M
243.17 184.25 L
S
GR
GS
0.149 GC
2 setlinecap
1 LJ
0.5 LW
N
241 130 M
243.17 130 L
S
GR
GS
0.149 GC
2 setlinecap
1 LJ
0.5 LW
N
241 75.75 M
243.17 75.75 L
S
GR
GS
0.149 GC
2 setlinecap
1 LJ
0.5 LW
N
241 21.5 M
243.17 21.5 L
S
GR
GS
[1 0 0 1 235.39999 238.5] CT
0.149 GC
/Helvetica 18 F
GS
[1 0 0 1 0 0] CT
-26 7 moveto 
1 -1 scale
(0.3) t 
GR
GR
GS
[1 0 0 1 235.39999 184.25] CT
0.149 GC
/Helvetica 18 F
GS
[1 0 0 1 0 0] CT
-26 7 moveto 
1 -1 scale
(0.4) t 
GR
GR
GS
[1 0 0 1 235.39999 130] CT
0.149 GC
/Helvetica 18 F
GS
[1 0 0 1 0 0] CT
-26 7 moveto 
1 -1 scale
(0.5) t 
GR
GR
GS
[1 0 0 1 235.39999 75.74998] CT
0.149 GC
/Helvetica 18 F
GS
[1 0 0 1 0 0] CT
-26 7 moveto 
1 -1 scale
(0.6) t 
GR
GR
GS
[1 0 0 1 235.39999 21.50001] CT
0.149 GC
/Helvetica 18 F
GS
[1 0 0 1 0 0] CT
-26 7 moveto 
1 -1 scale
(0.7) t 
GR
GR
GS
[0 -1 1 0 206.89999 129.99991] CT
0.149 GC
/Helvetica 18 F
GS
[1 0 0 1 0 0] CT
-11.5 -4 moveto 
1 -1 scale
(RT) t 
GR
GR
GS
1 LJ
2 LW
N
254.313 202.257 M
254.313 208.933 L
S
GR
GS
1 LJ
2 LW
N
280.938 194.351 M
280.938 201.233 L
S
GR
GS
1 LJ
2 LW
N
307.563 194.596 M
307.563 201.888 L
S
GR
GS
1 LJ
2 LW
N
334.188 185.896 M
334.188 194.783 L
S
GR
GS
1 LJ
2 LW
N
254.313 202.257 M
254.313 195.581 L
S
GR
GS
1 LJ
2 LW
N
280.938 194.351 M
280.938 187.47 L
S
GR
GS
1 LJ
2 LW
N
307.563 194.596 M
307.563 187.303 L
S
GR
GS
1 LJ
2 LW
N
334.188 185.896 M
334.188 177.009 L
S
GR
GS
1 LJ
2 LW
N
254.313 202.257 M
280.938 194.351 L
307.563 194.596 L
334.188 185.896 L
S
GR
GS
[1 0 0 1 254.3125 208.9326] CT
N
f1394637256
f
GR
GS
[1 0 0 1 254.3125 208.9326] CT
10.0 ML
2 LW
N
-3 0 M
3 0 L
S
GR
GS
[1 0 0 1 280.9375 201.23312] CT
N
f1394637256
f
GR
GS
[1 0 0 1 280.9375 201.23312] CT
10.0 ML
2 LW
N
-3 0 M
3 0 L
S
GR
GS
[1 0 0 1 307.5625 201.88773] CT
N
f1394637256
f
GR
GS
[1 0 0 1 307.5625 201.88773] CT
10.0 ML
2 LW
N
-3 0 M
3 0 L
S
GR
GS
[1 0 0 1 334.1875 194.78305] CT
N
f1394637256
f
GR
GS
[1 0 0 1 334.1875 194.78305] CT
10.0 ML
2 LW
N
-3 0 M
3 0 L
S
GR
GS
[1 0 0 1 254.3125 195.58076] CT
N
f1394637256
f
GR
GS
[1 0 0 1 254.3125 195.58076] CT
10.0 ML
2 LW
N
-3 0 M
3 0 L
S
GR
GS
[1 0 0 1 280.9375 187.46951] CT
N
f1394637256
f
GR
GS
[1 0 0 1 280.9375 187.46951] CT
10.0 ML
2 LW
N
-3 0 M
3 0 L
S
GR
GS
[1 0 0 1 307.5625 187.30347] CT
N
f1394637256
f
GR
GS
[1 0 0 1 307.5625 187.30347] CT
10.0 ML
2 LW
N
-3 0 M
3 0 L
S
GR
GS
[1 0 0 1 334.1875 177.0092] CT
N
f1394637256
f
GR
GS
[1 0 0 1 334.1875 177.0092] CT
10.0 ML
2 LW
N
-3 0 M
3 0 L
S
GR
GS
1 LJ
2 LW
N
254.313 152.505 M
254.313 173.897 L
S
GR
GS
1 LJ
2 LW
N
280.938 149.861 M
280.938 167.791 L
S
GR
GS
1 LJ
2 LW
N
307.563 153.244 M
307.563 173.194 L
S
GR
GS
1 LJ
2 LW
N
334.188 146.436 M
334.188 169.066 L
S
GR
GS
1 LJ
2 LW
N
254.313 152.505 M
254.313 131.112 L
S
GR
GS
1 LJ
2 LW
N
280.938 149.861 M
280.938 131.93 L
S
GR
GS
1 LJ
2 LW
N
307.563 153.244 M
307.563 133.294 L
S
GR
GS
1 LJ
2 LW
N
334.188 146.436 M
334.188 123.806 L
S
GR
GS
[8 8] 0 setdash
2 LJ
2 LW
N
254.313 152.505 M
280.938 149.861 L
307.563 153.244 L
334.188 146.436 L
S
GR
GS
[1 0 0 1 254.3125 173.89716] CT
N
f1394637256
f
GR
GS
[1 0 0 1 254.3125 173.89716] CT
10.0 ML
2 LW
N
-3 0 M
3 0 L
S
GR
GS
[1 0 0 1 280.9375 167.791] CT
N
f1394637256
f
GR
GS
[1 0 0 1 280.9375 167.791] CT
10.0 ML
2 LW
N
-3 0 M
3 0 L
S
GR
GS
[1 0 0 1 307.5625 173.19434] CT
N
f1394637256
f
GR
GS
[1 0 0 1 307.5625 173.19434] CT
10.0 ML
2 LW
N
-3 0 M
3 0 L
S
GR
GS
[1 0 0 1 334.1875 169.06642] CT
N
f1394637256
f
GR
GS
[1 0 0 1 334.1875 169.06642] CT
10.0 ML
2 LW
N
-3 0 M
3 0 L
S
GR
GS
[1 0 0 1 254.3125 131.11189] CT
N
f1394637256
f
GR
GS
[1 0 0 1 254.3125 131.11189] CT
10.0 ML
2 LW
N
-3 0 M
3 0 L
S
GR
GS
[1 0 0 1 280.9375 131.9305] CT
N
f1394637256
f
GR
GS
[1 0 0 1 280.9375 131.9305] CT
10.0 ML
2 LW
N
-3 0 M
3 0 L
S
GR
GS
[1 0 0 1 307.5625 133.29431] CT
N
f1394637256
f
GR
GS
[1 0 0 1 307.5625 133.29431] CT
10.0 ML
2 LW
N
-3 0 M
3 0 L
S
GR
GS
[1 0 0 1 334.1875 123.80613] CT
N
f1394637256
f
GR
GS
[1 0 0 1 334.1875 123.80613] CT
10.0 ML
2 LW
N
-3 0 M
3 0 L
S
GR
GS
1 0 0 RC
1 LJ
2 LW
N
254.313 115.631 M
254.313 128.357 L
S
GR
GS
1 0 0 RC
1 LJ
2 LW
N
280.938 116.556 M
280.938 132.449 L
S
GR
GS
1 0 0 RC
1 LJ
2 LW
N
307.563 100.268 M
307.563 115.061 L
S
GR
GS
1 0 0 RC
1 LJ
2 LW
N
334.188 77.64 M
334.188 93.756 L
S
GR
GS
1 0 0 RC
1 LJ
2 LW
N
254.313 115.631 M
254.313 102.906 L
S
GR
GS
1 0 0 RC
1 LJ
2 LW
N
280.938 116.556 M
280.938 100.663 L
S
GR
GS
1 0 0 RC
1 LJ
2 LW
N
307.563 100.268 M
307.563 85.475 L
S
GR
GS
1 0 0 RC
1 LJ
2 LW
N
334.188 77.64 M
334.188 61.523 L
S
GR
GS
1 0 0 RC
1 LJ
2 LW
N
254.313 115.631 M
280.938 116.556 L
307.563 100.268 L
334.188 77.64 L
S
GR
GS
[1 0 0 1 254.3125 128.35674] CT
1 0 0 RC
N
f1394637256
f
GR
GS
[1 0 0 1 254.3125 128.35674] CT
1 0 0 RC
10.0 ML
2 LW
N
-3 0 M
3 0 L
S
GR
GS
[1 0 0 1 280.9375 132.4492] CT
1 0 0 RC
N
f1394637256
f
GR
GS
[1 0 0 1 280.9375 132.4492] CT
1 0 0 RC
10.0 ML
2 LW
N
-3 0 M
3 0 L
S
GR
GS
[1 0 0 1 307.5625 115.06115] CT
1 0 0 RC
N
f1394637256
f
GR
GS
[1 0 0 1 307.5625 115.06115] CT
1 0 0 RC
10.0 ML
2 LW
N
-3 0 M
3 0 L
S
GR
GS
[1 0 0 1 334.1875 93.75589] CT
1 0 0 RC
N
f1394637256
f
GR
GS
[1 0 0 1 334.1875 93.75589] CT
1 0 0 RC
10.0 ML
2 LW
N
-3 0 M
3 0 L
S
GR
GS
[1 0 0 1 254.3125 102.90601] CT
1 0 0 RC
N
f1394637256
f
GR
GS
[1 0 0 1 254.3125 102.90601] CT
1 0 0 RC
10.0 ML
2 LW
N
-3 0 M
3 0 L
S
GR
GS
[1 0 0 1 280.9375 100.66328] CT
1 0 0 RC
N
f1394637256
f
GR
GS
[1 0 0 1 280.9375 100.66328] CT
1 0 0 RC
10.0 ML
2 LW
N
-3 0 M
3 0 L
S
GR
GS
[1 0 0 1 307.5625 85.4747] CT
1 0 0 RC
N
f1394637256
f
GR
GS
[1 0 0 1 307.5625 85.4747] CT
1 0 0 RC
10.0 ML
2 LW
N
-3 0 M
3 0 L
S
GR
GS
[1 0 0 1 334.1875 61.5233] CT
1 0 0 RC
N
f1394637256
f
GR
GS
[1 0 0 1 334.1875 61.5233] CT
1 0 0 RC
10.0 ML
2 LW
N
-3 0 M
3 0 L
S
GR
GS
1 0 0 RC
1 LJ
2 LW
N
254.313 99.612 M
254.313 120.009 L
S
GR
GS
1 0 0 RC
1 LJ
2 LW
N
280.938 84.363 M
280.938 112.837 L
S
GR
GS
1 0 0 RC
1 LJ
2 LW
N
307.563 91.7 M
307.563 116.601 L
S
GR
GS
1 0 0 RC
1 LJ
2 LW
N
334.188 60.611 M
334.188 88.961 L
S
GR
GS
1 0 0 RC
1 LJ
2 LW
N
254.313 99.612 M
254.313 79.215 L
S
GR
GS
1 0 0 RC
1 LJ
2 LW
N
280.938 84.363 M
280.938 55.889 L
S
GR
GS
1 0 0 RC
1 LJ
2 LW
N
307.563 91.7 M
307.563 66.799 L
S
GR
GS
1 0 0 RC
1 LJ
2 LW
N
334.188 60.611 M
334.188 32.26 L
S
GR
GS
1 0 0 RC
[8 8] 0 setdash
2 LJ
2 LW
N
254.313 99.612 M
280.938 84.363 L
307.563 91.7 L
334.188 60.611 L
S
GR
GS
[1 0 0 1 254.3125 120.00926] CT
1 0 0 RC
N
f1394637256
f
GR
GS
[1 0 0 1 254.3125 120.00926] CT
1 0 0 RC
10.0 ML
2 LW
N
-3 0 M
3 0 L
S
GR
GS
[1 0 0 1 280.9375 112.83679] CT
1 0 0 RC
N
f1394637256
f
GR
GS
[1 0 0 1 280.9375 112.83679] CT
1 0 0 RC
10.0 ML
2 LW
N
-3 0 M
3 0 L
S
GR
GS
[1 0 0 1 307.5625 116.60078] CT
1 0 0 RC
N
f1394637256
f
GR
GS
[1 0 0 1 307.5625 116.60078] CT
1 0 0 RC
10.0 ML
2 LW
N
-3 0 M
3 0 L
S
GR
GS
[1 0 0 1 334.1875 88.96134] CT
1 0 0 RC
N
f1394637256
f
GR
GS
[1 0 0 1 334.1875 88.96134] CT
1 0 0 RC
10.0 ML
2 LW
N
-3 0 M
3 0 L
S
GR
GS
[1 0 0 1 254.3125 79.21548] CT
1 0 0 RC
N
f1394637256
f
GR
GS
[1 0 0 1 254.3125 79.21548] CT
1 0 0 RC
10.0 ML
2 LW
N
-3 0 M
3 0 L
S
GR
GS
[1 0 0 1 280.9375 55.88912] CT
1 0 0 RC
N
f1394637256
f
GR
GS
[1 0 0 1 280.9375 55.88912] CT
1 0 0 RC
10.0 ML
2 LW
N
-3 0 M
3 0 L
S
GR
GS
[1 0 0 1 307.5625 66.79855] CT
1 0 0 RC
N
f1394637256
f
GR
GS
[1 0 0 1 307.5625 66.79855] CT
1 0 0 RC
10.0 ML
2 LW
N
-3 0 M
3 0 L
S
GR
GS
[1 0 0 1 334.1875 32.26014] CT
1 0 0 RC
N
f1394637256
f
GR
GS
[1 0 0 1 334.1875 32.26014] CT
1 0 0 RC
10.0 ML
2 LW
N
-3 0 M
3 0 L
S
GR
%%Trailer
%%Pages: 1
%%EOF
