%!PS-Adobe-3.0 EPSF-3.0
%%Creator: (MATLAB, The Mathworks, Inc. Version 9.8.0.1323502 \(R2020a\). Operating System: Mac OS X)
%%Title: /Users/ddg/Volumes/tardis_mpib.localized/stateswitch/stsw_beh_task/hddm_matched/figures/c1_mediansplit_yaoa_featurespecific.eps
%%CreationDate: 2024-05-07T11:58:29
%%Pages: (atend)
%%BoundingBox:    20     0   348   273
%%LanguageLevel: 3
%%EndComments
%%BeginProlog
%%BeginResource: procset (Apache XML Graphics Std ProcSet) 1.2 0
%%Version: 1.2 0
%%Copyright: (Copyright 2001-2003,2010 The Apache Software Foundation. License terms: http://www.apache.org/licenses/LICENSE-2.0)
/bd{bind def}bind def
/ld{load def}bd
/GR/grestore ld
/GS/gsave ld
/RM/rmoveto ld
/C/curveto ld
/t/show ld
/L/lineto ld
/ML/setmiterlimit ld
/CT/concat ld
/f/fill ld
/N/newpath ld
/S/stroke ld
/CC/setcmykcolor ld
/A/ashow ld
/cp/closepath ld
/RC/setrgbcolor ld
/LJ/setlinejoin ld
/GC/setgray ld
/LW/setlinewidth ld
/M/moveto ld
/re {4 2 roll M
1 index 0 rlineto
0 exch rlineto
neg 0 rlineto
cp } bd
/_ctm matrix def
/_tm matrix def
/BT { _ctm currentmatrix pop matrix _tm copy pop 0 0 moveto } bd
/ET { _ctm setmatrix } bd
/iTm { _ctm setmatrix _tm concat } bd
/Tm { _tm astore pop iTm 0 0 moveto } bd
/ux 0.0 def
/uy 0.0 def
/F {
  /Tp exch def
  /Tf exch def
  Tf findfont Tp scalefont setfont
  /cf Tf def  /cs Tp def
} bd
/ULS {currentpoint /uy exch def /ux exch def} bd
/ULE {
  /Tcx currentpoint pop def
  gsave
  newpath
  cf findfont cs scalefont dup
  /FontMatrix get 0 get /Ts exch def /FontInfo get dup
  /UnderlinePosition get Ts mul /To exch def
  /UnderlineThickness get Ts mul /Tt exch def
  ux uy To add moveto  Tcx uy To add lineto
  Tt setlinewidth stroke
  grestore
} bd
/OLE {
  /Tcx currentpoint pop def
  gsave
  newpath
  cf findfont cs scalefont dup
  /FontMatrix get 0 get /Ts exch def /FontInfo get dup
  /UnderlinePosition get Ts mul /To exch def
  /UnderlineThickness get Ts mul /Tt exch def
  ux uy To add cs add moveto Tcx uy To add cs add lineto
  Tt setlinewidth stroke
  grestore
} bd
/SOE {
  /Tcx currentpoint pop def
  gsave
  newpath
  cf findfont cs scalefont dup
  /FontMatrix get 0 get /Ts exch def /FontInfo get dup
  /UnderlinePosition get Ts mul /To exch def
  /UnderlineThickness get Ts mul /Tt exch def
  ux uy To add cs 10 mul 26 idiv add moveto Tcx uy To add cs 10 mul 26 idiv add lineto
  Tt setlinewidth stroke
  grestore
} bd
/QT {
/Y22 exch store
/X22 exch store
/Y21 exch store
/X21 exch store
currentpoint
/Y21 load 2 mul add 3 div exch
/X21 load 2 mul add 3 div exch
/X21 load 2 mul /X22 load add 3 div
/Y21 load 2 mul /Y22 load add 3 div
/X22 load /Y22 load curveto
} bd
/SSPD {
dup length /d exch dict def
{
/v exch def
/k exch def
currentpagedevice k known {
/cpdv currentpagedevice k get def
v cpdv ne {
/upd false def
/nullv v type /nulltype eq def
/nullcpdv cpdv type /nulltype eq def
nullv nullcpdv or
{
/upd true def
} {
/sametype v type cpdv type eq def
sametype {
v type /arraytype eq {
/vlen v length def
/cpdvlen cpdv length def
vlen cpdvlen eq {
0 1 vlen 1 sub {
/i exch def
/obj v i get def
/cpdobj cpdv i get def
obj cpdobj ne {
/upd true def
exit
} if
} for
} {
/upd true def
} ifelse
} {
v type /dicttype eq {
v {
/dv exch def
/dk exch def
/cpddv cpdv dk get def
dv cpddv ne {
/upd true def
exit
} if
} forall
} {
/upd true def
} ifelse
} ifelse
} if
} ifelse
upd true eq {
d k v put
} if
} if
} if
} forall
d length 0 gt {
d setpagedevice
} if
} bd
/RE { % /NewFontName [NewEncodingArray] /FontName RE -
  findfont dup length dict begin
  {
    1 index /FID ne
    {def} {pop pop} ifelse
  } forall
  /Encoding exch def
  /FontName 1 index def
  currentdict definefont pop
  end
} bind def
%%EndResource
%%BeginResource: procset (Apache XML Graphics EPS ProcSet) 1.0 0
%%Version: 1.0 0
%%Copyright: (Copyright 2002-2003 The Apache Software Foundation. License terms: http://www.apache.org/licenses/LICENSE-2.0)
/BeginEPSF { %def
/b4_Inc_state save def         % Save state for cleanup
/dict_count countdictstack def % Count objects on dict stack
/op_count count 1 sub def      % Count objects on operand stack
userdict begin                 % Push userdict on dict stack
/showpage { } def              % Redefine showpage, { } = null proc
0 setgray 0 setlinecap         % Prepare graphics state
1 setlinewidth 0 setlinejoin
10 setmiterlimit [ ] 0 setdash newpath
/languagelevel where           % If level not equal to 1 then
{pop languagelevel             % set strokeadjust and
1 ne                           % overprint to their defaults.
{false setstrokeadjust false setoverprint
} if
} if
} bd
/EndEPSF { %def
count op_count sub {pop} repeat            % Clean up stacks
countdictstack dict_count sub {end} repeat
b4_Inc_state restore
} bd
%%EndResource
%FOPBeginFontDict
%%IncludeResource: font Courier-Oblique
%%IncludeResource: font Courier-BoldOblique
%%IncludeResource: font Courier-Bold
%%IncludeResource: font ZapfDingbats
%%IncludeResource: font Symbol
%%IncludeResource: font Helvetica
%%IncludeResource: font Helvetica-Oblique
%%IncludeResource: font Helvetica-Bold
%%IncludeResource: font Helvetica-BoldOblique
%%IncludeResource: font Times-Roman
%%IncludeResource: font Times-Italic
%%IncludeResource: font Times-Bold
%%IncludeResource: font Times-BoldItalic
%%IncludeResource: font Courier
%FOPEndFontDict
%%BeginResource: encoding WinAnsiEncoding
/WinAnsiEncoding [
/.notdef /.notdef /.notdef /.notdef /.notdef
/.notdef /.notdef /.notdef /.notdef /.notdef
/.notdef /.notdef /.notdef /.notdef /.notdef
/.notdef /.notdef /.notdef /.notdef /.notdef
/.notdef /.notdef /.notdef /.notdef /.notdef
/.notdef /.notdef /.notdef /.notdef /.notdef
/.notdef /.notdef /space /exclam /quotedbl
/numbersign /dollar /percent /ampersand /quotesingle
/parenleft /parenright /asterisk /plus /comma
/hyphen /period /slash /zero /one
/two /three /four /five /six
/seven /eight /nine /colon /semicolon
/less /equal /greater /question /at
/A /B /C /D /E
/F /G /H /I /J
/K /L /M /N /O
/P /Q /R /S /T
/U /V /W /X /Y
/Z /bracketleft /backslash /bracketright /asciicircum
/underscore /quoteleft /a /b /c
/d /e /f /g /h
/i /j /k /l /m
/n /o /p /q /r
/s /t /u /v /w
/x /y /z /braceleft /bar
/braceright /asciitilde /bullet /Euro /bullet
/quotesinglbase /florin /quotedblbase /ellipsis /dagger
/daggerdbl /circumflex /perthousand /Scaron /guilsinglleft
/OE /bullet /Zcaron /bullet /bullet
/quoteleft /quoteright /quotedblleft /quotedblright /bullet
/endash /emdash /asciitilde /trademark /scaron
/guilsinglright /oe /bullet /zcaron /Ydieresis
/space /exclamdown /cent /sterling /currency
/yen /brokenbar /section /dieresis /copyright
/ordfeminine /guillemotleft /logicalnot /sfthyphen /registered
/macron /degree /plusminus /twosuperior /threesuperior
/acute /mu /paragraph /middot /cedilla
/onesuperior /ordmasculine /guillemotright /onequarter /onehalf
/threequarters /questiondown /Agrave /Aacute /Acircumflex
/Atilde /Adieresis /Aring /AE /Ccedilla
/Egrave /Eacute /Ecircumflex /Edieresis /Igrave
/Iacute /Icircumflex /Idieresis /Eth /Ntilde
/Ograve /Oacute /Ocircumflex /Otilde /Odieresis
/multiply /Oslash /Ugrave /Uacute /Ucircumflex
/Udieresis /Yacute /Thorn /germandbls /agrave
/aacute /acircumflex /atilde /adieresis /aring
/ae /ccedilla /egrave /eacute /ecircumflex
/edieresis /igrave /iacute /icircumflex /idieresis
/eth /ntilde /ograve /oacute /ocircumflex
/otilde /odieresis /divide /oslash /ugrave
/uacute /ucircumflex /udieresis /yacute /thorn
/ydieresis
] def
%%EndResource
%FOPBeginFontReencode
/Courier-Oblique findfont
dup length dict begin
  {1 index /FID ne {def} {pop pop} ifelse} forall
  /Encoding WinAnsiEncoding def
  currentdict
end
/Courier-Oblique exch definefont pop
/Courier-BoldOblique findfont
dup length dict begin
  {1 index /FID ne {def} {pop pop} ifelse} forall
  /Encoding WinAnsiEncoding def
  currentdict
end
/Courier-BoldOblique exch definefont pop
/Courier-Bold findfont
dup length dict begin
  {1 index /FID ne {def} {pop pop} ifelse} forall
  /Encoding WinAnsiEncoding def
  currentdict
end
/Courier-Bold exch definefont pop
/Helvetica findfont
dup length dict begin
  {1 index /FID ne {def} {pop pop} ifelse} forall
  /Encoding WinAnsiEncoding def
  currentdict
end
/Helvetica exch definefont pop
/Helvetica-Oblique findfont
dup length dict begin
  {1 index /FID ne {def} {pop pop} ifelse} forall
  /Encoding WinAnsiEncoding def
  currentdict
end
/Helvetica-Oblique exch definefont pop
/Helvetica-Bold findfont
dup length dict begin
  {1 index /FID ne {def} {pop pop} ifelse} forall
  /Encoding WinAnsiEncoding def
  currentdict
end
/Helvetica-Bold exch definefont pop
/Helvetica-BoldOblique findfont
dup length dict begin
  {1 index /FID ne {def} {pop pop} ifelse} forall
  /Encoding WinAnsiEncoding def
  currentdict
end
/Helvetica-BoldOblique exch definefont pop
/Times-Roman findfont
dup length dict begin
  {1 index /FID ne {def} {pop pop} ifelse} forall
  /Encoding WinAnsiEncoding def
  currentdict
end
/Times-Roman exch definefont pop
/Times-Italic findfont
dup length dict begin
  {1 index /FID ne {def} {pop pop} ifelse} forall
  /Encoding WinAnsiEncoding def
  currentdict
end
/Times-Italic exch definefont pop
/Times-Bold findfont
dup length dict begin
  {1 index /FID ne {def} {pop pop} ifelse} forall
  /Encoding WinAnsiEncoding def
  currentdict
end
/Times-Bold exch definefont pop
/Times-BoldItalic findfont
dup length dict begin
  {1 index /FID ne {def} {pop pop} ifelse} forall
  /Encoding WinAnsiEncoding def
  currentdict
end
/Times-BoldItalic exch definefont pop
/Courier findfont
dup length dict begin
  {1 index /FID ne {def} {pop pop} ifelse} forall
  /Encoding WinAnsiEncoding def
  currentdict
end
/Courier exch definefont pop
%FOPEndFontReencode
%%EndProlog
%%Page: 1 1
%%PageBoundingBox: 0 0 384 288
%%BeginPageSetup
[1 0 0 -1 0 288] CT
%%EndPageSetup
GS
1 GC
N
0 0 384 288 re
f
GR
GS
1 GC
N
0 0 384 288 re
f
GR
GS
1 GC
N
56.5 238.5 M
178.5 238.5 L
178.5 21.5 L
56.5 21.5 L
cp
f
GR
GS
0.149 GC
2 setlinecap
1 LJ
0.5 LW
N
56.5 238.5 M
178.5 238.5 L
S
GR
GS
0.149 GC
2 setlinecap
1 LJ
0.5 LW
N
71.75 238.5 M
71.75 236.33 L
S
GR
GS
0.149 GC
2 setlinecap
1 LJ
0.5 LW
N
102.25 238.5 M
102.25 236.33 L
S
GR
GS
0.149 GC
2 setlinecap
1 LJ
0.5 LW
N
132.75 238.5 M
132.75 236.33 L
S
GR
GS
0.149 GC
2 setlinecap
1 LJ
0.5 LW
N
163.25 238.5 M
163.25 236.33 L
S
GR
GS
[1 0 0 1 71.75 244.10001] CT
0.149 GC
/Helvetica 18 F
GS
[1 0 0 1 0 0] CT
-5.5 18 moveto 
1 -1 scale
(1) t 
GR
GR
GS
[1 0 0 1 102.25 244.10001] CT
0.149 GC
/Helvetica 18 F
GS
[1 0 0 1 0 0] CT
-5.5 18 moveto 
1 -1 scale
(2) t 
GR
GR
GS
[1 0 0 1 132.75 244.10001] CT
0.149 GC
/Helvetica 18 F
GS
[1 0 0 1 0 0] CT
-5.5 18 moveto 
1 -1 scale
(3) t 
GR
GR
GS
[1 0 0 1 163.25 244.10001] CT
0.149 GC
/Helvetica 18 F
GS
[1 0 0 1 0 0] CT
-5.5 18 moveto 
1 -1 scale
(4) t 
GR
GR
GS
[1 0 0 1 117.50006 266.60001] CT
0.149 GC
/Helvetica 18 F
GS
[1 0 0 1 0 0] CT
-67.5 18 moveto 
1 -1 scale
(preferred feature) t 
GR
GR
GS
0.149 GC
2 setlinecap
1 LJ
0.5 LW
N
56.5 238.5 M
56.5 21.5 L
S
GR
GS
0.149 GC
2 setlinecap
1 LJ
0.5 LW
N
56.5 238.5 M
58.67 238.5 L
S
GR
GS
0.149 GC
2 setlinecap
1 LJ
0.5 LW
N
56.5 184.25 M
58.67 184.25 L
S
GR
GS
0.149 GC
2 setlinecap
1 LJ
0.5 LW
N
56.5 130 M
58.67 130 L
S
GR
GS
0.149 GC
2 setlinecap
1 LJ
0.5 LW
N
56.5 75.75 M
58.67 75.75 L
S
GR
GS
0.149 GC
2 setlinecap
1 LJ
0.5 LW
N
56.5 21.5 M
58.67 21.5 L
S
GR
GS
[1 0 0 1 50.9 238.5] CT
0.149 GC
/Helvetica 18 F
GS
[1 0 0 1 0 0] CT
-11 7 moveto 
1 -1 scale
(0) t 
GR
GR
GS
[1 0 0 1 50.9 184.25] CT
0.149 GC
/Helvetica 18 F
GS
[1 0 0 1 0 0] CT
-11 7 moveto 
1 -1 scale
(1) t 
GR
GR
GS
[1 0 0 1 50.9 130] CT
0.149 GC
/Helvetica 18 F
GS
[1 0 0 1 0 0] CT
-11 7 moveto 
1 -1 scale
(2) t 
GR
GR
GS
[1 0 0 1 50.9 75.75] CT
0.149 GC
/Helvetica 18 F
GS
[1 0 0 1 0 0] CT
-11 7 moveto 
1 -1 scale
(3) t 
GR
GR
GS
[1 0 0 1 50.9 21.5] CT
0.149 GC
/Helvetica 18 F
GS
[1 0 0 1 0 0] CT
-11 7 moveto 
1 -1 scale
(4) t 
GR
GR
GS
[0 -1 1 0 37.4 129.99989] CT
0.149 GC
/Helvetica 18 F
GS
[1 0 0 1 0 0] CT
-17 -4 moveto 
1 -1 scale
(Drift) t 
GR
GR
GS
1 LJ
2 LW
N
71.75 52.713 M
71.75 58.488 L
S
GR
GS
1 LJ
2 LW
N
102.25 76.8 M
102.25 84.052 L
S
GR
GS
1 LJ
2 LW
N
132.75 108.59 M
132.75 115.244 L
S
GR
GS
1 LJ
2 LW
N
163.25 154.737 M
163.25 158.35 L
S
GR
GS
1 LJ
2 LW
N
71.75 52.713 M
71.75 46.937 L
S
GR
GS
1 LJ
2 LW
N
102.25 76.8 M
102.25 69.549 L
S
GR
GS
1 LJ
2 LW
N
132.75 108.59 M
132.75 101.936 L
S
GR
GS
1 LJ
2 LW
N
163.25 154.737 M
163.25 151.124 L
S
GR
GS
1 LJ
2 LW
N
71.75 52.713 M
102.25 76.8 L
132.75 108.59 L
163.25 154.737 L
S
GR
GS
[1 0 0 1 71.75 58.48787] CT
N
-3 0 M
3 0 L
f
GR
GS
[1 0 0 1 71.75 58.48787] CT
10.0 ML
2 LW
N
-3 0 M
3 0 L
S
GR
GS
[1 0 0 1 102.25 84.05202] CT
N
/f1394637256{-3 0 M
3 0 L}def
f1394637256
f
GR
GS
[1 0 0 1 102.25 84.05202] CT
10.0 ML
2 LW
N
-3 0 M
3 0 L
S
GR
GS
[1 0 0 1 132.75 115.24437] CT
N
f1394637256
f
GR
GS
[1 0 0 1 132.75 115.24437] CT
10.0 ML
2 LW
N
-3 0 M
3 0 L
S
GR
GS
[1 0 0 1 163.25 158.35004] CT
N
f1394637256
f
GR
GS
[1 0 0 1 163.25 158.35004] CT
10.0 ML
2 LW
N
-3 0 M
3 0 L
S
GR
GS
[1 0 0 1 71.75 46.93715] CT
N
f1394637256
f
GR
GS
[1 0 0 1 71.75 46.93715] CT
10.0 ML
2 LW
N
-3 0 M
3 0 L
S
GR
GS
[1 0 0 1 102.25 69.54858] CT
N
f1394637256
f
GR
GS
[1 0 0 1 102.25 69.54858] CT
10.0 ML
2 LW
N
-3 0 M
3 0 L
S
GR
GS
[1 0 0 1 132.75 101.9359] CT
N
f1394637256
f
GR
GS
[1 0 0 1 132.75 101.9359] CT
10.0 ML
2 LW
N
-3 0 M
3 0 L
S
GR
GS
[1 0 0 1 163.25 151.12424] CT
N
f1394637256
f
GR
GS
[1 0 0 1 163.25 151.12424] CT
10.0 ML
2 LW
N
-3 0 M
3 0 L
S
GR
GS
1 LJ
2 LW
N
71.75 90.108 M
71.75 99.685 L
S
GR
GS
1 LJ
2 LW
N
102.25 114.723 M
102.25 122.819 L
S
GR
GS
1 LJ
2 LW
N
132.75 149.494 M
132.75 157.218 L
S
GR
GS
1 LJ
2 LW
N
163.25 186.342 M
163.25 193.555 L
S
GR
GS
1 LJ
2 LW
N
71.75 90.108 M
71.75 80.53 L
S
GR
GS
1 LJ
2 LW
N
102.25 114.723 M
102.25 106.627 L
S
GR
GS
1 LJ
2 LW
N
132.75 149.494 M
132.75 141.77 L
S
GR
GS
1 LJ
2 LW
N
163.25 186.342 M
163.25 179.13 L
S
GR
GS
[8 8] 0 setdash
2 LJ
2 LW
N
71.75 90.108 M
102.25 114.723 L
132.75 149.494 L
163.25 186.342 L
S
GR
GS
[1 0 0 1 71.75 99.68549] CT
N
f1394637256
f
GR
GS
[1 0 0 1 71.75 99.68549] CT
10.0 ML
2 LW
N
-3 0 M
3 0 L
S
GR
GS
[1 0 0 1 102.25 122.81922] CT
N
f1394637256
f
GR
GS
[1 0 0 1 102.25 122.81922] CT
10.0 ML
2 LW
N
-3 0 M
3 0 L
S
GR
GS
[1 0 0 1 132.75 157.2179] CT
N
f1394637256
f
GR
GS
[1 0 0 1 132.75 157.2179] CT
10.0 ML
2 LW
N
-3 0 M
3 0 L
S
GR
GS
[1 0 0 1 163.25 193.5545] CT
N
f1394637256
f
GR
GS
[1 0 0 1 163.25 193.5545] CT
10.0 ML
2 LW
N
-3 0 M
3 0 L
S
GR
GS
[1 0 0 1 71.75 80.52969] CT
N
f1394637256
f
GR
GS
[1 0 0 1 71.75 80.52969] CT
10.0 ML
2 LW
N
-3 0 M
3 0 L
S
GR
GS
[1 0 0 1 102.25 106.62671] CT
N
f1394637256
f
GR
GS
[1 0 0 1 102.25 106.62671] CT
10.0 ML
2 LW
N
-3 0 M
3 0 L
S
GR
GS
[1 0 0 1 132.75 141.7695] CT
N
f1394637256
f
GR
GS
[1 0 0 1 132.75 141.7695] CT
10.0 ML
2 LW
N
-3 0 M
3 0 L
S
GR
GS
[1 0 0 1 163.25 179.12961] CT
N
f1394637256
f
GR
GS
[1 0 0 1 163.25 179.12961] CT
10.0 ML
2 LW
N
-3 0 M
3 0 L
S
GR
GS
1 0 0 RC
1 LJ
2 LW
N
71.75 119.873 M
71.75 124.063 L
S
GR
GS
1 0 0 RC
1 LJ
2 LW
N
102.25 151.106 M
102.25 156.394 L
S
GR
GS
1 0 0 RC
1 LJ
2 LW
N
132.75 176.128 M
132.75 181.066 L
S
GR
GS
1 0 0 RC
1 LJ
2 LW
N
163.25 213.442 M
163.25 217.768 L
S
GR
GS
1 0 0 RC
1 LJ
2 LW
N
71.75 119.873 M
71.75 115.682 L
S
GR
GS
1 0 0 RC
1 LJ
2 LW
N
102.25 151.106 M
102.25 145.818 L
S
GR
GS
1 0 0 RC
1 LJ
2 LW
N
132.75 176.128 M
132.75 171.19 L
S
GR
GS
1 0 0 RC
1 LJ
2 LW
N
163.25 213.442 M
163.25 209.117 L
S
GR
GS
1 0 0 RC
1 LJ
2 LW
N
71.75 119.873 M
102.25 151.106 L
132.75 176.128 L
163.25 213.442 L
S
GR
GS
[1 0 0 1 71.75 124.06304] CT
1 0 0 RC
N
f1394637256
f
GR
GS
[1 0 0 1 71.75 124.06304] CT
1 0 0 RC
10.0 ML
2 LW
N
-3 0 M
3 0 L
S
GR
GS
[1 0 0 1 102.25 156.39444] CT
1 0 0 RC
N
f1394637256
f
GR
GS
[1 0 0 1 102.25 156.39444] CT
1 0 0 RC
10.0 ML
2 LW
N
-3 0 M
3 0 L
S
GR
GS
[1 0 0 1 132.75 181.06595] CT
1 0 0 RC
N
f1394637256
f
GR
GS
[1 0 0 1 132.75 181.06595] CT
1 0 0 RC
10.0 ML
2 LW
N
-3 0 M
3 0 L
S
GR
GS
[1 0 0 1 163.25 217.76781] CT
1 0 0 RC
N
f1394637256
f
GR
GS
[1 0 0 1 163.25 217.76781] CT
1 0 0 RC
10.0 ML
2 LW
N
-3 0 M
3 0 L
S
GR
GS
[1 0 0 1 71.75 115.6824] CT
1 0 0 RC
N
f1394637256
f
GR
GS
[1 0 0 1 71.75 115.6824] CT
1 0 0 RC
10.0 ML
2 LW
N
-3 0 M
3 0 L
S
GR
GS
[1 0 0 1 102.25 145.81804] CT
1 0 0 RC
N
f1394637256
f
GR
GS
[1 0 0 1 102.25 145.81804] CT
1 0 0 RC
10.0 ML
2 LW
N
-3 0 M
3 0 L
S
GR
GS
[1 0 0 1 132.75 171.19002] CT
1 0 0 RC
N
f1394637256
f
GR
GS
[1 0 0 1 132.75 171.19002] CT
1 0 0 RC
10.0 ML
2 LW
N
-3 0 M
3 0 L
S
GR
GS
[1 0 0 1 163.25 209.11694] CT
1 0 0 RC
N
f1394637256
f
GR
GS
[1 0 0 1 163.25 209.11694] CT
1 0 0 RC
10.0 ML
2 LW
N
-3 0 M
3 0 L
S
GR
GS
1 0 0 RC
1 LJ
2 LW
N
71.75 147.966 M
71.75 156.906 L
S
GR
GS
1 0 0 RC
1 LJ
2 LW
N
102.25 184.161 M
102.25 190.315 L
S
GR
GS
1 0 0 RC
1 LJ
2 LW
N
132.75 208.158 M
132.75 211.841 L
S
GR
GS
1 0 0 RC
1 LJ
2 LW
N
163.25 234.515 M
163.25 237.374 L
S
GR
GS
1 0 0 RC
1 LJ
2 LW
N
71.75 147.966 M
71.75 139.025 L
S
GR
GS
1 0 0 RC
1 LJ
2 LW
N
102.25 184.161 M
102.25 178.008 L
S
GR
GS
1 0 0 RC
1 LJ
2 LW
N
132.75 208.158 M
132.75 204.475 L
S
GR
GS
1 0 0 RC
1 LJ
2 LW
N
163.25 234.515 M
163.25 231.656 L
S
GR
GS
1 0 0 RC
[8 8] 0 setdash
2 LJ
2 LW
N
71.75 147.966 M
102.25 184.161 L
132.75 208.158 L
163.25 234.515 L
S
GR
GS
[1 0 0 1 71.75 156.90639] CT
1 0 0 RC
N
f1394637256
f
GR
GS
[1 0 0 1 71.75 156.90639] CT
1 0 0 RC
10.0 ML
2 LW
N
-3 0 M
3 0 L
S
GR
GS
[1 0 0 1 102.25 190.31496] CT
1 0 0 RC
N
f1394637256
f
GR
GS
[1 0 0 1 102.25 190.31496] CT
1 0 0 RC
10.0 ML
2 LW
N
-3 0 M
3 0 L
S
GR
GS
[1 0 0 1 132.75 211.84079] CT
1 0 0 RC
N
f1394637256
f
GR
GS
[1 0 0 1 132.75 211.84079] CT
1 0 0 RC
10.0 ML
2 LW
N
-3 0 M
3 0 L
S
GR
GS
[1 0 0 1 163.25 237.37369] CT
1 0 0 RC
N
f1394637256
f
GR
GS
[1 0 0 1 163.25 237.37369] CT
1 0 0 RC
10.0 ML
2 LW
N
-3 0 M
3 0 L
S
GR
GS
[1 0 0 1 71.75 139.02501] CT
1 0 0 RC
N
f1394637256
f
GR
GS
[1 0 0 1 71.75 139.02501] CT
1 0 0 RC
10.0 ML
2 LW
N
-3 0 M
3 0 L
S
GR
GS
[1 0 0 1 102.25 178.00797] CT
1 0 0 RC
N
f1394637256
f
GR
GS
[1 0 0 1 102.25 178.00797] CT
1 0 0 RC
10.0 ML
2 LW
N
-3 0 M
3 0 L
S
GR
GS
[1 0 0 1 132.75 204.47498] CT
1 0 0 RC
N
f1394637256
f
GR
GS
[1 0 0 1 132.75 204.47498] CT
1 0 0 RC
10.0 ML
2 LW
N
-3 0 M
3 0 L
S
GR
GS
[1 0 0 1 163.25 231.65637] CT
1 0 0 RC
N
f1394637256
f
GR
GS
[1 0 0 1 163.25 231.65637] CT
1 0 0 RC
10.0 ML
2 LW
N
-3 0 M
3 0 L
S
GR
GS
1 GC
N
/f682546578{226 238.5 M
347.5 238.5 L
347.5 21.5 L
226 21.5 L
cp}def
f682546578
f
GR
GS
0.149 GC
2 setlinecap
1 LJ
0.5 LW
N
226 238.5 M
347.5 238.5 L
S
GR
GS
0.149 GC
2 setlinecap
1 LJ
0.5 LW
N
241.188 238.5 M
241.188 236.33 L
S
GR
GS
0.149 GC
2 setlinecap
1 LJ
0.5 LW
N
271.563 238.5 M
271.563 236.33 L
S
GR
GS
0.149 GC
2 setlinecap
1 LJ
0.5 LW
N
301.938 238.5 M
301.938 236.33 L
S
GR
GS
0.149 GC
2 setlinecap
1 LJ
0.5 LW
N
332.313 238.5 M
332.313 236.33 L
S
GR
GS
[1 0 0 1 241.1875 244.10001] CT
0.149 GC
/Helvetica 18 F
GS
[1 0 0 1 0 0] CT
-5.5 18 moveto 
1 -1 scale
(1) t 
GR
GR
GS
[1 0 0 1 271.5625 244.10001] CT
0.149 GC
/Helvetica 18 F
GS
[1 0 0 1 0 0] CT
-5.5 18 moveto 
1 -1 scale
(2) t 
GR
GR
GS
[1 0 0 1 301.9375 244.10001] CT
0.149 GC
/Helvetica 18 F
GS
[1 0 0 1 0 0] CT
-5.5 18 moveto 
1 -1 scale
(3) t 
GR
GR
GS
[1 0 0 1 332.3125 244.10001] CT
0.149 GC
/Helvetica 18 F
GS
[1 0 0 1 0 0] CT
-5.5 18 moveto 
1 -1 scale
(4) t 
GR
GR
GS
[1 0 0 1 286.75006 266.60001] CT
0.149 GC
/Helvetica 18 F
GS
[1 0 0 1 0 0] CT
-28 18 moveto 
1 -1 scale
(feature) t 
GR
GR
GS
0.149 GC
2 setlinecap
1 LJ
0.5 LW
N
226 238.5 M
226 21.5 L
S
GR
GS
0.149 GC
2 setlinecap
1 LJ
0.5 LW
N
226 238.5 M
228.17 238.5 L
S
GR
GS
0.149 GC
2 setlinecap
1 LJ
0.5 LW
N
226 184.25 M
228.17 184.25 L
S
GR
GS
0.149 GC
2 setlinecap
1 LJ
0.5 LW
N
226 130 M
228.17 130 L
S
GR
GS
0.149 GC
2 setlinecap
1 LJ
0.5 LW
N
226 75.75 M
228.17 75.75 L
S
GR
GS
0.149 GC
2 setlinecap
1 LJ
0.5 LW
N
226 21.5 M
228.17 21.5 L
S
GR
GS
[1 0 0 1 220.39999 238.5] CT
0.149 GC
/Helvetica 18 F
GS
[1 0 0 1 0 0] CT
-11 7 moveto 
1 -1 scale
(0) t 
GR
GR
GS
[1 0 0 1 220.39999 184.25] CT
0.149 GC
/Helvetica 18 F
GS
[1 0 0 1 0 0] CT
-11 7 moveto 
1 -1 scale
(1) t 
GR
GR
GS
[1 0 0 1 220.39999 130] CT
0.149 GC
/Helvetica 18 F
GS
[1 0 0 1 0 0] CT
-11 7 moveto 
1 -1 scale
(2) t 
GR
GR
GS
[1 0 0 1 220.39999 75.75] CT
0.149 GC
/Helvetica 18 F
GS
[1 0 0 1 0 0] CT
-11 7 moveto 
1 -1 scale
(3) t 
GR
GR
GS
[1 0 0 1 220.39999 21.5] CT
0.149 GC
/Helvetica 18 F
GS
[1 0 0 1 0 0] CT
-11 7 moveto 
1 -1 scale
(4) t 
GR
GR
GS
[0 -1 1 0 206.89999 129.99989] CT
0.149 GC
/Helvetica 18 F
GS
[1 0 0 1 0 0] CT
-17 -4 moveto 
1 -1 scale
(Drift) t 
GR
GR
GS
1 LJ
2 LW
N
241.188 59.077 M
241.188 66.886 L
S
GR
GS
1 LJ
2 LW
N
271.563 73.672 M
271.563 81.624 L
S
GR
GS
1 LJ
2 LW
N
301.938 113.754 M
301.938 122.447 L
S
GR
GS
1 LJ
2 LW
N
332.313 146.337 M
332.313 151.922 L
S
GR
GS
1 LJ
2 LW
N
241.188 59.077 M
241.188 51.269 L
S
GR
GS
1 LJ
2 LW
N
271.563 73.672 M
271.563 65.719 L
S
GR
GS
1 LJ
2 LW
N
301.938 113.754 M
301.938 105.061 L
S
GR
GS
1 LJ
2 LW
N
332.313 146.337 M
332.313 140.752 L
S
GR
GS
1 LJ
2 LW
N
241.188 59.077 M
271.563 73.672 L
301.938 113.754 L
332.313 146.337 L
S
GR
GS
[1 0 0 1 241.1875 66.88568] CT
N
f1394637256
f
GR
GS
[1 0 0 1 241.1875 66.88568] CT
10.0 ML
2 LW
N
-3 0 M
3 0 L
S
GR
GS
[1 0 0 1 271.5625 81.62448] CT
N
f1394637256
f
GR
GS
[1 0 0 1 271.5625 81.62448] CT
10.0 ML
2 LW
N
-3 0 M
3 0 L
S
GR
GS
[1 0 0 1 301.9375 122.44688] CT
N
f1394637256
f
GR
GS
[1 0 0 1 301.9375 122.44688] CT
10.0 ML
2 LW
N
-3 0 M
3 0 L
S
GR
GS
[1 0 0 1 332.3125 151.92209] CT
N
f1394637256
f
GR
GS
[1 0 0 1 332.3125 151.92209] CT
10.0 ML
2 LW
N
-3 0 M
3 0 L
S
GR
GS
[1 0 0 1 241.1875 51.26891] CT
N
f1394637256
f
GR
GS
[1 0 0 1 241.1875 51.26891] CT
10.0 ML
2 LW
N
-3 0 M
3 0 L
S
GR
GS
[1 0 0 1 271.5625 65.71891] CT
N
f1394637256
f
GR
GS
[1 0 0 1 271.5625 65.71891] CT
10.0 ML
2 LW
N
-3 0 M
3 0 L
S
GR
GS
[1 0 0 1 301.9375 105.06102] CT
N
f1394637256
f
GR
GS
[1 0 0 1 301.9375 105.06102] CT
10.0 ML
2 LW
N
-3 0 M
3 0 L
S
GR
GS
[1 0 0 1 332.3125 140.75218] CT
N
f1394637256
f
GR
GS
[1 0 0 1 332.3125 140.75218] CT
10.0 ML
2 LW
N
-3 0 M
3 0 L
S
GR
GS
1 LJ
2 LW
N
241.188 95.334 M
241.188 105.858 L
S
GR
GS
1 LJ
2 LW
N
271.563 125.314 M
271.563 137.364 L
S
GR
GS
1 LJ
2 LW
N
301.938 137.88 M
301.938 145.223 L
S
GR
GS
1 LJ
2 LW
N
332.313 182.138 M
332.313 190.192 L
S
GR
GS
1 LJ
2 LW
N
241.188 95.334 M
241.188 84.81 L
S
GR
GS
1 LJ
2 LW
N
271.563 125.314 M
271.563 113.264 L
S
GR
GS
1 LJ
2 LW
N
301.938 137.88 M
301.938 130.536 L
S
GR
GS
1 LJ
2 LW
N
332.313 182.138 M
332.313 174.085 L
S
GR
GS
[8 8] 0 setdash
2 LJ
2 LW
N
241.188 95.334 M
271.563 125.314 L
301.938 137.88 L
332.313 182.138 L
S
GR
GS
[1 0 0 1 241.1875 105.85825] CT
N
f1394637256
f
GR
GS
[1 0 0 1 241.1875 105.85825] CT
10.0 ML
2 LW
N
-3 0 M
3 0 L
S
GR
GS
[1 0 0 1 271.5625 137.36414] CT
N
f1394637256
f
GR
GS
[1 0 0 1 271.5625 137.36414] CT
10.0 ML
2 LW
N
-3 0 M
3 0 L
S
GR
GS
[1 0 0 1 301.9375 145.22321] CT
N
f1394637256
f
GR
GS
[1 0 0 1 301.9375 145.22321] CT
10.0 ML
2 LW
N
-3 0 M
3 0 L
S
GR
GS
[1 0 0 1 332.3125 190.19162] CT
N
f1394637256
f
GR
GS
[1 0 0 1 332.3125 190.19162] CT
10.0 ML
2 LW
N
-3 0 M
3 0 L
S
GR
GS
[1 0 0 1 241.1875 84.81041] CT
N
f1394637256
f
GR
GS
[1 0 0 1 241.1875 84.81041] CT
10.0 ML
2 LW
N
-3 0 M
3 0 L
S
GR
GS
[1 0 0 1 271.5625 113.26385] CT
N
f1394637256
f
GR
GS
[1 0 0 1 271.5625 113.26385] CT
10.0 ML
2 LW
N
-3 0 M
3 0 L
S
GR
GS
[1 0 0 1 301.9375 130.53601] CT
N
f1394637256
f
GR
GS
[1 0 0 1 301.9375 130.53601] CT
10.0 ML
2 LW
N
-3 0 M
3 0 L
S
GR
GS
[1 0 0 1 332.3125 174.08516] CT
N
f1394637256
f
GR
GS
[1 0 0 1 332.3125 174.08516] CT
10.0 ML
2 LW
N
-3 0 M
3 0 L
S
GR
GS
1 0 0 RC
1 LJ
2 LW
N
241.188 131.836 M
241.188 139.133 L
S
GR
GS
1 0 0 RC
1 LJ
2 LW
N
271.563 144.892 M
271.563 151.765 L
S
GR
GS
1 0 0 RC
1 LJ
2 LW
N
301.938 172.756 M
301.938 177.795 L
S
GR
GS
1 0 0 RC
1 LJ
2 LW
N
332.313 211.065 M
332.313 216.174 L
S
GR
GS
1 0 0 RC
1 LJ
2 LW
N
241.188 131.836 M
241.188 124.539 L
S
GR
GS
1 0 0 RC
1 LJ
2 LW
N
271.563 144.892 M
271.563 138.019 L
S
GR
GS
1 0 0 RC
1 LJ
2 LW
N
301.938 172.756 M
301.938 167.717 L
S
GR
GS
1 0 0 RC
1 LJ
2 LW
N
332.313 211.065 M
332.313 205.956 L
S
GR
GS
1 0 0 RC
1 LJ
2 LW
N
241.188 131.836 M
271.563 144.892 L
301.938 172.756 L
332.313 211.065 L
S
GR
GS
[1 0 0 1 241.1875 139.13338] CT
1 0 0 RC
N
f1394637256
f
GR
GS
[1 0 0 1 241.1875 139.13338] CT
1 0 0 RC
10.0 ML
2 LW
N
-3 0 M
3 0 L
S
GR
GS
[1 0 0 1 271.5625 151.76495] CT
1 0 0 RC
N
f1394637256
f
GR
GS
[1 0 0 1 271.5625 151.76495] CT
1 0 0 RC
10.0 ML
2 LW
N
-3 0 M
3 0 L
S
GR
GS
[1 0 0 1 301.9375 177.79494] CT
1 0 0 RC
N
f1394637256
f
GR
GS
[1 0 0 1 301.9375 177.79494] CT
1 0 0 RC
10.0 ML
2 LW
N
-3 0 M
3 0 L
S
GR
GS
[1 0 0 1 332.3125 216.17363] CT
1 0 0 RC
N
f1394637256
f
GR
GS
[1 0 0 1 332.3125 216.17363] CT
1 0 0 RC
10.0 ML
2 LW
N
-3 0 M
3 0 L
S
GR
GS
[1 0 0 1 241.1875 124.53928] CT
1 0 0 RC
N
f1394637256
f
GR
GS
[1 0 0 1 241.1875 124.53928] CT
1 0 0 RC
10.0 ML
2 LW
N
-3 0 M
3 0 L
S
GR
GS
[1 0 0 1 271.5625 138.01901] CT
1 0 0 RC
N
f1394637256
f
GR
GS
[1 0 0 1 271.5625 138.01901] CT
1 0 0 RC
10.0 ML
2 LW
N
-3 0 M
3 0 L
S
GR
GS
[1 0 0 1 301.9375 167.71727] CT
1 0 0 RC
N
f1394637256
f
GR
GS
[1 0 0 1 301.9375 167.71727] CT
1 0 0 RC
10.0 ML
2 LW
N
-3 0 M
3 0 L
S
GR
GS
[1 0 0 1 332.3125 205.95618] CT
1 0 0 RC
N
f1394637256
f
GR
GS
[1 0 0 1 332.3125 205.95618] CT
1 0 0 RC
10.0 ML
2 LW
N
-3 0 M
3 0 L
S
GR
GS
1 0 0 RC
1 LJ
2 LW
N
241.188 154.848 M
241.188 164.325 L
S
GR
GS
1 0 0 RC
1 LJ
2 LW
N
271.563 184.494 M
271.563 192.578 L
S
GR
GS
1 0 0 RC
1 LJ
2 LW
N
301.938 205.068 M
301.938 210.068 L
S
GR
GS
1 0 0 RC
1 LJ
2 LW
N
332.313 230.389 M
332.313 234.166 L
S
GR
GS
1 0 0 RC
1 LJ
2 LW
N
241.188 154.848 M
241.188 145.371 L
S
GR
GS
1 0 0 RC
1 LJ
2 LW
N
271.563 184.494 M
271.563 176.411 L
S
GR
GS
1 0 0 RC
1 LJ
2 LW
N
301.938 205.068 M
301.938 200.068 L
S
GR
GS
1 0 0 RC
1 LJ
2 LW
N
332.313 230.389 M
332.313 226.613 L
S
GR
GS
1 0 0 RC
[8 8] 0 setdash
2 LJ
2 LW
N
241.188 154.848 M
271.563 184.494 L
301.938 205.068 L
332.313 230.389 L
S
GR
GS
[1 0 0 1 241.1875 164.32523] CT
1 0 0 RC
N
f1394637256
f
GR
GS
[1 0 0 1 241.1875 164.32523] CT
1 0 0 RC
10.0 ML
2 LW
N
-3 0 M
3 0 L
S
GR
GS
[1 0 0 1 271.5625 192.57787] CT
1 0 0 RC
N
f1394637256
f
GR
GS
[1 0 0 1 271.5625 192.57787] CT
1 0 0 RC
10.0 ML
2 LW
N
-3 0 M
3 0 L
S
GR
GS
[1 0 0 1 301.9375 210.0685] CT
1 0 0 RC
N
f1394637256
f
GR
GS
[1 0 0 1 301.9375 210.0685] CT
1 0 0 RC
10.0 ML
2 LW
N
-3 0 M
3 0 L
S
GR
GS
[1 0 0 1 332.3125 234.16585] CT
1 0 0 RC
N
f1394637256
f
GR
GS
[1 0 0 1 332.3125 234.16585] CT
1 0 0 RC
10.0 ML
2 LW
N
-3 0 M
3 0 L
S
GR
GS
[1 0 0 1 241.1875 145.37111] CT
1 0 0 RC
N
f1394637256
f
GR
GS
[1 0 0 1 241.1875 145.37111] CT
1 0 0 RC
10.0 ML
2 LW
N
-3 0 M
3 0 L
S
GR
GS
[1 0 0 1 271.5625 176.41081] CT
1 0 0 RC
N
f1394637256
f
GR
GS
[1 0 0 1 271.5625 176.41081] CT
1 0 0 RC
10.0 ML
2 LW
N
-3 0 M
3 0 L
S
GR
GS
[1 0 0 1 301.9375 200.06767] CT
1 0 0 RC
N
f1394637256
f
GR
GS
[1 0 0 1 301.9375 200.06767] CT
1 0 0 RC
10.0 ML
2 LW
N
-3 0 M
3 0 L
S
GR
GS
[1 0 0 1 332.3125 226.61313] CT
1 0 0 RC
N
f1394637256
f
GR
GS
[1 0 0 1 332.3125 226.61313] CT
1 0 0 RC
10.0 ML
2 LW
N
-3 0 M
3 0 L
S
GR
%%Trailer
%%Pages: 1
%%EOF
