%!PS-Adobe-3.0 EPSF-3.0
%%Creator: (MATLAB, The Mathworks, Inc. Version 9.8.0.1323502 \(R2020a\). Operating System: Mac OS X)
%%Title: /Users/ddg/Volumes/tardis_mpib.localized/stateswitch/stsw_beh_task/hddm_matched/figures/c1_matcheddrift_linchange.eps
%%CreationDate: 2024-05-07T12:13:31
%%Pages: (atend)
%%BoundingBox:     4     3   180   219
%%LanguageLevel: 3
%%EndComments
%%BeginProlog
%%BeginResource: procset (Apache XML Graphics Std ProcSet) 1.2 0
%%Version: 1.2 0
%%Copyright: (Copyright 2001-2003,2010 The Apache Software Foundation. License terms: http://www.apache.org/licenses/LICENSE-2.0)
/bd{bind def}bind def
/ld{load def}bd
/GR/grestore ld
/GS/gsave ld
/RM/rmoveto ld
/C/curveto ld
/t/show ld
/L/lineto ld
/ML/setmiterlimit ld
/CT/concat ld
/f/fill ld
/N/newpath ld
/S/stroke ld
/CC/setcmykcolor ld
/A/ashow ld
/cp/closepath ld
/RC/setrgbcolor ld
/LJ/setlinejoin ld
/GC/setgray ld
/LW/setlinewidth ld
/M/moveto ld
/re {4 2 roll M
1 index 0 rlineto
0 exch rlineto
neg 0 rlineto
cp } bd
/_ctm matrix def
/_tm matrix def
/BT { _ctm currentmatrix pop matrix _tm copy pop 0 0 moveto } bd
/ET { _ctm setmatrix } bd
/iTm { _ctm setmatrix _tm concat } bd
/Tm { _tm astore pop iTm 0 0 moveto } bd
/ux 0.0 def
/uy 0.0 def
/F {
  /Tp exch def
  /Tf exch def
  Tf findfont Tp scalefont setfont
  /cf Tf def  /cs Tp def
} bd
/ULS {currentpoint /uy exch def /ux exch def} bd
/ULE {
  /Tcx currentpoint pop def
  gsave
  newpath
  cf findfont cs scalefont dup
  /FontMatrix get 0 get /Ts exch def /FontInfo get dup
  /UnderlinePosition get Ts mul /To exch def
  /UnderlineThickness get Ts mul /Tt exch def
  ux uy To add moveto  Tcx uy To add lineto
  Tt setlinewidth stroke
  grestore
} bd
/OLE {
  /Tcx currentpoint pop def
  gsave
  newpath
  cf findfont cs scalefont dup
  /FontMatrix get 0 get /Ts exch def /FontInfo get dup
  /UnderlinePosition get Ts mul /To exch def
  /UnderlineThickness get Ts mul /Tt exch def
  ux uy To add cs add moveto Tcx uy To add cs add lineto
  Tt setlinewidth stroke
  grestore
} bd
/SOE {
  /Tcx currentpoint pop def
  gsave
  newpath
  cf findfont cs scalefont dup
  /FontMatrix get 0 get /Ts exch def /FontInfo get dup
  /UnderlinePosition get Ts mul /To exch def
  /UnderlineThickness get Ts mul /Tt exch def
  ux uy To add cs 10 mul 26 idiv add moveto Tcx uy To add cs 10 mul 26 idiv add lineto
  Tt setlinewidth stroke
  grestore
} bd
/QT {
/Y22 exch store
/X22 exch store
/Y21 exch store
/X21 exch store
currentpoint
/Y21 load 2 mul add 3 div exch
/X21 load 2 mul add 3 div exch
/X21 load 2 mul /X22 load add 3 div
/Y21 load 2 mul /Y22 load add 3 div
/X22 load /Y22 load curveto
} bd
/SSPD {
dup length /d exch dict def
{
/v exch def
/k exch def
currentpagedevice k known {
/cpdv currentpagedevice k get def
v cpdv ne {
/upd false def
/nullv v type /nulltype eq def
/nullcpdv cpdv type /nulltype eq def
nullv nullcpdv or
{
/upd true def
} {
/sametype v type cpdv type eq def
sametype {
v type /arraytype eq {
/vlen v length def
/cpdvlen cpdv length def
vlen cpdvlen eq {
0 1 vlen 1 sub {
/i exch def
/obj v i get def
/cpdobj cpdv i get def
obj cpdobj ne {
/upd true def
exit
} if
} for
} {
/upd true def
} ifelse
} {
v type /dicttype eq {
v {
/dv exch def
/dk exch def
/cpddv cpdv dk get def
dv cpddv ne {
/upd true def
exit
} if
} forall
} {
/upd true def
} ifelse
} ifelse
} if
} ifelse
upd true eq {
d k v put
} if
} if
} if
} forall
d length 0 gt {
d setpagedevice
} if
} bd
/RE { % /NewFontName [NewEncodingArray] /FontName RE -
  findfont dup length dict begin
  {
    1 index /FID ne
    {def} {pop pop} ifelse
  } forall
  /Encoding exch def
  /FontName 1 index def
  currentdict definefont pop
  end
} bind def
%%EndResource
%%BeginResource: procset (Apache XML Graphics EPS ProcSet) 1.0 0
%%Version: 1.0 0
%%Copyright: (Copyright 2002-2003 The Apache Software Foundation. License terms: http://www.apache.org/licenses/LICENSE-2.0)
/BeginEPSF { %def
/b4_Inc_state save def         % Save state for cleanup
/dict_count countdictstack def % Count objects on dict stack
/op_count count 1 sub def      % Count objects on operand stack
userdict begin                 % Push userdict on dict stack
/showpage { } def              % Redefine showpage, { } = null proc
0 setgray 0 setlinecap         % Prepare graphics state
1 setlinewidth 0 setlinejoin
10 setmiterlimit [ ] 0 setdash newpath
/languagelevel where           % If level not equal to 1 then
{pop languagelevel             % set strokeadjust and
1 ne                           % overprint to their defaults.
{false setstrokeadjust false setoverprint
} if
} if
} bd
/EndEPSF { %def
count op_count sub {pop} repeat            % Clean up stacks
countdictstack dict_count sub {end} repeat
b4_Inc_state restore
} bd
%%EndResource
%FOPBeginFontDict
%%IncludeResource: font Courier-Oblique
%%IncludeResource: font Courier-BoldOblique
%%IncludeResource: font Courier-Bold
%%IncludeResource: font ZapfDingbats
%%IncludeResource: font Symbol
%%IncludeResource: font Helvetica
%%IncludeResource: font Helvetica-Oblique
%%IncludeResource: font Helvetica-Bold
%%IncludeResource: font Helvetica-BoldOblique
%%IncludeResource: font Times-Roman
%%IncludeResource: font Times-Italic
%%IncludeResource: font Times-Bold
%%IncludeResource: font Times-BoldItalic
%%IncludeResource: font Courier
%FOPEndFontDict
%%BeginResource: encoding WinAnsiEncoding
/WinAnsiEncoding [
/.notdef /.notdef /.notdef /.notdef /.notdef
/.notdef /.notdef /.notdef /.notdef /.notdef
/.notdef /.notdef /.notdef /.notdef /.notdef
/.notdef /.notdef /.notdef /.notdef /.notdef
/.notdef /.notdef /.notdef /.notdef /.notdef
/.notdef /.notdef /.notdef /.notdef /.notdef
/.notdef /.notdef /space /exclam /quotedbl
/numbersign /dollar /percent /ampersand /quotesingle
/parenleft /parenright /asterisk /plus /comma
/hyphen /period /slash /zero /one
/two /three /four /five /six
/seven /eight /nine /colon /semicolon
/less /equal /greater /question /at
/A /B /C /D /E
/F /G /H /I /J
/K /L /M /N /O
/P /Q /R /S /T
/U /V /W /X /Y
/Z /bracketleft /backslash /bracketright /asciicircum
/underscore /quoteleft /a /b /c
/d /e /f /g /h
/i /j /k /l /m
/n /o /p /q /r
/s /t /u /v /w
/x /y /z /braceleft /bar
/braceright /asciitilde /bullet /Euro /bullet
/quotesinglbase /florin /quotedblbase /ellipsis /dagger
/daggerdbl /circumflex /perthousand /Scaron /guilsinglleft
/OE /bullet /Zcaron /bullet /bullet
/quoteleft /quoteright /quotedblleft /quotedblright /bullet
/endash /emdash /asciitilde /trademark /scaron
/guilsinglright /oe /bullet /zcaron /Ydieresis
/space /exclamdown /cent /sterling /currency
/yen /brokenbar /section /dieresis /copyright
/ordfeminine /guillemotleft /logicalnot /sfthyphen /registered
/macron /degree /plusminus /twosuperior /threesuperior
/acute /mu /paragraph /middot /cedilla
/onesuperior /ordmasculine /guillemotright /onequarter /onehalf
/threequarters /questiondown /Agrave /Aacute /Acircumflex
/Atilde /Adieresis /Aring /AE /Ccedilla
/Egrave /Eacute /Ecircumflex /Edieresis /Igrave
/Iacute /Icircumflex /Idieresis /Eth /Ntilde
/Ograve /Oacute /Ocircumflex /Otilde /Odieresis
/multiply /Oslash /Ugrave /Uacute /Ucircumflex
/Udieresis /Yacute /Thorn /germandbls /agrave
/aacute /acircumflex /atilde /adieresis /aring
/ae /ccedilla /egrave /eacute /ecircumflex
/edieresis /igrave /iacute /icircumflex /idieresis
/eth /ntilde /ograve /oacute /ocircumflex
/otilde /odieresis /divide /oslash /ugrave
/uacute /ucircumflex /udieresis /yacute /thorn
/ydieresis
] def
%%EndResource
%FOPBeginFontReencode
/Courier-Oblique findfont
dup length dict begin
  {1 index /FID ne {def} {pop pop} ifelse} forall
  /Encoding WinAnsiEncoding def
  currentdict
end
/Courier-Oblique exch definefont pop
/Courier-BoldOblique findfont
dup length dict begin
  {1 index /FID ne {def} {pop pop} ifelse} forall
  /Encoding WinAnsiEncoding def
  currentdict
end
/Courier-BoldOblique exch definefont pop
/Courier-Bold findfont
dup length dict begin
  {1 index /FID ne {def} {pop pop} ifelse} forall
  /Encoding WinAnsiEncoding def
  currentdict
end
/Courier-Bold exch definefont pop
/Helvetica findfont
dup length dict begin
  {1 index /FID ne {def} {pop pop} ifelse} forall
  /Encoding WinAnsiEncoding def
  currentdict
end
/Helvetica exch definefont pop
/Helvetica-Oblique findfont
dup length dict begin
  {1 index /FID ne {def} {pop pop} ifelse} forall
  /Encoding WinAnsiEncoding def
  currentdict
end
/Helvetica-Oblique exch definefont pop
/Helvetica-Bold findfont
dup length dict begin
  {1 index /FID ne {def} {pop pop} ifelse} forall
  /Encoding WinAnsiEncoding def
  currentdict
end
/Helvetica-Bold exch definefont pop
/Helvetica-BoldOblique findfont
dup length dict begin
  {1 index /FID ne {def} {pop pop} ifelse} forall
  /Encoding WinAnsiEncoding def
  currentdict
end
/Helvetica-BoldOblique exch definefont pop
/Times-Roman findfont
dup length dict begin
  {1 index /FID ne {def} {pop pop} ifelse} forall
  /Encoding WinAnsiEncoding def
  currentdict
end
/Times-Roman exch definefont pop
/Times-Italic findfont
dup length dict begin
  {1 index /FID ne {def} {pop pop} ifelse} forall
  /Encoding WinAnsiEncoding def
  currentdict
end
/Times-Italic exch definefont pop
/Times-Bold findfont
dup length dict begin
  {1 index /FID ne {def} {pop pop} ifelse} forall
  /Encoding WinAnsiEncoding def
  currentdict
end
/Times-Bold exch definefont pop
/Times-BoldItalic findfont
dup length dict begin
  {1 index /FID ne {def} {pop pop} ifelse} forall
  /Encoding WinAnsiEncoding def
  currentdict
end
/Times-BoldItalic exch definefont pop
/Courier findfont
dup length dict begin
  {1 index /FID ne {def} {pop pop} ifelse} forall
  /Encoding WinAnsiEncoding def
  currentdict
end
/Courier exch definefont pop
%FOPEndFontReencode
%%EndProlog
%%Page: 1 1
%%PageBoundingBox: 0 0 198 227
%%BeginPageSetup
[1 0 0 -1 0 227] CT
%%EndPageSetup
GS
[1.00215 0 0 1 0 0] CT
1 GC
N
0 0 198 227 re
f
GR
GS
[1.00215 0 0 1 0 0] CT
1 GC
N
0 0 198 227 re
f
GR
GS
[1.00215 0 0 1 0 0] CT
1 GC
N
69 197 M
179 197 L
179 32 L
69 32 L
cp
f
GR
GS
[1.00215 0 0 1 0 0] CT
0.149 GC
2 setlinecap
1 LJ
0.5 LW
N
69 197 M
179 197 L
S
GR
GS
[1.00215 0 0 1 0 0] CT
0.149 GC
2 setlinecap
1 LJ
0.5 LW
N
102 197 M
102 195.35 L
S
GR
GS
[1.00215 0 0 1 0 0] CT
0.149 GC
2 setlinecap
1 LJ
0.5 LW
N
146 197 M
146 195.35 L
S
GR
GS
[1.00215 0 0 1 102.21904 203] CT
0.149 GC
/Helvetica 20 F
GS
[1 0 0 1 0 0] CT
-13 20 moveto 
1 -1 scale
(YA) t 
GR
GR
GS
[1.00215 0 0 1 146.31353 203] CT
0.149 GC
/Helvetica 20 F
GS
[1 0 0 1 0 0] CT
-14.5 20 moveto 
1 -1 scale
(OA) t 
GR
GR
GS
[1.00215 0 0 1 0 0] CT
0.149 GC
2 setlinecap
1 LJ
0.5 LW
N
69 197 M
69 32 L
S
GR
GS
[1.00215 0 0 1 0 0] CT
0.149 GC
2 setlinecap
1 LJ
0.5 LW
N
69 197 M
70.65 197 L
S
GR
GS
[1.00215 0 0 1 0 0] CT
0.149 GC
2 setlinecap
1 LJ
0.5 LW
N
69 155.75 M
70.65 155.75 L
S
GR
GS
[1.00215 0 0 1 0 0] CT
0.149 GC
2 setlinecap
1 LJ
0.5 LW
N
69 114.5 M
70.65 114.5 L
S
GR
GS
[1.00215 0 0 1 0 0] CT
0.149 GC
2 setlinecap
1 LJ
0.5 LW
N
69 73.25 M
70.65 73.25 L
S
GR
GS
[1.00215 0 0 1 63.13529 197] CT
0.149 GC
/Helvetica 20 F
GS
[1 0 0 1 0 0] CT
-36 7.5 moveto 
1 -1 scale
(-0.8) t 
GR
GR
GS
[1.00215 0 0 1 63.13529 155.75] CT
0.149 GC
/Helvetica 20 F
GS
[1 0 0 1 0 0] CT
-36 7.5 moveto 
1 -1 scale
(-0.6) t 
GR
GR
GS
[1.00215 0 0 1 63.13529 114.5] CT
0.149 GC
/Helvetica 20 F
GS
[1 0 0 1 0 0] CT
-36 7.5 moveto 
1 -1 scale
(-0.4) t 
GR
GR
GS
[1.00215 0 0 1 63.13529 73.25] CT
0.149 GC
/Helvetica 20 F
GS
[1 0 0 1 0 0] CT
-36 7.5 moveto 
1 -1 scale
(-0.2) t 
GR
GR
GS
[0 -1 1.00215 0 24.05154 114.49992] CT
0.149 GC
/Helvetica 20 F
GS
[1 0 0 1 0 0] CT
-60 -5 moveto 
1 -1 scale
(linear change) t 
GR
GR
GS
[1.00215 0 0 1 124.26641 29.25] CT
/Helvetica-Bold 22 F
GS
[1 0 0 1 0 0] CT
-41 -5 moveto 
1 -1 scale
(p = 0.05) t 
GR
GR
GS
[1.00215 0 0 1 0 0] CT
0.149 GC
1 LJ
0.5 LW
N
69 32 M
179 32 L
S
GR
GS
[1.00215 0 0 1 0 0] CT
0.6 0.8 1 RC
N
84.4 32 M
84.4 95.558 L
119.6 95.558 L
119.6 32 L
cp
f
GR
GS
[1.00215 0 0 1 94.63513 89.97747] CT
0.302 GC
N
2.236 0 M
2.236 -1.235 1.235 -2.236 0 -2.236 C
-1.235 -2.236 -2.236 -1.235 -2.236 0 C
-2.236 1.235 -1.235 2.236 0 2.236 C
1.235 2.236 2.236 1.235 2.236 0 C
cp
f
GR
GS
[1.00215 0 0 1 94.06686 89.77671] CT
0.302 GC
N
/f-1586420743{2.236 0 M
2.236 -1.235 1.235 -2.236 0 -2.236 C
-1.235 -2.236 -2.236 -1.235 -2.236 0 C
-2.236 1.235 -1.235 2.236 0 2.236 C
1.235 2.236 2.236 1.235 2.236 0 C
cp}def
f-1586420743
f
GR
GS
[1.00215 0 0 1 106.42959 81.96741] CT
0.302 GC
N
f-1586420743
f
GR
GS
[1.00215 0 0 1 105.50943 77.56739] CT
0.302 GC
N
f-1586420743
f
GR
GS
[1.00215 0 0 1 107.87914 50.59448] CT
0.302 GC
N
f-1586420743
f
GR
GS
[1.00215 0 0 1 104.57435 82.841] CT
0.302 GC
N
f-1586420743
f
GR
GS
[1.00215 0 0 1 106.82631 107.81355] CT
0.302 GC
N
f-1586420743
f
GR
GS
[1.00215 0 0 1 108.00833 121.0367] CT
0.302 GC
N
f-1586420743
f
GR
GS
[1.00215 0 0 1 97.39888 42.72317] CT
0.302 GC
N
f-1586420743
f
GR
GS
[1.00215 0 0 1 109.33246 92.46368] CT
0.302 GC
N
f-1586420743
f
GR
GS
[1.00215 0 0 1 105.24251 91.80603] CT
0.302 GC
N
f-1586420743
f
GR
GS
[1.00215 0 0 1 109.74617 97.6995] CT
0.302 GC
N
f-1586420743
f
GR
GS
[1.00215 0 0 1 99.05479 59.65872] CT
0.302 GC
N
f-1586420743
f
GR
GS
[1.00215 0 0 1 102.94544 87.12376] CT
0.302 GC
N
f-1586420743
f
GR
GS
[1.00215 0 0 1 98.34078 98.02289] CT
0.302 GC
N
f-1586420743
f
GR
GS
[1.00215 0 0 1 94.0954 54.16496] CT
0.302 GC
N
f-1586420743
f
GR
GS
[1.00215 0 0 1 102.98522 95.98952] CT
0.302 GC
N
f-1586420743
f
GR
GS
[1.00215 0 0 1 107.04941 115.15842] CT
0.302 GC
N
f-1586420743
f
GR
GS
[1.00215 0 0 1 93.47374 97.96384] CT
0.302 GC
N
f-1586420743
f
GR
GS
[1.00215 0 0 1 93.41234 105.28465] CT
0.302 GC
N
f-1586420743
f
GR
GS
[1.00215 0 0 1 96.72799 129.07187] CT
0.302 GC
N
f-1586420743
f
GR
GS
[1.00215 0 0 1 101.7611 60.47479] CT
0.302 GC
N
f-1586420743
f
GR
GS
[1.00215 0 0 1 108.39181 59.15271] CT
0.302 GC
N
f-1586420743
f
GR
GS
[1.00215 0 0 1 108.82081 129.00914] CT
0.302 GC
N
f-1586420743
f
GR
GS
[1.00215 0 0 1 93.94869 93.60384] CT
0.302 GC
N
f-1586420743
f
GR
GS
[1.00215 0 0 1 101.29985 133.92091] CT
0.302 GC
N
f-1586420743
f
GR
GS
[1.00215 0 0 1 93.6276 90.27079] CT
0.302 GC
N
f-1586420743
f
GR
GS
[1.00215 0 0 1 105.72121 120.10449] CT
0.302 GC
N
f-1586420743
f
GR
GS
[1.00215 0 0 1 107.06202 110.53901] CT
0.302 GC
N
f-1586420743
f
GR
GS
[1.00215 0 0 1 100.924 112.25203] CT
0.302 GC
N
f-1586420743
f
GR
GS
[1.00215 0 0 1 96.40781 68.2021] CT
0.302 GC
N
f-1586420743
f
GR
GS
[1.00215 0 0 1 103.88637 128.38106] CT
0.302 GC
N
f-1586420743
f
GR
GS
[1.00215 0 0 1 95.47309 119.71535] CT
0.302 GC
N
f-1586420743
f
GR
GS
[1.00215 0 0 1 105.80605 95.48084] CT
0.302 GC
N
f-1586420743
f
GR
GS
[1.00215 0 0 1 94.68291 112.38269] CT
0.302 GC
N
f-1586420743
f
GR
GS
[1.00215 0 0 1 102.79215 118.65652] CT
0.302 GC
N
f-1586420743
f
GR
GS
[1.00215 0 0 1 94.43457 92.25404] CT
0.302 GC
N
f-1586420743
f
GR
GS
[1.00215 0 0 1 100.86604 136.09573] CT
0.302 GC
N
f-1586420743
f
GR
GS
[1.00215 0 0 1 102.10615 65.43784] CT
0.302 GC
N
f-1586420743
f
GR
GS
[1.00215 0 0 1 109.79292 114.2494] CT
0.302 GC
N
f-1586420743
f
GR
GS
[1.00215 0 0 1 101.29689 84.89378] CT
0.302 GC
N
f-1586420743
f
GR
GS
[1.00215 0 0 1 100.23007 99.64935] CT
0.302 GC
N
f-1586420743
f
GR
GS
[1.00215 0 0 1 0 0] CT
0.6 0.8 1 RC
N
/f-1364061918{128.4 32 M
128.4 107.602 L
163.6 107.602 L
163.6 32 L
cp}def
f-1364061918
f
GR
GS
[1.00215 0 0 1 147.90141 95.03548] CT
0.302 GC
N
f-1586420743
f
GR
GS
[1.00215 0 0 1 137.65406 145.0914] CT
0.302 GC
N
f-1586420743
f
GR
GS
[1.00215 0 0 1 139.05552 63.24009] CT
0.302 GC
N
f-1586420743
f
GR
GS
[1.00215 0 0 1 146.55089 52.34183] CT
0.302 GC
N
f-1586420743
f
GR
GS
[1.00215 0 0 1 141.5453 132.49017] CT
0.302 GC
N
f-1586420743
f
GR
GS
[1.00215 0 0 1 144.13516 104.67044] CT
0.302 GC
N
f-1586420743
f
GR
GS
[1.00215 0 0 1 148.95524 133.42316] CT
0.302 GC
N
f-1586420743
f
GR
GS
[1.00215 0 0 1 138.73271 133.53926] CT
0.302 GC
N
f-1586420743
f
GR
GS
[1.00215 0 0 1 149.96409 110.62141] CT
0.302 GC
N
f-1586420743
f
GR
GS
[1.00215 0 0 1 151.49514 101.52821] CT
0.302 GC
N
f-1586420743
f
GR
GS
[1.00215 0 0 1 139.00405 104.59795] CT
0.302 GC
N
f-1586420743
f
GR
GS
[1.00215 0 0 1 153.17698 64.9165] CT
0.302 GC
N
f-1586420743
f
GR
GS
[1.00215 0 0 1 146.86277 156.53381] CT
0.302 GC
N
f-1586420743
f
GR
GS
[1.00215 0 0 1 147.59631 90.12196] CT
0.302 GC
N
f-1586420743
f
GR
GS
[1.00215 0 0 1 143.45228 76.57898] CT
0.302 GC
N
f-1586420743
f
GR
GS
[1.00215 0 0 1 140.36636 110.8419] CT
0.302 GC
N
f-1586420743
f
GR
GS
[1.00215 0 0 1 144.76873 89.59194] CT
0.302 GC
N
f-1586420743
f
GR
GS
[1.00215 0 0 1 140.1724 130.75427] CT
0.302 GC
N
f-1586420743
f
GR
GS
[1.00215 0 0 1 150.21909 100.77226] CT
0.302 GC
N
f-1586420743
f
GR
GS
[1.00215 0 0 1 144.0417 77.76622] CT
0.302 GC
N
f-1586420743
f
GR
GS
[1.00215 0 0 1 149.44197 92.31744] CT
0.302 GC
N
f-1586420743
f
GR
GS
[1.00215 0 0 1 148.71525 172.95193] CT
0.302 GC
N
f-1586420743
f
GR
GS
[1.00215 0 0 1 140.25863 84.88101] CT
0.302 GC
N
f-1586420743
f
GR
GS
[1.00215 0 0 1 144.11727 176.93214] CT
0.302 GC
N
f-1586420743
f
GR
GS
[1.00215 0 0 1 154.35033 108.28286] CT
0.302 GC
N
f-1586420743
f
GR
GS
[1.00215 0 0 1 146.58672 119.96512] CT
0.302 GC
N
f-1586420743
f
GR
GS
[1.00215 0 0 1 146.41733 126.42704] CT
0.302 GC
N
f-1586420743
f
GR
GS
[1.00215 0 0 1 150.29119 100.79358] CT
0.302 GC
N
f-1586420743
f
GR
GS
[1.00215 0 0 1 145.30189 163.77992] CT
0.302 GC
N
f-1586420743
f
GR
GS
[1.00215 0 0 1 139.42929 180.56482] CT
0.302 GC
N
f-1586420743
f
GR
GS
[1.00215 0 0 1 146.08018 84.08017] CT
0.302 GC
N
f-1586420743
f
GR
GS
[1.00215 0 0 1 137.88492 80.86753] CT
0.302 GC
N
f-1586420743
f
GR
GS
[1.00215 0 0 1 148.60158 34.5037] CT
0.302 GC
N
f-1586420743
f
GR
GS
[1.00215 0 0 1 145.40333 107.07868] CT
0.302 GC
N
f-1586420743
f
GR
GS
[1.00215 0 0 1 140.39888 75.65161] CT
0.302 GC
N
f-1586420743
f
GR
GS
[1.00215 0 0 1 140.43922 123.20047] CT
0.302 GC
N
f-1586420743
f
GR
GS
[1.00215 0 0 1 148.24372 88.02127] CT
0.302 GC
N
f-1586420743
f
GR
GS
[1.00215 0 0 1 143.01513 154.93323] CT
0.302 GC
N
f-1586420743
f
GR
GS
[1.00215 0 0 1 151.01882 80.37029] CT
0.302 GC
N
f-1586420743
f
GR
GS
[1.00215 0 0 1 143.75473 130.90057] CT
0.302 GC
N
f-1586420743
f
GR
GS
[1.00215 0 0 1 143.8611 64.89931] CT
0.302 GC
N
f-1586420743
f
GR
GS
[1.00215 0 0 1 153.48573 68.5621] CT
0.302 GC
N
f-1586420743
f
GR
GS
[1.00215 0 0 1 150.02323 87.80065] CT
0.302 GC
N
f-1586420743
f
GR
GS
[1.00215 0 0 1 142.09245 97.8092] CT
0.302 GC
N
f-1586420743
f
GR
GS
[1.00215 0 0 1 149.01632 108.42316] CT
0.302 GC
N
f-1586420743
f
GR
GS
[1.00215 0 0 1 152.82437 130.74791] CT
0.302 GC
N
f-1586420743
f
GR
GS
[1.00215 0 0 1 148.88302 101.54655] CT
0.302 GC
N
f-1586420743
f
GR
GS
[1.00215 0 0 1 140.10449 164.41551] CT
0.302 GC
N
f-1586420743
f
GR
GS
[1.00215 0 0 1 145.79142 132.95638] CT
0.302 GC
N
f-1586420743
f
GR
GS
[1.00215 0 0 1 145.38316 78.29046] CT
0.302 GC
N
f-1586420743
f
GR
GS
[1.00215 0 0 1 144.14889 93.40786] CT
0.302 GC
N
f-1586420743
f
GR
GS
[1.00215 0 0 1 142.60535 99.78678] CT
0.302 GC
N
f-1586420743
f
GR
GS
[1.00215 0 0 1 145.26852 113.32516] CT
0.302 GC
N
f-1586420743
f
GR
%%Trailer
%%Pages: 1
%%EOF
