%!PS-Adobe-3.0 EPSF-3.0
%%Creator: (MATLAB, The Mathworks, Inc. Version 9.8.0.1323502 \(R2020a\). Operating System: Mac OS X)
%%Title: /Users/ddg/Volumes/tardis_mpib.localized/stateswitch/stsw_beh_task/hddm_matched/figures/c1_mediansplit_yaoa_featurespecific_lin.eps
%%CreationDate: 2024-05-07T11:58:30
%%Pages: (atend)
%%BoundingBox:    20     0   348   273
%%LanguageLevel: 3
%%EndComments
%%BeginProlog
%%BeginResource: procset (Apache XML Graphics Std ProcSet) 1.2 0
%%Version: 1.2 0
%%Copyright: (Copyright 2001-2003,2010 The Apache Software Foundation. License terms: http://www.apache.org/licenses/LICENSE-2.0)
/bd{bind def}bind def
/ld{load def}bd
/GR/grestore ld
/GS/gsave ld
/RM/rmoveto ld
/C/curveto ld
/t/show ld
/L/lineto ld
/ML/setmiterlimit ld
/CT/concat ld
/f/fill ld
/N/newpath ld
/S/stroke ld
/CC/setcmykcolor ld
/A/ashow ld
/cp/closepath ld
/RC/setrgbcolor ld
/LJ/setlinejoin ld
/GC/setgray ld
/LW/setlinewidth ld
/M/moveto ld
/re {4 2 roll M
1 index 0 rlineto
0 exch rlineto
neg 0 rlineto
cp } bd
/_ctm matrix def
/_tm matrix def
/BT { _ctm currentmatrix pop matrix _tm copy pop 0 0 moveto } bd
/ET { _ctm setmatrix } bd
/iTm { _ctm setmatrix _tm concat } bd
/Tm { _tm astore pop iTm 0 0 moveto } bd
/ux 0.0 def
/uy 0.0 def
/F {
  /Tp exch def
  /Tf exch def
  Tf findfont Tp scalefont setfont
  /cf Tf def  /cs Tp def
} bd
/ULS {currentpoint /uy exch def /ux exch def} bd
/ULE {
  /Tcx currentpoint pop def
  gsave
  newpath
  cf findfont cs scalefont dup
  /FontMatrix get 0 get /Ts exch def /FontInfo get dup
  /UnderlinePosition get Ts mul /To exch def
  /UnderlineThickness get Ts mul /Tt exch def
  ux uy To add moveto  Tcx uy To add lineto
  Tt setlinewidth stroke
  grestore
} bd
/OLE {
  /Tcx currentpoint pop def
  gsave
  newpath
  cf findfont cs scalefont dup
  /FontMatrix get 0 get /Ts exch def /FontInfo get dup
  /UnderlinePosition get Ts mul /To exch def
  /UnderlineThickness get Ts mul /Tt exch def
  ux uy To add cs add moveto Tcx uy To add cs add lineto
  Tt setlinewidth stroke
  grestore
} bd
/SOE {
  /Tcx currentpoint pop def
  gsave
  newpath
  cf findfont cs scalefont dup
  /FontMatrix get 0 get /Ts exch def /FontInfo get dup
  /UnderlinePosition get Ts mul /To exch def
  /UnderlineThickness get Ts mul /Tt exch def
  ux uy To add cs 10 mul 26 idiv add moveto Tcx uy To add cs 10 mul 26 idiv add lineto
  Tt setlinewidth stroke
  grestore
} bd
/QT {
/Y22 exch store
/X22 exch store
/Y21 exch store
/X21 exch store
currentpoint
/Y21 load 2 mul add 3 div exch
/X21 load 2 mul add 3 div exch
/X21 load 2 mul /X22 load add 3 div
/Y21 load 2 mul /Y22 load add 3 div
/X22 load /Y22 load curveto
} bd
/SSPD {
dup length /d exch dict def
{
/v exch def
/k exch def
currentpagedevice k known {
/cpdv currentpagedevice k get def
v cpdv ne {
/upd false def
/nullv v type /nulltype eq def
/nullcpdv cpdv type /nulltype eq def
nullv nullcpdv or
{
/upd true def
} {
/sametype v type cpdv type eq def
sametype {
v type /arraytype eq {
/vlen v length def
/cpdvlen cpdv length def
vlen cpdvlen eq {
0 1 vlen 1 sub {
/i exch def
/obj v i get def
/cpdobj cpdv i get def
obj cpdobj ne {
/upd true def
exit
} if
} for
} {
/upd true def
} ifelse
} {
v type /dicttype eq {
v {
/dv exch def
/dk exch def
/cpddv cpdv dk get def
dv cpddv ne {
/upd true def
exit
} if
} forall
} {
/upd true def
} ifelse
} ifelse
} if
} ifelse
upd true eq {
d k v put
} if
} if
} if
} forall
d length 0 gt {
d setpagedevice
} if
} bd
/RE { % /NewFontName [NewEncodingArray] /FontName RE -
  findfont dup length dict begin
  {
    1 index /FID ne
    {def} {pop pop} ifelse
  } forall
  /Encoding exch def
  /FontName 1 index def
  currentdict definefont pop
  end
} bind def
%%EndResource
%%BeginResource: procset (Apache XML Graphics EPS ProcSet) 1.0 0
%%Version: 1.0 0
%%Copyright: (Copyright 2002-2003 The Apache Software Foundation. License terms: http://www.apache.org/licenses/LICENSE-2.0)
/BeginEPSF { %def
/b4_Inc_state save def         % Save state for cleanup
/dict_count countdictstack def % Count objects on dict stack
/op_count count 1 sub def      % Count objects on operand stack
userdict begin                 % Push userdict on dict stack
/showpage { } def              % Redefine showpage, { } = null proc
0 setgray 0 setlinecap         % Prepare graphics state
1 setlinewidth 0 setlinejoin
10 setmiterlimit [ ] 0 setdash newpath
/languagelevel where           % If level not equal to 1 then
{pop languagelevel             % set strokeadjust and
1 ne                           % overprint to their defaults.
{false setstrokeadjust false setoverprint
} if
} if
} bd
/EndEPSF { %def
count op_count sub {pop} repeat            % Clean up stacks
countdictstack dict_count sub {end} repeat
b4_Inc_state restore
} bd
%%EndResource
%FOPBeginFontDict
%%IncludeResource: font Courier-Oblique
%%IncludeResource: font Courier-BoldOblique
%%IncludeResource: font Courier-Bold
%%IncludeResource: font ZapfDingbats
%%IncludeResource: font Symbol
%%IncludeResource: font Helvetica
%%IncludeResource: font Helvetica-Oblique
%%IncludeResource: font Helvetica-Bold
%%IncludeResource: font Helvetica-BoldOblique
%%IncludeResource: font Times-Roman
%%IncludeResource: font Times-Italic
%%IncludeResource: font Times-Bold
%%IncludeResource: font Times-BoldItalic
%%IncludeResource: font Courier
%FOPEndFontDict
%%BeginResource: encoding WinAnsiEncoding
/WinAnsiEncoding [
/.notdef /.notdef /.notdef /.notdef /.notdef
/.notdef /.notdef /.notdef /.notdef /.notdef
/.notdef /.notdef /.notdef /.notdef /.notdef
/.notdef /.notdef /.notdef /.notdef /.notdef
/.notdef /.notdef /.notdef /.notdef /.notdef
/.notdef /.notdef /.notdef /.notdef /.notdef
/.notdef /.notdef /space /exclam /quotedbl
/numbersign /dollar /percent /ampersand /quotesingle
/parenleft /parenright /asterisk /plus /comma
/hyphen /period /slash /zero /one
/two /three /four /five /six
/seven /eight /nine /colon /semicolon
/less /equal /greater /question /at
/A /B /C /D /E
/F /G /H /I /J
/K /L /M /N /O
/P /Q /R /S /T
/U /V /W /X /Y
/Z /bracketleft /backslash /bracketright /asciicircum
/underscore /quoteleft /a /b /c
/d /e /f /g /h
/i /j /k /l /m
/n /o /p /q /r
/s /t /u /v /w
/x /y /z /braceleft /bar
/braceright /asciitilde /bullet /Euro /bullet
/quotesinglbase /florin /quotedblbase /ellipsis /dagger
/daggerdbl /circumflex /perthousand /Scaron /guilsinglleft
/OE /bullet /Zcaron /bullet /bullet
/quoteleft /quoteright /quotedblleft /quotedblright /bullet
/endash /emdash /asciitilde /trademark /scaron
/guilsinglright /oe /bullet /zcaron /Ydieresis
/space /exclamdown /cent /sterling /currency
/yen /brokenbar /section /dieresis /copyright
/ordfeminine /guillemotleft /logicalnot /sfthyphen /registered
/macron /degree /plusminus /twosuperior /threesuperior
/acute /mu /paragraph /middot /cedilla
/onesuperior /ordmasculine /guillemotright /onequarter /onehalf
/threequarters /questiondown /Agrave /Aacute /Acircumflex
/Atilde /Adieresis /Aring /AE /Ccedilla
/Egrave /Eacute /Ecircumflex /Edieresis /Igrave
/Iacute /Icircumflex /Idieresis /Eth /Ntilde
/Ograve /Oacute /Ocircumflex /Otilde /Odieresis
/multiply /Oslash /Ugrave /Uacute /Ucircumflex
/Udieresis /Yacute /Thorn /germandbls /agrave
/aacute /acircumflex /atilde /adieresis /aring
/ae /ccedilla /egrave /eacute /ecircumflex
/edieresis /igrave /iacute /icircumflex /idieresis
/eth /ntilde /ograve /oacute /ocircumflex
/otilde /odieresis /divide /oslash /ugrave
/uacute /ucircumflex /udieresis /yacute /thorn
/ydieresis
] def
%%EndResource
%FOPBeginFontReencode
/Courier-Oblique findfont
dup length dict begin
  {1 index /FID ne {def} {pop pop} ifelse} forall
  /Encoding WinAnsiEncoding def
  currentdict
end
/Courier-Oblique exch definefont pop
/Courier-BoldOblique findfont
dup length dict begin
  {1 index /FID ne {def} {pop pop} ifelse} forall
  /Encoding WinAnsiEncoding def
  currentdict
end
/Courier-BoldOblique exch definefont pop
/Courier-Bold findfont
dup length dict begin
  {1 index /FID ne {def} {pop pop} ifelse} forall
  /Encoding WinAnsiEncoding def
  currentdict
end
/Courier-Bold exch definefont pop
/Helvetica findfont
dup length dict begin
  {1 index /FID ne {def} {pop pop} ifelse} forall
  /Encoding WinAnsiEncoding def
  currentdict
end
/Helvetica exch definefont pop
/Helvetica-Oblique findfont
dup length dict begin
  {1 index /FID ne {def} {pop pop} ifelse} forall
  /Encoding WinAnsiEncoding def
  currentdict
end
/Helvetica-Oblique exch definefont pop
/Helvetica-Bold findfont
dup length dict begin
  {1 index /FID ne {def} {pop pop} ifelse} forall
  /Encoding WinAnsiEncoding def
  currentdict
end
/Helvetica-Bold exch definefont pop
/Helvetica-BoldOblique findfont
dup length dict begin
  {1 index /FID ne {def} {pop pop} ifelse} forall
  /Encoding WinAnsiEncoding def
  currentdict
end
/Helvetica-BoldOblique exch definefont pop
/Times-Roman findfont
dup length dict begin
  {1 index /FID ne {def} {pop pop} ifelse} forall
  /Encoding WinAnsiEncoding def
  currentdict
end
/Times-Roman exch definefont pop
/Times-Italic findfont
dup length dict begin
  {1 index /FID ne {def} {pop pop} ifelse} forall
  /Encoding WinAnsiEncoding def
  currentdict
end
/Times-Italic exch definefont pop
/Times-Bold findfont
dup length dict begin
  {1 index /FID ne {def} {pop pop} ifelse} forall
  /Encoding WinAnsiEncoding def
  currentdict
end
/Times-Bold exch definefont pop
/Times-BoldItalic findfont
dup length dict begin
  {1 index /FID ne {def} {pop pop} ifelse} forall
  /Encoding WinAnsiEncoding def
  currentdict
end
/Times-BoldItalic exch definefont pop
/Courier findfont
dup length dict begin
  {1 index /FID ne {def} {pop pop} ifelse} forall
  /Encoding WinAnsiEncoding def
  currentdict
end
/Courier exch definefont pop
%FOPEndFontReencode
%%EndProlog
%%Page: 1 1
%%PageBoundingBox: 0 0 384 288
%%BeginPageSetup
[1 0 0 -1 0 288] CT
%%EndPageSetup
GS
1 GC
N
0 0 384 288 re
f
GR
GS
1 GC
N
0 0 384 288 re
f
GR
GS
1 GC
N
78.5 238.5 M
178.5 238.5 L
178.5 21.5 L
78.5 21.5 L
cp
f
GR
GS
0.149 GC
2 setlinecap
1 LJ
0.5 LW
N
78.5 238.5 M
178.5 238.5 L
S
GR
GS
0.149 GC
2 setlinecap
1 LJ
0.5 LW
N
91 238.5 M
91 236.33 L
S
GR
GS
0.149 GC
2 setlinecap
1 LJ
0.5 LW
N
116 238.5 M
116 236.33 L
S
GR
GS
0.149 GC
2 setlinecap
1 LJ
0.5 LW
N
141 238.5 M
141 236.33 L
S
GR
GS
0.149 GC
2 setlinecap
1 LJ
0.5 LW
N
166 238.5 M
166 236.33 L
S
GR
GS
[1 0 0 1 91 244.10001] CT
0.149 GC
/Helvetica 18 F
GS
[1 0 0 1 0 0] CT
-5.5 18 moveto 
1 -1 scale
(1) t 
GR
GR
GS
[1 0 0 1 116 244.10001] CT
0.149 GC
/Helvetica 18 F
GS
[1 0 0 1 0 0] CT
-5.5 18 moveto 
1 -1 scale
(2) t 
GR
GR
GS
[1 0 0 1 141 244.10001] CT
0.149 GC
/Helvetica 18 F
GS
[1 0 0 1 0 0] CT
-5.5 18 moveto 
1 -1 scale
(3) t 
GR
GR
GS
[1 0 0 1 166 244.10001] CT
0.149 GC
/Helvetica 18 F
GS
[1 0 0 1 0 0] CT
-5.5 18 moveto 
1 -1 scale
(4) t 
GR
GR
GS
[1 0 0 1 128.50005 266.60001] CT
0.149 GC
/Helvetica 18 F
GS
[1 0 0 1 0 0] CT
-67.5 18 moveto 
1 -1 scale
(preferred feature) t 
GR
GR
GS
0.149 GC
2 setlinecap
1 LJ
0.5 LW
N
78.5 238.5 M
78.5 21.5 L
S
GR
GS
0.149 GC
2 setlinecap
1 LJ
0.5 LW
N
78.5 238.5 M
80.67 238.5 L
S
GR
GS
0.149 GC
2 setlinecap
1 LJ
0.5 LW
N
78.5 168.085 M
80.67 168.085 L
S
GR
GS
0.149 GC
2 setlinecap
1 LJ
0.5 LW
N
78.5 97.671 M
80.67 97.671 L
S
GR
GS
0.149 GC
2 setlinecap
1 LJ
0.5 LW
N
78.5 27.256 M
80.67 27.256 L
S
GR
GS
[1 0 0 1 72.9 238.50002] CT
0.149 GC
/Helvetica 18 F
GS
[1 0 0 1 0 0] CT
-33 7 moveto 
1 -1 scale
(-0.6) t 
GR
GR
GS
[1 0 0 1 72.9 168.08539] CT
0.149 GC
/Helvetica 18 F
GS
[1 0 0 1 0 0] CT
-33 7 moveto 
1 -1 scale
(-0.4) t 
GR
GR
GS
[1 0 0 1 72.9 97.67077] CT
0.149 GC
/Helvetica 18 F
GS
[1 0 0 1 0 0] CT
-33 7 moveto 
1 -1 scale
(-0.2) t 
GR
GR
GS
[1 0 0 1 72.9 27.25615] CT
0.149 GC
/Helvetica 18 F
GS
[1 0 0 1 0 0] CT
-11 7 moveto 
1 -1 scale
(0) t 
GR
GR
GS
[0 -1 1 0 37.4 129.99989] CT
0.149 GC
/Helvetica 18 F
GS
[1 0 0 1 0 0] CT
-59 -4 moveto 
1 -1 scale
(Drift \(lin. mod.\)) t 
GR
GR
GS
1 LJ
2 LW
N
91 197.231 M
91 226.872 L
S
GR
GS
1 LJ
2 LW
N
116 167.502 M
116 181.712 L
S
GR
GS
1 LJ
2 LW
N
141 169.6 M
141 182.33 L
S
GR
GS
1 LJ
2 LW
N
166 112.272 M
166 126.456 L
S
GR
GS
1 LJ
2 LW
N
91 197.231 M
91 167.59 L
S
GR
GS
1 LJ
2 LW
N
116 167.502 M
116 153.292 L
S
GR
GS
1 LJ
2 LW
N
141 169.6 M
141 156.87 L
S
GR
GS
1 LJ
2 LW
N
166 112.272 M
166 98.087 L
S
GR
GS
1 LJ
2 LW
N
91 197.231 M
116 167.502 L
141 169.6 L
166 112.272 L
S
GR
GS
[1 0 0 1 91 226.87178] CT
N
-3 0 M
3 0 L
f
GR
GS
[1 0 0 1 91 226.87178] CT
10.0 ML
2 LW
N
-3 0 M
3 0 L
S
GR
GS
[1 0 0 1 116 181.71158] CT
N
/f1394637256{-3 0 M
3 0 L}def
f1394637256
f
GR
GS
[1 0 0 1 116 181.71158] CT
10.0 ML
2 LW
N
-3 0 M
3 0 L
S
GR
GS
[1 0 0 1 141 182.33035] CT
N
f1394637256
f
GR
GS
[1 0 0 1 141 182.33035] CT
10.0 ML
2 LW
N
-3 0 M
3 0 L
S
GR
GS
[1 0 0 1 166 126.4565] CT
N
f1394637256
f
GR
GS
[1 0 0 1 166 126.4565] CT
10.0 ML
2 LW
N
-3 0 M
3 0 L
S
GR
GS
[1 0 0 1 91 167.59041] CT
N
f1394637256
f
GR
GS
[1 0 0 1 91 167.59041] CT
10.0 ML
2 LW
N
-3 0 M
3 0 L
S
GR
GS
[1 0 0 1 116 153.29161] CT
N
f1394637256
f
GR
GS
[1 0 0 1 116 153.29161] CT
10.0 ML
2 LW
N
-3 0 M
3 0 L
S
GR
GS
[1 0 0 1 141 156.86958] CT
N
f1394637256
f
GR
GS
[1 0 0 1 141 156.86958] CT
10.0 ML
2 LW
N
-3 0 M
3 0 L
S
GR
GS
[1 0 0 1 166 98.08712] CT
N
f1394637256
f
GR
GS
[1 0 0 1 166 98.08712] CT
10.0 ML
2 LW
N
-3 0 M
3 0 L
S
GR
GS
1 LJ
2 LW
N
91 160.775 M
91 182.77 L
S
GR
GS
1 LJ
2 LW
N
116 149.028 M
116 167.857 L
S
GR
GS
1 LJ
2 LW
N
141 109.312 M
141 130.756 L
S
GR
GS
1 LJ
2 LW
N
166 96.839 M
166 105.927 L
S
GR
GS
1 LJ
2 LW
N
91 160.775 M
91 138.781 L
S
GR
GS
1 LJ
2 LW
N
116 149.028 M
116 130.2 L
S
GR
GS
1 LJ
2 LW
N
141 109.312 M
141 87.869 L
S
GR
GS
1 LJ
2 LW
N
166 96.839 M
166 87.751 L
S
GR
GS
[8 8] 0 setdash
2 LJ
2 LW
N
91 160.775 M
116 149.028 L
141 109.312 L
166 96.839 L
S
GR
GS
[1 0 0 1 91 182.77028] CT
N
f1394637256
f
GR
GS
[1 0 0 1 91 182.77028] CT
10.0 ML
2 LW
N
-3 0 M
3 0 L
S
GR
GS
[1 0 0 1 116 167.85704] CT
N
f1394637256
f
GR
GS
[1 0 0 1 116 167.85704] CT
10.0 ML
2 LW
N
-3 0 M
3 0 L
S
GR
GS
[1 0 0 1 141 130.75563] CT
N
f1394637256
f
GR
GS
[1 0 0 1 141 130.75563] CT
10.0 ML
2 LW
N
-3 0 M
3 0 L
S
GR
GS
[1 0 0 1 166 105.9273] CT
N
f1394637256
f
GR
GS
[1 0 0 1 166 105.9273] CT
10.0 ML
2 LW
N
-3 0 M
3 0 L
S
GR
GS
[1 0 0 1 91 138.78072] CT
N
f1394637256
f
GR
GS
[1 0 0 1 91 138.78072] CT
10.0 ML
2 LW
N
-3 0 M
3 0 L
S
GR
GS
[1 0 0 1 116 130.19975] CT
N
f1394637256
f
GR
GS
[1 0 0 1 116 130.19975] CT
10.0 ML
2 LW
N
-3 0 M
3 0 L
S
GR
GS
[1 0 0 1 141 87.8688] CT
N
f1394637256
f
GR
GS
[1 0 0 1 141 87.8688] CT
10.0 ML
2 LW
N
-3 0 M
3 0 L
S
GR
GS
[1 0 0 1 166 87.75115] CT
N
f1394637256
f
GR
GS
[1 0 0 1 166 87.75115] CT
10.0 ML
2 LW
N
-3 0 M
3 0 L
S
GR
GS
1 0 0 RC
1 LJ
2 LW
N
91 170.595 M
91 183.437 L
S
GR
GS
1 0 0 RC
1 LJ
2 LW
N
116 120.812 M
116 133.987 L
S
GR
GS
1 0 0 RC
1 LJ
2 LW
N
141 121.774 M
141 131.469 L
S
GR
GS
1 0 0 RC
1 LJ
2 LW
N
166 66.138 M
166 74.282 L
S
GR
GS
1 0 0 RC
1 LJ
2 LW
N
91 170.595 M
91 157.752 L
S
GR
GS
1 0 0 RC
1 LJ
2 LW
N
116 120.812 M
116 107.637 L
S
GR
GS
1 0 0 RC
1 LJ
2 LW
N
141 121.774 M
141 112.08 L
S
GR
GS
1 0 0 RC
1 LJ
2 LW
N
166 66.138 M
166 57.994 L
S
GR
GS
1 0 0 RC
1 LJ
2 LW
N
91 170.595 M
116 120.812 L
141 121.774 L
166 66.138 L
S
GR
GS
[1 0 0 1 91 183.43689] CT
1 0 0 RC
N
f1394637256
f
GR
GS
[1 0 0 1 91 183.43689] CT
1 0 0 RC
10.0 ML
2 LW
N
-3 0 M
3 0 L
S
GR
GS
[1 0 0 1 116 133.98741] CT
1 0 0 RC
N
f1394637256
f
GR
GS
[1 0 0 1 116 133.98741] CT
1 0 0 RC
10.0 ML
2 LW
N
-3 0 M
3 0 L
S
GR
GS
[1 0 0 1 141 131.46889] CT
1 0 0 RC
N
f1394637256
f
GR
GS
[1 0 0 1 141 131.46889] CT
1 0 0 RC
10.0 ML
2 LW
N
-3 0 M
3 0 L
S
GR
GS
[1 0 0 1 166 74.28201] CT
1 0 0 RC
N
f1394637256
f
GR
GS
[1 0 0 1 166 74.28201] CT
1 0 0 RC
10.0 ML
2 LW
N
-3 0 M
3 0 L
S
GR
GS
[1 0 0 1 91 157.75227] CT
1 0 0 RC
N
f1394637256
f
GR
GS
[1 0 0 1 91 157.75227] CT
1 0 0 RC
10.0 ML
2 LW
N
-3 0 M
3 0 L
S
GR
GS
[1 0 0 1 116 107.63725] CT
1 0 0 RC
N
f1394637256
f
GR
GS
[1 0 0 1 116 107.63725] CT
1 0 0 RC
10.0 ML
2 LW
N
-3 0 M
3 0 L
S
GR
GS
[1 0 0 1 141 112.07986] CT
1 0 0 RC
N
f1394637256
f
GR
GS
[1 0 0 1 141 112.07986] CT
1 0 0 RC
10.0 ML
2 LW
N
-3 0 M
3 0 L
S
GR
GS
[1 0 0 1 166 57.9944] CT
1 0 0 RC
N
f1394637256
f
GR
GS
[1 0 0 1 166 57.9944] CT
1 0 0 RC
10.0 ML
2 LW
N
-3 0 M
3 0 L
S
GR
GS
1 0 0 RC
1 LJ
2 LW
N
91 139.598 M
91 154.153 L
S
GR
GS
1 0 0 RC
1 LJ
2 LW
N
116 94.447 M
116 105.478 L
S
GR
GS
1 0 0 RC
1 LJ
2 LW
N
141 60.539 M
141 70.258 L
S
GR
GS
1 0 0 RC
1 LJ
2 LW
N
166 29.499 M
166 37.498 L
S
GR
GS
1 0 0 RC
1 LJ
2 LW
N
91 139.598 M
91 125.043 L
S
GR
GS
1 0 0 RC
1 LJ
2 LW
N
116 94.447 M
116 83.416 L
S
GR
GS
1 0 0 RC
1 LJ
2 LW
N
141 60.539 M
141 50.819 L
S
GR
GS
1 0 0 RC
1 LJ
2 LW
N
166 29.499 M
166 21.5 L
S
GR
GS
1 0 0 RC
[8 8] 0 setdash
2 LJ
2 LW
N
91 139.598 M
116 94.447 L
141 60.539 L
166 29.499 L
S
GR
GS
[1 0 0 1 91 154.15276] CT
1 0 0 RC
N
f1394637256
f
GR
GS
[1 0 0 1 91 154.15276] CT
1 0 0 RC
10.0 ML
2 LW
N
-3 0 M
3 0 L
S
GR
GS
[1 0 0 1 116 105.47751] CT
1 0 0 RC
N
f1394637256
f
GR
GS
[1 0 0 1 116 105.47751] CT
1 0 0 RC
10.0 ML
2 LW
N
-3 0 M
3 0 L
S
GR
GS
[1 0 0 1 141 70.25822] CT
1 0 0 RC
N
f1394637256
f
GR
GS
[1 0 0 1 141 70.25822] CT
1 0 0 RC
10.0 ML
2 LW
N
-3 0 M
3 0 L
S
GR
GS
[1 0 0 1 166 37.49769] CT
1 0 0 RC
N
f1394637256
f
GR
GS
[1 0 0 1 166 37.49769] CT
1 0 0 RC
10.0 ML
2 LW
N
-3 0 M
3 0 L
S
GR
GS
[1 0 0 1 91 125.04274] CT
1 0 0 RC
N
f1394637256
f
GR
GS
[1 0 0 1 91 125.04274] CT
1 0 0 RC
10.0 ML
2 LW
N
-3 0 M
3 0 L
S
GR
GS
[1 0 0 1 116 83.4157] CT
1 0 0 RC
N
f1394637256
f
GR
GS
[1 0 0 1 116 83.4157] CT
1 0 0 RC
10.0 ML
2 LW
N
-3 0 M
3 0 L
S
GR
GS
[1 0 0 1 141 50.81893] CT
1 0 0 RC
N
f1394637256
f
GR
GS
[1 0 0 1 141 50.81893] CT
1 0 0 RC
10.0 ML
2 LW
N
-3 0 M
3 0 L
S
GR
GS
[1 0 0 1 166 21.5] CT
1 0 0 RC
N
f1394637256
f
GR
GS
[1 0 0 1 166 21.5] CT
1 0 0 RC
10.0 ML
2 LW
N
-3 0 M
3 0 L
S
GR
GS
1 GC
N
/f-867889774{248 238.5 M
347.5 238.5 L
347.5 21.5 L
248 21.5 L
cp}def
f-867889774
f
GR
GS
0.149 GC
2 setlinecap
1 LJ
0.5 LW
N
248 238.5 M
347.5 238.5 L
S
GR
GS
0.149 GC
2 setlinecap
1 LJ
0.5 LW
N
260.438 238.5 M
260.438 236.33 L
S
GR
GS
0.149 GC
2 setlinecap
1 LJ
0.5 LW
N
285.313 238.5 M
285.313 236.33 L
S
GR
GS
0.149 GC
2 setlinecap
1 LJ
0.5 LW
N
310.188 238.5 M
310.188 236.33 L
S
GR
GS
0.149 GC
2 setlinecap
1 LJ
0.5 LW
N
335.063 238.5 M
335.063 236.33 L
S
GR
GS
[1 0 0 1 260.4375 244.09999] CT
0.149 GC
/Helvetica 18 F
GS
[1 0 0 1 0 0] CT
-5.5 18 moveto 
1 -1 scale
(1) t 
GR
GR
GS
[1 0 0 1 285.3125 244.09999] CT
0.149 GC
/Helvetica 18 F
GS
[1 0 0 1 0 0] CT
-5.5 18 moveto 
1 -1 scale
(2) t 
GR
GR
GS
[1 0 0 1 310.1875 244.09999] CT
0.149 GC
/Helvetica 18 F
GS
[1 0 0 1 0 0] CT
-5.5 18 moveto 
1 -1 scale
(3) t 
GR
GR
GS
[1 0 0 1 335.0625 244.09999] CT
0.149 GC
/Helvetica 18 F
GS
[1 0 0 1 0 0] CT
-5.5 18 moveto 
1 -1 scale
(4) t 
GR
GR
GS
[1 0 0 1 297.75006 266.60001] CT
0.149 GC
/Helvetica 18 F
GS
[1 0 0 1 0 0] CT
-28 18 moveto 
1 -1 scale
(feature) t 
GR
GR
GS
0.149 GC
2 setlinecap
1 LJ
0.5 LW
N
248 238.5 M
248 21.5 L
S
GR
GS
0.149 GC
2 setlinecap
1 LJ
0.5 LW
N
248 237.549 M
250.17 237.549 L
S
GR
GS
0.149 GC
2 setlinecap
1 LJ
0.5 LW
N
248 165.533 M
250.17 165.533 L
S
GR
GS
0.149 GC
2 setlinecap
1 LJ
0.5 LW
N
248 93.516 M
250.17 93.516 L
S
GR
GS
0.149 GC
2 setlinecap
1 LJ
0.5 LW
N
248 21.5 M
250.17 21.5 L
S
GR
GS
[1 0 0 1 242.39999 237.54875] CT
0.149 GC
/Helvetica 18 F
GS
[1 0 0 1 0 0] CT
-33 7 moveto 
1 -1 scale
(-0.6) t 
GR
GR
GS
[1 0 0 1 242.39999 165.5325] CT
0.149 GC
/Helvetica 18 F
GS
[1 0 0 1 0 0] CT
-33 7 moveto 
1 -1 scale
(-0.4) t 
GR
GR
GS
[1 0 0 1 242.39999 93.51625] CT
0.149 GC
/Helvetica 18 F
GS
[1 0 0 1 0 0] CT
-33 7 moveto 
1 -1 scale
(-0.2) t 
GR
GR
GS
[1 0 0 1 242.39999 21.5] CT
0.149 GC
/Helvetica 18 F
GS
[1 0 0 1 0 0] CT
-11 7 moveto 
1 -1 scale
(0) t 
GR
GR
GS
[0 -1 1 0 206.89999 129.99989] CT
0.149 GC
/Helvetica 18 F
GS
[1 0 0 1 0 0] CT
-59 -4 moveto 
1 -1 scale
(Drift \(lin. mod.\)) t 
GR
GR
GS
1 LJ
2 LW
N
260.438 218.046 M
260.438 238.5 L
S
GR
GS
1 LJ
2 LW
N
285.313 122.402 M
285.313 142.181 L
S
GR
GS
1 LJ
2 LW
N
310.188 157.162 M
310.188 176.323 L
S
GR
GS
1 LJ
2 LW
N
335.063 135.856 M
335.063 148.659 L
S
GR
GS
1 LJ
2 LW
N
260.438 218.046 M
260.438 197.593 L
S
GR
GS
1 LJ
2 LW
N
285.313 122.402 M
285.313 102.624 L
S
GR
GS
1 LJ
2 LW
N
310.188 157.162 M
310.188 138.001 L
S
GR
GS
1 LJ
2 LW
N
335.063 135.856 M
335.063 123.052 L
S
GR
GS
1 LJ
2 LW
N
260.438 218.046 M
285.313 122.402 L
310.188 157.162 L
335.063 135.856 L
S
GR
GS
[1 0 0 1 260.4375 238.49998] CT
N
f1394637256
f
GR
GS
[1 0 0 1 260.4375 238.49998] CT
10.0 ML
2 LW
N
-3 0 M
3 0 L
S
GR
GS
[1 0 0 1 285.3125 142.18054] CT
N
f1394637256
f
GR
GS
[1 0 0 1 285.3125 142.18054] CT
10.0 ML
2 LW
N
-3 0 M
3 0 L
S
GR
GS
[1 0 0 1 310.1875 176.32297] CT
N
f1394637256
f
GR
GS
[1 0 0 1 310.1875 176.32297] CT
10.0 ML
2 LW
N
-3 0 M
3 0 L
S
GR
GS
[1 0 0 1 335.0625 148.65892] CT
N
f1394637256
f
GR
GS
[1 0 0 1 335.0625 148.65892] CT
10.0 ML
2 LW
N
-3 0 M
3 0 L
S
GR
GS
[1 0 0 1 260.4375 197.59258] CT
N
f1394637256
f
GR
GS
[1 0 0 1 260.4375 197.59258] CT
10.0 ML
2 LW
N
-3 0 M
3 0 L
S
GR
GS
[1 0 0 1 285.3125 102.62384] CT
N
f1394637256
f
GR
GS
[1 0 0 1 285.3125 102.62384] CT
10.0 ML
2 LW
N
-3 0 M
3 0 L
S
GR
GS
[1 0 0 1 310.1875 138.00133] CT
N
f1394637256
f
GR
GS
[1 0 0 1 310.1875 138.00133] CT
10.0 ML
2 LW
N
-3 0 M
3 0 L
S
GR
GS
[1 0 0 1 335.0625 123.05237] CT
N
f1394637256
f
GR
GS
[1 0 0 1 335.0625 123.05237] CT
10.0 ML
2 LW
N
-3 0 M
3 0 L
S
GR
GS
1 LJ
2 LW
N
260.438 177.109 M
260.438 194.517 L
S
GR
GS
1 LJ
2 LW
N
285.313 75.321 M
285.313 94.033 L
S
GR
GS
1 LJ
2 LW
N
310.188 145.507 M
310.188 166.95 L
S
GR
GS
1 LJ
2 LW
N
335.063 102.453 M
335.063 114.657 L
S
GR
GS
1 LJ
2 LW
N
260.438 177.109 M
260.438 159.701 L
S
GR
GS
1 LJ
2 LW
N
285.313 75.321 M
285.313 56.609 L
S
GR
GS
1 LJ
2 LW
N
310.188 145.507 M
310.188 124.065 L
S
GR
GS
1 LJ
2 LW
N
335.063 102.453 M
335.063 90.248 L
S
GR
GS
[8 8] 0 setdash
2 LJ
2 LW
N
260.438 177.109 M
285.313 75.321 L
310.188 145.507 L
335.063 102.453 L
S
GR
GS
[1 0 0 1 260.4375 194.51726] CT
N
f1394637256
f
GR
GS
[1 0 0 1 260.4375 194.51726] CT
10.0 ML
2 LW
N
-3 0 M
3 0 L
S
GR
GS
[1 0 0 1 285.3125 94.03308] CT
N
f1394637256
f
GR
GS
[1 0 0 1 285.3125 94.03308] CT
10.0 ML
2 LW
N
-3 0 M
3 0 L
S
GR
GS
[1 0 0 1 310.1875 166.94972] CT
N
f1394637256
f
GR
GS
[1 0 0 1 310.1875 166.94972] CT
10.0 ML
2 LW
N
-3 0 M
3 0 L
S
GR
GS
[1 0 0 1 335.0625 114.65739] CT
N
f1394637256
f
GR
GS
[1 0 0 1 335.0625 114.65739] CT
10.0 ML
2 LW
N
-3 0 M
3 0 L
S
GR
GS
[1 0 0 1 260.4375 159.70132] CT
N
f1394637256
f
GR
GS
[1 0 0 1 260.4375 159.70132] CT
10.0 ML
2 LW
N
-3 0 M
3 0 L
S
GR
GS
[1 0 0 1 285.3125 56.60931] CT
N
f1394637256
f
GR
GS
[1 0 0 1 285.3125 56.60931] CT
10.0 ML
2 LW
N
-3 0 M
3 0 L
S
GR
GS
[1 0 0 1 310.1875 124.06506] CT
N
f1394637256
f
GR
GS
[1 0 0 1 310.1875 124.06506] CT
10.0 ML
2 LW
N
-3 0 M
3 0 L
S
GR
GS
[1 0 0 1 335.0625 90.24789] CT
N
f1394637256
f
GR
GS
[1 0 0 1 335.0625 90.24789] CT
10.0 ML
2 LW
N
-3 0 M
3 0 L
S
GR
GS
1 0 0 RC
1 LJ
2 LW
N
260.438 154.902 M
260.438 170.754 L
S
GR
GS
1 0 0 RC
1 LJ
2 LW
N
285.313 117.201 M
285.313 130.172 L
S
GR
GS
1 0 0 RC
1 LJ
2 LW
N
310.188 120.794 M
310.188 131.954 L
S
GR
GS
1 0 0 RC
1 LJ
2 LW
N
335.063 71.82 M
335.063 82.631 L
S
GR
GS
1 0 0 RC
1 LJ
2 LW
N
260.438 154.902 M
260.438 139.05 L
S
GR
GS
1 0 0 RC
1 LJ
2 LW
N
285.313 117.201 M
285.313 104.231 L
S
GR
GS
1 0 0 RC
1 LJ
2 LW
N
310.188 120.794 M
310.188 109.635 L
S
GR
GS
1 0 0 RC
1 LJ
2 LW
N
335.063 71.82 M
335.063 61.009 L
S
GR
GS
1 0 0 RC
1 LJ
2 LW
N
260.438 154.902 M
285.313 117.201 L
310.188 120.794 L
335.063 71.82 L
S
GR
GS
[1 0 0 1 260.4375 170.75363] CT
1 0 0 RC
N
f1394637256
f
GR
GS
[1 0 0 1 260.4375 170.75363] CT
1 0 0 RC
10.0 ML
2 LW
N
-3 0 M
3 0 L
S
GR
GS
[1 0 0 1 285.3125 130.17166] CT
1 0 0 RC
N
f1394637256
f
GR
GS
[1 0 0 1 285.3125 130.17166] CT
1 0 0 RC
10.0 ML
2 LW
N
-3 0 M
3 0 L
S
GR
GS
[1 0 0 1 310.1875 131.95384] CT
1 0 0 RC
N
f1394637256
f
GR
GS
[1 0 0 1 310.1875 131.95384] CT
1 0 0 RC
10.0 ML
2 LW
N
-3 0 M
3 0 L
S
GR
GS
[1 0 0 1 335.0625 82.63087] CT
1 0 0 RC
N
f1394637256
f
GR
GS
[1 0 0 1 335.0625 82.63087] CT
1 0 0 RC
10.0 ML
2 LW
N
-3 0 M
3 0 L
S
GR
GS
[1 0 0 1 260.4375 139.05002] CT
1 0 0 RC
N
f1394637256
f
GR
GS
[1 0 0 1 260.4375 139.05002] CT
1 0 0 RC
10.0 ML
2 LW
N
-3 0 M
3 0 L
S
GR
GS
[1 0 0 1 285.3125 104.23108] CT
1 0 0 RC
N
f1394637256
f
GR
GS
[1 0 0 1 285.3125 104.23108] CT
1 0 0 RC
10.0 ML
2 LW
N
-3 0 M
3 0 L
S
GR
GS
[1 0 0 1 310.1875 109.63513] CT
1 0 0 RC
N
f1394637256
f
GR
GS
[1 0 0 1 310.1875 109.63513] CT
1 0 0 RC
10.0 ML
2 LW
N
-3 0 M
3 0 L
S
GR
GS
[1 0 0 1 335.0625 61.00882] CT
1 0 0 RC
N
f1394637256
f
GR
GS
[1 0 0 1 335.0625 61.00882] CT
1 0 0 RC
10.0 ML
2 LW
N
-3 0 M
3 0 L
S
GR
GS
1 0 0 RC
1 LJ
2 LW
N
260.438 135.083 M
260.438 149.946 L
S
GR
GS
1 0 0 RC
1 LJ
2 LW
N
285.313 72.316 M
285.313 85.137 L
S
GR
GS
1 0 0 RC
1 LJ
2 LW
N
310.188 68.194 M
310.188 80.001 L
S
GR
GS
1 0 0 RC
1 LJ
2 LW
N
335.063 30.356 M
335.063 38.398 L
S
GR
GS
1 0 0 RC
1 LJ
2 LW
N
260.438 135.083 M
260.438 120.22 L
S
GR
GS
1 0 0 RC
1 LJ
2 LW
N
285.313 72.316 M
285.313 59.494 L
S
GR
GS
1 0 0 RC
1 LJ
2 LW
N
310.188 68.194 M
310.188 56.387 L
S
GR
GS
1 0 0 RC
1 LJ
2 LW
N
335.063 30.356 M
335.063 22.315 L
S
GR
GS
1 0 0 RC
[8 8] 0 setdash
2 LJ
2 LW
N
260.438 135.083 M
285.313 72.316 L
310.188 68.194 L
335.063 30.356 L
S
GR
GS
[1 0 0 1 260.4375 149.9458] CT
1 0 0 RC
N
f1394637256
f
GR
GS
[1 0 0 1 260.4375 149.9458] CT
1 0 0 RC
10.0 ML
2 LW
N
-3 0 M
3 0 L
S
GR
GS
[1 0 0 1 285.3125 85.13722] CT
1 0 0 RC
N
f1394637256
f
GR
GS
[1 0 0 1 285.3125 85.13722] CT
1 0 0 RC
10.0 ML
2 LW
N
-3 0 M
3 0 L
S
GR
GS
[1 0 0 1 310.1875 80.00093] CT
1 0 0 RC
N
f1394637256
f
GR
GS
[1 0 0 1 310.1875 80.00093] CT
1 0 0 RC
10.0 ML
2 LW
N
-3 0 M
3 0 L
S
GR
GS
[1 0 0 1 335.0625 38.3975] CT
1 0 0 RC
N
f1394637256
f
GR
GS
[1 0 0 1 335.0625 38.3975] CT
1 0 0 RC
10.0 ML
2 LW
N
-3 0 M
3 0 L
S
GR
GS
[1 0 0 1 260.4375 120.22044] CT
1 0 0 RC
N
f1394637256
f
GR
GS
[1 0 0 1 260.4375 120.22044] CT
1 0 0 RC
10.0 ML
2 LW
N
-3 0 M
3 0 L
S
GR
GS
[1 0 0 1 285.3125 59.49392] CT
1 0 0 RC
N
f1394637256
f
GR
GS
[1 0 0 1 285.3125 59.49392] CT
1 0 0 RC
10.0 ML
2 LW
N
-3 0 M
3 0 L
S
GR
GS
[1 0 0 1 310.1875 56.38678] CT
1 0 0 RC
N
f1394637256
f
GR
GS
[1 0 0 1 310.1875 56.38678] CT
1 0 0 RC
10.0 ML
2 LW
N
-3 0 M
3 0 L
S
GR
GS
[1 0 0 1 335.0625 22.31502] CT
1 0 0 RC
N
f1394637256
f
GR
GS
[1 0 0 1 335.0625 22.31502] CT
1 0 0 RC
10.0 ML
2 LW
N
-3 0 M
3 0 L
S
GR
%%Trailer
%%Pages: 1
%%EOF
