%!PS-Adobe-3.0 EPSF-3.0
%%Creator: (MATLAB, The Mathworks, Inc. Version 9.7.0.1190202 \(R2019b\). Operating System: Mac OS X)
%%Title: /Users/julian.kosciessa/Volumes/tardis/LNDG/stateswitch/stsw_beh_task/hddm_matched/figures/D_compareYAOA_vat_linearEffects.eps
%%CreationDate: 2023-07-11T11:10:36
%%Pages: (atend)
%%BoundingBox:    59     0   646   215
%%LanguageLevel: 3
%%EndComments
%%BeginProlog
%%BeginResource: procset (Apache XML Graphics Std ProcSet) 1.2 0
%%Version: 1.2 0
%%Copyright: (Copyright 2001-2003,2010 The Apache Software Foundation. License terms: http://www.apache.org/licenses/LICENSE-2.0)
/bd{bind def}bind def
/ld{load def}bd
/GR/grestore ld
/GS/gsave ld
/RM/rmoveto ld
/C/curveto ld
/t/show ld
/L/lineto ld
/ML/setmiterlimit ld
/CT/concat ld
/f/fill ld
/N/newpath ld
/S/stroke ld
/CC/setcmykcolor ld
/A/ashow ld
/cp/closepath ld
/RC/setrgbcolor ld
/LJ/setlinejoin ld
/GC/setgray ld
/LW/setlinewidth ld
/M/moveto ld
/re {4 2 roll M
1 index 0 rlineto
0 exch rlineto
neg 0 rlineto
cp } bd
/_ctm matrix def
/_tm matrix def
/BT { _ctm currentmatrix pop matrix _tm copy pop 0 0 moveto } bd
/ET { _ctm setmatrix } bd
/iTm { _ctm setmatrix _tm concat } bd
/Tm { _tm astore pop iTm 0 0 moveto } bd
/ux 0.0 def
/uy 0.0 def
/F {
  /Tp exch def
  /Tf exch def
  Tf findfont Tp scalefont setfont
  /cf Tf def  /cs Tp def
} bd
/ULS {currentpoint /uy exch def /ux exch def} bd
/ULE {
  /Tcx currentpoint pop def
  gsave
  newpath
  cf findfont cs scalefont dup
  /FontMatrix get 0 get /Ts exch def /FontInfo get dup
  /UnderlinePosition get Ts mul /To exch def
  /UnderlineThickness get Ts mul /Tt exch def
  ux uy To add moveto  Tcx uy To add lineto
  Tt setlinewidth stroke
  grestore
} bd
/OLE {
  /Tcx currentpoint pop def
  gsave
  newpath
  cf findfont cs scalefont dup
  /FontMatrix get 0 get /Ts exch def /FontInfo get dup
  /UnderlinePosition get Ts mul /To exch def
  /UnderlineThickness get Ts mul /Tt exch def
  ux uy To add cs add moveto Tcx uy To add cs add lineto
  Tt setlinewidth stroke
  grestore
} bd
/SOE {
  /Tcx currentpoint pop def
  gsave
  newpath
  cf findfont cs scalefont dup
  /FontMatrix get 0 get /Ts exch def /FontInfo get dup
  /UnderlinePosition get Ts mul /To exch def
  /UnderlineThickness get Ts mul /Tt exch def
  ux uy To add cs 10 mul 26 idiv add moveto Tcx uy To add cs 10 mul 26 idiv add lineto
  Tt setlinewidth stroke
  grestore
} bd
/QT {
/Y22 exch store
/X22 exch store
/Y21 exch store
/X21 exch store
currentpoint
/Y21 load 2 mul add 3 div exch
/X21 load 2 mul add 3 div exch
/X21 load 2 mul /X22 load add 3 div
/Y21 load 2 mul /Y22 load add 3 div
/X22 load /Y22 load curveto
} bd
/SSPD {
dup length /d exch dict def
{
/v exch def
/k exch def
currentpagedevice k known {
/cpdv currentpagedevice k get def
v cpdv ne {
/upd false def
/nullv v type /nulltype eq def
/nullcpdv cpdv type /nulltype eq def
nullv nullcpdv or
{
/upd true def
} {
/sametype v type cpdv type eq def
sametype {
v type /arraytype eq {
/vlen v length def
/cpdvlen cpdv length def
vlen cpdvlen eq {
0 1 vlen 1 sub {
/i exch def
/obj v i get def
/cpdobj cpdv i get def
obj cpdobj ne {
/upd true def
exit
} if
} for
} {
/upd true def
} ifelse
} {
v type /dicttype eq {
v {
/dv exch def
/dk exch def
/cpddv cpdv dk get def
dv cpddv ne {
/upd true def
exit
} if
} forall
} {
/upd true def
} ifelse
} ifelse
} if
} ifelse
upd true eq {
d k v put
} if
} if
} if
} forall
d length 0 gt {
d setpagedevice
} if
} bd
/RE { % /NewFontName [NewEncodingArray] /FontName RE -
  findfont dup length dict begin
  {
    1 index /FID ne
    {def} {pop pop} ifelse
  } forall
  /Encoding exch def
  /FontName 1 index def
  currentdict definefont pop
  end
} bind def
%%EndResource
%%BeginResource: procset (Apache XML Graphics EPS ProcSet) 1.0 0
%%Version: 1.0 0
%%Copyright: (Copyright 2002-2003 The Apache Software Foundation. License terms: http://www.apache.org/licenses/LICENSE-2.0)
/BeginEPSF { %def
/b4_Inc_state save def         % Save state for cleanup
/dict_count countdictstack def % Count objects on dict stack
/op_count count 1 sub def      % Count objects on operand stack
userdict begin                 % Push userdict on dict stack
/showpage { } def              % Redefine showpage, { } = null proc
0 setgray 0 setlinecap         % Prepare graphics state
1 setlinewidth 0 setlinejoin
10 setmiterlimit [ ] 0 setdash newpath
/languagelevel where           % If level not equal to 1 then
{pop languagelevel             % set strokeadjust and
1 ne                           % overprint to their defaults.
{false setstrokeadjust false setoverprint
} if
} if
} bd
/EndEPSF { %def
count op_count sub {pop} repeat            % Clean up stacks
countdictstack dict_count sub {end} repeat
b4_Inc_state restore
} bd
%%EndResource
%FOPBeginFontDict
%%IncludeResource: font Courier-Oblique
%%IncludeResource: font Courier-BoldOblique
%%IncludeResource: font Courier-Bold
%%IncludeResource: font ZapfDingbats
%%IncludeResource: font Symbol
%%IncludeResource: font Helvetica
%%IncludeResource: font Helvetica-Oblique
%%IncludeResource: font Helvetica-Bold
%%IncludeResource: font Helvetica-BoldOblique
%%IncludeResource: font Times-Roman
%%IncludeResource: font Times-Italic
%%IncludeResource: font Times-Bold
%%IncludeResource: font Times-BoldItalic
%%IncludeResource: font Courier
%FOPEndFontDict
%%BeginResource: encoding WinAnsiEncoding
/WinAnsiEncoding [
/.notdef /.notdef /.notdef /.notdef /.notdef
/.notdef /.notdef /.notdef /.notdef /.notdef
/.notdef /.notdef /.notdef /.notdef /.notdef
/.notdef /.notdef /.notdef /.notdef /.notdef
/.notdef /.notdef /.notdef /.notdef /.notdef
/.notdef /.notdef /.notdef /.notdef /.notdef
/.notdef /.notdef /space /exclam /quotedbl
/numbersign /dollar /percent /ampersand /quotesingle
/parenleft /parenright /asterisk /plus /comma
/hyphen /period /slash /zero /one
/two /three /four /five /six
/seven /eight /nine /colon /semicolon
/less /equal /greater /question /at
/A /B /C /D /E
/F /G /H /I /J
/K /L /M /N /O
/P /Q /R /S /T
/U /V /W /X /Y
/Z /bracketleft /backslash /bracketright /asciicircum
/underscore /quoteleft /a /b /c
/d /e /f /g /h
/i /j /k /l /m
/n /o /p /q /r
/s /t /u /v /w
/x /y /z /braceleft /bar
/braceright /asciitilde /bullet /Euro /bullet
/quotesinglbase /florin /quotedblbase /ellipsis /dagger
/daggerdbl /circumflex /perthousand /Scaron /guilsinglleft
/OE /bullet /Zcaron /bullet /bullet
/quoteleft /quoteright /quotedblleft /quotedblright /bullet
/endash /emdash /asciitilde /trademark /scaron
/guilsinglright /oe /bullet /zcaron /Ydieresis
/space /exclamdown /cent /sterling /currency
/yen /brokenbar /section /dieresis /copyright
/ordfeminine /guillemotleft /logicalnot /sfthyphen /registered
/macron /degree /plusminus /twosuperior /threesuperior
/acute /mu /paragraph /middot /cedilla
/onesuperior /ordmasculine /guillemotright /onequarter /onehalf
/threequarters /questiondown /Agrave /Aacute /Acircumflex
/Atilde /Adieresis /Aring /AE /Ccedilla
/Egrave /Eacute /Ecircumflex /Edieresis /Igrave
/Iacute /Icircumflex /Idieresis /Eth /Ntilde
/Ograve /Oacute /Ocircumflex /Otilde /Odieresis
/multiply /Oslash /Ugrave /Uacute /Ucircumflex
/Udieresis /Yacute /Thorn /germandbls /agrave
/aacute /acircumflex /atilde /adieresis /aring
/ae /ccedilla /egrave /eacute /ecircumflex
/edieresis /igrave /iacute /icircumflex /idieresis
/eth /ntilde /ograve /oacute /ocircumflex
/otilde /odieresis /divide /oslash /ugrave
/uacute /ucircumflex /udieresis /yacute /thorn
/ydieresis
] def
%%EndResource
%FOPBeginFontReencode
/Courier-Oblique findfont
dup length dict begin
  {1 index /FID ne {def} {pop pop} ifelse} forall
  /Encoding WinAnsiEncoding def
  currentdict
end
/Courier-Oblique exch definefont pop
/Courier-BoldOblique findfont
dup length dict begin
  {1 index /FID ne {def} {pop pop} ifelse} forall
  /Encoding WinAnsiEncoding def
  currentdict
end
/Courier-BoldOblique exch definefont pop
/Courier-Bold findfont
dup length dict begin
  {1 index /FID ne {def} {pop pop} ifelse} forall
  /Encoding WinAnsiEncoding def
  currentdict
end
/Courier-Bold exch definefont pop
/Helvetica findfont
dup length dict begin
  {1 index /FID ne {def} {pop pop} ifelse} forall
  /Encoding WinAnsiEncoding def
  currentdict
end
/Helvetica exch definefont pop
/Helvetica-Oblique findfont
dup length dict begin
  {1 index /FID ne {def} {pop pop} ifelse} forall
  /Encoding WinAnsiEncoding def
  currentdict
end
/Helvetica-Oblique exch definefont pop
/Helvetica-Bold findfont
dup length dict begin
  {1 index /FID ne {def} {pop pop} ifelse} forall
  /Encoding WinAnsiEncoding def
  currentdict
end
/Helvetica-Bold exch definefont pop
/Helvetica-BoldOblique findfont
dup length dict begin
  {1 index /FID ne {def} {pop pop} ifelse} forall
  /Encoding WinAnsiEncoding def
  currentdict
end
/Helvetica-BoldOblique exch definefont pop
/Times-Roman findfont
dup length dict begin
  {1 index /FID ne {def} {pop pop} ifelse} forall
  /Encoding WinAnsiEncoding def
  currentdict
end
/Times-Roman exch definefont pop
/Times-Italic findfont
dup length dict begin
  {1 index /FID ne {def} {pop pop} ifelse} forall
  /Encoding WinAnsiEncoding def
  currentdict
end
/Times-Italic exch definefont pop
/Times-Bold findfont
dup length dict begin
  {1 index /FID ne {def} {pop pop} ifelse} forall
  /Encoding WinAnsiEncoding def
  currentdict
end
/Times-Bold exch definefont pop
/Times-BoldItalic findfont
dup length dict begin
  {1 index /FID ne {def} {pop pop} ifelse} forall
  /Encoding WinAnsiEncoding def
  currentdict
end
/Times-BoldItalic exch definefont pop
/Courier findfont
dup length dict begin
  {1 index /FID ne {def} {pop pop} ifelse} forall
  /Encoding WinAnsiEncoding def
  currentdict
end
/Courier exch definefont pop
%FOPEndFontReencode
%%EndProlog
%%Page: 1 1
%%PageBoundingBox: 0 0 691 223
%%BeginPageSetup
[1 0 0 -1 0 223] CT
%%EndPageSetup
GS
[1.00029 0 0 1.00179 0 -0.39999] CT
1 GC
N
0 0 691 223 re
f
GR
GS
[1.00029 0 0 1.00179 0 -0.39999] CT
1 GC
N
0 0 691 223 re
f
GR
GS
[1.00029 0 0 1.00179 0 -0.39999] CT
1 GC
N
129.5 163.5 M
237.5 163.5 L
237.5 32 L
129.5 32 L
cp
f
GR
GS
[1.00029 0 0 1.00179 0 -0.39999] CT
0.149 GC
2 setlinecap
1 LJ
0.5 LW
N
129.5 163.5 M
237.5 163.5 L
S
GR
GS
[1.00029 0 0 1.00179 0 -0.39999] CT
0.149 GC
2 setlinecap
1 LJ
0.5 LW
N
161.9 163.5 M
161.9 162.185 L
S
GR
GS
[1.00029 0 0 1.00179 0 -0.39999] CT
0.149 GC
2 setlinecap
1 LJ
0.5 LW
N
205.1 163.5 M
205.1 162.185 L
S
GR
GS
[1.00029 0 0 1.00179 161.94686 169.80475] CT
0.149 GC
/Helvetica 22 F
GS
[1 0 0 1 0 0] CT
-14.5 21 moveto 
1 -1 scale
(YA) t 
GR
GR
GS
[1.00029 0 0 1.00179 205.15937 169.80475] CT
0.149 GC
/Helvetica 22 F
GS
[1 0 0 1 0 0] CT
-15.5 21 moveto 
1 -1 scale
(OA) t 
GR
GR
GS
[1.00029 0 0 1.00179 183.55316 196.85318] CT
0.149 GC
/Helvetica 22 F
GS
[1 0 0 1 0 0] CT
-53.5 21 moveto 
1 -1 scale
(Age Group) t 
GR
GR
GS
[1.00029 0 0 1.00179 0 -0.39999] CT
0.149 GC
2 setlinecap
1 LJ
0.5 LW
N
129.5 163.5 M
129.5 32 L
S
GR
GS
[1.00029 0 0 1.00179 0 -0.39999] CT
0.149 GC
2 setlinecap
1 LJ
0.5 LW
N
129.5 139.581 M
130.815 139.581 L
S
GR
GS
[1.00029 0 0 1.00179 0 -0.39999] CT
0.149 GC
2 setlinecap
1 LJ
0.5 LW
N
129.5 96.313 M
130.815 96.313 L
S
GR
GS
[1.00029 0 0 1.00179 0 -0.39999] CT
0.149 GC
2 setlinecap
1 LJ
0.5 LW
N
129.5 53.044 M
130.815 53.044 L
S
GR
GS
[1.00029 0 0 1.00179 123.13563 139.4314] CT
0.149 GC
/Helvetica 22 F
GS
[1 0 0 1 0 0] CT
-40 8 moveto 
1 -1 scale
(-0.4) t 
GR
GR
GS
[1.00029 0 0 1.00179 123.13563 96.08548] CT
0.149 GC
/Helvetica 22 F
GS
[1 0 0 1 0 0] CT
-40 8 moveto 
1 -1 scale
(-0.2) t 
GR
GR
GS
[1.00029 0 0 1.00179 123.13563 52.73955] CT
0.149 GC
/Helvetica 22 F
GS
[1 0 0 1 0 0] CT
-13 8 moveto 
1 -1 scale
(0) t 
GR
GR
GS
[0 -1.00179 1.00029 0 80.62333 97.52528] CT
0.149 GC
/Helvetica 22 F
GS
[1 0 0 1 0 0] CT
-50.5 -5 moveto 
1 -1 scale
(Drift linear) t 
GR
GR
GS
[1.00029 0 0 1.00179 183.55328 28.90247] CT
/Helvetica-Bold 22 F
GS
[1 0 0 1 0 0] CT
-78 -5 moveto 
1 -1 scale
(p = 0.00018898) t 
GR
GR
GS
[1.00029 0 0 1.00179 0 -0.39999] CT
0.149 GC
1 LJ
0.5 LW
N
129.5 53.044 M
237.5 53.044 L
S
GR
GS
[1.00029 0 0 1.00179 0 -0.39999] CT
0.6 0.902 1 RC
N
144.62 53.044 M
144.62 122.149 L
179.18 122.149 L
179.18 53.044 L
cp
f
GR
GS
[1.00029 0 0 1.00179 154.26232 133.57678] CT
0.302 GC
N
2.236 0 M
2.236 -1.235 1.235 -2.236 0 -2.236 C
-1.235 -2.236 -2.236 -1.235 -2.236 0 C
-2.236 1.235 -1.235 2.236 0 2.236 C
1.235 2.236 2.236 1.235 2.236 0 C
cp
f
GR
GS
[1.00029 0 0 1.00179 166.8432 124.24578] CT
0.302 GC
N
/f-1586420743{2.236 0 M
2.236 -1.235 1.235 -2.236 0 -2.236 C
-1.235 -2.236 -2.236 -1.235 -2.236 0 C
-2.236 1.235 -1.235 2.236 0 2.236 C
1.235 2.236 2.236 1.235 2.236 0 C
cp}def
f-1586420743
f
GR
GS
[1.00029 0 0 1.00179 165.3973 96.26373] CT
0.302 GC
N
f-1586420743
f
GR
GS
[1.00029 0 0 1.00179 166.61067 105.41777] CT
0.302 GC
N
f-1586420743
f
GR
GS
[1.00029 0 0 1.00179 168.30319 92.52654] CT
0.302 GC
N
f-1586420743
f
GR
GS
[1.00029 0 0 1.00179 156.97284 113.17463] CT
0.302 GC
N
f-1586420743
f
GR
GS
[1.00029 0 0 1.00179 165.10987 110.12928] CT
0.302 GC
N
f-1586420743
f
GR
GS
[1.00029 0 0 1.00179 170.07854 132.80815] CT
0.302 GC
N
f-1586420743
f
GR
GS
[1.00029 0 0 1.00179 158.24332 153.39365] CT
0.302 GC
N
f-1586420743
f
GR
GS
[1.00029 0 0 1.00179 155.03609 31.6574] CT
0.302 GC
N
f-1586420743
f
GR
GS
[1.00029 0 0 1.00179 163.39619 75.23384] CT
0.302 GC
N
f-1586420743
f
GR
GS
[1.00029 0 0 1.00179 163.45576 143.87979] CT
0.302 GC
N
f-1586420743
f
GR
GS
[1.00029 0 0 1.00179 162.09357 86.41941] CT
0.302 GC
N
f-1586420743
f
GR
GS
[1.00029 0 0 1.00179 170.52788 113.19663] CT
0.302 GC
N
f-1586420743
f
GR
GS
[1.00029 0 0 1.00179 167.39391 107.23342] CT
0.302 GC
N
f-1586420743
f
GR
GS
[1.00029 0 0 1.00179 163.77887 88.23619] CT
0.302 GC
N
f-1586420743
f
GR
GS
[1.00029 0 0 1.00179 153.67493 125.43411] CT
0.302 GC
N
f-1586420743
f
GR
GS
[1.00029 0 0 1.00179 154.46404 76.76588] CT
0.302 GC
N
f-1586420743
f
GR
GS
[1.00029 0 0 1.00179 162.77954 105.93251] CT
0.302 GC
N
f-1586420743
f
GR
GS
[1.00029 0 0 1.00179 165.07871 124.50647] CT
0.302 GC
N
f-1586420743
f
GR
GS
[1.00029 0 0 1.00179 168.07105 109.96258] CT
0.302 GC
N
f-1586420743
f
GR
GS
[1.00029 0 0 1.00179 157.22105 108.07077] CT
0.302 GC
N
f-1586420743
f
GR
GS
[1.00029 0 0 1.00179 165.3691 133.47543] CT
0.302 GC
N
f-1586420743
f
GR
GS
[1.00029 0 0 1.00179 155.68627 97.55359] CT
0.302 GC
N
f-1586420743
f
GR
GS
[1.00029 0 0 1.00179 158.58272 134.28241] CT
0.302 GC
N
f-1586420743
f
GR
GS
[1.00029 0 0 1.00179 156.02876 154.17144] CT
0.302 GC
N
f-1586420743
f
GR
GS
[1.00029 0 0 1.00179 160.91094 156.49012] CT
0.302 GC
N
f-1586420743
f
GR
GS
[1.00029 0 0 1.00179 169.05827 163.15334] CT
0.302 GC
N
f-1586420743
f
GR
GS
[1.00029 0 0 1.00179 159.20064 113.26209] CT
0.302 GC
N
f-1586420743
f
GR
GS
[1.00029 0 0 1.00179 162.64909 82.72138] CT
0.302 GC
N
f-1586420743
f
GR
GS
[1.00029 0 0 1.00179 169.15052 161.94199] CT
0.302 GC
N
f-1586420743
f
GR
GS
[1.00029 0 0 1.00179 154.42925 129.6963] CT
0.302 GC
N
f-1586420743
f
GR
GS
[1.00029 0 0 1.00179 167.84552 158.17342] CT
0.302 GC
N
f-1586420743
f
GR
GS
[1.00029 0 0 1.00179 154.52734 100.15187] CT
0.302 GC
N
f-1586420743
f
GR
GS
[1.00029 0 0 1.00179 169.03745 163.39328] CT
0.302 GC
N
f-1586420743
f
GR
GS
[1.00029 0 0 1.00179 167.9746 136.13047] CT
0.302 GC
N
f-1586420743
f
GR
GS
[1.00029 0 0 1.00179 158.33341 139.65175] CT
0.302 GC
N
f-1586420743
f
GR
GS
[1.00029 0 0 1.00179 168.7402 98.74941] CT
0.302 GC
N
f-1586420743
f
GR
GS
[1.00029 0 0 1.00179 160.67615 150.71116] CT
0.302 GC
N
f-1586420743
f
GR
GS
[1.00029 0 0 1.00179 162.44779 155.01169] CT
0.302 GC
N
f-1586420743
f
GR
GS
[1.00029 0 0 1.00179 155.96669 131.96473] CT
0.302 GC
N
f-1586420743
f
GR
GS
[1.00029 0 0 1.00179 169.70923 148.46599] CT
0.302 GC
N
f-1586420743
f
GR
GS
[1.00029 0 0 1.00179 158.50745 156.40692] CT
0.302 GC
N
f-1586420743
f
GR
GS
[1.00029 0 0 1.00179 160.24531 122.56015] CT
0.302 GC
N
f-1586420743
f
GR
GS
[1.00029 0 0 1.00179 157.93011 159.62635] CT
0.302 GC
N
f-1586420743
f
GR
GS
[1.00029 0 0 1.00179 170.27754 104.73072] CT
0.302 GC
N
f-1586420743
f
GR
GS
[1.00029 0 0 1.00179 164.55081 126.874] CT
0.302 GC
N
f-1586420743
f
GR
GS
[1.00029 0 0 1.00179 160.22785 115.62731] CT
0.302 GC
N
f-1586420743
f
GR
GS
[1.00029 0 0 1.00179 154.21693 123.37144] CT
0.302 GC
N
f-1586420743
f
GR
GS
[1.00029 0 0 1.00179 0 -0.39999] CT
0.6 0.902 1 RC
N
/f269018616{187.82 53.044 M
187.82 102.976 L
222.38 102.976 L
222.38 53.044 L
cp}def
f269018616
f
GR
GS
[1.00029 0 0 1.00179 199.16382 111.54522] CT
0.302 GC
N
f-1586420743
f
GR
GS
[1.00029 0 0 1.00179 199.07612 141.73184] CT
0.302 GC
N
f-1586420743
f
GR
GS
[1.00029 0 0 1.00179 207.77292 85.79519] CT
0.302 GC
N
f-1586420743
f
GR
GS
[1.00029 0 0 1.00179 205.55275 60.74822] CT
0.302 GC
N
f-1586420743
f
GR
GS
[1.00029 0 0 1.00179 209.49222 133.11149] CT
0.302 GC
N
f-1586420743
f
GR
GS
[1.00029 0 0 1.00179 209.5884 92.69456] CT
0.302 GC
N
f-1586420743
f
GR
GS
[1.00029 0 0 1.00179 206.50163 141.39226] CT
0.302 GC
N
f-1586420743
f
GR
GS
[1.00029 0 0 1.00179 199.89132 117.66689] CT
0.302 GC
N
f-1586420743
f
GR
GS
[1.00029 0 0 1.00179 202.44463 114.78632] CT
0.302 GC
N
f-1586420743
f
GR
GS
[1.00029 0 0 1.00179 213.54904 114.26922] CT
0.302 GC
N
f-1586420743
f
GR
GS
[1.00029 0 0 1.00179 200.77087 119.85487] CT
0.302 GC
N
f-1586420743
f
GR
GS
[1.00029 0 0 1.00179 206.20409 82.75674] CT
0.302 GC
N
f-1586420743
f
GR
GS
[1.00029 0 0 1.00179 200.33452 144.12411] CT
0.302 GC
N
f-1586420743
f
GR
GS
[1.00029 0 0 1.00179 210.73029 132.47728] CT
0.302 GC
N
f-1586420743
f
GR
GS
[1.00029 0 0 1.00179 207.43187 99.07271] CT
0.302 GC
N
f-1586420743
f
GR
GS
[1.00029 0 0 1.00179 202.79095 121.96218] CT
0.302 GC
N
f-1586420743
f
GR
GS
[1.00029 0 0 1.00179 199.62097 96.3792] CT
0.302 GC
N
f-1586420743
f
GR
GS
[1.00029 0 0 1.00179 211.25896 105.1552] CT
0.302 GC
N
f-1586420743
f
GR
GS
[1.00029 0 0 1.00179 202.58803 104.85187] CT
0.302 GC
N
f-1586420743
f
GR
GS
[1.00029 0 0 1.00179 202.13141 55.0833] CT
0.302 GC
N
f-1586420743
f
GR
GS
[1.00029 0 0 1.00179 213.39725 99.48311] CT
0.302 GC
N
f-1586420743
f
GR
GS
[1.00029 0 0 1.00179 203.0893 106.63714] CT
0.302 GC
N
f-1586420743
f
GR
GS
[1.00029 0 0 1.00179 197.87261 86.20781] CT
0.302 GC
N
f-1586420743
f
GR
GS
[1.00029 0 0 1.00179 205.76547 85.47422] CT
0.302 GC
N
f-1586420743
f
GR
GS
[1.00029 0 0 1.00179 202.54485 91.73208] CT
0.302 GC
N
f-1586420743
f
GR
GS
[1.00029 0 0 1.00179 208.55301 119.14574] CT
0.302 GC
N
f-1586420743
f
GR
GS
[1.00029 0 0 1.00179 204.38444 124.467] CT
0.302 GC
N
f-1586420743
f
GR
GS
[1.00029 0 0 1.00179 199.19361 92.94941] CT
0.302 GC
N
f-1586420743
f
GR
GS
[1.00029 0 0 1.00179 197.29785 134.89572] CT
0.302 GC
N
f-1586420743
f
GR
GS
[1.00029 0 0 1.00179 206.28284 123.9129] CT
0.302 GC
N
f-1586420743
f
GR
GS
[1.00029 0 0 1.00179 200.27223 80.38813] CT
0.302 GC
N
f-1586420743
f
GR
GS
[1.00029 0 0 1.00179 207.34702 121.12631] CT
0.302 GC
N
f-1586420743
f
GR
GS
[1.00029 0 0 1.00179 205.44858 74.64663] CT
0.302 GC
N
f-1586420743
f
GR
GS
[1.00029 0 0 1.00179 212.90467 100.2278] CT
0.302 GC
N
f-1586420743
f
GR
GS
[1.00029 0 0 1.00179 197.51142 97.3615] CT
0.302 GC
N
f-1586420743
f
GR
GS
[1.00029 0 0 1.00179 209.04361 97.09925] CT
0.302 GC
N
f-1586420743
f
GR
GS
[1.00029 0 0 1.00179 198.30468 70.12427] CT
0.302 GC
N
f-1586420743
f
GR
GS
[1.00029 0 0 1.00179 208.13611 101.12367] CT
0.302 GC
N
f-1586420743
f
GR
GS
[1.00029 0 0 1.00179 207.73629 99.70985] CT
0.302 GC
N
f-1586420743
f
GR
GS
[1.00029 0 0 1.00179 204.89874 117.22284] CT
0.302 GC
N
f-1586420743
f
GR
GS
[1.00029 0 0 1.00179 203.46123 52.83416] CT
0.302 GC
N
f-1586420743
f
GR
GS
[1.00029 0 0 1.00179 213.27598 92.6877] CT
0.302 GC
N
f-1586420743
f
GR
GS
[1.00029 0 0 1.00179 204.03164 106.04218] CT
0.302 GC
N
f-1586420743
f
GR
GS
[1.00029 0 0 1.00179 199.14637 114.63996] CT
0.302 GC
N
f-1586420743
f
GR
GS
[1.00029 0 0 1.00179 207.12268 83.98783] CT
0.302 GC
N
f-1586420743
f
GR
GS
[1.00029 0 0 1.00179 202.86931 100.0911] CT
0.302 GC
N
f-1586420743
f
GR
GS
[1.00029 0 0 1.00179 206.45584 103.4989] CT
0.302 GC
N
f-1586420743
f
GR
GS
[1.00029 0 0 1.00179 213.57677 111.68382] CT
0.302 GC
N
f-1586420743
f
GR
GS
[1.00029 0 0 1.00179 205.72776 113.11984] CT
0.302 GC
N
f-1586420743
f
GR
GS
[1.00029 0 0 1.00179 200.02878 85.64149] CT
0.302 GC
N
f-1586420743
f
GR
GS
[1.00029 0 0 1.00179 199.27472 132.50142] CT
0.302 GC
N
f-1586420743
f
GR
GS
[1.00029 0 0 1.00179 202.60349 70.81166] CT
0.302 GC
N
f-1586420743
f
GR
GS
[1.00029 0 0 1.00179 196.77325 79.40909] CT
0.302 GC
N
f-1586420743
f
GR
GS
[1.00029 0 0 1.00179 0 -0.39999] CT
1 GC
N
/f1304554348{323.5 163.5 M
431.5 163.5 L
431.5 32 L
323.5 32 L
cp}def
f1304554348
f
GR
GS
[1.00029 0 0 1.00179 0 -0.39999] CT
0.149 GC
2 setlinecap
1 LJ
0.5 LW
N
323.5 163.5 M
431.5 163.5 L
S
GR
GS
[1.00029 0 0 1.00179 0 -0.39999] CT
0.149 GC
2 setlinecap
1 LJ
0.5 LW
N
355.9 163.5 M
355.9 162.185 L
S
GR
GS
[1.00029 0 0 1.00179 0 -0.39999] CT
0.149 GC
2 setlinecap
1 LJ
0.5 LW
N
399.1 163.5 M
399.1 162.185 L
S
GR
GS
[1.00029 0 0 1.00179 356.00301 169.80475] CT
0.149 GC
/Helvetica 22 F
GS
[1 0 0 1 0 0] CT
-14.5 21 moveto 
1 -1 scale
(YA) t 
GR
GR
GS
[1.00029 0 0 1.00179 399.21553 169.80475] CT
0.149 GC
/Helvetica 22 F
GS
[1 0 0 1 0 0] CT
-15.5 21 moveto 
1 -1 scale
(OA) t 
GR
GR
GS
[1.00029 0 0 1.00179 377.60933 196.85319] CT
0.149 GC
/Helvetica 22 F
GS
[1 0 0 1 0 0] CT
-53.5 21 moveto 
1 -1 scale
(Age Group) t 
GR
GR
GS
[1.00029 0 0 1.00179 0 -0.39999] CT
0.149 GC
2 setlinecap
1 LJ
0.5 LW
N
323.5 163.5 M
323.5 32 L
S
GR
GS
[1.00029 0 0 1.00179 0 -0.39999] CT
0.149 GC
2 setlinecap
1 LJ
0.5 LW
N
323.5 149.717 M
324.815 149.717 L
S
GR
GS
[1.00029 0 0 1.00179 0 -0.39999] CT
0.149 GC
2 setlinecap
1 LJ
0.5 LW
N
323.5 102.175 M
324.815 102.175 L
S
GR
GS
[1.00029 0 0 1.00179 0 -0.39999] CT
0.149 GC
2 setlinecap
1 LJ
0.5 LW
N
323.5 54.633 M
324.815 54.633 L
S
GR
GS
[1.00029 0 0 1.00179 317.19179 149.58533] CT
0.149 GC
/Helvetica 22 F
GS
[1 0 0 1 0 0] CT
-13 8 moveto 
1 -1 scale
(0) t 
GR
GR
GS
[1.00029 0 0 1.00179 317.19179 101.95823] CT
0.149 GC
/Helvetica 22 F
GS
[1 0 0 1 0 0] CT
-31 8 moveto 
1 -1 scale
(0.1) t 
GR
GR
GS
[1.00029 0 0 1.00179 317.19179 54.33113] CT
0.149 GC
/Helvetica 22 F
GS
[1 0 0 1 0 0] CT
-31 8 moveto 
1 -1 scale
(0.2) t 
GR
GR
GS
[0 -1.00179 1.00029 0 283.18195 97.52528] CT
0.149 GC
/Helvetica 22 F
GS
[1 0 0 1 0 0] CT
-78.5 -5 moveto 
1 -1 scale
(Threshold linear) t 
GR
GR
GS
[1.00029 0 0 1.00179 377.60963 28.90247] CT
/Helvetica-Bold 22 F
GS
[1 0 0 1 0 0] CT
-59.5 -5 moveto 
1 -1 scale
(p = 0.11423) t 
GR
GR
GS
[1.00029 0 0 1.00179 0 -0.39999] CT
0.149 GC
1 LJ
0.5 LW
N
323.5 149.717 M
431.5 149.717 L
S
GR
GS
[1.00029 0 0 1.00179 0 -0.39999] CT
1 0.6 0.6 RC
N
/f-515897110{373.18 149.717 M
373.18 86.471 L
338.62 86.471 L
338.62 149.717 L
cp}def
f-515897110
f
GR
GS
[1.00029 0 0 1.00179 354.12542 76.81992] CT
0.302 GC
N
f-1586420743
f
GR
GS
[1.00029 0 0 1.00179 358.4969 65.20653] CT
0.302 GC
N
f-1586420743
f
GR
GS
[1.00029 0 0 1.00179 349.06249 109.18957] CT
0.302 GC
N
f-1586420743
f
GR
GS
[1.00029 0 0 1.00179 362.32817 80.70616] CT
0.302 GC
N
f-1586420743
f
GR
GS
[1.00029 0 0 1.00179 359.57912 107.49452] CT
0.302 GC
N
f-1586420743
f
GR
GS
[1.00029 0 0 1.00179 359.61203 87.39727] CT
0.302 GC
N
f-1586420743
f
GR
GS
[1.00029 0 0 1.00179 353.82196 79.19941] CT
0.302 GC
N
f-1586420743
f
GR
GS
[1.00029 0 0 1.00179 348.08562 115.49025] CT
0.302 GC
N
f-1586420743
f
GR
GS
[1.00029 0 0 1.00179 356.84795 68.09523] CT
0.302 GC
N
f-1586420743
f
GR
GS
[1.00029 0 0 1.00179 348.54034 137.69351] CT
0.302 GC
N
f-1586420743
f
GR
GS
[1.00029 0 0 1.00179 358.49653 114.05234] CT
0.302 GC
N
f-1586420743
f
GR
GS
[1.00029 0 0 1.00179 358.7093 89.19579] CT
0.302 GC
N
f-1586420743
f
GR
GS
[1.00029 0 0 1.00179 354.62416 74.19482] CT
0.302 GC
N
f-1586420743
f
GR
GS
[1.00029 0 0 1.00179 351.63456 75.19935] CT
0.302 GC
N
f-1586420743
f
GR
GS
[1.00029 0 0 1.00179 355.85007 100.38876] CT
0.302 GC
N
f-1586420743
f
GR
GS
[1.00029 0 0 1.00179 349.31669 105.04629] CT
0.302 GC
N
f-1586420743
f
GR
GS
[1.00029 0 0 1.00179 348.58183 78.13855] CT
0.302 GC
N
f-1586420743
f
GR
GS
[1.00029 0 0 1.00179 349.83063 143.97709] CT
0.302 GC
N
f-1586420743
f
GR
GS
[1.00029 0 0 1.00179 357.7156 88.28767] CT
0.302 GC
N
f-1586420743
f
GR
GS
[1.00029 0 0 1.00179 362.4167 97.09396] CT
0.302 GC
N
f-1586420743
f
GR
GS
[1.00029 0 0 1.00179 352.52431 115.51826] CT
0.302 GC
N
f-1586420743
f
GR
GS
[1.00029 0 0 1.00179 354.17723 99.89614] CT
0.302 GC
N
f-1586420743
f
GR
GS
[1.00029 0 0 1.00179 358.08656 81.14167] CT
0.302 GC
N
f-1586420743
f
GR
GS
[1.00029 0 0 1.00179 361.47154 108.62683] CT
0.302 GC
N
f-1586420743
f
GR
GS
[1.00029 0 0 1.00179 354.46344 46.92639] CT
0.302 GC
N
f-1586420743
f
GR
GS
[1.00029 0 0 1.00179 352.18779 36.53354] CT
0.302 GC
N
f-1586420743
f
GR
GS
[1.00029 0 0 1.00179 359.80068 86.85681] CT
0.302 GC
N
f-1586420743
f
GR
GS
[1.00029 0 0 1.00179 361.76002 44.40498] CT
0.302 GC
N
f-1586420743
f
GR
GS
[1.00029 0 0 1.00179 357.28127 52.60937] CT
0.302 GC
N
f-1586420743
f
GR
GS
[1.00029 0 0 1.00179 350.21838 110.59475] CT
0.302 GC
N
f-1586420743
f
GR
GS
[1.00029 0 0 1.00179 352.76669 103.93055] CT
0.302 GC
N
f-1586420743
f
GR
GS
[1.00029 0 0 1.00179 354.15928 65.26967] CT
0.302 GC
N
f-1586420743
f
GR
GS
[1.00029 0 0 1.00179 359.72369 102.34088] CT
0.302 GC
N
f-1586420743
f
GR
GS
[1.00029 0 0 1.00179 355.53525 102.90507] CT
0.302 GC
N
f-1586420743
f
GR
GS
[1.00029 0 0 1.00179 364.32478 60.47765] CT
0.302 GC
N
f-1586420743
f
GR
GS
[1.00029 0 0 1.00179 357.37004 48.75977] CT
0.302 GC
N
f-1586420743
f
GR
GS
[1.00029 0 0 1.00179 353.09986 63.58417] CT
0.302 GC
N
f-1586420743
f
GR
GS
[1.00029 0 0 1.00179 362.7575 75.17463] CT
0.302 GC
N
f-1586420743
f
GR
GS
[1.00029 0 0 1.00179 350.45932 39.43921] CT
0.302 GC
N
f-1586420743
f
GR
GS
[1.00029 0 0 1.00179 355.32841 31.6574] CT
0.302 GC
N
f-1586420743
f
GR
GS
[1.00029 0 0 1.00179 350.12051 76.78534] CT
0.302 GC
N
f-1586420743
f
GR
GS
[1.00029 0 0 1.00179 349.4144 91.55578] CT
0.302 GC
N
f-1586420743
f
GR
GS
[1.00029 0 0 1.00179 363.13264 87.22297] CT
0.302 GC
N
f-1586420743
f
GR
GS
[1.00029 0 0 1.00179 362.04788 104.91153] CT
0.302 GC
N
f-1586420743
f
GR
GS
[1.00029 0 0 1.00179 363.65262 85.79281] CT
0.302 GC
N
f-1586420743
f
GR
GS
[1.00029 0 0 1.00179 363.27342 86.4768] CT
0.302 GC
N
f-1586420743
f
GR
GS
[1.00029 0 0 1.00179 363.90178 98.4104] CT
0.302 GC
N
f-1586420743
f
GR
GS
[1.00029 0 0 1.00179 361.64411 101.3419] CT
0.302 GC
N
f-1586420743
f
GR
GS
[1.00029 0 0 1.00179 360.75646 123.05758] CT
0.302 GC
N
f-1586420743
f
GR
GS
[1.00029 0 0 1.00179 0 -0.39999] CT
1 0.6 0.6 RC
N
/f-1376133594{416.38 149.717 M
416.38 95.327 L
381.82 95.327 L
381.82 149.717 L
cp}def
f-1376133594
f
GR
GS
[1.00029 0 0 1.00179 407.71176 105.74697] CT
0.302 GC
N
f-1586420743
f
GR
GS
[1.00029 0 0 1.00179 402.23282 68.81048] CT
0.302 GC
N
f-1586420743
f
GR
GS
[1.00029 0 0 1.00179 399.67877 127.5913] CT
0.302 GC
N
f-1586420743
f
GR
GS
[1.00029 0 0 1.00179 405.07266 143.18554] CT
0.302 GC
N
f-1586420743
f
GR
GS
[1.00029 0 0 1.00179 398.84329 60.60648] CT
0.302 GC
N
f-1586420743
f
GR
GS
[1.00029 0 0 1.00179 400.64935 125.39856] CT
0.302 GC
N
f-1586420743
f
GR
GS
[1.00029 0 0 1.00179 395.80988 67.17993] CT
0.302 GC
N
f-1586420743
f
GR
GS
[1.00029 0 0 1.00179 390.91918 104.3808] CT
0.302 GC
N
f-1586420743
f
GR
GS
[1.00029 0 0 1.00179 396.5575 45.41377] CT
0.302 GC
N
f-1586420743
f
GR
GS
[1.00029 0 0 1.00179 403.4612 115.6136] CT
0.302 GC
N
f-1586420743
f
GR
GS
[1.00029 0 0 1.00179 396.11401 123.37675] CT
0.302 GC
N
f-1586420743
f
GR
GS
[1.00029 0 0 1.00179 391.05795 125.79989] CT
0.302 GC
N
f-1586420743
f
GR
GS
[1.00029 0 0 1.00179 394.95221 87.37189] CT
0.302 GC
N
f-1586420743
f
GR
GS
[1.00029 0 0 1.00179 393.30513 77.60936] CT
0.302 GC
N
f-1586420743
f
GR
GS
[1.00029 0 0 1.00179 394.2661 65.43341] CT
0.302 GC
N
f-1586420743
f
GR
GS
[1.00029 0 0 1.00179 396.80992 45.86503] CT
0.302 GC
N
f-1586420743
f
GR
GS
[1.00029 0 0 1.00179 399.04928 46.21883] CT
0.302 GC
N
f-1586420743
f
GR
GS
[1.00029 0 0 1.00179 396.92733 80.58754] CT
0.302 GC
N
f-1586420743
f
GR
GS
[1.00029 0 0 1.00179 407.30774 129.84141] CT
0.302 GC
N
f-1586420743
f
GR
GS
[1.00029 0 0 1.00179 399.61469 163.39328] CT
0.302 GC
N
f-1586420743
f
GR
GS
[1.00029 0 0 1.00179 392.28832 66.8604] CT
0.302 GC
N
f-1586420743
f
GR
GS
[1.00029 0 0 1.00179 396.69643 70.58637] CT
0.302 GC
N
f-1586420743
f
GR
GS
[1.00029 0 0 1.00179 397.54176 144.36728] CT
0.302 GC
N
f-1586420743
f
GR
GS
[1.00029 0 0 1.00179 392.31668 101.47888] CT
0.302 GC
N
f-1586420743
f
GR
GS
[1.00029 0 0 1.00179 399.23903 87.43858] CT
0.302 GC
N
f-1586420743
f
GR
GS
[1.00029 0 0 1.00179 399.0077 136.1352] CT
0.302 GC
N
f-1586420743
f
GR
GS
[1.00029 0 0 1.00179 403.86699 71.93817] CT
0.302 GC
N
f-1586420743
f
GR
GS
[1.00029 0 0 1.00179 405.1625 58.62669] CT
0.302 GC
N
f-1586420743
f
GR
GS
[1.00029 0 0 1.00179 399.38879 105.49271] CT
0.302 GC
N
f-1586420743
f
GR
GS
[1.00029 0 0 1.00179 404.75604 69.86162] CT
0.302 GC
N
f-1586420743
f
GR
GS
[1.00029 0 0 1.00179 406.24613 101.5089] CT
0.302 GC
N
f-1586420743
f
GR
GS
[1.00029 0 0 1.00179 403.58569 56.79775] CT
0.302 GC
N
f-1586420743
f
GR
GS
[1.00029 0 0 1.00179 398.10238 125.93937] CT
0.302 GC
N
f-1586420743
f
GR
GS
[1.00029 0 0 1.00179 401.36199 98.02867] CT
0.302 GC
N
f-1586420743
f
GR
GS
[1.00029 0 0 1.00179 393.97356 118.57051] CT
0.302 GC
N
f-1586420743
f
GR
GS
[1.00029 0 0 1.00179 404.3998 83.64784] CT
0.302 GC
N
f-1586420743
f
GR
GS
[1.00029 0 0 1.00179 397.61481 97.8413] CT
0.302 GC
N
f-1586420743
f
GR
GS
[1.00029 0 0 1.00179 394.79509 85.86277] CT
0.302 GC
N
f-1586420743
f
GR
GS
[1.00029 0 0 1.00179 405.38827 80.71676] CT
0.302 GC
N
f-1586420743
f
GR
GS
[1.00029 0 0 1.00179 407.38562 102.57548] CT
0.302 GC
N
f-1586420743
f
GR
GS
[1.00029 0 0 1.00179 400.59224 123.07941] CT
0.302 GC
N
f-1586420743
f
GR
GS
[1.00029 0 0 1.00179 398.00812 162.08385] CT
0.302 GC
N
f-1586420743
f
GR
GS
[1.00029 0 0 1.00179 407.75499 71.75995] CT
0.302 GC
N
f-1586420743
f
GR
GS
[1.00029 0 0 1.00179 407.15957 119.18359] CT
0.302 GC
N
f-1586420743
f
GR
GS
[1.00029 0 0 1.00179 405.59478 96.83424] CT
0.302 GC
N
f-1586420743
f
GR
GS
[1.00029 0 0 1.00179 392.41571 83.86371] CT
0.302 GC
N
f-1586420743
f
GR
GS
[1.00029 0 0 1.00179 407.16964 107.32108] CT
0.302 GC
N
f-1586420743
f
GR
GS
[1.00029 0 0 1.00179 396.70635 58.30312] CT
0.302 GC
N
f-1586420743
f
GR
GS
[1.00029 0 0 1.00179 404.06544 68.40262] CT
0.302 GC
N
f-1586420743
f
GR
GS
[1.00029 0 0 1.00179 399.52787 43.87642] CT
0.302 GC
N
f-1586420743
f
GR
GS
[1.00029 0 0 1.00179 392.17604 98.84147] CT
0.302 GC
N
f-1586420743
f
GR
GS
[1.00029 0 0 1.00179 398.49639 112.54738] CT
0.302 GC
N
f-1586420743
f
GR
GS
[1.00029 0 0 1.00179 406.23956 120.40244] CT
0.302 GC
N
f-1586420743
f
GR
GS
[1.00029 0 0 1.00179 0 -0.39999] CT
1 GC
N
/f-1655143490{517.5 163.5 M
625.5 163.5 L
625.5 32 L
517.5 32 L
cp}def
f-1655143490
f
GR
GS
[1.00029 0 0 1.00179 0 -0.39999] CT
0.149 GC
2 setlinecap
1 LJ
0.5 LW
N
517.5 163.5 M
625.5 163.5 L
S
GR
GS
[1.00029 0 0 1.00179 0 -0.39999] CT
0.149 GC
2 setlinecap
1 LJ
0.5 LW
N
549.9 163.5 M
549.9 162.185 L
S
GR
GS
[1.00029 0 0 1.00179 0 -0.39999] CT
0.149 GC
2 setlinecap
1 LJ
0.5 LW
N
593.1 163.5 M
593.1 162.185 L
S
GR
GS
[1.00029 0 0 1.00179 550.05919 169.80475] CT
0.149 GC
/Helvetica 22 F
GS
[1 0 0 1 0 0] CT
-14.5 21 moveto 
1 -1 scale
(YA) t 
GR
GR
GS
[1.00029 0 0 1.00179 593.27165 169.80475] CT
0.149 GC
/Helvetica 22 F
GS
[1 0 0 1 0 0] CT
-15.5 21 moveto 
1 -1 scale
(OA) t 
GR
GR
GS
[1.00029 0 0 1.00179 571.66548 196.85318] CT
0.149 GC
/Helvetica 22 F
GS
[1 0 0 1 0 0] CT
-53.5 21 moveto 
1 -1 scale
(Age Group) t 
GR
GR
GS
[1.00029 0 0 1.00179 0 -0.39999] CT
0.149 GC
2 setlinecap
1 LJ
0.5 LW
N
517.5 163.5 M
517.5 32 L
S
GR
GS
[1.00029 0 0 1.00179 0 -0.39999] CT
0.149 GC
2 setlinecap
1 LJ
0.5 LW
N
517.5 155.513 M
518.815 155.513 L
S
GR
GS
[1.00029 0 0 1.00179 0 -0.39999] CT
0.149 GC
2 setlinecap
1 LJ
0.5 LW
N
517.5 94.705 M
518.815 94.705 L
S
GR
GS
[1.00029 0 0 1.00179 0 -0.39999] CT
0.149 GC
2 setlinecap
1 LJ
0.5 LW
N
517.5 33.897 M
518.815 33.897 L
S
GR
GS
[1.00029 0 0 1.00179 511.24795 155.39184] CT
0.149 GC
/Helvetica 22 F
GS
[1 0 0 1 0 0] CT
-13 8 moveto 
1 -1 scale
(0) t 
GR
GR
GS
[1.00029 0 0 1.00179 511.24795 94.4747] CT
0.149 GC
/Helvetica 22 F
GS
[1 0 0 1 0 0] CT
-43 8 moveto 
1 -1 scale
(0.05) t 
GR
GR
GS
[1.00029 0 0 1.00179 511.24795 33.55757] CT
0.149 GC
/Helvetica 22 F
GS
[1 0 0 1 0 0] CT
-31 8 moveto 
1 -1 scale
(0.1) t 
GR
GR
GS
[0 -1.00179 1.00029 0 465.23463 97.52528] CT
0.149 GC
/Helvetica 22 F
GS
[1 0 0 1 0 0] CT
-52 -5 moveto 
1 -1 scale
(NDT linear) t 
GR
GR
GS
[1.00029 0 0 1.00179 571.66597 28.90247] CT
/Helvetica-Bold 22 F
GS
[1 0 0 1 0 0] CT
-78 -5 moveto 
1 -1 scale
(p = 0.00039462) t 
GR
GR
GS
[1.00029 0 0 1.00179 0 -0.39999] CT
0.149 GC
1 LJ
0.5 LW
N
517.5 155.513 M
625.5 155.513 L
S
GR
GS
[1.00029 0 0 1.00179 0 -0.39999] CT
1 0.6 0.6 RC
N
/f-1777810098{567.18 155.513 M
567.18 88.71 L
532.62 88.71 L
532.62 155.513 L
cp}def
f-1777810098
f
GR
GS
[1.00029 0 0 1.00179 557.80649 67.51513] CT
0.302 GC
N
f-1586420743
f
GR
GS
[1.00029 0 0 1.00179 556.92312 96.24146] CT
0.302 GC
N
f-1586420743
f
GR
GS
[1.00029 0 0 1.00179 551.22121 43.78323] CT
0.302 GC
N
f-1586420743
f
GR
GS
[1.00029 0 0 1.00179 546.22776 76.30218] CT
0.302 GC
N
f-1586420743
f
GR
GS
[1.00029 0 0 1.00179 550.64298 90.43991] CT
0.302 GC
N
f-1586420743
f
GR
GS
[1.00029 0 0 1.00179 555.27781 101.90313] CT
0.302 GC
N
f-1586420743
f
GR
GS
[1.00029 0 0 1.00179 554.5525 96.52237] CT
0.302 GC
N
f-1586420743
f
GR
GS
[1.00029 0 0 1.00179 554.56514 31.76292] CT
0.302 GC
N
f-1586420743
f
GR
GS
[1.00029 0 0 1.00179 557.56613 101.45194] CT
0.302 GC
N
f-1586420743
f
GR
GS
[1.00029 0 0 1.00179 543.93279 75.26703] CT
0.302 GC
N
f-1586420743
f
GR
GS
[1.00029 0 0 1.00179 553.56674 108.1792] CT
0.302 GC
N
f-1586420743
f
GR
GS
[1.00029 0 0 1.00179 550.41269 54.88786] CT
0.302 GC
N
f-1586420743
f
GR
GS
[1.00029 0 0 1.00179 548.16064 82.79807] CT
0.302 GC
N
f-1586420743
f
GR
GS
[1.00029 0 0 1.00179 556.61206 132.42375] CT
0.302 GC
N
f-1586420743
f
GR
GS
[1.00029 0 0 1.00179 555.14453 73.26338] CT
0.302 GC
N
f-1586420743
f
GR
GS
[1.00029 0 0 1.00179 549.13931 47.18566] CT
0.302 GC
N
f-1586420743
f
GR
GS
[1.00029 0 0 1.00179 550.33863 78.96681] CT
0.302 GC
N
f-1586420743
f
GR
GS
[1.00029 0 0 1.00179 555.98004 77.87972] CT
0.302 GC
N
f-1586420743
f
GR
GS
[1.00029 0 0 1.00179 556.02357 79.4441] CT
0.302 GC
N
f-1586420743
f
GR
GS
[1.00029 0 0 1.00179 557.43273 88.65315] CT
0.302 GC
N
f-1586420743
f
GR
GS
[1.00029 0 0 1.00179 543.46079 111.34071] CT
0.302 GC
N
f-1586420743
f
GR
GS
[1.00029 0 0 1.00179 543.57404 60.75076] CT
0.302 GC
N
f-1586420743
f
GR
GS
[1.00029 0 0 1.00179 558.67784 78.48693] CT
0.302 GC
N
f-1586420743
f
GR
GS
[1.00029 0 0 1.00179 543.40065 96.33564] CT
0.302 GC
N
f-1586420743
f
GR
GS
[1.00029 0 0 1.00179 545.92329 121.29869] CT
0.302 GC
N
f-1586420743
f
GR
GS
[1.00029 0 0 1.00179 542.61533 96.07928] CT
0.302 GC
N
f-1586420743
f
GR
GS
[1.00029 0 0 1.00179 550.68468 58.26506] CT
0.302 GC
N
f-1586420743
f
GR
GS
[1.00029 0 0 1.00179 551.17371 139.7087] CT
0.302 GC
N
f-1586420743
f
GR
GS
[1.00029 0 0 1.00179 550.11897 97.57987] CT
0.302 GC
N
f-1586420743
f
GR
GS
[1.00029 0 0 1.00179 545.25696 42.52902] CT
0.302 GC
N
f-1586420743
f
GR
GS
[1.00029 0 0 1.00179 549.48121 153.82457] CT
0.302 GC
N
f-1586420743
f
GR
GS
[1.00029 0 0 1.00179 558.35005 113.42765] CT
0.302 GC
N
f-1586420743
f
GR
GS
[1.00029 0 0 1.00179 551.69883 101.17046] CT
0.302 GC
N
f-1586420743
f
GR
GS
[1.00029 0 0 1.00179 543.9497 98.98926] CT
0.302 GC
N
f-1586420743
f
GR
GS
[1.00029 0 0 1.00179 542.1357 114.80719] CT
0.302 GC
N
f-1586420743
f
GR
GS
[1.00029 0 0 1.00179 545.91401 80.01077] CT
0.302 GC
N
f-1586420743
f
GR
GS
[1.00029 0 0 1.00179 545.02051 107.60041] CT
0.302 GC
N
f-1586420743
f
GR
GS
[1.00029 0 0 1.00179 554.98048 84.17072] CT
0.302 GC
N
f-1586420743
f
GR
GS
[1.00029 0 0 1.00179 557.79697 124.70354] CT
0.302 GC
N
f-1586420743
f
GR
GS
[1.00029 0 0 1.00179 544.92825 65.22842] CT
0.302 GC
N
f-1586420743
f
GR
GS
[1.00029 0 0 1.00179 553.20842 74.571] CT
0.302 GC
N
f-1586420743
f
GR
GS
[1.00029 0 0 1.00179 545.25849 109.38545] CT
0.302 GC
N
f-1586420743
f
GR
GS
[1.00029 0 0 1.00179 557.04889 87.46975] CT
0.302 GC
N
f-1586420743
f
GR
GS
[1.00029 0 0 1.00179 552.04237 99.55488] CT
0.302 GC
N
f-1586420743
f
GR
GS
[1.00029 0 0 1.00179 558.25108 109.50851] CT
0.302 GC
N
f-1586420743
f
GR
GS
[1.00029 0 0 1.00179 553.81901 50.60095] CT
0.302 GC
N
f-1586420743
f
GR
GS
[1.00029 0 0 1.00179 549.34463 84.20164] CT
0.302 GC
N
f-1586420743
f
GR
GS
[1.00029 0 0 1.00179 546.26043 98.24691] CT
0.302 GC
N
f-1586420743
f
GR
GS
[1.00029 0 0 1.00179 552.43134 70.25255] CT
0.302 GC
N
f-1586420743
f
GR
GS
[1.00029 0 0 1.00179 0 -0.39999] CT
1 0.6 0.6 RC
N
/f1649915566{610.38 155.513 M
610.38 110.083 L
575.82 110.083 L
575.82 155.513 L
cp}def
f1649915566
f
GR
GS
[1.00029 0 0 1.00179 588.01116 133.21282] CT
0.302 GC
N
f-1586420743
f
GR
GS
[1.00029 0 0 1.00179 596.59482 93.71184] CT
0.302 GC
N
f-1586420743
f
GR
GS
[1.00029 0 0 1.00179 591.55472 31.65741] CT
0.302 GC
N
f-1586420743
f
GR
GS
[1.00029 0 0 1.00179 600.55507 118.54833] CT
0.302 GC
N
f-1586420743
f
GR
GS
[1.00029 0 0 1.00179 586.35919 103.98298] CT
0.302 GC
N
f-1586420743
f
GR
GS
[1.00029 0 0 1.00179 585.55579 131.23491] CT
0.302 GC
N
f-1586420743
f
GR
GS
[1.00029 0 0 1.00179 586.49589 133.61183] CT
0.302 GC
N
f-1586420743
f
GR
GS
[1.00029 0 0 1.00179 591.56101 130.0183] CT
0.302 GC
N
f-1586420743
f
GR
GS
[1.00029 0 0 1.00179 598.85994 124.23498] CT
0.302 GC
N
f-1586420743
f
GR
GS
[1.00029 0 0 1.00179 587.20367 91.65756] CT
0.302 GC
N
f-1586420743
f
GR
GS
[1.00029 0 0 1.00179 586.05179 46.8006] CT
0.302 GC
N
f-1586420743
f
GR
GS
[1.00029 0 0 1.00179 597.07139 72.46042] CT
0.302 GC
N
f-1586420743
f
GR
GS
[1.00029 0 0 1.00179 594.8473 161.91526] CT
0.302 GC
N
f-1586420743
f
GR
GS
[1.00029 0 0 1.00179 591.99314 113.49999] CT
0.302 GC
N
f-1586420743
f
GR
GS
[1.00029 0 0 1.00179 587.02234 96.5743] CT
0.302 GC
N
f-1586420743
f
GR
GS
[1.00029 0 0 1.00179 596.25133 112.87388] CT
0.302 GC
N
f-1586420743
f
GR
GS
[1.00029 0 0 1.00179 600.48669 79.79809] CT
0.302 GC
N
f-1586420743
f
GR
GS
[1.00029 0 0 1.00179 594.06589 135.89493] CT
0.302 GC
N
f-1586420743
f
GR
GS
[1.00029 0 0 1.00179 595.22613 154.98468] CT
0.302 GC
N
f-1586420743
f
GR
GS
[1.00029 0 0 1.00179 589.96008 124.33639] CT
0.302 GC
N
f-1586420743
f
GR
GS
[1.00029 0 0 1.00179 598.69039 90.78889] CT
0.302 GC
N
f-1586420743
f
GR
GS
[1.00029 0 0 1.00179 587.35441 65.83541] CT
0.302 GC
N
f-1586420743
f
GR
GS
[1.00029 0 0 1.00179 587.06203 118.16455] CT
0.302 GC
N
f-1586420743
f
GR
GS
[1.00029 0 0 1.00179 596.99288 127.5361] CT
0.302 GC
N
f-1586420743
f
GR
GS
[1.00029 0 0 1.00179 595.22284 92.27569] CT
0.302 GC
N
f-1586420743
f
GR
GS
[1.00029 0 0 1.00179 586.75927 160.57894] CT
0.302 GC
N
f-1586420743
f
GR
GS
[1.00029 0 0 1.00179 592.7176 99.72227] CT
0.302 GC
N
f-1586420743
f
GR
GS
[1.00029 0 0 1.00179 600.74104 109.38489] CT
0.302 GC
N
f-1586420743
f
GR
GS
[1.00029 0 0 1.00179 585.04265 114.19208] CT
0.302 GC
N
f-1586420743
f
GR
GS
[1.00029 0 0 1.00179 588.44921 66.20476] CT
0.302 GC
N
f-1586420743
f
GR
GS
[1.00029 0 0 1.00179 584.76247 145.81283] CT
0.302 GC
N
f-1586420743
f
GR
GS
[1.00029 0 0 1.00179 601.3863 94.29436] CT
0.302 GC
N
f-1586420743
f
GR
GS
[1.00029 0 0 1.00179 591.52224 78.73835] CT
0.302 GC
N
f-1586420743
f
GR
GS
[1.00029 0 0 1.00179 599.53726 154.43562] CT
0.302 GC
N
f-1586420743
f
GR
GS
[1.00029 0 0 1.00179 595.47596 101.67422] CT
0.302 GC
N
f-1586420743
f
GR
GS
[1.00029 0 0 1.00179 590.17017 115.09942] CT
0.302 GC
N
f-1586420743
f
GR
GS
[1.00029 0 0 1.00179 598.86726 82.24464] CT
0.302 GC
N
f-1586420743
f
GR
GS
[1.00029 0 0 1.00179 594.58068 136.77825] CT
0.302 GC
N
f-1586420743
f
GR
GS
[1.00029 0 0 1.00179 587.327 69.80346] CT
0.302 GC
N
f-1586420743
f
GR
GS
[1.00029 0 0 1.00179 585.13691 132.83779] CT
0.302 GC
N
f-1586420743
f
GR
GS
[1.00029 0 0 1.00179 599.60338 163.39328] CT
0.302 GC
N
f-1586420743
f
GR
GS
[1.00029 0 0 1.00179 598.23879 148.94958] CT
0.302 GC
N
f-1586420743
f
GR
GS
[1.00029 0 0 1.00179 599.02344 132.73915] CT
0.302 GC
N
f-1586420743
f
GR
GS
[1.00029 0 0 1.00179 585.25548 70.73736] CT
0.302 GC
N
f-1586420743
f
GR
GS
[1.00029 0 0 1.00179 585.77852 99.88432] CT
0.302 GC
N
f-1586420743
f
GR
GS
[1.00029 0 0 1.00179 586.76256 53.74074] CT
0.302 GC
N
f-1586420743
f
GR
GS
[1.00029 0 0 1.00179 593.13495 159.96376] CT
0.302 GC
N
f-1586420743
f
GR
GS
[1.00029 0 0 1.00179 593.48912 76.50651] CT
0.302 GC
N
f-1586420743
f
GR
GS
[1.00029 0 0 1.00179 596.80881 146.40048] CT
0.302 GC
N
f-1586420743
f
GR
GS
[1.00029 0 0 1.00179 596.99166 67.58154] CT
0.302 GC
N
f-1586420743
f
GR
GS
[1.00029 0 0 1.00179 597.36927 94.57337] CT
0.302 GC
N
f-1586420743
f
GR
GS
[1.00029 0 0 1.00179 595.85705 113.57171] CT
0.302 GC
N
f-1586420743
f
GR
GS
[1.00029 0 0 1.00179 588.28998 148.22659] CT
0.302 GC
N
f-1586420743
f
GR
%%Trailer
%%Pages: 1
%%EOF
