%!PS-Adobe-3.0 EPSF-3.0
%%Creator: (MATLAB, The Mathworks, Inc. Version 9.7.0.1190202 \(R2019b\). Operating System: Mac OS X)
%%Title: /Users/julian.kosciessa/Volumes/tardis/LNDG/stateswitch/stsw_beh_task/hddm_matched/figures/D_compareYAOA_vat_l1.eps
%%CreationDate: 2023-07-11T11:10:31
%%Pages: (atend)
%%BoundingBox:    74     0   633   215
%%LanguageLevel: 3
%%EndComments
%%BeginProlog
%%BeginResource: procset (Apache XML Graphics Std ProcSet) 1.2 0
%%Version: 1.2 0
%%Copyright: (Copyright 2001-2003,2010 The Apache Software Foundation. License terms: http://www.apache.org/licenses/LICENSE-2.0)
/bd{bind def}bind def
/ld{load def}bd
/GR/grestore ld
/GS/gsave ld
/RM/rmoveto ld
/C/curveto ld
/t/show ld
/L/lineto ld
/ML/setmiterlimit ld
/CT/concat ld
/f/fill ld
/N/newpath ld
/S/stroke ld
/CC/setcmykcolor ld
/A/ashow ld
/cp/closepath ld
/RC/setrgbcolor ld
/LJ/setlinejoin ld
/GC/setgray ld
/LW/setlinewidth ld
/M/moveto ld
/re {4 2 roll M
1 index 0 rlineto
0 exch rlineto
neg 0 rlineto
cp } bd
/_ctm matrix def
/_tm matrix def
/BT { _ctm currentmatrix pop matrix _tm copy pop 0 0 moveto } bd
/ET { _ctm setmatrix } bd
/iTm { _ctm setmatrix _tm concat } bd
/Tm { _tm astore pop iTm 0 0 moveto } bd
/ux 0.0 def
/uy 0.0 def
/F {
  /Tp exch def
  /Tf exch def
  Tf findfont Tp scalefont setfont
  /cf Tf def  /cs Tp def
} bd
/ULS {currentpoint /uy exch def /ux exch def} bd
/ULE {
  /Tcx currentpoint pop def
  gsave
  newpath
  cf findfont cs scalefont dup
  /FontMatrix get 0 get /Ts exch def /FontInfo get dup
  /UnderlinePosition get Ts mul /To exch def
  /UnderlineThickness get Ts mul /Tt exch def
  ux uy To add moveto  Tcx uy To add lineto
  Tt setlinewidth stroke
  grestore
} bd
/OLE {
  /Tcx currentpoint pop def
  gsave
  newpath
  cf findfont cs scalefont dup
  /FontMatrix get 0 get /Ts exch def /FontInfo get dup
  /UnderlinePosition get Ts mul /To exch def
  /UnderlineThickness get Ts mul /Tt exch def
  ux uy To add cs add moveto Tcx uy To add cs add lineto
  Tt setlinewidth stroke
  grestore
} bd
/SOE {
  /Tcx currentpoint pop def
  gsave
  newpath
  cf findfont cs scalefont dup
  /FontMatrix get 0 get /Ts exch def /FontInfo get dup
  /UnderlinePosition get Ts mul /To exch def
  /UnderlineThickness get Ts mul /Tt exch def
  ux uy To add cs 10 mul 26 idiv add moveto Tcx uy To add cs 10 mul 26 idiv add lineto
  Tt setlinewidth stroke
  grestore
} bd
/QT {
/Y22 exch store
/X22 exch store
/Y21 exch store
/X21 exch store
currentpoint
/Y21 load 2 mul add 3 div exch
/X21 load 2 mul add 3 div exch
/X21 load 2 mul /X22 load add 3 div
/Y21 load 2 mul /Y22 load add 3 div
/X22 load /Y22 load curveto
} bd
/SSPD {
dup length /d exch dict def
{
/v exch def
/k exch def
currentpagedevice k known {
/cpdv currentpagedevice k get def
v cpdv ne {
/upd false def
/nullv v type /nulltype eq def
/nullcpdv cpdv type /nulltype eq def
nullv nullcpdv or
{
/upd true def
} {
/sametype v type cpdv type eq def
sametype {
v type /arraytype eq {
/vlen v length def
/cpdvlen cpdv length def
vlen cpdvlen eq {
0 1 vlen 1 sub {
/i exch def
/obj v i get def
/cpdobj cpdv i get def
obj cpdobj ne {
/upd true def
exit
} if
} for
} {
/upd true def
} ifelse
} {
v type /dicttype eq {
v {
/dv exch def
/dk exch def
/cpddv cpdv dk get def
dv cpddv ne {
/upd true def
exit
} if
} forall
} {
/upd true def
} ifelse
} ifelse
} if
} ifelse
upd true eq {
d k v put
} if
} if
} if
} forall
d length 0 gt {
d setpagedevice
} if
} bd
/RE { % /NewFontName [NewEncodingArray] /FontName RE -
  findfont dup length dict begin
  {
    1 index /FID ne
    {def} {pop pop} ifelse
  } forall
  /Encoding exch def
  /FontName 1 index def
  currentdict definefont pop
  end
} bind def
%%EndResource
%%BeginResource: procset (Apache XML Graphics EPS ProcSet) 1.0 0
%%Version: 1.0 0
%%Copyright: (Copyright 2002-2003 The Apache Software Foundation. License terms: http://www.apache.org/licenses/LICENSE-2.0)
/BeginEPSF { %def
/b4_Inc_state save def         % Save state for cleanup
/dict_count countdictstack def % Count objects on dict stack
/op_count count 1 sub def      % Count objects on operand stack
userdict begin                 % Push userdict on dict stack
/showpage { } def              % Redefine showpage, { } = null proc
0 setgray 0 setlinecap         % Prepare graphics state
1 setlinewidth 0 setlinejoin
10 setmiterlimit [ ] 0 setdash newpath
/languagelevel where           % If level not equal to 1 then
{pop languagelevel             % set strokeadjust and
1 ne                           % overprint to their defaults.
{false setstrokeadjust false setoverprint
} if
} if
} bd
/EndEPSF { %def
count op_count sub {pop} repeat            % Clean up stacks
countdictstack dict_count sub {end} repeat
b4_Inc_state restore
} bd
%%EndResource
%FOPBeginFontDict
%%IncludeResource: font Courier-Oblique
%%IncludeResource: font Courier-BoldOblique
%%IncludeResource: font Courier-Bold
%%IncludeResource: font ZapfDingbats
%%IncludeResource: font Symbol
%%IncludeResource: font Helvetica
%%IncludeResource: font Helvetica-Oblique
%%IncludeResource: font Helvetica-Bold
%%IncludeResource: font Helvetica-BoldOblique
%%IncludeResource: font Times-Roman
%%IncludeResource: font Times-Italic
%%IncludeResource: font Times-Bold
%%IncludeResource: font Times-BoldItalic
%%IncludeResource: font Courier
%FOPEndFontDict
%%BeginResource: encoding WinAnsiEncoding
/WinAnsiEncoding [
/.notdef /.notdef /.notdef /.notdef /.notdef
/.notdef /.notdef /.notdef /.notdef /.notdef
/.notdef /.notdef /.notdef /.notdef /.notdef
/.notdef /.notdef /.notdef /.notdef /.notdef
/.notdef /.notdef /.notdef /.notdef /.notdef
/.notdef /.notdef /.notdef /.notdef /.notdef
/.notdef /.notdef /space /exclam /quotedbl
/numbersign /dollar /percent /ampersand /quotesingle
/parenleft /parenright /asterisk /plus /comma
/hyphen /period /slash /zero /one
/two /three /four /five /six
/seven /eight /nine /colon /semicolon
/less /equal /greater /question /at
/A /B /C /D /E
/F /G /H /I /J
/K /L /M /N /O
/P /Q /R /S /T
/U /V /W /X /Y
/Z /bracketleft /backslash /bracketright /asciicircum
/underscore /quoteleft /a /b /c
/d /e /f /g /h
/i /j /k /l /m
/n /o /p /q /r
/s /t /u /v /w
/x /y /z /braceleft /bar
/braceright /asciitilde /bullet /Euro /bullet
/quotesinglbase /florin /quotedblbase /ellipsis /dagger
/daggerdbl /circumflex /perthousand /Scaron /guilsinglleft
/OE /bullet /Zcaron /bullet /bullet
/quoteleft /quoteright /quotedblleft /quotedblright /bullet
/endash /emdash /asciitilde /trademark /scaron
/guilsinglright /oe /bullet /zcaron /Ydieresis
/space /exclamdown /cent /sterling /currency
/yen /brokenbar /section /dieresis /copyright
/ordfeminine /guillemotleft /logicalnot /sfthyphen /registered
/macron /degree /plusminus /twosuperior /threesuperior
/acute /mu /paragraph /middot /cedilla
/onesuperior /ordmasculine /guillemotright /onequarter /onehalf
/threequarters /questiondown /Agrave /Aacute /Acircumflex
/Atilde /Adieresis /Aring /AE /Ccedilla
/Egrave /Eacute /Ecircumflex /Edieresis /Igrave
/Iacute /Icircumflex /Idieresis /Eth /Ntilde
/Ograve /Oacute /Ocircumflex /Otilde /Odieresis
/multiply /Oslash /Ugrave /Uacute /Ucircumflex
/Udieresis /Yacute /Thorn /germandbls /agrave
/aacute /acircumflex /atilde /adieresis /aring
/ae /ccedilla /egrave /eacute /ecircumflex
/edieresis /igrave /iacute /icircumflex /idieresis
/eth /ntilde /ograve /oacute /ocircumflex
/otilde /odieresis /divide /oslash /ugrave
/uacute /ucircumflex /udieresis /yacute /thorn
/ydieresis
] def
%%EndResource
%FOPBeginFontReencode
/Courier-Oblique findfont
dup length dict begin
  {1 index /FID ne {def} {pop pop} ifelse} forall
  /Encoding WinAnsiEncoding def
  currentdict
end
/Courier-Oblique exch definefont pop
/Courier-BoldOblique findfont
dup length dict begin
  {1 index /FID ne {def} {pop pop} ifelse} forall
  /Encoding WinAnsiEncoding def
  currentdict
end
/Courier-BoldOblique exch definefont pop
/Courier-Bold findfont
dup length dict begin
  {1 index /FID ne {def} {pop pop} ifelse} forall
  /Encoding WinAnsiEncoding def
  currentdict
end
/Courier-Bold exch definefont pop
/Helvetica findfont
dup length dict begin
  {1 index /FID ne {def} {pop pop} ifelse} forall
  /Encoding WinAnsiEncoding def
  currentdict
end
/Helvetica exch definefont pop
/Helvetica-Oblique findfont
dup length dict begin
  {1 index /FID ne {def} {pop pop} ifelse} forall
  /Encoding WinAnsiEncoding def
  currentdict
end
/Helvetica-Oblique exch definefont pop
/Helvetica-Bold findfont
dup length dict begin
  {1 index /FID ne {def} {pop pop} ifelse} forall
  /Encoding WinAnsiEncoding def
  currentdict
end
/Helvetica-Bold exch definefont pop
/Helvetica-BoldOblique findfont
dup length dict begin
  {1 index /FID ne {def} {pop pop} ifelse} forall
  /Encoding WinAnsiEncoding def
  currentdict
end
/Helvetica-BoldOblique exch definefont pop
/Times-Roman findfont
dup length dict begin
  {1 index /FID ne {def} {pop pop} ifelse} forall
  /Encoding WinAnsiEncoding def
  currentdict
end
/Times-Roman exch definefont pop
/Times-Italic findfont
dup length dict begin
  {1 index /FID ne {def} {pop pop} ifelse} forall
  /Encoding WinAnsiEncoding def
  currentdict
end
/Times-Italic exch definefont pop
/Times-Bold findfont
dup length dict begin
  {1 index /FID ne {def} {pop pop} ifelse} forall
  /Encoding WinAnsiEncoding def
  currentdict
end
/Times-Bold exch definefont pop
/Times-BoldItalic findfont
dup length dict begin
  {1 index /FID ne {def} {pop pop} ifelse} forall
  /Encoding WinAnsiEncoding def
  currentdict
end
/Times-BoldItalic exch definefont pop
/Courier findfont
dup length dict begin
  {1 index /FID ne {def} {pop pop} ifelse} forall
  /Encoding WinAnsiEncoding def
  currentdict
end
/Courier exch definefont pop
%FOPEndFontReencode
%%EndProlog
%%Page: 1 1
%%PageBoundingBox: 0 0 691 223
%%BeginPageSetup
[1 0 0 -1 0 223] CT
%%EndPageSetup
GS
[1.00029 0 0 1.00179 0 -0.39999] CT
1 GC
N
0 0 691 223 re
f
GR
GS
[1.00029 0 0 1.00179 0 -0.39999] CT
1 GC
N
0 0 691 223 re
f
GR
GS
[1.00029 0 0 1.00179 0 -0.39999] CT
1 GC
N
117.5 163.5 M
237.5 163.5 L
237.5 32 L
117.5 32 L
cp
f
GR
GS
[1.00029 0 0 1.00179 0 -0.39999] CT
0.149 GC
2 setlinecap
1 LJ
0.5 LW
N
117.5 163.5 M
237.5 163.5 L
S
GR
GS
[1.00029 0 0 1.00179 0 -0.39999] CT
0.149 GC
2 setlinecap
1 LJ
0.5 LW
N
153.5 163.5 M
153.5 162.185 L
S
GR
GS
[1.00029 0 0 1.00179 0 -0.39999] CT
0.149 GC
2 setlinecap
1 LJ
0.5 LW
N
201.5 163.5 M
201.5 162.185 L
S
GR
GS
[1.00029 0 0 1.00179 153.54443 169.80475] CT
0.149 GC
/Helvetica 22 F
GS
[1 0 0 1 0 0] CT
-14.5 21 moveto 
1 -1 scale
(YA) t 
GR
GR
GS
[1.00029 0 0 1.00179 201.55832 169.80475] CT
0.149 GC
/Helvetica 22 F
GS
[1 0 0 1 0 0] CT
-15.5 21 moveto 
1 -1 scale
(OA) t 
GR
GR
GS
[1.00029 0 0 1.00179 177.55144 196.85318] CT
0.149 GC
/Helvetica 22 F
GS
[1 0 0 1 0 0] CT
-53.5 21 moveto 
1 -1 scale
(Age Group) t 
GR
GR
GS
[1.00029 0 0 1.00179 0 -0.39999] CT
0.149 GC
2 setlinecap
1 LJ
0.5 LW
N
117.5 163.5 M
117.5 32 L
S
GR
GS
[1.00029 0 0 1.00179 0 -0.39999] CT
0.149 GC
2 setlinecap
1 LJ
0.5 LW
N
117.5 163.5 M
118.815 163.5 L
S
GR
GS
[1.00029 0 0 1.00179 0 -0.39999] CT
0.149 GC
2 setlinecap
1 LJ
0.5 LW
N
117.5 115.916 M
118.815 115.916 L
S
GR
GS
[1.00029 0 0 1.00179 0 -0.39999] CT
0.149 GC
2 setlinecap
1 LJ
0.5 LW
N
117.5 68.331 M
118.815 68.331 L
S
GR
GS
[1.00029 0 0 1.00179 111.13216 163.39328] CT
0.149 GC
/Helvetica 22 F
GS
[1 0 0 1 0 0] CT
-13 8 moveto 
1 -1 scale
(0) t 
GR
GR
GS
[1.00029 0 0 1.00179 111.13216 115.72359] CT
0.149 GC
/Helvetica 22 F
GS
[1 0 0 1 0 0] CT
-13 8 moveto 
1 -1 scale
(1) t 
GR
GR
GS
[1.00029 0 0 1.00179 111.13216 68.0539] CT
0.149 GC
/Helvetica 22 F
GS
[1 0 0 1 0 0] CT
-13 8 moveto 
1 -1 scale
(2) t 
GR
GR
GS
[0 -1.00179 1.00029 0 95.62767 97.52528] CT
0.149 GC
/Helvetica 22 F
GS
[1 0 0 1 0 0] CT
-36 -5 moveto 
1 -1 scale
(Drift L1) t 
GR
GR
GS
[1.00029 0 0 1.00179 177.55155 28.90247] CT
/Helvetica-Bold 22 F
GS
[1 0 0 1 0 0] CT
-76.5 -5 moveto 
1 -1 scale
(p = 8.2392e-13) t 
GR
GR
GS
[1.00029 0 0 1.00179 0 -0.39999] CT
0.149 GC
1 LJ
0.5 LW
N
117.5 163.5 M
237.5 163.5 L
S
GR
GS
[1.00029 0 0 1.00179 0 -0.39999] CT
0.6 0.902 1 RC
N
172.7 163.5 M
172.7 69.005 L
134.3 69.005 L
134.3 163.5 L
cp
f
GR
GS
[1.00029 0 0 1.00179 151.53688 52.90866] CT
0.302 GC
N
2.236 0 M
2.236 -1.235 1.235 -2.236 0 -2.236 C
-1.235 -2.236 -2.236 -1.235 -2.236 0 C
-2.236 1.235 -1.235 2.236 0 2.236 C
1.235 2.236 2.236 1.235 2.236 0 C
cp
f
GR
GS
[1.00029 0 0 1.00179 159.29895 86.72948] CT
0.302 GC
N
/f-1586420743{2.236 0 M
2.236 -1.235 1.235 -2.236 0 -2.236 C
-1.235 -2.236 -2.236 -1.235 -2.236 0 C
-2.236 1.235 -1.235 2.236 0 2.236 C
1.235 2.236 2.236 1.235 2.236 0 C
cp}def
f-1586420743
f
GR
GS
[1.00029 0 0 1.00179 147.4903 59.00986] CT
0.302 GC
N
f-1586420743
f
GR
GS
[1.00029 0 0 1.00179 156.7934 37.8174] CT
0.302 GC
N
f-1586420743
f
GR
GS
[1.00029 0 0 1.00179 153.44461 110.036] CT
0.302 GC
N
f-1586420743
f
GR
GS
[1.00029 0 0 1.00179 150.06865 84.11053] CT
0.302 GC
N
f-1586420743
f
GR
GS
[1.00029 0 0 1.00179 158.99727 72.9054] CT
0.302 GC
N
f-1586420743
f
GR
GS
[1.00029 0 0 1.00179 146.52935 58.75126] CT
0.302 GC
N
f-1586420743
f
GR
GS
[1.00029 0 0 1.00179 158.4787 47.56122] CT
0.302 GC
N
f-1586420743
f
GR
GS
[1.00029 0 0 1.00179 145.80536 91.84075] CT
0.302 GC
N
f-1586420743
f
GR
GS
[1.00029 0 0 1.00179 161.89916 100.08047] CT
0.302 GC
N
f-1586420743
f
GR
GS
[1.00029 0 0 1.00179 157.1347 74.3031] CT
0.302 GC
N
f-1586420743
f
GR
GS
[1.00029 0 0 1.00179 144.90153 57.75595] CT
0.302 GC
N
f-1586420743
f
GR
GS
[1.00029 0 0 1.00179 148.42517 70.66041] CT
0.302 GC
N
f-1586420743
f
GR
GS
[1.00029 0 0 1.00179 148.45898 85.62383] CT
0.302 GC
N
f-1586420743
f
GR
GS
[1.00029 0 0 1.00179 147.23232 97.4919] CT
0.302 GC
N
f-1586420743
f
GR
GS
[1.00029 0 0 1.00179 144.81337 54.54744] CT
0.302 GC
N
f-1586420743
f
GR
GS
[1.00029 0 0 1.00179 151.39584 90.6963] CT
0.302 GC
N
f-1586420743
f
GR
GS
[1.00029 0 0 1.00179 152.79226 66.69887] CT
0.302 GC
N
f-1586420743
f
GR
GS
[1.00029 0 0 1.00179 152.02397 98.69267] CT
0.302 GC
N
f-1586420743
f
GR
GS
[1.00029 0 0 1.00179 145.62127 130.16314] CT
0.302 GC
N
f-1586420743
f
GR
GS
[1.00029 0 0 1.00179 159.67459 83.83704] CT
0.302 GC
N
f-1586420743
f
GR
GS
[1.00029 0 0 1.00179 157.23269 50.05111] CT
0.302 GC
N
f-1586420743
f
GR
GS
[1.00029 0 0 1.00179 155.50067 68.14773] CT
0.302 GC
N
f-1586420743
f
GR
GS
[1.00029 0 0 1.00179 162.16887 71.59836] CT
0.302 GC
N
f-1586420743
f
GR
GS
[1.00029 0 0 1.00179 155.39215 53.18656] CT
0.302 GC
N
f-1586420743
f
GR
GS
[1.00029 0 0 1.00179 161.21325 51.79267] CT
0.302 GC
N
f-1586420743
f
GR
GS
[1.00029 0 0 1.00179 156.10639 51.69915] CT
0.302 GC
N
f-1586420743
f
GR
GS
[1.00029 0 0 1.00179 144.8628 82.77663] CT
0.302 GC
N
f-1586420743
f
GR
GS
[1.00029 0 0 1.00179 150.58819 110.25251] CT
0.302 GC
N
f-1586420743
f
GR
GS
[1.00029 0 0 1.00179 158.40501 52.74095] CT
0.302 GC
N
f-1586420743
f
GR
GS
[1.00029 0 0 1.00179 162.86895 38.73905] CT
0.302 GC
N
f-1586420743
f
GR
GS
[1.00029 0 0 1.00179 155.00793 76.12541] CT
0.302 GC
N
f-1586420743
f
GR
GS
[1.00029 0 0 1.00179 146.32074 77.9617] CT
0.302 GC
N
f-1586420743
f
GR
GS
[1.00029 0 0 1.00179 147.48082 41.50583] CT
0.302 GC
N
f-1586420743
f
GR
GS
[1.00029 0 0 1.00179 148.74652 35.20005] CT
0.302 GC
N
f-1586420743
f
GR
GS
[1.00029 0 0 1.00179 159.12296 82.54004] CT
0.302 GC
N
f-1586420743
f
GR
GS
[1.00029 0 0 1.00179 144.1263 69.73163] CT
0.302 GC
N
f-1586420743
f
GR
GS
[1.00029 0 0 1.00179 146.09629 36.71597] CT
0.302 GC
N
f-1586420743
f
GR
GS
[1.00029 0 0 1.00179 161.57871 41.60369] CT
0.302 GC
N
f-1586420743
f
GR
GS
[1.00029 0 0 1.00179 157.48751 44.03823] CT
0.302 GC
N
f-1586420743
f
GR
GS
[1.00029 0 0 1.00179 152.28068 64.3233] CT
0.302 GC
N
f-1586420743
f
GR
GS
[1.00029 0 0 1.00179 154.87413 31.65741] CT
0.302 GC
N
f-1586420743
f
GR
GS
[1.00029 0 0 1.00179 156.27038 88.08218] CT
0.302 GC
N
f-1586420743
f
GR
GS
[1.00029 0 0 1.00179 155.88677 42.20132] CT
0.302 GC
N
f-1586420743
f
GR
GS
[1.00029 0 0 1.00179 158.13084 81.76981] CT
0.302 GC
N
f-1586420743
f
GR
GS
[1.00029 0 0 1.00179 147.09786 56.76777] CT
0.302 GC
N
f-1586420743
f
GR
GS
[1.00029 0 0 1.00179 158.8685 86.59489] CT
0.302 GC
N
f-1586420743
f
GR
GS
[1.00029 0 0 1.00179 156.50261 67.66205] CT
0.302 GC
N
f-1586420743
f
GR
GS
[1.00029 0 0 1.00179 0 -0.39999] CT
0.6 0.902 1 RC
N
/f-2018905764{220.7 163.5 M
220.7 104.043 L
182.3 104.043 L
182.3 163.5 L
cp}def
f-2018905764
f
GR
GS
[1.00029 0 0 1.00179 210.21833 98.28534] CT
0.302 GC
N
f-1586420743
f
GR
GS
[1.00029 0 0 1.00179 207.15749 77.51014] CT
0.302 GC
N
f-1586420743
f
GR
GS
[1.00029 0 0 1.00179 211.13821 84.1605] CT
0.302 GC
N
f-1586420743
f
GR
GS
[1.00029 0 0 1.00179 200.25234 155.96515] CT
0.302 GC
N
f-1586420743
f
GR
GS
[1.00029 0 0 1.00179 194.30401 80.61931] CT
0.302 GC
N
f-1586420743
f
GR
GS
[1.00029 0 0 1.00179 209.14148 115.24661] CT
0.302 GC
N
f-1586420743
f
GR
GS
[1.00029 0 0 1.00179 192.67833 56.42488] CT
0.302 GC
N
f-1586420743
f
GR
GS
[1.00029 0 0 1.00179 195.37953 95.8223] CT
0.302 GC
N
f-1586420743
f
GR
GS
[1.00029 0 0 1.00179 198.93646 93.0917] CT
0.302 GC
N
f-1586420743
f
GR
GS
[1.00029 0 0 1.00179 203.59003 82.32129] CT
0.302 GC
N
f-1586420743
f
GR
GS
[1.00029 0 0 1.00179 200.23192 85.96219] CT
0.302 GC
N
f-1586420743
f
GR
GS
[1.00029 0 0 1.00179 194.74185 132.38657] CT
0.302 GC
N
f-1586420743
f
GR
GS
[1.00029 0 0 1.00179 207.93065 76.81262] CT
0.302 GC
N
f-1586420743
f
GR
GS
[1.00029 0 0 1.00179 194.83916 76.49435] CT
0.302 GC
N
f-1586420743
f
GR
GS
[1.00029 0 0 1.00179 198.09439 114.59565] CT
0.302 GC
N
f-1586420743
f
GR
GS
[1.00029 0 0 1.00179 204.61559 87.79924] CT
0.302 GC
N
f-1586420743
f
GR
GS
[1.00029 0 0 1.00179 200.6101 93.45926] CT
0.302 GC
N
f-1586420743
f
GR
GS
[1.00029 0 0 1.00179 202.80142 112.63657] CT
0.302 GC
N
f-1586420743
f
GR
GS
[1.00029 0 0 1.00179 203.87708 104.2415] CT
0.302 GC
N
f-1586420743
f
GR
GS
[1.00029 0 0 1.00179 204.85809 145.78131] CT
0.302 GC
N
f-1586420743
f
GR
GS
[1.00029 0 0 1.00179 192.49374 110.34323] CT
0.302 GC
N
f-1586420743
f
GR
GS
[1.00029 0 0 1.00179 207.40169 113.30445] CT
0.302 GC
N
f-1586420743
f
GR
GS
[1.00029 0 0 1.00179 207.01375 114.495] CT
0.302 GC
N
f-1586420743
f
GR
GS
[1.00029 0 0 1.00179 203.01907 117.90399] CT
0.302 GC
N
f-1586420743
f
GR
GS
[1.00029 0 0 1.00179 208.6894 109.47325] CT
0.302 GC
N
f-1586420743
f
GR
GS
[1.00029 0 0 1.00179 196.11341 85.56526] CT
0.302 GC
N
f-1586420743
f
GR
GS
[1.00029 0 0 1.00179 196.87808 80.48285] CT
0.302 GC
N
f-1586420743
f
GR
GS
[1.00029 0 0 1.00179 201.12192 109.42351] CT
0.302 GC
N
f-1586420743
f
GR
GS
[1.00029 0 0 1.00179 206.58537 87.46301] CT
0.302 GC
N
f-1586420743
f
GR
GS
[1.00029 0 0 1.00179 208.01007 96.70368] CT
0.302 GC
N
f-1586420743
f
GR
GS
[1.00029 0 0 1.00179 206.57925 119.06759] CT
0.302 GC
N
f-1586420743
f
GR
GS
[1.00029 0 0 1.00179 206.01143 88.0793] CT
0.302 GC
N
f-1586420743
f
GR
GS
[1.00029 0 0 1.00179 205.4166 121.57329] CT
0.302 GC
N
f-1586420743
f
GR
GS
[1.00029 0 0 1.00179 208.36883 110.45541] CT
0.302 GC
N
f-1586420743
f
GR
GS
[1.00029 0 0 1.00179 197.05898 104.53673] CT
0.302 GC
N
f-1586420743
f
GR
GS
[1.00029 0 0 1.00179 192.91526 111.69069] CT
0.302 GC
N
f-1586420743
f
GR
GS
[1.00029 0 0 1.00179 199.01993 138.83785] CT
0.302 GC
N
f-1586420743
f
GR
GS
[1.00029 0 0 1.00179 198.10589 105.97601] CT
0.302 GC
N
f-1586420743
f
GR
GS
[1.00029 0 0 1.00179 193.58342 103.86167] CT
0.302 GC
N
f-1586420743
f
GR
GS
[1.00029 0 0 1.00179 201.73239 88.27747] CT
0.302 GC
N
f-1586420743
f
GR
GS
[1.00029 0 0 1.00179 195.34716 145.70687] CT
0.302 GC
N
f-1586420743
f
GR
GS
[1.00029 0 0 1.00179 208.01547 131.23103] CT
0.302 GC
N
f-1586420743
f
GR
GS
[1.00029 0 0 1.00179 197.25064 117.66517] CT
0.302 GC
N
f-1586420743
f
GR
GS
[1.00029 0 0 1.00179 204.34065 86.7063] CT
0.302 GC
N
f-1586420743
f
GR
GS
[1.00029 0 0 1.00179 207.18604 97.43009] CT
0.302 GC
N
f-1586420743
f
GR
GS
[1.00029 0 0 1.00179 207.67895 110.93193] CT
0.302 GC
N
f-1586420743
f
GR
GS
[1.00029 0 0 1.00179 197.46366 105.10478] CT
0.302 GC
N
f-1586420743
f
GR
GS
[1.00029 0 0 1.00179 197.27782 98.7349] CT
0.302 GC
N
f-1586420743
f
GR
GS
[1.00029 0 0 1.00179 206.2519 87.14416] CT
0.302 GC
N
f-1586420743
f
GR
GS
[1.00029 0 0 1.00179 209.63035 112.70309] CT
0.302 GC
N
f-1586420743
f
GR
GS
[1.00029 0 0 1.00179 205.03666 68.64214] CT
0.302 GC
N
f-1586420743
f
GR
GS
[1.00029 0 0 1.00179 203.09423 128.96934] CT
0.302 GC
N
f-1586420743
f
GR
GS
[1.00029 0 0 1.00179 200.17124 124.86047] CT
0.302 GC
N
f-1586420743
f
GR
GS
[1.00029 0 0 1.00179 0 -0.39999] CT
1 GC
N
/f-177703284{311.5 163.5 M
431.5 163.5 L
431.5 32 L
311.5 32 L
cp}def
f-177703284
f
GR
GS
[1.00029 0 0 1.00179 0 -0.39999] CT
0.149 GC
2 setlinecap
1 LJ
0.5 LW
N
311.5 163.5 M
431.5 163.5 L
S
GR
GS
[1.00029 0 0 1.00179 0 -0.39999] CT
0.149 GC
2 setlinecap
1 LJ
0.5 LW
N
347.5 163.5 M
347.5 162.185 L
S
GR
GS
[1.00029 0 0 1.00179 0 -0.39999] CT
0.149 GC
2 setlinecap
1 LJ
0.5 LW
N
395.5 163.5 M
395.5 162.185 L
S
GR
GS
[1.00029 0 0 1.00179 347.60059 169.80475] CT
0.149 GC
/Helvetica 22 F
GS
[1 0 0 1 0 0] CT
-14.5 21 moveto 
1 -1 scale
(YA) t 
GR
GR
GS
[1.00029 0 0 1.00179 395.61448 169.80475] CT
0.149 GC
/Helvetica 22 F
GS
[1 0 0 1 0 0] CT
-15.5 21 moveto 
1 -1 scale
(OA) t 
GR
GR
GS
[1.00029 0 0 1.00179 371.60759 196.85318] CT
0.149 GC
/Helvetica 22 F
GS
[1 0 0 1 0 0] CT
-53.5 21 moveto 
1 -1 scale
(Age Group) t 
GR
GR
GS
[1.00029 0 0 1.00179 0 -0.39999] CT
0.149 GC
2 setlinecap
1 LJ
0.5 LW
N
311.5 163.5 M
311.5 32 L
S
GR
GS
[1.00029 0 0 1.00179 0 -0.39999] CT
0.149 GC
2 setlinecap
1 LJ
0.5 LW
N
311.5 163.5 M
312.815 163.5 L
S
GR
GS
[1.00029 0 0 1.00179 0 -0.39999] CT
0.149 GC
2 setlinecap
1 LJ
0.5 LW
N
311.5 77.583 M
312.815 77.583 L
S
GR
GS
[1.00029 0 0 1.00179 305.18832 163.39328] CT
0.149 GC
/Helvetica 22 F
GS
[1 0 0 1 0 0] CT
-13 8 moveto 
1 -1 scale
(0) t 
GR
GR
GS
[1.00029 0 0 1.00179 305.18832 77.32209] CT
0.149 GC
/Helvetica 22 F
GS
[1 0 0 1 0 0] CT
-13 8 moveto 
1 -1 scale
(1) t 
GR
GR
GS
[0 -1.00179 1.00029 0 289.68383 97.52528] CT
0.149 GC
/Helvetica 22 F
GS
[1 0 0 1 0 0] CT
-64.5 -5 moveto 
1 -1 scale
(Threshold L1) t 
GR
GR
GS
[1.00029 0 0 1.00179 371.6079 28.90247] CT
/Helvetica-Bold 22 F
GS
[1 0 0 1 0 0] CT
-65.5 -5 moveto 
1 -1 scale
(p = 0.004453) t 
GR
GR
GS
[1.00029 0 0 1.00179 0 -0.39999] CT
0.149 GC
1 LJ
0.5 LW
N
311.5 163.5 M
431.5 163.5 L
S
GR
GS
[1.00029 0 0 1.00179 0 -0.39999] CT
1 0.6 0.6 RC
N
/f-283214714{366.7 163.5 M
366.7 80.764 L
328.3 80.764 L
328.3 163.5 L
cp}def
f-283214714
f
GR
GS
[1.00029 0 0 1.00179 346.84347 91.18743] CT
0.302 GC
N
f-1586420743
f
GR
GS
[1.00029 0 0 1.00179 340.63601 97.85424] CT
0.302 GC
N
f-1586420743
f
GR
GS
[1.00029 0 0 1.00179 346.60252 77.37691] CT
0.302 GC
N
f-1586420743
f
GR
GS
[1.00029 0 0 1.00179 340.29265 77.31588] CT
0.302 GC
N
f-1586420743
f
GR
GS
[1.00029 0 0 1.00179 354.52053 78.51718] CT
0.302 GC
N
f-1586420743
f
GR
GS
[1.00029 0 0 1.00179 349.36065 63.61641] CT
0.302 GC
N
f-1586420743
f
GR
GS
[1.00029 0 0 1.00179 344.78165 96.97508] CT
0.302 GC
N
f-1586420743
f
GR
GS
[1.00029 0 0 1.00179 355.77916 68.21727] CT
0.302 GC
N
f-1586420743
f
GR
GS
[1.00029 0 0 1.00179 350.16935 89.86754] CT
0.302 GC
N
f-1586420743
f
GR
GS
[1.00029 0 0 1.00179 342.98157 42.61756] CT
0.302 GC
N
f-1586420743
f
GR
GS
[1.00029 0 0 1.00179 350.43957 75.90677] CT
0.302 GC
N
f-1586420743
f
GR
GS
[1.00029 0 0 1.00179 346.28725 67.37087] CT
0.302 GC
N
f-1586420743
f
GR
GS
[1.00029 0 0 1.00179 342.25962 77.89227] CT
0.302 GC
N
f-1586420743
f
GR
GS
[1.00029 0 0 1.00179 353.90725 78.59073] CT
0.302 GC
N
f-1586420743
f
GR
GS
[1.00029 0 0 1.00179 344.99763 65.2504] CT
0.302 GC
N
f-1586420743
f
GR
GS
[1.00029 0 0 1.00179 344.54804 63.13859] CT
0.302 GC
N
f-1586420743
f
GR
GS
[1.00029 0 0 1.00179 348.96814 82.38276] CT
0.302 GC
N
f-1586420743
f
GR
GS
[1.00029 0 0 1.00179 349.1792 51.28737] CT
0.302 GC
N
f-1586420743
f
GR
GS
[1.00029 0 0 1.00179 352.46076 73.44495] CT
0.302 GC
N
f-1586420743
f
GR
GS
[1.00029 0 0 1.00179 356.88376 73.16954] CT
0.302 GC
N
f-1586420743
f
GR
GS
[1.00029 0 0 1.00179 349.28851 61.60195] CT
0.302 GC
N
f-1586420743
f
GR
GS
[1.00029 0 0 1.00179 339.11424 61.07809] CT
0.302 GC
N
f-1586420743
f
GR
GS
[1.00029 0 0 1.00179 343.59772 64.93356] CT
0.302 GC
N
f-1586420743
f
GR
GS
[1.00029 0 0 1.00179 355.81359 80.30835] CT
0.302 GC
N
f-1586420743
f
GR
GS
[1.00029 0 0 1.00179 343.46505 97.91025] CT
0.302 GC
N
f-1586420743
f
GR
GS
[1.00029 0 0 1.00179 345.33928 106.04421] CT
0.302 GC
N
f-1586420743
f
GR
GS
[1.00029 0 0 1.00179 353.05175 89.51285] CT
0.302 GC
N
f-1586420743
f
GR
GS
[1.00029 0 0 1.00179 340.80525 105.16402] CT
0.302 GC
N
f-1586420743
f
GR
GS
[1.00029 0 0 1.00179 340.69624 81.28441] CT
0.302 GC
N
f-1586420743
f
GR
GS
[1.00029 0 0 1.00179 343.6396 40.14326] CT
0.302 GC
N
f-1586420743
f
GR
GS
[1.00029 0 0 1.00179 350.33218 96.84144] CT
0.302 GC
N
f-1586420743
f
GR
GS
[1.00029 0 0 1.00179 356.77493 93.37081] CT
0.302 GC
N
f-1586420743
f
GR
GS
[1.00029 0 0 1.00179 353.6171 103.03861] CT
0.302 GC
N
f-1586420743
f
GR
GS
[1.00029 0 0 1.00179 346.54745 83.00509] CT
0.302 GC
N
f-1586420743
f
GR
GS
[1.00029 0 0 1.00179 343.83344 97.02678] CT
0.302 GC
N
f-1586420743
f
GR
GS
[1.00029 0 0 1.00179 340.72726 77.59655] CT
0.302 GC
N
f-1586420743
f
GR
GS
[1.00029 0 0 1.00179 356.46039 90.90008] CT
0.302 GC
N
f-1586420743
f
GR
GS
[1.00029 0 0 1.00179 350.8747 74.86865] CT
0.302 GC
N
f-1586420743
f
GR
GS
[1.00029 0 0 1.00179 349.88839 97.21035] CT
0.302 GC
N
f-1586420743
f
GR
GS
[1.00029 0 0 1.00179 342.65653 95.57977] CT
0.302 GC
N
f-1586420743
f
GR
GS
[1.00029 0 0 1.00179 339.87273 76.32808] CT
0.302 GC
N
f-1586420743
f
GR
GS
[1.00029 0 0 1.00179 352.06107 98.4901] CT
0.302 GC
N
f-1586420743
f
GR
GS
[1.00029 0 0 1.00179 355.32468 85.3875] CT
0.302 GC
N
f-1586420743
f
GR
GS
[1.00029 0 0 1.00179 352.87024 85.83513] CT
0.302 GC
N
f-1586420743
f
GR
GS
[1.00029 0 0 1.00179 340.84207 91.69625] CT
0.302 GC
N
f-1586420743
f
GR
GS
[1.00029 0 0 1.00179 354.03726 74.32947] CT
0.302 GC
N
f-1586420743
f
GR
GS
[1.00029 0 0 1.00179 343.5718 88.93655] CT
0.302 GC
N
f-1586420743
f
GR
GS
[1.00029 0 0 1.00179 338.32474 92.28573] CT
0.302 GC
N
f-1586420743
f
GR
GS
[1.00029 0 0 1.00179 340.4245 62.26302] CT
0.302 GC
N
f-1586420743
f
GR
GS
[1.00029 0 0 1.00179 0 -0.39999] CT
1 0.6 0.6 RC
N
/f-1068001826{414.7 163.5 M
414.7 70.866 L
376.3 70.866 L
376.3 163.5 L
cp}def
f-1068001826
f
GR
GS
[1.00029 0 0 1.00179 391.13164 82.23635] CT
0.302 GC
N
f-1586420743
f
GR
GS
[1.00029 0 0 1.00179 393.64727 54.60285] CT
0.302 GC
N
f-1586420743
f
GR
GS
[1.00029 0 0 1.00179 403.68682 73.39007] CT
0.302 GC
N
f-1586420743
f
GR
GS
[1.00029 0 0 1.00179 400.34336 39.94133] CT
0.302 GC
N
f-1586420743
f
GR
GS
[1.00029 0 0 1.00179 404.84814 71.5045] CT
0.302 GC
N
f-1586420743
f
GR
GS
[1.00029 0 0 1.00179 389.30604 48.01901] CT
0.302 GC
N
f-1586420743
f
GR
GS
[1.00029 0 0 1.00179 391.6157 61.4138] CT
0.302 GC
N
f-1586420743
f
GR
GS
[1.00029 0 0 1.00179 388.39477 73.77298] CT
0.302 GC
N
f-1586420743
f
GR
GS
[1.00029 0 0 1.00179 395.96999 80.19158] CT
0.302 GC
N
f-1586420743
f
GR
GS
[1.00029 0 0 1.00179 395.43617 52.91042] CT
0.302 GC
N
f-1586420743
f
GR
GS
[1.00029 0 0 1.00179 394.44208 35.1093] CT
0.302 GC
N
f-1586420743
f
GR
GS
[1.00029 0 0 1.00179 394.92345 37.59124] CT
0.302 GC
N
f-1586420743
f
GR
GS
[1.00029 0 0 1.00179 390.71352 101.7778] CT
0.302 GC
N
f-1586420743
f
GR
GS
[1.00029 0 0 1.00179 397.9528 81.16512] CT
0.302 GC
N
f-1586420743
f
GR
GS
[1.00029 0 0 1.00179 394.94235 66.86278] CT
0.302 GC
N
f-1586420743
f
GR
GS
[1.00029 0 0 1.00179 398.23444 82.65112] CT
0.302 GC
N
f-1586420743
f
GR
GS
[1.00029 0 0 1.00179 405.07626 95.5752] CT
0.302 GC
N
f-1586420743
f
GR
GS
[1.00029 0 0 1.00179 403.56243 78.08825] CT
0.302 GC
N
f-1586420743
f
GR
GS
[1.00029 0 0 1.00179 396.97187 113.08144] CT
0.302 GC
N
f-1586420743
f
GR
GS
[1.00029 0 0 1.00179 387.59708 50.07784] CT
0.302 GC
N
f-1586420743
f
GR
GS
[1.00029 0 0 1.00179 396.28997 67.36222] CT
0.302 GC
N
f-1586420743
f
GR
GS
[1.00029 0 0 1.00179 403.84574 87.84357] CT
0.302 GC
N
f-1586420743
f
GR
GS
[1.00029 0 0 1.00179 391.26071 62.55343] CT
0.302 GC
N
f-1586420743
f
GR
GS
[1.00029 0 0 1.00179 401.44469 67.3461] CT
0.302 GC
N
f-1586420743
f
GR
GS
[1.00029 0 0 1.00179 399.28534 63.88066] CT
0.302 GC
N
f-1586420743
f
GR
GS
[1.00029 0 0 1.00179 390.86258 95.9741] CT
0.302 GC
N
f-1586420743
f
GR
GS
[1.00029 0 0 1.00179 395.30573 91.60629] CT
0.302 GC
N
f-1586420743
f
GR
GS
[1.00029 0 0 1.00179 387.34991 62.29575] CT
0.302 GC
N
f-1586420743
f
GR
GS
[1.00029 0 0 1.00179 399.53511 80.24724] CT
0.302 GC
N
f-1586420743
f
GR
GS
[1.00029 0 0 1.00179 402.97812 85.97181] CT
0.302 GC
N
f-1586420743
f
GR
GS
[1.00029 0 0 1.00179 389.3544 63.95247] CT
0.302 GC
N
f-1586420743
f
GR
GS
[1.00029 0 0 1.00179 396.64539 76.7219] CT
0.302 GC
N
f-1586420743
f
GR
GS
[1.00029 0 0 1.00179 393.64754 69.22245] CT
0.302 GC
N
f-1586420743
f
GR
GS
[1.00029 0 0 1.00179 398.99946 73.5341] CT
0.302 GC
N
f-1586420743
f
GR
GS
[1.00029 0 0 1.00179 402.5317 38.35631] CT
0.302 GC
N
f-1586420743
f
GR
GS
[1.00029 0 0 1.00179 393.75173 93.83408] CT
0.302 GC
N
f-1586420743
f
GR
GS
[1.00029 0 0 1.00179 401.23763 31.6574] CT
0.302 GC
N
f-1586420743
f
GR
GS
[1.00029 0 0 1.00179 389.40083 76.39892] CT
0.302 GC
N
f-1586420743
f
GR
GS
[1.00029 0 0 1.00179 394.24079 56.08529] CT
0.302 GC
N
f-1586420743
f
GR
GS
[1.00029 0 0 1.00179 392.92162 74.96289] CT
0.302 GC
N
f-1586420743
f
GR
GS
[1.00029 0 0 1.00179 396.58091 67.91132] CT
0.302 GC
N
f-1586420743
f
GR
GS
[1.00029 0 0 1.00179 400.35963 74.19664] CT
0.302 GC
N
f-1586420743
f
GR
GS
[1.00029 0 0 1.00179 388.93374 97.91629] CT
0.302 GC
N
f-1586420743
f
GR
GS
[1.00029 0 0 1.00179 394.19934 37.31825] CT
0.302 GC
N
f-1586420743
f
GR
GS
[1.00029 0 0 1.00179 388.28332 78.81695] CT
0.302 GC
N
f-1586420743
f
GR
GS
[1.00029 0 0 1.00179 395.54714 62.40534] CT
0.302 GC
N
f-1586420743
f
GR
GS
[1.00029 0 0 1.00179 401.22529 102.33964] CT
0.302 GC
N
f-1586420743
f
GR
GS
[1.00029 0 0 1.00179 400.02835 49.53631] CT
0.302 GC
N
f-1586420743
f
GR
GS
[1.00029 0 0 1.00179 393.72495 79.8194] CT
0.302 GC
N
f-1586420743
f
GR
GS
[1.00029 0 0 1.00179 386.58242 80.07358] CT
0.302 GC
N
f-1586420743
f
GR
GS
[1.00029 0 0 1.00179 394.80959 66.46568] CT
0.302 GC
N
f-1586420743
f
GR
GS
[1.00029 0 0 1.00179 401.75719 65.34083] CT
0.302 GC
N
f-1586420743
f
GR
GS
[1.00029 0 0 1.00179 396.89332 79.51374] CT
0.302 GC
N
f-1586420743
f
GR
GS
[1.00029 0 0 1.00179 0 -0.39999] CT
1 GC
N
/f1157566174{505.5 163.5 M
625.5 163.5 L
625.5 32 L
505.5 32 L
cp}def
f1157566174
f
GR
GS
[1.00029 0 0 1.00179 0 -0.39999] CT
0.149 GC
2 setlinecap
1 LJ
0.5 LW
N
505.5 163.5 M
625.5 163.5 L
S
GR
GS
[1.00029 0 0 1.00179 0 -0.39999] CT
0.149 GC
2 setlinecap
1 LJ
0.5 LW
N
541.5 163.5 M
541.5 162.185 L
S
GR
GS
[1.00029 0 0 1.00179 0 -0.39999] CT
0.149 GC
2 setlinecap
1 LJ
0.5 LW
N
589.5 163.5 M
589.5 162.185 L
S
GR
GS
[1.00029 0 0 1.00179 541.65674 169.80475] CT
0.149 GC
/Helvetica 22 F
GS
[1 0 0 1 0 0] CT
-14.5 21 moveto 
1 -1 scale
(YA) t 
GR
GR
GS
[1.00029 0 0 1.00179 589.67063 169.80475] CT
0.149 GC
/Helvetica 22 F
GS
[1 0 0 1 0 0] CT
-15.5 21 moveto 
1 -1 scale
(OA) t 
GR
GR
GS
[1.00029 0 0 1.00179 565.66375 196.85319] CT
0.149 GC
/Helvetica 22 F
GS
[1 0 0 1 0 0] CT
-53.5 21 moveto 
1 -1 scale
(Age Group) t 
GR
GR
GS
[1.00029 0 0 1.00179 0 -0.39999] CT
0.149 GC
2 setlinecap
1 LJ
0.5 LW
N
505.5 163.5 M
505.5 32 L
S
GR
GS
[1.00029 0 0 1.00179 0 -0.39999] CT
0.149 GC
2 setlinecap
1 LJ
0.5 LW
N
505.5 163.5 M
506.815 163.5 L
S
GR
GS
[1.00029 0 0 1.00179 0 -0.39999] CT
0.149 GC
2 setlinecap
1 LJ
0.5 LW
N
505.5 32 M
506.815 32 L
S
GR
GS
[1.00029 0 0 1.00179 499.24447 163.39328] CT
0.149 GC
/Helvetica 22 F
GS
[1 0 0 1 0 0] CT
-13 8 moveto 
1 -1 scale
(0) t 
GR
GR
GS
[1.00029 0 0 1.00179 499.24447 31.6574] CT
0.149 GC
/Helvetica 22 F
GS
[1 0 0 1 0 0] CT
-31 8 moveto 
1 -1 scale
(0.5) t 
GR
GR
GS
[0 -1.00179 1.00029 0 465.23463 97.52528] CT
0.149 GC
/Helvetica 22 F
GS
[1 0 0 1 0 0] CT
-37.5 -5 moveto 
1 -1 scale
(NDT L1) t 
GR
GR
GS
[1.00029 0 0 1.00179 565.66424 28.90247] CT
/Helvetica-Bold 22 F
GS
[1 0 0 1 0 0] CT
-76.5 -5 moveto 
1 -1 scale
(p = 2.8896e-11) t 
GR
GR
GS
[1.00029 0 0 1.00179 0 -0.39999] CT
0.149 GC
1 LJ
0.5 LW
N
505.5 163.5 M
625.5 163.5 L
S
GR
GS
[1.00029 0 0 1.00179 0 -0.39999] CT
1 0.6 0.6 RC
N
/f-1463361650{560.7 163.5 M
560.7 95.489 L
522.3 95.489 L
522.3 163.5 L
cp}def
f-1463361650
f
GR
GS
[1.00029 0 0 1.00179 551.1949 94.8684] CT
0.302 GC
N
f-1586420743
f
GR
GS
[1.00029 0 0 1.00179 545.17387 98.43424] CT
0.302 GC
N
f-1586420743
f
GR
GS
[1.00029 0 0 1.00179 533.47987 104.26929] CT
0.302 GC
N
f-1586420743
f
GR
GS
[1.00029 0 0 1.00179 548.15477 103.9023] CT
0.302 GC
N
f-1586420743
f
GR
GS
[1.00029 0 0 1.00179 538.1473 93.60562] CT
0.302 GC
N
f-1586420743
f
GR
GS
[1.00029 0 0 1.00179 532.82868 105.63492] CT
0.302 GC
N
f-1586420743
f
GR
GS
[1.00029 0 0 1.00179 534.40757 89.66835] CT
0.302 GC
N
f-1586420743
f
GR
GS
[1.00029 0 0 1.00179 538.67284 87.58691] CT
0.302 GC
N
f-1586420743
f
GR
GS
[1.00029 0 0 1.00179 534.57168 90.6615] CT
0.302 GC
N
f-1586420743
f
GR
GS
[1.00029 0 0 1.00179 541.33817 102.03768] CT
0.302 GC
N
f-1586420743
f
GR
GS
[1.00029 0 0 1.00179 549.94851 112.49904] CT
0.302 GC
N
f-1586420743
f
GR
GS
[1.00029 0 0 1.00179 550.31562 105.24096] CT
0.302 GC
N
f-1586420743
f
GR
GS
[1.00029 0 0 1.00179 549.0597 92.00704] CT
0.302 GC
N
f-1586420743
f
GR
GS
[1.00029 0 0 1.00179 535.56068 106.34448] CT
0.302 GC
N
f-1586420743
f
GR
GS
[1.00029 0 0 1.00179 545.67585 90.19816] CT
0.302 GC
N
f-1586420743
f
GR
GS
[1.00029 0 0 1.00179 536.17078 101.15158] CT
0.302 GC
N
f-1586420743
f
GR
GS
[1.00029 0 0 1.00179 538.27423 100.51435] CT
0.302 GC
N
f-1586420743
f
GR
GS
[1.00029 0 0 1.00179 538.09889 100.47533] CT
0.302 GC
N
f-1586420743
f
GR
GS
[1.00029 0 0 1.00179 538.24315 94.31376] CT
0.302 GC
N
f-1586420743
f
GR
GS
[1.00029 0 0 1.00179 539.22427 78.97338] CT
0.302 GC
N
f-1586420743
f
GR
GS
[1.00029 0 0 1.00179 541.32406 71.15407] CT
0.302 GC
N
f-1586420743
f
GR
GS
[1.00029 0 0 1.00179 539.12067 90.72493] CT
0.302 GC
N
f-1586420743
f
GR
GS
[1.00029 0 0 1.00179 535.12116 93.79462] CT
0.302 GC
N
f-1586420743
f
GR
GS
[1.00029 0 0 1.00179 538.15432 96.39584] CT
0.302 GC
N
f-1586420743
f
GR
GS
[1.00029 0 0 1.00179 545.24756 81.30701] CT
0.302 GC
N
f-1586420743
f
GR
GS
[1.00029 0 0 1.00179 535.01181 98.70548] CT
0.302 GC
N
f-1586420743
f
GR
GS
[1.00029 0 0 1.00179 546.74616 99.36912] CT
0.302 GC
N
f-1586420743
f
GR
GS
[1.00029 0 0 1.00179 532.20808 101.89963] CT
0.302 GC
N
f-1586420743
f
GR
GS
[1.00029 0 0 1.00179 546.82474 95.02681] CT
0.302 GC
N
f-1586420743
f
GR
GS
[1.00029 0 0 1.00179 534.30885 85.31515] CT
0.302 GC
N
f-1586420743
f
GR
GS
[1.00029 0 0 1.00179 535.61617 101.27309] CT
0.302 GC
N
f-1586420743
f
GR
GS
[1.00029 0 0 1.00179 549.80741 95.49485] CT
0.302 GC
N
f-1586420743
f
GR
GS
[1.00029 0 0 1.00179 545.27851 93.61972] CT
0.302 GC
N
f-1586420743
f
GR
GS
[1.00029 0 0 1.00179 544.57091 92.34826] CT
0.302 GC
N
f-1586420743
f
GR
GS
[1.00029 0 0 1.00179 538.83726 94.29982] CT
0.302 GC
N
f-1586420743
f
GR
GS
[1.00029 0 0 1.00179 537.32919 95.44447] CT
0.302 GC
N
f-1586420743
f
GR
GS
[1.00029 0 0 1.00179 535.71392 66.3207] CT
0.302 GC
N
f-1586420743
f
GR
GS
[1.00029 0 0 1.00179 549.75466 97.03871] CT
0.302 GC
N
f-1586420743
f
GR
GS
[1.00029 0 0 1.00179 537.22308 99.90577] CT
0.302 GC
N
f-1586420743
f
GR
GS
[1.00029 0 0 1.00179 543.91081 101.30034] CT
0.302 GC
N
f-1586420743
f
GR
GS
[1.00029 0 0 1.00179 547.08415 95.91756] CT
0.302 GC
N
f-1586420743
f
GR
GS
[1.00029 0 0 1.00179 548.29391 90.96767] CT
0.302 GC
N
f-1586420743
f
GR
GS
[1.00029 0 0 1.00179 544.46138 92.88461] CT
0.302 GC
N
f-1586420743
f
GR
GS
[1.00029 0 0 1.00179 535.25584 99.56538] CT
0.302 GC
N
f-1586420743
f
GR
GS
[1.00029 0 0 1.00179 545.12295 102.06743] CT
0.302 GC
N
f-1586420743
f
GR
GS
[1.00029 0 0 1.00179 532.185 103.22586] CT
0.302 GC
N
f-1586420743
f
GR
GS
[1.00029 0 0 1.00179 537.4756 99.80508] CT
0.302 GC
N
f-1586420743
f
GR
GS
[1.00029 0 0 1.00179 543.11492 89.76471] CT
0.302 GC
N
f-1586420743
f
GR
GS
[1.00029 0 0 1.00179 550.04369 90.41195] CT
0.302 GC
N
f-1586420743
f
GR
GS
[1.00029 0 0 1.00179 0 -0.39999] CT
1 0.6 0.6 RC
N
/f-552668176{608.7 163.5 M
608.7 79.361 L
570.3 79.361 L
570.3 163.5 L
cp}def
f-552668176
f
GR
GS
[1.00029 0 0 1.00179 597.73412 90.43952] CT
0.302 GC
N
f-1586420743
f
GR
GS
[1.00029 0 0 1.00179 580.82939 91.1525] CT
0.302 GC
N
f-1586420743
f
GR
GS
[1.00029 0 0 1.00179 598.37017 80.43921] CT
0.302 GC
N
f-1586420743
f
GR
GS
[1.00029 0 0 1.00179 580.21923 69.61103] CT
0.302 GC
N
f-1586420743
f
GR
GS
[1.00029 0 0 1.00179 583.05037 80.41621] CT
0.302 GC
N
f-1586420743
f
GR
GS
[1.00029 0 0 1.00179 589.0573 101.69201] CT
0.302 GC
N
f-1586420743
f
GR
GS
[1.00029 0 0 1.00179 585.95551 48.29567] CT
0.302 GC
N
f-1586420743
f
GR
GS
[1.00029 0 0 1.00179 580.90064 52.7822] CT
0.302 GC
N
f-1586420743
f
GR
GS
[1.00029 0 0 1.00179 597.94018 79.15338] CT
0.302 GC
N
f-1586420743
f
GR
GS
[1.00029 0 0 1.00179 584.97042 68.4859] CT
0.302 GC
N
f-1586420743
f
GR
GS
[1.00029 0 0 1.00179 596.14419 82.21773] CT
0.302 GC
N
f-1586420743
f
GR
GS
[1.00029 0 0 1.00179 597.5597 70.95649] CT
0.302 GC
N
f-1586420743
f
GR
GS
[1.00029 0 0 1.00179 598.42762 89.96744] CT
0.302 GC
N
f-1586420743
f
GR
GS
[1.00029 0 0 1.00179 583.02338 75.31191] CT
0.302 GC
N
f-1586420743
f
GR
GS
[1.00029 0 0 1.00179 584.33413 73.85821] CT
0.302 GC
N
f-1586420743
f
GR
GS
[1.00029 0 0 1.00179 591.56889 55.38417] CT
0.302 GC
N
f-1586420743
f
GR
GS
[1.00029 0 0 1.00179 582.21529 76.00918] CT
0.302 GC
N
f-1586420743
f
GR
GS
[1.00029 0 0 1.00179 593.50048 68.36235] CT
0.302 GC
N
f-1586420743
f
GR
GS
[1.00029 0 0 1.00179 594.02309 98.2647] CT
0.302 GC
N
f-1586420743
f
GR
GS
[1.00029 0 0 1.00179 586.89859 81.88352] CT
0.302 GC
N
f-1586420743
f
GR
GS
[1.00029 0 0 1.00179 585.07665 65.82712] CT
0.302 GC
N
f-1586420743
f
GR
GS
[1.00029 0 0 1.00179 588.02581 81.57316] CT
0.302 GC
N
f-1586420743
f
GR
GS
[1.00029 0 0 1.00179 597.56745 81.77494] CT
0.302 GC
N
f-1586420743
f
GR
GS
[1.00029 0 0 1.00179 580.52791 64.01287] CT
0.302 GC
N
f-1586420743
f
GR
GS
[1.00029 0 0 1.00179 597.19411 77.43025] CT
0.302 GC
N
f-1586420743
f
GR
GS
[1.00029 0 0 1.00179 588.91382 94.8374] CT
0.302 GC
N
f-1586420743
f
GR
GS
[1.00029 0 0 1.00179 592.25665 93.11725] CT
0.302 GC
N
f-1586420743
f
GR
GS
[1.00029 0 0 1.00179 581.09436 64.94095] CT
0.302 GC
N
f-1586420743
f
GR
GS
[1.00029 0 0 1.00179 590.57055 68.60938] CT
0.302 GC
N
f-1586420743
f
GR
GS
[1.00029 0 0 1.00179 596.46612 73.63905] CT
0.302 GC
N
f-1586420743
f
GR
GS
[1.00029 0 0 1.00179 590.84462 85.63026] CT
0.302 GC
N
f-1586420743
f
GR
GS
[1.00029 0 0 1.00179 594.57824 88.79205] CT
0.302 GC
N
f-1586420743
f
GR
GS
[1.00029 0 0 1.00179 589.40151 84.71849] CT
0.302 GC
N
f-1586420743
f
GR
GS
[1.00029 0 0 1.00179 597.38307 83.4457] CT
0.302 GC
N
f-1586420743
f
GR
GS
[1.00029 0 0 1.00179 591.14915 95.46733] CT
0.302 GC
N
f-1586420743
f
GR
GS
[1.00029 0 0 1.00179 582.03586 68.43474] CT
0.302 GC
N
f-1586420743
f
GR
GS
[1.00029 0 0 1.00179 584.967 88.26118] CT
0.302 GC
N
f-1586420743
f
GR
GS
[1.00029 0 0 1.00179 580.78427 89.10739] CT
0.302 GC
N
f-1586420743
f
GR
GS
[1.00029 0 0 1.00179 584.17307 94.3418] CT
0.302 GC
N
f-1586420743
f
GR
GS
[1.00029 0 0 1.00179 580.28462 90.71201] CT
0.302 GC
N
f-1586420743
f
GR
GS
[1.00029 0 0 1.00179 597.98096 75.10926] CT
0.302 GC
N
f-1586420743
f
GR
GS
[1.00029 0 0 1.00179 598.44911 72.09706] CT
0.302 GC
N
f-1586420743
f
GR
GS
[1.00029 0 0 1.00179 587.87287 87.15534] CT
0.302 GC
N
f-1586420743
f
GR
GS
[1.00029 0 0 1.00179 595.01978 51.17603] CT
0.302 GC
N
f-1586420743
f
GR
GS
[1.00029 0 0 1.00179 596.27972 92.90703] CT
0.302 GC
N
f-1586420743
f
GR
GS
[1.00029 0 0 1.00179 598.23689 64.52866] CT
0.302 GC
N
f-1586420743
f
GR
GS
[1.00029 0 0 1.00179 596.41178 95.44995] CT
0.302 GC
N
f-1586420743
f
GR
GS
[1.00029 0 0 1.00179 592.39469 74.66961] CT
0.302 GC
N
f-1586420743
f
GR
GS
[1.00029 0 0 1.00179 596.4561 85.2644] CT
0.302 GC
N
f-1586420743
f
GR
GS
[1.00029 0 0 1.00179 582.6009 69.24846] CT
0.302 GC
N
f-1586420743
f
GR
GS
[1.00029 0 0 1.00179 583.94815 98.55494] CT
0.302 GC
N
f-1586420743
f
GR
GS
[1.00029 0 0 1.00179 591.03986 76.21393] CT
0.302 GC
N
f-1586420743
f
GR
GS
[1.00029 0 0 1.00179 592.54146 80.74566] CT
0.302 GC
N
f-1586420743
f
GR
%%Trailer
%%Pages: 1
%%EOF
