%!PS-Adobe-3.0 EPSF-3.0
%%Creator: (MATLAB, The Mathworks, Inc. Version 9.8.0.1323502 \(R2020a\). Operating System: Mac OS X)
%%Title: /Users/ddg/Volumes/tardis_mpib.localized/stateswitch/stsw_beh_task/hddm_matched/figures/c1_matcheddriftL1.eps
%%CreationDate: 2024-05-07T11:58:28
%%Pages: (atend)
%%BoundingBox:     4     0   348   339
%%LanguageLevel: 3
%%EndComments
%%BeginProlog
%%BeginResource: procset (Apache XML Graphics Std ProcSet) 1.2 0
%%Version: 1.2 0
%%Copyright: (Copyright 2001-2003,2010 The Apache Software Foundation. License terms: http://www.apache.org/licenses/LICENSE-2.0)
/bd{bind def}bind def
/ld{load def}bd
/GR/grestore ld
/GS/gsave ld
/RM/rmoveto ld
/C/curveto ld
/t/show ld
/L/lineto ld
/ML/setmiterlimit ld
/CT/concat ld
/f/fill ld
/N/newpath ld
/S/stroke ld
/CC/setcmykcolor ld
/A/ashow ld
/cp/closepath ld
/RC/setrgbcolor ld
/LJ/setlinejoin ld
/GC/setgray ld
/LW/setlinewidth ld
/M/moveto ld
/re {4 2 roll M
1 index 0 rlineto
0 exch rlineto
neg 0 rlineto
cp } bd
/_ctm matrix def
/_tm matrix def
/BT { _ctm currentmatrix pop matrix _tm copy pop 0 0 moveto } bd
/ET { _ctm setmatrix } bd
/iTm { _ctm setmatrix _tm concat } bd
/Tm { _tm astore pop iTm 0 0 moveto } bd
/ux 0.0 def
/uy 0.0 def
/F {
  /Tp exch def
  /Tf exch def
  Tf findfont Tp scalefont setfont
  /cf Tf def  /cs Tp def
} bd
/ULS {currentpoint /uy exch def /ux exch def} bd
/ULE {
  /Tcx currentpoint pop def
  gsave
  newpath
  cf findfont cs scalefont dup
  /FontMatrix get 0 get /Ts exch def /FontInfo get dup
  /UnderlinePosition get Ts mul /To exch def
  /UnderlineThickness get Ts mul /Tt exch def
  ux uy To add moveto  Tcx uy To add lineto
  Tt setlinewidth stroke
  grestore
} bd
/OLE {
  /Tcx currentpoint pop def
  gsave
  newpath
  cf findfont cs scalefont dup
  /FontMatrix get 0 get /Ts exch def /FontInfo get dup
  /UnderlinePosition get Ts mul /To exch def
  /UnderlineThickness get Ts mul /Tt exch def
  ux uy To add cs add moveto Tcx uy To add cs add lineto
  Tt setlinewidth stroke
  grestore
} bd
/SOE {
  /Tcx currentpoint pop def
  gsave
  newpath
  cf findfont cs scalefont dup
  /FontMatrix get 0 get /Ts exch def /FontInfo get dup
  /UnderlinePosition get Ts mul /To exch def
  /UnderlineThickness get Ts mul /Tt exch def
  ux uy To add cs 10 mul 26 idiv add moveto Tcx uy To add cs 10 mul 26 idiv add lineto
  Tt setlinewidth stroke
  grestore
} bd
/QT {
/Y22 exch store
/X22 exch store
/Y21 exch store
/X21 exch store
currentpoint
/Y21 load 2 mul add 3 div exch
/X21 load 2 mul add 3 div exch
/X21 load 2 mul /X22 load add 3 div
/Y21 load 2 mul /Y22 load add 3 div
/X22 load /Y22 load curveto
} bd
/SSPD {
dup length /d exch dict def
{
/v exch def
/k exch def
currentpagedevice k known {
/cpdv currentpagedevice k get def
v cpdv ne {
/upd false def
/nullv v type /nulltype eq def
/nullcpdv cpdv type /nulltype eq def
nullv nullcpdv or
{
/upd true def
} {
/sametype v type cpdv type eq def
sametype {
v type /arraytype eq {
/vlen v length def
/cpdvlen cpdv length def
vlen cpdvlen eq {
0 1 vlen 1 sub {
/i exch def
/obj v i get def
/cpdobj cpdv i get def
obj cpdobj ne {
/upd true def
exit
} if
} for
} {
/upd true def
} ifelse
} {
v type /dicttype eq {
v {
/dv exch def
/dk exch def
/cpddv cpdv dk get def
dv cpddv ne {
/upd true def
exit
} if
} forall
} {
/upd true def
} ifelse
} ifelse
} if
} ifelse
upd true eq {
d k v put
} if
} if
} if
} forall
d length 0 gt {
d setpagedevice
} if
} bd
/RE { % /NewFontName [NewEncodingArray] /FontName RE -
  findfont dup length dict begin
  {
    1 index /FID ne
    {def} {pop pop} ifelse
  } forall
  /Encoding exch def
  /FontName 1 index def
  currentdict definefont pop
  end
} bind def
%%EndResource
%%BeginResource: procset (Apache XML Graphics EPS ProcSet) 1.0 0
%%Version: 1.0 0
%%Copyright: (Copyright 2002-2003 The Apache Software Foundation. License terms: http://www.apache.org/licenses/LICENSE-2.0)
/BeginEPSF { %def
/b4_Inc_state save def         % Save state for cleanup
/dict_count countdictstack def % Count objects on dict stack
/op_count count 1 sub def      % Count objects on operand stack
userdict begin                 % Push userdict on dict stack
/showpage { } def              % Redefine showpage, { } = null proc
0 setgray 0 setlinecap         % Prepare graphics state
1 setlinewidth 0 setlinejoin
10 setmiterlimit [ ] 0 setdash newpath
/languagelevel where           % If level not equal to 1 then
{pop languagelevel             % set strokeadjust and
1 ne                           % overprint to their defaults.
{false setstrokeadjust false setoverprint
} if
} if
} bd
/EndEPSF { %def
count op_count sub {pop} repeat            % Clean up stacks
countdictstack dict_count sub {end} repeat
b4_Inc_state restore
} bd
%%EndResource
%FOPBeginFontDict
%%IncludeResource: font Courier-Oblique
%%IncludeResource: font Courier-BoldOblique
%%IncludeResource: font Courier-Bold
%%IncludeResource: font ZapfDingbats
%%IncludeResource: font Symbol
%%IncludeResource: font Helvetica
%%IncludeResource: font Helvetica-Oblique
%%IncludeResource: font Helvetica-Bold
%%IncludeResource: font Helvetica-BoldOblique
%%IncludeResource: font Times-Roman
%%IncludeResource: font Times-Italic
%%IncludeResource: font Times-Bold
%%IncludeResource: font Times-BoldItalic
%%IncludeResource: font Courier
%FOPEndFontDict
%%BeginResource: encoding WinAnsiEncoding
/WinAnsiEncoding [
/.notdef /.notdef /.notdef /.notdef /.notdef
/.notdef /.notdef /.notdef /.notdef /.notdef
/.notdef /.notdef /.notdef /.notdef /.notdef
/.notdef /.notdef /.notdef /.notdef /.notdef
/.notdef /.notdef /.notdef /.notdef /.notdef
/.notdef /.notdef /.notdef /.notdef /.notdef
/.notdef /.notdef /space /exclam /quotedbl
/numbersign /dollar /percent /ampersand /quotesingle
/parenleft /parenright /asterisk /plus /comma
/hyphen /period /slash /zero /one
/two /three /four /five /six
/seven /eight /nine /colon /semicolon
/less /equal /greater /question /at
/A /B /C /D /E
/F /G /H /I /J
/K /L /M /N /O
/P /Q /R /S /T
/U /V /W /X /Y
/Z /bracketleft /backslash /bracketright /asciicircum
/underscore /quoteleft /a /b /c
/d /e /f /g /h
/i /j /k /l /m
/n /o /p /q /r
/s /t /u /v /w
/x /y /z /braceleft /bar
/braceright /asciitilde /bullet /Euro /bullet
/quotesinglbase /florin /quotedblbase /ellipsis /dagger
/daggerdbl /circumflex /perthousand /Scaron /guilsinglleft
/OE /bullet /Zcaron /bullet /bullet
/quoteleft /quoteright /quotedblleft /quotedblright /bullet
/endash /emdash /asciitilde /trademark /scaron
/guilsinglright /oe /bullet /zcaron /Ydieresis
/space /exclamdown /cent /sterling /currency
/yen /brokenbar /section /dieresis /copyright
/ordfeminine /guillemotleft /logicalnot /sfthyphen /registered
/macron /degree /plusminus /twosuperior /threesuperior
/acute /mu /paragraph /middot /cedilla
/onesuperior /ordmasculine /guillemotright /onequarter /onehalf
/threequarters /questiondown /Agrave /Aacute /Acircumflex
/Atilde /Adieresis /Aring /AE /Ccedilla
/Egrave /Eacute /Ecircumflex /Edieresis /Igrave
/Iacute /Icircumflex /Idieresis /Eth /Ntilde
/Ograve /Oacute /Ocircumflex /Otilde /Odieresis
/multiply /Oslash /Ugrave /Uacute /Ucircumflex
/Udieresis /Yacute /Thorn /germandbls /agrave
/aacute /acircumflex /atilde /adieresis /aring
/ae /ccedilla /egrave /eacute /ecircumflex
/edieresis /igrave /iacute /icircumflex /idieresis
/eth /ntilde /ograve /oacute /ocircumflex
/otilde /odieresis /divide /oslash /ugrave
/uacute /ucircumflex /udieresis /yacute /thorn
/ydieresis
] def
%%EndResource
%FOPBeginFontReencode
/Courier-Oblique findfont
dup length dict begin
  {1 index /FID ne {def} {pop pop} ifelse} forall
  /Encoding WinAnsiEncoding def
  currentdict
end
/Courier-Oblique exch definefont pop
/Courier-BoldOblique findfont
dup length dict begin
  {1 index /FID ne {def} {pop pop} ifelse} forall
  /Encoding WinAnsiEncoding def
  currentdict
end
/Courier-BoldOblique exch definefont pop
/Courier-Bold findfont
dup length dict begin
  {1 index /FID ne {def} {pop pop} ifelse} forall
  /Encoding WinAnsiEncoding def
  currentdict
end
/Courier-Bold exch definefont pop
/Helvetica findfont
dup length dict begin
  {1 index /FID ne {def} {pop pop} ifelse} forall
  /Encoding WinAnsiEncoding def
  currentdict
end
/Helvetica exch definefont pop
/Helvetica-Oblique findfont
dup length dict begin
  {1 index /FID ne {def} {pop pop} ifelse} forall
  /Encoding WinAnsiEncoding def
  currentdict
end
/Helvetica-Oblique exch definefont pop
/Helvetica-Bold findfont
dup length dict begin
  {1 index /FID ne {def} {pop pop} ifelse} forall
  /Encoding WinAnsiEncoding def
  currentdict
end
/Helvetica-Bold exch definefont pop
/Helvetica-BoldOblique findfont
dup length dict begin
  {1 index /FID ne {def} {pop pop} ifelse} forall
  /Encoding WinAnsiEncoding def
  currentdict
end
/Helvetica-BoldOblique exch definefont pop
/Times-Roman findfont
dup length dict begin
  {1 index /FID ne {def} {pop pop} ifelse} forall
  /Encoding WinAnsiEncoding def
  currentdict
end
/Times-Roman exch definefont pop
/Times-Italic findfont
dup length dict begin
  {1 index /FID ne {def} {pop pop} ifelse} forall
  /Encoding WinAnsiEncoding def
  currentdict
end
/Times-Italic exch definefont pop
/Times-Bold findfont
dup length dict begin
  {1 index /FID ne {def} {pop pop} ifelse} forall
  /Encoding WinAnsiEncoding def
  currentdict
end
/Times-Bold exch definefont pop
/Times-BoldItalic findfont
dup length dict begin
  {1 index /FID ne {def} {pop pop} ifelse} forall
  /Encoding WinAnsiEncoding def
  currentdict
end
/Times-BoldItalic exch definefont pop
/Courier findfont
dup length dict begin
  {1 index /FID ne {def} {pop pop} ifelse} forall
  /Encoding WinAnsiEncoding def
  currentdict
end
/Courier exch definefont pop
%FOPEndFontReencode
%%EndProlog
%%Page: 1 1
%%PageBoundingBox: 0 0 384 360
%%BeginPageSetup
[1 0 0 -1 0 360] CT
%%EndPageSetup
GS
1 GC
N
0 0 384 360 re
f
GR
GS
1 GC
N
0 0 384 360 re
f
GR
GS
1 GC
N
55.5 310.5 M
347.5 310.5 L
347.5 27 L
55.5 27 L
cp
f
GR
GS
0.149 GC
2 setlinecap
1 LJ
0.5 LW
N
55.5 310.5 M
347.5 310.5 L
S
GR
GS
0.149 GC
2 setlinecap
1 LJ
0.5 LW
N
92 310.5 M
92 307.581 L
S
GR
GS
0.149 GC
2 setlinecap
1 LJ
0.5 LW
N
165 310.5 M
165 307.581 L
S
GR
GS
0.149 GC
2 setlinecap
1 LJ
0.5 LW
N
238 310.5 M
238 307.581 L
S
GR
GS
0.149 GC
2 setlinecap
1 LJ
0.5 LW
N
311 310.5 M
311 307.581 L
S
GR
GS
[1 0 0 1 92 316.10001] CT
0.149 GC
/Helvetica 18 F
GS
[1 0 0 1 0 0] CT
-5.5 18 moveto 
1 -1 scale
(1) t 
GR
GR
GS
[1 0 0 1 165 316.10001] CT
0.149 GC
/Helvetica 18 F
GS
[1 0 0 1 0 0] CT
-5.5 18 moveto 
1 -1 scale
(2) t 
GR
GR
GS
[1 0 0 1 238 316.10001] CT
0.149 GC
/Helvetica 18 F
GS
[1 0 0 1 0 0] CT
-5.5 18 moveto 
1 -1 scale
(3) t 
GR
GR
GS
[1 0 0 1 311 316.10001] CT
0.149 GC
/Helvetica 18 F
GS
[1 0 0 1 0 0] CT
-5.5 18 moveto 
1 -1 scale
(4) t 
GR
GR
GS
[1 0 0 1 201.50014 338.5] CT
0.149 GC
/Helvetica 18 F
GS
[1 0 0 1 0 0] CT
-46 18 moveto 
1 -1 scale
(# of targets) t 
GR
GR
GS
0.149 GC
2 setlinecap
1 LJ
0.5 LW
N
55.5 310.5 M
55.5 27 L
S
GR
GS
0.149 GC
2 setlinecap
1 LJ
0.5 LW
N
55.5 310.5 M
58.419 310.5 L
S
GR
GS
0.149 GC
2 setlinecap
1 LJ
0.5 LW
N
55.5 270 M
58.419 270 L
S
GR
GS
0.149 GC
2 setlinecap
1 LJ
0.5 LW
N
55.5 229.5 M
58.419 229.5 L
S
GR
GS
0.149 GC
2 setlinecap
1 LJ
0.5 LW
N
55.5 189 M
58.419 189 L
S
GR
GS
0.149 GC
2 setlinecap
1 LJ
0.5 LW
N
55.5 148.5 M
58.419 148.5 L
S
GR
GS
0.149 GC
2 setlinecap
1 LJ
0.5 LW
N
55.5 108 M
58.419 108 L
S
GR
GS
0.149 GC
2 setlinecap
1 LJ
0.5 LW
N
55.5 67.5 M
58.419 67.5 L
S
GR
GS
0.149 GC
2 setlinecap
1 LJ
0.5 LW
N
55.5 27 M
58.419 27 L
S
GR
GS
[1 0 0 1 49.9 310.5] CT
0.149 GC
/Helvetica 18 F
GS
[1 0 0 1 0 0] CT
-11 7 moveto 
1 -1 scale
(0) t 
GR
GR
GS
[1 0 0 1 49.9 270] CT
0.149 GC
/Helvetica 18 F
GS
[1 0 0 1 0 0] CT
-26 7 moveto 
1 -1 scale
(0.5) t 
GR
GR
GS
[1 0 0 1 49.9 229.5] CT
0.149 GC
/Helvetica 18 F
GS
[1 0 0 1 0 0] CT
-11 7 moveto 
1 -1 scale
(1) t 
GR
GR
GS
[1 0 0 1 49.9 189] CT
0.149 GC
/Helvetica 18 F
GS
[1 0 0 1 0 0] CT
-26 7 moveto 
1 -1 scale
(1.5) t 
GR
GR
GS
[1 0 0 1 49.9 148.5] CT
0.149 GC
/Helvetica 18 F
GS
[1 0 0 1 0 0] CT
-11 7 moveto 
1 -1 scale
(2) t 
GR
GR
GS
[1 0 0 1 49.9 108] CT
0.149 GC
/Helvetica 18 F
GS
[1 0 0 1 0 0] CT
-26 7 moveto 
1 -1 scale
(2.5) t 
GR
GR
GS
[1 0 0 1 49.9 67.5] CT
0.149 GC
/Helvetica 18 F
GS
[1 0 0 1 0 0] CT
-11 7 moveto 
1 -1 scale
(3) t 
GR
GR
GS
[1 0 0 1 49.9 27] CT
0.149 GC
/Helvetica 18 F
GS
[1 0 0 1 0 0] CT
-26 7 moveto 
1 -1 scale
(3.5) t 
GR
GR
GS
[0 -1 1 0 21.5 168.74986] CT
0.149 GC
/Helvetica 18 F
GS
[1 0 0 1 0 0] CT
-17 -4 moveto 
1 -1 scale
(Drift) t 
GR
GR
GS
1 LJ
2 LW
N
92 61.442 M
92 67.841 L
S
GR
GS
1 LJ
2 LW
N
165 148.088 M
165 153.607 L
S
GR
GS
1 LJ
2 LW
N
238 164.532 M
238 170.96 L
S
GR
GS
1 LJ
2 LW
N
311 168.266 M
311 175.903 L
S
GR
GS
1 LJ
2 LW
N
92 61.442 M
92 55.044 L
S
GR
GS
1 LJ
2 LW
N
165 148.088 M
165 142.569 L
S
GR
GS
1 LJ
2 LW
N
238 164.532 M
238 158.104 L
S
GR
GS
1 LJ
2 LW
N
311 168.266 M
311 160.629 L
S
GR
GS
[8 8] 0 setdash
2 LJ
2 LW
N
92 61.442 M
165 148.088 L
238 164.532 L
311 168.266 L
S
GR
GS
[1 0 0 1 92 67.84074] CT
N
-3 0 M
3 0 L
f
GR
GS
[1 0 0 1 92 67.84074] CT
10.0 ML
2 LW
N
-3 0 M
3 0 L
S
GR
GS
[1 0 0 1 165 153.60667] CT
N
/f1394637256{-3 0 M
3 0 L}def
f1394637256
f
GR
GS
[1 0 0 1 165 153.60667] CT
10.0 ML
2 LW
N
-3 0 M
3 0 L
S
GR
GS
[1 0 0 1 238 170.95981] CT
N
f1394637256
f
GR
GS
[1 0 0 1 238 170.95981] CT
10.0 ML
2 LW
N
-3 0 M
3 0 L
S
GR
GS
[1 0 0 1 311 175.90344] CT
N
f1394637256
f
GR
GS
[1 0 0 1 311 175.90344] CT
10.0 ML
2 LW
N
-3 0 M
3 0 L
S
GR
GS
[1 0 0 1 92 55.04384] CT
N
f1394637256
f
GR
GS
[1 0 0 1 92 55.04384] CT
10.0 ML
2 LW
N
-3 0 M
3 0 L
S
GR
GS
[1 0 0 1 165 142.56911] CT
N
f1394637256
f
GR
GS
[1 0 0 1 165 142.56911] CT
10.0 ML
2 LW
N
-3 0 M
3 0 L
S
GR
GS
[1 0 0 1 238 158.10359] CT
N
f1394637256
f
GR
GS
[1 0 0 1 238 158.10359] CT
10.0 ML
2 LW
N
-3 0 M
3 0 L
S
GR
GS
[1 0 0 1 311 160.62927] CT
N
f1394637256
f
GR
GS
[1 0 0 1 311 160.62927] CT
10.0 ML
2 LW
N
-3 0 M
3 0 L
S
GR
GS
1 LJ
2 LW
N
92 153.466 M
92 159.202 L
S
GR
GS
1 LJ
2 LW
N
165 212.938 M
165 217.001 L
S
GR
GS
1 LJ
2 LW
N
238 225.151 M
238 229.018 L
S
GR
GS
1 LJ
2 LW
N
311 232.598 M
311 236.325 L
S
GR
GS
1 LJ
2 LW
N
92 153.466 M
92 147.731 L
S
GR
GS
1 LJ
2 LW
N
165 212.938 M
165 208.874 L
S
GR
GS
1 LJ
2 LW
N
238 225.151 M
238 221.284 L
S
GR
GS
1 LJ
2 LW
N
311 232.598 M
311 228.872 L
S
GR
GS
1 LJ
2 LW
N
92 153.466 M
165 212.938 L
238 225.151 L
311 232.598 L
S
GR
GS
[1 0 0 1 92 159.20236] CT
N
f1394637256
f
GR
GS
[1 0 0 1 92 159.20236] CT
10.0 ML
2 LW
N
-3 0 M
3 0 L
S
GR
GS
[1 0 0 1 165 217.0013] CT
N
f1394637256
f
GR
GS
[1 0 0 1 165 217.0013] CT
10.0 ML
2 LW
N
-3 0 M
3 0 L
S
GR
GS
[1 0 0 1 238 229.01839] CT
N
f1394637256
f
GR
GS
[1 0 0 1 238 229.01839] CT
10.0 ML
2 LW
N
-3 0 M
3 0 L
S
GR
GS
[1 0 0 1 311 236.32494] CT
N
f1394637256
f
GR
GS
[1 0 0 1 311 236.32494] CT
10.0 ML
2 LW
N
-3 0 M
3 0 L
S
GR
GS
[1 0 0 1 92 147.73059] CT
N
f1394637256
f
GR
GS
[1 0 0 1 92 147.73059] CT
10.0 ML
2 LW
N
-3 0 M
3 0 L
S
GR
GS
[1 0 0 1 165 208.87373] CT
N
f1394637256
f
GR
GS
[1 0 0 1 165 208.87373] CT
10.0 ML
2 LW
N
-3 0 M
3 0 L
S
GR
GS
[1 0 0 1 238 221.28424] CT
N
f1394637256
f
GR
GS
[1 0 0 1 238 221.28424] CT
10.0 ML
2 LW
N
-3 0 M
3 0 L
S
GR
GS
[1 0 0 1 311 228.87164] CT
N
f1394637256
f
GR
GS
[1 0 0 1 311 228.87164] CT
10.0 ML
2 LW
N
-3 0 M
3 0 L
S
GR
GS
1 0 0 RC
1 LJ
2 LW
N
92 144.004 M
92 150.453 L
S
GR
GS
1 0 0 RC
1 LJ
2 LW
N
165 225.652 M
165 230.492 L
S
GR
GS
1 0 0 RC
1 LJ
2 LW
N
238 234.225 M
238 239.717 L
S
GR
GS
1 0 0 RC
1 LJ
2 LW
N
311 240.116 M
311 245.07 L
S
GR
GS
1 0 0 RC
1 LJ
2 LW
N
92 144.004 M
92 137.554 L
S
GR
GS
1 0 0 RC
1 LJ
2 LW
N
165 225.652 M
165 220.811 L
S
GR
GS
1 0 0 RC
1 LJ
2 LW
N
238 234.225 M
238 228.734 L
S
GR
GS
1 0 0 RC
1 LJ
2 LW
N
311 240.116 M
311 235.162 L
S
GR
GS
1 0 0 RC
1 LJ
2 LW
N
92 144.004 M
165 225.652 L
238 234.225 L
311 240.116 L
S
GR
GS
[1 0 0 1 92 150.45287] CT
1 0 0 RC
N
f1394637256
f
GR
GS
[1 0 0 1 92 150.45287] CT
1 0 0 RC
10.0 ML
2 LW
N
-3 0 M
3 0 L
S
GR
GS
[1 0 0 1 165 230.49168] CT
1 0 0 RC
N
f1394637256
f
GR
GS
[1 0 0 1 165 230.49168] CT
1 0 0 RC
10.0 ML
2 LW
N
-3 0 M
3 0 L
S
GR
GS
[1 0 0 1 238 239.71658] CT
1 0 0 RC
N
f1394637256
f
GR
GS
[1 0 0 1 238 239.71658] CT
1 0 0 RC
10.0 ML
2 LW
N
-3 0 M
3 0 L
S
GR
GS
[1 0 0 1 311 245.07031] CT
1 0 0 RC
N
f1394637256
f
GR
GS
[1 0 0 1 311 245.07031] CT
1 0 0 RC
10.0 ML
2 LW
N
-3 0 M
3 0 L
S
GR
GS
[1 0 0 1 92 137.5544] CT
1 0 0 RC
N
f1394637256
f
GR
GS
[1 0 0 1 92 137.5544] CT
1 0 0 RC
10.0 ML
2 LW
N
-3 0 M
3 0 L
S
GR
GS
[1 0 0 1 165 220.81149] CT
1 0 0 RC
N
f1394637256
f
GR
GS
[1 0 0 1 165 220.81149] CT
1 0 0 RC
10.0 ML
2 LW
N
-3 0 M
3 0 L
S
GR
GS
[1 0 0 1 238 228.73357] CT
1 0 0 RC
N
f1394637256
f
GR
GS
[1 0 0 1 238 228.73357] CT
1 0 0 RC
10.0 ML
2 LW
N
-3 0 M
3 0 L
S
GR
GS
[1 0 0 1 311 235.16235] CT
1 0 0 RC
N
f1394637256
f
GR
GS
[1 0 0 1 311 235.16235] CT
1 0 0 RC
10.0 ML
2 LW
N
-3 0 M
3 0 L
S
GR
GS
1 0 0 RC
1 LJ
2 LW
N
92 236.297 M
92 241.04 L
S
GR
GS
1 0 0 RC
1 LJ
2 LW
N
165 275.746 M
165 278.969 L
S
GR
GS
1 0 0 RC
1 LJ
2 LW
N
238 279.156 M
238 281.412 L
S
GR
GS
1 0 0 RC
1 LJ
2 LW
N
311 281.916 M
311 284.064 L
S
GR
GS
1 0 0 RC
1 LJ
2 LW
N
92 236.297 M
92 231.553 L
S
GR
GS
1 0 0 RC
1 LJ
2 LW
N
165 275.746 M
165 272.524 L
S
GR
GS
1 0 0 RC
1 LJ
2 LW
N
238 279.156 M
238 276.9 L
S
GR
GS
1 0 0 RC
1 LJ
2 LW
N
311 281.916 M
311 279.767 L
S
GR
GS
1 0 0 RC
[8 8] 0 setdash
2 LJ
2 LW
N
92 236.297 M
165 275.746 L
238 279.156 L
311 281.916 L
S
GR
GS
[1 0 0 1 92 241.04045] CT
1 0 0 RC
N
f1394637256
f
GR
GS
[1 0 0 1 92 241.04045] CT
1 0 0 RC
10.0 ML
2 LW
N
-3 0 M
3 0 L
S
GR
GS
[1 0 0 1 165 278.96909] CT
1 0 0 RC
N
f1394637256
f
GR
GS
[1 0 0 1 165 278.96909] CT
1 0 0 RC
10.0 ML
2 LW
N
-3 0 M
3 0 L
S
GR
GS
[1 0 0 1 238 281.4118] CT
1 0 0 RC
N
f1394637256
f
GR
GS
[1 0 0 1 238 281.4118] CT
1 0 0 RC
10.0 ML
2 LW
N
-3 0 M
3 0 L
S
GR
GS
[1 0 0 1 311 284.06442] CT
1 0 0 RC
N
f1394637256
f
GR
GS
[1 0 0 1 311 284.06442] CT
1 0 0 RC
10.0 ML
2 LW
N
-3 0 M
3 0 L
S
GR
GS
[1 0 0 1 92 231.55348] CT
1 0 0 RC
N
f1394637256
f
GR
GS
[1 0 0 1 92 231.55348] CT
1 0 0 RC
10.0 ML
2 LW
N
-3 0 M
3 0 L
S
GR
GS
[1 0 0 1 165 272.5239] CT
1 0 0 RC
N
f1394637256
f
GR
GS
[1 0 0 1 165 272.5239] CT
1 0 0 RC
10.0 ML
2 LW
N
-3 0 M
3 0 L
S
GR
GS
[1 0 0 1 238 276.90009] CT
1 0 0 RC
N
f1394637256
f
GR
GS
[1 0 0 1 238 276.90009] CT
1 0 0 RC
10.0 ML
2 LW
N
-3 0 M
3 0 L
S
GR
GS
[1 0 0 1 311 279.76666] CT
1 0 0 RC
N
f1394637256
f
GR
GS
[1 0 0 1 311 279.76666] CT
1 0 0 RC
10.0 ML
2 LW
N
-3 0 M
3 0 L
S
GR
%%Trailer
%%Pages: 1
%%EOF
