Subject,Age,Modality,Condition,drift,ndt,thresh
1117,YA,EEG,1,3.9503,0.19699,1.3065
1117,YA,EEG,2,1.0551,0.19155,1.3065
1117,YA,EEG,3,1.023,0.42194,1.3065
1117,YA,EEG,4,1.0821,0.43567,1.3065
1118,YA,EEG,1,2.5588,0.18704,1.2285
1118,YA,EEG,2,0.92441,0.22968,1.2285
1118,YA,EEG,3,0.62243,0.37914,1.2285
1118,YA,EEG,4,0.84108,0.41237,1.2285
1120,YA,EEG,1,3.7833,0.20197,1.2517
1120,YA,EEG,2,1.4832,0.19533,1.2517
1120,YA,EEG,3,1.3701,0.37892,1.2517
1120,YA,EEG,4,1.7137,0.46489,1.2517
1124,YA,EEG,1,1.7701,0.18623,1.4156
1124,YA,EEG,2,1.2913,0.31691,1.4156
1124,YA,EEG,3,1.1544,0.40759,1.4156
1124,YA,EEG,4,1.0199,0.36794,1.4156
1126,YA,EEG,1,1.4422,0.1481,1.6584
1126,YA,EEG,2,0.88709,0.27681,1.6584
1126,YA,EEG,3,0.71488,0.34661,1.6584
1126,YA,EEG,4,0.7599,0.35557,1.6584
1131,YA,EEG,1,2.9074,0.23621,1.2214
1131,YA,EEG,2,1.0245,0.2857,1.2214
1131,YA,EEG,3,0.8359,0.38828,1.2214
1131,YA,EEG,4,0.94749,0.38726,1.2214
1132,YA,EEG,1,2.5139,0.21691,1.5788
1132,YA,EEG,2,1.3956,0.20863,1.5788
1132,YA,EEG,3,1.1351,0.46119,1.5788
1132,YA,EEG,4,1.317,0.48306,1.5788
1135,YA,EEG,1,2.7876,0.21642,1.3159
1135,YA,EEG,2,1.6238,0.31151,1.3159
1135,YA,EEG,3,0.95302,0.43863,1.3159
1135,YA,EEG,4,0.88673,0.39331,1.3159
1136,YA,EEG,1,1.8487,0.18305,1.6366
1136,YA,EEG,2,1.1534,0.33054,1.6366
1136,YA,EEG,3,1.1548,0.38369,1.6366
1136,YA,EEG,4,1.3611,0.39238,1.6366
1138,YA,EEG,1,1.6253,0.18112,1.1443
1138,YA,EEG,2,1.1488,0.2242,1.1443
1138,YA,EEG,3,1.5162,0.34145,1.1443
1138,YA,EEG,4,1.0065,0.30279,1.1443
1144,YA,EEG,1,2.1183,0.19512,1.3616
1144,YA,EEG,2,1.3002,0.27216,1.3616
1144,YA,EEG,3,0.92975,0.37418,1.3616
1144,YA,EEG,4,0.82689,0.46141,1.3616
1151,YA,EEG,1,3.5692,0.2168,1.5893
1151,YA,EEG,2,1.5762,0.19782,1.5893
1151,YA,EEG,3,1.598,0.39516,1.5893
1151,YA,EEG,4,1.4286,0.36632,1.5893
1158,YA,EEG,1,2.6846,0.18868,1.3577
1158,YA,EEG,2,1.6801,0.26252,1.3577
1158,YA,EEG,3,1.3609,0.26866,1.3577
1158,YA,EEG,4,1.3797,0.3162,1.3577
1160,YA,EEG,1,1.772,0.22593,1.4929
1160,YA,EEG,2,1.3806,0.41411,1.4929
1160,YA,EEG,3,0.81098,0.48069,1.4929
1160,YA,EEG,4,0.82919,0.48822,1.4929
1163,YA,EEG,1,1.7869,0.19969,1.4459
1163,YA,EEG,2,0.45413,0.36653,1.4459
1163,YA,EEG,3,0.83769,0.46157,1.4459
1163,YA,EEG,4,0.80211,0.50673,1.4459
1164,YA,EEG,1,3.8811,0.18267,1.5048
1164,YA,EEG,2,1.5789,0.31663,1.5048
1164,YA,EEG,3,1.6256,0.46248,1.5048
1164,YA,EEG,4,1.048,0.40813,1.5048
1167,YA,EEG,1,1.9267,0.19391,1.5196
1167,YA,EEG,2,1.2721,0.36457,1.5196
1167,YA,EEG,3,1.5635,0.35064,1.5196
1167,YA,EEG,4,1.4053,0.37653,1.5196
1169,YA,EEG,1,2.0495,0.20116,1.4582
1169,YA,EEG,2,1.403,0.39333,1.4582
1169,YA,EEG,3,1.1834,0.48645,1.4582
1169,YA,EEG,4,1.0161,0.44293,1.4582
1172,YA,EEG,1,1.1008,0.23564,1.4614
1172,YA,EEG,2,0.68201,0.40175,1.4614
1172,YA,EEG,3,0.8224,0.46111,1.4614
1172,YA,EEG,4,0.44369,0.49975,1.4614
1173,YA,EEG,1,0.60692,0.29323,1.443
1173,YA,EEG,2,0.43456,0.53728,1.443
1173,YA,EEG,3,0.071477,0.51923,1.443
1173,YA,EEG,4,0.13896,0.50835,1.443
1178,YA,EEG,1,2.4926,0.21077,1.7907
1178,YA,EEG,2,1.0907,0.28259,1.7907
1178,YA,EEG,3,0.58501,0.35202,1.7907
1178,YA,EEG,4,0.84737,0.41983,1.7907
1182,YA,EEG,1,3.3222,0.20786,1.6745
1182,YA,EEG,2,1.8765,0.3093,1.6745
1182,YA,EEG,3,1.2009,0.39956,1.6745
1182,YA,EEG,4,1.33,0.48271,1.6745
1215,YA,EEG,1,3.2199,0.23477,1.3839
1215,YA,EEG,2,0.81548,0.25305,1.3839
1215,YA,EEG,3,1.1766,0.46567,1.3839
1215,YA,EEG,4,0.87578,0.38136,1.3839
1216,YA,EEG,1,1.986,0.17017,1.2499
1216,YA,EEG,2,1.1272,0.2284,1.2499
1216,YA,EEG,3,0.89187,0.36091,1.2499
1216,YA,EEG,4,0.45944,0.40794,1.2499
1219,YA,EEG,1,2.5828,0.19152,1.2547
1219,YA,EEG,2,1.4143,0.29481,1.2547
1219,YA,EEG,3,0.79204,0.40974,1.2547
1219,YA,EEG,4,0.57958,0.50093,1.2547
1221,YA,EEG,1,2.9387,0.18779,1.2032
1221,YA,EEG,2,1.1964,0.2648,1.2032
1221,YA,EEG,3,0.70108,0.31722,1.2032
1221,YA,EEG,4,0.63105,0.28006,1.2032
1223,YA,EEG,1,3.8571,0.18354,1.455
1223,YA,EEG,2,1.1444,0.28607,1.455
1223,YA,EEG,3,0.86396,0.32407,1.455
1223,YA,EEG,4,0.8958,0.39114,1.455
1227,YA,EEG,1,1.3174,0.22825,1.7952
1227,YA,EEG,2,0.91965,0.4865,1.7952
1227,YA,EEG,3,0.62705,0.49964,1.7952
1227,YA,EEG,4,0.88209,0.5577,1.7952
1228,YA,EEG,1,2.9203,0.21716,0.90343
1228,YA,EEG,2,1.4991,0.22028,0.90343
1228,YA,EEG,3,0.65007,0.23511,0.90343
1228,YA,EEG,4,0.65273,0.22917,0.90343
1233,YA,EEG,1,4.1571,0.21619,1.3538
1233,YA,EEG,2,1.5183,0.31545,1.3538
1233,YA,EEG,3,1.4618,0.34606,1.3538
1233,YA,EEG,4,1.4011,0.38956,1.3538
1234,YA,EEG,1,2.958,0.22221,1.0192
1234,YA,EEG,2,1.044,0.24112,1.0192
1234,YA,EEG,3,0.71267,0.33317,1.0192
1234,YA,EEG,4,0.33544,0.38091,1.0192
1237,YA,EEG,1,2.4819,0.23278,1.2083
1237,YA,EEG,2,0.97807,0.2781,1.2083
1237,YA,EEG,3,0.9958,0.34951,1.2083
1237,YA,EEG,4,0.94081,0.44886,1.2083
1239,YA,EEG,1,4.1637,0.20604,1.3523
1239,YA,EEG,2,1.8301,0.21404,1.3523
1239,YA,EEG,3,1.4375,0.39646,1.3523
1239,YA,EEG,4,1.1648,0.34485,1.3523
1240,YA,EEG,1,4.3001,0.20361,1.5085
1240,YA,EEG,2,1.6089,0.2767,1.5085
1240,YA,EEG,3,1.8229,0.41607,1.5085
1240,YA,EEG,4,1.2821,0.46281,1.5085
1243,YA,EEG,1,2.8184,0.30391,1.2975
1243,YA,EEG,2,0.866,0.37002,1.2975
1243,YA,EEG,3,0.8303,0.47083,1.2975
1243,YA,EEG,4,0.56007,0.53312,1.2975
1245,YA,EEG,1,3.2105,0.17064,1.4835
1245,YA,EEG,2,1.5263,0.30967,1.4835
1245,YA,EEG,3,1.3166,0.34091,1.4835
1245,YA,EEG,4,1.5131,0.4444,1.4835
1247,YA,EEG,1,4.7217,0.19164,1.4677
1247,YA,EEG,2,1.8916,0.18531,1.4677
1247,YA,EEG,3,1.3549,0.21262,1.4677
1247,YA,EEG,4,0.99193,0.33659,1.4677
1250,YA,EEG,1,4.0705,0.18448,1.4891
1250,YA,EEG,2,1.5013,0.29526,1.4891
1250,YA,EEG,3,1.0308,0.32928,1.4891
1250,YA,EEG,4,0.80244,0.37376,1.4891
1252,YA,EEG,1,3.9581,0.18309,1.7102
1252,YA,EEG,2,1.9379,0.30414,1.7102
1252,YA,EEG,3,1.6386,0.38831,1.7102
1252,YA,EEG,4,1.6092,0.42792,1.7102
1257,YA,EEG,1,3.5858,0.20878,1.1138
1257,YA,EEG,2,1.41,0.2183,1.1138
1257,YA,EEG,3,0.88936,0.30016,1.1138
1257,YA,EEG,4,0.74535,0.3617,1.1138
1261,YA,EEG,1,4.5419,0.21038,1.4472
1261,YA,EEG,2,2.0042,0.27725,1.4472
1261,YA,EEG,3,1.4809,0.34956,1.4472
1261,YA,EEG,4,1.3884,0.41626,1.4472
1265,YA,EEG,1,2.1404,0.19117,1.149
1265,YA,EEG,2,1.4608,0.20509,1.149
1265,YA,EEG,3,0.89382,0.25528,1.149
1265,YA,EEG,4,0.81196,0.31501,1.149
1266,YA,EEG,1,3.1355,0.21165,1.1137
1266,YA,EEG,2,1.5771,0.25529,1.1137
1266,YA,EEG,3,1.4013,0.32461,1.1137
1266,YA,EEG,4,0.86609,0.32189,1.1137
1268,YA,EEG,1,1.4122,0.1629,1.3812
1268,YA,EEG,2,0.95752,0.20394,1.3812
1268,YA,EEG,3,0.90227,0.3584,1.3812
1268,YA,EEG,4,0.65763,0.39237,1.3812
1270,YA,EEG,1,4.0622,0.21838,1.2607
1270,YA,EEG,2,1.8798,0.3319,1.2607
1270,YA,EEG,3,1.3761,0.34571,1.2607
1270,YA,EEG,4,1.1619,0.41058,1.2607
1276,YA,EEG,1,1.9869,0.23726,1.1052
1276,YA,EEG,2,0.75153,0.41014,1.1052
1276,YA,EEG,3,0.75915,0.42696,1.1052
1276,YA,EEG,4,0.88604,0.47305,1.1052
1281,YA,EEG,1,2.0589,0.25437,1.2901
1281,YA,EEG,2,1.4215,0.4506,1.2901
1281,YA,EEG,3,0.85598,0.49049,1.2901
1281,YA,EEG,4,1.0897,0.49853,1.2901
2104,OA,EEG,1,1.5036,0.25024,1.16
2104,OA,EEG,2,0.4943,0.30944,1.16
2104,OA,EEG,3,0.4651,0.37325,1.16
2104,OA,EEG,4,0.36454,0.3495,1.16
2107,OA,EEG,1,1.6128,0.23283,1.7761
2107,OA,EEG,2,1.0235,0.4471,1.7761
2107,OA,EEG,3,0.53818,0.41942,1.7761
2107,OA,EEG,4,0.59793,0.45661,1.7761
2108,OA,EEG,1,1.9371,0.26522,1.2836
2108,OA,EEG,2,0.85277,0.39929,1.2836
2108,OA,EEG,3,0.75232,0.50963,1.2836
2108,OA,EEG,4,0.99375,0.60955,1.2836
2112,OA,EEG,1,0.31314,0.1963,1.6396
2112,OA,EEG,2,0.30818,0.20336,1.6396
2112,OA,EEG,3,0.029783,0.30197,1.6396
2112,OA,EEG,4,-0.041934,0.40441,1.6396
2118,OA,EEG,1,1.9799,0.22409,1.6499
2118,OA,EEG,2,0.64931,0.4232,1.6499
2118,OA,EEG,3,0.5458,0.42237,1.6499
2118,OA,EEG,4,0.16361,0.46333,1.6499
2120,OA,EEG,1,1.1412,0.19485,1.4308
2120,OA,EEG,2,0.21657,0.22226,1.4308
2120,OA,EEG,3,0.5363,0.2299,1.4308
2120,OA,EEG,4,0.30125,0.26109,1.4308
2121,OA,EEG,1,1.9715,0.3998,1.562
2121,OA,EEG,2,0.94212,0.51929,1.562
2121,OA,EEG,3,0.89399,0.55181,1.562
2121,OA,EEG,4,0.72164,0.57695,1.562
2123,OA,EEG,1,1.527,0.3399,1.4984
2123,OA,EEG,2,0.61487,0.43869,1.4984
2123,OA,EEG,3,0.58972,0.3951,1.4984
2123,OA,EEG,4,0.23535,0.42717,1.4984
2125,OA,EEG,1,1.1619,0.23709,1.5657
2125,OA,EEG,2,0.64189,0.32206,1.5657
2125,OA,EEG,3,0.59203,0.31118,1.5657
2125,OA,EEG,4,0.52435,0.39826,1.5657
2129,OA,EEG,1,1.8643,0.30038,1.4526
2129,OA,EEG,2,0.90079,0.45103,1.4526
2129,OA,EEG,3,0.56545,0.52206,1.4526
2129,OA,EEG,4,0.58937,0.51292,1.4526
2130,OA,EEG,1,1.5581,0.29475,1.6265
2130,OA,EEG,2,0.6031,0.4635,1.6265
2130,OA,EEG,3,0.57876,0.58404,1.6265
2130,OA,EEG,4,0.54553,0.65662,1.6265
2131,OA,EEG,1,0.44382,0.33322,1.7823
2131,OA,EEG,2,-0.0088138,0.38809,1.7823
2131,OA,EEG,3,0.19828,0.52797,1.7823
2131,OA,EEG,4,0.096872,0.46249,1.7823
2132,OA,EEG,1,2.4694,0.21457,1.298
2132,OA,EEG,2,0.81145,0.24928,1.298
2132,OA,EEG,3,0.67406,0.25118,1.298
2132,OA,EEG,4,0.47802,0.26598,1.298
2133,OA,EEG,1,1.5465,0.2622,1.5039
2133,OA,EEG,2,0.70009,0.36696,1.5039
2133,OA,EEG,3,0.62968,0.4124,1.5039
2133,OA,EEG,4,0.4702,0.45343,1.5039
2134,OA,EEG,1,1.1079,0.28825,1.3893
2134,OA,EEG,2,0.49097,0.42726,1.3893
2134,OA,EEG,3,0.42618,0.44698,1.3893
2134,OA,EEG,4,0.45697,0.50225,1.3893
2135,OA,EEG,1,2.0436,0.35121,1.6264
2135,OA,EEG,2,0.83082,0.46145,1.6264
2135,OA,EEG,3,0.58306,0.52191,1.6264
2135,OA,EEG,4,0.5777,0.55964,1.6264
2139,OA,EEG,1,2.1813,0.30157,1.2997
2139,OA,EEG,2,0.45269,0.41461,1.2997
2139,OA,EEG,3,0.45891,0.42327,1.2997
2139,OA,EEG,4,0.74937,0.5308,1.2997
2140,OA,EEG,1,0.98987,0.27402,1.3285
2140,OA,EEG,2,0.64147,0.42903,1.3285
2140,OA,EEG,3,0.37942,0.40898,1.3285
2140,OA,EEG,4,0.36517,0.40353,1.3285
2145,OA,EEG,1,1.0748,0.2306,0.67987
2145,OA,EEG,2,0.79027,0.22992,0.67987
2145,OA,EEG,3,0.9252,0.23432,0.67987
2145,OA,EEG,4,0.38533,0.24008,0.67987
2147,OA,EEG,1,0.29447,0.29658,1.2132
2147,OA,EEG,2,-0.054273,0.30009,1.2132
2147,OA,EEG,3,0.0068422,0.30025,1.2132
2147,OA,EEG,4,0.12586,0.32772,1.2132
2149,OA,EEG,1,1.5072,0.29302,1.5894
2149,OA,EEG,2,0.6383,0.42304,1.5894
2149,OA,EEG,3,0.74036,0.49874,1.5894
2149,OA,EEG,4,0.50503,0.50089,1.5894
2157,OA,EEG,1,1.1205,0.24384,1.3626
2157,OA,EEG,2,0.82468,0.38882,1.3626
2157,OA,EEG,3,0.4978,0.38172,1.3626
2157,OA,EEG,4,0.53787,0.40574,1.3626
2160,OA,EEG,1,0.9328,0.28811,1.1027
2160,OA,EEG,2,0.37611,0.34277,1.1027
2160,OA,EEG,3,0.34447,0.37915,1.1027
2160,OA,EEG,4,0.51812,0.38041,1.1027
2201,OA,EEG,1,0.57555,0.34949,1.356
2201,OA,EEG,2,0.27163,0.47434,1.356
2201,OA,EEG,3,0.22377,0.48431,1.356
2201,OA,EEG,4,0.58077,0.44278,1.356
2202,OA,EEG,1,1.4656,0.22351,1.493
2202,OA,EEG,2,0.3222,0.3328,1.493
2202,OA,EEG,3,0.40719,0.30917,1.493
2202,OA,EEG,4,0.46503,0.29272,1.493
2203,OA,EEG,1,1.4976,0.2486,0.90036
2203,OA,EEG,2,0.53717,0.24053,0.90036
2203,OA,EEG,3,0.77135,0.23245,0.90036
2203,OA,EEG,4,0.74765,0.24873,0.90036
2205,OA,EEG,1,2.4273,0.21746,1.2916
2205,OA,EEG,2,1.0836,0.39803,1.2916
2205,OA,EEG,3,1.0047,0.51151,1.2916
2205,OA,EEG,4,0.76674,0.47703,1.2916
2206,OA,EEG,1,1.3003,0.26596,1.6654
2206,OA,EEG,2,0.59277,0.38381,1.6654
2206,OA,EEG,3,0.54344,0.48124,1.6654
2206,OA,EEG,4,0.48602,0.46104,1.6654
2209,OA,EEG,1,1.3834,0.32955,1.4419
2209,OA,EEG,2,0.69181,0.37601,1.4419
2209,OA,EEG,3,0.60947,0.50599,1.4419
2209,OA,EEG,4,0.28757,0.55268,1.4419
2210,OA,EEG,1,1.3691,0.26909,1.4722
2210,OA,EEG,2,0.53477,0.51339,1.4722
2210,OA,EEG,3,0.29917,0.5993,1.4722
2210,OA,EEG,4,0.29506,0.65301,1.4722
2211,OA,EEG,1,0.99012,0.1971,1.401
2211,OA,EEG,2,0.7525,0.34985,1.401
2211,OA,EEG,3,0.86339,0.25597,1.401
2211,OA,EEG,4,0.45669,0.22989,1.401
2213,OA,EEG,1,1.7719,0.26612,1.3986
2213,OA,EEG,2,0.87207,0.43536,1.3986
2213,OA,EEG,3,0.58188,0.40955,1.3986
2213,OA,EEG,4,0.86468,0.52138,1.3986
2214,OA,EEG,1,1.0644,0.24505,1.2376
2214,OA,EEG,2,0.70335,0.39013,1.2376
2214,OA,EEG,3,0.17919,0.4737,1.2376
2214,OA,EEG,4,0.66257,0.55366,1.2376
2215,OA,EEG,1,1.4115,0.26225,1.2348
2215,OA,EEG,2,0.56161,0.27611,1.2348
2215,OA,EEG,3,0.19596,0.32413,1.2348
2215,OA,EEG,4,0.23027,0.2906,1.2348
2216,OA,EEG,1,0.89106,0.22769,1.6639
2216,OA,EEG,2,0.46875,0.3339,1.6639
2216,OA,EEG,3,0.46959,0.45398,1.6639
2216,OA,EEG,4,0.29293,0.36022,1.6639
2217,OA,EEG,1,1.9822,0.29283,1.2043
2217,OA,EEG,2,0.55182,0.42931,1.2043
2217,OA,EEG,3,0.65792,0.5667,1.2043
2217,OA,EEG,4,0.5527,0.50756,1.2043
2219,OA,EEG,1,0.070248,0.18071,1.9432
2219,OA,EEG,2,0.096128,0.18166,1.9432
2219,OA,EEG,3,0.16581,0.15917,1.9432
2219,OA,EEG,4,0.15401,0.20759,1.9432
2222,OA,EEG,1,1.2604,0.20278,1.301
2222,OA,EEG,2,0.70619,0.26489,1.301
2222,OA,EEG,3,0.60872,0.26973,1.301
2222,OA,EEG,4,0.32765,0.18378,1.301
2224,OA,EEG,1,1.2637,0.22167,1.6756
2224,OA,EEG,2,0.8211,0.44038,1.6756
2224,OA,EEG,3,0.76446,0.54439,1.6756
2224,OA,EEG,4,0.63088,0.52148,1.6756
2226,OA,EEG,1,0.98294,0.23316,1.3214
2226,OA,EEG,2,0.41286,0.271,1.3214
2226,OA,EEG,3,0.31023,0.27732,1.3214
2226,OA,EEG,4,0.61471,0.28592,1.3214
2227,OA,EEG,1,0.087226,0.30183,1.1993
2227,OA,EEG,2,-0.039045,0.34386,1.1993
2227,OA,EEG,3,0.14838,0.3946,1.1993
2227,OA,EEG,4,0.31067,0.34375,1.1993
2236,OA,EEG,1,0.87081,0.29661,0.97688
2236,OA,EEG,2,0.34648,0.29786,0.97688
2236,OA,EEG,3,0.053808,0.29702,0.97688
2236,OA,EEG,4,0.15631,0.30724,0.97688
2237,OA,EEG,1,0.74494,0.21807,1.1729
2237,OA,EEG,2,0.070128,0.24275,1.1729
2237,OA,EEG,3,0.13242,0.27608,1.1729
2237,OA,EEG,4,0.35531,0.34416,1.1729
2238,OA,EEG,1,1.4899,0.48593,1.6649
2238,OA,EEG,2,0.93519,0.69894,1.6649
2238,OA,EEG,3,0.92287,0.74592,1.6649
2238,OA,EEG,4,0.58375,0.75126,1.6649
2241,OA,EEG,1,1.6286,0.21692,1.3927
2241,OA,EEG,2,0.66973,0.4524,1.3927
2241,OA,EEG,3,0.96123,0.5136,1.3927
2241,OA,EEG,4,0.71681,0.48491,1.3927
2244,OA,EEG,1,1.2519,0.30086,1.6029
2244,OA,EEG,2,0.31918,0.47908,1.6029
2244,OA,EEG,3,0.37458,0.5776,1.6029
2244,OA,EEG,4,0.45878,0.56671,1.6029
2246,OA,EEG,1,1.2489,0.23385,0.75384
2246,OA,EEG,2,0.37529,0.24872,0.75384
2246,OA,EEG,3,0.38782,0.23761,0.75384
2246,OA,EEG,4,0.21474,0.24986,0.75384
2248,OA,EEG,1,1.0118,0.23048,2.0448
2248,OA,EEG,2,0.52185,0.43581,2.0448
2248,OA,EEG,3,0.56543,0.57731,2.0448
2248,OA,EEG,4,0.3694,0.54199,2.0448
2250,OA,EEG,1,1.5638,0.21979,1.308
2250,OA,EEG,2,0.76162,0.31428,1.308
2250,OA,EEG,3,0.6007,0.24436,1.308
2250,OA,EEG,4,0.44936,0.29396,1.308
2251,OA,EEG,1,1.3048,0.27077,1.4295
2251,OA,EEG,2,1.0938,0.49417,1.4295
2251,OA,EEG,3,0.62012,0.48542,1.4295
2251,OA,EEG,4,0.63017,0.57613,1.4295
2252,OA,EEG,1,1.8565,0.17795,1.4883
2252,OA,EEG,2,1.1398,0.32807,1.4883
2252,OA,EEG,3,0.7989,0.3872,1.4883
2252,OA,EEG,4,0.92859,0.34041,1.4883
2258,OA,EEG,1,0.90936,0.27772,1.412
2258,OA,EEG,2,0.33284,0.43608,1.412
2258,OA,EEG,3,0.39271,0.43015,1.412
2258,OA,EEG,4,0.825,0.434,1.412
2261,OA,EEG,1,1.1869,0.25328,1.0967
2261,OA,EEG,2,0.36186,0.24387,1.0967
2261,OA,EEG,3,0.25123,0.25211,1.0967
2261,OA,EEG,4,0.20255,0.30495,1.0967
1117,YA,MRI,1,2.3931,0.24665,1.3354
1117,YA,MRI,2,1.1521,0.33479,1.3354
1117,YA,MRI,3,1.3282,0.40565,1.3354
1117,YA,MRI,4,1.3121,0.45054,1.3354
1118,YA,MRI,1,1.7408,0.23645,1.0422
1118,YA,MRI,2,0.93151,0.2559,1.0422
1118,YA,MRI,3,0.8847,0.41742,1.0422
1118,YA,MRI,4,0.48334,0.33643,1.0422
1120,YA,MRI,1,1.9044,0.21903,1.1966
1120,YA,MRI,2,1.1372,0.23417,1.1966
1120,YA,MRI,3,1.1452,0.44725,1.1966
1120,YA,MRI,4,1.5926,0.47698,1.1966
1124,YA,MRI,1,2.8512,0.21856,1.0799
1124,YA,MRI,2,1.0754,0.23691,1.0799
1124,YA,MRI,3,1.5086,0.3697,1.0799
1124,YA,MRI,4,1.3902,0.41906,1.0799
1126,YA,MRI,1,1.2453,0.22443,1.2761
1126,YA,MRI,2,0.64487,0.32407,1.2761
1126,YA,MRI,3,0.84562,0.40074,1.2761
1126,YA,MRI,4,0.64451,0.43929,1.2761
1131,YA,MRI,1,2.7193,0.2673,1.0368
1131,YA,MRI,2,1.6901,0.296,1.0368
1131,YA,MRI,3,1.1804,0.39789,1.0368
1131,YA,MRI,4,1.1554,0.4295,1.0368
1132,YA,MRI,1,2.9488,0.31299,1.382
1132,YA,MRI,2,1.1558,0.34799,1.382
1132,YA,MRI,3,1.2892,0.52463,1.382
1132,YA,MRI,4,1.0371,0.58293,1.382
1135,YA,MRI,1,4.0083,0.28391,1.1941
1135,YA,MRI,2,1.2632,0.32415,1.1941
1135,YA,MRI,3,1.2679,0.41782,1.1941
1135,YA,MRI,4,1.2444,0.4141,1.1941
1136,YA,MRI,1,1.2068,0.24199,1.4087
1136,YA,MRI,2,0.91722,0.46056,1.4087
1136,YA,MRI,3,0.97155,0.46568,1.4087
1136,YA,MRI,4,1.349,0.4653,1.4087
1138,YA,MRI,1,NaN,NaN,NaN
1138,YA,MRI,2,NaN,NaN,NaN
1138,YA,MRI,3,NaN,NaN,NaN
1138,YA,MRI,4,NaN,NaN,NaN
1144,YA,MRI,1,NaN,NaN,NaN
1144,YA,MRI,2,NaN,NaN,NaN
1144,YA,MRI,3,NaN,NaN,NaN
1144,YA,MRI,4,NaN,NaN,NaN
1151,YA,MRI,1,2.0704,0.25208,1.2249
1151,YA,MRI,2,1.1357,0.25124,1.2249
1151,YA,MRI,3,1.0317,0.40151,1.2249
1151,YA,MRI,4,1.5331,0.52181,1.2249
1158,YA,MRI,1,NaN,NaN,NaN
1158,YA,MRI,2,NaN,NaN,NaN
1158,YA,MRI,3,NaN,NaN,NaN
1158,YA,MRI,4,NaN,NaN,NaN
1160,YA,MRI,1,2.0087,0.28367,1.3042
1160,YA,MRI,2,1.3443,0.44845,1.3042
1160,YA,MRI,3,0.96337,0.536,1.3042
1160,YA,MRI,4,1.0668,0.49333,1.3042
1163,YA,MRI,1,NaN,NaN,NaN
1163,YA,MRI,2,NaN,NaN,NaN
1163,YA,MRI,3,NaN,NaN,NaN
1163,YA,MRI,4,NaN,NaN,NaN
1164,YA,MRI,1,2.0328,0.2229,1.2329
1164,YA,MRI,2,1.3946,0.3233,1.2329
1164,YA,MRI,3,1.3883,0.45739,1.2329
1164,YA,MRI,4,1.2411,0.41909,1.2329
1167,YA,MRI,1,1.8318,0.27783,1.2917
1167,YA,MRI,2,1.2703,0.37117,1.2917
1167,YA,MRI,3,1.1791,0.43341,1.2917
1167,YA,MRI,4,1.1287,0.47649,1.2917
1169,YA,MRI,1,2.3327,0.2786,1.203
1169,YA,MRI,2,1.8336,0.46317,1.203
1169,YA,MRI,3,1.1198,0.48459,1.203
1169,YA,MRI,4,1.5358,0.57356,1.203
1172,YA,MRI,1,1.8512,0.33345,1.1501
1172,YA,MRI,2,0.78248,0.39727,1.1501
1172,YA,MRI,3,0.26224,0.4865,1.1501
1172,YA,MRI,4,0.46577,0.49299,1.1501
1173,YA,MRI,1,0.40845,0.38365,1.2222
1173,YA,MRI,2,0.4446,0.50462,1.2222
1173,YA,MRI,3,0.24256,0.44989,1.2222
1173,YA,MRI,4,-0.053372,0.49064,1.2222
1178,YA,MRI,1,1.5993,0.28198,1.43
1178,YA,MRI,2,0.92243,0.4531,1.43
1178,YA,MRI,3,0.7843,0.56916,1.43
1178,YA,MRI,4,0.88722,0.59922,1.43
1182,YA,MRI,1,2.6014,0.25257,1.4938
1182,YA,MRI,2,1.3523,0.3116,1.4938
1182,YA,MRI,3,1.3605,0.44006,1.4938
1182,YA,MRI,4,1.1682,0.44996,1.4938
1215,YA,MRI,1,2.1843,0.29905,1.2304
1215,YA,MRI,2,1.0268,0.35045,1.2304
1215,YA,MRI,3,0.76824,0.43353,1.2304
1215,YA,MRI,4,0.68923,0.37761,1.2304
1216,YA,MRI,1,1.9828,0.22478,1.1238
1216,YA,MRI,2,0.96355,0.28029,1.1238
1216,YA,MRI,3,0.63829,0.41173,1.1238
1216,YA,MRI,4,0.71759,0.44582,1.1238
1219,YA,MRI,1,3.7763,0.24457,1.2451
1219,YA,MRI,2,1.3026,0.2716,1.2451
1219,YA,MRI,3,1.1564,0.43274,1.2451
1219,YA,MRI,4,1.0356,0.45863,1.2451
1221,YA,MRI,1,NaN,NaN,NaN
1221,YA,MRI,2,NaN,NaN,NaN
1221,YA,MRI,3,NaN,NaN,NaN
1221,YA,MRI,4,NaN,NaN,NaN
1223,YA,MRI,1,1.6023,0.24733,1.5188
1223,YA,MRI,2,1.0683,0.3329,1.5188
1223,YA,MRI,3,0.85149,0.46657,1.5188
1223,YA,MRI,4,0.9359,0.4374,1.5188
1227,YA,MRI,1,1.2066,0.30405,1.6618
1227,YA,MRI,2,0.74748,0.53665,1.6618
1227,YA,MRI,3,0.76131,0.57191,1.6618
1227,YA,MRI,4,0.41853,0.58614,1.6618
1228,YA,MRI,1,2.9968,0.24117,0.88181
1228,YA,MRI,2,1.067,0.24934,0.88181
1228,YA,MRI,3,0.95363,0.25833,0.88181
1228,YA,MRI,4,0.72808,0.27625,0.88181
1233,YA,MRI,1,3.5942,0.26477,0.9936
1233,YA,MRI,2,1.8484,0.33724,0.9936
1233,YA,MRI,3,1.3969,0.38447,0.9936
1233,YA,MRI,4,1.3107,0.40028,0.9936
1234,YA,MRI,1,2.2395,0.27227,0.84343
1234,YA,MRI,2,0.43641,0.30712,0.84343
1234,YA,MRI,3,0.11078,0.35638,0.84343
1234,YA,MRI,4,0.38382,0.41265,0.84343
1237,YA,MRI,1,1.728,0.28342,1.0553
1237,YA,MRI,2,1.0082,0.31563,1.0553
1237,YA,MRI,3,1.4538,0.45415,1.0553
1237,YA,MRI,4,1.1236,0.43504,1.0553
1239,YA,MRI,1,3.5504,0.25034,1.24
1239,YA,MRI,2,1.1349,0.25129,1.24
1239,YA,MRI,3,1.2166,0.31862,1.24
1239,YA,MRI,4,0.67646,0.31638,1.24
1240,YA,MRI,1,3.5092,0.23412,1.6478
1240,YA,MRI,2,1.2619,0.28191,1.6478
1240,YA,MRI,3,1.2141,0.45619,1.6478
1240,YA,MRI,4,1.4149,0.45624,1.6478
1243,YA,MRI,1,1.8947,0.33406,1.2967
1243,YA,MRI,2,1.015,0.44757,1.2967
1243,YA,MRI,3,0.67084,0.47108,1.2967
1243,YA,MRI,4,0.54412,0.46765,1.2967
1245,YA,MRI,1,2.3474,0.24911,1.3957
1245,YA,MRI,2,1.4309,0.2788,1.3957
1245,YA,MRI,3,1.2625,0.32714,1.3957
1245,YA,MRI,4,1.5176,0.41376,1.3957
1247,YA,MRI,1,3.3192,0.22864,1.1672
1247,YA,MRI,2,2.3715,0.24848,1.1672
1247,YA,MRI,3,1.6416,0.25311,1.1672
1247,YA,MRI,4,1.2753,0.27339,1.1672
1250,YA,MRI,1,3.9201,0.1944,1.5179
1250,YA,MRI,2,1.4367,0.29064,1.5179
1250,YA,MRI,3,1.1133,0.35358,1.5179
1250,YA,MRI,4,1.3627,0.46416,1.5179
1252,YA,MRI,1,3.5623,0.25881,1.4615
1252,YA,MRI,2,1.5494,0.29596,1.4615
1252,YA,MRI,3,1.5501,0.42933,1.4615
1252,YA,MRI,4,1.4489,0.47284,1.4615
1257,YA,MRI,1,2.2935,0.3062,0.99737
1257,YA,MRI,2,1.2498,0.36276,0.99737
1257,YA,MRI,3,1.0851,0.39392,0.99737
1257,YA,MRI,4,0.81866,0.43469,0.99737
1261,YA,MRI,1,3.4606,0.26652,1.19
1261,YA,MRI,2,2.2199,0.36117,1.19
1261,YA,MRI,3,1.453,0.41175,1.19
1261,YA,MRI,4,1.636,0.46516,1.19
1265,YA,MRI,1,1.8716,0.24323,1.0884
1265,YA,MRI,2,1.3636,0.23933,1.0884
1265,YA,MRI,3,1.1327,0.29489,1.0884
1265,YA,MRI,4,0.56125,0.31237,1.0884
1266,YA,MRI,1,3.6639,0.2234,1.1184
1266,YA,MRI,2,1.7929,0.25677,1.1184
1266,YA,MRI,3,1.0814,0.34569,1.1184
1266,YA,MRI,4,1.2897,0.39012,1.1184
1268,YA,MRI,1,1.7032,0.21814,1.3605
1268,YA,MRI,2,0.83632,0.23916,1.3605
1268,YA,MRI,3,0.80461,0.38723,1.3605
1268,YA,MRI,4,0.7643,0.43764,1.3605
1270,YA,MRI,1,2.1357,0.22437,1.1539
1270,YA,MRI,2,0.91874,0.3465,1.1539
1270,YA,MRI,3,1.2692,0.42424,1.1539
1270,YA,MRI,4,1.091,0.40829,1.1539
1276,YA,MRI,1,2.1792,0.28642,1.0106
1276,YA,MRI,2,1.2987,0.41276,1.0106
1276,YA,MRI,3,1.0192,0.42685,1.0106
1276,YA,MRI,4,0.7402,0.43802,1.0106
1281,YA,MRI,1,2.6444,0.30039,1.1902
1281,YA,MRI,2,1.6323,0.45492,1.1902
1281,YA,MRI,3,1.3909,0.51655,1.1902
1281,YA,MRI,4,1.4015,0.53364,1.1902
2104,OA,MRI,1,0.78885,0.28671,1.0045
2104,OA,MRI,2,0.095627,0.32913,1.0045
2104,OA,MRI,3,0.3453,0.34525,1.0045
2104,OA,MRI,4,0.31381,0.3169,1.0045
2107,OA,MRI,1,1.3646,0.20935,1.6387
2107,OA,MRI,2,0.083227,0.50954,1.6387
2107,OA,MRI,3,0.34387,0.50845,1.6387
2107,OA,MRI,4,0.13732,0.53115,1.6387
2108,OA,MRI,1,1.4831,0.33416,1.1147
2108,OA,MRI,2,0.77333,0.40299,1.1147
2108,OA,MRI,3,0.75159,0.55709,1.1147
2108,OA,MRI,4,1.0145,0.61493,1.1147
2112,OA,MRI,1,-0.04462,0.43408,1.4615
2112,OA,MRI,2,-0.11042,0.32938,1.4615
2112,OA,MRI,3,0.061397,0.43287,1.4615
2112,OA,MRI,4,0.041023,0.41733,1.4615
2118,OA,MRI,1,1.3591,0.27422,1.4654
2118,OA,MRI,2,0.61401,0.51205,1.4654
2118,OA,MRI,3,0.62679,0.5374,1.4654
2118,OA,MRI,4,0.44648,0.49146,1.4654
2120,OA,MRI,1,0.71736,0.26963,1.3639
2120,OA,MRI,2,0.24036,0.33334,1.3639
2120,OA,MRI,3,0.51334,0.36799,1.3639
2120,OA,MRI,4,0.19988,0.30241,1.3639
2121,OA,MRI,1,1.9384,0.38556,1.4312
2121,OA,MRI,2,0.96687,0.55628,1.4312
2121,OA,MRI,3,0.64951,0.54884,1.4312
2121,OA,MRI,4,0.80572,0.58791,1.4312
2123,OA,MRI,1,0.7683,0.39464,1.1999
2123,OA,MRI,2,0.50237,0.50064,1.1999
2123,OA,MRI,3,0.24791,0.56262,1.1999
2123,OA,MRI,4,0.55052,0.56874,1.1999
2125,OA,MRI,1,1.2104,0.27095,1.4692
2125,OA,MRI,2,0.34697,0.34644,1.4692
2125,OA,MRI,3,0.39416,0.4562,1.4692
2125,OA,MRI,4,0.091827,0.4291,1.4692
2129,OA,MRI,1,1.0076,0.38784,1.3112
2129,OA,MRI,2,0.9703,0.56558,1.3112
2129,OA,MRI,3,0.74514,0.59075,1.3112
2129,OA,MRI,4,0.54734,0.57137,1.3112
2130,OA,MRI,1,1.2612,0.29963,1.5974
2130,OA,MRI,2,0.63856,0.4672,1.5974
2130,OA,MRI,3,0.51898,0.52995,1.5974
2130,OA,MRI,4,0.33218,0.55299,1.5974
2131,OA,MRI,1,0.91091,0.33219,1.438
2131,OA,MRI,2,0.28099,0.43907,1.438
2131,OA,MRI,3,0.13285,0.50155,1.438
2131,OA,MRI,4,0.26835,0.55571,1.438
2132,OA,MRI,1,2.1192,0.28795,0.78375
2132,OA,MRI,2,1.0562,0.27519,0.78375
2132,OA,MRI,3,0.5526,0.28856,0.78375
2132,OA,MRI,4,0.61634,0.27708,0.78375
2133,OA,MRI,1,1.6775,0.32736,1.1933
2133,OA,MRI,2,0.48918,0.38238,1.1933
2133,OA,MRI,3,0.69399,0.42014,1.1933
2133,OA,MRI,4,0.5015,0.48508,1.1933
2134,OA,MRI,1,1.6089,0.34038,1.4573
2134,OA,MRI,2,0.55237,0.51465,1.4573
2134,OA,MRI,3,0.58721,0.55276,1.4573
2134,OA,MRI,4,0.44329,0.56845,1.4573
2135,OA,MRI,1,2.117,0.34996,1.2704
2135,OA,MRI,2,0.62821,0.43446,1.2704
2135,OA,MRI,3,0.42771,0.51169,1.2704
2135,OA,MRI,4,0.36342,0.52566,1.2704
2139,OA,MRI,1,1.3546,0.26608,1.2246
2139,OA,MRI,2,0.71772,0.4399,1.2246
2139,OA,MRI,3,0.40294,0.51289,1.2246
2139,OA,MRI,4,0.68411,0.58202,1.2246
2140,OA,MRI,1,1.1879,0.34182,1.3511
2140,OA,MRI,2,0.33584,0.43517,1.3511
2140,OA,MRI,3,0.40509,0.44847,1.3511
2140,OA,MRI,4,0.29654,0.47931,1.3511
2145,OA,MRI,1,0.97244,0.26423,0.59259
2145,OA,MRI,2,0.53913,0.25461,0.59259
2145,OA,MRI,3,0.75339,0.25484,0.59259
2145,OA,MRI,4,0.48635,0.25725,0.59259
2147,OA,MRI,1,0.38655,0.34749,1.3444
2147,OA,MRI,2,0.20116,0.36123,1.3444
2147,OA,MRI,3,0.17899,0.36786,1.3444
2147,OA,MRI,4,0.28433,0.38112,1.3444
2149,OA,MRI,1,1.0625,0.34441,1.3783
2149,OA,MRI,2,0.51791,0.41813,1.3783
2149,OA,MRI,3,0.44457,0.52051,1.3783
2149,OA,MRI,4,0.37433,0.45997,1.3783
2157,OA,MRI,1,1.2191,0.27773,1.2608
2157,OA,MRI,2,0.46518,0.46995,1.2608
2157,OA,MRI,3,0.40528,0.51771,1.2608
2157,OA,MRI,4,0.10567,0.58553,1.2608
2160,OA,MRI,1,1.0622,0.34083,1.187
2160,OA,MRI,2,0.50058,0.3782,1.187
2160,OA,MRI,3,0.31931,0.47503,1.187
2160,OA,MRI,4,0.41828,0.44753,1.187
2201,OA,MRI,1,1.1673,0.37095,1.1666
2201,OA,MRI,2,0.71422,0.43631,1.1666
2201,OA,MRI,3,0.35669,0.44459,1.1666
2201,OA,MRI,4,0.39727,0.49379,1.1666
2202,OA,MRI,1,0.9661,0.36252,1.4719
2202,OA,MRI,2,0.54198,0.49203,1.4719
2202,OA,MRI,3,0.37397,0.65974,1.4719
2202,OA,MRI,4,0.51758,0.6967,1.4719
2203,OA,MRI,1,1.8312,0.26383,0.74948
2203,OA,MRI,2,0.55756,0.27449,0.74948
2203,OA,MRI,3,0.77869,0.27373,0.74948
2203,OA,MRI,4,0.52453,0.26511,0.74948
2205,OA,MRI,1,1.9283,0.25999,1.0158
2205,OA,MRI,2,1.183,0.32602,1.0158
2205,OA,MRI,3,0.52111,0.37498,1.0158
2205,OA,MRI,4,0.58974,0.38618,1.0158
2206,OA,MRI,1,1.2182,0.35379,1.6474
2206,OA,MRI,2,0.49964,0.55329,1.6474
2206,OA,MRI,3,0.44261,0.50481,1.6474
2206,OA,MRI,4,0.48267,0.61405,1.6474
2209,OA,MRI,1,1.4361,0.29755,1.0603
2209,OA,MRI,2,0.4752,0.30556,1.0603
2209,OA,MRI,3,0.49459,0.36021,1.0603
2209,OA,MRI,4,0.14413,0.35608,1.0603
2210,OA,MRI,1,1.9154,0.31432,1.2408
2210,OA,MRI,2,0.37072,0.41842,1.2408
2210,OA,MRI,3,0.29957,0.55363,1.2408
2210,OA,MRI,4,0.20982,0.56932,1.2408
2211,OA,MRI,1,0.6431,0.37523,1.2126
2211,OA,MRI,2,0.32672,0.47192,1.2126
2211,OA,MRI,3,0.29464,0.46078,1.2126
2211,OA,MRI,4,0.31622,0.49,1.2126
2213,OA,MRI,1,2.2016,0.24101,1.2257
2213,OA,MRI,2,0.9674,0.33003,1.2257
2213,OA,MRI,3,0.59067,0.41358,1.2257
2213,OA,MRI,4,0.36814,0.42841,1.2257
2214,OA,MRI,1,0.42786,0.33005,1.0984
2214,OA,MRI,2,0.40309,0.42932,1.0984
2214,OA,MRI,3,0.23016,0.53453,1.0984
2214,OA,MRI,4,0.30168,0.52365,1.0984
2215,OA,MRI,1,0.71828,0.31925,1.2031
2215,OA,MRI,2,0.41965,0.34004,1.2031
2215,OA,MRI,3,0.38316,0.38902,1.2031
2215,OA,MRI,4,0.38971,0.34545,1.2031
2216,OA,MRI,1,1.384,0.2633,1.5666
2216,OA,MRI,2,0.78623,0.48633,1.5666
2216,OA,MRI,3,0.43086,0.50527,1.5666
2216,OA,MRI,4,0.64852,0.43851,1.5666
2217,OA,MRI,1,-0.087234,0.35048,0.95636
2217,OA,MRI,2,-0.16233,0.39852,0.95636
2217,OA,MRI,3,-0.19991,0.45201,0.95636
2217,OA,MRI,4,0.082647,0.4158,0.95636
2219,OA,MRI,1,0.95209,0.30037,1.6489
2219,OA,MRI,2,0.26338,0.65132,1.6489
2219,OA,MRI,3,0.1407,0.85724,1.6489
2219,OA,MRI,4,0.27033,0.71594,1.6489
2222,OA,MRI,1,0.65642,0.29876,1.4015
2222,OA,MRI,2,0.1435,0.36281,1.4015
2222,OA,MRI,3,0.52335,0.4243,1.4015
2222,OA,MRI,4,0.13004,0.48397,1.4015
2224,OA,MRI,1,1.6585,0.2314,1.6099
2224,OA,MRI,2,0.78429,0.50146,1.6099
2224,OA,MRI,3,0.43437,0.46802,1.6099
2224,OA,MRI,4,0.58072,0.48371,1.6099
2226,OA,MRI,1,1.8521,0.27463,1.2288
2226,OA,MRI,2,0.64005,0.33709,1.2288
2226,OA,MRI,3,0.56973,0.38197,1.2288
2226,OA,MRI,4,0.25364,0.39545,1.2288
2227,OA,MRI,1,0.32308,0.3735,1.019
2227,OA,MRI,2,-0.050837,0.37293,1.019
2227,OA,MRI,3,0.055436,0.34994,1.019
2227,OA,MRI,4,0.054174,0.36988,1.019
2236,OA,MRI,1,0.064873,0.38073,0.97284
2236,OA,MRI,2,0.30867,0.37555,0.97284
2236,OA,MRI,3,0.23332,0.38717,0.97284
2236,OA,MRI,4,0.067103,0.40355,0.97284
2237,OA,MRI,1,1.8142,0.29841,0.91991
2237,OA,MRI,2,0.45039,0.30824,0.91991
2237,OA,MRI,3,0.2719,0.35914,0.91991
2237,OA,MRI,4,0.2044,0.38325,0.91991
2238,OA,MRI,1,1.0587,0.32237,1.4488
2238,OA,MRI,2,0.9012,0.47024,1.4488
2238,OA,MRI,3,0.47486,0.58345,1.4488
2238,OA,MRI,4,0.44184,0.57016,1.4488
2241,OA,MRI,1,0.97084,0.26811,1.189
2241,OA,MRI,2,0.23328,0.28286,1.189
2241,OA,MRI,3,0.55784,0.3295,1.189
2241,OA,MRI,4,0.38202,0.34645,1.189
2244,OA,MRI,1,1.0139,0.36605,1.4624
2244,OA,MRI,2,0.61024,0.58517,1.4624
2244,OA,MRI,3,0.47492,0.71801,1.4624
2244,OA,MRI,4,0.23017,0.71973,1.4624
2246,OA,MRI,1,1.042,0.26669,0.88584
2246,OA,MRI,2,0.89796,0.26735,0.88584
2246,OA,MRI,3,0.52955,0.27745,0.88584
2246,OA,MRI,4,0.47171,0.27421,0.88584
2248,OA,MRI,1,1.4263,0.32546,1.5585
2248,OA,MRI,2,0.67191,0.44893,1.5585
2248,OA,MRI,3,0.4698,0.5294,1.5585
2248,OA,MRI,4,0.25369,0.55673,1.5585
2250,OA,MRI,1,1.6573,0.30954,1.186
2250,OA,MRI,2,0.85385,0.50965,1.186
2250,OA,MRI,3,0.34027,0.52906,1.186
2250,OA,MRI,4,0.46717,0.44849,1.186
2251,OA,MRI,1,1.599,0.35806,1.473
2251,OA,MRI,2,0.84797,0.61904,1.473
2251,OA,MRI,3,0.82761,0.66253,1.473
2251,OA,MRI,4,0.85708,0.67654,1.473
2252,OA,MRI,1,2.3277,0.27338,1.2991
2252,OA,MRI,2,1.0463,0.45808,1.2991
2252,OA,MRI,3,0.90408,0.50232,1.2991
2252,OA,MRI,4,0.49304,0.48399,1.2991
2258,OA,MRI,1,0.94103,0.30542,1.2246
2258,OA,MRI,2,0.30092,0.37896,1.2246
2258,OA,MRI,3,0.17742,0.37778,1.2246
2258,OA,MRI,4,0.087441,0.51156,1.2246
2261,OA,MRI,1,0.59017,0.31585,1.0798
2261,OA,MRI,2,0.27897,0.34233,1.0798
2261,OA,MRI,3,0.47706,0.35264,1.0798
2261,OA,MRI,4,0.64972,0.38922,1.0798