%!PS-Adobe-3.0 EPSF-3.0
%%Creator: (MATLAB, The Mathworks, Inc. Version 9.8.0.1323502 \(R2020a\). Operating System: Mac OS X)
%%Title: /Users/kosciessa/Volumes/tardis/LNDG/stateswitch/stsw_beh_task/hddm/figures/D_compareYAOA_vat_l1.eps
%%CreationDate: 2022-02-10T11:32:53
%%Pages: (atend)
%%BoundingBox:    99     0   927   280
%%LanguageLevel: 3
%%EndComments
%%BeginProlog
%%BeginResource: procset (Apache XML Graphics Std ProcSet) 1.2 0
%%Version: 1.2 0
%%Copyright: (Copyright 2001-2003,2010 The Apache Software Foundation. License terms: http://www.apache.org/licenses/LICENSE-2.0)
/bd{bind def}bind def
/ld{load def}bd
/GR/grestore ld
/GS/gsave ld
/RM/rmoveto ld
/C/curveto ld
/t/show ld
/L/lineto ld
/ML/setmiterlimit ld
/CT/concat ld
/f/fill ld
/N/newpath ld
/S/stroke ld
/CC/setcmykcolor ld
/A/ashow ld
/cp/closepath ld
/RC/setrgbcolor ld
/LJ/setlinejoin ld
/GC/setgray ld
/LW/setlinewidth ld
/M/moveto ld
/re {4 2 roll M
1 index 0 rlineto
0 exch rlineto
neg 0 rlineto
cp } bd
/_ctm matrix def
/_tm matrix def
/BT { _ctm currentmatrix pop matrix _tm copy pop 0 0 moveto } bd
/ET { _ctm setmatrix } bd
/iTm { _ctm setmatrix _tm concat } bd
/Tm { _tm astore pop iTm 0 0 moveto } bd
/ux 0.0 def
/uy 0.0 def
/F {
  /Tp exch def
  /Tf exch def
  Tf findfont Tp scalefont setfont
  /cf Tf def  /cs Tp def
} bd
/ULS {currentpoint /uy exch def /ux exch def} bd
/ULE {
  /Tcx currentpoint pop def
  gsave
  newpath
  cf findfont cs scalefont dup
  /FontMatrix get 0 get /Ts exch def /FontInfo get dup
  /UnderlinePosition get Ts mul /To exch def
  /UnderlineThickness get Ts mul /Tt exch def
  ux uy To add moveto  Tcx uy To add lineto
  Tt setlinewidth stroke
  grestore
} bd
/OLE {
  /Tcx currentpoint pop def
  gsave
  newpath
  cf findfont cs scalefont dup
  /FontMatrix get 0 get /Ts exch def /FontInfo get dup
  /UnderlinePosition get Ts mul /To exch def
  /UnderlineThickness get Ts mul /Tt exch def
  ux uy To add cs add moveto Tcx uy To add cs add lineto
  Tt setlinewidth stroke
  grestore
} bd
/SOE {
  /Tcx currentpoint pop def
  gsave
  newpath
  cf findfont cs scalefont dup
  /FontMatrix get 0 get /Ts exch def /FontInfo get dup
  /UnderlinePosition get Ts mul /To exch def
  /UnderlineThickness get Ts mul /Tt exch def
  ux uy To add cs 10 mul 26 idiv add moveto Tcx uy To add cs 10 mul 26 idiv add lineto
  Tt setlinewidth stroke
  grestore
} bd
/QT {
/Y22 exch store
/X22 exch store
/Y21 exch store
/X21 exch store
currentpoint
/Y21 load 2 mul add 3 div exch
/X21 load 2 mul add 3 div exch
/X21 load 2 mul /X22 load add 3 div
/Y21 load 2 mul /Y22 load add 3 div
/X22 load /Y22 load curveto
} bd
/SSPD {
dup length /d exch dict def
{
/v exch def
/k exch def
currentpagedevice k known {
/cpdv currentpagedevice k get def
v cpdv ne {
/upd false def
/nullv v type /nulltype eq def
/nullcpdv cpdv type /nulltype eq def
nullv nullcpdv or
{
/upd true def
} {
/sametype v type cpdv type eq def
sametype {
v type /arraytype eq {
/vlen v length def
/cpdvlen cpdv length def
vlen cpdvlen eq {
0 1 vlen 1 sub {
/i exch def
/obj v i get def
/cpdobj cpdv i get def
obj cpdobj ne {
/upd true def
exit
} if
} for
} {
/upd true def
} ifelse
} {
v type /dicttype eq {
v {
/dv exch def
/dk exch def
/cpddv cpdv dk get def
dv cpddv ne {
/upd true def
exit
} if
} forall
} {
/upd true def
} ifelse
} ifelse
} if
} ifelse
upd true eq {
d k v put
} if
} if
} if
} forall
d length 0 gt {
d setpagedevice
} if
} bd
/RE { % /NewFontName [NewEncodingArray] /FontName RE -
  findfont dup length dict begin
  {
    1 index /FID ne
    {def} {pop pop} ifelse
  } forall
  /Encoding exch def
  /FontName 1 index def
  currentdict definefont pop
  end
} bind def
%%EndResource
%%BeginResource: procset (Apache XML Graphics EPS ProcSet) 1.0 0
%%Version: 1.0 0
%%Copyright: (Copyright 2002-2003 The Apache Software Foundation. License terms: http://www.apache.org/licenses/LICENSE-2.0)
/BeginEPSF { %def
/b4_Inc_state save def         % Save state for cleanup
/dict_count countdictstack def % Count objects on dict stack
/op_count count 1 sub def      % Count objects on operand stack
userdict begin                 % Push userdict on dict stack
/showpage { } def              % Redefine showpage, { } = null proc
0 setgray 0 setlinecap         % Prepare graphics state
1 setlinewidth 0 setlinejoin
10 setmiterlimit [ ] 0 setdash newpath
/languagelevel where           % If level not equal to 1 then
{pop languagelevel             % set strokeadjust and
1 ne                           % overprint to their defaults.
{false setstrokeadjust false setoverprint
} if
} if
} bd
/EndEPSF { %def
count op_count sub {pop} repeat            % Clean up stacks
countdictstack dict_count sub {end} repeat
b4_Inc_state restore
} bd
%%EndResource
%FOPBeginFontDict
%%IncludeResource: font Courier-Oblique
%%IncludeResource: font Courier-BoldOblique
%%IncludeResource: font Courier-Bold
%%IncludeResource: font ZapfDingbats
%%IncludeResource: font Symbol
%%IncludeResource: font Helvetica
%%IncludeResource: font Helvetica-Oblique
%%IncludeResource: font Helvetica-Bold
%%IncludeResource: font Helvetica-BoldOblique
%%IncludeResource: font Times-Roman
%%IncludeResource: font Times-Italic
%%IncludeResource: font Times-Bold
%%IncludeResource: font Times-BoldItalic
%%IncludeResource: font Courier
%FOPEndFontDict
%%BeginResource: encoding WinAnsiEncoding
/WinAnsiEncoding [
/.notdef /.notdef /.notdef /.notdef /.notdef
/.notdef /.notdef /.notdef /.notdef /.notdef
/.notdef /.notdef /.notdef /.notdef /.notdef
/.notdef /.notdef /.notdef /.notdef /.notdef
/.notdef /.notdef /.notdef /.notdef /.notdef
/.notdef /.notdef /.notdef /.notdef /.notdef
/.notdef /.notdef /space /exclam /quotedbl
/numbersign /dollar /percent /ampersand /quotesingle
/parenleft /parenright /asterisk /plus /comma
/hyphen /period /slash /zero /one
/two /three /four /five /six
/seven /eight /nine /colon /semicolon
/less /equal /greater /question /at
/A /B /C /D /E
/F /G /H /I /J
/K /L /M /N /O
/P /Q /R /S /T
/U /V /W /X /Y
/Z /bracketleft /backslash /bracketright /asciicircum
/underscore /quoteleft /a /b /c
/d /e /f /g /h
/i /j /k /l /m
/n /o /p /q /r
/s /t /u /v /w
/x /y /z /braceleft /bar
/braceright /asciitilde /bullet /Euro /bullet
/quotesinglbase /florin /quotedblbase /ellipsis /dagger
/daggerdbl /circumflex /perthousand /Scaron /guilsinglleft
/OE /bullet /Zcaron /bullet /bullet
/quoteleft /quoteright /quotedblleft /quotedblright /bullet
/endash /emdash /asciitilde /trademark /scaron
/guilsinglright /oe /bullet /zcaron /Ydieresis
/space /exclamdown /cent /sterling /currency
/yen /brokenbar /section /dieresis /copyright
/ordfeminine /guillemotleft /logicalnot /sfthyphen /registered
/macron /degree /plusminus /twosuperior /threesuperior
/acute /mu /paragraph /middot /cedilla
/onesuperior /ordmasculine /guillemotright /onequarter /onehalf
/threequarters /questiondown /Agrave /Aacute /Acircumflex
/Atilde /Adieresis /Aring /AE /Ccedilla
/Egrave /Eacute /Ecircumflex /Edieresis /Igrave
/Iacute /Icircumflex /Idieresis /Eth /Ntilde
/Ograve /Oacute /Ocircumflex /Otilde /Odieresis
/multiply /Oslash /Ugrave /Uacute /Ucircumflex
/Udieresis /Yacute /Thorn /germandbls /agrave
/aacute /acircumflex /atilde /adieresis /aring
/ae /ccedilla /egrave /eacute /ecircumflex
/edieresis /igrave /iacute /icircumflex /idieresis
/eth /ntilde /ograve /oacute /ocircumflex
/otilde /odieresis /divide /oslash /ugrave
/uacute /ucircumflex /udieresis /yacute /thorn
/ydieresis
] def
%%EndResource
%FOPBeginFontReencode
/Courier-Oblique findfont
dup length dict begin
  {1 index /FID ne {def} {pop pop} ifelse} forall
  /Encoding WinAnsiEncoding def
  currentdict
end
/Courier-Oblique exch definefont pop
/Courier-BoldOblique findfont
dup length dict begin
  {1 index /FID ne {def} {pop pop} ifelse} forall
  /Encoding WinAnsiEncoding def
  currentdict
end
/Courier-BoldOblique exch definefont pop
/Courier-Bold findfont
dup length dict begin
  {1 index /FID ne {def} {pop pop} ifelse} forall
  /Encoding WinAnsiEncoding def
  currentdict
end
/Courier-Bold exch definefont pop
/Helvetica findfont
dup length dict begin
  {1 index /FID ne {def} {pop pop} ifelse} forall
  /Encoding WinAnsiEncoding def
  currentdict
end
/Helvetica exch definefont pop
/Helvetica-Oblique findfont
dup length dict begin
  {1 index /FID ne {def} {pop pop} ifelse} forall
  /Encoding WinAnsiEncoding def
  currentdict
end
/Helvetica-Oblique exch definefont pop
/Helvetica-Bold findfont
dup length dict begin
  {1 index /FID ne {def} {pop pop} ifelse} forall
  /Encoding WinAnsiEncoding def
  currentdict
end
/Helvetica-Bold exch definefont pop
/Helvetica-BoldOblique findfont
dup length dict begin
  {1 index /FID ne {def} {pop pop} ifelse} forall
  /Encoding WinAnsiEncoding def
  currentdict
end
/Helvetica-BoldOblique exch definefont pop
/Times-Roman findfont
dup length dict begin
  {1 index /FID ne {def} {pop pop} ifelse} forall
  /Encoding WinAnsiEncoding def
  currentdict
end
/Times-Roman exch definefont pop
/Times-Italic findfont
dup length dict begin
  {1 index /FID ne {def} {pop pop} ifelse} forall
  /Encoding WinAnsiEncoding def
  currentdict
end
/Times-Italic exch definefont pop
/Times-Bold findfont
dup length dict begin
  {1 index /FID ne {def} {pop pop} ifelse} forall
  /Encoding WinAnsiEncoding def
  currentdict
end
/Times-Bold exch definefont pop
/Times-BoldItalic findfont
dup length dict begin
  {1 index /FID ne {def} {pop pop} ifelse} forall
  /Encoding WinAnsiEncoding def
  currentdict
end
/Times-BoldItalic exch definefont pop
/Courier findfont
dup length dict begin
  {1 index /FID ne {def} {pop pop} ifelse} forall
  /Encoding WinAnsiEncoding def
  currentdict
end
/Courier exch definefont pop
%FOPEndFontReencode
%%EndProlog
%%Page: 1 1
%%PageBoundingBox: 0 0 1024 288
%%BeginPageSetup
[1 0 0 -1 0 288] CT
%%EndPageSetup
GS
1 GC
N
0 0 1024 288 re
f
GR
GS
1 GC
N
0 0 1024 288 re
f
GR
GS
1 GC
N
142 228.5 M
351.5 228.5 L
351.5 32 L
142 32 L
cp
f
GR
GS
0.149 GC
2 setlinecap
1 LJ
0.5 LW
N
142 228.5 M
351.5 228.5 L
S
GR
GS
0.149 GC
2 setlinecap
1 LJ
0.5 LW
N
204.85 228.5 M
204.85 226.405 L
S
GR
GS
0.149 GC
2 setlinecap
1 LJ
0.5 LW
N
288.65 228.5 M
288.65 226.405 L
S
GR
GS
[1 0 0 1 204.85001 234.89999] CT
0.149 GC
/Helvetica 22 F
GS
[1 0 0 1 0 0] CT
-14.5 21 moveto 
1 -1 scale
(YA) t 
GR
GR
GS
[1 0 0 1 288.64999 234.89999] CT
0.149 GC
/Helvetica 22 F
GS
[1 0 0 1 0 0] CT
-15.5 21 moveto 
1 -1 scale
(OA) t 
GR
GR
GS
[1 0 0 1 246.75011 261.89999] CT
0.149 GC
/Helvetica 22 F
GS
[1 0 0 1 0 0] CT
-53.5 21 moveto 
1 -1 scale
(Age Group) t 
GR
GR
GS
0.149 GC
2 setlinecap
1 LJ
0.5 LW
N
142 228.5 M
142 32 L
S
GR
GS
0.149 GC
2 setlinecap
1 LJ
0.5 LW
N
142 228.5 M
144.095 228.5 L
S
GR
GS
0.149 GC
2 setlinecap
1 LJ
0.5 LW
N
142 164.715 M
144.095 164.715 L
S
GR
GS
0.149 GC
2 setlinecap
1 LJ
0.5 LW
N
142 100.93 M
144.095 100.93 L
S
GR
GS
0.149 GC
2 setlinecap
1 LJ
0.5 LW
N
142 37.145 M
144.095 37.145 L
S
GR
GS
[1 0 0 1 135.60001 228.5] CT
0.149 GC
/Helvetica 22 F
GS
[1 0 0 1 0 0] CT
-13 8 moveto 
1 -1 scale
(0) t 
GR
GR
GS
[1 0 0 1 135.60001 164.71506] CT
0.149 GC
/Helvetica 22 F
GS
[1 0 0 1 0 0] CT
-13 8 moveto 
1 -1 scale
(1) t 
GR
GR
GS
[1 0 0 1 135.60001 100.93011] CT
0.149 GC
/Helvetica 22 F
GS
[1 0 0 1 0 0] CT
-13 8 moveto 
1 -1 scale
(2) t 
GR
GR
GS
[1 0 0 1 135.60001 37.14516] CT
0.149 GC
/Helvetica 22 F
GS
[1 0 0 1 0 0] CT
-13 8 moveto 
1 -1 scale
(3) t 
GR
GR
GS
[0 -1 1 0 120.1 130.24991] CT
0.149 GC
/Helvetica 22 F
GS
[1 0 0 1 0 0] CT
-36 -5 moveto 
1 -1 scale
(Drift L1) t 
GR
GR
GS
[1 0 0 1 246.75024 29.24999] CT
/Helvetica-Bold 22 F
GS
[1 0 0 1 0 0] CT
-26 -5 moveto 
1 -1 scale
(p = 0) t 
GR
GR
GS
0.149 GC
1 LJ
0.5 LW
N
142 228.5 M
351.5 228.5 L
S
GR
GS
0.6 0.902 1 RC
N
238.37 228.5 M
238.37 93.187 L
171.33 93.187 L
171.33 228.5 L
cp
f
GR
GS
[1 0 0 1 212.11299 69.44153] CT
0.302 GC
N
2.236 0 M
2.236 -1.235 1.235 -2.236 0 -2.236 C
-1.235 -2.236 -2.236 -1.235 -2.236 0 C
-2.236 1.235 -1.235 2.236 0 2.236 C
1.235 2.236 2.236 1.235 2.236 0 C
cp
f
GR
GS
[1 0 0 1 205.07751 109.09872] CT
0.302 GC
N
/f-1586420743{2.236 0 M
2.236 -1.235 1.235 -2.236 0 -2.236 C
-1.235 -2.236 -2.236 -1.235 -2.236 0 C
-2.236 1.235 -1.235 2.236 0 2.236 C
1.235 2.236 2.236 1.235 2.236 0 C
cp}def
f-1586420743
f
GR
GS
[1 0 0 1 199.08749 77.76508] CT
0.302 GC
N
f-1586420743
f
GR
GS
[1 0 0 1 213.34813 104.74795] CT
0.302 GC
N
f-1586420743
f
GR
GS
[1 0 0 1 216.11292 140.12854] CT
0.302 GC
N
f-1586420743
f
GR
GS
[1 0 0 1 196.59457 148.79195] CT
0.302 GC
N
f-1586420743
f
GR
GS
[1 0 0 1 206.00392 83.39442] CT
0.302 GC
N
f-1586420743
f
GR
GS
[1 0 0 1 202.67674 82.20435] CT
0.302 GC
N
f-1586420743
f
GR
GS
[1 0 0 1 193.37624 61.88041] CT
0.302 GC
N
f-1586420743
f
GR
GS
[1 0 0 1 208.21812 134.44156] CT
0.302 GC
N
f-1586420743
f
GR
GS
[1 0 0 1 219.51335 121.55976] CT
0.302 GC
N
f-1586420743
f
GR
GS
[1 0 0 1 191.70207 106.14584] CT
0.302 GC
N
f-1586420743
f
GR
GS
[1 0 0 1 218.25739 82.50054] CT
0.302 GC
N
f-1586420743
f
GR
GS
[1 0 0 1 206.54158 89.03288] CT
0.302 GC
N
f-1586420743
f
GR
GS
[1 0 0 1 202.41499 118.71282] CT
0.302 GC
N
f-1586420743
f
GR
GS
[1 0 0 1 193.1978 125.46172] CT
0.302 GC
N
f-1586420743
f
GR
GS
[1 0 0 1 196.38774 78.29464] CT
0.302 GC
N
f-1586420743
f
GR
GS
[1 0 0 1 203.0858 115.14323] CT
0.302 GC
N
f-1586420743
f
GR
GS
[1 0 0 1 205.9489 103.46268] CT
0.302 GC
N
f-1586420743
f
GR
GS
[1 0 0 1 199.97791 128.82603] CT
0.302 GC
N
f-1586420743
f
GR
GS
[1 0 0 1 214.00481 192.00888] CT
0.302 GC
N
f-1586420743
f
GR
GS
[1 0 0 1 217.64395 117.53664] CT
0.302 GC
N
f-1586420743
f
GR
GS
[1 0 0 1 212.69678 73.63001] CT
0.302 GC
N
f-1586420743
f
GR
GS
[1 0 0 1 208.34207 82.0132] CT
0.302 GC
N
f-1586420743
f
GR
GS
[1 0 0 1 209.57983 87.62056] CT
0.302 GC
N
f-1586420743
f
GR
GS
[1 0 0 1 192.36269 110.36781] CT
0.302 GC
N
f-1586420743
f
GR
GS
[1 0 0 1 204.72235 62.99717] CT
0.302 GC
N
f-1586420743
f
GR
GS
[1 0 0 1 198.49693 75.33468] CT
0.302 GC
N
f-1586420743
f
GR
GS
[1 0 0 1 207.48381 97.79821] CT
0.302 GC
N
f-1586420743
f
GR
GS
[1 0 0 1 219.71977 153.70027] CT
0.302 GC
N
f-1586420743
f
GR
GS
[1 0 0 1 202.40102 64.49835] CT
0.302 GC
N
f-1586420743
f
GR
GS
[1 0 0 1 189.20047 44.54591] CT
0.302 GC
N
f-1586420743
f
GR
GS
[1 0 0 1 219.24463 89.15249] CT
0.302 GC
N
f-1586420743
f
GR
GS
[1 0 0 1 219.09541 108.45469] CT
0.302 GC
N
f-1586420743
f
GR
GS
[1 0 0 1 200.10045 47.16016] CT
0.302 GC
N
f-1586420743
f
GR
GS
[1 0 0 1 196.80484 63.70353] CT
0.302 GC
N
f-1586420743
f
GR
GS
[1 0 0 1 214.46553 105.61901] CT
0.302 GC
N
f-1586420743
f
GR
GS
[1 0 0 1 205.23824 85.04572] CT
0.302 GC
N
f-1586420743
f
GR
GS
[1 0 0 1 206.94591 42.83456] CT
0.302 GC
N
f-1586420743
f
GR
GS
[1 0 0 1 211.04428 54.038] CT
0.302 GC
N
f-1586420743
f
GR
GS
[1 0 0 1 191.18713 52.64724] CT
0.302 GC
N
f-1586420743
f
GR
GS
[1 0 0 1 217.33885 76.56606] CT
0.302 GC
N
f-1586420743
f
GR
GS
[1 0 0 1 191.32784 32] CT
0.302 GC
N
f-1586420743
f
GR
GS
[1 0 0 1 216.44398 111.25717] CT
0.302 GC
N
f-1586420743
f
GR
GS
[1 0 0 1 218.57294 51.08382] CT
0.302 GC
N
f-1586420743
f
GR
GS
[1 0 0 1 188.47015 135.35269] CT
0.302 GC
N
f-1586420743
f
GR
GS
[1 0 0 1 205.64384 72.24673] CT
0.302 GC
N
f-1586420743
f
GR
GS
[1 0 0 1 209.88957 109.85154] CT
0.302 GC
N
f-1586420743
f
GR
GS
[1 0 0 1 201.00008 86.06889] CT
0.302 GC
N
f-1586420743
f
GR
GS
0.6 0.902 1 RC
N
/f-28739862{322.17 228.5 M
322.17 158.99 L
255.13 158.99 L
255.13 228.5 L
cp}def
f-28739862
f
GR
GS
[1 0 0 1 293.6546 162.20219] CT
0.302 GC
N
f-1586420743
f
GR
GS
[1 0 0 1 297.46085 149.53963] CT
0.302 GC
N
f-1586420743
f
GR
GS
[1 0 0 1 291.18698 132.80272] CT
0.302 GC
N
f-1586420743
f
GR
GS
[1 0 0 1 293.07193 217.97653] CT
0.302 GC
N
f-1586420743
f
GR
GS
[1 0 0 1 281.21539 141.4062] CT
0.302 GC
N
f-1586420743
f
GR
GS
[1 0 0 1 300.04132 173.47304] CT
0.302 GC
N
f-1586420743
f
GR
GS
[1 0 0 1 286.19751 123.74846] CT
0.302 GC
N
f-1586420743
f
GR
GS
[1 0 0 1 293.06198 162.15343] CT
0.302 GC
N
f-1586420743
f
GR
GS
[1 0 0 1 280.94662 159.16833] CT
0.302 GC
N
f-1586420743
f
GR
GS
[1 0 0 1 285.32486 148.25102] CT
0.302 GC
N
f-1586420743
f
GR
GS
[1 0 0 1 290.4686 145.91266] CT
0.302 GC
N
f-1586420743
f
GR
GS
[1 0 0 1 286.76837 187.47989] CT
0.302 GC
N
f-1586420743
f
GR
GS
[1 0 0 1 274.91968 113.16815] CT
0.302 GC
N
f-1586420743
f
GR
GS
[1 0 0 1 296.84167 142.10437] CT
0.302 GC
N
f-1586420743
f
GR
GS
[1 0 0 1 272.98328 154.77306] CT
0.302 GC
N
f-1586420743
f
GR
GS
[1 0 0 1 286.29498 127.26178] CT
0.302 GC
N
f-1586420743
f
GR
GS
[1 0 0 1 273.13904 139.13332] CT
0.302 GC
N
f-1586420743
f
GR
GS
[1 0 0 1 304.59872 162.86588] CT
0.302 GC
N
f-1586420743
f
GR
GS
[1 0 0 1 302.3808 167.41313] CT
0.302 GC
N
f-1586420743
f
GR
GS
[1 0 0 1 284.73648 206.24908] CT
0.302 GC
N
f-1586420743
f
GR
GS
[1 0 0 1 301.53683 158.39975] CT
0.302 GC
N
f-1586420743
f
GR
GS
[1 0 0 1 280.4382 162.57117] CT
0.302 GC
N
f-1586420743
f
GR
GS
[1 0 0 1 302.36136 167.0275] CT
0.302 GC
N
f-1586420743
f
GR
GS
[1 0 0 1 301.87567 175.78331] CT
0.302 GC
N
f-1586420743
f
GR
GS
[1 0 0 1 285.24829 161.28603] CT
0.302 GC
N
f-1586420743
f
GR
GS
[1 0 0 1 292.84067 129.98546] CT
0.302 GC
N
f-1586420743
f
GR
GS
[1 0 0 1 290.91586 120.96439] CT
0.302 GC
N
f-1586420743
f
GR
GS
[1 0 0 1 301.87402 156.51399] CT
0.302 GC
N
f-1586420743
f
GR
GS
[1 0 0 1 279.06885 146.43311] CT
0.302 GC
N
f-1586420743
f
GR
GS
[1 0 0 1 272.01935 144.12328] CT
0.302 GC
N
f-1586420743
f
GR
GS
[1 0 0 1 301.4071 178.72797] CT
0.302 GC
N
f-1586420743
f
GR
GS
[1 0 0 1 279.77127 127.65341] CT
0.302 GC
N
f-1586420743
f
GR
GS
[1 0 0 1 280.09787 181.87151] CT
0.302 GC
N
f-1586420743
f
GR
GS
[1 0 0 1 293.37354 165.43579] CT
0.302 GC
N
f-1586420743
f
GR
GS
[1 0 0 1 282.09766 161.99292] CT
0.302 GC
N
f-1586420743
f
GR
GS
[1 0 0 1 299.56482 175.80264] CT
0.302 GC
N
f-1586420743
f
GR
GS
[1 0 0 1 301.51126 197.60512] CT
0.302 GC
N
f-1586420743
f
GR
GS
[1 0 0 1 303.57892 171.41635] CT
0.302 GC
N
f-1586420743
f
GR
GS
[1 0 0 1 284.98947 150.56088] CT
0.302 GC
N
f-1586420743
f
GR
GS
[1 0 0 1 298.75024 151.50772] CT
0.302 GC
N
f-1586420743
f
GR
GS
[1 0 0 1 277.15643 212.64912] CT
0.302 GC
N
f-1586420743
f
GR
GS
[1 0 0 1 292.84555 197.6861] CT
0.302 GC
N
f-1586420743
f
GR
GS
[1 0 0 1 295.31998 157.9126] CT
0.302 GC
N
f-1586420743
f
GR
GS
[1 0 0 1 274.76834 153.81097] CT
0.302 GC
N
f-1586420743
f
GR
GS
[1 0 0 1 289.69516 152.31245] CT
0.302 GC
N
f-1586420743
f
GR
GS
[1 0 0 1 301.67474 166.06609] CT
0.302 GC
N
f-1586420743
f
GR
GS
[1 0 0 1 280.72809 162.44328] CT
0.302 GC
N
f-1586420743
f
GR
GS
[1 0 0 1 279.76001 161.52573] CT
0.302 GC
N
f-1586420743
f
GR
GS
[1 0 0 1 300.03531 139.2921] CT
0.302 GC
N
f-1586420743
f
GR
GS
[1 0 0 1 288.50052 152.39934] CT
0.302 GC
N
f-1586420743
f
GR
GS
[1 0 0 1 276.99731 119.30465] CT
0.302 GC
N
f-1586420743
f
GR
GS
[1 0 0 1 281.67209 173.04332] CT
0.302 GC
N
f-1586420743
f
GR
GS
[1 0 0 1 292.74966 175.2681] CT
0.302 GC
N
f-1586420743
f
GR
GS
1 GC
N
/f2074849970{429.5 228.5 M
639 228.5 L
639 32 L
429.5 32 L
cp}def
f2074849970
f
GR
GS
0.149 GC
2 setlinecap
1 LJ
0.5 LW
N
429.5 228.5 M
639 228.5 L
S
GR
GS
0.149 GC
2 setlinecap
1 LJ
0.5 LW
N
492.35 228.5 M
492.35 226.405 L
S
GR
GS
0.149 GC
2 setlinecap
1 LJ
0.5 LW
N
576.15 228.5 M
576.15 226.405 L
S
GR
GS
[1 0 0 1 492.35001 234.89999] CT
0.149 GC
/Helvetica 22 F
GS
[1 0 0 1 0 0] CT
-14.5 21 moveto 
1 -1 scale
(YA) t 
GR
GR
GS
[1 0 0 1 576.15002 234.89999] CT
0.149 GC
/Helvetica 22 F
GS
[1 0 0 1 0 0] CT
-15.5 21 moveto 
1 -1 scale
(OA) t 
GR
GR
GS
[1 0 0 1 534.25012 261.89999] CT
0.149 GC
/Helvetica 22 F
GS
[1 0 0 1 0 0] CT
-53.5 21 moveto 
1 -1 scale
(Age Group) t 
GR
GR
GS
0.149 GC
2 setlinecap
1 LJ
0.5 LW
N
429.5 228.5 M
429.5 32 L
S
GR
GS
0.149 GC
2 setlinecap
1 LJ
0.5 LW
N
429.5 228.5 M
431.595 228.5 L
S
GR
GS
0.149 GC
2 setlinecap
1 LJ
0.5 LW
N
429.5 165.917 M
431.595 165.917 L
S
GR
GS
0.149 GC
2 setlinecap
1 LJ
0.5 LW
N
429.5 103.333 M
431.595 103.333 L
S
GR
GS
0.149 GC
2 setlinecap
1 LJ
0.5 LW
N
429.5 40.75 M
431.595 40.75 L
S
GR
GS
[1 0 0 1 423.10001 228.5] CT
0.149 GC
/Helvetica 22 F
GS
[1 0 0 1 0 0] CT
-13 8 moveto 
1 -1 scale
(0) t 
GR
GR
GS
[1 0 0 1 423.10001 165.9165] CT
0.149 GC
/Helvetica 22 F
GS
[1 0 0 1 0 0] CT
-31 8 moveto 
1 -1 scale
(0.5) t 
GR
GR
GS
[1 0 0 1 423.10001 103.33302] CT
0.149 GC
/Helvetica 22 F
GS
[1 0 0 1 0 0] CT
-13 8 moveto 
1 -1 scale
(1) t 
GR
GR
GS
[1 0 0 1 423.10001 40.74953] CT
0.149 GC
/Helvetica 22 F
GS
[1 0 0 1 0 0] CT
-31 8 moveto 
1 -1 scale
(1.5) t 
GR
GR
GS
[0 -1 1 0 389.10001 130.24989] CT
0.149 GC
/Helvetica 22 F
GS
[1 0 0 1 0 0] CT
-64.5 -5 moveto 
1 -1 scale
(Threshold L1) t 
GR
GR
GS
[1 0 0 1 534.25049 29.25] CT
/Helvetica-Bold 22 F
GS
[1 0 0 1 0 0] CT
-65.5 -5 moveto 
1 -1 scale
(p = 0.027747) t 
GR
GR
GS
0.149 GC
1 LJ
0.5 LW
N
429.5 228.5 M
639 228.5 L
S
GR
GS
1 0.6 0.6 RC
N
/f-40808498{525.87 228.5 M
525.87 106.123 L
458.83 106.123 L
458.83 228.5 L
cp}def
f-40808498
f
GR
GS
[1 0 0 1 499.58716 117.70707] CT
0.302 GC
N
f-1586420743
f
GR
GS
[1 0 0 1 485.00009 132.52206] CT
0.302 GC
N
f-1586420743
f
GR
GS
[1 0 0 1 489.40939 103.91087] CT
0.302 GC
N
f-1586420743
f
GR
GS
[1 0 0 1 487.73114 113.89877] CT
0.302 GC
N
f-1586420743
f
GR
GS
[1 0 0 1 501.78226 102.03193] CT
0.302 GC
N
f-1586420743
f
GR
GS
[1 0 0 1 480.13153 84.33076] CT
0.302 GC
N
f-1586420743
f
GR
GS
[1 0 0 1 505.82736 133.24922] CT
0.302 GC
N
f-1586420743
f
GR
GS
[1 0 0 1 485.29861 81.37386] CT
0.302 GC
N
f-1586420743
f
GR
GS
[1 0 0 1 492.33517 121.31441] CT
0.302 GC
N
f-1586420743
f
GR
GS
[1 0 0 1 501.85596 45.62415] CT
0.302 GC
N
f-1586420743
f
GR
GS
[1 0 0 1 498.28513 109.36984] CT
0.302 GC
N
f-1586420743
f
GR
GS
[1 0 0 1 480.61169 85.9234] CT
0.302 GC
N
f-1586420743
f
GR
GS
[1 0 0 1 498.94067 93.07639] CT
0.302 GC
N
f-1586420743
f
GR
GS
[1 0 0 1 479.91452 108.62766] CT
0.302 GC
N
f-1586420743
f
GR
GS
[1 0 0 1 507.29813 78.81769] CT
0.302 GC
N
f-1586420743
f
GR
GS
[1 0 0 1 505.30252 80.67263] CT
0.302 GC
N
f-1586420743
f
GR
GS
[1 0 0 1 492.85297 104.16465] CT
0.302 GC
N
f-1586420743
f
GR
GS
[1 0 0 1 498.36377 63.41644] CT
0.302 GC
N
f-1586420743
f
GR
GS
[1 0 0 1 508.33212 91.90587] CT
0.302 GC
N
f-1586420743
f
GR
GS
[1 0 0 1 479.79544 93.40602] CT
0.302 GC
N
f-1586420743
f
GR
GS
[1 0 0 1 500.80518 81.61012] CT
0.302 GC
N
f-1586420743
f
GR
GS
[1 0 0 1 503.31277 70.90392] CT
0.302 GC
N
f-1586420743
f
GR
GS
[1 0 0 1 501.78354 78.80317] CT
0.302 GC
N
f-1586420743
f
GR
GS
[1 0 0 1 489.95807 110.29125] CT
0.302 GC
N
f-1586420743
f
GR
GS
[1 0 0 1 476.07458 133.12457] CT
0.302 GC
N
f-1586420743
f
GR
GS
[1 0 0 1 486.49356 145.8199] CT
0.302 GC
N
f-1586420743
f
GR
GS
[1 0 0 1 480.10522 117.29549] CT
0.302 GC
N
f-1586420743
f
GR
GS
[1 0 0 1 490.69135 143.11264] CT
0.302 GC
N
f-1586420743
f
GR
GS
[1 0 0 1 494.77264 106.85332] CT
0.302 GC
N
f-1586420743
f
GR
GS
[1 0 0 1 502.13861 44.8752] CT
0.302 GC
N
f-1586420743
f
GR
GS
[1 0 0 1 489.65958 133.74965] CT
0.302 GC
N
f-1586420743
f
GR
GS
[1 0 0 1 493.44064 128.46765] CT
0.302 GC
N
f-1586420743
f
GR
GS
[1 0 0 1 506.6196 142.97127] CT
0.302 GC
N
f-1586420743
f
GR
GS
[1 0 0 1 505.72723 109.74836] CT
0.302 GC
N
f-1586420743
f
GR
GS
[1 0 0 1 493.85281 130.1179] CT
0.302 GC
N
f-1586420743
f
GR
GS
[1 0 0 1 505.79568 106.92177] CT
0.302 GC
N
f-1586420743
f
GR
GS
[1 0 0 1 477.32724 115.18388] CT
0.302 GC
N
f-1586420743
f
GR
GS
[1 0 0 1 502.69437 98.49516] CT
0.302 GC
N
f-1586420743
f
GR
GS
[1 0 0 1 486.81601 129.89697] CT
0.302 GC
N
f-1586420743
f
GR
GS
[1 0 0 1 483.25546 124.59783] CT
0.302 GC
N
f-1586420743
f
GR
GS
[1 0 0 1 503.15692 98.64201] CT
0.302 GC
N
f-1586420743
f
GR
GS
[1 0 0 1 487.26282 132.86348] CT
0.302 GC
N
f-1586420743
f
GR
GS
[1 0 0 1 476.53305 116.3483] CT
0.302 GC
N
f-1586420743
f
GR
GS
[1 0 0 1 507.61398 111.46164] CT
0.302 GC
N
f-1586420743
f
GR
GS
[1 0 0 1 498.39334 121.37051] CT
0.302 GC
N
f-1586420743
f
GR
GS
[1 0 0 1 504.43604 102.04162] CT
0.302 GC
N
f-1586420743
f
GR
GS
[1 0 0 1 507.06842 118.78257] CT
0.302 GC
N
f-1586420743
f
GR
GS
[1 0 0 1 498.39011 122.49728] CT
0.302 GC
N
f-1586420743
f
GR
GS
[1 0 0 1 506.34204 77.82786] CT
0.302 GC
N
f-1586420743
f
GR
GS
1 0.6 0.6 RC
N
/f-422207496{609.67 228.5 M
609.67 94.927 L
542.63 94.927 L
542.63 228.5 L
cp}def
f-422207496
f
GR
GS
[1 0 0 1 567.99432 114.12096] CT
0.302 GC
N
f-1586420743
f
GR
GS
[1 0 0 1 589.07593 74.48224] CT
0.302 GC
N
f-1586420743
f
GR
GS
[1 0 0 1 590.22986 96.53789] CT
0.302 GC
N
f-1586420743
f
GR
GS
[1 0 0 1 569.44812 44.25262] CT
0.302 GC
N
f-1586420743
f
GR
GS
[1 0 0 1 561.8501 97.85917] CT
0.302 GC
N
f-1586420743
f
GR
GS
[1 0 0 1 585.11322 66.07291] CT
0.302 GC
N
f-1586420743
f
GR
GS
[1 0 0 1 562.23761 100.71239] CT
0.302 GC
N
f-1586420743
f
GR
GS
[1 0 0 1 583.81818 87.15572] CT
0.302 GC
N
f-1586420743
f
GR
GS
[1 0 0 1 581.21985 103.12879] CT
0.302 GC
N
f-1586420743
f
GR
GS
[1 0 0 1 565.07172 76.62144] CT
0.302 GC
N
f-1586420743
f
GR
GS
[1 0 0 1 577.20416 45.69307] CT
0.302 GC
N
f-1586420743
f
GR
GS
[1 0 0 1 580.63501 46.43172] CT
0.302 GC
N
f-1586420743
f
GR
GS
[1 0 0 1 559.86249 141.50696] CT
0.302 GC
N
f-1586420743
f
GR
GS
[1 0 0 1 575.15686 102.133] CT
0.302 GC
N
f-1586420743
f
GR
GS
[1 0 0 1 589.09961 91.41877] CT
0.302 GC
N
f-1586420743
f
GR
GS
[1 0 0 1 563.21222 110.76087] CT
0.302 GC
N
f-1586420743
f
GR
GS
[1 0 0 1 574.224 129.37952] CT
0.302 GC
N
f-1586420743
f
GR
GS
[1 0 0 1 581.49805 112.08268] CT
0.302 GC
N
f-1586420743
f
GR
GS
[1 0 0 1 591.24634 157.45695] CT
0.302 GC
N
f-1586420743
f
GR
GS
[1 0 0 1 582.66248 64.75532] CT
0.302 GC
N
f-1586420743
f
GR
GS
[1 0 0 1 566.32214 95.06986] CT
0.302 GC
N
f-1586420743
f
GR
GS
[1 0 0 1 577.98566 116.04681] CT
0.302 GC
N
f-1586420743
f
GR
GS
[1 0 0 1 588.8634 88.34955] CT
0.302 GC
N
f-1586420743
f
GR
GS
[1 0 0 1 578.08942 99.26656] CT
0.302 GC
N
f-1586420743
f
GR
GS
[1 0 0 1 584.60822 92.31187] CT
0.302 GC
N
f-1586420743
f
GR
GS
[1 0 0 1 589.38708 124.37744] CT
0.302 GC
N
f-1586420743
f
GR
GS
[1 0 0 1 587.60858 129.61661] CT
0.302 GC
N
f-1586420743
f
GR
GS
[1 0 0 1 563.77631 75.82994] CT
0.302 GC
N
f-1586420743
f
GR
GS
[1 0 0 1 565.73047 103.15777] CT
0.302 GC
N
f-1586420743
f
GR
GS
[1 0 0 1 564.53998 118.70972] CT
0.302 GC
N
f-1586420743
f
GR
GS
[1 0 0 1 560.35883 84.97493] CT
0.302 GC
N
f-1586420743
f
GR
GS
[1 0 0 1 559.69452 109.06802] CT
0.302 GC
N
f-1586420743
f
GR
GS
[1 0 0 1 579.38306 90.62464] CT
0.302 GC
N
f-1586420743
f
GR
GS
[1 0 0 1 579.8053 98.65277] CT
0.302 GC
N
f-1586420743
f
GR
GS
[1 0 0 1 590.19232 50.80142] CT
0.302 GC
N
f-1586420743
f
GR
GS
[1 0 0 1 583.97943 126.50204] CT
0.302 GC
N
f-1586420743
f
GR
GS
[1 0 0 1 569.48444 31.99999] CT
0.302 GC
N
f-1586420743
f
GR
GS
[1 0 0 1 576.00165 77.85691] CT
0.302 GC
N
f-1586420743
f
GR
GS
[1 0 0 1 568.04364 75.1488] CT
0.302 GC
N
f-1586420743
f
GR
GS
[1 0 0 1 583.95526 101.30698] CT
0.302 GC
N
f-1586420743
f
GR
GS
[1 0 0 1 563.30383 93.91893] CT
0.302 GC
N
f-1586420743
f
GR
GS
[1 0 0 1 584.39728 99.87762] CT
0.302 GC
N
f-1586420743
f
GR
GS
[1 0 0 1 586.53412 134.77756] CT
0.302 GC
N
f-1586420743
f
GR
GS
[1 0 0 1 584.37024 60.3863] CT
0.302 GC
N
f-1586420743
f
GR
GS
[1 0 0 1 570.69104 107.35532] CT
0.302 GC
N
f-1586420743
f
GR
GS
[1 0 0 1 578.97656 84.6438] CT
0.302 GC
N
f-1586420743
f
GR
GS
[1 0 0 1 575.10925 142.16731] CT
0.302 GC
N
f-1586420743
f
GR
GS
[1 0 0 1 562.31512 64.9287] CT
0.302 GC
N
f-1586420743
f
GR
GS
[1 0 0 1 587.16858 105.82771] CT
0.302 GC
N
f-1586420743
f
GR
GS
[1 0 0 1 582.38287 103.51658] CT
0.302 GC
N
f-1586420743
f
GR
GS
[1 0 0 1 568.35071 92.83047] CT
0.302 GC
N
f-1586420743
f
GR
GS
[1 0 0 1 573.17291 84.71927] CT
0.302 GC
N
f-1586420743
f
GR
GS
[1 0 0 1 567.31714 103.93446] CT
0.302 GC
N
f-1586420743
f
GR
GS
1 GC
N
/f1706994306{717 228.5 M
926.5 228.5 L
926.5 32 L
717 32 L
cp}def
f1706994306
f
GR
GS
0.149 GC
2 setlinecap
1 LJ
0.5 LW
N
717 228.5 M
926.5 228.5 L
S
GR
GS
0.149 GC
2 setlinecap
1 LJ
0.5 LW
N
779.85 228.5 M
779.85 226.405 L
S
GR
GS
0.149 GC
2 setlinecap
1 LJ
0.5 LW
N
863.65 228.5 M
863.65 226.405 L
S
GR
GS
[1 0 0 1 779.84998 234.89999] CT
0.149 GC
/Helvetica 22 F
GS
[1 0 0 1 0 0] CT
-14.5 21 moveto 
1 -1 scale
(YA) t 
GR
GR
GS
[1 0 0 1 863.65002 234.89999] CT
0.149 GC
/Helvetica 22 F
GS
[1 0 0 1 0 0] CT
-15.5 21 moveto 
1 -1 scale
(OA) t 
GR
GR
GS
[1 0 0 1 821.75012 261.89999] CT
0.149 GC
/Helvetica 22 F
GS
[1 0 0 1 0 0] CT
-53.5 21 moveto 
1 -1 scale
(Age Group) t 
GR
GR
GS
0.149 GC
2 setlinecap
1 LJ
0.5 LW
N
717 228.5 M
717 32 L
S
GR
GS
0.149 GC
2 setlinecap
1 LJ
0.5 LW
N
717 228.5 M
719.095 228.5 L
S
GR
GS
0.149 GC
2 setlinecap
1 LJ
0.5 LW
N
717 186.655 M
719.095 186.655 L
S
GR
GS
0.149 GC
2 setlinecap
1 LJ
0.5 LW
N
717 144.811 M
719.095 144.811 L
S
GR
GS
0.149 GC
2 setlinecap
1 LJ
0.5 LW
N
717 102.966 M
719.095 102.966 L
S
GR
GS
0.149 GC
2 setlinecap
1 LJ
0.5 LW
N
717 61.122 M
719.095 61.122 L
S
GR
GS
[1 0 0 1 710.59998 228.5] CT
0.149 GC
/Helvetica 22 F
GS
[1 0 0 1 0 0] CT
-13 8 moveto 
1 -1 scale
(0) t 
GR
GR
GS
[1 0 0 1 710.59998 186.65546] CT
0.149 GC
/Helvetica 22 F
GS
[1 0 0 1 0 0] CT
-31 8 moveto 
1 -1 scale
(0.1) t 
GR
GR
GS
[1 0 0 1 710.59998 144.81091] CT
0.149 GC
/Helvetica 22 F
GS
[1 0 0 1 0 0] CT
-31 8 moveto 
1 -1 scale
(0.2) t 
GR
GR
GS
[1 0 0 1 710.59998 102.96638] CT
0.149 GC
/Helvetica 22 F
GS
[1 0 0 1 0 0] CT
-31 8 moveto 
1 -1 scale
(0.3) t 
GR
GR
GS
[1 0 0 1 710.59998 61.12184] CT
0.149 GC
/Helvetica 22 F
GS
[1 0 0 1 0 0] CT
-31 8 moveto 
1 -1 scale
(0.4) t 
GR
GR
GS
[0 -1 1 0 676.59998 130.24991] CT
0.149 GC
/Helvetica 22 F
GS
[1 0 0 1 0 0] CT
-37.5 -5 moveto 
1 -1 scale
(NDT L1) t 
GR
GR
GS
[1 0 0 1 821.75079 29.25] CT
/Helvetica-Bold 22 F
GS
[1 0 0 1 0 0] CT
-76.5 -5 moveto 
1 -1 scale
(p = 1.3512e-11) t 
GR
GR
GS
0.149 GC
1 LJ
0.5 LW
N
717 228.5 M
926.5 228.5 L
S
GR
GS
1 0.6 0.6 RC
N
/f-1589751858{813.37 228.5 M
813.37 120.725 L
746.33 120.725 L
746.33 228.5 L
cp}def
f-1589751858
f
GR
GS
[1 0 0 1 769.62823 122.37103] CT
0.302 GC
N
f-1586420743
f
GR
GS
[1 0 0 1 786.73431 125.70204] CT
0.302 GC
N
f-1586420743
f
GR
GS
[1 0 0 1 769.14197 133.76956] CT
0.302 GC
N
f-1586420743
f
GR
GS
[1 0 0 1 780.59857 133.13568] CT
0.302 GC
N
f-1586420743
f
GR
GS
[1 0 0 1 773.0177 116.42921] CT
0.302 GC
N
f-1586420743
f
GR
GS
[1 0 0 1 778.60242 135.44475] CT
0.302 GC
N
f-1586420743
f
GR
GS
[1 0 0 1 794.10376 112.5036] CT
0.302 GC
N
f-1586420743
f
GR
GS
[1 0 0 1 770.3266 108.11215] CT
0.302 GC
N
f-1586420743
f
GR
GS
[1 0 0 1 763.12384 113.63815] CT
0.302 GC
N
f-1586420743
f
GR
GS
[1 0 0 1 793.47943 137.3008] CT
0.302 GC
N
f-1586420743
f
GR
GS
[1 0 0 1 785.88501 143.69563] CT
0.302 GC
N
f-1586420743
f
GR
GS
[1 0 0 1 780.3512 138.09657] CT
0.302 GC
N
f-1586420743
f
GR
GS
[1 0 0 1 780.58972 121.51999] CT
0.302 GC
N
f-1586420743
f
GR
GS
[1 0 0 1 766.53986 136.13048] CT
0.302 GC
N
f-1586420743
f
GR
GS
[1 0 0 1 796.50543 114.57827] CT
0.302 GC
N
f-1586420743
f
GR
GS
[1 0 0 1 775.12262 135.21414] CT
0.302 GC
N
f-1586420743
f
GR
GS
[1 0 0 1 784.04816 131.03375] CT
0.302 GC
N
f-1586420743
f
GR
GS
[1 0 0 1 776.27563 126.97554] CT
0.302 GC
N
f-1586420743
f
GR
GS
[1 0 0 1 763.34686 119.13466] CT
0.302 GC
N
f-1586420743
f
GR
GS
[1 0 0 1 781.36798 87.55839] CT
0.302 GC
N
f-1586420743
f
GR
GS
[1 0 0 1 780.1554 79.39139] CT
0.302 GC
N
f-1586420743
f
GR
GS
[1 0 0 1 771.362 113.30058] CT
0.302 GC
N
f-1586420743
f
GR
GS
[1 0 0 1 764.61163 120.36954] CT
0.302 GC
N
f-1586420743
f
GR
GS
[1 0 0 1 764.70734 122.83412] CT
0.302 GC
N
f-1586420743
f
GR
GS
[1 0 0 1 773.69305 96.31773] CT
0.302 GC
N
f-1586420743
f
GR
GS
[1 0 0 1 789.35022 124.76445] CT
0.302 GC
N
f-1586420743
f
GR
GS
[1 0 0 1 795.68488 126.14394] CT
0.302 GC
N
f-1586420743
f
GR
GS
[1 0 0 1 782.74829 130.72954] CT
0.302 GC
N
f-1586420743
f
GR
GS
[1 0 0 1 789.17004 120.08543] CT
0.302 GC
N
f-1586420743
f
GR
GS
[1 0 0 1 787.48242 105.35865] CT
0.302 GC
N
f-1586420743
f
GR
GS
[1 0 0 1 784.91107 128.10486] CT
0.302 GC
N
f-1586420743
f
GR
GS
[1 0 0 1 785.36792 119.69013] CT
0.302 GC
N
f-1586420743
f
GR
GS
[1 0 0 1 794.55792 117.98512] CT
0.302 GC
N
f-1586420743
f
GR
GS
[1 0 0 1 781.02594 114.67558] CT
0.302 GC
N
f-1586420743
f
GR
GS
[1 0 0 1 776.44574 119.53104] CT
0.302 GC
N
f-1586420743
f
GR
GS
[1 0 0 1 785.56372 121.58784] CT
0.302 GC
N
f-1586420743
f
GR
GS
[1 0 0 1 777.85669 82.67901] CT
0.302 GC
N
f-1586420743
f
GR
GS
[1 0 0 1 767.54395 126.39411] CT
0.302 GC
N
f-1586420743
f
GR
GS
[1 0 0 1 777.81213 127.0511] CT
0.302 GC
N
f-1586420743
f
GR
GS
[1 0 0 1 781.44696 130.46239] CT
0.302 GC
N
f-1586420743
f
GR
GS
[1 0 0 1 776.33496 122.35162] CT
0.302 GC
N
f-1586420743
f
GR
GS
[1 0 0 1 776.44006 112.5476] CT
0.302 GC
N
f-1586420743
f
GR
GS
[1 0 0 1 780.59918 116.60114] CT
0.302 GC
N
f-1586420743
f
GR
GS
[1 0 0 1 779.5293 131.73439] CT
0.302 GC
N
f-1586420743
f
GR
GS
[1 0 0 1 766.0625 131.03441] CT
0.302 GC
N
f-1586420743
f
GR
GS
[1 0 0 1 771.49854 132.07693] CT
0.302 GC
N
f-1586420743
f
GR
GS
[1 0 0 1 778.09216 125.58127] CT
0.302 GC
N
f-1586420743
f
GR
GS
[1 0 0 1 784.47443 112.12588] CT
0.302 GC
N
f-1586420743
f
GR
GS
[1 0 0 1 786.87061 111.67471] CT
0.302 GC
N
f-1586420743
f
GR
GS
1 0.6 0.6 RC
N
/f890409056{897.17 228.5 M
897.17 95.026 L
830.13 95.026 L
830.13 228.5 L
cp}def
f890409056
f
GR
GS
[1 0 0 1 880.1626 110.43736] CT
0.302 GC
N
f-1586420743
f
GR
GS
[1 0 0 1 878.13721 112.62346] CT
0.302 GC
N
f-1586420743
f
GR
GS
[1 0 0 1 849.98151 98.60234] CT
0.302 GC
N
f-1586420743
f
GR
GS
[1 0 0 1 878.85266 92.13473] CT
0.302 GC
N
f-1586420743
f
GR
GS
[1 0 0 1 852.34692 98.76634] CT
0.302 GC
N
f-1586420743
f
GR
GS
[1 0 0 1 879.41968 126.76495] CT
0.302 GC
N
f-1586420743
f
GR
GS
[1 0 0 1 866.90167 32] CT
0.302 GC
N
f-1586420743
f
GR
GS
[1 0 0 1 854.94244 64.76226] CT
0.302 GC
N
f-1586420743
f
GR
GS
[1 0 0 1 856.94739 94.74773] CT
0.302 GC
N
f-1586420743
f
GR
GS
[1 0 0 1 874.16003 79.04507] CT
0.302 GC
N
f-1586420743
f
GR
GS
[1 0 0 1 849.4613 97.39902] CT
0.302 GC
N
f-1586420743
f
GR
GS
[1 0 0 1 858.77191 81.41837] CT
0.302 GC
N
f-1586420743
f
GR
GS
[1 0 0 1 851.315 110.67101] CT
0.302 GC
N
f-1586420743
f
GR
GS
[1 0 0 1 852.1922 90.63024] CT
0.302 GC
N
f-1586420743
f
GR
GS
[1 0 0 1 848.97314 84.02637] CT
0.302 GC
N
f-1586420743
f
GR
GS
[1 0 0 1 870.41577 62.82821] CT
0.302 GC
N
f-1586420743
f
GR
GS
[1 0 0 1 849.78888 90.94936] CT
0.302 GC
N
f-1586420743
f
GR
GS
[1 0 0 1 867.5647 76.19168] CT
0.302 GC
N
f-1586420743
f
GR
GS
[1 0 0 1 868.72498 123.11708] CT
0.302 GC
N
f-1586420743
f
GR
GS
[1 0 0 1 863.60632 94.90686] CT
0.302 GC
N
f-1586420743
f
GR
GS
[1 0 0 1 856.42682 76.30386] CT
0.302 GC
N
f-1586420743
f
GR
GS
[1 0 0 1 874.73035 100.73714] CT
0.302 GC
N
f-1586420743
f
GR
GS
[1 0 0 1 874.32141 95.02476] CT
0.302 GC
N
f-1586420743
f
GR
GS
[1 0 0 1 878.33746 67.08965] CT
0.302 GC
N
f-1586420743
f
GR
GS
[1 0 0 1 846.90094 89.16833] CT
0.302 GC
N
f-1586420743
f
GR
GS
[1 0 0 1 868.35583 121.84787] CT
0.302 GC
N
f-1586420743
f
GR
GS
[1 0 0 1 847.13654 117.17975] CT
0.302 GC
N
f-1586420743
f
GR
GS
[1 0 0 1 850.45721 74.06446] CT
0.302 GC
N
f-1586420743
f
GR
GS
[1 0 0 1 850.46973 87.79863] CT
0.302 GC
N
f-1586420743
f
GR
GS
[1 0 0 1 859.1955 85.10732] CT
0.302 GC
N
f-1586420743
f
GR
GS
[1 0 0 1 854.92163 101.54445] CT
0.302 GC
N
f-1586420743
f
GR
GS
[1 0 0 1 858.49261 110.58876] CT
0.302 GC
N
f-1586420743
f
GR
GS
[1 0 0 1 855.25726 106.05623] CT
0.302 GC
N
f-1586420743
f
GR
GS
[1 0 0 1 859.86438 98.57252] CT
0.302 GC
N
f-1586420743
f
GR
GS
[1 0 0 1 861.00323 114.828] CT
0.302 GC
N
f-1586420743
f
GR
GS
[1 0 0 1 868.3454 84.53145] CT
0.302 GC
N
f-1586420743
f
GR
GS
[1 0 0 1 873.28876 106.23905] CT
0.302 GC
N
f-1586420743
f
GR
GS
[1 0 0 1 855.94019 115.70858] CT
0.302 GC
N
f-1586420743
f
GR
GS
[1 0 0 1 875.1803 114.62381] CT
0.302 GC
N
f-1586420743
f
GR
GS
[1 0 0 1 871.71051 111.94078] CT
0.302 GC
N
f-1586420743
f
GR
GS
[1 0 0 1 874.58093 85.89709] CT
0.302 GC
N
f-1586420743
f
GR
GS
[1 0 0 1 852.99707 88.81962] CT
0.302 GC
N
f-1586420743
f
GR
GS
[1 0 0 1 849.08344 109.82911] CT
0.302 GC
N
f-1586420743
f
GR
GS
[1 0 0 1 867.34894 49.78929] CT
0.302 GC
N
f-1586420743
f
GR
GS
[1 0 0 1 870.40607 114.90618] CT
0.302 GC
N
f-1586420743
f
GR
GS
[1 0 0 1 850.63141 72.2993] CT
0.302 GC
N
f-1586420743
f
GR
GS
[1 0 0 1 850.10199 120.37394] CT
0.302 GC
N
f-1586420743
f
GR
GS
[1 0 0 1 866.92938 82.9715] CT
0.302 GC
N
f-1586420743
f
GR
GS
[1 0 0 1 874.11603 105.23573] CT
0.302 GC
N
f-1586420743
f
GR
GS
[1 0 0 1 874.19464 78.21906] CT
0.302 GC
N
f-1586420743
f
GR
GS
[1 0 0 1 849.88794 122.9721] CT
0.302 GC
N
f-1586420743
f
GR
GS
[1 0 0 1 849.25946 98.007] CT
0.302 GC
N
f-1586420743
f
GR
GS
[1 0 0 1 854.97766 106.08802] CT
0.302 GC
N
f-1586420743
f
GR
%%Trailer
%%Pages: 1
%%EOF
