%!PS-Adobe-3.0 EPSF-3.0
%%Creator: (MATLAB, The Mathworks, Inc. Version 9.8.0.1323502 \(R2020a\). Operating System: Mac OS X)
%%Title: /Users/kosciessa/Volumes/tardis/LNDG/stateswitch/stsw_beh_task/hddm/figures/D_compareYAOA_vt_l1.eps
%%CreationDate: 2022-02-10T11:31:55
%%Pages: (atend)
%%BoundingBox:    99     0   927   280
%%LanguageLevel: 3
%%EndComments
%%BeginProlog
%%BeginResource: procset (Apache XML Graphics Std ProcSet) 1.2 0
%%Version: 1.2 0
%%Copyright: (Copyright 2001-2003,2010 The Apache Software Foundation. License terms: http://www.apache.org/licenses/LICENSE-2.0)
/bd{bind def}bind def
/ld{load def}bd
/GR/grestore ld
/GS/gsave ld
/RM/rmoveto ld
/C/curveto ld
/t/show ld
/L/lineto ld
/ML/setmiterlimit ld
/CT/concat ld
/f/fill ld
/N/newpath ld
/S/stroke ld
/CC/setcmykcolor ld
/A/ashow ld
/cp/closepath ld
/RC/setrgbcolor ld
/LJ/setlinejoin ld
/GC/setgray ld
/LW/setlinewidth ld
/M/moveto ld
/re {4 2 roll M
1 index 0 rlineto
0 exch rlineto
neg 0 rlineto
cp } bd
/_ctm matrix def
/_tm matrix def
/BT { _ctm currentmatrix pop matrix _tm copy pop 0 0 moveto } bd
/ET { _ctm setmatrix } bd
/iTm { _ctm setmatrix _tm concat } bd
/Tm { _tm astore pop iTm 0 0 moveto } bd
/ux 0.0 def
/uy 0.0 def
/F {
  /Tp exch def
  /Tf exch def
  Tf findfont Tp scalefont setfont
  /cf Tf def  /cs Tp def
} bd
/ULS {currentpoint /uy exch def /ux exch def} bd
/ULE {
  /Tcx currentpoint pop def
  gsave
  newpath
  cf findfont cs scalefont dup
  /FontMatrix get 0 get /Ts exch def /FontInfo get dup
  /UnderlinePosition get Ts mul /To exch def
  /UnderlineThickness get Ts mul /Tt exch def
  ux uy To add moveto  Tcx uy To add lineto
  Tt setlinewidth stroke
  grestore
} bd
/OLE {
  /Tcx currentpoint pop def
  gsave
  newpath
  cf findfont cs scalefont dup
  /FontMatrix get 0 get /Ts exch def /FontInfo get dup
  /UnderlinePosition get Ts mul /To exch def
  /UnderlineThickness get Ts mul /Tt exch def
  ux uy To add cs add moveto Tcx uy To add cs add lineto
  Tt setlinewidth stroke
  grestore
} bd
/SOE {
  /Tcx currentpoint pop def
  gsave
  newpath
  cf findfont cs scalefont dup
  /FontMatrix get 0 get /Ts exch def /FontInfo get dup
  /UnderlinePosition get Ts mul /To exch def
  /UnderlineThickness get Ts mul /Tt exch def
  ux uy To add cs 10 mul 26 idiv add moveto Tcx uy To add cs 10 mul 26 idiv add lineto
  Tt setlinewidth stroke
  grestore
} bd
/QT {
/Y22 exch store
/X22 exch store
/Y21 exch store
/X21 exch store
currentpoint
/Y21 load 2 mul add 3 div exch
/X21 load 2 mul add 3 div exch
/X21 load 2 mul /X22 load add 3 div
/Y21 load 2 mul /Y22 load add 3 div
/X22 load /Y22 load curveto
} bd
/SSPD {
dup length /d exch dict def
{
/v exch def
/k exch def
currentpagedevice k known {
/cpdv currentpagedevice k get def
v cpdv ne {
/upd false def
/nullv v type /nulltype eq def
/nullcpdv cpdv type /nulltype eq def
nullv nullcpdv or
{
/upd true def
} {
/sametype v type cpdv type eq def
sametype {
v type /arraytype eq {
/vlen v length def
/cpdvlen cpdv length def
vlen cpdvlen eq {
0 1 vlen 1 sub {
/i exch def
/obj v i get def
/cpdobj cpdv i get def
obj cpdobj ne {
/upd true def
exit
} if
} for
} {
/upd true def
} ifelse
} {
v type /dicttype eq {
v {
/dv exch def
/dk exch def
/cpddv cpdv dk get def
dv cpddv ne {
/upd true def
exit
} if
} forall
} {
/upd true def
} ifelse
} ifelse
} if
} ifelse
upd true eq {
d k v put
} if
} if
} if
} forall
d length 0 gt {
d setpagedevice
} if
} bd
/RE { % /NewFontName [NewEncodingArray] /FontName RE -
  findfont dup length dict begin
  {
    1 index /FID ne
    {def} {pop pop} ifelse
  } forall
  /Encoding exch def
  /FontName 1 index def
  currentdict definefont pop
  end
} bind def
%%EndResource
%%BeginResource: procset (Apache XML Graphics EPS ProcSet) 1.0 0
%%Version: 1.0 0
%%Copyright: (Copyright 2002-2003 The Apache Software Foundation. License terms: http://www.apache.org/licenses/LICENSE-2.0)
/BeginEPSF { %def
/b4_Inc_state save def         % Save state for cleanup
/dict_count countdictstack def % Count objects on dict stack
/op_count count 1 sub def      % Count objects on operand stack
userdict begin                 % Push userdict on dict stack
/showpage { } def              % Redefine showpage, { } = null proc
0 setgray 0 setlinecap         % Prepare graphics state
1 setlinewidth 0 setlinejoin
10 setmiterlimit [ ] 0 setdash newpath
/languagelevel where           % If level not equal to 1 then
{pop languagelevel             % set strokeadjust and
1 ne                           % overprint to their defaults.
{false setstrokeadjust false setoverprint
} if
} if
} bd
/EndEPSF { %def
count op_count sub {pop} repeat            % Clean up stacks
countdictstack dict_count sub {end} repeat
b4_Inc_state restore
} bd
%%EndResource
%FOPBeginFontDict
%%IncludeResource: font Courier-Oblique
%%IncludeResource: font Courier-BoldOblique
%%IncludeResource: font Courier-Bold
%%IncludeResource: font ZapfDingbats
%%IncludeResource: font Symbol
%%IncludeResource: font Helvetica
%%IncludeResource: font Helvetica-Oblique
%%IncludeResource: font Helvetica-Bold
%%IncludeResource: font Helvetica-BoldOblique
%%IncludeResource: font Times-Roman
%%IncludeResource: font Times-Italic
%%IncludeResource: font Times-Bold
%%IncludeResource: font Times-BoldItalic
%%IncludeResource: font Courier
%FOPEndFontDict
%%BeginResource: encoding WinAnsiEncoding
/WinAnsiEncoding [
/.notdef /.notdef /.notdef /.notdef /.notdef
/.notdef /.notdef /.notdef /.notdef /.notdef
/.notdef /.notdef /.notdef /.notdef /.notdef
/.notdef /.notdef /.notdef /.notdef /.notdef
/.notdef /.notdef /.notdef /.notdef /.notdef
/.notdef /.notdef /.notdef /.notdef /.notdef
/.notdef /.notdef /space /exclam /quotedbl
/numbersign /dollar /percent /ampersand /quotesingle
/parenleft /parenright /asterisk /plus /comma
/hyphen /period /slash /zero /one
/two /three /four /five /six
/seven /eight /nine /colon /semicolon
/less /equal /greater /question /at
/A /B /C /D /E
/F /G /H /I /J
/K /L /M /N /O
/P /Q /R /S /T
/U /V /W /X /Y
/Z /bracketleft /backslash /bracketright /asciicircum
/underscore /quoteleft /a /b /c
/d /e /f /g /h
/i /j /k /l /m
/n /o /p /q /r
/s /t /u /v /w
/x /y /z /braceleft /bar
/braceright /asciitilde /bullet /Euro /bullet
/quotesinglbase /florin /quotedblbase /ellipsis /dagger
/daggerdbl /circumflex /perthousand /Scaron /guilsinglleft
/OE /bullet /Zcaron /bullet /bullet
/quoteleft /quoteright /quotedblleft /quotedblright /bullet
/endash /emdash /asciitilde /trademark /scaron
/guilsinglright /oe /bullet /zcaron /Ydieresis
/space /exclamdown /cent /sterling /currency
/yen /brokenbar /section /dieresis /copyright
/ordfeminine /guillemotleft /logicalnot /sfthyphen /registered
/macron /degree /plusminus /twosuperior /threesuperior
/acute /mu /paragraph /middot /cedilla
/onesuperior /ordmasculine /guillemotright /onequarter /onehalf
/threequarters /questiondown /Agrave /Aacute /Acircumflex
/Atilde /Adieresis /Aring /AE /Ccedilla
/Egrave /Eacute /Ecircumflex /Edieresis /Igrave
/Iacute /Icircumflex /Idieresis /Eth /Ntilde
/Ograve /Oacute /Ocircumflex /Otilde /Odieresis
/multiply /Oslash /Ugrave /Uacute /Ucircumflex
/Udieresis /Yacute /Thorn /germandbls /agrave
/aacute /acircumflex /atilde /adieresis /aring
/ae /ccedilla /egrave /eacute /ecircumflex
/edieresis /igrave /iacute /icircumflex /idieresis
/eth /ntilde /ograve /oacute /ocircumflex
/otilde /odieresis /divide /oslash /ugrave
/uacute /ucircumflex /udieresis /yacute /thorn
/ydieresis
] def
%%EndResource
%FOPBeginFontReencode
/Courier-Oblique findfont
dup length dict begin
  {1 index /FID ne {def} {pop pop} ifelse} forall
  /Encoding WinAnsiEncoding def
  currentdict
end
/Courier-Oblique exch definefont pop
/Courier-BoldOblique findfont
dup length dict begin
  {1 index /FID ne {def} {pop pop} ifelse} forall
  /Encoding WinAnsiEncoding def
  currentdict
end
/Courier-BoldOblique exch definefont pop
/Courier-Bold findfont
dup length dict begin
  {1 index /FID ne {def} {pop pop} ifelse} forall
  /Encoding WinAnsiEncoding def
  currentdict
end
/Courier-Bold exch definefont pop
/Helvetica findfont
dup length dict begin
  {1 index /FID ne {def} {pop pop} ifelse} forall
  /Encoding WinAnsiEncoding def
  currentdict
end
/Helvetica exch definefont pop
/Helvetica-Oblique findfont
dup length dict begin
  {1 index /FID ne {def} {pop pop} ifelse} forall
  /Encoding WinAnsiEncoding def
  currentdict
end
/Helvetica-Oblique exch definefont pop
/Helvetica-Bold findfont
dup length dict begin
  {1 index /FID ne {def} {pop pop} ifelse} forall
  /Encoding WinAnsiEncoding def
  currentdict
end
/Helvetica-Bold exch definefont pop
/Helvetica-BoldOblique findfont
dup length dict begin
  {1 index /FID ne {def} {pop pop} ifelse} forall
  /Encoding WinAnsiEncoding def
  currentdict
end
/Helvetica-BoldOblique exch definefont pop
/Times-Roman findfont
dup length dict begin
  {1 index /FID ne {def} {pop pop} ifelse} forall
  /Encoding WinAnsiEncoding def
  currentdict
end
/Times-Roman exch definefont pop
/Times-Italic findfont
dup length dict begin
  {1 index /FID ne {def} {pop pop} ifelse} forall
  /Encoding WinAnsiEncoding def
  currentdict
end
/Times-Italic exch definefont pop
/Times-Bold findfont
dup length dict begin
  {1 index /FID ne {def} {pop pop} ifelse} forall
  /Encoding WinAnsiEncoding def
  currentdict
end
/Times-Bold exch definefont pop
/Times-BoldItalic findfont
dup length dict begin
  {1 index /FID ne {def} {pop pop} ifelse} forall
  /Encoding WinAnsiEncoding def
  currentdict
end
/Times-BoldItalic exch definefont pop
/Courier findfont
dup length dict begin
  {1 index /FID ne {def} {pop pop} ifelse} forall
  /Encoding WinAnsiEncoding def
  currentdict
end
/Courier exch definefont pop
%FOPEndFontReencode
%%EndProlog
%%Page: 1 1
%%PageBoundingBox: 0 0 1024 288
%%BeginPageSetup
[1 0 0 -1 0 288] CT
%%EndPageSetup
GS
1 GC
N
0 0 1024 288 re
f
GR
GS
1 GC
N
0 0 1024 288 re
f
GR
GS
1 GC
N
142 228.5 M
351.5 228.5 L
351.5 32 L
142 32 L
cp
f
GR
GS
0.149 GC
2 setlinecap
1 LJ
0.5 LW
N
142 228.5 M
351.5 228.5 L
S
GR
GS
0.149 GC
2 setlinecap
1 LJ
0.5 LW
N
204.85 228.5 M
204.85 226.405 L
S
GR
GS
0.149 GC
2 setlinecap
1 LJ
0.5 LW
N
288.65 228.5 M
288.65 226.405 L
S
GR
GS
[1 0 0 1 204.85001 234.89999] CT
0.149 GC
/Helvetica 22 F
GS
[1 0 0 1 0 0] CT
-14.5 21 moveto 
1 -1 scale
(YA) t 
GR
GR
GS
[1 0 0 1 288.64999 234.89999] CT
0.149 GC
/Helvetica 22 F
GS
[1 0 0 1 0 0] CT
-15.5 21 moveto 
1 -1 scale
(OA) t 
GR
GR
GS
[1 0 0 1 246.75011 261.89999] CT
0.149 GC
/Helvetica 22 F
GS
[1 0 0 1 0 0] CT
-53.5 21 moveto 
1 -1 scale
(Age Group) t 
GR
GR
GS
0.149 GC
2 setlinecap
1 LJ
0.5 LW
N
142 228.5 M
142 32 L
S
GR
GS
0.149 GC
2 setlinecap
1 LJ
0.5 LW
N
142 228.5 M
144.095 228.5 L
S
GR
GS
0.149 GC
2 setlinecap
1 LJ
0.5 LW
N
142 179.625 M
144.095 179.625 L
S
GR
GS
0.149 GC
2 setlinecap
1 LJ
0.5 LW
N
142 130.75 M
144.095 130.75 L
S
GR
GS
0.149 GC
2 setlinecap
1 LJ
0.5 LW
N
142 81.875 M
144.095 81.875 L
S
GR
GS
0.149 GC
2 setlinecap
1 LJ
0.5 LW
N
142 33 M
144.095 33 L
S
GR
GS
[1 0 0 1 135.60001 228.5] CT
0.149 GC
/Helvetica 22 F
GS
[1 0 0 1 0 0] CT
-13 8 moveto 
1 -1 scale
(0) t 
GR
GR
GS
[1 0 0 1 135.60001 179.62494] CT
0.149 GC
/Helvetica 22 F
GS
[1 0 0 1 0 0] CT
-13 8 moveto 
1 -1 scale
(1) t 
GR
GR
GS
[1 0 0 1 135.60001 130.74988] CT
0.149 GC
/Helvetica 22 F
GS
[1 0 0 1 0 0] CT
-13 8 moveto 
1 -1 scale
(2) t 
GR
GR
GS
[1 0 0 1 135.60001 81.87482] CT
0.149 GC
/Helvetica 22 F
GS
[1 0 0 1 0 0] CT
-13 8 moveto 
1 -1 scale
(3) t 
GR
GR
GS
[1 0 0 1 135.60001 32.99976] CT
0.149 GC
/Helvetica 22 F
GS
[1 0 0 1 0 0] CT
-13 8 moveto 
1 -1 scale
(4) t 
GR
GR
GS
[0 -1 1 0 120.1 130.24991] CT
0.149 GC
/Helvetica 22 F
GS
[1 0 0 1 0 0] CT
-36 -5 moveto 
1 -1 scale
(Drift L1) t 
GR
GR
GS
[1 0 0 1 246.75024 29.25001] CT
/Helvetica-Bold 22 F
GS
[1 0 0 1 0 0] CT
-76.5 -5 moveto 
1 -1 scale
(p = 1.1102e-16) t 
GR
GR
GS
0.149 GC
1 LJ
0.5 LW
N
142 228.5 M
351.5 228.5 L
S
GR
GS
0.6 0.902 1 RC
N
238.37 228.5 M
238.37 103.024 L
171.33 103.024 L
171.33 228.5 L
cp
f
GR
GS
[1 0 0 1 191.79088 73.48334] CT
0.302 GC
N
2.236 0 M
2.236 -1.235 1.235 -2.236 0 -2.236 C
-1.235 -2.236 -2.236 -1.235 -2.236 0 C
-2.236 1.235 -1.235 2.236 0 2.236 C
1.235 2.236 2.236 1.235 2.236 0 C
cp
f
GR
GS
[1 0 0 1 195.35202 123.42849] CT
0.302 GC
N
/f-1586420743{2.236 0 M
2.236 -1.235 1.235 -2.236 0 -2.236 C
-1.235 -2.236 -2.236 -1.235 -2.236 0 C
-2.236 1.235 -1.235 2.236 0 2.236 C
1.235 2.236 2.236 1.235 2.236 0 C
cp}def
f-1586420743
f
GR
GS
[1 0 0 1 215.27541 89.50713] CT
0.302 GC
N
f-1586420743
f
GR
GS
[1 0 0 1 192.73795 115.56554] CT
0.302 GC
N
f-1586420743
f
GR
GS
[1 0 0 1 217.65126 156.34883] CT
0.302 GC
N
f-1586420743
f
GR
GS
[1 0 0 1 219.04759 162.82309] CT
0.302 GC
N
f-1586420743
f
GR
GS
[1 0 0 1 188.51756 90.996] CT
0.302 GC
N
f-1586420743
f
GR
GS
[1 0 0 1 200.73238 95.00527] CT
0.302 GC
N
f-1586420743
f
GR
GS
[1 0 0 1 193.71504 62.42713] CT
0.302 GC
N
f-1586420743
f
GR
GS
[1 0 0 1 206.19826 153.83318] CT
0.302 GC
N
f-1586420743
f
GR
GS
[1 0 0 1 191.49773 149.06235] CT
0.302 GC
N
f-1586420743
f
GR
GS
[1 0 0 1 189.40625 124.97035] CT
0.302 GC
N
f-1586420743
f
GR
GS
[1 0 0 1 219.37184 90.68282] CT
0.302 GC
N
f-1586420743
f
GR
GS
[1 0 0 1 220.65776 97.28906] CT
0.302 GC
N
f-1586420743
f
GR
GS
[1 0 0 1 200.18831 136.10968] CT
0.302 GC
N
f-1586420743
f
GR
GS
[1 0 0 1 209.68376 141.16286] CT
0.302 GC
N
f-1586420743
f
GR
GS
[1 0 0 1 190.36758 83.97963] CT
0.302 GC
N
f-1586420743
f
GR
GS
[1 0 0 1 195.05922 136.65063] CT
0.302 GC
N
f-1586420743
f
GR
GS
[1 0 0 1 189.41753 121.41039] CT
0.302 GC
N
f-1586420743
f
GR
GS
[1 0 0 1 203.82292 156.35905] CT
0.302 GC
N
f-1586420743
f
GR
GS
[1 0 0 1 193.12125 203.68677] CT
0.302 GC
N
f-1586420743
f
GR
GS
[1 0 0 1 221.3186 128.50557] CT
0.302 GC
N
f-1586420743
f
GR
GS
[1 0 0 1 202.40514 83.74171] CT
0.302 GC
N
f-1586420743
f
GR
GS
[1 0 0 1 212.36676 99.40118] CT
0.302 GC
N
f-1586420743
f
GR
GS
[1 0 0 1 207.56149 96.43543] CT
0.302 GC
N
f-1586420743
f
GR
GS
[1 0 0 1 206.19945 131.51134] CT
0.302 GC
N
f-1586420743
f
GR
GS
[1 0 0 1 211.73639 73.10093] CT
0.302 GC
N
f-1586420743
f
GR
GS
[1 0 0 1 188.25858 84.87053] CT
0.302 GC
N
f-1586420743
f
GR
GS
[1 0 0 1 214.31993 95.08656] CT
0.302 GC
N
f-1586420743
f
GR
GS
[1 0 0 1 219.15833 166.82011] CT
0.302 GC
N
f-1586420743
f
GR
GS
[1 0 0 1 188.36807 83.90247] CT
0.302 GC
N
f-1586420743
f
GR
GS
[1 0 0 1 215.73154 39.0779] CT
0.302 GC
N
f-1586420743
f
GR
GS
[1 0 0 1 213.8111 101.48679] CT
0.302 GC
N
f-1586420743
f
GR
GS
[1 0 0 1 221.51404 125.62082] CT
0.302 GC
N
f-1586420743
f
GR
GS
[1 0 0 1 195.72093 39.98749] CT
0.302 GC
N
f-1586420743
f
GR
GS
[1 0 0 1 218.91306 37.66177] CT
0.302 GC
N
f-1586420743
f
GR
GS
[1 0 0 1 209.60982 113.32392] CT
0.302 GC
N
f-1586420743
f
GR
GS
[1 0 0 1 191.62033 92.67877] CT
0.302 GC
N
f-1586420743
f
GR
GS
[1 0 0 1 197.07875 32] CT
0.302 GC
N
f-1586420743
f
GR
GS
[1 0 0 1 213.69405 33.22935] CT
0.302 GC
N
f-1586420743
f
GR
GS
[1 0 0 1 215.0907 44.71952] CT
0.302 GC
N
f-1586420743
f
GR
GS
[1 0 0 1 191.58456 84.82448] CT
0.302 GC
N
f-1586420743
f
GR
GS
[1 0 0 1 195.43295 32.93987] CT
0.302 GC
N
f-1586420743
f
GR
GS
[1 0 0 1 219.01917 130.45758] CT
0.302 GC
N
f-1586420743
f
GR
GS
[1 0 0 1 198.82721 62.34036] CT
0.302 GC
N
f-1586420743
f
GR
GS
[1 0 0 1 216.83487 152.36656] CT
0.302 GC
N
f-1586420743
f
GR
GS
[1 0 0 1 196.80006 77.03892] CT
0.302 GC
N
f-1586420743
f
GR
GS
[1 0 0 1 217.52267 126.69162] CT
0.302 GC
N
f-1586420743
f
GR
GS
[1 0 0 1 194.40073 113.56186] CT
0.302 GC
N
f-1586420743
f
GR
GS
0.6 0.902 1 RC
N
/f-1333042418{322.17 228.5 M
322.17 167.463 L
255.13 167.463 L
255.13 228.5 L
cp}def
f-1333042418
f
GR
GS
[1 0 0 1 297.33817 172.47879] CT
0.302 GC
N
f-1586420743
f
GR
GS
[1 0 0 1 272.95224 155.73843] CT
0.302 GC
N
f-1586420743
f
GR
GS
[1 0 0 1 293.4212 144.91888] CT
0.302 GC
N
f-1586420743
f
GR
GS
[1 0 0 1 290.89151 221.938] CT
0.302 GC
N
f-1586420743
f
GR
GS
[1 0 0 1 284.50723 146.90497] CT
0.302 GC
N
f-1586420743
f
GR
GS
[1 0 0 1 279.01462 183.08156] CT
0.302 GC
N
f-1586420743
f
GR
GS
[1 0 0 1 298.44312 132.95299] CT
0.302 GC
N
f-1586420743
f
GR
GS
[1 0 0 1 276.76526 172.40755] CT
0.302 GC
N
f-1586420743
f
GR
GS
[1 0 0 1 272.32059 170.52684] CT
0.302 GC
N
f-1586420743
f
GR
GS
[1 0 0 1 278.14523 158.31987] CT
0.302 GC
N
f-1586420743
f
GR
GS
[1 0 0 1 288.15494 159.60396] CT
0.302 GC
N
f-1586420743
f
GR
GS
[1 0 0 1 299.98734 195.39381] CT
0.302 GC
N
f-1586420743
f
GR
GS
[1 0 0 1 276.61823 116.36639] CT
0.302 GC
N
f-1586420743
f
GR
GS
[1 0 0 1 296.4339 149.71181] CT
0.302 GC
N
f-1586420743
f
GR
GS
[1 0 0 1 295.05457 162.10803] CT
0.302 GC
N
f-1586420743
f
GR
GS
[1 0 0 1 273.0462 126.82645] CT
0.302 GC
N
f-1586420743
f
GR
GS
[1 0 0 1 288.27649 142.09177] CT
0.302 GC
N
f-1586420743
f
GR
GS
[1 0 0 1 304.45102 175.28094] CT
0.302 GC
N
f-1586420743
f
GR
GS
[1 0 0 1 296.80252 178.4696] CT
0.302 GC
N
f-1586420743
f
GR
GS
[1 0 0 1 293.29391 211.85762] CT
0.302 GC
N
f-1586420743
f
GR
GS
[1 0 0 1 291.80701 165.7009] CT
0.302 GC
N
f-1586420743
f
GR
GS
[1 0 0 1 288.60382 171.32434] CT
0.302 GC
N
f-1586420743
f
GR
GS
[1 0 0 1 290.92444 179.74666] CT
0.302 GC
N
f-1586420743
f
GR
GS
[1 0 0 1 286.18643 185.90909] CT
0.302 GC
N
f-1586420743
f
GR
GS
[1 0 0 1 274.44556 169.07623] CT
0.302 GC
N
f-1586420743
f
GR
GS
[1 0 0 1 281.63046 147.15213] CT
0.302 GC
N
f-1586420743
f
GR
GS
[1 0 0 1 290.70596 122.0584] CT
0.302 GC
N
f-1586420743
f
GR
GS
[1 0 0 1 293.11932 166.95476] CT
0.302 GC
N
f-1586420743
f
GR
GS
[1 0 0 1 303.0896 159.59782] CT
0.302 GC
N
f-1586420743
f
GR
GS
[1 0 0 1 304.66483 148.23633] CT
0.302 GC
N
f-1586420743
f
GR
GS
[1 0 0 1 275.02734 188.58823] CT
0.302 GC
N
f-1586420743
f
GR
GS
[1 0 0 1 294.07135 131.39885] CT
0.302 GC
N
f-1586420743
f
GR
GS
[1 0 0 1 292.09494 192.03319] CT
0.302 GC
N
f-1586420743
f
GR
GS
[1 0 0 1 287.77237 176.45378] CT
0.302 GC
N
f-1586420743
f
GR
GS
[1 0 0 1 283.8317 172.90234] CT
0.302 GC
N
f-1586420743
f
GR
GS
[1 0 0 1 287.83139 182.19179] CT
0.302 GC
N
f-1586420743
f
GR
GS
[1 0 0 1 294.38266 203.51662] CT
0.302 GC
N
f-1586420743
f
GR
GS
[1 0 0 1 304.05731 181.6581] CT
0.302 GC
N
f-1586420743
f
GR
GS
[1 0 0 1 274.8761 157.08839] CT
0.302 GC
N
f-1586420743
f
GR
GS
[1 0 0 1 298.63034 159.21867] CT
0.302 GC
N
f-1586420743
f
GR
GS
[1 0 0 1 291.69278 218.47311] CT
0.302 GC
N
f-1586420743
f
GR
GS
[1 0 0 1 302.46683 205.63429] CT
0.302 GC
N
f-1586420743
f
GR
GS
[1 0 0 1 275.27985 165.95995] CT
0.302 GC
N
f-1586420743
f
GR
GS
[1 0 0 1 281.72125 166.21849] CT
0.302 GC
N
f-1586420743
f
GR
GS
[1 0 0 1 273.61923 164.97557] CT
0.302 GC
N
f-1586420743
f
GR
GS
[1 0 0 1 288.78839 173.12886] CT
0.302 GC
N
f-1586420743
f
GR
GS
[1 0 0 1 297.64597 172.51529] CT
0.302 GC
N
f-1586420743
f
GR
GS
[1 0 0 1 281.37567 168.91879] CT
0.302 GC
N
f-1586420743
f
GR
GS
[1 0 0 1 279.44406 149.78535] CT
0.302 GC
N
f-1586420743
f
GR
GS
[1 0 0 1 282.99484 157.53746] CT
0.302 GC
N
f-1586420743
f
GR
GS
[1 0 0 1 287.08298 126.24748] CT
0.302 GC
N
f-1586420743
f
GR
GS
[1 0 0 1 302.24179 183.28113] CT
0.302 GC
N
f-1586420743
f
GR
GS
[1 0 0 1 304.24545 185.07286] CT
0.302 GC
N
f-1586420743
f
GR
GS
1 GC
N
/f2074849970{429.5 228.5 M
639 228.5 L
639 32 L
429.5 32 L
cp}def
f2074849970
f
GR
GS
0.149 GC
2 setlinecap
1 LJ
0.5 LW
N
429.5 228.5 M
639 228.5 L
S
GR
GS
0.149 GC
2 setlinecap
1 LJ
0.5 LW
N
492.35 228.5 M
492.35 226.405 L
S
GR
GS
0.149 GC
2 setlinecap
1 LJ
0.5 LW
N
576.15 228.5 M
576.15 226.405 L
S
GR
GS
[1 0 0 1 492.35001 234.89999] CT
0.149 GC
/Helvetica 22 F
GS
[1 0 0 1 0 0] CT
-14.5 21 moveto 
1 -1 scale
(YA) t 
GR
GR
GS
[1 0 0 1 576.15002 234.89999] CT
0.149 GC
/Helvetica 22 F
GS
[1 0 0 1 0 0] CT
-15.5 21 moveto 
1 -1 scale
(OA) t 
GR
GR
GS
[1 0 0 1 534.25012 261.89999] CT
0.149 GC
/Helvetica 22 F
GS
[1 0 0 1 0 0] CT
-53.5 21 moveto 
1 -1 scale
(Age Group) t 
GR
GR
GS
0.149 GC
2 setlinecap
1 LJ
0.5 LW
N
429.5 228.5 M
429.5 32 L
S
GR
GS
0.149 GC
2 setlinecap
1 LJ
0.5 LW
N
429.5 228.5 M
431.595 228.5 L
S
GR
GS
0.149 GC
2 setlinecap
1 LJ
0.5 LW
N
429.5 179.375 M
431.595 179.375 L
S
GR
GS
0.149 GC
2 setlinecap
1 LJ
0.5 LW
N
429.5 130.25 M
431.595 130.25 L
S
GR
GS
0.149 GC
2 setlinecap
1 LJ
0.5 LW
N
429.5 81.125 M
431.595 81.125 L
S
GR
GS
0.149 GC
2 setlinecap
1 LJ
0.5 LW
N
429.5 32 M
431.595 32 L
S
GR
GS
[1 0 0 1 423.10001 228.5] CT
0.149 GC
/Helvetica 22 F
GS
[1 0 0 1 0 0] CT
-13 8 moveto 
1 -1 scale
(0) t 
GR
GR
GS
[1 0 0 1 423.10001 179.375] CT
0.149 GC
/Helvetica 22 F
GS
[1 0 0 1 0 0] CT
-31 8 moveto 
1 -1 scale
(0.5) t 
GR
GR
GS
[1 0 0 1 423.10001 130.25] CT
0.149 GC
/Helvetica 22 F
GS
[1 0 0 1 0 0] CT
-13 8 moveto 
1 -1 scale
(1) t 
GR
GR
GS
[1 0 0 1 423.10001 81.125] CT
0.149 GC
/Helvetica 22 F
GS
[1 0 0 1 0 0] CT
-31 8 moveto 
1 -1 scale
(1.5) t 
GR
GR
GS
[1 0 0 1 423.10001 32] CT
0.149 GC
/Helvetica 22 F
GS
[1 0 0 1 0 0] CT
-13 8 moveto 
1 -1 scale
(2) t 
GR
GR
GS
[0 -1 1 0 389.10001 130.24991] CT
0.149 GC
/Helvetica 22 F
GS
[1 0 0 1 0 0] CT
-64.5 -5 moveto 
1 -1 scale
(Threshold L1) t 
GR
GR
GS
[1 0 0 1 534.25049 29.25] CT
/Helvetica-Bold 22 F
GS
[1 0 0 1 0 0] CT
-59.5 -5 moveto 
1 -1 scale
(p = 0.53807) t 
GR
GR
GS
0.149 GC
1 LJ
0.5 LW
N
429.5 228.5 M
639 228.5 L
S
GR
GS
1 0.6 0.6 RC
N
/f600508174{525.87 228.5 M
525.87 100.255 L
458.83 100.255 L
458.83 228.5 L
cp}def
f600508174
f
GR
GS
[1 0 0 1 496.64954 98.71817] CT
0.302 GC
N
f-1586420743
f
GR
GS
[1 0 0 1 480.01569 116.9506] CT
0.302 GC
N
f-1586420743
f
GR
GS
[1 0 0 1 496.31549 108.22488] CT
0.302 GC
N
f-1586420743
f
GR
GS
[1 0 0 1 488.42883 105.91174] CT
0.302 GC
N
f-1586420743
f
GR
GS
[1 0 0 1 508.81482 112.38151] CT
0.302 GC
N
f-1586420743
f
GR
GS
[1 0 0 1 485.20444 84.34355] CT
0.302 GC
N
f-1586420743
f
GR
GS
[1 0 0 1 499.26154 117.56281] CT
0.302 GC
N
f-1586420743
f
GR
GS
[1 0 0 1 493.53009 83.04736] CT
0.302 GC
N
f-1586420743
f
GR
GS
[1 0 0 1 482.06644 105.19619] CT
0.302 GC
N
f-1586420743
f
GR
GS
[1 0 0 1 498.69986 78.90049] CT
0.302 GC
N
f-1586420743
f
GR
GS
[1 0 0 1 477.28125 116.07149] CT
0.302 GC
N
f-1586420743
f
GR
GS
[1 0 0 1 481.77222 94.72653] CT
0.302 GC
N
f-1586420743
f
GR
GS
[1 0 0 1 477.12048 90.2549] CT
0.302 GC
N
f-1586420743
f
GR
GS
[1 0 0 1 505.25659 95.10955] CT
0.302 GC
N
f-1586420743
f
GR
GS
[1 0 0 1 503.7399 91.08964] CT
0.302 GC
N
f-1586420743
f
GR
GS
[1 0 0 1 479.55057 86.44172] CT
0.302 GC
N
f-1586420743
f
GR
GS
[1 0 0 1 489.34711 94.0106] CT
0.302 GC
N
f-1586420743
f
GR
GS
[1 0 0 1 479.62006 90.39739] CT
0.302 GC
N
f-1586420743
f
GR
GS
[1 0 0 1 494.76654 97.76572] CT
0.302 GC
N
f-1586420743
f
GR
GS
[1 0 0 1 507.41354 100.20947] CT
0.302 GC
N
f-1586420743
f
GR
GS
[1 0 0 1 484.18402 97.57245] CT
0.302 GC
N
f-1586420743
f
GR
GS
[1 0 0 1 508.77029 70.28561] CT
0.302 GC
N
f-1586420743
f
GR
GS
[1 0 0 1 487.31555 72.85629] CT
0.302 GC
N
f-1586420743
f
GR
GS
[1 0 0 1 497.90854 115.79385] CT
0.302 GC
N
f-1586420743
f
GR
GS
[1 0 0 1 508.21652 100.07402] CT
0.302 GC
N
f-1586420743
f
GR
GS
[1 0 0 1 496.46289 111.89253] CT
0.302 GC
N
f-1586420743
f
GR
GS
[1 0 0 1 477.71979 105.69722] CT
0.302 GC
N
f-1586420743
f
GR
GS
[1 0 0 1 488.11005 110.28555] CT
0.302 GC
N
f-1586420743
f
GR
GS
[1 0 0 1 481.16275 82.4167] CT
0.302 GC
N
f-1586420743
f
GR
GS
[1 0 0 1 483.34244 58.67097] CT
0.302 GC
N
f-1586420743
f
GR
GS
[1 0 0 1 477.34003 140.79979] CT
0.302 GC
N
f-1586420743
f
GR
GS
[1 0 0 1 505.81686 113.1851] CT
0.302 GC
N
f-1586420743
f
GR
GS
[1 0 0 1 502.18115 136.99615] CT
0.302 GC
N
f-1586420743
f
GR
GS
[1 0 0 1 488.09344 117.29957] CT
0.302 GC
N
f-1586420743
f
GR
GS
[1 0 0 1 503.48047 101.15169] CT
0.302 GC
N
f-1586420743
f
GR
GS
[1 0 0 1 500.85852 73.44591] CT
0.302 GC
N
f-1586420743
f
GR
GS
[1 0 0 1 496.43484 101.06465] CT
0.302 GC
N
f-1586420743
f
GR
GS
[1 0 0 1 488.79999 87.05868] CT
0.302 GC
N
f-1586420743
f
GR
GS
[1 0 0 1 487.633 99.06128] CT
0.302 GC
N
f-1586420743
f
GR
GS
[1 0 0 1 478.56833 80.7824] CT
0.302 GC
N
f-1586420743
f
GR
GS
[1 0 0 1 487.043 72.69225] CT
0.302 GC
N
f-1586420743
f
GR
GS
[1 0 0 1 493.98145 124.78689] CT
0.302 GC
N
f-1586420743
f
GR
GS
[1 0 0 1 497.22556 98.94633] CT
0.302 GC
N
f-1586420743
f
GR
GS
[1 0 0 1 492.80322 118.58711] CT
0.302 GC
N
f-1586420743
f
GR
GS
[1 0 0 1 502.88959 118.85228] CT
0.302 GC
N
f-1586420743
f
GR
GS
[1 0 0 1 478.84756 93.81619] CT
0.302 GC
N
f-1586420743
f
GR
GS
[1 0 0 1 491.13367 109.88178] CT
0.302 GC
N
f-1586420743
f
GR
GS
[1 0 0 1 495.36069 124.5604] CT
0.302 GC
N
f-1586420743
f
GR
GS
[1 0 0 1 481.86401 106.65849] CT
0.302 GC
N
f-1586420743
f
GR
GS
1 0.6 0.6 RC
N
/f1964311326{609.67 228.5 M
609.67 97.691 L
542.63 97.691 L
542.63 228.5 L
cp}def
f1964311326
f
GR
GS
[1 0 0 1 579.88177 122.17148] CT
0.302 GC
N
f-1586420743
f
GR
GS
[1 0 0 1 561.1311 60.7463] CT
0.302 GC
N
f-1586420743
f
GR
GS
[1 0 0 1 578.68835 110.68488] CT
0.302 GC
N
f-1586420743
f
GR
GS
[1 0 0 1 587.62537 76.15708] CT
0.302 GC
N
f-1586420743
f
GR
GS
[1 0 0 1 576.14081 75.46116] CT
0.302 GC
N
f-1586420743
f
GR
GS
[1 0 0 1 574.10608 91.21376] CT
0.302 GC
N
f-1586420743
f
GR
GS
[1 0 0 1 564.38641 81.46] CT
0.302 GC
N
f-1586420743
f
GR
GS
[1 0 0 1 560.33795 95.94281] CT
0.302 GC
N
f-1586420743
f
GR
GS
[1 0 0 1 586.0755 79.40918] CT
0.302 GC
N
f-1586420743
f
GR
GS
[1 0 0 1 569.22998 92.72615] CT
0.302 GC
N
f-1586420743
f
GR
GS
[1 0 0 1 563.25171 70.12886] CT
0.302 GC
N
f-1586420743
f
GR
GS
[1 0 0 1 571.96307 70.30261] CT
0.302 GC
N
f-1586420743
f
GR
GS
[1 0 0 1 587.1745 126.23431] CT
0.302 GC
N
f-1586420743
f
GR
GS
[1 0 0 1 587.60632 95.99754] CT
0.302 GC
N
f-1586420743
f
GR
GS
[1 0 0 1 581.68878 88.66277] CT
0.302 GC
N
f-1586420743
f
GR
GS
[1 0 0 1 591.57391 86.19226] CT
0.302 GC
N
f-1586420743
f
GR
GS
[1 0 0 1 591.0033 104.49024] CT
0.302 GC
N
f-1586420743
f
GR
GS
[1 0 0 1 563.16766 96.86402] CT
0.302 GC
N
f-1586420743
f
GR
GS
[1 0 0 1 575.50653 165.99025] CT
0.302 GC
N
f-1586420743
f
GR
GS
[1 0 0 1 561.61975 102.85789] CT
0.302 GC
N
f-1586420743
f
GR
GS
[1 0 0 1 589.48328 82.71641] CT
0.302 GC
N
f-1586420743
f
GR
GS
[1 0 0 1 576.05713 99.62467] CT
0.302 GC
N
f-1586420743
f
GR
GS
[1 0 0 1 585.24408 116.01559] CT
0.302 GC
N
f-1586420743
f
GR
GS
[1 0 0 1 561.41333 104.57988] CT
0.302 GC
N
f-1586420743
f
GR
GS
[1 0 0 1 568.18756 82.85123] CT
0.302 GC
N
f-1586420743
f
GR
GS
[1 0 0 1 581.21387 147.45166] CT
0.302 GC
N
f-1586420743
f
GR
GS
[1 0 0 1 563.86841 115.14831] CT
0.302 GC
N
f-1586420743
f
GR
GS
[1 0 0 1 580.79407 65.76077] CT
0.302 GC
N
f-1586420743
f
GR
GS
[1 0 0 1 572.29327 105.57914] CT
0.302 GC
N
f-1586420743
f
GR
GS
[1 0 0 1 585.05621 95.22256] CT
0.302 GC
N
f-1586420743
f
GR
GS
[1 0 0 1 581.27576 100.10636] CT
0.302 GC
N
f-1586420743
f
GR
GS
[1 0 0 1 572.17749 99.58511] CT
0.302 GC
N
f-1586420743
f
GR
GS
[1 0 0 1 569.44666 113.74477] CT
0.302 GC
N
f-1586420743
f
GR
GS
[1 0 0 1 570.7915 108.73489] CT
0.302 GC
N
f-1586420743
f
GR
GS
[1 0 0 1 590.19244 69.80487] CT
0.302 GC
N
f-1586420743
f
GR
GS
[1 0 0 1 574.68408 122.35664] CT
0.302 GC
N
f-1586420743
f
GR
GS
[1 0 0 1 574.22247 52.03678] CT
0.302 GC
N
f-1586420743
f
GR
GS
[1 0 0 1 574.61432 95.73917] CT
0.302 GC
N
f-1586420743
f
GR
GS
[1 0 0 1 591.07587 67.09981] CT
0.302 GC
N
f-1586420743
f
GR
GS
[1 0 0 1 566.73486 103.22179] CT
0.302 GC
N
f-1586420743
f
GR
GS
[1 0 0 1 588.96814 119.52698] CT
0.302 GC
N
f-1586420743
f
GR
GS
[1 0 0 1 560.05621 132.72012] CT
0.302 GC
N
f-1586420743
f
GR
GS
[1 0 0 1 570.84595 125.68857] CT
0.302 GC
N
f-1586420743
f
GR
GS
[1 0 0 1 585.06726 75.54253] CT
0.302 GC
N
f-1586420743
f
GR
GS
[1 0 0 1 570.8808 101.67335] CT
0.302 GC
N
f-1586420743
f
GR
GS
[1 0 0 1 580.13239 77.91467] CT
0.302 GC
N
f-1586420743
f
GR
GS
[1 0 0 1 574.57526 147.95087] CT
0.302 GC
N
f-1586420743
f
GR
GS
[1 0 0 1 559.73065 51.49179] CT
0.302 GC
N
f-1586420743
f
GR
GS
[1 0 0 1 579.47119 105.98217] CT
0.302 GC
N
f-1586420743
f
GR
GS
[1 0 0 1 579.55457 85.91208] CT
0.302 GC
N
f-1586420743
f
GR
GS
[1 0 0 1 581.15845 91.56513] CT
0.302 GC
N
f-1586420743
f
GR
GS
[1 0 0 1 589.14917 98.97584] CT
0.302 GC
N
f-1586420743
f
GR
GS
[1 0 0 1 561.23553 121.58043] CT
0.302 GC
N
f-1586420743
f
GR
GS
1 GC
N
/f1706994306{717 228.5 M
926.5 228.5 L
926.5 32 L
717 32 L
cp}def
f1706994306
f
GR
GS
0.149 GC
2 setlinecap
1 LJ
0.5 LW
N
717 228.5 M
926.5 228.5 L
S
GR
GS
0.149 GC
2 setlinecap
1 LJ
0.5 LW
N
779.85 228.5 M
779.85 226.405 L
S
GR
GS
0.149 GC
2 setlinecap
1 LJ
0.5 LW
N
863.65 228.5 M
863.65 226.405 L
S
GR
GS
[1 0 0 1 779.84998 234.89999] CT
0.149 GC
/Helvetica 22 F
GS
[1 0 0 1 0 0] CT
-14.5 21 moveto 
1 -1 scale
(YA) t 
GR
GR
GS
[1 0 0 1 863.65002 234.89999] CT
0.149 GC
/Helvetica 22 F
GS
[1 0 0 1 0 0] CT
-15.5 21 moveto 
1 -1 scale
(OA) t 
GR
GR
GS
[1 0 0 1 821.75012 261.89999] CT
0.149 GC
/Helvetica 22 F
GS
[1 0 0 1 0 0] CT
-53.5 21 moveto 
1 -1 scale
(Age Group) t 
GR
GR
GS
0.149 GC
2 setlinecap
1 LJ
0.5 LW
N
717 228.5 M
717 32 L
S
GR
GS
0.149 GC
2 setlinecap
1 LJ
0.5 LW
N
717 228.5 M
719.095 228.5 L
S
GR
GS
0.149 GC
2 setlinecap
1 LJ
0.5 LW
N
717 179.879 M
719.095 179.879 L
S
GR
GS
0.149 GC
2 setlinecap
1 LJ
0.5 LW
N
717 131.258 M
719.095 131.258 L
S
GR
GS
0.149 GC
2 setlinecap
1 LJ
0.5 LW
N
717 82.638 M
719.095 82.638 L
S
GR
GS
0.149 GC
2 setlinecap
1 LJ
0.5 LW
N
717 34.017 M
719.095 34.017 L
S
GR
GS
[1 0 0 1 710.59998 228.5] CT
0.149 GC
/Helvetica 22 F
GS
[1 0 0 1 0 0] CT
-13 8 moveto 
1 -1 scale
(0) t 
GR
GR
GS
[1 0 0 1 710.59998 179.87923] CT
0.149 GC
/Helvetica 22 F
GS
[1 0 0 1 0 0] CT
-31 8 moveto 
1 -1 scale
(0.1) t 
GR
GR
GS
[1 0 0 1 710.59998 131.25847] CT
0.149 GC
/Helvetica 22 F
GS
[1 0 0 1 0 0] CT
-31 8 moveto 
1 -1 scale
(0.2) t 
GR
GR
GS
[1 0 0 1 710.59998 82.6377] CT
0.149 GC
/Helvetica 22 F
GS
[1 0 0 1 0 0] CT
-31 8 moveto 
1 -1 scale
(0.3) t 
GR
GR
GS
[1 0 0 1 710.59998 34.01693] CT
0.149 GC
/Helvetica 22 F
GS
[1 0 0 1 0 0] CT
-31 8 moveto 
1 -1 scale
(0.4) t 
GR
GR
GS
[0 -1 1 0 676.59998 130.24991] CT
0.149 GC
/Helvetica 22 F
GS
[1 0 0 1 0 0] CT
-37.5 -5 moveto 
1 -1 scale
(NDT L1) t 
GR
GR
GS
[1 0 0 1 821.75079 29.24999] CT
/Helvetica-Bold 22 F
GS
[1 0 0 1 0 0] CT
-70 -5 moveto 
1 -1 scale
(p = 1.343e-11) t 
GR
GR
GS
0.149 GC
1 LJ
0.5 LW
N
717 228.5 M
926.5 228.5 L
S
GR
GS
1 0.6 0.6 RC
N
/f-794814322{813.37 228.5 M
813.37 115.967 L
746.33 115.967 L
746.33 228.5 L
cp}def
f-794814322
f
GR
GS
[1 0 0 1 766.38708 120.64832] CT
0.302 GC
N
f-1586420743
f
GR
GS
[1 0 0 1 784.87073 125.54786] CT
0.302 GC
N
f-1586420743
f
GR
GS
[1 0 0 1 788.70166 126.15314] CT
0.302 GC
N
f-1586420743
f
GR
GS
[1 0 0 1 796.20636 130.09415] CT
0.302 GC
N
f-1586420743
f
GR
GS
[1 0 0 1 767.29089 104.92892] CT
0.302 GC
N
f-1586420743
f
GR
GS
[1 0 0 1 775.30725 137.93694] CT
0.302 GC
N
f-1586420743
f
GR
GS
[1 0 0 1 785.7572 106.09447] CT
0.302 GC
N
f-1586420743
f
GR
GS
[1 0 0 1 775.68542 99.67886] CT
0.302 GC
N
f-1586420743
f
GR
GS
[1 0 0 1 792.03314 106.86829] CT
0.302 GC
N
f-1586420743
f
GR
GS
[1 0 0 1 772.87708 125.17181] CT
0.302 GC
N
f-1586420743
f
GR
GS
[1 0 0 1 767.56409 140.43742] CT
0.302 GC
N
f-1586420743
f
GR
GS
[1 0 0 1 785.63727 133.62917] CT
0.302 GC
N
f-1586420743
f
GR
GS
[1 0 0 1 769.88068 114.5126] CT
0.302 GC
N
f-1586420743
f
GR
GS
[1 0 0 1 792.20264 136.76227] CT
0.302 GC
N
f-1586420743
f
GR
GS
[1 0 0 1 788.2688 104.61388] CT
0.302 GC
N
f-1586420743
f
GR
GS
[1 0 0 1 777.14758 131.41008] CT
0.302 GC
N
f-1586420743
f
GR
GS
[1 0 0 1 763.09772 129.90227] CT
0.302 GC
N
f-1586420743
f
GR
GS
[1 0 0 1 768.10004 113.8194] CT
0.302 GC
N
f-1586420743
f
GR
GS
[1 0 0 1 772.26892 111.86865] CT
0.302 GC
N
f-1586420743
f
GR
GS
[1 0 0 1 792.33368 90.15243] CT
0.302 GC
N
f-1586420743
f
GR
GS
[1 0 0 1 783.24396 63.94727] CT
0.302 GC
N
f-1586420743
f
GR
GS
[1 0 0 1 773.85626 108.71071] CT
0.302 GC
N
f-1586420743
f
GR
GS
[1 0 0 1 772.61951 116.56805] CT
0.302 GC
N
f-1586420743
f
GR
GS
[1 0 0 1 793.38403 112.85799] CT
0.302 GC
N
f-1586420743
f
GR
GS
[1 0 0 1 794.09955 98.72859] CT
0.302 GC
N
f-1586420743
f
GR
GS
[1 0 0 1 780.0274 132.4846] CT
0.302 GC
N
f-1586420743
f
GR
GS
[1 0 0 1 784.12653 122.48644] CT
0.302 GC
N
f-1586420743
f
GR
GS
[1 0 0 1 787.19971 137.19736] CT
0.302 GC
N
f-1586420743
f
GR
GS
[1 0 0 1 763.89154 123.75496] CT
0.302 GC
N
f-1586420743
f
GR
GS
[1 0 0 1 782.36176 99.09366] CT
0.302 GC
N
f-1586420743
f
GR
GS
[1 0 0 1 764.64984 117.08035] CT
0.302 GC
N
f-1586420743
f
GR
GS
[1 0 0 1 777.25323 111.57615] CT
0.302 GC
N
f-1586420743
f
GR
GS
[1 0 0 1 778.76843 108.29015] CT
0.302 GC
N
f-1586420743
f
GR
GS
[1 0 0 1 763.84851 103.00948] CT
0.302 GC
N
f-1586420743
f
GR
GS
[1 0 0 1 765.2713 117.55264] CT
0.302 GC
N
f-1586420743
f
GR
GS
[1 0 0 1 794.06104 122.08531] CT
0.302 GC
N
f-1586420743
f
GR
GS
[1 0 0 1 780.99445 73.40736] CT
0.302 GC
N
f-1586420743
f
GR
GS
[1 0 0 1 775.38501 126.45631] CT
0.302 GC
N
f-1586420743
f
GR
GS
[1 0 0 1 775.28949 126.32805] CT
0.302 GC
N
f-1586420743
f
GR
GS
[1 0 0 1 768.16406 136.39256] CT
0.302 GC
N
f-1586420743
f
GR
GS
[1 0 0 1 768.10486 121.07189] CT
0.302 GC
N
f-1586420743
f
GR
GS
[1 0 0 1 774.84888 103.30423] CT
0.302 GC
N
f-1586420743
f
GR
GS
[1 0 0 1 789.37061 112.56306] CT
0.302 GC
N
f-1586420743
f
GR
GS
[1 0 0 1 779.40552 122.89452] CT
0.302 GC
N
f-1586420743
f
GR
GS
[1 0 0 1 778.67004 122.73872] CT
0.302 GC
N
f-1586420743
f
GR
GS
[1 0 0 1 767.48956 135.86893] CT
0.302 GC
N
f-1586420743
f
GR
GS
[1 0 0 1 792.80182 120.86565] CT
0.302 GC
N
f-1586420743
f
GR
GS
[1 0 0 1 785.70117 101.19237] CT
0.302 GC
N
f-1586420743
f
GR
GS
[1 0 0 1 791.08453 93.63555] CT
0.302 GC
N
f-1586420743
f
GR
GS
1 0.6 0.6 RC
N
/f-1924974118{897.17 228.5 M
897.17 87.372 L
830.13 87.372 L
830.13 228.5 L
cp}def
f-1924974118
f
GR
GS
[1 0 0 1 868.89545 97.96465] CT
0.302 GC
N
f-1586420743
f
GR
GS
[1 0 0 1 879.87091 121.00353] CT
0.302 GC
N
f-1586420743
f
GR
GS
[1 0 0 1 879.73254 82.78967] CT
0.302 GC
N
f-1586420743
f
GR
GS
[1 0 0 1 855.27515 75.25298] CT
0.302 GC
N
f-1586420743
f
GR
GS
[1 0 0 1 867.82562 107.35968] CT
0.302 GC
N
f-1586420743
f
GR
GS
[1 0 0 1 871.30066 115.58288] CT
0.302 GC
N
f-1586420743
f
GR
GS
[1 0 0 1 863.58868 37.57682] CT
0.302 GC
N
f-1586420743
f
GR
GS
[1 0 0 1 875.37622 49.93113] CT
0.302 GC
N
f-1586420743
f
GR
GS
[1 0 0 1 851.05133 104.99512] CT
0.302 GC
N
f-1586420743
f
GR
GS
[1 0 0 1 846.98352 61.19115] CT
0.302 GC
N
f-1586420743
f
GR
GS
[1 0 0 1 852.01697 84.00413] CT
0.302 GC
N
f-1586420743
f
GR
GS
[1 0 0 1 864.79504 66.73701] CT
0.302 GC
N
f-1586420743
f
GR
GS
[1 0 0 1 864.00641 106.33626] CT
0.302 GC
N
f-1586420743
f
GR
GS
[1 0 0 1 859.80243 85.17503] CT
0.302 GC
N
f-1586420743
f
GR
GS
[1 0 0 1 857.30121 75.67735] CT
0.302 GC
N
f-1586420743
f
GR
GS
[1 0 0 1 847.00916 58.04288] CT
0.302 GC
N
f-1586420743
f
GR
GS
[1 0 0 1 874.21692 90.50086] CT
0.302 GC
N
f-1586420743
f
GR
GS
[1 0 0 1 868.28979 78.787] CT
0.302 GC
N
f-1586420743
f
GR
GS
[1 0 0 1 855.07178 108.20322] CT
0.302 GC
N
f-1586420743
f
GR
GS
[1 0 0 1 873.81946 71.92329] CT
0.302 GC
N
f-1586420743
f
GR
GS
[1 0 0 1 874.50952 73.53674] CT
0.302 GC
N
f-1586420743
f
GR
GS
[1 0 0 1 875.45544 101.70403] CT
0.302 GC
N
f-1586420743
f
GR
GS
[1 0 0 1 862.55231 75.60138] CT
0.302 GC
N
f-1586420743
f
GR
GS
[1 0 0 1 879.42786 53.35881] CT
0.302 GC
N
f-1586420743
f
GR
GS
[1 0 0 1 875.0885 86.03402] CT
0.302 GC
N
f-1586420743
f
GR
GS
[1 0 0 1 849.52295 103.92648] CT
0.302 GC
N
f-1586420743
f
GR
GS
[1 0 0 1 854.85431 112.43214] CT
0.302 GC
N
f-1586420743
f
GR
GS
[1 0 0 1 874.29498 77.83783] CT
0.302 GC
N
f-1586420743
f
GR
GS
[1 0 0 1 860.49341 76.0493] CT
0.302 GC
N
f-1586420743
f
GR
GS
[1 0 0 1 862.52081 86.67149] CT
0.302 GC
N
f-1586420743
f
GR
GS
[1 0 0 1 878.78552 89.36269] CT
0.302 GC
N
f-1586420743
f
GR
GS
[1 0 0 1 879.23694 105.21572] CT
0.302 GC
N
f-1586420743
f
GR
GS
[1 0 0 1 872.54236 88.69102] CT
0.302 GC
N
f-1586420743
f
GR
GS
[1 0 0 1 866.14838 87.13612] CT
0.302 GC
N
f-1586420743
f
GR
GS
[1 0 0 1 877.5918 109.13707] CT
0.302 GC
N
f-1586420743
f
GR
GS
[1 0 0 1 863.49689 72.10755] CT
0.302 GC
N
f-1586420743
f
GR
GS
[1 0 0 1 852.45471 111.54951] CT
0.302 GC
N
f-1586420743
f
GR
GS
[1 0 0 1 857.81744 106.57282] CT
0.302 GC
N
f-1586420743
f
GR
GS
[1 0 0 1 856.82654 118.35684] CT
0.302 GC
N
f-1586420743
f
GR
GS
[1 0 0 1 865.60419 105.05378] CT
0.302 GC
N
f-1586420743
f
GR
GS
[1 0 0 1 849.15179 64.32314] CT
0.302 GC
N
f-1586420743
f
GR
GS
[1 0 0 1 849.20215 63.83464] CT
0.302 GC
N
f-1586420743
f
GR
GS
[1 0 0 1 852.48065 102.94251] CT
0.302 GC
N
f-1586420743
f
GR
GS
[1 0 0 1 878.64813 32] CT
0.302 GC
N
f-1586420743
f
GR
GS
[1 0 0 1 874.0777 110.58813] CT
0.302 GC
N
f-1586420743
f
GR
GS
[1 0 0 1 870.70447 66.37187] CT
0.302 GC
N
f-1586420743
f
GR
GS
[1 0 0 1 879.41266 106.8164] CT
0.302 GC
N
f-1586420743
f
GR
GS
[1 0 0 1 880.35724 93.34923] CT
0.302 GC
N
f-1586420743
f
GR
GS
[1 0 0 1 879.9895 99.81718] CT
0.302 GC
N
f-1586420743
f
GR
GS
[1 0 0 1 851.9209 75.62816] CT
0.302 GC
N
f-1586420743
f
GR
GS
[1 0 0 1 879.01819 118.78025] CT
0.302 GC
N
f-1586420743
f
GR
GS
[1 0 0 1 876.89612 86.73656] CT
0.302 GC
N
f-1586420743
f
GR
GS
[1 0 0 1 874.87146 90.14136] CT
0.302 GC
N
f-1586420743
f
GR
%%Trailer
%%Pages: 1
%%EOF
