%!PS-Adobe-3.0 EPSF-3.0
%%Creator: (MATLAB, The Mathworks, Inc. Version 9.8.0.1323502 \(R2020a\). Operating System: Mac OS X)
%%Title: /Users/kosciessa/Volumes/mntTardisLNDG/LNDG/stateswitch/stsw_beh_task/hddm/figures/Z_PPC_YA_vat.eps
%%CreationDate: 2022-02-07T12:54:10
%%Pages: (atend)
%%BoundingBox:    13    32   465   545
%%LanguageLevel: 3
%%EndComments
%%BeginProlog
%%BeginResource: procset (Apache XML Graphics Std ProcSet) 1.2 0
%%Version: 1.2 0
%%Copyright: (Copyright 2001-2003,2010 The Apache Software Foundation. License terms: http://www.apache.org/licenses/LICENSE-2.0)
/bd{bind def}bind def
/ld{load def}bd
/GR/grestore ld
/GS/gsave ld
/RM/rmoveto ld
/C/curveto ld
/t/show ld
/L/lineto ld
/ML/setmiterlimit ld
/CT/concat ld
/f/fill ld
/N/newpath ld
/S/stroke ld
/CC/setcmykcolor ld
/A/ashow ld
/cp/closepath ld
/RC/setrgbcolor ld
/LJ/setlinejoin ld
/GC/setgray ld
/LW/setlinewidth ld
/M/moveto ld
/re {4 2 roll M
1 index 0 rlineto
0 exch rlineto
neg 0 rlineto
cp } bd
/_ctm matrix def
/_tm matrix def
/BT { _ctm currentmatrix pop matrix _tm copy pop 0 0 moveto } bd
/ET { _ctm setmatrix } bd
/iTm { _ctm setmatrix _tm concat } bd
/Tm { _tm astore pop iTm 0 0 moveto } bd
/ux 0.0 def
/uy 0.0 def
/F {
  /Tp exch def
  /Tf exch def
  Tf findfont Tp scalefont setfont
  /cf Tf def  /cs Tp def
} bd
/ULS {currentpoint /uy exch def /ux exch def} bd
/ULE {
  /Tcx currentpoint pop def
  gsave
  newpath
  cf findfont cs scalefont dup
  /FontMatrix get 0 get /Ts exch def /FontInfo get dup
  /UnderlinePosition get Ts mul /To exch def
  /UnderlineThickness get Ts mul /Tt exch def
  ux uy To add moveto  Tcx uy To add lineto
  Tt setlinewidth stroke
  grestore
} bd
/OLE {
  /Tcx currentpoint pop def
  gsave
  newpath
  cf findfont cs scalefont dup
  /FontMatrix get 0 get /Ts exch def /FontInfo get dup
  /UnderlinePosition get Ts mul /To exch def
  /UnderlineThickness get Ts mul /Tt exch def
  ux uy To add cs add moveto Tcx uy To add cs add lineto
  Tt setlinewidth stroke
  grestore
} bd
/SOE {
  /Tcx currentpoint pop def
  gsave
  newpath
  cf findfont cs scalefont dup
  /FontMatrix get 0 get /Ts exch def /FontInfo get dup
  /UnderlinePosition get Ts mul /To exch def
  /UnderlineThickness get Ts mul /Tt exch def
  ux uy To add cs 10 mul 26 idiv add moveto Tcx uy To add cs 10 mul 26 idiv add lineto
  Tt setlinewidth stroke
  grestore
} bd
/QT {
/Y22 exch store
/X22 exch store
/Y21 exch store
/X21 exch store
currentpoint
/Y21 load 2 mul add 3 div exch
/X21 load 2 mul add 3 div exch
/X21 load 2 mul /X22 load add 3 div
/Y21 load 2 mul /Y22 load add 3 div
/X22 load /Y22 load curveto
} bd
/SSPD {
dup length /d exch dict def
{
/v exch def
/k exch def
currentpagedevice k known {
/cpdv currentpagedevice k get def
v cpdv ne {
/upd false def
/nullv v type /nulltype eq def
/nullcpdv cpdv type /nulltype eq def
nullv nullcpdv or
{
/upd true def
} {
/sametype v type cpdv type eq def
sametype {
v type /arraytype eq {
/vlen v length def
/cpdvlen cpdv length def
vlen cpdvlen eq {
0 1 vlen 1 sub {
/i exch def
/obj v i get def
/cpdobj cpdv i get def
obj cpdobj ne {
/upd true def
exit
} if
} for
} {
/upd true def
} ifelse
} {
v type /dicttype eq {
v {
/dv exch def
/dk exch def
/cpddv cpdv dk get def
dv cpddv ne {
/upd true def
exit
} if
} forall
} {
/upd true def
} ifelse
} ifelse
} if
} ifelse
upd true eq {
d k v put
} if
} if
} if
} forall
d length 0 gt {
d setpagedevice
} if
} bd
/RE { % /NewFontName [NewEncodingArray] /FontName RE -
  findfont dup length dict begin
  {
    1 index /FID ne
    {def} {pop pop} ifelse
  } forall
  /Encoding exch def
  /FontName 1 index def
  currentdict definefont pop
  end
} bind def
%%EndResource
%%BeginResource: procset (Apache XML Graphics EPS ProcSet) 1.0 0
%%Version: 1.0 0
%%Copyright: (Copyright 2002-2003 The Apache Software Foundation. License terms: http://www.apache.org/licenses/LICENSE-2.0)
/BeginEPSF { %def
/b4_Inc_state save def         % Save state for cleanup
/dict_count countdictstack def % Count objects on dict stack
/op_count count 1 sub def      % Count objects on operand stack
userdict begin                 % Push userdict on dict stack
/showpage { } def              % Redefine showpage, { } = null proc
0 setgray 0 setlinecap         % Prepare graphics state
1 setlinewidth 0 setlinejoin
10 setmiterlimit [ ] 0 setdash newpath
/languagelevel where           % If level not equal to 1 then
{pop languagelevel             % set strokeadjust and
1 ne                           % overprint to their defaults.
{false setstrokeadjust false setoverprint
} if
} if
} bd
/EndEPSF { %def
count op_count sub {pop} repeat            % Clean up stacks
countdictstack dict_count sub {end} repeat
b4_Inc_state restore
} bd
%%EndResource
%FOPBeginFontDict
%%IncludeResource: font Courier-Oblique
%%IncludeResource: font Courier-BoldOblique
%%IncludeResource: font Courier-Bold
%%IncludeResource: font ZapfDingbats
%%IncludeResource: font Symbol
%%IncludeResource: font Helvetica
%%IncludeResource: font Helvetica-Oblique
%%IncludeResource: font Helvetica-Bold
%%IncludeResource: font Helvetica-BoldOblique
%%IncludeResource: font Times-Roman
%%IncludeResource: font Times-Italic
%%IncludeResource: font Times-Bold
%%IncludeResource: font Times-BoldItalic
%%IncludeResource: font Courier
%FOPEndFontDict
%%BeginResource: encoding WinAnsiEncoding
/WinAnsiEncoding [
/.notdef /.notdef /.notdef /.notdef /.notdef
/.notdef /.notdef /.notdef /.notdef /.notdef
/.notdef /.notdef /.notdef /.notdef /.notdef
/.notdef /.notdef /.notdef /.notdef /.notdef
/.notdef /.notdef /.notdef /.notdef /.notdef
/.notdef /.notdef /.notdef /.notdef /.notdef
/.notdef /.notdef /space /exclam /quotedbl
/numbersign /dollar /percent /ampersand /quotesingle
/parenleft /parenright /asterisk /plus /comma
/hyphen /period /slash /zero /one
/two /three /four /five /six
/seven /eight /nine /colon /semicolon
/less /equal /greater /question /at
/A /B /C /D /E
/F /G /H /I /J
/K /L /M /N /O
/P /Q /R /S /T
/U /V /W /X /Y
/Z /bracketleft /backslash /bracketright /asciicircum
/underscore /quoteleft /a /b /c
/d /e /f /g /h
/i /j /k /l /m
/n /o /p /q /r
/s /t /u /v /w
/x /y /z /braceleft /bar
/braceright /asciitilde /bullet /Euro /bullet
/quotesinglbase /florin /quotedblbase /ellipsis /dagger
/daggerdbl /circumflex /perthousand /Scaron /guilsinglleft
/OE /bullet /Zcaron /bullet /bullet
/quoteleft /quoteright /quotedblleft /quotedblright /bullet
/endash /emdash /asciitilde /trademark /scaron
/guilsinglright /oe /bullet /zcaron /Ydieresis
/space /exclamdown /cent /sterling /currency
/yen /brokenbar /section /dieresis /copyright
/ordfeminine /guillemotleft /logicalnot /sfthyphen /registered
/macron /degree /plusminus /twosuperior /threesuperior
/acute /mu /paragraph /middot /cedilla
/onesuperior /ordmasculine /guillemotright /onequarter /onehalf
/threequarters /questiondown /Agrave /Aacute /Acircumflex
/Atilde /Adieresis /Aring /AE /Ccedilla
/Egrave /Eacute /Ecircumflex /Edieresis /Igrave
/Iacute /Icircumflex /Idieresis /Eth /Ntilde
/Ograve /Oacute /Ocircumflex /Otilde /Odieresis
/multiply /Oslash /Ugrave /Uacute /Ucircumflex
/Udieresis /Yacute /Thorn /germandbls /agrave
/aacute /acircumflex /atilde /adieresis /aring
/ae /ccedilla /egrave /eacute /ecircumflex
/edieresis /igrave /iacute /icircumflex /idieresis
/eth /ntilde /ograve /oacute /ocircumflex
/otilde /odieresis /divide /oslash /ugrave
/uacute /ucircumflex /udieresis /yacute /thorn
/ydieresis
] def
%%EndResource
%FOPBeginFontReencode
/Courier-Oblique findfont
dup length dict begin
  {1 index /FID ne {def} {pop pop} ifelse} forall
  /Encoding WinAnsiEncoding def
  currentdict
end
/Courier-Oblique exch definefont pop
/Courier-BoldOblique findfont
dup length dict begin
  {1 index /FID ne {def} {pop pop} ifelse} forall
  /Encoding WinAnsiEncoding def
  currentdict
end
/Courier-BoldOblique exch definefont pop
/Courier-Bold findfont
dup length dict begin
  {1 index /FID ne {def} {pop pop} ifelse} forall
  /Encoding WinAnsiEncoding def
  currentdict
end
/Courier-Bold exch definefont pop
/Helvetica findfont
dup length dict begin
  {1 index /FID ne {def} {pop pop} ifelse} forall
  /Encoding WinAnsiEncoding def
  currentdict
end
/Helvetica exch definefont pop
/Helvetica-Oblique findfont
dup length dict begin
  {1 index /FID ne {def} {pop pop} ifelse} forall
  /Encoding WinAnsiEncoding def
  currentdict
end
/Helvetica-Oblique exch definefont pop
/Helvetica-Bold findfont
dup length dict begin
  {1 index /FID ne {def} {pop pop} ifelse} forall
  /Encoding WinAnsiEncoding def
  currentdict
end
/Helvetica-Bold exch definefont pop
/Helvetica-BoldOblique findfont
dup length dict begin
  {1 index /FID ne {def} {pop pop} ifelse} forall
  /Encoding WinAnsiEncoding def
  currentdict
end
/Helvetica-BoldOblique exch definefont pop
/Times-Roman findfont
dup length dict begin
  {1 index /FID ne {def} {pop pop} ifelse} forall
  /Encoding WinAnsiEncoding def
  currentdict
end
/Times-Roman exch definefont pop
/Times-Italic findfont
dup length dict begin
  {1 index /FID ne {def} {pop pop} ifelse} forall
  /Encoding WinAnsiEncoding def
  currentdict
end
/Times-Italic exch definefont pop
/Times-Bold findfont
dup length dict begin
  {1 index /FID ne {def} {pop pop} ifelse} forall
  /Encoding WinAnsiEncoding def
  currentdict
end
/Times-Bold exch definefont pop
/Times-BoldItalic findfont
dup length dict begin
  {1 index /FID ne {def} {pop pop} ifelse} forall
  /Encoding WinAnsiEncoding def
  currentdict
end
/Times-BoldItalic exch definefont pop
/Courier findfont
dup length dict begin
  {1 index /FID ne {def} {pop pop} ifelse} forall
  /Encoding WinAnsiEncoding def
  currentdict
end
/Courier exch definefont pop
%FOPEndFontReencode
%%EndProlog
%%Page: 1 1
%%PageBoundingBox: 0 0 512 576
%%BeginPageSetup
[1 0 0 -1 0 576] CT
%%EndPageSetup
GS
1 GC
N
0 0 512 576 re
f
GR
GS
1 GC
N
0 0 512 576 re
f
GR
GS
1 GC
N
80 154.5 M
238 154.5 L
238 49.5 L
80 49.5 L
cp
f
GR
GS
0.149 GC
2 setlinecap
1 LJ
0.5 LW
N
80 154.5 M
238 154.5 L
S
GR
GS
0.149 GC
2 setlinecap
1 LJ
0.5 LW
N
95.8 154.5 M
95.8 152.92 L
S
GR
GS
0.149 GC
2 setlinecap
1 LJ
0.5 LW
N
159 154.5 M
159 152.92 L
S
GR
GS
0.149 GC
2 setlinecap
1 LJ
0.5 LW
N
222.2 154.5 M
222.2 152.92 L
S
GR
GS
[1 0 0 1 95.8 159.7] CT
0.149 GC
/Helvetica 16 F
GS
[1 0 0 1 0 0] CT
-8 16 moveto 
1 -1 scale
(-2) t 
GR
GR
GS
[1 0 0 1 159 159.7] CT
0.149 GC
/Helvetica 16 F
GS
[1 0 0 1 0 0] CT
-4.5 16 moveto 
1 -1 scale
(0) t 
GR
GR
GS
[1 0 0 1 222.2 159.7] CT
0.149 GC
/Helvetica 16 F
GS
[1 0 0 1 0 0] CT
-4.5 16 moveto 
1 -1 scale
(2) t 
GR
GR
GS
[1 0 0 1 159.00008 179.7] CT
0.149 GC
/Helvetica 16 F
GS
[1 0 0 1 0 0] CT
-23.5 16 moveto 
1 -1 scale
(RT bin) t 
GR
GR
GS
0.149 GC
2 setlinecap
1 LJ
0.5 LW
N
80 154.5 M
80 49.5 L
S
GR
GS
0.149 GC
2 setlinecap
1 LJ
0.5 LW
N
80 154.5 M
81.58 154.5 L
S
GR
GS
0.149 GC
2 setlinecap
1 LJ
0.5 LW
N
80 102 M
81.58 102 L
S
GR
GS
0.149 GC
2 setlinecap
1 LJ
0.5 LW
N
80 49.5 M
81.58 49.5 L
S
GR
GS
[1 0 0 1 74.8 154.5] CT
0.149 GC
/Helvetica 16 F
GS
[1 0 0 1 0 0] CT
-9 6 moveto 
1 -1 scale
(0) t 
GR
GR
GS
[1 0 0 1 74.8 102] CT
0.149 GC
/Helvetica 16 F
GS
[1 0 0 1 0 0] CT
-23 6 moveto 
1 -1 scale
(0.1) t 
GR
GR
GS
[1 0 0 1 74.8 49.5] CT
0.149 GC
/Helvetica 16 F
GS
[1 0 0 1 0 0] CT
-23 6 moveto 
1 -1 scale
(0.2) t 
GR
GR
GS
[0 -1 1 0 49.3 101.99995] CT
0.149 GC
/Helvetica 16 F
GS
[1 0 0 1 0 0] CT
-38.5 -24 moveto 
1 -1 scale
(Probability) t 
GR
GR
GS
[0 -1 1 0 49.3 101.99995] CT
0.149 GC
/Helvetica 16 F
GS
[1 0 0 1 0 0] CT
-26 -4 moveto 
1 -1 scale
(density) t 
GR
GR
GS
[1 0 0 1 159.00015 47.5] CT
/Helvetica-Bold 16 F
GS
[1 0 0 1 0 0] CT
-63.5 -4 moveto 
1 -1 scale
(Model-based RT) t 
GR
GR
GS
0 0.447 0.741 RC
1 LJ
2 LW
N
81.596 154.497 M
83.192 154.497 L
84.788 154.5 L
86.384 154.497 L
87.98 154.497 L
89.576 154.497 L
91.172 154.493 L
92.768 154.498 L
94.364 154.492 L
95.96 154.492 L
97.556 154.487 L
99.152 154.492 L
100.747 154.492 L
102.343 154.488 L
103.939 154.492 L
105.535 154.48 L
107.131 154.473 L
108.727 154.475 L
110.323 154.476 L
111.919 154.468 L
113.515 154.456 L
115.111 154.45 L
116.707 154.407 L
118.303 154.415 L
119.899 154.409 L
121.495 154.342 L
123.091 154.365 L
124.687 154.339 L
126.283 154.253 L
127.879 154.247 L
129.475 154.151 L
131.071 154.094 L
132.667 154.03 L
134.263 153.835 L
135.859 153.648 L
137.455 153.362 L
139.051 152.952 L
140.646 152.568 L
142.242 151.831 L
143.838 150.564 L
145.434 148.906 L
147.03 146.468 L
148.626 143.198 L
150.222 140.442 L
151.818 147.91 L
153.414 154.468 L
155.01 154.5 L
156.606 154.5 L
158.202 154.5 L
159.798 154.5 L
161.394 154.5 L
162.99 154.5 L
164.586 154.5 L
166.182 154.239 L
167.778 110.29 L
169.374 50.024 L
170.97 69.32 L
172.566 94.615 L
174.162 113.415 L
175.758 126.627 L
177.354 134.842 L
178.949 140.151 L
180.545 144.055 L
182.141 146.945 L
183.737 148.719 L
185.333 150.008 L
186.929 151.095 L
188.525 151.714 L
190.121 152.478 L
191.717 152.784 L
193.313 153.196 L
194.909 153.433 L
196.505 153.614 L
198.101 153.811 L
199.697 153.966 L
201.293 154.017 L
202.889 154.068 L
204.485 154.161 L
206.081 154.232 L
207.677 154.295 L
209.273 154.312 L
210.869 154.376 L
212.465 154.35 L
214.061 154.423 L
215.657 154.42 L
217.253 154.436 L
218.848 154.446 L
220.444 154.431 L
222.04 154.458 L
223.636 154.475 L
225.232 154.469 L
226.828 154.475 L
228.424 154.473 L
230.02 154.483 L
231.616 154.486 L
233.212 154.488 L
234.808 154.485 L
236.404 154.493 L
238 154.492 L
S
GR
GS
0.851 0.325 0.098 RC
1 LJ
2 LW
N
81.596 154.48 M
83.192 154.48 L
84.788 154.446 L
86.384 154.449 L
87.98 154.458 L
89.576 154.463 L
91.172 154.434 L
92.768 154.429 L
94.364 154.399 L
95.96 154.393 L
97.556 154.4 L
99.152 154.362 L
100.747 154.354 L
102.343 154.336 L
103.939 154.308 L
105.535 154.247 L
107.131 154.208 L
108.727 154.215 L
110.323 154.171 L
111.919 154.166 L
113.515 154.102 L
115.111 153.968 L
116.707 153.9 L
118.303 153.855 L
119.899 153.657 L
121.495 153.609 L
123.091 153.428 L
124.687 153.371 L
126.283 153.042 L
127.879 152.808 L
129.475 152.544 L
131.071 152.312 L
132.667 151.768 L
134.263 151.35 L
135.859 150.656 L
137.455 150.36 L
139.051 149.43 L
140.646 148.972 L
142.242 148.186 L
143.838 148.069 L
145.434 148.26 L
147.03 148.525 L
148.626 149.392 L
150.222 150.987 L
151.818 153.455 L
153.414 154.478 L
155.01 154.5 L
156.606 154.5 L
158.202 154.5 L
159.798 154.5 L
161.394 154.5 L
162.99 154.5 L
164.586 154.498 L
166.182 154.343 L
167.778 148.44 L
169.374 136.397 L
170.97 126.054 L
172.566 117.99 L
174.162 114.304 L
175.758 114.663 L
177.354 117.686 L
178.949 122.405 L
180.545 126.156 L
182.141 130.189 L
183.737 134.307 L
185.333 137.002 L
186.929 139.738 L
188.525 142.246 L
190.121 144.004 L
191.717 145.557 L
193.313 147.04 L
194.909 147.921 L
196.505 149.21 L
198.101 149.857 L
199.697 150.538 L
201.293 150.979 L
202.889 151.593 L
204.485 151.999 L
206.081 152.331 L
207.677 152.591 L
209.273 152.875 L
210.869 153.095 L
212.465 153.338 L
214.061 153.449 L
215.657 153.652 L
217.253 153.724 L
218.848 153.84 L
220.444 153.912 L
222.04 153.974 L
223.636 154.103 L
225.232 154.041 L
226.828 154.179 L
228.424 154.229 L
230.02 154.245 L
231.616 154.232 L
233.212 154.325 L
234.808 154.333 L
236.404 154.366 L
238 154.358 L
S
GR
GS
0.929 0.694 0.125 RC
1 LJ
2 LW
N
81.596 154.433 M
83.192 154.417 L
84.788 154.4 L
86.384 154.399 L
87.98 154.382 L
89.576 154.377 L
91.172 154.366 L
92.768 154.37 L
94.364 154.316 L
95.96 154.301 L
97.556 154.262 L
99.152 154.243 L
100.747 154.156 L
102.343 154.167 L
103.939 154.076 L
105.535 154.05 L
107.131 153.954 L
108.727 153.953 L
110.323 153.866 L
111.919 153.794 L
113.515 153.656 L
115.111 153.65 L
116.707 153.528 L
118.303 153.344 L
119.899 153.125 L
121.495 152.877 L
123.091 152.713 L
124.687 152.451 L
126.283 152.072 L
127.879 151.689 L
129.475 151.424 L
131.071 150.831 L
132.667 150.242 L
134.263 149.751 L
135.859 149.085 L
137.455 148.272 L
139.051 147.493 L
140.646 146.796 L
142.242 147.003 L
143.838 147.748 L
145.434 149.104 L
147.03 151.246 L
148.626 152.817 L
150.222 153.626 L
151.818 154.294 L
153.414 154.5 L
155.01 154.5 L
156.606 154.5 L
158.202 154.5 L
159.798 154.5 L
161.394 154.5 L
162.99 154.5 L
164.586 154.5 L
166.182 154.493 L
167.778 153.989 L
169.374 151.813 L
170.97 148.258 L
172.566 139.681 L
174.162 130.02 L
175.758 122.437 L
177.354 118.348 L
178.949 117.979 L
180.545 120.751 L
182.141 124.791 L
183.737 128.433 L
185.333 132.024 L
186.929 134.409 L
188.525 137.923 L
190.121 139.91 L
191.717 141.828 L
193.313 143.879 L
194.909 144.905 L
196.505 146.31 L
198.101 147.602 L
199.697 148.232 L
201.293 149.258 L
202.889 149.765 L
204.485 150.369 L
206.081 150.929 L
207.677 151.502 L
209.273 151.768 L
210.869 152.18 L
212.465 152.325 L
214.061 152.745 L
215.657 152.903 L
217.253 153.165 L
218.848 153.359 L
220.444 153.489 L
222.04 153.541 L
223.636 153.672 L
225.232 153.727 L
226.828 153.873 L
228.424 153.941 L
230.02 153.997 L
231.616 154.027 L
233.212 154.118 L
234.808 154.159 L
236.404 154.196 L
238 154.201 L
S
GR
GS
0.494 0.184 0.557 RC
1 LJ
2 LW
N
81.596 154.441 M
83.192 154.427 L
84.788 154.405 L
86.384 154.375 L
87.98 154.336 L
89.576 154.343 L
91.172 154.34 L
92.768 154.301 L
94.364 154.306 L
95.96 154.311 L
97.556 154.245 L
99.152 154.218 L
100.747 154.167 L
102.343 154.14 L
103.939 154.091 L
105.535 154.02 L
107.131 153.942 L
108.727 153.907 L
110.323 153.751 L
111.919 153.662 L
113.515 153.55 L
115.111 153.393 L
116.707 153.254 L
118.303 153.077 L
119.899 152.757 L
121.495 152.647 L
123.091 152.332 L
124.687 151.973 L
126.283 151.662 L
127.879 151.172 L
129.475 150.629 L
131.071 149.974 L
132.667 149.255 L
134.263 148.489 L
135.859 147.413 L
137.455 146.573 L
139.051 145.802 L
140.646 145.277 L
142.242 146.177 L
143.838 147.865 L
145.434 149.779 L
147.03 151.784 L
148.626 153.118 L
150.222 153.627 L
151.818 154.178 L
153.414 154.498 L
155.01 154.5 L
156.606 154.5 L
158.202 154.5 L
159.798 154.5 L
161.394 154.5 L
162.99 154.5 L
164.586 154.5 L
166.182 154.5 L
167.778 153.908 L
169.374 152.606 L
170.97 150.57 L
172.566 145.974 L
174.162 138.415 L
175.758 129.344 L
177.354 121.017 L
178.949 118.153 L
180.545 119.69 L
182.141 123.18 L
183.737 126.991 L
185.333 130.706 L
186.929 134.205 L
188.525 136.726 L
190.121 138.967 L
191.717 140.967 L
193.313 143.106 L
194.909 144.328 L
196.505 145.986 L
198.101 146.835 L
199.697 147.879 L
201.293 148.889 L
202.889 149.601 L
204.485 150.278 L
206.081 150.702 L
207.677 151.118 L
209.273 151.515 L
210.869 152.122 L
212.465 152.369 L
214.061 152.679 L
215.657 152.806 L
217.253 153 L
218.848 153.189 L
220.444 153.344 L
222.04 153.57 L
223.636 153.602 L
225.232 153.75 L
226.828 153.812 L
228.424 153.86 L
230.02 154.006 L
231.616 154.078 L
233.212 154.11 L
234.808 154.15 L
236.404 154.184 L
238 154.184 L
S
GR
GS
1 GC
N
305.5 154.5 M
463.5 154.5 L
463.5 49.5 L
305.5 49.5 L
cp
f
GR
GS
0.149 GC
2 setlinecap
1 LJ
0.5 LW
N
305.5 154.5 M
463.5 154.5 L
S
GR
GS
0.149 GC
2 setlinecap
1 LJ
0.5 LW
N
321.3 154.5 M
321.3 152.92 L
S
GR
GS
0.149 GC
2 setlinecap
1 LJ
0.5 LW
N
384.5 154.5 M
384.5 152.92 L
S
GR
GS
0.149 GC
2 setlinecap
1 LJ
0.5 LW
N
447.7 154.5 M
447.7 152.92 L
S
GR
GS
[1 0 0 1 321.29999 159.7] CT
0.149 GC
/Helvetica 16 F
GS
[1 0 0 1 0 0] CT
-8 16 moveto 
1 -1 scale
(-2) t 
GR
GR
GS
[1 0 0 1 384.5 159.7] CT
0.149 GC
/Helvetica 16 F
GS
[1 0 0 1 0 0] CT
-4.5 16 moveto 
1 -1 scale
(0) t 
GR
GR
GS
[1 0 0 1 447.70001 159.7] CT
0.149 GC
/Helvetica 16 F
GS
[1 0 0 1 0 0] CT
-4.5 16 moveto 
1 -1 scale
(2) t 
GR
GR
GS
[1 0 0 1 384.50006 179.7] CT
0.149 GC
/Helvetica 16 F
GS
[1 0 0 1 0 0] CT
-23.5 16 moveto 
1 -1 scale
(RT bin) t 
GR
GR
GS
0.149 GC
2 setlinecap
1 LJ
0.5 LW
N
305.5 154.5 M
305.5 49.5 L
S
GR
GS
0.149 GC
2 setlinecap
1 LJ
0.5 LW
N
305.5 154.5 M
307.08 154.5 L
S
GR
GS
0.149 GC
2 setlinecap
1 LJ
0.5 LW
N
305.5 105.359 M
307.08 105.359 L
S
GR
GS
0.149 GC
2 setlinecap
1 LJ
0.5 LW
N
305.5 56.217 M
307.08 56.217 L
S
GR
GS
[1 0 0 1 300.29999 154.5] CT
0.149 GC
/Helvetica 16 F
GS
[1 0 0 1 0 0] CT
-9 6 moveto 
1 -1 scale
(0) t 
GR
GR
GS
[1 0 0 1 300.29999 105.35858] CT
0.149 GC
/Helvetica 16 F
GS
[1 0 0 1 0 0] CT
-23 6 moveto 
1 -1 scale
(0.1) t 
GR
GR
GS
[1 0 0 1 300.29999 56.21717] CT
0.149 GC
/Helvetica 16 F
GS
[1 0 0 1 0 0] CT
-23 6 moveto 
1 -1 scale
(0.2) t 
GR
GR
GS
[0 -1 1 0 274.79999 101.99995] CT
0.149 GC
/Helvetica 16 F
GS
[1 0 0 1 0 0] CT
-47.5 -4 moveto 
1 -1 scale
(Prob. density) t 
GR
GR
GS
[1 0 0 1 384.50037 47.5] CT
/Helvetica-Bold 16 F
GS
[1 0 0 1 0 0] CT
-49 -4 moveto 
1 -1 scale
(Empirical RT) t 
GR
GR
GS
0 0.447 0.741 RC
1 LJ
2 LW
N
307.096 154.5 M
308.692 154.5 L
310.288 154.5 L
311.884 154.5 L
313.48 154.5 L
315.076 154.5 L
316.672 154.5 L
318.268 154.5 L
319.864 154.5 L
321.46 154.5 L
323.056 154.5 L
324.652 154.323 L
326.247 154.5 L
327.843 154.323 L
329.439 154.323 L
331.035 154.5 L
332.631 154.5 L
334.227 154.5 L
335.823 154.323 L
337.419 154.5 L
339.015 154.5 L
340.611 153.97 L
342.207 154.146 L
343.803 154.323 L
345.399 154.146 L
346.995 154.146 L
348.591 154.146 L
350.187 154.146 L
351.783 154.146 L
353.379 153.793 L
354.975 152.909 L
356.571 153.439 L
358.167 153.263 L
359.763 152.379 L
361.359 153.616 L
362.955 151.672 L
364.551 152.025 L
366.146 149.904 L
367.742 149.551 L
369.338 150.434 L
370.934 149.727 L
372.53 147.076 L
374.126 147.606 L
375.722 146.722 L
377.318 149.374 L
378.914 154.5 L
380.51 154.5 L
382.106 154.5 L
383.702 154.5 L
385.298 154.5 L
386.894 154.5 L
388.49 154.5 L
390.086 154.5 L
391.682 154.5 L
393.278 109.955 L
394.874 49.5 L
396.47 75.308 L
398.066 98.818 L
399.662 118.616 L
401.258 126.04 L
402.854 134.879 L
404.449 139.121 L
406.045 141.242 L
407.641 146.015 L
409.237 149.197 L
410.833 150.258 L
412.429 151.318 L
414.025 152.025 L
415.621 152.556 L
417.217 152.556 L
418.813 153.263 L
420.409 152.909 L
422.005 154.146 L
423.601 154.5 L
425.197 153.793 L
426.793 154.323 L
428.389 154.146 L
429.985 154.5 L
431.581 154.323 L
433.177 154.5 L
434.773 154.5 L
436.369 154.323 L
437.965 154.5 L
439.561 154.5 L
441.157 154.5 L
442.753 154.5 L
444.348 154.5 L
445.944 154.5 L
447.54 154.5 L
449.136 154.5 L
450.732 154.5 L
452.328 154.5 L
453.924 154.5 L
455.52 154.5 L
457.116 154.5 L
458.712 154.5 L
460.308 154.5 L
461.904 154.5 L
463.5 154.5 L
S
GR
GS
0.851 0.325 0.098 RC
1 LJ
2 LW
N
307.096 154.5 M
308.692 154.5 L
310.288 154.5 L
311.884 154.5 L
313.48 154.5 L
315.076 154.5 L
316.672 154.5 L
318.268 154.5 L
319.864 154.5 L
321.46 154.5 L
323.056 154.5 L
324.652 154.5 L
326.247 154.5 L
327.843 154.5 L
329.439 154.334 L
331.035 154.334 L
332.631 154.167 L
334.227 154.167 L
335.823 153.835 L
337.419 154.167 L
339.015 153.835 L
340.611 153.502 L
342.207 152.504 L
343.803 153.668 L
345.399 153.336 L
346.995 153.003 L
348.591 153.336 L
350.187 153.003 L
351.783 152.171 L
353.379 150.84 L
354.975 150.507 L
356.571 150.674 L
358.167 151.173 L
359.763 149.177 L
361.359 149.509 L
362.955 150.507 L
364.551 148.678 L
366.146 148.012 L
367.742 147.18 L
369.338 148.678 L
370.934 150.175 L
372.53 151.506 L
374.126 151.672 L
375.722 152.67 L
377.318 154.001 L
378.914 154.5 L
380.51 154.5 L
382.106 154.5 L
383.702 154.5 L
385.298 154.5 L
386.894 154.5 L
388.49 154.5 L
390.086 154.5 L
391.682 154.5 L
393.278 145.517 L
394.874 137.199 L
396.47 134.205 L
398.066 129.713 L
399.662 116.904 L
401.258 117.569 L
402.854 111.414 L
404.449 118.9 L
406.045 119.732 L
407.641 129.38 L
409.237 135.036 L
410.833 135.203 L
412.429 140.859 L
414.025 142.356 L
415.621 142.19 L
417.217 147.679 L
418.813 147.347 L
420.409 148.178 L
422.005 149.01 L
423.601 150.84 L
425.197 149.177 L
426.793 152.67 L
428.389 152.67 L
429.985 152.836 L
431.581 153.003 L
433.177 152.67 L
434.773 153.336 L
436.369 154.001 L
437.965 153.835 L
439.561 153.668 L
441.157 154.001 L
442.753 154.001 L
444.348 153.835 L
445.944 154.5 L
447.54 153.835 L
449.136 154.5 L
450.732 154.5 L
452.328 154.5 L
453.924 154.5 L
455.52 154.5 L
457.116 154.5 L
458.712 154.5 L
460.308 154.5 L
461.904 154.5 L
463.5 154.5 L
S
GR
GS
0.929 0.694 0.125 RC
1 LJ
2 LW
N
307.096 154.5 M
308.692 154.5 L
310.288 154.5 L
311.884 154.5 L
313.48 154.5 L
315.076 154.5 L
316.672 154.5 L
318.268 154.5 L
319.864 154.5 L
321.46 154.5 L
323.056 154.5 L
324.652 154.335 L
326.247 154.335 L
327.843 154.335 L
329.439 154.004 L
331.035 154.17 L
332.631 152.848 L
334.227 153.674 L
335.823 154.17 L
337.419 152.848 L
339.015 153.509 L
340.611 152.021 L
342.207 152.352 L
343.803 152.187 L
345.399 152.682 L
346.995 151.526 L
348.591 150.865 L
350.187 150.865 L
351.783 150.7 L
353.379 150.039 L
354.975 150.7 L
356.571 150.534 L
358.167 150.204 L
359.763 147.56 L
361.359 148.386 L
362.955 148.221 L
364.551 146.734 L
366.146 149.047 L
367.742 147.56 L
369.338 150.369 L
370.934 151.195 L
372.53 153.013 L
374.126 153.839 L
375.722 154.004 L
377.318 154.335 L
378.914 154.5 L
380.51 154.5 L
382.106 154.5 L
383.702 154.5 L
385.298 154.5 L
386.894 154.5 L
388.49 154.5 L
390.086 154.5 L
391.682 154.5 L
393.278 153.343 L
394.874 151.03 L
396.47 148.717 L
398.066 142.768 L
399.662 135.663 L
401.258 129.384 L
402.854 126.905 L
404.449 115.339 L
406.045 119.305 L
407.641 119.47 L
409.237 128.723 L
410.833 131.697 L
412.429 130.045 L
414.025 135.167 L
415.621 138.307 L
417.217 138.968 L
418.813 142.272 L
420.409 145.247 L
422.005 145.908 L
423.601 146.734 L
425.197 149.212 L
426.793 149.047 L
428.389 152.352 L
429.985 150.7 L
431.581 152.021 L
433.177 151.856 L
434.773 152.682 L
436.369 152.517 L
437.965 153.178 L
439.561 152.021 L
441.157 154.335 L
442.753 154.335 L
444.348 154.17 L
445.944 154.335 L
447.54 154.17 L
449.136 154.5 L
450.732 154.5 L
452.328 154.5 L
453.924 154.5 L
455.52 154.5 L
457.116 154.5 L
458.712 154.5 L
460.308 154.5 L
461.904 154.5 L
463.5 154.5 L
S
GR
GS
0.494 0.184 0.557 RC
1 LJ
2 LW
N
307.096 154.5 M
308.692 154.5 L
310.288 154.5 L
311.884 154.5 L
313.48 154.5 L
315.076 154.5 L
316.672 154.5 L
318.268 154.5 L
319.864 154.5 L
321.46 154.5 L
323.056 154.005 L
324.652 154.17 L
326.247 154.17 L
327.843 154.005 L
329.439 154.005 L
331.035 154.17 L
332.631 153.839 L
334.227 154.335 L
335.823 153.509 L
337.419 153.014 L
339.015 153.179 L
340.611 152.684 L
342.207 152.188 L
343.803 151.363 L
345.399 152.023 L
346.995 151.032 L
348.591 148.555 L
350.187 150.867 L
351.783 148.225 L
353.379 150.372 L
354.975 148.555 L
356.571 149.216 L
358.167 149.546 L
359.763 147.895 L
361.359 145.583 L
362.955 149.876 L
364.551 146.904 L
366.146 147.234 L
367.742 147.565 L
369.338 151.363 L
370.934 152.518 L
372.53 152.518 L
374.126 153.674 L
375.722 153.509 L
377.318 154.335 L
378.914 154.5 L
380.51 154.5 L
382.106 154.5 L
383.702 154.5 L
385.298 154.5 L
386.894 154.5 L
388.49 154.5 L
390.086 154.5 L
391.682 154.5 L
393.278 153.344 L
394.874 153.344 L
396.47 151.693 L
398.066 146.409 L
399.662 142.281 L
401.258 134.52 L
402.854 128.74 L
404.449 119.658 L
406.045 119.658 L
407.641 121.64 L
409.237 127.254 L
410.833 125.438 L
412.429 131.878 L
414.025 131.217 L
415.621 134.52 L
417.217 139.639 L
418.813 141.455 L
420.409 144.097 L
422.005 143.767 L
423.601 146.739 L
425.197 148.555 L
426.793 149.381 L
428.389 150.867 L
429.985 151.032 L
431.581 151.858 L
433.177 152.188 L
434.773 152.849 L
436.369 152.353 L
437.965 153.179 L
439.561 153.014 L
441.157 154.005 L
442.753 154.335 L
444.348 154.005 L
445.944 154.335 L
447.54 154.335 L
449.136 154.5 L
450.732 154.5 L
452.328 154.5 L
453.924 154.5 L
455.52 154.5 L
457.116 154.5 L
458.712 154.5 L
460.308 154.5 L
461.904 154.5 L
463.5 154.5 L
S
GR
GS
1 GC
N
80 327 M
238 327 L
238 222 L
80 222 L
cp
f
GR
GS
0.149 GC
2 setlinecap
1 LJ
0.5 LW
N
80 327 M
238 327 L
S
GR
GS
0.149 GC
2 setlinecap
1 LJ
0.5 LW
N
95.8 327 M
95.8 325.42 L
S
GR
GS
0.149 GC
2 setlinecap
1 LJ
0.5 LW
N
159 327 M
159 325.42 L
S
GR
GS
0.149 GC
2 setlinecap
1 LJ
0.5 LW
N
222.2 327 M
222.2 325.42 L
S
GR
GS
[1 0 0 1 95.8 332.20001] CT
0.149 GC
/Helvetica 16 F
GS
[1 0 0 1 0 0] CT
-8 16 moveto 
1 -1 scale
(-2) t 
GR
GR
GS
[1 0 0 1 159 332.20001] CT
0.149 GC
/Helvetica 16 F
GS
[1 0 0 1 0 0] CT
-4.5 16 moveto 
1 -1 scale
(0) t 
GR
GR
GS
[1 0 0 1 222.2 332.20001] CT
0.149 GC
/Helvetica 16 F
GS
[1 0 0 1 0 0] CT
-4.5 16 moveto 
1 -1 scale
(2) t 
GR
GR
GS
[1 0 0 1 159.00008 352.20001] CT
0.149 GC
/Helvetica 16 F
GS
[1 0 0 1 0 0] CT
-60 16 moveto 
1 -1 scale
(Reaction time \(s\)) t 
GR
GR
GS
0.149 GC
2 setlinecap
1 LJ
0.5 LW
N
80 327 M
80 222 L
S
GR
GS
0.149 GC
2 setlinecap
1 LJ
0.5 LW
N
80 327 M
81.58 327 L
S
GR
GS
0.149 GC
2 setlinecap
1 LJ
0.5 LW
N
80 277.859 M
81.58 277.859 L
S
GR
GS
0.149 GC
2 setlinecap
1 LJ
0.5 LW
N
80 228.717 M
81.58 228.717 L
S
GR
GS
[1 0 0 1 74.8 327] CT
0.149 GC
/Helvetica 16 F
GS
[1 0 0 1 0 0] CT
-9 6 moveto 
1 -1 scale
(0) t 
GR
GR
GS
[1 0 0 1 74.8 277.85858] CT
0.149 GC
/Helvetica 16 F
GS
[1 0 0 1 0 0] CT
-23 6 moveto 
1 -1 scale
(0.1) t 
GR
GR
GS
[1 0 0 1 74.8 228.71716] CT
0.149 GC
/Helvetica 16 F
GS
[1 0 0 1 0 0] CT
-23 6 moveto 
1 -1 scale
(0.2) t 
GR
GR
GS
[0 -1 1 0 49.3 274.49994] CT
0.149 GC
/Helvetica 16 F
GS
[1 0 0 1 0 0] CT
-47.5 -4 moveto 
1 -1 scale
(Prob. density) t 
GR
GR
GS
[1 0 0 1 159.00015 220] CT
/Helvetica-Bold 16 F
GS
[1 0 0 1 0 0] CT
-36 -4 moveto 
1 -1 scale
(1 Targets) t 
GR
GR
GS
0.4 0.668 0.845 RC
N
99.152 327 M
99.152 326.823 L
97.556 326.823 L
97.556 327 L
cp
102.343 326.823 M
100.747 326.823 L
100.747 327 L
102.343 327 L
103.939 327 L
103.939 326.823 L
cp
110.323 327 M
110.323 326.823 L
108.727 326.823 L
108.727 327 L
cp
115.111 327 M
115.111 326.47 L
113.515 326.47 L
113.515 327 L
cp
116.707 327 M
116.707 326.646 L
115.111 326.646 L
115.111 327 L
cp
118.303 327 M
118.303 326.823 L
116.707 326.823 L
116.707 327 L
cp
119.899 326.646 M
118.303 326.646 L
118.303 327 L
119.899 327 L
121.495 327 L
123.091 327 L
124.687 327 L
126.283 327 L
126.283 326.646 L
124.687 326.646 L
123.091 326.646 L
121.495 326.646 L
cp
127.879 327 M
127.879 326.293 L
126.283 326.293 L
126.283 327 L
cp
129.475 327 M
129.475 325.409 L
127.879 325.409 L
127.879 327 L
cp
131.071 327 M
131.071 325.939 L
129.475 325.939 L
129.475 327 L
cp
132.667 327 M
132.667 325.763 L
131.071 325.763 L
131.071 327 L
cp
134.263 327 M
134.263 324.879 L
132.667 324.879 L
132.667 327 L
cp
135.859 327 M
135.859 326.116 L
134.263 326.116 L
134.263 327 L
cp
137.455 327 M
137.455 324.172 L
135.859 324.172 L
135.859 327 L
cp
139.051 327 M
139.051 324.525 L
137.455 324.525 L
137.455 327 L
cp
140.646 327 M
140.646 322.404 L
139.051 322.404 L
139.051 327 L
cp
142.242 327 M
142.242 322.051 L
140.646 322.051 L
140.646 327 L
cp
143.838 327 M
143.838 322.934 L
142.242 322.934 L
142.242 327 L
cp
145.434 327 M
145.434 322.227 L
143.838 322.227 L
143.838 327 L
cp
147.03 327 M
147.03 319.576 L
145.434 319.576 L
145.434 327 L
cp
148.626 327 M
148.626 320.106 L
147.03 320.106 L
147.03 327 L
cp
150.222 327 M
150.222 319.222 L
148.626 319.222 L
148.626 327 L
cp
151.818 327 M
151.818 321.874 L
150.222 321.874 L
150.222 327 L
cp
167.778 327 M
167.778 282.455 L
166.182 282.455 L
166.182 327 L
cp
169.374 327 M
169.374 222 L
167.778 222 L
167.778 327 L
cp
170.97 327 M
170.97 247.808 L
169.374 247.808 L
169.374 327 L
cp
172.566 327 M
172.566 271.318 L
170.97 271.318 L
170.97 327 L
cp
174.162 327 M
174.162 291.116 L
172.566 291.116 L
172.566 327 L
cp
175.758 327 M
175.758 298.54 L
174.162 298.54 L
174.162 327 L
cp
177.354 327 M
177.354 307.379 L
175.758 307.379 L
175.758 327 L
cp
178.949 327 M
178.949 311.621 L
177.354 311.621 L
177.354 327 L
cp
180.545 327 M
180.545 313.742 L
178.949 313.742 L
178.949 327 L
cp
182.141 327 M
182.141 318.515 L
180.545 318.515 L
180.545 327 L
cp
183.737 327 M
183.737 321.697 L
182.141 321.697 L
182.141 327 L
cp
185.333 327 M
185.333 322.758 L
183.737 322.758 L
183.737 327 L
cp
186.929 327 M
186.929 323.818 L
185.333 323.818 L
185.333 327 L
cp
188.525 327 M
188.525 324.525 L
186.929 324.525 L
186.929 327 L
cp
190.121 325.056 M
188.525 325.056 L
188.525 327 L
190.121 327 L
191.717 327 L
191.717 325.056 L
cp
193.313 327 M
193.313 325.763 L
191.717 325.763 L
191.717 327 L
cp
194.909 327 M
194.909 325.409 L
193.313 325.409 L
193.313 327 L
cp
196.505 327 M
196.505 326.646 L
194.909 326.646 L
194.909 327 L
cp
199.697 327 M
199.697 326.293 L
198.101 326.293 L
198.101 327 L
cp
201.293 327 M
201.293 326.823 L
199.697 326.823 L
199.697 327 L
cp
202.889 327 M
202.889 326.646 L
201.293 326.646 L
201.293 327 L
cp
206.081 327 M
206.081 326.823 L
204.485 326.823 L
204.485 327 L
cp
210.869 327 M
210.869 326.823 L
209.273 326.823 L
209.273 327 L
cp
f
GR
GS
2 setlinecap
10.0 ML
0.5 LW
N
80 327 M
80 327 L
81.596 327 L
81.596 327 L
81.596 327 L
S
GR
GS
2 setlinecap
10.0 ML
0.5 LW
N
81.596 327 M
83.192 327 L
83.192 327 L
83.192 327 L
S
GR
GS
2 setlinecap
10.0 ML
0.5 LW
N
83.192 327 M
84.788 327 L
84.788 327 L
84.788 327 L
S
GR
GS
2 setlinecap
10.0 ML
0.5 LW
N
84.788 327 M
86.384 327 L
86.384 327 L
86.384 327 L
S
GR
GS
2 setlinecap
10.0 ML
0.5 LW
N
86.384 327 M
87.98 327 L
87.98 327 L
87.98 327 L
S
GR
GS
2 setlinecap
10.0 ML
0.5 LW
N
87.98 327 M
89.576 327 L
89.576 327 L
89.576 327 L
S
GR
GS
2 setlinecap
10.0 ML
0.5 LW
N
89.576 327 M
91.172 327 L
91.172 327 L
91.172 327 L
S
GR
GS
2 setlinecap
10.0 ML
0.5 LW
N
91.172 327 M
92.768 327 L
92.768 327 L
92.768 327 L
S
GR
GS
2 setlinecap
10.0 ML
0.5 LW
N
92.768 327 M
94.364 327 L
94.364 327 L
94.364 327 L
S
GR
GS
2 setlinecap
10.0 ML
0.5 LW
N
94.364 327 M
95.96 327 L
95.96 327 L
95.96 327 L
S
GR
GS
2 setlinecap
10.0 ML
0.5 LW
N
95.96 327 M
97.556 327 L
S
GR
GS
2 setlinecap
10.0 ML
0.5 LW
N
97.556 327 M
97.556 327 L
97.556 326.823 L
99.152 326.823 L
99.152 327 L
99.152 327 L
S
GR
GS
2 setlinecap
10.0 ML
0.5 LW
N
99.152 327 M
100.747 327 L
S
GR
GS
2 setlinecap
10.0 ML
0.5 LW
N
100.747 327 M
100.747 327 L
100.747 326.823 L
102.343 326.823 L
102.343 327 L
102.343 327 L
S
GR
GS
2 setlinecap
10.0 ML
0.5 LW
N
102.343 326.823 M
103.939 326.823 L
103.939 327 L
103.939 327 L
S
GR
GS
2 setlinecap
10.0 ML
0.5 LW
N
103.939 327 M
105.535 327 L
105.535 327 L
105.535 327 L
S
GR
GS
2 setlinecap
10.0 ML
0.5 LW
N
105.535 327 M
107.131 327 L
107.131 327 L
107.131 327 L
S
GR
GS
2 setlinecap
10.0 ML
0.5 LW
N
107.131 327 M
108.727 327 L
S
GR
GS
2 setlinecap
10.0 ML
0.5 LW
N
108.727 327 M
108.727 327 L
108.727 326.823 L
110.323 326.823 L
110.323 327 L
110.323 327 L
S
GR
GS
2 setlinecap
10.0 ML
0.5 LW
N
110.323 327 M
111.919 327 L
111.919 327 L
111.919 327 L
S
GR
GS
2 setlinecap
10.0 ML
0.5 LW
N
111.919 327 M
113.515 327 L
S
GR
GS
2 setlinecap
10.0 ML
0.5 LW
N
113.515 327 M
113.515 327 L
113.515 326.47 L
115.111 326.47 L
115.111 327 L
115.111 327 L
S
GR
GS
2 setlinecap
10.0 ML
0.5 LW
N
115.111 326.646 M
116.707 326.646 L
116.707 327 L
116.707 327 L
S
GR
GS
2 setlinecap
10.0 ML
0.5 LW
N
116.707 326.823 M
118.303 326.823 L
S
GR
GS
2 setlinecap
10.0 ML
0.5 LW
N
118.303 327 M
118.303 327 L
118.303 326.646 L
119.899 326.646 L
119.899 327 L
119.899 327 L
S
GR
GS
2 setlinecap
10.0 ML
0.5 LW
N
119.899 326.646 M
121.495 326.646 L
121.495 327 L
121.495 327 L
S
GR
GS
2 setlinecap
10.0 ML
0.5 LW
N
121.495 326.646 M
123.091 326.646 L
123.091 327 L
123.091 327 L
S
GR
GS
2 setlinecap
10.0 ML
0.5 LW
N
123.091 326.646 M
124.687 326.646 L
124.687 327 L
124.687 327 L
S
GR
GS
2 setlinecap
10.0 ML
0.5 LW
N
124.687 326.646 M
126.283 326.646 L
S
GR
GS
2 setlinecap
10.0 ML
0.5 LW
N
126.283 327 M
126.283 327 L
126.283 326.293 L
127.879 326.293 L
S
GR
GS
2 setlinecap
10.0 ML
0.5 LW
N
127.879 327 M
127.879 327 L
127.879 325.409 L
129.475 325.409 L
129.475 327 L
129.475 327 L
S
GR
GS
2 setlinecap
10.0 ML
0.5 LW
N
129.475 325.939 M
131.071 325.939 L
S
GR
GS
2 setlinecap
10.0 ML
0.5 LW
N
131.071 327 M
131.071 327 L
131.071 325.763 L
132.667 325.763 L
S
GR
GS
2 setlinecap
10.0 ML
0.5 LW
N
132.667 327 M
132.667 327 L
132.667 324.879 L
134.263 324.879 L
134.263 327 L
134.263 327 L
S
GR
GS
2 setlinecap
10.0 ML
0.5 LW
N
134.263 326.116 M
135.859 326.116 L
S
GR
GS
2 setlinecap
10.0 ML
0.5 LW
N
135.859 327 M
135.859 327 L
135.859 324.172 L
137.455 324.172 L
137.455 327 L
137.455 327 L
S
GR
GS
2 setlinecap
10.0 ML
0.5 LW
N
137.455 324.525 M
139.051 324.525 L
S
GR
GS
2 setlinecap
10.0 ML
0.5 LW
N
139.051 327 M
139.051 327 L
139.051 322.404 L
140.646 322.404 L
S
GR
GS
2 setlinecap
10.0 ML
0.5 LW
N
140.646 327 M
140.646 327 L
140.646 322.051 L
142.242 322.051 L
142.242 327 L
142.242 327 L
S
GR
GS
2 setlinecap
10.0 ML
0.5 LW
N
142.242 322.934 M
143.838 322.934 L
S
GR
GS
2 setlinecap
10.0 ML
0.5 LW
N
143.838 327 M
143.838 327 L
143.838 322.227 L
145.434 322.227 L
S
GR
GS
2 setlinecap
10.0 ML
0.5 LW
N
145.434 327 M
145.434 327 L
145.434 319.576 L
147.03 319.576 L
147.03 327 L
147.03 327 L
S
GR
GS
2 setlinecap
10.0 ML
0.5 LW
N
147.03 320.106 M
148.626 320.106 L
S
GR
GS
2 setlinecap
10.0 ML
0.5 LW
N
148.626 327 M
148.626 327 L
148.626 319.222 L
150.222 319.222 L
150.222 327 L
150.222 327 L
S
GR
GS
2 setlinecap
10.0 ML
0.5 LW
N
150.222 321.874 M
151.818 321.874 L
151.818 327 L
151.818 327 L
S
GR
GS
2 setlinecap
10.0 ML
0.5 LW
N
151.818 327 M
153.414 327 L
153.414 327 L
153.414 327 L
S
GR
GS
2 setlinecap
10.0 ML
0.5 LW
N
153.414 327 M
155.01 327 L
155.01 327 L
155.01 327 L
S
GR
GS
2 setlinecap
10.0 ML
0.5 LW
N
155.01 327 M
156.606 327 L
156.606 327 L
156.606 327 L
S
GR
GS
2 setlinecap
10.0 ML
0.5 LW
N
156.606 327 M
158.202 327 L
158.202 327 L
158.202 327 L
S
GR
GS
2 setlinecap
10.0 ML
0.5 LW
N
158.202 327 M
159.798 327 L
159.798 327 L
159.798 327 L
S
GR
GS
2 setlinecap
10.0 ML
0.5 LW
N
159.798 327 M
161.394 327 L
161.394 327 L
161.394 327 L
S
GR
GS
2 setlinecap
10.0 ML
0.5 LW
N
161.394 327 M
162.99 327 L
162.99 327 L
162.99 327 L
S
GR
GS
2 setlinecap
10.0 ML
0.5 LW
N
162.99 327 M
164.586 327 L
164.586 327 L
164.586 327 L
S
GR
GS
2 setlinecap
10.0 ML
0.5 LW
N
164.586 327 M
166.182 327 L
S
GR
GS
2 setlinecap
10.0 ML
0.5 LW
N
166.182 327 M
166.182 327 L
166.182 282.455 L
167.778 282.455 L
S
GR
GS
2 setlinecap
10.0 ML
0.5 LW
N
167.778 327 M
167.778 327 L
167.778 222 L
169.374 222 L
169.374 327 L
169.374 327 L
S
GR
GS
2 setlinecap
10.0 ML
0.5 LW
N
169.374 247.808 M
170.97 247.808 L
170.97 327 L
170.97 327 L
S
GR
GS
2 setlinecap
10.0 ML
0.5 LW
N
170.97 271.318 M
172.566 271.318 L
172.566 327 L
172.566 327 L
S
GR
GS
2 setlinecap
10.0 ML
0.5 LW
N
172.566 291.116 M
174.162 291.116 L
174.162 327 L
174.162 327 L
S
GR
GS
2 setlinecap
10.0 ML
0.5 LW
N
174.162 298.54 M
175.758 298.54 L
175.758 327 L
175.758 327 L
S
GR
GS
2 setlinecap
10.0 ML
0.5 LW
N
175.758 307.379 M
177.354 307.379 L
177.354 327 L
177.354 327 L
S
GR
GS
2 setlinecap
10.0 ML
0.5 LW
N
177.354 311.621 M
178.949 311.621 L
178.949 327 L
178.949 327 L
S
GR
GS
2 setlinecap
10.0 ML
0.5 LW
N
178.949 313.742 M
180.545 313.742 L
180.545 327 L
180.545 327 L
S
GR
GS
2 setlinecap
10.0 ML
0.5 LW
N
180.545 318.515 M
182.141 318.515 L
182.141 327 L
182.141 327 L
S
GR
GS
2 setlinecap
10.0 ML
0.5 LW
N
182.141 321.697 M
183.737 321.697 L
183.737 327 L
183.737 327 L
S
GR
GS
2 setlinecap
10.0 ML
0.5 LW
N
183.737 322.758 M
185.333 322.758 L
185.333 327 L
185.333 327 L
S
GR
GS
2 setlinecap
10.0 ML
0.5 LW
N
185.333 323.818 M
186.929 323.818 L
186.929 327 L
186.929 327 L
S
GR
GS
2 setlinecap
10.0 ML
0.5 LW
N
186.929 324.525 M
188.525 324.525 L
188.525 327 L
188.525 327 L
S
GR
GS
2 setlinecap
10.0 ML
0.5 LW
N
188.525 325.056 M
190.121 325.056 L
190.121 327 L
190.121 327 L
S
GR
GS
2 setlinecap
10.0 ML
0.5 LW
N
190.121 325.056 M
191.717 325.056 L
191.717 327 L
191.717 327 L
S
GR
GS
2 setlinecap
10.0 ML
0.5 LW
N
191.717 325.763 M
193.313 325.763 L
S
GR
GS
2 setlinecap
10.0 ML
0.5 LW
N
193.313 327 M
193.313 327 L
193.313 325.409 L
194.909 325.409 L
194.909 327 L
194.909 327 L
S
GR
GS
2 setlinecap
10.0 ML
0.5 LW
N
194.909 326.646 M
196.505 326.646 L
196.505 327 L
196.505 327 L
S
GR
GS
2 setlinecap
10.0 ML
0.5 LW
N
196.505 327 M
198.101 327 L
S
GR
GS
2 setlinecap
10.0 ML
0.5 LW
N
198.101 327 M
198.101 327 L
198.101 326.293 L
199.697 326.293 L
199.697 327 L
199.697 327 L
S
GR
GS
2 setlinecap
10.0 ML
0.5 LW
N
199.697 326.823 M
201.293 326.823 L
S
GR
GS
2 setlinecap
10.0 ML
0.5 LW
N
201.293 327 M
201.293 327 L
201.293 326.646 L
202.889 326.646 L
202.889 327 L
202.889 327 L
S
GR
GS
2 setlinecap
10.0 ML
0.5 LW
N
202.889 327 M
204.485 327 L
S
GR
GS
2 setlinecap
10.0 ML
0.5 LW
N
204.485 327 M
204.485 327 L
204.485 326.823 L
206.081 326.823 L
206.081 327 L
206.081 327 L
S
GR
GS
2 setlinecap
10.0 ML
0.5 LW
N
206.081 327 M
207.677 327 L
207.677 327 L
207.677 327 L
S
GR
GS
2 setlinecap
10.0 ML
0.5 LW
N
207.677 327 M
209.273 327 L
S
GR
GS
2 setlinecap
10.0 ML
0.5 LW
N
209.273 327 M
209.273 327 L
209.273 326.823 L
210.869 326.823 L
210.869 327 L
210.869 327 L
S
GR
GS
2 setlinecap
10.0 ML
0.5 LW
N
210.869 327 M
212.465 327 L
212.465 327 L
212.465 327 L
S
GR
GS
2 setlinecap
10.0 ML
0.5 LW
N
212.465 327 M
214.061 327 L
214.061 327 L
214.061 327 L
S
GR
GS
2 setlinecap
10.0 ML
0.5 LW
N
214.061 327 M
215.657 327 L
215.657 327 L
215.657 327 L
S
GR
GS
2 setlinecap
10.0 ML
0.5 LW
N
215.657 327 M
217.253 327 L
217.253 327 L
217.253 327 L
S
GR
GS
2 setlinecap
10.0 ML
0.5 LW
N
217.253 327 M
218.848 327 L
218.848 327 L
218.848 327 L
S
GR
GS
2 setlinecap
10.0 ML
0.5 LW
N
218.848 327 M
220.444 327 L
220.444 327 L
220.444 327 L
S
GR
GS
2 setlinecap
10.0 ML
0.5 LW
N
220.444 327 M
222.04 327 L
222.04 327 L
222.04 327 L
S
GR
GS
2 setlinecap
10.0 ML
0.5 LW
N
222.04 327 M
223.636 327 L
223.636 327 L
223.636 327 L
S
GR
GS
2 setlinecap
10.0 ML
0.5 LW
N
223.636 327 M
225.232 327 L
225.232 327 L
225.232 327 L
S
GR
GS
2 setlinecap
10.0 ML
0.5 LW
N
225.232 327 M
226.828 327 L
226.828 327 L
226.828 327 L
S
GR
GS
2 setlinecap
10.0 ML
0.5 LW
N
226.828 327 M
228.424 327 L
228.424 327 L
228.424 327 L
S
GR
GS
2 setlinecap
10.0 ML
0.5 LW
N
228.424 327 M
230.02 327 L
230.02 327 L
230.02 327 L
S
GR
GS
2 setlinecap
10.0 ML
0.5 LW
N
230.02 327 M
231.616 327 L
231.616 327 L
231.616 327 L
S
GR
GS
2 setlinecap
10.0 ML
0.5 LW
N
231.616 327 M
233.212 327 L
233.212 327 L
233.212 327 L
S
GR
GS
2 setlinecap
10.0 ML
0.5 LW
N
233.212 327 M
234.808 327 L
234.808 327 L
234.808 327 L
S
GR
GS
2 setlinecap
10.0 ML
0.5 LW
N
234.808 327 M
236.404 327 L
236.404 327 L
236.404 327 L
S
GR
GS
2 setlinecap
10.0 ML
0.5 LW
N
236.404 327 M
238 327 L
238 327 L
S
GR
GS
0.851 0.325 0.098 RC
1 LJ
2 LW
N
81.596 326.997 M
83.192 326.997 L
84.788 327 L
86.384 326.997 L
87.98 326.997 L
89.576 326.997 L
91.172 326.994 L
92.768 326.998 L
94.364 326.992 L
95.96 326.992 L
97.556 326.987 L
99.152 326.992 L
100.747 326.992 L
102.343 326.989 L
103.939 326.992 L
105.535 326.981 L
107.131 326.975 L
108.727 326.977 L
110.323 326.978 L
111.919 326.97 L
113.515 326.959 L
115.111 326.953 L
116.707 326.913 L
118.303 326.921 L
119.899 326.915 L
121.495 326.852 L
123.091 326.874 L
124.687 326.849 L
126.283 326.769 L
127.879 326.763 L
129.475 326.674 L
131.071 326.62 L
132.667 326.56 L
134.263 326.378 L
135.859 326.203 L
137.455 325.934 L
139.051 325.551 L
140.646 325.191 L
142.242 324.502 L
143.838 323.316 L
145.434 321.763 L
147.03 319.482 L
148.626 316.421 L
150.222 313.842 L
151.818 320.832 L
153.414 326.97 L
155.01 327 L
156.606 327 L
158.202 327 L
159.798 327 L
161.394 327 L
162.99 327 L
164.586 327 L
166.182 326.756 L
167.778 285.618 L
169.374 229.208 L
170.97 247.269 L
172.566 270.946 L
174.162 288.543 L
175.758 300.91 L
177.354 308.6 L
178.949 313.569 L
180.545 317.223 L
182.141 319.928 L
183.737 321.589 L
185.333 322.795 L
186.929 323.813 L
188.525 324.392 L
190.121 325.108 L
191.717 325.393 L
193.313 325.779 L
194.909 326.002 L
196.505 326.171 L
198.101 326.355 L
199.697 326.5 L
201.293 326.548 L
202.889 326.596 L
204.485 326.682 L
206.081 326.749 L
207.677 326.808 L
209.273 326.824 L
210.869 326.884 L
212.465 326.859 L
214.061 326.928 L
215.657 326.925 L
217.253 326.94 L
218.848 326.95 L
220.444 326.935 L
222.04 326.961 L
223.636 326.976 L
225.232 326.971 L
226.828 326.976 L
228.424 326.975 L
230.02 326.984 L
231.616 326.987 L
233.212 326.989 L
234.808 326.986 L
236.404 326.994 L
238 326.992 L
S
GR
GS
1 GC
N
305.5 327 M
463.5 327 L
463.5 222 L
305.5 222 L
cp
f
GR
GS
0.149 GC
2 setlinecap
1 LJ
0.5 LW
N
305.5 327 M
463.5 327 L
S
GR
GS
0.149 GC
2 setlinecap
1 LJ
0.5 LW
N
321.3 327 M
321.3 325.42 L
S
GR
GS
0.149 GC
2 setlinecap
1 LJ
0.5 LW
N
384.5 327 M
384.5 325.42 L
S
GR
GS
0.149 GC
2 setlinecap
1 LJ
0.5 LW
N
447.7 327 M
447.7 325.42 L
S
GR
GS
[1 0 0 1 321.29999 332.20001] CT
0.149 GC
/Helvetica 16 F
GS
[1 0 0 1 0 0] CT
-8 16 moveto 
1 -1 scale
(-2) t 
GR
GR
GS
[1 0 0 1 384.5 332.20001] CT
0.149 GC
/Helvetica 16 F
GS
[1 0 0 1 0 0] CT
-4.5 16 moveto 
1 -1 scale
(0) t 
GR
GR
GS
[1 0 0 1 447.70001 332.20001] CT
0.149 GC
/Helvetica 16 F
GS
[1 0 0 1 0 0] CT
-4.5 16 moveto 
1 -1 scale
(2) t 
GR
GR
GS
[1 0 0 1 384.50006 352.20001] CT
0.149 GC
/Helvetica 16 F
GS
[1 0 0 1 0 0] CT
-60 16 moveto 
1 -1 scale
(Reaction time \(s\)) t 
GR
GR
GS
0.149 GC
2 setlinecap
1 LJ
0.5 LW
N
305.5 327 M
305.5 222 L
S
GR
GS
0.149 GC
2 setlinecap
1 LJ
0.5 LW
N
305.5 327 M
307.08 327 L
S
GR
GS
0.149 GC
2 setlinecap
1 LJ
0.5 LW
N
305.5 274.5 M
307.08 274.5 L
S
GR
GS
0.149 GC
2 setlinecap
1 LJ
0.5 LW
N
305.5 222 M
307.08 222 L
S
GR
GS
[1 0 0 1 300.29999 327] CT
0.149 GC
/Helvetica 16 F
GS
[1 0 0 1 0 0] CT
-9 6 moveto 
1 -1 scale
(0) t 
GR
GR
GS
[1 0 0 1 300.29999 274.5] CT
0.149 GC
/Helvetica 16 F
GS
[1 0 0 1 0 0] CT
-32 6 moveto 
1 -1 scale
(0.05) t 
GR
GR
GS
[1 0 0 1 300.29999 222] CT
0.149 GC
/Helvetica 16 F
GS
[1 0 0 1 0 0] CT
-23 6 moveto 
1 -1 scale
(0.1) t 
GR
GR
GS
[0 -1 1 0 265.79999 274.49994] CT
0.149 GC
/Helvetica 16 F
GS
[1 0 0 1 0 0] CT
-47.5 -4 moveto 
1 -1 scale
(Prob. density) t 
GR
GR
GS
[1 0 0 1 384.50037 220] CT
/Helvetica-Bold 16 F
GS
[1 0 0 1 0 0] CT
-36 -4 moveto 
1 -1 scale
(2 Targets) t 
GR
GR
GS
0.4 0.668 0.845 RC
N
329.439 326.645 M
327.843 326.645 L
327.843 327 L
329.439 327 L
331.035 327 L
331.035 326.645 L
cp
332.631 326.289 M
331.035 326.289 L
331.035 327 L
332.631 327 L
334.227 327 L
334.227 326.289 L
cp
335.823 327 M
335.823 325.578 L
334.227 325.578 L
334.227 327 L
cp
337.419 327 M
337.419 326.289 L
335.823 326.289 L
335.823 327 L
cp
339.015 327 M
339.015 325.578 L
337.419 325.578 L
337.419 327 L
cp
340.611 327 M
340.611 324.867 L
339.015 324.867 L
339.015 327 L
cp
342.207 327 M
342.207 322.735 L
340.611 322.735 L
340.611 327 L
cp
343.803 327 M
343.803 325.223 L
342.207 325.223 L
342.207 327 L
cp
345.399 327 M
345.399 324.512 L
343.803 324.512 L
343.803 327 L
cp
346.995 327 M
346.995 323.801 L
345.399 323.801 L
345.399 327 L
cp
348.591 327 M
348.591 324.512 L
346.995 324.512 L
346.995 327 L
cp
350.187 327 M
350.187 323.801 L
348.591 323.801 L
348.591 327 L
cp
351.783 327 M
351.783 322.024 L
350.187 322.024 L
350.187 327 L
cp
353.379 327 M
353.379 319.18 L
351.783 319.18 L
351.783 327 L
cp
354.975 327 M
354.975 318.469 L
353.379 318.469 L
353.379 327 L
cp
356.571 327 M
356.571 318.825 L
354.975 318.825 L
354.975 327 L
cp
358.167 327 M
358.167 319.891 L
356.571 319.891 L
356.571 327 L
cp
359.763 327 M
359.763 315.626 L
358.167 315.626 L
358.167 327 L
cp
361.359 327 M
361.359 316.336 L
359.763 316.336 L
359.763 327 L
cp
362.955 327 M
362.955 318.469 L
361.359 318.469 L
361.359 327 L
cp
364.551 327 M
364.551 314.559 L
362.955 314.559 L
362.955 327 L
cp
366.146 327 M
366.146 313.137 L
364.551 313.137 L
364.551 327 L
cp
367.742 327 M
367.742 311.36 L
366.146 311.36 L
366.146 327 L
cp
369.338 327 M
369.338 314.559 L
367.742 314.559 L
367.742 327 L
cp
370.934 327 M
370.934 317.758 L
369.338 317.758 L
369.338 327 L
cp
372.53 327 M
372.53 320.602 L
370.934 320.602 L
370.934 327 L
cp
374.126 327 M
374.126 320.957 L
372.53 320.957 L
372.53 327 L
cp
375.722 327 M
375.722 323.09 L
374.126 323.09 L
374.126 327 L
cp
377.318 327 M
377.318 325.934 L
375.722 325.934 L
375.722 327 L
cp
393.278 327 M
393.278 307.806 L
391.682 307.806 L
391.682 327 L
cp
394.874 327 M
394.874 290.033 L
393.278 290.033 L
393.278 327 L
cp
396.47 327 M
396.47 283.635 L
394.874 283.635 L
394.874 327 L
cp
398.066 327 M
398.066 274.038 L
396.47 274.038 L
396.47 327 L
cp
399.662 327 M
399.662 246.668 L
398.066 246.668 L
398.066 327 L
cp
401.258 327 M
401.258 248.09 L
399.662 248.09 L
399.662 327 L
cp
402.854 327 M
402.854 234.938 L
401.258 234.938 L
401.258 327 L
cp
404.449 327 M
404.449 250.934 L
402.854 250.934 L
402.854 327 L
cp
406.045 327 M
406.045 252.711 L
404.449 252.711 L
404.449 327 L
cp
407.641 327 M
407.641 273.327 L
406.045 273.327 L
406.045 327 L
cp
409.237 327 M
409.237 285.412 L
407.641 285.412 L
407.641 327 L
cp
410.833 327 M
410.833 285.768 L
409.237 285.768 L
409.237 327 L
cp
412.429 327 M
412.429 297.853 L
410.833 297.853 L
410.833 327 L
cp
414.025 327 M
414.025 301.052 L
412.429 301.052 L
412.429 327 L
cp
415.621 327 M
415.621 300.697 L
414.025 300.697 L
414.025 327 L
cp
417.217 327 M
417.217 312.427 L
415.621 312.427 L
415.621 327 L
cp
418.813 327 M
418.813 311.716 L
417.217 311.716 L
417.217 327 L
cp
420.409 327 M
420.409 313.493 L
418.813 313.493 L
418.813 327 L
cp
422.005 327 M
422.005 315.27 L
420.409 315.27 L
420.409 327 L
cp
423.601 327 M
423.601 319.18 L
422.005 319.18 L
422.005 327 L
cp
425.197 327 M
425.197 315.626 L
423.601 315.626 L
423.601 327 L
cp
426.793 323.09 M
425.197 323.09 L
425.197 327 L
426.793 327 L
428.389 327 L
428.389 323.09 L
cp
429.985 327 M
429.985 323.445 L
428.389 323.445 L
428.389 327 L
cp
431.581 327 M
431.581 323.801 L
429.985 323.801 L
429.985 327 L
cp
433.177 327 M
433.177 323.09 L
431.581 323.09 L
431.581 327 L
cp
434.773 327 M
434.773 324.512 L
433.177 324.512 L
433.177 327 L
cp
436.369 327 M
436.369 325.934 L
434.773 325.934 L
434.773 327 L
cp
437.965 327 M
437.965 325.578 L
436.369 325.578 L
436.369 327 L
cp
439.561 327 M
439.561 325.223 L
437.965 325.223 L
437.965 327 L
cp
441.157 325.934 M
439.561 325.934 L
439.561 327 L
441.157 327 L
442.753 327 L
442.753 325.934 L
cp
444.348 327 M
444.348 325.578 L
442.753 325.578 L
442.753 327 L
cp
447.54 327 M
447.54 325.578 L
445.944 325.578 L
445.944 327 L
cp
f
GR
GS
2 setlinecap
10.0 ML
0.5 LW
N
305.5 327 M
305.5 327 L
307.096 327 L
307.096 327 L
307.096 327 L
S
GR
GS
2 setlinecap
10.0 ML
0.5 LW
N
307.096 327 M
308.692 327 L
308.692 327 L
308.692 327 L
S
GR
GS
2 setlinecap
10.0 ML
0.5 LW
N
308.692 327 M
310.288 327 L
310.288 327 L
310.288 327 L
S
GR
GS
2 setlinecap
10.0 ML
0.5 LW
N
310.288 327 M
311.884 327 L
311.884 327 L
311.884 327 L
S
GR
GS
2 setlinecap
10.0 ML
0.5 LW
N
311.884 327 M
313.48 327 L
313.48 327 L
313.48 327 L
S
GR
GS
2 setlinecap
10.0 ML
0.5 LW
N
313.48 327 M
315.076 327 L
315.076 327 L
315.076 327 L
S
GR
GS
2 setlinecap
10.0 ML
0.5 LW
N
315.076 327 M
316.672 327 L
316.672 327 L
316.672 327 L
S
GR
GS
2 setlinecap
10.0 ML
0.5 LW
N
316.672 327 M
318.268 327 L
318.268 327 L
318.268 327 L
S
GR
GS
2 setlinecap
10.0 ML
0.5 LW
N
318.268 327 M
319.864 327 L
319.864 327 L
319.864 327 L
S
GR
GS
2 setlinecap
10.0 ML
0.5 LW
N
319.864 327 M
321.46 327 L
321.46 327 L
321.46 327 L
S
GR
GS
2 setlinecap
10.0 ML
0.5 LW
N
321.46 327 M
323.056 327 L
323.056 327 L
323.056 327 L
S
GR
GS
2 setlinecap
10.0 ML
0.5 LW
N
323.056 327 M
324.652 327 L
324.652 327 L
324.652 327 L
S
GR
GS
2 setlinecap
10.0 ML
0.5 LW
N
324.652 327 M
326.247 327 L
326.247 327 L
326.247 327 L
S
GR
GS
2 setlinecap
10.0 ML
0.5 LW
N
326.247 327 M
327.843 327 L
S
GR
GS
2 setlinecap
10.0 ML
0.5 LW
N
327.843 327 M
327.843 327 L
327.843 326.645 L
329.439 326.645 L
329.439 327 L
329.439 327 L
S
GR
GS
2 setlinecap
10.0 ML
0.5 LW
N
329.439 326.645 M
331.035 326.645 L
S
GR
GS
2 setlinecap
10.0 ML
0.5 LW
N
331.035 327 M
331.035 327 L
331.035 326.289 L
332.631 326.289 L
332.631 327 L
332.631 327 L
S
GR
GS
2 setlinecap
10.0 ML
0.5 LW
N
332.631 326.289 M
334.227 326.289 L
S
GR
GS
2 setlinecap
10.0 ML
0.5 LW
N
334.227 327 M
334.227 327 L
334.227 325.578 L
335.823 325.578 L
335.823 327 L
335.823 327 L
S
GR
GS
2 setlinecap
10.0 ML
0.5 LW
N
335.823 326.289 M
337.419 326.289 L
S
GR
GS
2 setlinecap
10.0 ML
0.5 LW
N
337.419 327 M
337.419 327 L
337.419 325.578 L
339.015 325.578 L
S
GR
GS
2 setlinecap
10.0 ML
0.5 LW
N
339.015 327 M
339.015 327 L
339.015 324.867 L
340.611 324.867 L
S
GR
GS
2 setlinecap
10.0 ML
0.5 LW
N
340.611 327 M
340.611 327 L
340.611 322.735 L
342.207 322.735 L
342.207 327 L
342.207 327 L
S
GR
GS
2 setlinecap
10.0 ML
0.5 LW
N
342.207 325.223 M
343.803 325.223 L
S
GR
GS
2 setlinecap
10.0 ML
0.5 LW
N
343.803 327 M
343.803 327 L
343.803 324.512 L
345.399 324.512 L
S
GR
GS
2 setlinecap
10.0 ML
0.5 LW
N
345.399 327 M
345.399 327 L
345.399 323.801 L
346.995 323.801 L
346.995 327 L
346.995 327 L
S
GR
GS
2 setlinecap
10.0 ML
0.5 LW
N
346.995 324.512 M
348.591 324.512 L
S
GR
GS
2 setlinecap
10.0 ML
0.5 LW
N
348.591 327 M
348.591 327 L
348.591 323.801 L
350.187 323.801 L
S
GR
GS
2 setlinecap
10.0 ML
0.5 LW
N
350.187 327 M
350.187 327 L
350.187 322.024 L
351.783 322.024 L
S
GR
GS
2 setlinecap
10.0 ML
0.5 LW
N
351.783 327 M
351.783 327 L
351.783 319.18 L
353.379 319.18 L
S
GR
GS
2 setlinecap
10.0 ML
0.5 LW
N
353.379 327 M
353.379 327 L
353.379 318.469 L
354.975 318.469 L
354.975 327 L
354.975 327 L
S
GR
GS
2 setlinecap
10.0 ML
0.5 LW
N
354.975 318.825 M
356.571 318.825 L
356.571 327 L
356.571 327 L
S
GR
GS
2 setlinecap
10.0 ML
0.5 LW
N
356.571 319.891 M
358.167 319.891 L
S
GR
GS
2 setlinecap
10.0 ML
0.5 LW
N
358.167 327 M
358.167 327 L
358.167 315.626 L
359.763 315.626 L
359.763 327 L
359.763 327 L
S
GR
GS
2 setlinecap
10.0 ML
0.5 LW
N
359.763 316.336 M
361.359 316.336 L
361.359 327 L
361.359 327 L
S
GR
GS
2 setlinecap
10.0 ML
0.5 LW
N
361.359 318.469 M
362.955 318.469 L
S
GR
GS
2 setlinecap
10.0 ML
0.5 LW
N
362.955 327 M
362.955 327 L
362.955 314.559 L
364.551 314.559 L
S
GR
GS
2 setlinecap
10.0 ML
0.5 LW
N
364.551 327 M
364.551 327 L
364.551 313.137 L
366.146 313.137 L
S
GR
GS
2 setlinecap
10.0 ML
0.5 LW
N
366.146 327 M
366.146 327 L
366.146 311.36 L
367.742 311.36 L
367.742 327 L
367.742 327 L
S
GR
GS
2 setlinecap
10.0 ML
0.5 LW
N
367.742 314.559 M
369.338 314.559 L
369.338 327 L
369.338 327 L
S
GR
GS
2 setlinecap
10.0 ML
0.5 LW
N
369.338 317.758 M
370.934 317.758 L
370.934 327 L
370.934 327 L
S
GR
GS
2 setlinecap
10.0 ML
0.5 LW
N
370.934 320.602 M
372.53 320.602 L
372.53 327 L
372.53 327 L
S
GR
GS
2 setlinecap
10.0 ML
0.5 LW
N
372.53 320.957 M
374.126 320.957 L
374.126 327 L
374.126 327 L
S
GR
GS
2 setlinecap
10.0 ML
0.5 LW
N
374.126 323.09 M
375.722 323.09 L
375.722 327 L
375.722 327 L
S
GR
GS
2 setlinecap
10.0 ML
0.5 LW
N
375.722 325.934 M
377.318 325.934 L
377.318 327 L
377.318 327 L
S
GR
GS
2 setlinecap
10.0 ML
0.5 LW
N
377.318 327 M
378.914 327 L
378.914 327 L
378.914 327 L
S
GR
GS
2 setlinecap
10.0 ML
0.5 LW
N
378.914 327 M
380.51 327 L
380.51 327 L
380.51 327 L
S
GR
GS
2 setlinecap
10.0 ML
0.5 LW
N
380.51 327 M
382.106 327 L
382.106 327 L
382.106 327 L
S
GR
GS
2 setlinecap
10.0 ML
0.5 LW
N
382.106 327 M
383.702 327 L
383.702 327 L
383.702 327 L
S
GR
GS
2 setlinecap
10.0 ML
0.5 LW
N
383.702 327 M
385.298 327 L
385.298 327 L
385.298 327 L
S
GR
GS
2 setlinecap
10.0 ML
0.5 LW
N
385.298 327 M
386.894 327 L
386.894 327 L
386.894 327 L
S
GR
GS
2 setlinecap
10.0 ML
0.5 LW
N
386.894 327 M
388.49 327 L
388.49 327 L
388.49 327 L
S
GR
GS
2 setlinecap
10.0 ML
0.5 LW
N
388.49 327 M
390.086 327 L
390.086 327 L
390.086 327 L
S
GR
GS
2 setlinecap
10.0 ML
0.5 LW
N
390.086 327 M
391.682 327 L
S
GR
GS
2 setlinecap
10.0 ML
0.5 LW
N
391.682 327 M
391.682 327 L
391.682 307.806 L
393.278 307.806 L
S
GR
GS
2 setlinecap
10.0 ML
0.5 LW
N
393.278 327 M
393.278 327 L
393.278 290.033 L
394.874 290.033 L
S
GR
GS
2 setlinecap
10.0 ML
0.5 LW
N
394.874 327 M
394.874 327 L
394.874 283.635 L
396.47 283.635 L
S
GR
GS
2 setlinecap
10.0 ML
0.5 LW
N
396.47 327 M
396.47 327 L
396.47 274.038 L
398.066 274.038 L
S
GR
GS
2 setlinecap
10.0 ML
0.5 LW
N
398.066 327 M
398.066 327 L
398.066 246.668 L
399.662 246.668 L
399.662 327 L
399.662 327 L
S
GR
GS
2 setlinecap
10.0 ML
0.5 LW
N
399.662 248.09 M
401.258 248.09 L
S
GR
GS
2 setlinecap
10.0 ML
0.5 LW
N
401.258 327 M
401.258 327 L
401.258 234.938 L
402.854 234.938 L
402.854 327 L
402.854 327 L
S
GR
GS
2 setlinecap
10.0 ML
0.5 LW
N
402.854 250.934 M
404.449 250.934 L
404.449 327 L
404.449 327 L
S
GR
GS
2 setlinecap
10.0 ML
0.5 LW
N
404.449 252.711 M
406.045 252.711 L
406.045 327 L
406.045 327 L
S
GR
GS
2 setlinecap
10.0 ML
0.5 LW
N
406.045 273.327 M
407.641 273.327 L
407.641 327 L
407.641 327 L
S
GR
GS
2 setlinecap
10.0 ML
0.5 LW
N
407.641 285.412 M
409.237 285.412 L
409.237 327 L
409.237 327 L
S
GR
GS
2 setlinecap
10.0 ML
0.5 LW
N
409.237 285.768 M
410.833 285.768 L
410.833 327 L
410.833 327 L
S
GR
GS
2 setlinecap
10.0 ML
0.5 LW
N
410.833 297.853 M
412.429 297.853 L
412.429 327 L
412.429 327 L
S
GR
GS
2 setlinecap
10.0 ML
0.5 LW
N
412.429 301.052 M
414.025 301.052 L
S
GR
GS
2 setlinecap
10.0 ML
0.5 LW
N
414.025 327 M
414.025 327 L
414.025 300.697 L
415.621 300.697 L
415.621 327 L
415.621 327 L
S
GR
GS
2 setlinecap
10.0 ML
0.5 LW
N
415.621 312.427 M
417.217 312.427 L
S
GR
GS
2 setlinecap
10.0 ML
0.5 LW
N
417.217 327 M
417.217 327 L
417.217 311.716 L
418.813 311.716 L
418.813 327 L
418.813 327 L
S
GR
GS
2 setlinecap
10.0 ML
0.5 LW
N
418.813 313.493 M
420.409 313.493 L
420.409 327 L
420.409 327 L
S
GR
GS
2 setlinecap
10.0 ML
0.5 LW
N
420.409 315.27 M
422.005 315.27 L
422.005 327 L
422.005 327 L
S
GR
GS
2 setlinecap
10.0 ML
0.5 LW
N
422.005 319.18 M
423.601 319.18 L
S
GR
GS
2 setlinecap
10.0 ML
0.5 LW
N
423.601 327 M
423.601 327 L
423.601 315.626 L
425.197 315.626 L
425.197 327 L
425.197 327 L
S
GR
GS
2 setlinecap
10.0 ML
0.5 LW
N
425.197 323.09 M
426.793 323.09 L
426.793 327 L
426.793 327 L
S
GR
GS
2 setlinecap
10.0 ML
0.5 LW
N
426.793 323.09 M
428.389 323.09 L
428.389 327 L
428.389 327 L
S
GR
GS
2 setlinecap
10.0 ML
0.5 LW
N
428.389 323.445 M
429.985 323.445 L
429.985 327 L
429.985 327 L
S
GR
GS
2 setlinecap
10.0 ML
0.5 LW
N
429.985 323.801 M
431.581 323.801 L
S
GR
GS
2 setlinecap
10.0 ML
0.5 LW
N
431.581 327 M
431.581 327 L
431.581 323.09 L
433.177 323.09 L
433.177 327 L
433.177 327 L
S
GR
GS
2 setlinecap
10.0 ML
0.5 LW
N
433.177 324.512 M
434.773 324.512 L
434.773 327 L
434.773 327 L
S
GR
GS
2 setlinecap
10.0 ML
0.5 LW
N
434.773 325.934 M
436.369 325.934 L
S
GR
GS
2 setlinecap
10.0 ML
0.5 LW
N
436.369 327 M
436.369 327 L
436.369 325.578 L
437.965 325.578 L
S
GR
GS
2 setlinecap
10.0 ML
0.5 LW
N
437.965 327 M
437.965 327 L
437.965 325.223 L
439.561 325.223 L
439.561 327 L
439.561 327 L
S
GR
GS
2 setlinecap
10.0 ML
0.5 LW
N
439.561 325.934 M
441.157 325.934 L
441.157 327 L
441.157 327 L
S
GR
GS
2 setlinecap
10.0 ML
0.5 LW
N
441.157 325.934 M
442.753 325.934 L
S
GR
GS
2 setlinecap
10.0 ML
0.5 LW
N
442.753 327 M
442.753 327 L
442.753 325.578 L
444.348 325.578 L
444.348 327 L
444.348 327 L
S
GR
GS
2 setlinecap
10.0 ML
0.5 LW
N
444.348 327 M
445.944 327 L
S
GR
GS
2 setlinecap
10.0 ML
0.5 LW
N
445.944 327 M
445.944 327 L
445.944 325.578 L
447.54 325.578 L
447.54 327 L
447.54 327 L
S
GR
GS
2 setlinecap
10.0 ML
0.5 LW
N
447.54 327 M
449.136 327 L
449.136 327 L
449.136 327 L
S
GR
GS
2 setlinecap
10.0 ML
0.5 LW
N
449.136 327 M
450.732 327 L
450.732 327 L
450.732 327 L
S
GR
GS
2 setlinecap
10.0 ML
0.5 LW
N
450.732 327 M
452.328 327 L
452.328 327 L
452.328 327 L
S
GR
GS
2 setlinecap
10.0 ML
0.5 LW
N
452.328 327 M
453.924 327 L
453.924 327 L
453.924 327 L
S
GR
GS
2 setlinecap
10.0 ML
0.5 LW
N
453.924 327 M
455.52 327 L
455.52 327 L
455.52 327 L
S
GR
GS
2 setlinecap
10.0 ML
0.5 LW
N
455.52 327 M
457.116 327 L
457.116 327 L
457.116 327 L
S
GR
GS
2 setlinecap
10.0 ML
0.5 LW
N
457.116 327 M
458.712 327 L
458.712 327 L
458.712 327 L
S
GR
GS
2 setlinecap
10.0 ML
0.5 LW
N
458.712 327 M
460.308 327 L
460.308 327 L
460.308 327 L
S
GR
GS
2 setlinecap
10.0 ML
0.5 LW
N
460.308 327 M
461.904 327 L
461.904 327 L
461.904 327 L
S
GR
GS
2 setlinecap
10.0 ML
0.5 LW
N
461.904 327 M
463.5 327 L
463.5 327 L
S
GR
GS
0.851 0.325 0.098 RC
1 LJ
2 LW
N
307.096 326.96 M
308.692 326.96 L
310.288 326.892 L
311.884 326.899 L
313.48 326.916 L
315.076 326.926 L
316.672 326.868 L
318.268 326.858 L
319.864 326.798 L
321.46 326.787 L
323.056 326.8 L
324.652 326.723 L
326.247 326.707 L
327.843 326.673 L
329.439 326.615 L
331.035 326.495 L
332.631 326.416 L
334.227 326.43 L
335.823 326.342 L
337.419 326.332 L
339.015 326.204 L
340.611 325.936 L
342.207 325.801 L
343.803 325.71 L
345.399 325.314 L
346.995 325.217 L
348.591 324.856 L
350.187 324.741 L
351.783 324.083 L
353.379 323.616 L
354.975 323.088 L
356.571 322.624 L
358.167 321.536 L
359.763 320.7 L
361.359 319.311 L
362.955 318.721 L
364.551 316.859 L
366.146 315.944 L
367.742 314.372 L
369.338 314.138 L
370.934 314.52 L
372.53 315.049 L
374.126 316.784 L
375.722 319.974 L
377.318 324.91 L
378.914 326.956 L
380.51 327 L
382.106 327 L
383.702 327 L
385.298 327 L
386.894 327 L
388.49 327 L
390.086 326.996 L
391.682 326.687 L
393.278 314.881 L
394.874 290.793 L
396.47 270.108 L
398.066 253.98 L
399.662 246.609 L
401.258 247.326 L
402.854 253.373 L
404.449 262.809 L
406.045 270.313 L
407.641 278.378 L
409.237 286.615 L
410.833 292.005 L
412.429 297.476 L
414.025 302.493 L
415.621 306.008 L
417.217 309.114 L
418.813 312.08 L
420.409 313.842 L
422.005 316.421 L
423.601 317.714 L
425.197 319.077 L
426.793 319.958 L
428.389 321.185 L
429.985 321.997 L
431.581 322.662 L
433.177 323.183 L
434.773 323.751 L
436.369 324.19 L
437.965 324.677 L
439.561 324.898 L
441.157 325.304 L
442.753 325.449 L
444.348 325.68 L
445.944 325.825 L
447.54 325.948 L
449.136 326.207 L
450.732 326.082 L
452.328 326.358 L
453.924 326.458 L
455.52 326.49 L
457.116 326.463 L
458.712 326.649 L
460.308 326.666 L
461.904 326.733 L
463.5 326.716 L
S
GR
GS
1 GC
N
80 499.5 M
238 499.5 L
238 394.5 L
80 394.5 L
cp
f
GR
GS
0.149 GC
2 setlinecap
1 LJ
0.5 LW
N
80 499.5 M
238 499.5 L
S
GR
GS
0.149 GC
2 setlinecap
1 LJ
0.5 LW
N
95.8 499.5 M
95.8 497.92 L
S
GR
GS
0.149 GC
2 setlinecap
1 LJ
0.5 LW
N
159 499.5 M
159 497.92 L
S
GR
GS
0.149 GC
2 setlinecap
1 LJ
0.5 LW
N
222.2 499.5 M
222.2 497.92 L
S
GR
GS
[1 0 0 1 95.8 504.70001] CT
0.149 GC
/Helvetica 16 F
GS
[1 0 0 1 0 0] CT
-8 16 moveto 
1 -1 scale
(-2) t 
GR
GR
GS
[1 0 0 1 159 504.70001] CT
0.149 GC
/Helvetica 16 F
GS
[1 0 0 1 0 0] CT
-4.5 16 moveto 
1 -1 scale
(0) t 
GR
GR
GS
[1 0 0 1 222.2 504.70001] CT
0.149 GC
/Helvetica 16 F
GS
[1 0 0 1 0 0] CT
-4.5 16 moveto 
1 -1 scale
(2) t 
GR
GR
GS
[1 0 0 1 159.00008 524.70001] CT
0.149 GC
/Helvetica 16 F
GS
[1 0 0 1 0 0] CT
-60 16 moveto 
1 -1 scale
(Reaction time \(s\)) t 
GR
GR
GS
0.149 GC
2 setlinecap
1 LJ
0.5 LW
N
80 499.5 M
80 394.5 L
S
GR
GS
0.149 GC
2 setlinecap
1 LJ
0.5 LW
N
80 499.5 M
81.58 499.5 L
S
GR
GS
0.149 GC
2 setlinecap
1 LJ
0.5 LW
N
80 473.148 M
81.58 473.148 L
S
GR
GS
0.149 GC
2 setlinecap
1 LJ
0.5 LW
N
80 446.796 M
81.58 446.796 L
S
GR
GS
0.149 GC
2 setlinecap
1 LJ
0.5 LW
N
80 420.444 M
81.58 420.444 L
S
GR
GS
[1 0 0 1 74.8 499.5] CT
0.149 GC
/Helvetica 16 F
GS
[1 0 0 1 0 0] CT
-9 6 moveto 
1 -1 scale
(0) t 
GR
GR
GS
[1 0 0 1 74.8 473.1481] CT
0.149 GC
/Helvetica 16 F
GS
[1 0 0 1 0 0] CT
-32 6 moveto 
1 -1 scale
(0.02) t 
GR
GR
GS
[1 0 0 1 74.8 446.7962] CT
0.149 GC
/Helvetica 16 F
GS
[1 0 0 1 0 0] CT
-32 6 moveto 
1 -1 scale
(0.04) t 
GR
GR
GS
[1 0 0 1 74.8 420.44431] CT
0.149 GC
/Helvetica 16 F
GS
[1 0 0 1 0 0] CT
-32 6 moveto 
1 -1 scale
(0.06) t 
GR
GR
GS
[0 -1 1 0 40.3 446.99994] CT
0.149 GC
/Helvetica 16 F
GS
[1 0 0 1 0 0] CT
-47.5 -4 moveto 
1 -1 scale
(Prob. density) t 
GR
GR
GS
[1 0 0 1 159.00015 392.5] CT
/Helvetica-Bold 16 F
GS
[1 0 0 1 0 0] CT
-36 -4 moveto 
1 -1 scale
(3 Targets) t 
GR
GR
GS
0.4 0.668 0.845 RC
N
99.152 499.057 M
97.556 499.057 L
97.556 499.5 L
99.152 499.5 L
100.747 499.5 L
102.343 499.5 L
102.343 499.057 L
100.747 499.057 L
cp
103.939 499.5 M
103.939 498.171 L
102.343 498.171 L
102.343 499.5 L
cp
105.535 499.5 M
105.535 498.614 L
103.939 498.614 L
103.939 499.5 L
cp
107.131 499.5 M
107.131 495.07 L
105.535 495.07 L
105.535 499.5 L
cp
108.727 499.5 M
108.727 497.285 L
107.131 497.285 L
107.131 499.5 L
cp
110.323 499.5 M
110.323 498.614 L
108.727 498.614 L
108.727 499.5 L
cp
111.919 499.5 M
111.919 495.07 L
110.323 495.07 L
110.323 499.5 L
cp
113.515 499.5 M
113.515 496.842 L
111.919 496.842 L
111.919 499.5 L
cp
115.111 499.5 M
115.111 492.854 L
113.515 492.854 L
113.515 499.5 L
cp
116.707 499.5 M
116.707 493.741 L
115.111 493.741 L
115.111 499.5 L
cp
118.303 499.5 M
118.303 493.297 L
116.707 493.297 L
116.707 499.5 L
cp
119.899 499.5 M
119.899 494.627 L
118.303 494.627 L
118.303 499.5 L
cp
121.495 499.5 M
121.495 491.525 L
119.899 491.525 L
119.899 499.5 L
cp
123.091 489.753 M
121.495 489.753 L
121.495 499.5 L
123.091 499.5 L
124.687 499.5 L
124.687 489.753 L
cp
126.283 499.5 M
126.283 489.31 L
124.687 489.31 L
124.687 499.5 L
cp
127.879 499.5 M
127.879 487.538 L
126.283 487.538 L
126.283 499.5 L
cp
129.475 499.5 M
129.475 489.31 L
127.879 489.31 L
127.879 499.5 L
cp
131.071 499.5 M
131.071 488.867 L
129.475 488.867 L
129.475 499.5 L
cp
132.667 499.5 M
132.667 487.981 L
131.071 487.981 L
131.071 499.5 L
cp
134.263 499.5 M
134.263 480.892 L
132.667 480.892 L
132.667 499.5 L
cp
135.859 499.5 M
135.859 483.108 L
134.263 483.108 L
134.263 499.5 L
cp
137.455 499.5 M
137.455 482.665 L
135.859 482.665 L
135.859 499.5 L
cp
139.051 499.5 M
139.051 478.677 L
137.455 478.677 L
137.455 499.5 L
cp
140.646 499.5 M
140.646 484.88 L
139.051 484.88 L
139.051 499.5 L
cp
142.242 499.5 M
142.242 480.892 L
140.646 480.892 L
140.646 499.5 L
cp
143.838 499.5 M
143.838 488.424 L
142.242 488.424 L
142.242 499.5 L
cp
145.434 499.5 M
145.434 490.639 L
143.838 490.639 L
143.838 499.5 L
cp
147.03 499.5 M
147.03 495.513 L
145.434 495.513 L
145.434 499.5 L
cp
148.626 499.5 M
148.626 497.728 L
147.03 497.728 L
147.03 499.5 L
cp
150.222 499.5 M
150.222 498.171 L
148.626 498.171 L
148.626 499.5 L
cp
151.818 499.5 M
151.818 499.057 L
150.222 499.057 L
150.222 499.5 L
cp
167.778 499.5 M
167.778 496.399 L
166.182 496.399 L
166.182 499.5 L
cp
169.374 499.5 M
169.374 490.196 L
167.778 490.196 L
167.778 499.5 L
cp
170.97 499.5 M
170.97 483.994 L
169.374 483.994 L
169.374 499.5 L
cp
172.566 499.5 M
172.566 468.044 L
170.97 468.044 L
170.97 499.5 L
cp
174.162 499.5 M
174.162 448.994 L
172.566 448.994 L
172.566 499.5 L
cp
175.758 499.5 M
175.758 432.158 L
174.162 432.158 L
174.162 499.5 L
cp
177.354 499.5 M
177.354 425.513 L
175.758 425.513 L
175.758 499.5 L
cp
178.949 499.5 M
178.949 394.5 L
177.354 394.5 L
177.354 499.5 L
cp
180.545 499.5 M
180.545 405.133 L
178.949 405.133 L
178.949 499.5 L
cp
182.141 499.5 M
182.141 405.576 L
180.545 405.576 L
180.545 499.5 L
cp
183.737 499.5 M
183.737 430.386 L
182.141 430.386 L
182.141 499.5 L
cp
185.333 499.5 M
185.333 438.361 L
183.737 438.361 L
183.737 499.5 L
cp
186.929 499.5 M
186.929 433.93 L
185.333 433.93 L
185.333 499.5 L
cp
188.525 499.5 M
188.525 447.665 L
186.929 447.665 L
186.929 499.5 L
cp
190.121 499.5 M
190.121 456.082 L
188.525 456.082 L
188.525 499.5 L
cp
191.717 499.5 M
191.717 457.854 L
190.121 457.854 L
190.121 499.5 L
cp
193.313 499.5 M
193.313 466.715 L
191.717 466.715 L
191.717 499.5 L
cp
194.909 499.5 M
194.909 474.69 L
193.313 474.69 L
193.313 499.5 L
cp
196.505 499.5 M
196.505 476.462 L
194.909 476.462 L
194.909 499.5 L
cp
198.101 499.5 M
198.101 478.677 L
196.505 478.677 L
196.505 499.5 L
cp
199.697 499.5 M
199.697 485.323 L
198.101 485.323 L
198.101 499.5 L
cp
201.293 499.5 M
201.293 484.88 L
199.697 484.88 L
199.697 499.5 L
cp
202.889 499.5 M
202.889 493.741 L
201.293 493.741 L
201.293 499.5 L
cp
204.485 499.5 M
204.485 489.31 L
202.889 489.31 L
202.889 499.5 L
cp
206.081 499.5 M
206.081 492.854 L
204.485 492.854 L
204.485 499.5 L
cp
207.677 499.5 M
207.677 492.411 L
206.081 492.411 L
206.081 499.5 L
cp
209.273 499.5 M
209.273 494.627 L
207.677 494.627 L
207.677 499.5 L
cp
210.869 499.5 M
210.869 494.184 L
209.273 494.184 L
209.273 499.5 L
cp
212.465 499.5 M
212.465 495.956 L
210.869 495.956 L
210.869 499.5 L
cp
214.061 499.5 M
214.061 492.854 L
212.465 492.854 L
212.465 499.5 L
cp
215.657 499.057 M
214.061 499.057 L
214.061 499.5 L
215.657 499.5 L
217.253 499.5 L
217.253 499.057 L
cp
218.848 499.5 M
218.848 498.614 L
217.253 498.614 L
217.253 499.5 L
cp
220.444 499.5 M
220.444 499.057 L
218.848 499.057 L
218.848 499.5 L
cp
222.04 499.5 M
222.04 498.614 L
220.444 498.614 L
220.444 499.5 L
cp
f
GR
GS
2 setlinecap
10.0 ML
0.5 LW
N
80 499.5 M
80 499.5 L
81.596 499.5 L
81.596 499.5 L
81.596 499.5 L
S
GR
GS
2 setlinecap
10.0 ML
0.5 LW
N
81.596 499.5 M
83.192 499.5 L
83.192 499.5 L
83.192 499.5 L
S
GR
GS
2 setlinecap
10.0 ML
0.5 LW
N
83.192 499.5 M
84.788 499.5 L
84.788 499.5 L
84.788 499.5 L
S
GR
GS
2 setlinecap
10.0 ML
0.5 LW
N
84.788 499.5 M
86.384 499.5 L
86.384 499.5 L
86.384 499.5 L
S
GR
GS
2 setlinecap
10.0 ML
0.5 LW
N
86.384 499.5 M
87.98 499.5 L
87.98 499.5 L
87.98 499.5 L
S
GR
GS
2 setlinecap
10.0 ML
0.5 LW
N
87.98 499.5 M
89.576 499.5 L
89.576 499.5 L
89.576 499.5 L
S
GR
GS
2 setlinecap
10.0 ML
0.5 LW
N
89.576 499.5 M
91.172 499.5 L
91.172 499.5 L
91.172 499.5 L
S
GR
GS
2 setlinecap
10.0 ML
0.5 LW
N
91.172 499.5 M
92.768 499.5 L
92.768 499.5 L
92.768 499.5 L
S
GR
GS
2 setlinecap
10.0 ML
0.5 LW
N
92.768 499.5 M
94.364 499.5 L
94.364 499.5 L
94.364 499.5 L
S
GR
GS
2 setlinecap
10.0 ML
0.5 LW
N
94.364 499.5 M
95.96 499.5 L
95.96 499.5 L
95.96 499.5 L
S
GR
GS
2 setlinecap
10.0 ML
0.5 LW
N
95.96 499.5 M
97.556 499.5 L
S
GR
GS
2 setlinecap
10.0 ML
0.5 LW
N
97.556 499.5 M
97.556 499.5 L
97.556 499.057 L
99.152 499.057 L
99.152 499.5 L
99.152 499.5 L
S
GR
GS
2 setlinecap
10.0 ML
0.5 LW
N
99.152 499.057 M
100.747 499.057 L
100.747 499.5 L
100.747 499.5 L
S
GR
GS
2 setlinecap
10.0 ML
0.5 LW
N
100.747 499.057 M
102.343 499.057 L
S
GR
GS
2 setlinecap
10.0 ML
0.5 LW
N
102.343 499.5 M
102.343 499.5 L
102.343 498.171 L
103.939 498.171 L
103.939 499.5 L
103.939 499.5 L
S
GR
GS
2 setlinecap
10.0 ML
0.5 LW
N
103.939 498.614 M
105.535 498.614 L
S
GR
GS
2 setlinecap
10.0 ML
0.5 LW
N
105.535 499.5 M
105.535 499.5 L
105.535 495.07 L
107.131 495.07 L
107.131 499.5 L
107.131 499.5 L
S
GR
GS
2 setlinecap
10.0 ML
0.5 LW
N
107.131 497.285 M
108.727 497.285 L
108.727 499.5 L
108.727 499.5 L
S
GR
GS
2 setlinecap
10.0 ML
0.5 LW
N
108.727 498.614 M
110.323 498.614 L
S
GR
GS
2 setlinecap
10.0 ML
0.5 LW
N
110.323 499.5 M
110.323 499.5 L
110.323 495.07 L
111.919 495.07 L
111.919 499.5 L
111.919 499.5 L
S
GR
GS
2 setlinecap
10.0 ML
0.5 LW
N
111.919 496.842 M
113.515 496.842 L
S
GR
GS
2 setlinecap
10.0 ML
0.5 LW
N
113.515 499.5 M
113.515 499.5 L
113.515 492.854 L
115.111 492.854 L
115.111 499.5 L
115.111 499.5 L
S
GR
GS
2 setlinecap
10.0 ML
0.5 LW
N
115.111 493.741 M
116.707 493.741 L
S
GR
GS
2 setlinecap
10.0 ML
0.5 LW
N
116.707 499.5 M
116.707 499.5 L
116.707 493.297 L
118.303 493.297 L
118.303 499.5 L
118.303 499.5 L
S
GR
GS
2 setlinecap
10.0 ML
0.5 LW
N
118.303 494.627 M
119.899 494.627 L
S
GR
GS
2 setlinecap
10.0 ML
0.5 LW
N
119.899 499.5 M
119.899 499.5 L
119.899 491.525 L
121.495 491.525 L
S
GR
GS
2 setlinecap
10.0 ML
0.5 LW
N
121.495 499.5 M
121.495 499.5 L
121.495 489.753 L
123.091 489.753 L
123.091 499.5 L
123.091 499.5 L
S
GR
GS
2 setlinecap
10.0 ML
0.5 LW
N
123.091 489.753 M
124.687 489.753 L
S
GR
GS
2 setlinecap
10.0 ML
0.5 LW
N
124.687 499.5 M
124.687 499.5 L
124.687 489.31 L
126.283 489.31 L
S
GR
GS
2 setlinecap
10.0 ML
0.5 LW
N
126.283 499.5 M
126.283 499.5 L
126.283 487.538 L
127.879 487.538 L
127.879 499.5 L
127.879 499.5 L
S
GR
GS
2 setlinecap
10.0 ML
0.5 LW
N
127.879 489.31 M
129.475 489.31 L
S
GR
GS
2 setlinecap
10.0 ML
0.5 LW
N
129.475 499.5 M
129.475 499.5 L
129.475 488.867 L
131.071 488.867 L
S
GR
GS
2 setlinecap
10.0 ML
0.5 LW
N
131.071 499.5 M
131.071 499.5 L
131.071 487.981 L
132.667 487.981 L
S
GR
GS
2 setlinecap
10.0 ML
0.5 LW
N
132.667 499.5 M
132.667 499.5 L
132.667 480.892 L
134.263 480.892 L
134.263 499.5 L
134.263 499.5 L
S
GR
GS
2 setlinecap
10.0 ML
0.5 LW
N
134.263 483.108 M
135.859 483.108 L
S
GR
GS
2 setlinecap
10.0 ML
0.5 LW
N
135.859 499.5 M
135.859 499.5 L
135.859 482.665 L
137.455 482.665 L
S
GR
GS
2 setlinecap
10.0 ML
0.5 LW
N
137.455 499.5 M
137.455 499.5 L
137.455 478.677 L
139.051 478.677 L
139.051 499.5 L
139.051 499.5 L
S
GR
GS
2 setlinecap
10.0 ML
0.5 LW
N
139.051 484.88 M
140.646 484.88 L
S
GR
GS
2 setlinecap
10.0 ML
0.5 LW
N
140.646 499.5 M
140.646 499.5 L
140.646 480.892 L
142.242 480.892 L
142.242 499.5 L
142.242 499.5 L
S
GR
GS
2 setlinecap
10.0 ML
0.5 LW
N
142.242 488.424 M
143.838 488.424 L
143.838 499.5 L
143.838 499.5 L
S
GR
GS
2 setlinecap
10.0 ML
0.5 LW
N
143.838 490.639 M
145.434 490.639 L
145.434 499.5 L
145.434 499.5 L
S
GR
GS
2 setlinecap
10.0 ML
0.5 LW
N
145.434 495.513 M
147.03 495.513 L
147.03 499.5 L
147.03 499.5 L
S
GR
GS
2 setlinecap
10.0 ML
0.5 LW
N
147.03 497.728 M
148.626 497.728 L
148.626 499.5 L
148.626 499.5 L
S
GR
GS
2 setlinecap
10.0 ML
0.5 LW
N
148.626 498.171 M
150.222 498.171 L
150.222 499.5 L
150.222 499.5 L
S
GR
GS
2 setlinecap
10.0 ML
0.5 LW
N
150.222 499.057 M
151.818 499.057 L
151.818 499.5 L
151.818 499.5 L
S
GR
GS
2 setlinecap
10.0 ML
0.5 LW
N
151.818 499.5 M
153.414 499.5 L
153.414 499.5 L
153.414 499.5 L
S
GR
GS
2 setlinecap
10.0 ML
0.5 LW
N
153.414 499.5 M
155.01 499.5 L
155.01 499.5 L
155.01 499.5 L
S
GR
GS
2 setlinecap
10.0 ML
0.5 LW
N
155.01 499.5 M
156.606 499.5 L
156.606 499.5 L
156.606 499.5 L
S
GR
GS
2 setlinecap
10.0 ML
0.5 LW
N
156.606 499.5 M
158.202 499.5 L
158.202 499.5 L
158.202 499.5 L
S
GR
GS
2 setlinecap
10.0 ML
0.5 LW
N
158.202 499.5 M
159.798 499.5 L
159.798 499.5 L
159.798 499.5 L
S
GR
GS
2 setlinecap
10.0 ML
0.5 LW
N
159.798 499.5 M
161.394 499.5 L
161.394 499.5 L
161.394 499.5 L
S
GR
GS
2 setlinecap
10.0 ML
0.5 LW
N
161.394 499.5 M
162.99 499.5 L
162.99 499.5 L
162.99 499.5 L
S
GR
GS
2 setlinecap
10.0 ML
0.5 LW
N
162.99 499.5 M
164.586 499.5 L
164.586 499.5 L
164.586 499.5 L
S
GR
GS
2 setlinecap
10.0 ML
0.5 LW
N
164.586 499.5 M
166.182 499.5 L
S
GR
GS
2 setlinecap
10.0 ML
0.5 LW
N
166.182 499.5 M
166.182 499.5 L
166.182 496.399 L
167.778 496.399 L
S
GR
GS
2 setlinecap
10.0 ML
0.5 LW
N
167.778 499.5 M
167.778 499.5 L
167.778 490.196 L
169.374 490.196 L
S
GR
GS
2 setlinecap
10.0 ML
0.5 LW
N
169.374 499.5 M
169.374 499.5 L
169.374 483.994 L
170.97 483.994 L
S
GR
GS
2 setlinecap
10.0 ML
0.5 LW
N
170.97 499.5 M
170.97 499.5 L
170.97 468.044 L
172.566 468.044 L
S
GR
GS
2 setlinecap
10.0 ML
0.5 LW
N
172.566 499.5 M
172.566 499.5 L
172.566 448.994 L
174.162 448.994 L
S
GR
GS
2 setlinecap
10.0 ML
0.5 LW
N
174.162 499.5 M
174.162 499.5 L
174.162 432.158 L
175.758 432.158 L
S
GR
GS
2 setlinecap
10.0 ML
0.5 LW
N
175.758 499.5 M
175.758 499.5 L
175.758 425.513 L
177.354 425.513 L
S
GR
GS
2 setlinecap
10.0 ML
0.5 LW
N
177.354 499.5 M
177.354 499.5 L
177.354 394.5 L
178.949 394.5 L
178.949 499.5 L
178.949 499.5 L
S
GR
GS
2 setlinecap
10.0 ML
0.5 LW
N
178.949 405.133 M
180.545 405.133 L
180.545 499.5 L
180.545 499.5 L
S
GR
GS
2 setlinecap
10.0 ML
0.5 LW
N
180.545 405.576 M
182.141 405.576 L
182.141 499.5 L
182.141 499.5 L
S
GR
GS
2 setlinecap
10.0 ML
0.5 LW
N
182.141 430.386 M
183.737 430.386 L
183.737 499.5 L
183.737 499.5 L
S
GR
GS
2 setlinecap
10.0 ML
0.5 LW
N
183.737 438.361 M
185.333 438.361 L
S
GR
GS
2 setlinecap
10.0 ML
0.5 LW
N
185.333 499.5 M
185.333 499.5 L
185.333 433.93 L
186.929 433.93 L
186.929 499.5 L
186.929 499.5 L
S
GR
GS
2 setlinecap
10.0 ML
0.5 LW
N
186.929 447.665 M
188.525 447.665 L
188.525 499.5 L
188.525 499.5 L
S
GR
GS
2 setlinecap
10.0 ML
0.5 LW
N
188.525 456.082 M
190.121 456.082 L
190.121 499.5 L
190.121 499.5 L
S
GR
GS
2 setlinecap
10.0 ML
0.5 LW
N
190.121 457.854 M
191.717 457.854 L
191.717 499.5 L
191.717 499.5 L
S
GR
GS
2 setlinecap
10.0 ML
0.5 LW
N
191.717 466.715 M
193.313 466.715 L
193.313 499.5 L
193.313 499.5 L
S
GR
GS
2 setlinecap
10.0 ML
0.5 LW
N
193.313 474.69 M
194.909 474.69 L
194.909 499.5 L
194.909 499.5 L
S
GR
GS
2 setlinecap
10.0 ML
0.5 LW
N
194.909 476.462 M
196.505 476.462 L
196.505 499.5 L
196.505 499.5 L
S
GR
GS
2 setlinecap
10.0 ML
0.5 LW
N
196.505 478.677 M
198.101 478.677 L
198.101 499.5 L
198.101 499.5 L
S
GR
GS
2 setlinecap
10.0 ML
0.5 LW
N
198.101 485.323 M
199.697 485.323 L
S
GR
GS
2 setlinecap
10.0 ML
0.5 LW
N
199.697 499.5 M
199.697 499.5 L
199.697 484.88 L
201.293 484.88 L
201.293 499.5 L
201.293 499.5 L
S
GR
GS
2 setlinecap
10.0 ML
0.5 LW
N
201.293 493.741 M
202.889 493.741 L
S
GR
GS
2 setlinecap
10.0 ML
0.5 LW
N
202.889 499.5 M
202.889 499.5 L
202.889 489.31 L
204.485 489.31 L
204.485 499.5 L
204.485 499.5 L
S
GR
GS
2 setlinecap
10.0 ML
0.5 LW
N
204.485 492.854 M
206.081 492.854 L
S
GR
GS
2 setlinecap
10.0 ML
0.5 LW
N
206.081 499.5 M
206.081 499.5 L
206.081 492.411 L
207.677 492.411 L
207.677 499.5 L
207.677 499.5 L
S
GR
GS
2 setlinecap
10.0 ML
0.5 LW
N
207.677 494.627 M
209.273 494.627 L
S
GR
GS
2 setlinecap
10.0 ML
0.5 LW
N
209.273 499.5 M
209.273 499.5 L
209.273 494.184 L
210.869 494.184 L
210.869 499.5 L
210.869 499.5 L
S
GR
GS
2 setlinecap
10.0 ML
0.5 LW
N
210.869 495.956 M
212.465 495.956 L
S
GR
GS
2 setlinecap
10.0 ML
0.5 LW
N
212.465 499.5 M
212.465 499.5 L
212.465 492.854 L
214.061 492.854 L
214.061 499.5 L
214.061 499.5 L
S
GR
GS
2 setlinecap
10.0 ML
0.5 LW
N
214.061 499.057 M
215.657 499.057 L
215.657 499.5 L
215.657 499.5 L
S
GR
GS
2 setlinecap
10.0 ML
0.5 LW
N
215.657 499.057 M
217.253 499.057 L
S
GR
GS
2 setlinecap
10.0 ML
0.5 LW
N
217.253 499.5 M
217.253 499.5 L
217.253 498.614 L
218.848 498.614 L
218.848 499.5 L
218.848 499.5 L
S
GR
GS
2 setlinecap
10.0 ML
0.5 LW
N
218.848 499.057 M
220.444 499.057 L
S
GR
GS
2 setlinecap
10.0 ML
0.5 LW
N
220.444 499.5 M
220.444 499.5 L
220.444 498.614 L
222.04 498.614 L
222.04 499.5 L
222.04 499.5 L
S
GR
GS
2 setlinecap
10.0 ML
0.5 LW
N
222.04 499.5 M
223.636 499.5 L
223.636 499.5 L
223.636 499.5 L
S
GR
GS
2 setlinecap
10.0 ML
0.5 LW
N
223.636 499.5 M
225.232 499.5 L
225.232 499.5 L
225.232 499.5 L
S
GR
GS
2 setlinecap
10.0 ML
0.5 LW
N
225.232 499.5 M
226.828 499.5 L
226.828 499.5 L
226.828 499.5 L
S
GR
GS
2 setlinecap
10.0 ML
0.5 LW
N
226.828 499.5 M
228.424 499.5 L
228.424 499.5 L
228.424 499.5 L
S
GR
GS
2 setlinecap
10.0 ML
0.5 LW
N
228.424 499.5 M
230.02 499.5 L
230.02 499.5 L
230.02 499.5 L
S
GR
GS
2 setlinecap
10.0 ML
0.5 LW
N
230.02 499.5 M
231.616 499.5 L
231.616 499.5 L
231.616 499.5 L
S
GR
GS
2 setlinecap
10.0 ML
0.5 LW
N
231.616 499.5 M
233.212 499.5 L
233.212 499.5 L
233.212 499.5 L
S
GR
GS
2 setlinecap
10.0 ML
0.5 LW
N
233.212 499.5 M
234.808 499.5 L
234.808 499.5 L
234.808 499.5 L
S
GR
GS
2 setlinecap
10.0 ML
0.5 LW
N
234.808 499.5 M
236.404 499.5 L
236.404 499.5 L
236.404 499.5 L
S
GR
GS
2 setlinecap
10.0 ML
0.5 LW
N
236.404 499.5 M
238 499.5 L
238 499.5 L
S
GR
GS
0.851 0.325 0.098 RC
1 LJ
2 LW
N
81.596 499.331 M
83.192 499.292 L
84.788 499.249 L
86.384 499.246 L
87.98 499.203 L
89.576 499.191 L
91.172 499.165 L
92.768 499.173 L
94.364 499.038 L
95.96 499.001 L
97.556 498.902 L
99.152 498.855 L
100.747 498.636 L
102.343 498.665 L
103.939 498.437 L
105.535 498.37 L
107.131 498.129 L
108.727 498.127 L
110.323 497.91 L
111.919 497.728 L
113.515 497.382 L
115.111 497.366 L
116.707 497.06 L
118.303 496.6 L
119.899 496.05 L
121.495 495.428 L
123.091 495.015 L
124.687 494.357 L
126.283 493.405 L
127.879 492.446 L
129.475 491.781 L
131.071 490.291 L
132.667 488.814 L
134.263 487.581 L
135.859 485.911 L
137.455 483.869 L
139.051 481.914 L
140.646 480.165 L
142.242 480.684 L
143.838 482.554 L
145.434 485.958 L
147.03 491.332 L
148.626 495.277 L
150.222 497.306 L
151.818 498.982 L
153.414 499.5 L
155.01 499.5 L
156.606 499.5 L
158.202 499.5 L
159.798 499.5 L
161.394 499.5 L
162.99 499.5 L
164.586 499.5 L
166.182 499.483 L
167.778 498.217 L
169.374 492.756 L
170.97 483.836 L
172.566 462.308 L
174.162 438.063 L
175.758 419.031 L
177.354 408.768 L
178.949 407.842 L
180.545 414.801 L
182.141 424.938 L
183.737 434.079 L
185.333 443.093 L
186.929 449.077 L
188.525 457.896 L
190.121 462.883 L
191.717 467.697 L
193.313 472.845 L
194.909 475.419 L
196.505 478.945 L
198.101 482.187 L
199.697 483.768 L
201.293 486.345 L
202.889 487.615 L
204.485 489.133 L
206.081 490.538 L
207.677 491.975 L
209.273 492.644 L
210.869 493.677 L
212.465 494.042 L
214.061 495.095 L
215.657 495.493 L
217.253 496.149 L
218.848 496.637 L
220.444 496.963 L
222.04 497.092 L
223.636 497.421 L
225.232 497.56 L
226.828 497.927 L
228.424 498.097 L
230.02 498.238 L
231.616 498.314 L
233.212 498.542 L
234.808 498.644 L
236.404 498.737 L
238 498.749 L
S
GR
GS
1 GC
N
305.5 499.5 M
463.5 499.5 L
463.5 394.5 L
305.5 394.5 L
cp
f
GR
GS
0.149 GC
2 setlinecap
1 LJ
0.5 LW
N
305.5 499.5 M
463.5 499.5 L
S
GR
GS
0.149 GC
2 setlinecap
1 LJ
0.5 LW
N
321.3 499.5 M
321.3 497.92 L
S
GR
GS
0.149 GC
2 setlinecap
1 LJ
0.5 LW
N
384.5 499.5 M
384.5 497.92 L
S
GR
GS
0.149 GC
2 setlinecap
1 LJ
0.5 LW
N
447.7 499.5 M
447.7 497.92 L
S
GR
GS
[1 0 0 1 321.29999 504.70001] CT
0.149 GC
/Helvetica 16 F
GS
[1 0 0 1 0 0] CT
-8 16 moveto 
1 -1 scale
(-2) t 
GR
GR
GS
[1 0 0 1 384.5 504.70001] CT
0.149 GC
/Helvetica 16 F
GS
[1 0 0 1 0 0] CT
-4.5 16 moveto 
1 -1 scale
(0) t 
GR
GR
GS
[1 0 0 1 447.70001 504.70001] CT
0.149 GC
/Helvetica 16 F
GS
[1 0 0 1 0 0] CT
-4.5 16 moveto 
1 -1 scale
(2) t 
GR
GR
GS
[1 0 0 1 384.50006 524.70001] CT
0.149 GC
/Helvetica 16 F
GS
[1 0 0 1 0 0] CT
-60 16 moveto 
1 -1 scale
(Reaction time \(s\)) t 
GR
GR
GS
0.149 GC
2 setlinecap
1 LJ
0.5 LW
N
305.5 499.5 M
305.5 394.5 L
S
GR
GS
0.149 GC
2 setlinecap
1 LJ
0.5 LW
N
305.5 499.5 M
307.08 499.5 L
S
GR
GS
0.149 GC
2 setlinecap
1 LJ
0.5 LW
N
305.5 469.881 M
307.08 469.881 L
S
GR
GS
0.149 GC
2 setlinecap
1 LJ
0.5 LW
N
305.5 440.262 M
307.08 440.262 L
S
GR
GS
0.149 GC
2 setlinecap
1 LJ
0.5 LW
N
305.5 410.643 M
307.08 410.643 L
S
GR
GS
[1 0 0 1 300.29999 499.5] CT
0.149 GC
/Helvetica 16 F
GS
[1 0 0 1 0 0] CT
-9 6 moveto 
1 -1 scale
(0) t 
GR
GR
GS
[1 0 0 1 300.29999 469.88104] CT
0.149 GC
/Helvetica 16 F
GS
[1 0 0 1 0 0] CT
-32 6 moveto 
1 -1 scale
(0.02) t 
GR
GR
GS
[1 0 0 1 300.29999 440.26208] CT
0.149 GC
/Helvetica 16 F
GS
[1 0 0 1 0 0] CT
-32 6 moveto 
1 -1 scale
(0.04) t 
GR
GR
GS
[1 0 0 1 300.29999 410.64313] CT
0.149 GC
/Helvetica 16 F
GS
[1 0 0 1 0 0] CT
-32 6 moveto 
1 -1 scale
(0.06) t 
GR
GR
GS
[0 -1 1 0 265.79999 446.99994] CT
0.149 GC
/Helvetica 16 F
GS
[1 0 0 1 0 0] CT
-47.5 -4 moveto 
1 -1 scale
(Prob. density) t 
GR
GR
GS
[1 0 0 1 384.50037 392.5] CT
/Helvetica-Bold 16 F
GS
[1 0 0 1 0 0] CT
-36 -4 moveto 
1 -1 scale
(4 Targets) t 
GR
GR
GS
0.4 0.668 0.845 RC
N
323.056 499.5 M
323.056 498.007 L
321.46 498.007 L
321.46 499.5 L
cp
324.652 498.505 M
323.056 498.505 L
323.056 499.5 L
324.652 499.5 L
326.247 499.5 L
326.247 498.505 L
cp
327.843 498.007 M
326.247 498.007 L
326.247 499.5 L
327.843 499.5 L
329.439 499.5 L
329.439 498.007 L
cp
331.035 499.5 M
331.035 498.505 L
329.439 498.505 L
329.439 499.5 L
cp
332.631 499.5 M
332.631 497.509 L
331.035 497.509 L
331.035 499.5 L
cp
334.227 499.5 M
334.227 499.002 L
332.631 499.002 L
332.631 499.5 L
cp
335.823 499.5 M
335.823 496.514 L
334.227 496.514 L
334.227 499.5 L
cp
337.419 499.5 M
337.419 495.021 L
335.823 495.021 L
335.823 499.5 L
cp
339.015 499.5 M
339.015 495.519 L
337.419 495.519 L
337.419 499.5 L
cp
340.611 499.5 M
340.611 494.026 L
339.015 494.026 L
339.015 499.5 L
cp
342.207 499.5 M
342.207 492.533 L
340.611 492.533 L
340.611 499.5 L
cp
343.803 499.5 M
343.803 490.045 L
342.207 490.045 L
342.207 499.5 L
cp
345.399 499.5 M
345.399 492.036 L
343.803 492.036 L
343.803 499.5 L
cp
346.995 499.5 M
346.995 489.05 L
345.399 489.05 L
345.399 499.5 L
cp
348.591 499.5 M
348.591 481.585 L
346.995 481.585 L
346.995 499.5 L
cp
350.187 499.5 M
350.187 488.552 L
348.591 488.552 L
348.591 499.5 L
cp
351.783 499.5 M
351.783 480.59 L
350.187 480.59 L
350.187 499.5 L
cp
353.379 499.5 M
353.379 487.059 L
351.783 487.059 L
351.783 499.5 L
cp
354.975 499.5 M
354.975 481.585 L
353.379 481.585 L
353.379 499.5 L
cp
356.571 499.5 M
356.571 483.576 L
354.975 483.576 L
354.975 499.5 L
cp
358.167 499.5 M
358.167 484.571 L
356.571 484.571 L
356.571 499.5 L
cp
359.763 499.5 M
359.763 479.595 L
358.167 479.595 L
358.167 499.5 L
cp
361.359 499.5 M
361.359 472.628 L
359.763 472.628 L
359.763 499.5 L
cp
362.955 499.5 M
362.955 485.566 L
361.359 485.566 L
361.359 499.5 L
cp
364.551 499.5 M
364.551 476.609 L
362.955 476.609 L
362.955 499.5 L
cp
366.146 499.5 M
366.146 477.604 L
364.551 477.604 L
364.551 499.5 L
cp
367.742 499.5 M
367.742 478.6 L
366.146 478.6 L
366.146 499.5 L
cp
369.338 499.5 M
369.338 490.045 L
367.742 490.045 L
367.742 499.5 L
cp
370.934 493.528 M
369.338 493.528 L
369.338 499.5 L
370.934 499.5 L
372.53 499.5 L
372.53 493.528 L
cp
374.126 499.5 M
374.126 497.012 L
372.53 497.012 L
372.53 499.5 L
cp
375.722 499.5 M
375.722 496.514 L
374.126 496.514 L
374.126 499.5 L
cp
377.318 499.5 M
377.318 499.002 L
375.722 499.002 L
375.722 499.5 L
cp
393.278 496.017 M
391.682 496.017 L
391.682 499.5 L
393.278 499.5 L
394.874 499.5 L
394.874 496.017 L
cp
396.47 499.5 M
396.47 491.04 L
394.874 491.04 L
394.874 499.5 L
cp
398.066 499.5 M
398.066 475.116 L
396.47 475.116 L
396.47 499.5 L
cp
399.662 499.5 M
399.662 462.675 L
398.066 462.675 L
398.066 499.5 L
cp
401.258 499.5 M
401.258 439.287 L
399.662 439.287 L
399.662 499.5 L
cp
402.854 499.5 M
402.854 421.87 L
401.258 421.87 L
401.258 499.5 L
cp
404.449 394.5 M
402.854 394.5 L
402.854 499.5 L
404.449 499.5 L
406.045 499.5 L
406.045 394.5 L
cp
407.641 499.5 M
407.641 400.472 L
406.045 400.472 L
406.045 499.5 L
cp
409.237 499.5 M
409.237 417.391 L
407.641 417.391 L
407.641 499.5 L
cp
410.833 499.5 M
410.833 411.917 L
409.237 411.917 L
409.237 499.5 L
cp
412.429 499.5 M
412.429 431.325 L
410.833 431.325 L
410.833 499.5 L
cp
414.025 499.5 M
414.025 429.334 L
412.429 429.334 L
412.429 499.5 L
cp
415.621 499.5 M
415.621 439.287 L
414.025 439.287 L
414.025 499.5 L
cp
417.217 499.5 M
417.217 454.713 L
415.621 454.713 L
415.621 499.5 L
cp
418.813 499.5 M
418.813 460.187 L
417.217 460.187 L
417.217 499.5 L
cp
420.409 499.5 M
420.409 468.149 L
418.813 468.149 L
418.813 499.5 L
cp
422.005 499.5 M
422.005 467.154 L
420.409 467.154 L
420.409 499.5 L
cp
423.601 499.5 M
423.601 476.111 L
422.005 476.111 L
422.005 499.5 L
cp
425.197 499.5 M
425.197 481.585 L
423.601 481.585 L
423.601 499.5 L
cp
426.793 499.5 M
426.793 484.073 L
425.197 484.073 L
425.197 499.5 L
cp
428.389 499.5 M
428.389 488.552 L
426.793 488.552 L
426.793 499.5 L
cp
429.985 499.5 M
429.985 489.05 L
428.389 489.05 L
428.389 499.5 L
cp
431.581 499.5 M
431.581 491.538 L
429.985 491.538 L
429.985 499.5 L
cp
433.177 499.5 M
433.177 492.533 L
431.581 492.533 L
431.581 499.5 L
cp
434.773 499.5 M
434.773 494.524 L
433.177 494.524 L
433.177 499.5 L
cp
436.369 499.5 M
436.369 493.031 L
434.773 493.031 L
434.773 499.5 L
cp
437.965 499.5 M
437.965 495.519 L
436.369 495.519 L
436.369 499.5 L
cp
439.561 499.5 M
439.561 495.021 L
437.965 495.021 L
437.965 499.5 L
cp
441.157 499.5 M
441.157 498.007 L
439.561 498.007 L
439.561 499.5 L
cp
442.753 499.5 M
442.753 499.002 L
441.157 499.002 L
441.157 499.5 L
cp
444.348 499.5 M
444.348 498.007 L
442.753 498.007 L
442.753 499.5 L
cp
445.944 499.002 M
444.348 499.002 L
444.348 499.5 L
445.944 499.5 L
447.54 499.5 L
447.54 499.002 L
cp
f
GR
GS
2 setlinecap
10.0 ML
0.5 LW
N
305.5 499.5 M
305.5 499.5 L
307.096 499.5 L
307.096 499.5 L
307.096 499.5 L
S
GR
GS
2 setlinecap
10.0 ML
0.5 LW
N
307.096 499.5 M
308.692 499.5 L
308.692 499.5 L
308.692 499.5 L
S
GR
GS
2 setlinecap
10.0 ML
0.5 LW
N
308.692 499.5 M
310.288 499.5 L
310.288 499.5 L
310.288 499.5 L
S
GR
GS
2 setlinecap
10.0 ML
0.5 LW
N
310.288 499.5 M
311.884 499.5 L
311.884 499.5 L
311.884 499.5 L
S
GR
GS
2 setlinecap
10.0 ML
0.5 LW
N
311.884 499.5 M
313.48 499.5 L
313.48 499.5 L
313.48 499.5 L
S
GR
GS
2 setlinecap
10.0 ML
0.5 LW
N
313.48 499.5 M
315.076 499.5 L
315.076 499.5 L
315.076 499.5 L
S
GR
GS
2 setlinecap
10.0 ML
0.5 LW
N
315.076 499.5 M
316.672 499.5 L
316.672 499.5 L
316.672 499.5 L
S
GR
GS
2 setlinecap
10.0 ML
0.5 LW
N
316.672 499.5 M
318.268 499.5 L
318.268 499.5 L
318.268 499.5 L
S
GR
GS
2 setlinecap
10.0 ML
0.5 LW
N
318.268 499.5 M
319.864 499.5 L
319.864 499.5 L
319.864 499.5 L
S
GR
GS
2 setlinecap
10.0 ML
0.5 LW
N
319.864 499.5 M
321.46 499.5 L
S
GR
GS
2 setlinecap
10.0 ML
0.5 LW
N
321.46 499.5 M
321.46 499.5 L
321.46 498.007 L
323.056 498.007 L
323.056 499.5 L
323.056 499.5 L
S
GR
GS
2 setlinecap
10.0 ML
0.5 LW
N
323.056 498.505 M
324.652 498.505 L
324.652 499.5 L
324.652 499.5 L
S
GR
GS
2 setlinecap
10.0 ML
0.5 LW
N
324.652 498.505 M
326.247 498.505 L
S
GR
GS
2 setlinecap
10.0 ML
0.5 LW
N
326.247 499.5 M
326.247 499.5 L
326.247 498.007 L
327.843 498.007 L
327.843 499.5 L
327.843 499.5 L
S
GR
GS
2 setlinecap
10.0 ML
0.5 LW
N
327.843 498.007 M
329.439 498.007 L
329.439 499.5 L
329.439 499.5 L
S
GR
GS
2 setlinecap
10.0 ML
0.5 LW
N
329.439 498.505 M
331.035 498.505 L
S
GR
GS
2 setlinecap
10.0 ML
0.5 LW
N
331.035 499.5 M
331.035 499.5 L
331.035 497.509 L
332.631 497.509 L
332.631 499.5 L
332.631 499.5 L
S
GR
GS
2 setlinecap
10.0 ML
0.5 LW
N
332.631 499.002 M
334.227 499.002 L
S
GR
GS
2 setlinecap
10.0 ML
0.5 LW
N
334.227 499.5 M
334.227 499.5 L
334.227 496.514 L
335.823 496.514 L
S
GR
GS
2 setlinecap
10.0 ML
0.5 LW
N
335.823 499.5 M
335.823 499.5 L
335.823 495.021 L
337.419 495.021 L
337.419 499.5 L
337.419 499.5 L
S
GR
GS
2 setlinecap
10.0 ML
0.5 LW
N
337.419 495.519 M
339.015 495.519 L
S
GR
GS
2 setlinecap
10.0 ML
0.5 LW
N
339.015 499.5 M
339.015 499.5 L
339.015 494.026 L
340.611 494.026 L
S
GR
GS
2 setlinecap
10.0 ML
0.5 LW
N
340.611 499.5 M
340.611 499.5 L
340.611 492.533 L
342.207 492.533 L
S
GR
GS
2 setlinecap
10.0 ML
0.5 LW
N
342.207 499.5 M
342.207 499.5 L
342.207 490.045 L
343.803 490.045 L
343.803 499.5 L
343.803 499.5 L
S
GR
GS
2 setlinecap
10.0 ML
0.5 LW
N
343.803 492.036 M
345.399 492.036 L
S
GR
GS
2 setlinecap
10.0 ML
0.5 LW
N
345.399 499.5 M
345.399 499.5 L
345.399 489.05 L
346.995 489.05 L
S
GR
GS
2 setlinecap
10.0 ML
0.5 LW
N
346.995 499.5 M
346.995 499.5 L
346.995 481.585 L
348.591 481.585 L
348.591 499.5 L
348.591 499.5 L
S
GR
GS
2 setlinecap
10.0 ML
0.5 LW
N
348.591 488.552 M
350.187 488.552 L
S
GR
GS
2 setlinecap
10.0 ML
0.5 LW
N
350.187 499.5 M
350.187 499.5 L
350.187 480.59 L
351.783 480.59 L
351.783 499.5 L
351.783 499.5 L
S
GR
GS
2 setlinecap
10.0 ML
0.5 LW
N
351.783 487.059 M
353.379 487.059 L
S
GR
GS
2 setlinecap
10.0 ML
0.5 LW
N
353.379 499.5 M
353.379 499.5 L
353.379 481.585 L
354.975 481.585 L
354.975 499.5 L
354.975 499.5 L
S
GR
GS
2 setlinecap
10.0 ML
0.5 LW
N
354.975 483.576 M
356.571 483.576 L
356.571 499.5 L
356.571 499.5 L
S
GR
GS
2 setlinecap
10.0 ML
0.5 LW
N
356.571 484.571 M
358.167 484.571 L
S
GR
GS
2 setlinecap
10.0 ML
0.5 LW
N
358.167 499.5 M
358.167 499.5 L
358.167 479.595 L
359.763 479.595 L
S
GR
GS
2 setlinecap
10.0 ML
0.5 LW
N
359.763 499.5 M
359.763 499.5 L
359.763 472.628 L
361.359 472.628 L
361.359 499.5 L
361.359 499.5 L
S
GR
GS
2 setlinecap
10.0 ML
0.5 LW
N
361.359 485.566 M
362.955 485.566 L
S
GR
GS
2 setlinecap
10.0 ML
0.5 LW
N
362.955 499.5 M
362.955 499.5 L
362.955 476.609 L
364.551 476.609 L
364.551 499.5 L
364.551 499.5 L
S
GR
GS
2 setlinecap
10.0 ML
0.5 LW
N
364.551 477.604 M
366.146 477.604 L
366.146 499.5 L
366.146 499.5 L
S
GR
GS
2 setlinecap
10.0 ML
0.5 LW
N
366.146 478.6 M
367.742 478.6 L
367.742 499.5 L
367.742 499.5 L
S
GR
GS
2 setlinecap
10.0 ML
0.5 LW
N
367.742 490.045 M
369.338 490.045 L
369.338 499.5 L
369.338 499.5 L
S
GR
GS
2 setlinecap
10.0 ML
0.5 LW
N
369.338 493.528 M
370.934 493.528 L
370.934 499.5 L
370.934 499.5 L
S
GR
GS
2 setlinecap
10.0 ML
0.5 LW
N
370.934 493.528 M
372.53 493.528 L
372.53 499.5 L
372.53 499.5 L
S
GR
GS
2 setlinecap
10.0 ML
0.5 LW
N
372.53 497.012 M
374.126 497.012 L
S
GR
GS
2 setlinecap
10.0 ML
0.5 LW
N
374.126 499.5 M
374.126 499.5 L
374.126 496.514 L
375.722 496.514 L
375.722 499.5 L
375.722 499.5 L
S
GR
GS
2 setlinecap
10.0 ML
0.5 LW
N
375.722 499.002 M
377.318 499.002 L
377.318 499.5 L
377.318 499.5 L
S
GR
GS
2 setlinecap
10.0 ML
0.5 LW
N
377.318 499.5 M
378.914 499.5 L
378.914 499.5 L
378.914 499.5 L
S
GR
GS
2 setlinecap
10.0 ML
0.5 LW
N
378.914 499.5 M
380.51 499.5 L
380.51 499.5 L
380.51 499.5 L
S
GR
GS
2 setlinecap
10.0 ML
0.5 LW
N
380.51 499.5 M
382.106 499.5 L
382.106 499.5 L
382.106 499.5 L
S
GR
GS
2 setlinecap
10.0 ML
0.5 LW
N
382.106 499.5 M
383.702 499.5 L
383.702 499.5 L
383.702 499.5 L
S
GR
GS
2 setlinecap
10.0 ML
0.5 LW
N
383.702 499.5 M
385.298 499.5 L
385.298 499.5 L
385.298 499.5 L
S
GR
GS
2 setlinecap
10.0 ML
0.5 LW
N
385.298 499.5 M
386.894 499.5 L
386.894 499.5 L
386.894 499.5 L
S
GR
GS
2 setlinecap
10.0 ML
0.5 LW
N
386.894 499.5 M
388.49 499.5 L
388.49 499.5 L
388.49 499.5 L
S
GR
GS
2 setlinecap
10.0 ML
0.5 LW
N
388.49 499.5 M
390.086 499.5 L
390.086 499.5 L
390.086 499.5 L
S
GR
GS
2 setlinecap
10.0 ML
0.5 LW
N
390.086 499.5 M
391.682 499.5 L
S
GR
GS
2 setlinecap
10.0 ML
0.5 LW
N
391.682 499.5 M
391.682 499.5 L
391.682 496.017 L
393.278 496.017 L
393.278 499.5 L
393.278 499.5 L
S
GR
GS
2 setlinecap
10.0 ML
0.5 LW
N
393.278 496.017 M
394.874 496.017 L
S
GR
GS
2 setlinecap
10.0 ML
0.5 LW
N
394.874 499.5 M
394.874 499.5 L
394.874 491.04 L
396.47 491.04 L
S
GR
GS
2 setlinecap
10.0 ML
0.5 LW
N
396.47 499.5 M
396.47 499.5 L
396.47 475.116 L
398.066 475.116 L
S
GR
GS
2 setlinecap
10.0 ML
0.5 LW
N
398.066 499.5 M
398.066 499.5 L
398.066 462.675 L
399.662 462.675 L
S
GR
GS
2 setlinecap
10.0 ML
0.5 LW
N
399.662 499.5 M
399.662 499.5 L
399.662 439.287 L
401.258 439.287 L
S
GR
GS
2 setlinecap
10.0 ML
0.5 LW
N
401.258 499.5 M
401.258 499.5 L
401.258 421.87 L
402.854 421.87 L
S
GR
GS
2 setlinecap
10.0 ML
0.5 LW
N
402.854 499.5 M
402.854 499.5 L
402.854 394.5 L
404.449 394.5 L
404.449 499.5 L
404.449 499.5 L
S
GR
GS
2 setlinecap
10.0 ML
0.5 LW
N
404.449 394.5 M
406.045 394.5 L
406.045 499.5 L
406.045 499.5 L
S
GR
GS
2 setlinecap
10.0 ML
0.5 LW
N
406.045 400.472 M
407.641 400.472 L
407.641 499.5 L
407.641 499.5 L
S
GR
GS
2 setlinecap
10.0 ML
0.5 LW
N
407.641 417.391 M
409.237 417.391 L
S
GR
GS
2 setlinecap
10.0 ML
0.5 LW
N
409.237 499.5 M
409.237 499.5 L
409.237 411.917 L
410.833 411.917 L
410.833 499.5 L
410.833 499.5 L
S
GR
GS
2 setlinecap
10.0 ML
0.5 LW
N
410.833 431.325 M
412.429 431.325 L
S
GR
GS
2 setlinecap
10.0 ML
0.5 LW
N
412.429 499.5 M
412.429 499.5 L
412.429 429.334 L
414.025 429.334 L
414.025 499.5 L
414.025 499.5 L
S
GR
GS
2 setlinecap
10.0 ML
0.5 LW
N
414.025 439.287 M
415.621 439.287 L
415.621 499.5 L
415.621 499.5 L
S
GR
GS
2 setlinecap
10.0 ML
0.5 LW
N
415.621 454.713 M
417.217 454.713 L
417.217 499.5 L
417.217 499.5 L
S
GR
GS
2 setlinecap
10.0 ML
0.5 LW
N
417.217 460.187 M
418.813 460.187 L
418.813 499.5 L
418.813 499.5 L
S
GR
GS
2 setlinecap
10.0 ML
0.5 LW
N
418.813 468.149 M
420.409 468.149 L
S
GR
GS
2 setlinecap
10.0 ML
0.5 LW
N
420.409 499.5 M
420.409 499.5 L
420.409 467.154 L
422.005 467.154 L
422.005 499.5 L
422.005 499.5 L
S
GR
GS
2 setlinecap
10.0 ML
0.5 LW
N
422.005 476.111 M
423.601 476.111 L
423.601 499.5 L
423.601 499.5 L
S
GR
GS
2 setlinecap
10.0 ML
0.5 LW
N
423.601 481.585 M
425.197 481.585 L
425.197 499.5 L
425.197 499.5 L
S
GR
GS
2 setlinecap
10.0 ML
0.5 LW
N
425.197 484.073 M
426.793 484.073 L
426.793 499.5 L
426.793 499.5 L
S
GR
GS
2 setlinecap
10.0 ML
0.5 LW
N
426.793 488.552 M
428.389 488.552 L
428.389 499.5 L
428.389 499.5 L
S
GR
GS
2 setlinecap
10.0 ML
0.5 LW
N
428.389 489.05 M
429.985 489.05 L
429.985 499.5 L
429.985 499.5 L
S
GR
GS
2 setlinecap
10.0 ML
0.5 LW
N
429.985 491.538 M
431.581 491.538 L
431.581 499.5 L
431.581 499.5 L
S
GR
GS
2 setlinecap
10.0 ML
0.5 LW
N
431.581 492.533 M
433.177 492.533 L
433.177 499.5 L
433.177 499.5 L
S
GR
GS
2 setlinecap
10.0 ML
0.5 LW
N
433.177 494.524 M
434.773 494.524 L
S
GR
GS
2 setlinecap
10.0 ML
0.5 LW
N
434.773 499.5 M
434.773 499.5 L
434.773 493.031 L
436.369 493.031 L
436.369 499.5 L
436.369 499.5 L
S
GR
GS
2 setlinecap
10.0 ML
0.5 LW
N
436.369 495.519 M
437.965 495.519 L
S
GR
GS
2 setlinecap
10.0 ML
0.5 LW
N
437.965 499.5 M
437.965 499.5 L
437.965 495.021 L
439.561 495.021 L
439.561 499.5 L
439.561 499.5 L
S
GR
GS
2 setlinecap
10.0 ML
0.5 LW
N
439.561 498.007 M
441.157 498.007 L
441.157 499.5 L
441.157 499.5 L
S
GR
GS
2 setlinecap
10.0 ML
0.5 LW
N
441.157 499.002 M
442.753 499.002 L
S
GR
GS
2 setlinecap
10.0 ML
0.5 LW
N
442.753 499.5 M
442.753 499.5 L
442.753 498.007 L
444.348 498.007 L
444.348 499.5 L
444.348 499.5 L
S
GR
GS
2 setlinecap
10.0 ML
0.5 LW
N
444.348 499.002 M
445.944 499.002 L
445.944 499.5 L
445.944 499.5 L
S
GR
GS
2 setlinecap
10.0 ML
0.5 LW
N
445.944 499.002 M
447.54 499.002 L
447.54 499.5 L
447.54 499.5 L
S
GR
GS
2 setlinecap
10.0 ML
0.5 LW
N
447.54 499.5 M
449.136 499.5 L
449.136 499.5 L
449.136 499.5 L
S
GR
GS
2 setlinecap
10.0 ML
0.5 LW
N
449.136 499.5 M
450.732 499.5 L
450.732 499.5 L
450.732 499.5 L
S
GR
GS
2 setlinecap
10.0 ML
0.5 LW
N
450.732 499.5 M
452.328 499.5 L
452.328 499.5 L
452.328 499.5 L
S
GR
GS
2 setlinecap
10.0 ML
0.5 LW
N
452.328 499.5 M
453.924 499.5 L
453.924 499.5 L
453.924 499.5 L
S
GR
GS
2 setlinecap
10.0 ML
0.5 LW
N
453.924 499.5 M
455.52 499.5 L
455.52 499.5 L
455.52 499.5 L
S
GR
GS
2 setlinecap
10.0 ML
0.5 LW
N
455.52 499.5 M
457.116 499.5 L
457.116 499.5 L
457.116 499.5 L
S
GR
GS
2 setlinecap
10.0 ML
0.5 LW
N
457.116 499.5 M
458.712 499.5 L
458.712 499.5 L
458.712 499.5 L
S
GR
GS
2 setlinecap
10.0 ML
0.5 LW
N
458.712 499.5 M
460.308 499.5 L
460.308 499.5 L
460.308 499.5 L
S
GR
GS
2 setlinecap
10.0 ML
0.5 LW
N
460.308 499.5 M
461.904 499.5 L
461.904 499.5 L
461.904 499.5 L
S
GR
GS
2 setlinecap
10.0 ML
0.5 LW
N
461.904 499.5 M
463.5 499.5 L
463.5 499.5 L
S
GR
GS
0.851 0.325 0.098 RC
1 LJ
2 LW
N
307.096 499.334 M
308.692 499.295 L
310.288 499.233 L
311.884 499.148 L
313.48 499.037 L
315.076 499.056 L
316.672 499.049 L
318.268 498.938 L
319.864 498.954 L
321.46 498.966 L
323.056 498.781 L
324.652 498.706 L
326.247 498.561 L
327.843 498.485 L
329.439 498.346 L
331.035 498.147 L
332.631 497.925 L
334.227 497.826 L
335.823 497.388 L
337.419 497.135 L
339.015 496.819 L
340.611 496.377 L
342.207 495.986 L
343.803 495.487 L
345.399 494.584 L
346.995 494.273 L
348.591 493.383 L
350.187 492.37 L
351.783 491.494 L
353.379 490.111 L
354.975 488.581 L
356.571 486.733 L
358.167 484.706 L
359.763 482.544 L
361.359 479.508 L
362.955 477.139 L
364.551 474.963 L
366.146 473.484 L
367.742 476.021 L
369.338 480.783 L
370.934 486.184 L
372.53 491.838 L
374.126 495.6 L
375.722 497.038 L
377.318 498.592 L
378.914 499.493 L
380.51 499.5 L
382.106 499.5 L
383.702 499.5 L
385.298 499.5 L
386.894 499.5 L
388.49 499.5 L
390.086 499.5 L
391.682 499.5 L
393.278 497.831 L
394.874 494.158 L
396.47 488.415 L
398.066 475.451 L
399.662 454.126 L
401.258 428.538 L
402.854 405.048 L
404.449 396.972 L
406.045 401.307 L
407.641 411.15 L
409.237 421.902 L
410.833 432.381 L
412.429 442.252 L
414.025 449.363 L
415.621 455.683 L
417.217 461.324 L
418.813 467.358 L
420.409 470.806 L
422.005 475.484 L
423.601 477.878 L
425.197 480.824 L
426.793 483.673 L
428.389 485.68 L
429.985 487.589 L
431.581 488.787 L
433.177 489.961 L
434.773 491.079 L
436.369 492.791 L
437.965 493.488 L
439.561 494.364 L
441.157 494.72 L
442.753 495.268 L
444.348 495.801 L
445.944 496.24 L
447.54 496.877 L
449.136 496.968 L
450.732 497.383 L
452.328 497.561 L
453.924 497.693 L
455.52 498.107 L
457.116 498.309 L
458.712 498.4 L
460.308 498.512 L
461.904 498.608 L
463.5 498.609 L
S
GR
%%Trailer
%%Pages: 1
%%EOF
