%!PS-Adobe-3.0 EPSF-3.0
%%Creator: (MATLAB, The Mathworks, Inc. Version 9.8.0.1323502 \(R2020a\). Operating System: Linux)
%%Title: /mnt/beegfs/home/LNDG/stateswitch/stsw_beh_task/hddm/figures/c0_DICcomparison.eps
%%CreationDate: 2022-02-09T18:18:22
%%Pages: (atend)
%%BoundingBox:     3     5   259   211
%%LanguageLevel: 3
%%EndComments
%%BeginProlog
%%BeginResource: procset (Apache XML Graphics Std ProcSet) 1.2 0
%%Version: 1.2 0
%%Copyright: (Copyright 2001-2003,2010 The Apache Software Foundation. License terms: http://www.apache.org/licenses/LICENSE-2.0)
/bd{bind def}bind def
/ld{load def}bd
/GR/grestore ld
/GS/gsave ld
/RM/rmoveto ld
/C/curveto ld
/t/show ld
/L/lineto ld
/ML/setmiterlimit ld
/CT/concat ld
/f/fill ld
/N/newpath ld
/S/stroke ld
/CC/setcmykcolor ld
/A/ashow ld
/cp/closepath ld
/RC/setrgbcolor ld
/LJ/setlinejoin ld
/GC/setgray ld
/LW/setlinewidth ld
/M/moveto ld
/re {4 2 roll M
1 index 0 rlineto
0 exch rlineto
neg 0 rlineto
cp } bd
/_ctm matrix def
/_tm matrix def
/BT { _ctm currentmatrix pop matrix _tm copy pop 0 0 moveto } bd
/ET { _ctm setmatrix } bd
/iTm { _ctm setmatrix _tm concat } bd
/Tm { _tm astore pop iTm 0 0 moveto } bd
/ux 0.0 def
/uy 0.0 def
/F {
  /Tp exch def
  /Tf exch def
  Tf findfont Tp scalefont setfont
  /cf Tf def  /cs Tp def
} bd
/ULS {currentpoint /uy exch def /ux exch def} bd
/ULE {
  /Tcx currentpoint pop def
  gsave
  newpath
  cf findfont cs scalefont dup
  /FontMatrix get 0 get /Ts exch def /FontInfo get dup
  /UnderlinePosition get Ts mul /To exch def
  /UnderlineThickness get Ts mul /Tt exch def
  ux uy To add moveto  Tcx uy To add lineto
  Tt setlinewidth stroke
  grestore
} bd
/OLE {
  /Tcx currentpoint pop def
  gsave
  newpath
  cf findfont cs scalefont dup
  /FontMatrix get 0 get /Ts exch def /FontInfo get dup
  /UnderlinePosition get Ts mul /To exch def
  /UnderlineThickness get Ts mul /Tt exch def
  ux uy To add cs add moveto Tcx uy To add cs add lineto
  Tt setlinewidth stroke
  grestore
} bd
/SOE {
  /Tcx currentpoint pop def
  gsave
  newpath
  cf findfont cs scalefont dup
  /FontMatrix get 0 get /Ts exch def /FontInfo get dup
  /UnderlinePosition get Ts mul /To exch def
  /UnderlineThickness get Ts mul /Tt exch def
  ux uy To add cs 10 mul 26 idiv add moveto Tcx uy To add cs 10 mul 26 idiv add lineto
  Tt setlinewidth stroke
  grestore
} bd
/QT {
/Y22 exch store
/X22 exch store
/Y21 exch store
/X21 exch store
currentpoint
/Y21 load 2 mul add 3 div exch
/X21 load 2 mul add 3 div exch
/X21 load 2 mul /X22 load add 3 div
/Y21 load 2 mul /Y22 load add 3 div
/X22 load /Y22 load curveto
} bd
/SSPD {
dup length /d exch dict def
{
/v exch def
/k exch def
currentpagedevice k known {
/cpdv currentpagedevice k get def
v cpdv ne {
/upd false def
/nullv v type /nulltype eq def
/nullcpdv cpdv type /nulltype eq def
nullv nullcpdv or
{
/upd true def
} {
/sametype v type cpdv type eq def
sametype {
v type /arraytype eq {
/vlen v length def
/cpdvlen cpdv length def
vlen cpdvlen eq {
0 1 vlen 1 sub {
/i exch def
/obj v i get def
/cpdobj cpdv i get def
obj cpdobj ne {
/upd true def
exit
} if
} for
} {
/upd true def
} ifelse
} {
v type /dicttype eq {
v {
/dv exch def
/dk exch def
/cpddv cpdv dk get def
dv cpddv ne {
/upd true def
exit
} if
} forall
} {
/upd true def
} ifelse
} ifelse
} if
} ifelse
upd true eq {
d k v put
} if
} if
} if
} forall
d length 0 gt {
d setpagedevice
} if
} bd
/RE { % /NewFontName [NewEncodingArray] /FontName RE -
  findfont dup length dict begin
  {
    1 index /FID ne
    {def} {pop pop} ifelse
  } forall
  /Encoding exch def
  /FontName 1 index def
  currentdict definefont pop
  end
} bind def
%%EndResource
%%BeginResource: procset (Apache XML Graphics EPS ProcSet) 1.0 0
%%Version: 1.0 0
%%Copyright: (Copyright 2002-2003 The Apache Software Foundation. License terms: http://www.apache.org/licenses/LICENSE-2.0)
/BeginEPSF { %def
/b4_Inc_state save def         % Save state for cleanup
/dict_count countdictstack def % Count objects on dict stack
/op_count count 1 sub def      % Count objects on operand stack
userdict begin                 % Push userdict on dict stack
/showpage { } def              % Redefine showpage, { } = null proc
0 setgray 0 setlinecap         % Prepare graphics state
1 setlinewidth 0 setlinejoin
10 setmiterlimit [ ] 0 setdash newpath
/languagelevel where           % If level not equal to 1 then
{pop languagelevel             % set strokeadjust and
1 ne                           % overprint to their defaults.
{false setstrokeadjust false setoverprint
} if
} if
} bd
/EndEPSF { %def
count op_count sub {pop} repeat            % Clean up stacks
countdictstack dict_count sub {end} repeat
b4_Inc_state restore
} bd
%%EndResource
%FOPBeginFontDict
%%IncludeResource: font Courier-Oblique
%%IncludeResource: font Courier-BoldOblique
%%IncludeResource: font Courier-Bold
%%IncludeResource: font ZapfDingbats
%%IncludeResource: font Symbol
%%IncludeResource: font Helvetica
%%IncludeResource: font Helvetica-Oblique
%%IncludeResource: font Helvetica-Bold
%%IncludeResource: font Helvetica-BoldOblique
%%IncludeResource: font Times-Roman
%%IncludeResource: font Times-Italic
%%IncludeResource: font Times-Bold
%%IncludeResource: font Times-BoldItalic
%%IncludeResource: font Courier
%FOPEndFontDict
%%BeginResource: encoding WinAnsiEncoding
/WinAnsiEncoding [
/.notdef /.notdef /.notdef /.notdef /.notdef
/.notdef /.notdef /.notdef /.notdef /.notdef
/.notdef /.notdef /.notdef /.notdef /.notdef
/.notdef /.notdef /.notdef /.notdef /.notdef
/.notdef /.notdef /.notdef /.notdef /.notdef
/.notdef /.notdef /.notdef /.notdef /.notdef
/.notdef /.notdef /space /exclam /quotedbl
/numbersign /dollar /percent /ampersand /quotesingle
/parenleft /parenright /asterisk /plus /comma
/hyphen /period /slash /zero /one
/two /three /four /five /six
/seven /eight /nine /colon /semicolon
/less /equal /greater /question /at
/A /B /C /D /E
/F /G /H /I /J
/K /L /M /N /O
/P /Q /R /S /T
/U /V /W /X /Y
/Z /bracketleft /backslash /bracketright /asciicircum
/underscore /quoteleft /a /b /c
/d /e /f /g /h
/i /j /k /l /m
/n /o /p /q /r
/s /t /u /v /w
/x /y /z /braceleft /bar
/braceright /asciitilde /bullet /Euro /bullet
/quotesinglbase /florin /quotedblbase /ellipsis /dagger
/daggerdbl /circumflex /perthousand /Scaron /guilsinglleft
/OE /bullet /Zcaron /bullet /bullet
/quoteleft /quoteright /quotedblleft /quotedblright /bullet
/endash /emdash /asciitilde /trademark /scaron
/guilsinglright /oe /bullet /zcaron /Ydieresis
/space /exclamdown /cent /sterling /currency
/yen /brokenbar /section /dieresis /copyright
/ordfeminine /guillemotleft /logicalnot /sfthyphen /registered
/macron /degree /plusminus /twosuperior /threesuperior
/acute /mu /paragraph /middot /cedilla
/onesuperior /ordmasculine /guillemotright /onequarter /onehalf
/threequarters /questiondown /Agrave /Aacute /Acircumflex
/Atilde /Adieresis /Aring /AE /Ccedilla
/Egrave /Eacute /Ecircumflex /Edieresis /Igrave
/Iacute /Icircumflex /Idieresis /Eth /Ntilde
/Ograve /Oacute /Ocircumflex /Otilde /Odieresis
/multiply /Oslash /Ugrave /Uacute /Ucircumflex
/Udieresis /Yacute /Thorn /germandbls /agrave
/aacute /acircumflex /atilde /adieresis /aring
/ae /ccedilla /egrave /eacute /ecircumflex
/edieresis /igrave /iacute /icircumflex /idieresis
/eth /ntilde /ograve /oacute /ocircumflex
/otilde /odieresis /divide /oslash /ugrave
/uacute /ucircumflex /udieresis /yacute /thorn
/ydieresis
] def
%%EndResource
%FOPBeginFontReencode
/Courier-Oblique findfont
dup length dict begin
  {1 index /FID ne {def} {pop pop} ifelse} forall
  /Encoding WinAnsiEncoding def
  currentdict
end
/Courier-Oblique exch definefont pop
/Courier-BoldOblique findfont
dup length dict begin
  {1 index /FID ne {def} {pop pop} ifelse} forall
  /Encoding WinAnsiEncoding def
  currentdict
end
/Courier-BoldOblique exch definefont pop
/Courier-Bold findfont
dup length dict begin
  {1 index /FID ne {def} {pop pop} ifelse} forall
  /Encoding WinAnsiEncoding def
  currentdict
end
/Courier-Bold exch definefont pop
/Helvetica findfont
dup length dict begin
  {1 index /FID ne {def} {pop pop} ifelse} forall
  /Encoding WinAnsiEncoding def
  currentdict
end
/Helvetica exch definefont pop
/Helvetica-Oblique findfont
dup length dict begin
  {1 index /FID ne {def} {pop pop} ifelse} forall
  /Encoding WinAnsiEncoding def
  currentdict
end
/Helvetica-Oblique exch definefont pop
/Helvetica-Bold findfont
dup length dict begin
  {1 index /FID ne {def} {pop pop} ifelse} forall
  /Encoding WinAnsiEncoding def
  currentdict
end
/Helvetica-Bold exch definefont pop
/Helvetica-BoldOblique findfont
dup length dict begin
  {1 index /FID ne {def} {pop pop} ifelse} forall
  /Encoding WinAnsiEncoding def
  currentdict
end
/Helvetica-BoldOblique exch definefont pop
/Times-Roman findfont
dup length dict begin
  {1 index /FID ne {def} {pop pop} ifelse} forall
  /Encoding WinAnsiEncoding def
  currentdict
end
/Times-Roman exch definefont pop
/Times-Italic findfont
dup length dict begin
  {1 index /FID ne {def} {pop pop} ifelse} forall
  /Encoding WinAnsiEncoding def
  currentdict
end
/Times-Italic exch definefont pop
/Times-Bold findfont
dup length dict begin
  {1 index /FID ne {def} {pop pop} ifelse} forall
  /Encoding WinAnsiEncoding def
  currentdict
end
/Times-Bold exch definefont pop
/Times-BoldItalic findfont
dup length dict begin
  {1 index /FID ne {def} {pop pop} ifelse} forall
  /Encoding WinAnsiEncoding def
  currentdict
end
/Times-BoldItalic exch definefont pop
/Courier findfont
dup length dict begin
  {1 index /FID ne {def} {pop pop} ifelse} forall
  /Encoding WinAnsiEncoding def
  currentdict
end
/Courier exch definefont pop
%FOPEndFontReencode
%%EndProlog
%%Page: 1 1
%%PageBoundingBox: 0 0 283 227
%%BeginPageSetup
[1 0 0 -1 0 227] CT
%%EndPageSetup
GS
[1.00164 0 0 0.99899 0 0.22835] CT
N
0 0 M
283 0 L
283 227 L
0 227 L
0 0 L
cp
clip
1 GC
N
0 0 283 227 re
f
GR
GS
[1.00164 0 0 0.99899 0 0.22835] CT
1 GC
N
0 0 283 227 re
f
GR
GS
[1.00164 0 0 0.99899 0 0.22835] CT
1 GC
N
105 199 M
256 199 L
256 17 L
105 17 L
cp
f
GR
GS
[1.00164 0 0 0.99899 0 0.22835] CT
0.775 GC
[1 3] 0 setdash
2 LJ
0.5 LW
N
108.447 199 M
108.447 17 L
S
GR
GS
[1.00164 0 0 0.99899 0 0.22835] CT
0.775 GC
[1 3] 0 setdash
2 LJ
0.5 LW
N
116.032 199 M
116.032 17 L
S
GR
GS
[1.00164 0 0 0.99899 0 0.22835] CT
0.775 GC
[1 3] 0 setdash
2 LJ
0.5 LW
N
123.616 199 M
123.616 17 L
S
GR
GS
[1.00164 0 0 0.99899 0 0.22835] CT
0.775 GC
[1 3] 0 setdash
2 LJ
0.5 LW
N
131.201 199 M
131.201 17 L
S
GR
GS
[1.00164 0 0 0.99899 0 0.22835] CT
0.775 GC
[1 3] 0 setdash
2 LJ
0.5 LW
N
138.785 199 M
138.785 17 L
S
GR
GS
[1.00164 0 0 0.99899 0 0.22835] CT
0.775 GC
[1 3] 0 setdash
2 LJ
0.5 LW
N
146.37 199 M
146.37 17 L
S
GR
GS
[1.00164 0 0 0.99899 0 0.22835] CT
0.775 GC
[1 3] 0 setdash
2 LJ
0.5 LW
N
153.954 199 M
153.954 17 L
S
GR
GS
[1.00164 0 0 0.99899 0 0.22835] CT
0.775 GC
[1 3] 0 setdash
2 LJ
0.5 LW
N
161.539 199 M
161.539 17 L
S
GR
GS
[1.00164 0 0 0.99899 0 0.22835] CT
0.775 GC
[1 3] 0 setdash
2 LJ
0.5 LW
N
169.123 199 M
169.123 17 L
S
GR
GS
[1.00164 0 0 0.99899 0 0.22835] CT
0.775 GC
[1 3] 0 setdash
2 LJ
0.5 LW
N
176.708 199 M
176.708 17 L
S
GR
GS
[1.00164 0 0 0.99899 0 0.22835] CT
0.775 GC
[1 3] 0 setdash
2 LJ
0.5 LW
N
184.292 199 M
184.292 17 L
S
GR
GS
[1.00164 0 0 0.99899 0 0.22835] CT
0.775 GC
[1 3] 0 setdash
2 LJ
0.5 LW
N
191.877 199 M
191.877 17 L
S
GR
GS
[1.00164 0 0 0.99899 0 0.22835] CT
0.775 GC
[1 3] 0 setdash
2 LJ
0.5 LW
N
199.461 199 M
199.461 17 L
S
GR
GS
[1.00164 0 0 0.99899 0 0.22835] CT
0.775 GC
[1 3] 0 setdash
2 LJ
0.5 LW
N
207.046 199 M
207.046 17 L
S
GR
GS
[1.00164 0 0 0.99899 0 0.22835] CT
0.775 GC
[1 3] 0 setdash
2 LJ
0.5 LW
N
214.63 199 M
214.63 17 L
S
GR
GS
[1.00164 0 0 0.99899 0 0.22835] CT
0.775 GC
[1 3] 0 setdash
2 LJ
0.5 LW
N
222.215 199 M
222.215 17 L
S
GR
GS
[1.00164 0 0 0.99899 0 0.22835] CT
0.775 GC
[1 3] 0 setdash
2 LJ
0.5 LW
N
229.799 199 M
229.799 17 L
S
GR
GS
[1.00164 0 0 0.99899 0 0.22835] CT
0.775 GC
[1 3] 0 setdash
2 LJ
0.5 LW
N
237.384 199 M
237.384 17 L
S
GR
GS
[1.00164 0 0 0.99899 0 0.22835] CT
0.775 GC
[1 3] 0 setdash
2 LJ
0.5 LW
N
244.968 199 M
244.968 17 L
S
GR
GS
[1.00164 0 0 0.99899 0 0.22835] CT
0.775 GC
[1 3] 0 setdash
2 LJ
0.5 LW
N
252.553 199 M
252.553 17 L
S
GR
GS
[1.00164 0 0 0.99899 0 0.22835] CT
0.775 GC
[1 3] 0 setdash
2 LJ
0.5 LW
N
256 199 M
105 199 L
S
GR
GS
[1.00164 0 0 0.99899 0 0.22835] CT
0.775 GC
[1 3] 0 setdash
2 LJ
0.5 LW
N
256 187.625 M
105 187.625 L
S
GR
GS
[1.00164 0 0 0.99899 0 0.22835] CT
0.775 GC
[1 3] 0 setdash
2 LJ
0.5 LW
N
256 176.25 M
105 176.25 L
S
GR
GS
[1.00164 0 0 0.99899 0 0.22835] CT
0.775 GC
[1 3] 0 setdash
2 LJ
0.5 LW
N
256 164.875 M
105 164.875 L
S
GR
GS
[1.00164 0 0 0.99899 0 0.22835] CT
0.775 GC
[1 3] 0 setdash
2 LJ
0.5 LW
N
256 153.5 M
105 153.5 L
S
GR
GS
[1.00164 0 0 0.99899 0 0.22835] CT
0.775 GC
[1 3] 0 setdash
2 LJ
0.5 LW
N
256 142.125 M
105 142.125 L
S
GR
GS
[1.00164 0 0 0.99899 0 0.22835] CT
0.775 GC
[1 3] 0 setdash
2 LJ
0.5 LW
N
256 130.75 M
105 130.75 L
S
GR
GS
[1.00164 0 0 0.99899 0 0.22835] CT
0.775 GC
[1 3] 0 setdash
2 LJ
0.5 LW
N
256 119.375 M
105 119.375 L
S
GR
GS
[1.00164 0 0 0.99899 0 0.22835] CT
0.775 GC
[1 3] 0 setdash
2 LJ
0.5 LW
N
256 108 M
105 108 L
S
GR
GS
[1.00164 0 0 0.99899 0 0.22835] CT
0.775 GC
[1 3] 0 setdash
2 LJ
0.5 LW
N
256 96.625 M
105 96.625 L
S
GR
GS
[1.00164 0 0 0.99899 0 0.22835] CT
0.775 GC
[1 3] 0 setdash
2 LJ
0.5 LW
N
256 85.25 M
105 85.25 L
S
GR
GS
[1.00164 0 0 0.99899 0 0.22835] CT
0.775 GC
[1 3] 0 setdash
2 LJ
0.5 LW
N
256 73.875 M
105 73.875 L
S
GR
GS
[1.00164 0 0 0.99899 0 0.22835] CT
0.775 GC
[1 3] 0 setdash
2 LJ
0.5 LW
N
256 62.5 M
105 62.5 L
S
GR
GS
[1.00164 0 0 0.99899 0 0.22835] CT
0.775 GC
[1 3] 0 setdash
2 LJ
0.5 LW
N
256 51.125 M
105 51.125 L
S
GR
GS
[1.00164 0 0 0.99899 0 0.22835] CT
0.775 GC
[1 3] 0 setdash
2 LJ
0.5 LW
N
256 39.75 M
105 39.75 L
S
GR
GS
[1.00164 0 0 0.99899 0 0.22835] CT
0.775 GC
[1 3] 0 setdash
2 LJ
0.5 LW
N
256 28.375 M
105 28.375 L
S
GR
GS
[1.00164 0 0 0.99899 0 0.22835] CT
0.775 GC
[1 3] 0 setdash
2 LJ
0.5 LW
N
256 17 M
105 17 L
S
GR
GS
[1.00164 0 0 0.99899 0 0.22835] CT
0.149 GC
1 LJ
0.5 LW
N
105 17 M
256 17 L
S
GR
GS
[1.00164 0 0 0.99899 0 0.22835] CT
N
110.516 17 M
110.516 83.612 L
116.032 83.612 L
116.032 17 L
cp
148.438 17 M
148.438 136.233 L
153.954 136.233 L
153.954 17 L
cp
186.361 17 M
186.361 169.994 L
191.877 169.994 L
191.877 17 L
cp
224.283 17 M
224.283 185.714 L
229.799 185.714 L
229.799 17 L
cp
f
GR
GS
[1.00164 0 0 0.99899 0 0.22835] CT
10.0 ML
0.5 LW
N
110.516 17 M
110.516 83.612 L
116.032 83.612 L
116.032 17 L
cp
S
GR
GS
[1.00164 0 0 0.99899 0 0.22835] CT
10.0 ML
0.5 LW
N
148.438 17 M
148.438 136.233 L
153.954 136.233 L
153.954 17 L
cp
S
GR
GS
[1.00164 0 0 0.99899 0 0.22835] CT
10.0 ML
0.5 LW
N
186.361 17 M
186.361 169.994 L
191.877 169.994 L
191.877 17 L
cp
S
GR
GS
[1.00164 0 0 0.99899 0 0.22835] CT
10.0 ML
0.5 LW
N
224.283 17 M
224.283 185.714 L
229.799 185.714 L
229.799 17 L
cp
S
GR
GS
[1.00164 0 0 0.99899 0 0.22835] CT
0.502 GC
N
117.411 17 M
117.411 59.019 L
122.927 59.019 L
122.927 17 L
cp
155.333 17 M
155.333 107.158 L
160.849 107.158 L
160.849 17 L
cp
193.256 17 M
193.256 146.311 L
198.772 146.311 L
198.772 17 L
cp
231.178 17 M
231.178 157.094 L
236.694 157.094 L
236.694 17 L
cp
f
GR
GS
[1.00164 0 0 0.99899 0 0.22835] CT
0.502 GC
10.0 ML
0.5 LW
N
117.411 17 M
117.411 59.019 L
122.927 59.019 L
122.927 17 L
cp
S
GR
GS
[1.00164 0 0 0.99899 0 0.22835] CT
0.502 GC
10.0 ML
0.5 LW
N
155.333 17 M
155.333 107.158 L
160.849 107.158 L
160.849 17 L
cp
S
GR
GS
[1.00164 0 0 0.99899 0 0.22835] CT
0.502 GC
10.0 ML
0.5 LW
N
193.256 17 M
193.256 146.311 L
198.772 146.311 L
198.772 17 L
cp
S
GR
GS
[1.00164 0 0 0.99899 0 0.22835] CT
0.502 GC
10.0 ML
0.5 LW
N
231.178 17 M
231.178 157.094 L
236.694 157.094 L
236.694 17 L
cp
S
GR
GS
[1.00164 0 0 0.99899 0 0.22835] CT
0.929 0.694 0.125 RC
N
124.306 17 M
124.306 41.479 L
129.822 41.479 L
129.822 17 L
cp
162.228 17 M
162.228 89.481 L
167.744 89.481 L
167.744 17 L
cp
200.151 17 M
200.151 107.135 L
205.667 107.135 L
205.667 17 L
cp
238.073 17 M
238.073 120.831 L
243.589 120.831 L
243.589 17 L
cp
f
GR
GS
[1.00164 0 0 0.99899 0 0.22835] CT
10.0 ML
0.5 LW
N
124.306 17 M
124.306 41.479 L
129.822 41.479 L
129.822 17 L
cp
S
GR
GS
[1.00164 0 0 0.99899 0 0.22835] CT
10.0 ML
0.5 LW
N
162.228 17 M
162.228 89.481 L
167.744 89.481 L
167.744 17 L
cp
S
GR
GS
[1.00164 0 0 0.99899 0 0.22835] CT
10.0 ML
0.5 LW
N
200.151 17 M
200.151 107.135 L
205.667 107.135 L
205.667 17 L
cp
S
GR
GS
[1.00164 0 0 0.99899 0 0.22835] CT
10.0 ML
0.5 LW
N
238.073 17 M
238.073 120.831 L
243.589 120.831 L
243.589 17 L
cp
S
GR
GS
[1.00164 0 0 0.99899 0 0.22835] CT
0.494 0.184 0.557 RC
N
131.201 17 M
131.201 37.475 L
136.717 37.475 L
136.717 17 L
cp
169.123 17 M
169.123 96.807 L
174.639 96.807 L
174.639 17 L
cp
207.046 17 M
207.046 116.281 L
212.562 116.281 L
212.562 17 L
cp
244.968 17 M
244.968 133.594 L
250.484 133.594 L
250.484 17 L
cp
f
GR
GS
[1.00164 0 0 0.99899 0 0.22835] CT
10.0 ML
0.5 LW
N
131.201 17 M
131.201 37.475 L
136.717 37.475 L
136.717 17 L
cp
S
GR
GS
[1.00164 0 0 0.99899 0 0.22835] CT
10.0 ML
0.5 LW
N
169.123 17 M
169.123 96.807 L
174.639 96.807 L
174.639 17 L
cp
S
GR
GS
[1.00164 0 0 0.99899 0 0.22835] CT
10.0 ML
0.5 LW
N
207.046 17 M
207.046 116.281 L
212.562 116.281 L
212.562 17 L
cp
S
GR
GS
[1.00164 0 0 0.99899 0 0.22835] CT
10.0 ML
0.5 LW
N
244.968 17 M
244.968 133.594 L
250.484 133.594 L
250.484 17 L
cp
S
GR
GS
[1.00164 0 0 0.99899 0 0.22835] CT
0.149 GC
2 setlinecap
1 LJ
0.5 LW
N
105 199 M
256 199 L
S
GR
GS
[1.00164 0 0 0.99899 0 0.22835] CT
0.149 GC
2 setlinecap
1 LJ
0.5 LW
N
105 17 M
256 17 L
S
GR
GS
[1.00164 0 0 0.99899 0 0.22835] CT
0.149 GC
2 setlinecap
1 LJ
0.5 LW
N
123.616 199 M
123.616 197.18 L
S
GR
GS
[1.00164 0 0 0.99899 0 0.22835] CT
0.149 GC
2 setlinecap
1 LJ
0.5 LW
N
161.539 199 M
161.539 197.18 L
S
GR
GS
[1.00164 0 0 0.99899 0 0.22835] CT
0.149 GC
2 setlinecap
1 LJ
0.5 LW
N
199.461 199 M
199.461 197.18 L
S
GR
GS
[1.00164 0 0 0.99899 0 0.22835] CT
0.149 GC
2 setlinecap
1 LJ
0.5 LW
N
237.384 199 M
237.384 197.18 L
S
GR
GS
[1.00164 0 0 0.99899 0 0.22835] CT
0.149 GC
2 setlinecap
1 LJ
0.5 LW
N
123.616 17 M
123.616 18.82 L
S
GR
GS
[1.00164 0 0 0.99899 0 0.22835] CT
0.149 GC
2 setlinecap
1 LJ
0.5 LW
N
161.539 17 M
161.539 18.82 L
S
GR
GS
[1.00164 0 0 0.99899 0 0.22835] CT
0.149 GC
2 setlinecap
1 LJ
0.5 LW
N
199.461 17 M
199.461 18.82 L
S
GR
GS
[1.00164 0 0 0.99899 0 0.22835] CT
0.149 GC
2 setlinecap
1 LJ
0.5 LW
N
237.384 17 M
237.384 18.82 L
S
GR
GS
[1.00164 0 0 0.99899 123.81937 204.62254] CT
0.149 GC
/Helvetica 18 F
GS
[1 0 0 1 0 0] CT
-13 17 moveto 
1 -1 scale
(+v) t 
GR
GR
GS
[1.00164 0 0 0.99899 161.804 204.62254] CT
0.149 GC
/Helvetica 18 F
GS
[1 0 0 1 0 0] CT
-18.5 17 moveto 
1 -1 scale
(+va) t 
GR
GR
GS
[1.00164 0 0 0.99899 199.78861 204.62254] CT
0.149 GC
/Helvetica 18 F
GS
[1 0 0 1 0 0] CT
-16.5 17 moveto 
1 -1 scale
(+vt) t 
GR
GR
GS
[1.00164 0 0 0.99899 237.77325 204.62254] CT
0.149 GC
/Helvetica 18 F
GS
[1 0 0 1 0 0] CT
-22 17 moveto 
1 -1 scale
(+vat) t 
GR
GR
GS
[1.00164 0 0 0.99899 0 0.22835] CT
0.149 GC
2 setlinecap
1 LJ
0.5 LW
N
105 199 M
105 17 L
S
GR
GS
[1.00164 0 0 0.99899 0 0.22835] CT
0.149 GC
2 setlinecap
1 LJ
0.5 LW
N
256 199 M
256 17 L
S
GR
GS
[1.00164 0 0 0.99899 0 0.22835] CT
0.149 GC
2 setlinecap
1 LJ
0.5 LW
N
105 153.5 M
106.82 153.5 L
S
GR
GS
[1.00164 0 0 0.99899 0 0.22835] CT
0.149 GC
2 setlinecap
1 LJ
0.5 LW
N
105 62.5 M
106.82 62.5 L
S
GR
GS
[1.00164 0 0 0.99899 0 0.22835] CT
0.149 GC
2 setlinecap
1 LJ
0.5 LW
N
256 153.5 M
254.18 153.5 L
S
GR
GS
[1.00164 0 0 0.99899 0 0.22835] CT
0.149 GC
2 setlinecap
1 LJ
0.5 LW
N
256 62.5 M
254.18 62.5 L
S
GR
GS
[1.00164 0 0 0.99899 99.56318 153.57394] CT
0.149 GC
/Helvetica 18 F
GS
[1 0 0 1 0 0] CT
-53 6 moveto 
1 -1 scale
(-6000) t 
GR
GR
GS
[1.00164 0 0 0.99899 99.56318 62.66548] CT
0.149 GC
/Helvetica 18 F
GS
[1 0 0 1 0 0] CT
-53 6 moveto 
1 -1 scale
(-2000) t 
GR
GR
GS
[0 -0.99899 1.00164 0 44.47288 108.11962] CT
0.149 GC
/Helvetica 18 F
GS
[1 0 0 1 0 0] CT
-64.5 -27 moveto 
1 -1 scale
(DIC difference) t 
GR
GR
GS
[0 -0.99899 1.00164 0 44.47288 108.11962] CT
0.149 GC
/Helvetica 18 F
GS
[1 0 0 1 0 0] CT
-71.5 -5 moveto 
1 -1 scale
(from null model) t 
GR
GR
GS
[1.00164 0 0 0.99899 149.2446 157.49168] CT
/Helvetica 7 F
GS
[1 0 0 1 0 0] CT
0 2.5 moveto 
1 -1 scale
(YA: EEG) t 
GR
GR
GS
[1.00164 0 0 0.99899 0 0.22835] CT
N
146 160.756 M
146 154.087 L
116 154.087 L
116 160.756 L
cp
f
GR
GS
[1.00164 0 0 0.99899 0 0.22835] CT
10.0 ML
0.5 LW
N
116 160.756 M
116 154.087 L
146 154.087 L
146 160.756 L
cp
S
GR
GS
[1.00164 0 0 0.99899 149.2446 166.86779] CT
/Helvetica 7 F
GS
[1 0 0 1 0 0] CT
0 2.5 moveto 
1 -1 scale
(YA: MRI) t 
GR
GR
GS
[1.00164 0 0 0.99899 0 0.22835] CT
0.502 GC
N
146 170.142 M
146 163.473 L
116 163.473 L
116 170.142 L
cp
f
GR
GS
[1.00164 0 0 0.99899 0 0.22835] CT
0.502 GC
10.0 ML
0.5 LW
N
116 170.142 M
116 163.473 L
146 163.473 L
146 170.142 L
cp
S
GR
GS
[1.00164 0 0 0.99899 149.2446 176.24387] CT
/Helvetica 7 F
GS
[1 0 0 1 0 0] CT
0 2.5 moveto 
1 -1 scale
(OA: EEG) t 
GR
GR
GS
[1.00164 0 0 0.99899 0 0.22835] CT
0.929 0.694 0.125 RC
N
146 179.527 M
146 172.858 L
116 172.858 L
116 179.527 L
cp
f
GR
GS
[1.00164 0 0 0.99899 0 0.22835] CT
10.0 ML
0.5 LW
N
116 179.527 M
116 172.858 L
146 172.858 L
146 179.527 L
cp
S
GR
GS
[1.00164 0 0 0.99899 149.2446 185.61998] CT
/Helvetica 7 F
GS
[1 0 0 1 0 0] CT
0 2.5 moveto 
1 -1 scale
(OA: MRI) t 
GR
GR
GS
[1.00164 0 0 0.99899 0 0.22835] CT
0.494 0.184 0.557 RC
N
146 188.913 M
146 182.244 L
116 182.244 L
116 188.913 L
cp
f
GR
GS
[1.00164 0 0 0.99899 0 0.22835] CT
10.0 ML
0.5 LW
N
116 188.913 M
116 182.244 L
146 182.244 L
146 188.913 L
cp
S
GR
%%Trailer
%%Pages: 1
%%EOF
