%!PS-Adobe-3.0 EPSF-3.0
%%Creator: (MATLAB, The Mathworks, Inc. Version 9.8.0.1323502 \(R2020a\). Operating System: Mac OS X)
%%Title: /Users/kosciessa/Volumes/tardis/LNDG/stateswitch/stsw_beh_task/hddm/figures/D_compareYAOA_vat_linearEffects.eps
%%CreationDate: 2022-02-10T11:32:54
%%Pages: (atend)
%%BoundingBox:    84     0   927   280
%%LanguageLevel: 3
%%EndComments
%%BeginProlog
%%BeginResource: procset (Apache XML Graphics Std ProcSet) 1.2 0
%%Version: 1.2 0
%%Copyright: (Copyright 2001-2003,2010 The Apache Software Foundation. License terms: http://www.apache.org/licenses/LICENSE-2.0)
/bd{bind def}bind def
/ld{load def}bd
/GR/grestore ld
/GS/gsave ld
/RM/rmoveto ld
/C/curveto ld
/t/show ld
/L/lineto ld
/ML/setmiterlimit ld
/CT/concat ld
/f/fill ld
/N/newpath ld
/S/stroke ld
/CC/setcmykcolor ld
/A/ashow ld
/cp/closepath ld
/RC/setrgbcolor ld
/LJ/setlinejoin ld
/GC/setgray ld
/LW/setlinewidth ld
/M/moveto ld
/re {4 2 roll M
1 index 0 rlineto
0 exch rlineto
neg 0 rlineto
cp } bd
/_ctm matrix def
/_tm matrix def
/BT { _ctm currentmatrix pop matrix _tm copy pop 0 0 moveto } bd
/ET { _ctm setmatrix } bd
/iTm { _ctm setmatrix _tm concat } bd
/Tm { _tm astore pop iTm 0 0 moveto } bd
/ux 0.0 def
/uy 0.0 def
/F {
  /Tp exch def
  /Tf exch def
  Tf findfont Tp scalefont setfont
  /cf Tf def  /cs Tp def
} bd
/ULS {currentpoint /uy exch def /ux exch def} bd
/ULE {
  /Tcx currentpoint pop def
  gsave
  newpath
  cf findfont cs scalefont dup
  /FontMatrix get 0 get /Ts exch def /FontInfo get dup
  /UnderlinePosition get Ts mul /To exch def
  /UnderlineThickness get Ts mul /Tt exch def
  ux uy To add moveto  Tcx uy To add lineto
  Tt setlinewidth stroke
  grestore
} bd
/OLE {
  /Tcx currentpoint pop def
  gsave
  newpath
  cf findfont cs scalefont dup
  /FontMatrix get 0 get /Ts exch def /FontInfo get dup
  /UnderlinePosition get Ts mul /To exch def
  /UnderlineThickness get Ts mul /Tt exch def
  ux uy To add cs add moveto Tcx uy To add cs add lineto
  Tt setlinewidth stroke
  grestore
} bd
/SOE {
  /Tcx currentpoint pop def
  gsave
  newpath
  cf findfont cs scalefont dup
  /FontMatrix get 0 get /Ts exch def /FontInfo get dup
  /UnderlinePosition get Ts mul /To exch def
  /UnderlineThickness get Ts mul /Tt exch def
  ux uy To add cs 10 mul 26 idiv add moveto Tcx uy To add cs 10 mul 26 idiv add lineto
  Tt setlinewidth stroke
  grestore
} bd
/QT {
/Y22 exch store
/X22 exch store
/Y21 exch store
/X21 exch store
currentpoint
/Y21 load 2 mul add 3 div exch
/X21 load 2 mul add 3 div exch
/X21 load 2 mul /X22 load add 3 div
/Y21 load 2 mul /Y22 load add 3 div
/X22 load /Y22 load curveto
} bd
/SSPD {
dup length /d exch dict def
{
/v exch def
/k exch def
currentpagedevice k known {
/cpdv currentpagedevice k get def
v cpdv ne {
/upd false def
/nullv v type /nulltype eq def
/nullcpdv cpdv type /nulltype eq def
nullv nullcpdv or
{
/upd true def
} {
/sametype v type cpdv type eq def
sametype {
v type /arraytype eq {
/vlen v length def
/cpdvlen cpdv length def
vlen cpdvlen eq {
0 1 vlen 1 sub {
/i exch def
/obj v i get def
/cpdobj cpdv i get def
obj cpdobj ne {
/upd true def
exit
} if
} for
} {
/upd true def
} ifelse
} {
v type /dicttype eq {
v {
/dv exch def
/dk exch def
/cpddv cpdv dk get def
dv cpddv ne {
/upd true def
exit
} if
} forall
} {
/upd true def
} ifelse
} ifelse
} if
} ifelse
upd true eq {
d k v put
} if
} if
} if
} forall
d length 0 gt {
d setpagedevice
} if
} bd
/RE { % /NewFontName [NewEncodingArray] /FontName RE -
  findfont dup length dict begin
  {
    1 index /FID ne
    {def} {pop pop} ifelse
  } forall
  /Encoding exch def
  /FontName 1 index def
  currentdict definefont pop
  end
} bind def
%%EndResource
%%BeginResource: procset (Apache XML Graphics EPS ProcSet) 1.0 0
%%Version: 1.0 0
%%Copyright: (Copyright 2002-2003 The Apache Software Foundation. License terms: http://www.apache.org/licenses/LICENSE-2.0)
/BeginEPSF { %def
/b4_Inc_state save def         % Save state for cleanup
/dict_count countdictstack def % Count objects on dict stack
/op_count count 1 sub def      % Count objects on operand stack
userdict begin                 % Push userdict on dict stack
/showpage { } def              % Redefine showpage, { } = null proc
0 setgray 0 setlinecap         % Prepare graphics state
1 setlinewidth 0 setlinejoin
10 setmiterlimit [ ] 0 setdash newpath
/languagelevel where           % If level not equal to 1 then
{pop languagelevel             % set strokeadjust and
1 ne                           % overprint to their defaults.
{false setstrokeadjust false setoverprint
} if
} if
} bd
/EndEPSF { %def
count op_count sub {pop} repeat            % Clean up stacks
countdictstack dict_count sub {end} repeat
b4_Inc_state restore
} bd
%%EndResource
%FOPBeginFontDict
%%IncludeResource: font Courier-Oblique
%%IncludeResource: font Courier-BoldOblique
%%IncludeResource: font Courier-Bold
%%IncludeResource: font ZapfDingbats
%%IncludeResource: font Symbol
%%IncludeResource: font Helvetica
%%IncludeResource: font Helvetica-Oblique
%%IncludeResource: font Helvetica-Bold
%%IncludeResource: font Helvetica-BoldOblique
%%IncludeResource: font Times-Roman
%%IncludeResource: font Times-Italic
%%IncludeResource: font Times-Bold
%%IncludeResource: font Times-BoldItalic
%%IncludeResource: font Courier
%FOPEndFontDict
%%BeginResource: encoding WinAnsiEncoding
/WinAnsiEncoding [
/.notdef /.notdef /.notdef /.notdef /.notdef
/.notdef /.notdef /.notdef /.notdef /.notdef
/.notdef /.notdef /.notdef /.notdef /.notdef
/.notdef /.notdef /.notdef /.notdef /.notdef
/.notdef /.notdef /.notdef /.notdef /.notdef
/.notdef /.notdef /.notdef /.notdef /.notdef
/.notdef /.notdef /space /exclam /quotedbl
/numbersign /dollar /percent /ampersand /quotesingle
/parenleft /parenright /asterisk /plus /comma
/hyphen /period /slash /zero /one
/two /three /four /five /six
/seven /eight /nine /colon /semicolon
/less /equal /greater /question /at
/A /B /C /D /E
/F /G /H /I /J
/K /L /M /N /O
/P /Q /R /S /T
/U /V /W /X /Y
/Z /bracketleft /backslash /bracketright /asciicircum
/underscore /quoteleft /a /b /c
/d /e /f /g /h
/i /j /k /l /m
/n /o /p /q /r
/s /t /u /v /w
/x /y /z /braceleft /bar
/braceright /asciitilde /bullet /Euro /bullet
/quotesinglbase /florin /quotedblbase /ellipsis /dagger
/daggerdbl /circumflex /perthousand /Scaron /guilsinglleft
/OE /bullet /Zcaron /bullet /bullet
/quoteleft /quoteright /quotedblleft /quotedblright /bullet
/endash /emdash /asciitilde /trademark /scaron
/guilsinglright /oe /bullet /zcaron /Ydieresis
/space /exclamdown /cent /sterling /currency
/yen /brokenbar /section /dieresis /copyright
/ordfeminine /guillemotleft /logicalnot /sfthyphen /registered
/macron /degree /plusminus /twosuperior /threesuperior
/acute /mu /paragraph /middot /cedilla
/onesuperior /ordmasculine /guillemotright /onequarter /onehalf
/threequarters /questiondown /Agrave /Aacute /Acircumflex
/Atilde /Adieresis /Aring /AE /Ccedilla
/Egrave /Eacute /Ecircumflex /Edieresis /Igrave
/Iacute /Icircumflex /Idieresis /Eth /Ntilde
/Ograve /Oacute /Ocircumflex /Otilde /Odieresis
/multiply /Oslash /Ugrave /Uacute /Ucircumflex
/Udieresis /Yacute /Thorn /germandbls /agrave
/aacute /acircumflex /atilde /adieresis /aring
/ae /ccedilla /egrave /eacute /ecircumflex
/edieresis /igrave /iacute /icircumflex /idieresis
/eth /ntilde /ograve /oacute /ocircumflex
/otilde /odieresis /divide /oslash /ugrave
/uacute /ucircumflex /udieresis /yacute /thorn
/ydieresis
] def
%%EndResource
%FOPBeginFontReencode
/Courier-Oblique findfont
dup length dict begin
  {1 index /FID ne {def} {pop pop} ifelse} forall
  /Encoding WinAnsiEncoding def
  currentdict
end
/Courier-Oblique exch definefont pop
/Courier-BoldOblique findfont
dup length dict begin
  {1 index /FID ne {def} {pop pop} ifelse} forall
  /Encoding WinAnsiEncoding def
  currentdict
end
/Courier-BoldOblique exch definefont pop
/Courier-Bold findfont
dup length dict begin
  {1 index /FID ne {def} {pop pop} ifelse} forall
  /Encoding WinAnsiEncoding def
  currentdict
end
/Courier-Bold exch definefont pop
/Helvetica findfont
dup length dict begin
  {1 index /FID ne {def} {pop pop} ifelse} forall
  /Encoding WinAnsiEncoding def
  currentdict
end
/Helvetica exch definefont pop
/Helvetica-Oblique findfont
dup length dict begin
  {1 index /FID ne {def} {pop pop} ifelse} forall
  /Encoding WinAnsiEncoding def
  currentdict
end
/Helvetica-Oblique exch definefont pop
/Helvetica-Bold findfont
dup length dict begin
  {1 index /FID ne {def} {pop pop} ifelse} forall
  /Encoding WinAnsiEncoding def
  currentdict
end
/Helvetica-Bold exch definefont pop
/Helvetica-BoldOblique findfont
dup length dict begin
  {1 index /FID ne {def} {pop pop} ifelse} forall
  /Encoding WinAnsiEncoding def
  currentdict
end
/Helvetica-BoldOblique exch definefont pop
/Times-Roman findfont
dup length dict begin
  {1 index /FID ne {def} {pop pop} ifelse} forall
  /Encoding WinAnsiEncoding def
  currentdict
end
/Times-Roman exch definefont pop
/Times-Italic findfont
dup length dict begin
  {1 index /FID ne {def} {pop pop} ifelse} forall
  /Encoding WinAnsiEncoding def
  currentdict
end
/Times-Italic exch definefont pop
/Times-Bold findfont
dup length dict begin
  {1 index /FID ne {def} {pop pop} ifelse} forall
  /Encoding WinAnsiEncoding def
  currentdict
end
/Times-Bold exch definefont pop
/Times-BoldItalic findfont
dup length dict begin
  {1 index /FID ne {def} {pop pop} ifelse} forall
  /Encoding WinAnsiEncoding def
  currentdict
end
/Times-BoldItalic exch definefont pop
/Courier findfont
dup length dict begin
  {1 index /FID ne {def} {pop pop} ifelse} forall
  /Encoding WinAnsiEncoding def
  currentdict
end
/Courier exch definefont pop
%FOPEndFontReencode
%%EndProlog
%%Page: 1 1
%%PageBoundingBox: 0 0 1024 288
%%BeginPageSetup
[1 0 0 -1 0 288] CT
%%EndPageSetup
GS
1 GC
N
0 0 1024 288 re
f
GR
GS
1 GC
N
0 0 1024 288 re
f
GR
GS
1 GC
N
154 228.5 M
351.5 228.5 L
351.5 32 L
154 32 L
cp
f
GR
GS
0.149 GC
2 setlinecap
1 LJ
0.5 LW
N
154 228.5 M
351.5 228.5 L
S
GR
GS
0.149 GC
2 setlinecap
1 LJ
0.5 LW
N
213.25 228.5 M
213.25 226.525 L
S
GR
GS
0.149 GC
2 setlinecap
1 LJ
0.5 LW
N
292.25 228.5 M
292.25 226.525 L
S
GR
GS
[1 0 0 1 213.25 234.90001] CT
0.149 GC
/Helvetica 22 F
GS
[1 0 0 1 0 0] CT
-14.5 21 moveto 
1 -1 scale
(YA) t 
GR
GR
GS
[1 0 0 1 292.25 234.90001] CT
0.149 GC
/Helvetica 22 F
GS
[1 0 0 1 0 0] CT
-15.5 21 moveto 
1 -1 scale
(OA) t 
GR
GR
GS
[1 0 0 1 252.75009 261.90002] CT
0.149 GC
/Helvetica 22 F
GS
[1 0 0 1 0 0] CT
-53.5 21 moveto 
1 -1 scale
(Age Group) t 
GR
GR
GS
0.149 GC
2 setlinecap
1 LJ
0.5 LW
N
154 228.5 M
154 32 L
S
GR
GS
0.149 GC
2 setlinecap
1 LJ
0.5 LW
N
154 228.5 M
155.975 228.5 L
S
GR
GS
0.149 GC
2 setlinecap
1 LJ
0.5 LW
N
154 163.055 M
155.975 163.055 L
S
GR
GS
0.149 GC
2 setlinecap
1 LJ
0.5 LW
N
154 97.61 M
155.975 97.61 L
S
GR
GS
0.149 GC
2 setlinecap
1 LJ
0.5 LW
N
154 32.166 M
155.975 32.166 L
S
GR
GS
[1 0 0 1 147.60001 228.50002] CT
0.149 GC
/Helvetica 22 F
GS
[1 0 0 1 0 0] CT
-40 8 moveto 
1 -1 scale
(-0.6) t 
GR
GR
GS
[1 0 0 1 147.60001 163.05519] CT
0.149 GC
/Helvetica 22 F
GS
[1 0 0 1 0 0] CT
-40 8 moveto 
1 -1 scale
(-0.4) t 
GR
GR
GS
[1 0 0 1 147.60001 97.61037] CT
0.149 GC
/Helvetica 22 F
GS
[1 0 0 1 0 0] CT
-40 8 moveto 
1 -1 scale
(-0.2) t 
GR
GR
GS
[1 0 0 1 147.60001 32.16555] CT
0.149 GC
/Helvetica 22 F
GS
[1 0 0 1 0 0] CT
-13 8 moveto 
1 -1 scale
(0) t 
GR
GR
GS
[0 -1 1 0 105.1 130.24991] CT
0.149 GC
/Helvetica 22 F
GS
[1 0 0 1 0 0] CT
-50.5 -5 moveto 
1 -1 scale
(Drift linear) t 
GR
GR
GS
[1 0 0 1 252.75024 29.25] CT
/Helvetica-Bold 22 F
GS
[1 0 0 1 0 0] CT
-76.5 -5 moveto 
1 -1 scale
(p = 9.9417e-10) t 
GR
GR
GS
0.149 GC
1 LJ
0.5 LW
N
154 32.166 M
351.5 32.166 L
S
GR
GS
0.6 0.902 1 RC
N
181.65 32.166 M
181.65 145.936 L
244.85 145.936 L
244.85 32.166 L
cp
f
GR
GS
[1 0 0 1 220.57693 154.78642] CT
0.302 GC
N
2.236 0 M
2.236 -1.235 1.235 -2.236 0 -2.236 C
-1.235 -2.236 -2.236 -1.235 -2.236 0 C
-2.236 1.235 -1.235 2.236 0 2.236 C
1.235 2.236 2.236 1.235 2.236 0 C
cp
f
GR
GS
[1 0 0 1 198.72954 149.78146] CT
0.302 GC
N
/f-1586420743{2.236 0 M
2.236 -1.235 1.235 -2.236 0 -2.236 C
-1.235 -2.236 -2.236 -1.235 -2.236 0 C
-2.236 1.235 -1.235 2.236 0 2.236 C
1.235 2.236 2.236 1.235 2.236 0 C
cp}def
f-1586420743
f
GR
GS
[1 0 0 1 210.86491 108.27257] CT
0.302 GC
N
f-1586420743
f
GR
GS
[1 0 0 1 214.5208 98.27806] CT
0.302 GC
N
f-1586420743
f
GR
GS
[1 0 0 1 227.59096 107.11633] CT
0.302 GC
N
f-1586420743
f
GR
GS
[1 0 0 1 204.05142 82.27007] CT
0.302 GC
N
f-1586420743
f
GR
GS
[1 0 0 1 201.1261 155.99553] CT
0.302 GC
N
f-1586420743
f
GR
GS
[1 0 0 1 217.87056 150.18181] CT
0.302 GC
N
f-1586420743
f
GR
GS
[1 0 0 1 200.87579 186.9281] CT
0.302 GC
N
f-1586420743
f
GR
GS
[1 0 0 1 228.5285 46.53739] CT
0.302 GC
N
f-1586420743
f
GR
GS
[1 0 0 1 205.29767 86.75991] CT
0.302 GC
N
f-1586420743
f
GR
GS
[1 0 0 1 216.61084 146.63953] CT
0.302 GC
N
f-1586420743
f
GR
GS
[1 0 0 1 223.25757 113.82754] CT
0.302 GC
N
f-1586420743
f
GR
GS
[1 0 0 1 223.67972 121.24464] CT
0.302 GC
N
f-1586420743
f
GR
GS
[1 0 0 1 212.90364 118.60354] CT
0.302 GC
N
f-1586420743
f
GR
GS
[1 0 0 1 221.48901 96.18394] CT
0.302 GC
N
f-1586420743
f
GR
GS
[1 0 0 1 226.36742 145.36388] CT
0.302 GC
N
f-1586420743
f
GR
GS
[1 0 0 1 225.92081 81.45497] CT
0.302 GC
N
f-1586420743
f
GR
GS
[1 0 0 1 204.21991 111.62447] CT
0.302 GC
N
f-1586420743
f
GR
GS
[1 0 0 1 214.73714 142.42384] CT
0.302 GC
N
f-1586420743
f
GR
GS
[1 0 0 1 222.24681 89.18409] CT
0.302 GC
N
f-1586420743
f
GR
GS
[1 0 0 1 203.59435 128.14897] CT
0.302 GC
N
f-1586420743
f
GR
GS
[1 0 0 1 221.0517 158.30573] CT
0.302 GC
N
f-1586420743
f
GR
GS
[1 0 0 1 215.88097 138.0811] CT
0.302 GC
N
f-1586420743
f
GR
GS
[1 0 0 1 205.68332 163.49144] CT
0.302 GC
N
f-1586420743
f
GR
GS
[1 0 0 1 200.13039 158.62947] CT
0.302 GC
N
f-1586420743
f
GR
GS
[1 0 0 1 206.871 219.84016] CT
0.302 GC
N
f-1586420743
f
GR
GS
[1 0 0 1 226.43129 215.15211] CT
0.302 GC
N
f-1586420743
f
GR
GS
[1 0 0 1 212.31837 146.84587] CT
0.302 GC
N
f-1586420743
f
GR
GS
[1 0 0 1 205.96518 84.0291] CT
0.302 GC
N
f-1586420743
f
GR
GS
[1 0 0 1 221.55986 222.43806] CT
0.302 GC
N
f-1586420743
f
GR
GS
[1 0 0 1 221.85063 180.3765] CT
0.302 GC
N
f-1586420743
f
GR
GS
[1 0 0 1 198.12306 214.22063] CT
0.302 GC
N
f-1586420743
f
GR
GS
[1 0 0 1 225.25757 108.4503] CT
0.302 GC
N
f-1586420743
f
GR
GS
[1 0 0 1 222.67218 219.59189] CT
0.302 GC
N
f-1586420743
f
GR
GS
[1 0 0 1 207.69362 152.47736] CT
0.302 GC
N
f-1586420743
f
GR
GS
[1 0 0 1 218.5918 167.26108] CT
0.302 GC
N
f-1586420743
f
GR
GS
[1 0 0 1 206.81288 110.63687] CT
0.302 GC
N
f-1586420743
f
GR
GS
[1 0 0 1 226.83649 209.0753] CT
0.302 GC
N
f-1586420743
f
GR
GS
[1 0 0 1 206.35995 200.6517] CT
0.302 GC
N
f-1586420743
f
GR
GS
[1 0 0 1 202.78661 161.64445] CT
0.302 GC
N
f-1586420743
f
GR
GS
[1 0 0 1 220.99727 192.6131] CT
0.302 GC
N
f-1586420743
f
GR
GS
[1 0 0 1 218.09885 207.11365] CT
0.302 GC
N
f-1586420743
f
GR
GS
[1 0 0 1 227.9938 150.85445] CT
0.302 GC
N
f-1586420743
f
GR
GS
[1 0 0 1 207.34167 210.09604] CT
0.302 GC
N
f-1586420743
f
GR
GS
[1 0 0 1 199.86548 102.851] CT
0.302 GC
N
f-1586420743
f
GR
GS
[1 0 0 1 222.45872 161.25439] CT
0.302 GC
N
f-1586420743
f
GR
GS
[1 0 0 1 208.99614 134.11987] CT
0.302 GC
N
f-1586420743
f
GR
GS
[1 0 0 1 215.93913 139.1335] CT
0.302 GC
N
f-1586420743
f
GR
GS
0.6 0.902 1 RC
N
/f-964684498{260.65 32.166 M
260.65 97.496 L
323.85 97.496 L
323.85 32.166 L
cp}def
f-964684498
f
GR
GS
[1 0 0 1 282.24344 94.92085] CT
0.302 GC
N
f-1586420743
f
GR
GS
[1 0 0 1 278.88065 118.34508] CT
0.302 GC
N
f-1586420743
f
GR
GS
[1 0 0 1 281.30576 88.69973] CT
0.302 GC
N
f-1586420743
f
GR
GS
[1 0 0 1 302.57928 46.80719] CT
0.302 GC
N
f-1586420743
f
GR
GS
[1 0 0 1 285.96024 133.62534] CT
0.302 GC
N
f-1586420743
f
GR
GS
[1 0 0 1 288.58075 81.27498] CT
0.302 GC
N
f-1586420743
f
GR
GS
[1 0 0 1 297.01367 120.25062] CT
0.302 GC
N
f-1586420743
f
GR
GS
[1 0 0 1 302.2789 99.40636] CT
0.302 GC
N
f-1586420743
f
GR
GS
[1 0 0 1 288.27396 106.17644] CT
0.302 GC
N
f-1586420743
f
GR
GS
[1 0 0 1 282.44965 104.15791] CT
0.302 GC
N
f-1586420743
f
GR
GS
[1 0 0 1 296.87946 117.19254] CT
0.302 GC
N
f-1586420743
f
GR
GS
[1 0 0 1 276.56393 74.69193] CT
0.302 GC
N
f-1586420743
f
GR
GS
[1 0 0 1 285.38925 165.88379] CT
0.302 GC
N
f-1586420743
f
GR
GS
[1 0 0 1 296.62976 112.97903] CT
0.302 GC
N
f-1586420743
f
GR
GS
[1 0 0 1 295.15958 98.09293] CT
0.302 GC
N
f-1586420743
f
GR
GS
[1 0 0 1 286.72913 146.00227] CT
0.302 GC
N
f-1586420743
f
GR
GS
[1 0 0 1 307.70087 99.1259] CT
0.302 GC
N
f-1586420743
f
GR
GS
[1 0 0 1 280.34424 100.83758] CT
0.302 GC
N
f-1586420743
f
GR
GS
[1 0 0 1 281.39911 80.08009] CT
0.302 GC
N
f-1586420743
f
GR
GS
[1 0 0 1 290.18484 42.13022] CT
0.302 GC
N
f-1586420743
f
GR
GS
[1 0 0 1 302.7489 93.85675] CT
0.302 GC
N
f-1586420743
f
GR
GS
[1 0 0 1 287.82315 104.1288] CT
0.302 GC
N
f-1586420743
f
GR
GS
[1 0 0 1 278.85913 84.20563] CT
0.302 GC
N
f-1586420743
f
GR
GS
[1 0 0 1 294.04883 68.57856] CT
0.302 GC
N
f-1586420743
f
GR
GS
[1 0 0 1 285.1062 86.59568] CT
0.302 GC
N
f-1586420743
f
GR
GS
[1 0 0 1 280.62292 115.3443] CT
0.302 GC
N
f-1586420743
f
GR
GS
[1 0 0 1 298.55908 137.37186] CT
0.302 GC
N
f-1586420743
f
GR
GS
[1 0 0 1 291.8046 95.73991] CT
0.302 GC
N
f-1586420743
f
GR
GS
[1 0 0 1 282.22382 136.97159] CT
0.302 GC
N
f-1586420743
f
GR
GS
[1 0 0 1 279.64838 140.09451] CT
0.302 GC
N
f-1586420743
f
GR
GS
[1 0 0 1 282.82007 67.14819] CT
0.302 GC
N
f-1586420743
f
GR
GS
[1 0 0 1 280.70798 131.36951] CT
0.302 GC
N
f-1586420743
f
GR
GS
[1 0 0 1 286.68173 67.44256] CT
0.302 GC
N
f-1586420743
f
GR
GS
[1 0 0 1 306.48721 101.99374] CT
0.302 GC
N
f-1586420743
f
GR
GS
[1 0 0 1 293.26532 91.66128] CT
0.302 GC
N
f-1586420743
f
GR
GS
[1 0 0 1 284.27689 76.38042] CT
0.302 GC
N
f-1586420743
f
GR
GS
[1 0 0 1 290.26794 58.58301] CT
0.302 GC
N
f-1586420743
f
GR
GS
[1 0 0 1 297.59317 88.57474] CT
0.302 GC
N
f-1586420743
f
GR
GS
[1 0 0 1 293.75717 97.49271] CT
0.302 GC
N
f-1586420743
f
GR
GS
[1 0 0 1 295.69611 108.57255] CT
0.302 GC
N
f-1586420743
f
GR
GS
[1 0 0 1 303.72507 32] CT
0.302 GC
N
f-1586420743
f
GR
GS
[1 0 0 1 288.47998 69.62469] CT
0.302 GC
N
f-1586420743
f
GR
GS
[1 0 0 1 300.117 110.99313] CT
0.302 GC
N
f-1586420743
f
GR
GS
[1 0 0 1 281.40161 104.30732] CT
0.302 GC
N
f-1586420743
f
GR
GS
[1 0 0 1 278.28671 84.95435] CT
0.302 GC
N
f-1586420743
f
GR
GS
[1 0 0 1 287.18475 94.04915] CT
0.302 GC
N
f-1586420743
f
GR
GS
[1 0 0 1 302.27277 100.79908] CT
0.302 GC
N
f-1586420743
f
GR
GS
[1 0 0 1 288.38049 104.3438] CT
0.302 GC
N
f-1586420743
f
GR
GS
[1 0 0 1 307.18433 130.3309] CT
0.302 GC
N
f-1586420743
f
GR
GS
[1 0 0 1 295.57806 77.58311] CT
0.302 GC
N
f-1586420743
f
GR
GS
[1 0 0 1 287.13828 134.49026] CT
0.302 GC
N
f-1586420743
f
GR
GS
[1 0 0 1 284.56464 69.82757] CT
0.302 GC
N
f-1586420743
f
GR
GS
[1 0 0 1 285.47165 71.20924] CT
0.302 GC
N
f-1586420743
f
GR
GS
1 GC
N
/f52512498{441.5 228.5 M
639 228.5 L
639 32 L
441.5 32 L
cp}def
f52512498
f
GR
GS
0.149 GC
2 setlinecap
1 LJ
0.5 LW
N
441.5 228.5 M
639 228.5 L
S
GR
GS
0.149 GC
2 setlinecap
1 LJ
0.5 LW
N
500.75 228.5 M
500.75 226.525 L
S
GR
GS
0.149 GC
2 setlinecap
1 LJ
0.5 LW
N
579.75 228.5 M
579.75 226.525 L
S
GR
GS
[1 0 0 1 500.75 234.89999] CT
0.149 GC
/Helvetica 22 F
GS
[1 0 0 1 0 0] CT
-14.5 21 moveto 
1 -1 scale
(YA) t 
GR
GR
GS
[1 0 0 1 579.75 234.89999] CT
0.149 GC
/Helvetica 22 F
GS
[1 0 0 1 0 0] CT
-15.5 21 moveto 
1 -1 scale
(OA) t 
GR
GR
GS
[1 0 0 1 540.25012 261.89999] CT
0.149 GC
/Helvetica 22 F
GS
[1 0 0 1 0 0] CT
-53.5 21 moveto 
1 -1 scale
(Age Group) t 
GR
GR
GS
0.149 GC
2 setlinecap
1 LJ
0.5 LW
N
441.5 228.5 M
441.5 32 L
S
GR
GS
0.149 GC
2 setlinecap
1 LJ
0.5 LW
N
441.5 228.5 M
443.475 228.5 L
S
GR
GS
0.149 GC
2 setlinecap
1 LJ
0.5 LW
N
441.5 179.375 M
443.475 179.375 L
S
GR
GS
0.149 GC
2 setlinecap
1 LJ
0.5 LW
N
441.5 130.25 M
443.475 130.25 L
S
GR
GS
0.149 GC
2 setlinecap
1 LJ
0.5 LW
N
441.5 81.125 M
443.475 81.125 L
S
GR
GS
0.149 GC
2 setlinecap
1 LJ
0.5 LW
N
441.5 32 M
443.475 32 L
S
GR
GS
[1 0 0 1 435.10001 228.5] CT
0.149 GC
/Helvetica 22 F
GS
[1 0 0 1 0 0] CT
-40 8 moveto 
1 -1 scale
(-0.1) t 
GR
GR
GS
[1 0 0 1 435.10001 179.375] CT
0.149 GC
/Helvetica 22 F
GS
[1 0 0 1 0 0] CT
-13 8 moveto 
1 -1 scale
(0) t 
GR
GR
GS
[1 0 0 1 435.10001 130.25] CT
0.149 GC
/Helvetica 22 F
GS
[1 0 0 1 0 0] CT
-31 8 moveto 
1 -1 scale
(0.1) t 
GR
GR
GS
[1 0 0 1 435.10001 81.125] CT
0.149 GC
/Helvetica 22 F
GS
[1 0 0 1 0 0] CT
-31 8 moveto 
1 -1 scale
(0.2) t 
GR
GR
GS
[1 0 0 1 435.10001 31.99999] CT
0.149 GC
/Helvetica 22 F
GS
[1 0 0 1 0 0] CT
-31 8 moveto 
1 -1 scale
(0.3) t 
GR
GR
GS
[0 -1 1 0 392.60001 130.24991] CT
0.149 GC
/Helvetica 22 F
GS
[1 0 0 1 0 0] CT
-78.5 -5 moveto 
1 -1 scale
(Threshold linear) t 
GR
GR
GS
[1 0 0 1 540.25049 29.24999] CT
/Helvetica-Bold 22 F
GS
[1 0 0 1 0 0] CT
-59.5 -5 moveto 
1 -1 scale
(p = 0.47243) t 
GR
GR
GS
0.149 GC
1 LJ
0.5 LW
N
441.5 179.375 M
639 179.375 L
S
GR
GS
1 0.6 0.6 RC
N
/f419378414{532.35 179.375 M
532.35 117.075 L
469.15 117.075 L
469.15 179.375 L
cp}def
f419378414
f
GR
GS
[1 0 0 1 509.59631 105.31732] CT
0.302 GC
N
f-1586420743
f
GR
GS
[1 0 0 1 507.11407 96.47065] CT
0.302 GC
N
f-1586420743
f
GR
GS
[1 0 0 1 500.51337 145.17509] CT
0.302 GC
N
f-1586420743
f
GR
GS
[1 0 0 1 515.52832 120.68546] CT
0.302 GC
N
f-1586420743
f
GR
GS
[1 0 0 1 499.9967 129.42679] CT
0.302 GC
N
f-1586420743
f
GR
GS
[1 0 0 1 516.38904 111.68408] CT
0.302 GC
N
f-1586420743
f
GR
GS
[1 0 0 1 500.45227 101.34618] CT
0.302 GC
N
f-1586420743
f
GR
GS
[1 0 0 1 500.85913 151.98923] CT
0.302 GC
N
f-1586420743
f
GR
GS
[1 0 0 1 509.24323 96.67395] CT
0.302 GC
N
f-1586420743
f
GR
GS
[1 0 0 1 497.21347 175.74953] CT
0.302 GC
N
f-1586420743
f
GR
GS
[1 0 0 1 499.27298 138.32825] CT
0.302 GC
N
f-1586420743
f
GR
GS
[1 0 0 1 489.14819 130.91101] CT
0.302 GC
N
f-1586420743
f
GR
GS
[1 0 0 1 508.91879 122.05247] CT
0.302 GC
N
f-1586420743
f
GR
GS
[1 0 0 1 502.81149 109.53442] CT
0.302 GC
N
f-1586420743
f
GR
GS
[1 0 0 1 505.44693 137.81233] CT
0.302 GC
N
f-1586420743
f
GR
GS
[1 0 0 1 510.16864 132.2951] CT
0.302 GC
N
f-1586420743
f
GR
GS
[1 0 0 1 491.91617 111.22353] CT
0.302 GC
N
f-1586420743
f
GR
GS
[1 0 0 1 512.05933 175.70482] CT
0.302 GC
N
f-1586420743
f
GR
GS
[1 0 0 1 513.53943 126.94311] CT
0.302 GC
N
f-1586420743
f
GR
GS
[1 0 0 1 494.17783 135.1452] CT
0.302 GC
N
f-1586420743
f
GR
GS
[1 0 0 1 507.88748 139.85321] CT
0.302 GC
N
f-1586420743
f
GR
GS
[1 0 0 1 495.67648 133.56729] CT
0.302 GC
N
f-1586420743
f
GR
GS
[1 0 0 1 493.56674 116.18925] CT
0.302 GC
N
f-1586420743
f
GR
GS
[1 0 0 1 505.93298 141.78667] CT
0.302 GC
N
f-1586420743
f
GR
GS
[1 0 0 1 501.8829 71.43655] CT
0.302 GC
N
f-1586420743
f
GR
GS
[1 0 0 1 511.14987 72.45819] CT
0.302 GC
N
f-1586420743
f
GR
GS
[1 0 0 1 493.39865 127.84764] CT
0.302 GC
N
f-1586420743
f
GR
GS
[1 0 0 1 490.51651 69.0293] CT
0.302 GC
N
f-1586420743
f
GR
GS
[1 0 0 1 498.5755 85.08258] CT
0.302 GC
N
f-1586420743
f
GR
GS
[1 0 0 1 499.98071 126.1288] CT
0.302 GC
N
f-1586420743
f
GR
GS
[1 0 0 1 509.76297 136.79556] CT
0.302 GC
N
f-1586420743
f
GR
GS
[1 0 0 1 489.07858 90.44834] CT
0.302 GC
N
f-1586420743
f
GR
GS
[1 0 0 1 486.57285 130.04271] CT
0.302 GC
N
f-1586420743
f
GR
GS
[1 0 0 1 504.77921 146.63564] CT
0.302 GC
N
f-1586420743
f
GR
GS
[1 0 0 1 485.86917 78.38516] CT
0.302 GC
N
f-1586420743
f
GR
GS
[1 0 0 1 489.25375 82.48821] CT
0.302 GC
N
f-1586420743
f
GR
GS
[1 0 0 1 506.89795 98.53269] CT
0.302 GC
N
f-1586420743
f
GR
GS
[1 0 0 1 501.24545 113.08388] CT
0.302 GC
N
f-1586420743
f
GR
GS
[1 0 0 1 502.09561 50.07808] CT
0.302 GC
N
f-1586420743
f
GR
GS
[1 0 0 1 510.49808 53.06332] CT
0.302 GC
N
f-1586420743
f
GR
GS
[1 0 0 1 510.03049 102.86243] CT
0.302 GC
N
f-1586420743
f
GR
GS
[1 0 0 1 500.80899 117.41989] CT
0.302 GC
N
f-1586420743
f
GR
GS
[1 0 0 1 488.73141 113.53717] CT
0.302 GC
N
f-1586420743
f
GR
GS
[1 0 0 1 512.96649 131.87689] CT
0.302 GC
N
f-1586420743
f
GR
GS
[1 0 0 1 515.61115 126.31244] CT
0.302 GC
N
f-1586420743
f
GR
GS
[1 0 0 1 514.73383 113.5943] CT
0.302 GC
N
f-1586420743
f
GR
GS
[1 0 0 1 505.11484 121.87362] CT
0.302 GC
N
f-1586420743
f
GR
GS
[1 0 0 1 487.81265 132.6967] CT
0.302 GC
N
f-1586420743
f
GR
GS
[1 0 0 1 487.31076 159.09354] CT
0.302 GC
N
f-1586420743
f
GR
GS
1 0.6 0.6 RC
N
/f-824482866{611.35 179.375 M
611.35 121.525 L
548.15 121.525 L
548.15 179.375 L
cp}def
f-824482866
f
GR
GS
[1 0 0 1 569.71545 124.87751] CT
0.302 GC
N
f-1586420743
f
GR
GS
[1 0 0 1 564.95135 77.12009] CT
0.302 GC
N
f-1586420743
f
GR
GS
[1 0 0 1 586.85797 163.56963] CT
0.302 GC
N
f-1586420743
f
GR
GS
[1 0 0 1 568.50543 178.66174] CT
0.302 GC
N
f-1586420743
f
GR
GS
[1 0 0 1 584.04529 73.61] CT
0.302 GC
N
f-1586420743
f
GR
GS
[1 0 0 1 588.90918 141.01433] CT
0.302 GC
N
f-1586420743
f
GR
GS
[1 0 0 1 581.84357 76.24182] CT
0.302 GC
N
f-1586420743
f
GR
GS
[1 0 0 1 575.87628 144.78163] CT
0.302 GC
N
f-1586420743
f
GR
GS
[1 0 0 1 573.58423 76.39182] CT
0.302 GC
N
f-1586420743
f
GR
GS
[1 0 0 1 574.04218 124.9257] CT
0.302 GC
N
f-1586420743
f
GR
GS
[1 0 0 1 588.75537 148.9635] CT
0.302 GC
N
f-1586420743
f
GR
GS
[1 0 0 1 579.8681 157.25003] CT
0.302 GC
N
f-1586420743
f
GR
GS
[1 0 0 1 572.19751 115.63175] CT
0.302 GC
N
f-1586420743
f
GR
GS
[1 0 0 1 587.09625 117.6526] CT
0.302 GC
N
f-1586420743
f
GR
GS
[1 0 0 1 569.09924 93.47736] CT
0.302 GC
N
f-1586420743
f
GR
GS
[1 0 0 1 593.05597 76.85253] CT
0.302 GC
N
f-1586420743
f
GR
GS
[1 0 0 1 570.97229 68.42959] CT
0.302 GC
N
f-1586420743
f
GR
GS
[1 0 0 1 566.59204 91.78356] CT
0.302 GC
N
f-1586420743
f
GR
GS
[1 0 0 1 588.26782 156.36151] CT
0.302 GC
N
f-1586420743
f
GR
GS
[1 0 0 1 589.78857 190.15033] CT
0.302 GC
N
f-1586420743
f
GR
GS
[1 0 0 1 587.34747 92.0638] CT
0.302 GC
N
f-1586420743
f
GR
GS
[1 0 0 1 587.91064 88.14963] CT
0.302 GC
N
f-1586420743
f
GR
GS
[1 0 0 1 594.32379 172.78749] CT
0.302 GC
N
f-1586420743
f
GR
GS
[1 0 0 1 578.68903 118.70693] CT
0.302 GC
N
f-1586420743
f
GR
GS
[1 0 0 1 588.81909 95.49718] CT
0.302 GC
N
f-1586420743
f
GR
GS
[1 0 0 1 577.30316 174.63293] CT
0.302 GC
N
f-1586420743
f
GR
GS
[1 0 0 1 593.77185 96.02078] CT
0.302 GC
N
f-1586420743
f
GR
GS
[1 0 0 1 563.99152 105.33524] CT
0.302 GC
N
f-1586420743
f
GR
GS
[1 0 0 1 594.95807 135.48618] CT
0.302 GC
N
f-1586420743
f
GR
GS
[1 0 0 1 581.96814 87.34909] CT
0.302 GC
N
f-1586420743
f
GR
GS
[1 0 0 1 574.8985 138.01631] CT
0.302 GC
N
f-1586420743
f
GR
GS
[1 0 0 1 581.56708 86.95556] CT
0.302 GC
N
f-1586420743
f
GR
GS
[1 0 0 1 573.42322 167.37614] CT
0.302 GC
N
f-1586420743
f
GR
GS
[1 0 0 1 568.97668 125.881] CT
0.302 GC
N
f-1586420743
f
GR
GS
[1 0 0 1 584.97211 133.71811] CT
0.302 GC
N
f-1586420743
f
GR
GS
[1 0 0 1 585.5708 117.84718] CT
0.302 GC
N
f-1586420743
f
GR
GS
[1 0 0 1 588.99017 125.23724] CT
0.302 GC
N
f-1586420743
f
GR
GS
[1 0 0 1 574.96655 154.80232] CT
0.302 GC
N
f-1586420743
f
GR
GS
[1 0 0 1 571.85236 106.80022] CT
0.302 GC
N
f-1586420743
f
GR
GS
[1 0 0 1 574.85211 131.94612] CT
0.302 GC
N
f-1586420743
f
GR
GS
[1 0 0 1 574.33478 157.82368] CT
0.302 GC
N
f-1586420743
f
GR
GS
[1 0 0 1 593.25854 194.63564] CT
0.302 GC
N
f-1586420743
f
GR
GS
[1 0 0 1 587.84186 96.44609] CT
0.302 GC
N
f-1586420743
f
GR
GS
[1 0 0 1 573.05835 119.07806] CT
0.302 GC
N
f-1586420743
f
GR
GS
[1 0 0 1 583.10529 117.18521] CT
0.302 GC
N
f-1586420743
f
GR
GS
[1 0 0 1 588.15649 102.46667] CT
0.302 GC
N
f-1586420743
f
GR
GS
[1 0 0 1 590.68842 139.5867] CT
0.302 GC
N
f-1586420743
f
GR
GS
[1 0 0 1 592.45264 73.49374] CT
0.302 GC
N
f-1586420743
f
GR
GS
[1 0 0 1 582.77435 98.88648] CT
0.302 GC
N
f-1586420743
f
GR
GS
[1 0 0 1 566.11572 74.2685] CT
0.302 GC
N
f-1586420743
f
GR
GS
[1 0 0 1 570.84015 111.42255] CT
0.302 GC
N
f-1586420743
f
GR
GS
[1 0 0 1 588.70813 146.61551] CT
0.302 GC
N
f-1586420743
f
GR
GS
[1 0 0 1 571.7832 156.5667] CT
0.302 GC
N
f-1586420743
f
GR
GS
1 GC
N
/f1794784034{729 228.5 M
926.5 228.5 L
926.5 32 L
729 32 L
cp}def
f1794784034
f
GR
GS
0.149 GC
2 setlinecap
1 LJ
0.5 LW
N
729 228.5 M
926.5 228.5 L
S
GR
GS
0.149 GC
2 setlinecap
1 LJ
0.5 LW
N
788.25 228.5 M
788.25 226.525 L
S
GR
GS
0.149 GC
2 setlinecap
1 LJ
0.5 LW
N
867.25 228.5 M
867.25 226.525 L
S
GR
GS
[1 0 0 1 788.25 234.89999] CT
0.149 GC
/Helvetica 22 F
GS
[1 0 0 1 0 0] CT
-14.5 21 moveto 
1 -1 scale
(YA) t 
GR
GR
GS
[1 0 0 1 867.25 234.89999] CT
0.149 GC
/Helvetica 22 F
GS
[1 0 0 1 0 0] CT
-15.5 21 moveto 
1 -1 scale
(OA) t 
GR
GR
GS
[1 0 0 1 827.75012 261.89999] CT
0.149 GC
/Helvetica 22 F
GS
[1 0 0 1 0 0] CT
-53.5 21 moveto 
1 -1 scale
(Age Group) t 
GR
GR
GS
0.149 GC
2 setlinecap
1 LJ
0.5 LW
N
729 228.5 M
729 32 L
S
GR
GS
0.149 GC
2 setlinecap
1 LJ
0.5 LW
N
729 219.497 M
730.975 219.497 L
S
GR
GS
0.149 GC
2 setlinecap
1 LJ
0.5 LW
N
729 129.936 M
730.975 129.936 L
S
GR
GS
0.149 GC
2 setlinecap
1 LJ
0.5 LW
N
729 40.375 M
730.975 40.375 L
S
GR
GS
[1 0 0 1 722.59998 219.4967] CT
0.149 GC
/Helvetica 22 F
GS
[1 0 0 1 0 0] CT
-13 8 moveto 
1 -1 scale
(0) t 
GR
GR
GS
[1 0 0 1 722.59998 129.93607] CT
0.149 GC
/Helvetica 22 F
GS
[1 0 0 1 0 0] CT
-43 8 moveto 
1 -1 scale
(0.05) t 
GR
GR
GS
[1 0 0 1 722.59998 40.37543] CT
0.149 GC
/Helvetica 22 F
GS
[1 0 0 1 0 0] CT
-31 8 moveto 
1 -1 scale
(0.1) t 
GR
GR
GS
[0 -1 1 0 676.59998 130.24991] CT
0.149 GC
/Helvetica 22 F
GS
[1 0 0 1 0 0] CT
-52 -5 moveto 
1 -1 scale
(NDT linear) t 
GR
GR
GS
[1 0 0 1 827.75079 29.24999] CT
/Helvetica-Bold 22 F
GS
[1 0 0 1 0 0] CT
-78 -5 moveto 
1 -1 scale
(p = 0.00055202) t 
GR
GR
GS
0.149 GC
1 LJ
0.5 LW
N
729 219.497 M
926.5 219.497 L
S
GR
GS
1 0.6 0.6 RC
N
/f-1922603570{819.85 219.497 M
819.85 122.084 L
756.65 122.084 L
756.65 219.497 L
cp}def
f-1922603570
f
GR
GS
[1 0 0 1 789.96985 95.06192] CT
0.302 GC
N
f-1586420743
f
GR
GS
[1 0 0 1 779.7049 134.45746] CT
0.302 GC
N
f-1586420743
f
GR
GS
[1 0 0 1 772.66846 51.2273] CT
0.302 GC
N
f-1586420743
f
GR
GS
[1 0 0 1 796.67578 115.78185] CT
0.302 GC
N
f-1586420743
f
GR
GS
[1 0 0 1 773.13995 133.15694] CT
0.302 GC
N
f-1586420743
f
GR
GS
[1 0 0 1 784.87207 138.07138] CT
0.302 GC
N
f-1586420743
f
GR
GS
[1 0 0 1 780.4303 138.05458] CT
0.302 GC
N
f-1586420743
f
GR
GS
[1 0 0 1 778.90326 41.68417] CT
0.302 GC
N
f-1586420743
f
GR
GS
[1 0 0 1 793.37805 140.79703] CT
0.302 GC
N
f-1586420743
f
GR
GS
[1 0 0 1 801.35583 98.73489] CT
0.302 GC
N
f-1586420743
f
GR
GS
[1 0 0 1 772.66809 148.34874] CT
0.302 GC
N
f-1586420743
f
GR
GS
[1 0 0 1 796.03699 77.65632] CT
0.302 GC
N
f-1586420743
f
GR
GS
[1 0 0 1 797.7196 94.90119] CT
0.302 GC
N
f-1586420743
f
GR
GS
[1 0 0 1 801.13647 173.6304] CT
0.302 GC
N
f-1586420743
f
GR
GS
[1 0 0 1 803.24652 93.97212] CT
0.302 GC
N
f-1586420743
f
GR
GS
[1 0 0 1 776.23767 53.1512] CT
0.302 GC
N
f-1586420743
f
GR
GS
[1 0 0 1 788.84943 100.87231] CT
0.302 GC
N
f-1586420743
f
GR
GS
[1 0 0 1 798.42438 108.43998] CT
0.302 GC
N
f-1586420743
f
GR
GS
[1 0 0 1 792.5799 88.22536] CT
0.302 GC
N
f-1586420743
f
GR
GS
[1 0 0 1 802.59357 125.99744] CT
0.302 GC
N
f-1586420743
f
GR
GS
[1 0 0 1 802.37286 168.33008] CT
0.302 GC
N
f-1586420743
f
GR
GS
[1 0 0 1 802.99475 73.30998] CT
0.302 GC
N
f-1586420743
f
GR
GS
[1 0 0 1 774.57806 93.54464] CT
0.302 GC
N
f-1586420743
f
GR
GS
[1 0 0 1 782.58856 130.35005] CT
0.302 GC
N
f-1586420743
f
GR
GS
[1 0 0 1 776.68604 168.1002] CT
0.302 GC
N
f-1586420743
f
GR
GS
[1 0 0 1 776.70288 118.49377] CT
0.302 GC
N
f-1586420743
f
GR
GS
[1 0 0 1 797.91797 68.89451] CT
0.302 GC
N
f-1586420743
f
GR
GS
[1 0 0 1 789.03253 206.24596] CT
0.302 GC
N
f-1586420743
f
GR
GS
[1 0 0 1 802.28851 129.59904] CT
0.302 GC
N
f-1586420743
f
GR
GS
[1 0 0 1 803.68152 74.20724] CT
0.302 GC
N
f-1586420743
f
GR
GS
[1 0 0 1 785.40265 218.36525] CT
0.302 GC
N
f-1586420743
f
GR
GS
[1 0 0 1 784.1795 154.50552] CT
0.302 GC
N
f-1586420743
f
GR
GS
[1 0 0 1 779.61859 140.41063] CT
0.302 GC
N
f-1586420743
f
GR
GS
[1 0 0 1 786.54456 114.14828] CT
0.302 GC
N
f-1586420743
f
GR
GS
[1 0 0 1 780.86261 170.31699] CT
0.302 GC
N
f-1586420743
f
GR
GS
[1 0 0 1 786.95746 90.0319] CT
0.302 GC
N
f-1586420743
f
GR
GS
[1 0 0 1 786.12982 135.47166] CT
0.302 GC
N
f-1586420743
f
GR
GS
[1 0 0 1 780.65411 115.2921] CT
0.302 GC
N
f-1586420743
f
GR
GS
[1 0 0 1 776.67535 213.51537] CT
0.302 GC
N
f-1586420743
f
GR
GS
[1 0 0 1 785.69763 123.05104] CT
0.302 GC
N
f-1586420743
f
GR
GS
[1 0 0 1 788.4668 93.32649] CT
0.302 GC
N
f-1586420743
f
GR
GS
[1 0 0 1 782.69867 152.51251] CT
0.302 GC
N
f-1586420743
f
GR
GS
[1 0 0 1 786.45178 116.50555] CT
0.302 GC
N
f-1586420743
f
GR
GS
[1 0 0 1 786.21698 171.7195] CT
0.302 GC
N
f-1586420743
f
GR
GS
[1 0 0 1 797.50952 145.27234] CT
0.302 GC
N
f-1586420743
f
GR
GS
[1 0 0 1 798.22156 100.23653] CT
0.302 GC
N
f-1586420743
f
GR
GS
[1 0 0 1 796.21674 126.16119] CT
0.302 GC
N
f-1586420743
f
GR
GS
[1 0 0 1 797.3905 128.21701] CT
0.302 GC
N
f-1586420743
f
GR
GS
[1 0 0 1 788.29004 89.75788] CT
0.302 GC
N
f-1586420743
f
GR
GS
1 0.6 0.6 RC
N
/f1155630958{898.85 219.497 M
898.85 153.013 L
835.65 153.013 L
835.65 219.497 L
cp}def
f1155630958
f
GR
GS
[1 0 0 1 868.99377 196.18985] CT
0.302 GC
N
f-1586420743
f
GR
GS
[1 0 0 1 871.38171 122.88879] CT
0.302 GC
N
f-1586420743
f
GR
GS
[1 0 0 1 854.54645 32] CT
0.302 GC
N
f-1586420743
f
GR
GS
[1 0 0 1 859.21338 151.67729] CT
0.302 GC
N
f-1586420743
f
GR
GS
[1 0 0 1 870.90692 142.79689] CT
0.302 GC
N
f-1586420743
f
GR
GS
[1 0 0 1 861.08673 207.04732] CT
0.302 GC
N
f-1586420743
f
GR
GS
[1 0 0 1 875.68616 185.34546] CT
0.302 GC
N
f-1586420743
f
GR
GS
[1 0 0 1 859.89441 162.50125] CT
0.302 GC
N
f-1586420743
f
GR
GS
[1 0 0 1 860.82135 181.94093] CT
0.302 GC
N
f-1586420743
f
GR
GS
[1 0 0 1 869.03113 124.82663] CT
0.302 GC
N
f-1586420743
f
GR
GS
[1 0 0 1 882.07275 51.20391] CT
0.302 GC
N
f-1586420743
f
GR
GS
[1 0 0 1 873.22632 112.76775] CT
0.302 GC
N
f-1586420743
f
GR
GS
[1 0 0 1 874.13507 228.5] CT
0.302 GC
N
f-1586420743
f
GR
GS
[1 0 0 1 869.1153 142.18571] CT
0.302 GC
N
f-1586420743
f
GR
GS
[1 0 0 1 868.30402 138.80869] CT
0.302 GC
N
f-1586420743
f
GR
GS
[1 0 0 1 879.12286 141.23145] CT
0.302 GC
N
f-1586420743
f
GR
GS
[1 0 0 1 863.87189 115.72964] CT
0.302 GC
N
f-1586420743
f
GR
GS
[1 0 0 1 865.92493 195.66434] CT
0.302 GC
N
f-1586420743
f
GR
GS
[1 0 0 1 875.37982 223.92493] CT
0.302 GC
N
f-1586420743
f
GR
GS
[1 0 0 1 868.72546 190.23932] CT
0.302 GC
N
f-1586420743
f
GR
GS
[1 0 0 1 862.74347 159.31845] CT
0.302 GC
N
f-1586420743
f
GR
GS
[1 0 0 1 873.6015 141.97784] CT
0.302 GC
N
f-1586420743
f
GR
GS
[1 0 0 1 854.90143 165.35724] CT
0.302 GC
N
f-1586420743
f
GR
GS
[1 0 0 1 851.65887 184.26802] CT
0.302 GC
N
f-1586420743
f
GR
GS
[1 0 0 1 870.32477 136.14365] CT
0.302 GC
N
f-1586420743
f
GR
GS
[1 0 0 1 872.27997 221.57289] CT
0.302 GC
N
f-1586420743
f
GR
GS
[1 0 0 1 869.7782 129.68294] CT
0.302 GC
N
f-1586420743
f
GR
GS
[1 0 0 1 880.20447 129.33058] CT
0.302 GC
N
f-1586420743
f
GR
GS
[1 0 0 1 871.54779 143.76372] CT
0.302 GC
N
f-1586420743
f
GR
GS
[1 0 0 1 868.05774 79.10801] CT
0.302 GC
N
f-1586420743
f
GR
GS
[1 0 0 1 859.65411 204.90823] CT
0.302 GC
N
f-1586420743
f
GR
GS
[1 0 0 1 853.06702 126.90426] CT
0.302 GC
N
f-1586420743
f
GR
GS
[1 0 0 1 874.57965 74.23154] CT
0.302 GC
N
f-1586420743
f
GR
GS
[1 0 0 1 856.6416 216.53815] CT
0.302 GC
N
f-1586420743
f
GR
GS
[1 0 0 1 860.31055 145.63902] CT
0.302 GC
N
f-1586420743
f
GR
GS
[1 0 0 1 859.64789 149.28038] CT
0.302 GC
N
f-1586420743
f
GR
GS
[1 0 0 1 868.73822 135.53392] CT
0.302 GC
N
f-1586420743
f
GR
GS
[1 0 0 1 868.55408 180.75992] CT
0.302 GC
N
f-1586420743
f
GR
GS
[1 0 0 1 876.35437 93.82576] CT
0.302 GC
N
f-1586420743
f
GR
GS
[1 0 0 1 878.9295 185.76068] CT
0.302 GC
N
f-1586420743
f
GR
GS
[1 0 0 1 876.3363 225.79677] CT
0.302 GC
N
f-1586420743
f
GR
GS
[1 0 0 1 882.08392 201.64832] CT
0.302 GC
N
f-1586420743
f
GR
GS
[1 0 0 1 857.15277 186.89221] CT
0.302 GC
N
f-1586420743
f
GR
GS
[1 0 0 1 880.85693 119.87757] CT
0.302 GC
N
f-1586420743
f
GR
GS
[1 0 0 1 852.87677 141.17345] CT
0.302 GC
N
f-1586420743
f
GR
GS
[1 0 0 1 859.05438 71.64353] CT
0.302 GC
N
f-1586420743
f
GR
GS
[1 0 0 1 851.7298 223.9437] CT
0.302 GC
N
f-1586420743
f
GR
GS
[1 0 0 1 872.67236 121.84624] CT
0.302 GC
N
f-1586420743
f
GR
GS
[1 0 0 1 880.04211 208.52235] CT
0.302 GC
N
f-1586420743
f
GR
GS
[1 0 0 1 869.53833 91.90615] CT
0.302 GC
N
f-1586420743
f
GR
GS
[1 0 0 1 856.36255 132.86823] CT
0.302 GC
N
f-1586420743
f
GR
GS
[1 0 0 1 861.69458 138.08983] CT
0.302 GC
N
f-1586420743
f
GR
GS
[1 0 0 1 874.07678 194.08931] CT
0.302 GC
N
f-1586420743
f
GR
%%Trailer
%%Pages: 1
%%EOF
