%!PS-Adobe-3.0 EPSF-3.0
%%Creator: (MATLAB, The Mathworks, Inc. Version 9.8.0.1323502 \(R2020a\). Operating System: Mac OS X)
%%Title: /Users/kosciessa/Volumes/tardis/LNDG/stateswitch/stsw_beh_task/hddm/figures/D_compareYAOA_vt_linearEffects.eps
%%CreationDate: 2022-02-10T11:31:58
%%Pages: (atend)
%%BoundingBox:    84     0   927   284
%%LanguageLevel: 3
%%EndComments
%%BeginProlog
%%BeginResource: procset (Apache XML Graphics Std ProcSet) 1.2 0
%%Version: 1.2 0
%%Copyright: (Copyright 2001-2003,2010 The Apache Software Foundation. License terms: http://www.apache.org/licenses/LICENSE-2.0)
/bd{bind def}bind def
/ld{load def}bd
/GR/grestore ld
/GS/gsave ld
/RM/rmoveto ld
/C/curveto ld
/t/show ld
/L/lineto ld
/ML/setmiterlimit ld
/CT/concat ld
/f/fill ld
/N/newpath ld
/S/stroke ld
/CC/setcmykcolor ld
/A/ashow ld
/cp/closepath ld
/RC/setrgbcolor ld
/LJ/setlinejoin ld
/GC/setgray ld
/LW/setlinewidth ld
/M/moveto ld
/re {4 2 roll M
1 index 0 rlineto
0 exch rlineto
neg 0 rlineto
cp } bd
/_ctm matrix def
/_tm matrix def
/BT { _ctm currentmatrix pop matrix _tm copy pop 0 0 moveto } bd
/ET { _ctm setmatrix } bd
/iTm { _ctm setmatrix _tm concat } bd
/Tm { _tm astore pop iTm 0 0 moveto } bd
/ux 0.0 def
/uy 0.0 def
/F {
  /Tp exch def
  /Tf exch def
  Tf findfont Tp scalefont setfont
  /cf Tf def  /cs Tp def
} bd
/ULS {currentpoint /uy exch def /ux exch def} bd
/ULE {
  /Tcx currentpoint pop def
  gsave
  newpath
  cf findfont cs scalefont dup
  /FontMatrix get 0 get /Ts exch def /FontInfo get dup
  /UnderlinePosition get Ts mul /To exch def
  /UnderlineThickness get Ts mul /Tt exch def
  ux uy To add moveto  Tcx uy To add lineto
  Tt setlinewidth stroke
  grestore
} bd
/OLE {
  /Tcx currentpoint pop def
  gsave
  newpath
  cf findfont cs scalefont dup
  /FontMatrix get 0 get /Ts exch def /FontInfo get dup
  /UnderlinePosition get Ts mul /To exch def
  /UnderlineThickness get Ts mul /Tt exch def
  ux uy To add cs add moveto Tcx uy To add cs add lineto
  Tt setlinewidth stroke
  grestore
} bd
/SOE {
  /Tcx currentpoint pop def
  gsave
  newpath
  cf findfont cs scalefont dup
  /FontMatrix get 0 get /Ts exch def /FontInfo get dup
  /UnderlinePosition get Ts mul /To exch def
  /UnderlineThickness get Ts mul /Tt exch def
  ux uy To add cs 10 mul 26 idiv add moveto Tcx uy To add cs 10 mul 26 idiv add lineto
  Tt setlinewidth stroke
  grestore
} bd
/QT {
/Y22 exch store
/X22 exch store
/Y21 exch store
/X21 exch store
currentpoint
/Y21 load 2 mul add 3 div exch
/X21 load 2 mul add 3 div exch
/X21 load 2 mul /X22 load add 3 div
/Y21 load 2 mul /Y22 load add 3 div
/X22 load /Y22 load curveto
} bd
/SSPD {
dup length /d exch dict def
{
/v exch def
/k exch def
currentpagedevice k known {
/cpdv currentpagedevice k get def
v cpdv ne {
/upd false def
/nullv v type /nulltype eq def
/nullcpdv cpdv type /nulltype eq def
nullv nullcpdv or
{
/upd true def
} {
/sametype v type cpdv type eq def
sametype {
v type /arraytype eq {
/vlen v length def
/cpdvlen cpdv length def
vlen cpdvlen eq {
0 1 vlen 1 sub {
/i exch def
/obj v i get def
/cpdobj cpdv i get def
obj cpdobj ne {
/upd true def
exit
} if
} for
} {
/upd true def
} ifelse
} {
v type /dicttype eq {
v {
/dv exch def
/dk exch def
/cpddv cpdv dk get def
dv cpddv ne {
/upd true def
exit
} if
} forall
} {
/upd true def
} ifelse
} ifelse
} if
} ifelse
upd true eq {
d k v put
} if
} if
} if
} forall
d length 0 gt {
d setpagedevice
} if
} bd
/RE { % /NewFontName [NewEncodingArray] /FontName RE -
  findfont dup length dict begin
  {
    1 index /FID ne
    {def} {pop pop} ifelse
  } forall
  /Encoding exch def
  /FontName 1 index def
  currentdict definefont pop
  end
} bind def
%%EndResource
%%BeginResource: procset (Apache XML Graphics EPS ProcSet) 1.0 0
%%Version: 1.0 0
%%Copyright: (Copyright 2002-2003 The Apache Software Foundation. License terms: http://www.apache.org/licenses/LICENSE-2.0)
/BeginEPSF { %def
/b4_Inc_state save def         % Save state for cleanup
/dict_count countdictstack def % Count objects on dict stack
/op_count count 1 sub def      % Count objects on operand stack
userdict begin                 % Push userdict on dict stack
/showpage { } def              % Redefine showpage, { } = null proc
0 setgray 0 setlinecap         % Prepare graphics state
1 setlinewidth 0 setlinejoin
10 setmiterlimit [ ] 0 setdash newpath
/languagelevel where           % If level not equal to 1 then
{pop languagelevel             % set strokeadjust and
1 ne                           % overprint to their defaults.
{false setstrokeadjust false setoverprint
} if
} if
} bd
/EndEPSF { %def
count op_count sub {pop} repeat            % Clean up stacks
countdictstack dict_count sub {end} repeat
b4_Inc_state restore
} bd
%%EndResource
%FOPBeginFontDict
%%IncludeResource: font Courier-Oblique
%%IncludeResource: font Courier-BoldOblique
%%IncludeResource: font Courier-Bold
%%IncludeResource: font ZapfDingbats
%%IncludeResource: font Symbol
%%IncludeResource: font Helvetica
%%IncludeResource: font Helvetica-Oblique
%%IncludeResource: font Helvetica-Bold
%%IncludeResource: font Helvetica-BoldOblique
%%IncludeResource: font Times-Roman
%%IncludeResource: font Times-Italic
%%IncludeResource: font Times-Bold
%%IncludeResource: font Times-BoldItalic
%%IncludeResource: font Courier
%FOPEndFontDict
%%BeginResource: encoding WinAnsiEncoding
/WinAnsiEncoding [
/.notdef /.notdef /.notdef /.notdef /.notdef
/.notdef /.notdef /.notdef /.notdef /.notdef
/.notdef /.notdef /.notdef /.notdef /.notdef
/.notdef /.notdef /.notdef /.notdef /.notdef
/.notdef /.notdef /.notdef /.notdef /.notdef
/.notdef /.notdef /.notdef /.notdef /.notdef
/.notdef /.notdef /space /exclam /quotedbl
/numbersign /dollar /percent /ampersand /quotesingle
/parenleft /parenright /asterisk /plus /comma
/hyphen /period /slash /zero /one
/two /three /four /five /six
/seven /eight /nine /colon /semicolon
/less /equal /greater /question /at
/A /B /C /D /E
/F /G /H /I /J
/K /L /M /N /O
/P /Q /R /S /T
/U /V /W /X /Y
/Z /bracketleft /backslash /bracketright /asciicircum
/underscore /quoteleft /a /b /c
/d /e /f /g /h
/i /j /k /l /m
/n /o /p /q /r
/s /t /u /v /w
/x /y /z /braceleft /bar
/braceright /asciitilde /bullet /Euro /bullet
/quotesinglbase /florin /quotedblbase /ellipsis /dagger
/daggerdbl /circumflex /perthousand /Scaron /guilsinglleft
/OE /bullet /Zcaron /bullet /bullet
/quoteleft /quoteright /quotedblleft /quotedblright /bullet
/endash /emdash /asciitilde /trademark /scaron
/guilsinglright /oe /bullet /zcaron /Ydieresis
/space /exclamdown /cent /sterling /currency
/yen /brokenbar /section /dieresis /copyright
/ordfeminine /guillemotleft /logicalnot /sfthyphen /registered
/macron /degree /plusminus /twosuperior /threesuperior
/acute /mu /paragraph /middot /cedilla
/onesuperior /ordmasculine /guillemotright /onequarter /onehalf
/threequarters /questiondown /Agrave /Aacute /Acircumflex
/Atilde /Adieresis /Aring /AE /Ccedilla
/Egrave /Eacute /Ecircumflex /Edieresis /Igrave
/Iacute /Icircumflex /Idieresis /Eth /Ntilde
/Ograve /Oacute /Ocircumflex /Otilde /Odieresis
/multiply /Oslash /Ugrave /Uacute /Ucircumflex
/Udieresis /Yacute /Thorn /germandbls /agrave
/aacute /acircumflex /atilde /adieresis /aring
/ae /ccedilla /egrave /eacute /ecircumflex
/edieresis /igrave /iacute /icircumflex /idieresis
/eth /ntilde /ograve /oacute /ocircumflex
/otilde /odieresis /divide /oslash /ugrave
/uacute /ucircumflex /udieresis /yacute /thorn
/ydieresis
] def
%%EndResource
%FOPBeginFontReencode
/Courier-Oblique findfont
dup length dict begin
  {1 index /FID ne {def} {pop pop} ifelse} forall
  /Encoding WinAnsiEncoding def
  currentdict
end
/Courier-Oblique exch definefont pop
/Courier-BoldOblique findfont
dup length dict begin
  {1 index /FID ne {def} {pop pop} ifelse} forall
  /Encoding WinAnsiEncoding def
  currentdict
end
/Courier-BoldOblique exch definefont pop
/Courier-Bold findfont
dup length dict begin
  {1 index /FID ne {def} {pop pop} ifelse} forall
  /Encoding WinAnsiEncoding def
  currentdict
end
/Courier-Bold exch definefont pop
/Helvetica findfont
dup length dict begin
  {1 index /FID ne {def} {pop pop} ifelse} forall
  /Encoding WinAnsiEncoding def
  currentdict
end
/Helvetica exch definefont pop
/Helvetica-Oblique findfont
dup length dict begin
  {1 index /FID ne {def} {pop pop} ifelse} forall
  /Encoding WinAnsiEncoding def
  currentdict
end
/Helvetica-Oblique exch definefont pop
/Helvetica-Bold findfont
dup length dict begin
  {1 index /FID ne {def} {pop pop} ifelse} forall
  /Encoding WinAnsiEncoding def
  currentdict
end
/Helvetica-Bold exch definefont pop
/Helvetica-BoldOblique findfont
dup length dict begin
  {1 index /FID ne {def} {pop pop} ifelse} forall
  /Encoding WinAnsiEncoding def
  currentdict
end
/Helvetica-BoldOblique exch definefont pop
/Times-Roman findfont
dup length dict begin
  {1 index /FID ne {def} {pop pop} ifelse} forall
  /Encoding WinAnsiEncoding def
  currentdict
end
/Times-Roman exch definefont pop
/Times-Italic findfont
dup length dict begin
  {1 index /FID ne {def} {pop pop} ifelse} forall
  /Encoding WinAnsiEncoding def
  currentdict
end
/Times-Italic exch definefont pop
/Times-Bold findfont
dup length dict begin
  {1 index /FID ne {def} {pop pop} ifelse} forall
  /Encoding WinAnsiEncoding def
  currentdict
end
/Times-Bold exch definefont pop
/Times-BoldItalic findfont
dup length dict begin
  {1 index /FID ne {def} {pop pop} ifelse} forall
  /Encoding WinAnsiEncoding def
  currentdict
end
/Times-BoldItalic exch definefont pop
/Courier findfont
dup length dict begin
  {1 index /FID ne {def} {pop pop} ifelse} forall
  /Encoding WinAnsiEncoding def
  currentdict
end
/Courier exch definefont pop
%FOPEndFontReencode
%%EndProlog
%%Page: 1 1
%%PageBoundingBox: 0 0 1024 288
%%BeginPageSetup
[1 0 0 -1 0 288] CT
%%EndPageSetup
GS
1 GC
N
0 0 1024 288 re
f
GR
GS
1 GC
N
0 0 1024 288 re
f
GR
GS
1 GC
N
154 228.5 M
351.5 228.5 L
351.5 33 L
154 33 L
cp
f
GR
GS
0.149 GC
2 setlinecap
1 LJ
0.5 LW
N
154 228.5 M
351.5 228.5 L
S
GR
GS
0.149 GC
2 setlinecap
1 LJ
0.5 LW
N
213.25 228.5 M
213.25 226.525 L
S
GR
GS
0.149 GC
2 setlinecap
1 LJ
0.5 LW
N
292.25 228.5 M
292.25 226.525 L
S
GR
GS
[1 0 0 1 213.25 234.89999] CT
0.149 GC
/Helvetica 22 F
GS
[1 0 0 1 0 0] CT
-14.5 21 moveto 
1 -1 scale
(YA) t 
GR
GR
GS
[1 0 0 1 292.25 234.89999] CT
0.149 GC
/Helvetica 22 F
GS
[1 0 0 1 0 0] CT
-15.5 21 moveto 
1 -1 scale
(OA) t 
GR
GR
GS
[1 0 0 1 252.75009 261.90002] CT
0.149 GC
/Helvetica 22 F
GS
[1 0 0 1 0 0] CT
-53.5 21 moveto 
1 -1 scale
(Age Group) t 
GR
GR
GS
0.149 GC
2 setlinecap
1 LJ
0.5 LW
N
154 228.5 M
154 33 L
S
GR
GS
0.149 GC
2 setlinecap
1 LJ
0.5 LW
N
154 228.5 M
155.975 228.5 L
S
GR
GS
0.149 GC
2 setlinecap
1 LJ
0.5 LW
N
154 131.513 M
155.975 131.513 L
S
GR
GS
0.149 GC
2 setlinecap
1 LJ
0.5 LW
N
154 34.526 M
155.975 34.526 L
S
GR
GS
[1 0 0 1 147.60001 228.5] CT
0.149 GC
/Helvetica 22 F
GS
[1 0 0 1 0 0] CT
-21 8 moveto 
1 -1 scale
(-1) t 
GR
GR
GS
[1 0 0 1 147.60001 131.51279] CT
0.149 GC
/Helvetica 22 F
GS
[1 0 0 1 0 0] CT
-40 8 moveto 
1 -1 scale
(-0.5) t 
GR
GR
GS
[1 0 0 1 147.60001 34.52556] CT
0.149 GC
/Helvetica 22 F
GS
[1 0 0 1 0 0] CT
-13 8 moveto 
1 -1 scale
(0) t 
GR
GR
GS
[0 -1 1 0 105.1 130.74991] CT
0.149 GC
/Helvetica 22 F
GS
[1 0 0 1 0 0] CT
-50.5 -5 moveto 
1 -1 scale
(Drift linear) t 
GR
GR
GS
[1 0 0 1 252.75024 30.25] CT
/Helvetica-Bold 22 F
GS
[1 0 0 1 0 0] CT
-76.5 -5 moveto 
1 -1 scale
(p = 7.8962e-10) t 
GR
GR
GS
0.149 GC
1 LJ
0.5 LW
N
154 34.526 M
351.5 34.526 L
S
GR
GS
0.6 0.902 1 RC
N
181.65 34.526 M
181.65 129.969 L
244.85 129.969 L
244.85 34.526 L
cp
f
GR
GS
[1 0 0 1 197.52422 148.03572] CT
0.302 GC
N
2.236 0 M
2.236 -1.235 1.235 -2.236 0 -2.236 C
-1.235 -2.236 -2.236 -1.235 -2.236 0 C
-2.236 1.235 -1.235 2.236 0 2.236 C
1.235 2.236 2.236 1.235 2.236 0 C
cp
f
GR
GS
[1 0 0 1 217.68063 124.47443] CT
0.302 GC
N
/f-1586420743{2.236 0 M
2.236 -1.235 1.235 -2.236 0 -2.236 C
-1.235 -2.236 -2.236 -1.235 -2.236 0 C
-2.236 1.235 -1.235 2.236 0 2.236 C
1.235 2.236 2.236 1.235 2.236 0 C
cp}def
f-1586420743
f
GR
GS
[1 0 0 1 222.83057 104.8343] CT
0.302 GC
N
f-1586420743
f
GR
GS
[1 0 0 1 205.19614 95.99337] CT
0.302 GC
N
f-1586420743
f
GR
GS
[1 0 0 1 199.47626 86.96819] CT
0.302 GC
N
f-1586420743
f
GR
GS
[1 0 0 1 205.76549 71.58302] CT
0.302 GC
N
f-1586420743
f
GR
GS
[1 0 0 1 200.69597 143.82864] CT
0.302 GC
N
f-1586420743
f
GR
GS
[1 0 0 1 212.73552 126.20616] CT
0.302 GC
N
f-1586420743
f
GR
GS
[1 0 0 1 210.68675 176.70992] CT
0.302 GC
N
f-1586420743
f
GR
GS
[1 0 0 1 209.49873 44.03239] CT
0.302 GC
N
f-1586420743
f
GR
GS
[1 0 0 1 225.47177 63.41101] CT
0.302 GC
N
f-1586420743
f
GR
GS
[1 0 0 1 210.73962 116.8584] CT
0.302 GC
N
f-1586420743
f
GR
GS
[1 0 0 1 206.4196 113.23837] CT
0.302 GC
N
f-1586420743
f
GR
GS
[1 0 0 1 198.97252 116.65387] CT
0.302 GC
N
f-1586420743
f
GR
GS
[1 0 0 1 204.37564 98.58115] CT
0.302 GC
N
f-1586420743
f
GR
GS
[1 0 0 1 205.00797 84.3952] CT
0.302 GC
N
f-1586420743
f
GR
GS
[1 0 0 1 198.37457 139.6011] CT
0.302 GC
N
f-1586420743
f
GR
GS
[1 0 0 1 219.64302 68.21291] CT
0.302 GC
N
f-1586420743
f
GR
GS
[1 0 0 1 197.69128 96.83369] CT
0.302 GC
N
f-1586420743
f
GR
GS
[1 0 0 1 216.7551 97.64152] CT
0.302 GC
N
f-1586420743
f
GR
GS
[1 0 0 1 210.34563 67.05984] CT
0.302 GC
N
f-1586420743
f
GR
GS
[1 0 0 1 205.31671 109.35674] CT
0.302 GC
N
f-1586420743
f
GR
GS
[1 0 0 1 218.06773 140.66469] CT
0.302 GC
N
f-1586420743
f
GR
GS
[1 0 0 1 200.72604 117.23386] CT
0.302 GC
N
f-1586420743
f
GR
GS
[1 0 0 1 214.37386 145.23563] CT
0.302 GC
N
f-1586420743
f
GR
GS
[1 0 0 1 202.6599 121.1931] CT
0.302 GC
N
f-1586420743
f
GR
GS
[1 0 0 1 225.36667 180.00627] CT
0.302 GC
N
f-1586420743
f
GR
GS
[1 0 0 1 218.51004 178.42125] CT
0.302 GC
N
f-1586420743
f
GR
GS
[1 0 0 1 224.23866 144.89972] CT
0.302 GC
N
f-1586420743
f
GR
GS
[1 0 0 1 221.55008 72.82454] CT
0.302 GC
N
f-1586420743
f
GR
GS
[1 0 0 1 222.95163 175.8465] CT
0.302 GC
N
f-1586420743
f
GR
GS
[1 0 0 1 217.45129 186.08185] CT
0.302 GC
N
f-1586420743
f
GR
GS
[1 0 0 1 219.89951 171.19571] CT
0.302 GC
N
f-1586420743
f
GR
GS
[1 0 0 1 219.21178 92.45798] CT
0.302 GC
N
f-1586420743
f
GR
GS
[1 0 0 1 207.59195 208.41649] CT
0.302 GC
N
f-1586420743
f
GR
GS
[1 0 0 1 214.25009 181.66136] CT
0.302 GC
N
f-1586420743
f
GR
GS
[1 0 0 1 225.04292 143.21481] CT
0.302 GC
N
f-1586420743
f
GR
GS
[1 0 0 1 199.17345 111.72234] CT
0.302 GC
N
f-1586420743
f
GR
GS
[1 0 0 1 213.26266 214.80032] CT
0.302 GC
N
f-1586420743
f
GR
GS
[1 0 0 1 211.12532 211.72269] CT
0.302 GC
N
f-1586420743
f
GR
GS
[1 0 0 1 226.02533 167.26006] CT
0.302 GC
N
f-1586420743
f
GR
GS
[1 0 0 1 217.3638 166.731] CT
0.302 GC
N
f-1586420743
f
GR
GS
[1 0 0 1 215.94234 191.88213] CT
0.302 GC
N
f-1586420743
f
GR
GS
[1 0 0 1 224.01411 119.04165] CT
0.302 GC
N
f-1586420743
f
GR
GS
[1 0 0 1 212.26451 178.24132] CT
0.302 GC
N
f-1586420743
f
GR
GS
[1 0 0 1 214.67903 84.64323] CT
0.302 GC
N
f-1586420743
f
GR
GS
[1 0 0 1 203.1097 150.79596] CT
0.302 GC
N
f-1586420743
f
GR
GS
[1 0 0 1 217.49899 111.06217] CT
0.302 GC
N
f-1586420743
f
GR
GS
[1 0 0 1 227.8795 106.71455] CT
0.302 GC
N
f-1586420743
f
GR
GS
0.6 0.902 1 RC
N
/f882829918{260.65 34.526 M
260.65 84.012 L
323.85 84.012 L
323.85 34.526 L
cp}def
f882829918
f
GR
GS
[1 0 0 1 293.32483 79.35078] CT
0.302 GC
N
f-1586420743
f
GR
GS
[1 0 0 1 291.6058 101.94405] CT
0.302 GC
N
f-1586420743
f
GR
GS
[1 0 0 1 301.52985 76.79212] CT
0.302 GC
N
f-1586420743
f
GR
GS
[1 0 0 1 279.37976 43.39867] CT
0.302 GC
N
f-1586420743
f
GR
GS
[1 0 0 1 304.28326 114.80424] CT
0.302 GC
N
f-1586420743
f
GR
GS
[1 0 0 1 276.57242 68.27275] CT
0.302 GC
N
f-1586420743
f
GR
GS
[1 0 0 1 292.61432 107.39133] CT
0.302 GC
N
f-1586420743
f
GR
GS
[1 0 0 1 297.88943 81.15717] CT
0.302 GC
N
f-1586420743
f
GR
GS
[1 0 0 1 291.56931 85.64789] CT
0.302 GC
N
f-1586420743
f
GR
GS
[1 0 0 1 286.57822 90.4465] CT
0.302 GC
N
f-1586420743
f
GR
GS
[1 0 0 1 295.45993 92.4132] CT
0.302 GC
N
f-1586420743
f
GR
GS
[1 0 0 1 305.30563 62.7445] CT
0.302 GC
N
f-1586420743
f
GR
GS
[1 0 0 1 298.01755 142.4111] CT
0.302 GC
N
f-1586420743
f
GR
GS
[1 0 0 1 306.36676 98.75739] CT
0.302 GC
N
f-1586420743
f
GR
GS
[1 0 0 1 279.58121 87.67023] CT
0.302 GC
N
f-1586420743
f
GR
GS
[1 0 0 1 292.59851 132.54626] CT
0.302 GC
N
f-1586420743
f
GR
GS
[1 0 0 1 279.93005 98.69009] CT
0.302 GC
N
f-1586420743
f
GR
GS
[1 0 0 1 293.68027 80.50646] CT
0.302 GC
N
f-1586420743
f
GR
GS
[1 0 0 1 281.10837 65.34409] CT
0.302 GC
N
f-1586420743
f
GR
GS
[1 0 0 1 301.02094 42.02802] CT
0.302 GC
N
f-1586420743
f
GR
GS
[1 0 0 1 289.06003 83.43192] CT
0.302 GC
N
f-1586420743
f
GR
GS
[1 0 0 1 304.83627 87.62757] CT
0.302 GC
N
f-1586420743
f
GR
GS
[1 0 0 1 286.15259 67.39226] CT
0.302 GC
N
f-1586420743
f
GR
GS
[1 0 0 1 278.37921 60.71027] CT
0.302 GC
N
f-1586420743
f
GR
GS
[1 0 0 1 283.38528 77.49248] CT
0.302 GC
N
f-1586420743
f
GR
GS
[1 0 0 1 279.06754 89.94967] CT
0.302 GC
N
f-1586420743
f
GR
GS
[1 0 0 1 306.48248 128.97476] CT
0.302 GC
N
f-1586420743
f
GR
GS
[1 0 0 1 276.96732 80.64988] CT
0.302 GC
N
f-1586420743
f
GR
GS
[1 0 0 1 280.07352 104.61268] CT
0.302 GC
N
f-1586420743
f
GR
GS
[1 0 0 1 276.84216 118.37544] CT
0.302 GC
N
f-1586420743
f
GR
GS
[1 0 0 1 283.28278 58.79298] CT
0.302 GC
N
f-1586420743
f
GR
GS
[1 0 0 1 276.81113 120.73528] CT
0.302 GC
N
f-1586420743
f
GR
GS
[1 0 0 1 296.7514 56.64909] CT
0.302 GC
N
f-1586420743
f
GR
GS
[1 0 0 1 292.78693 82.35478] CT
0.302 GC
N
f-1586420743
f
GR
GS
[1 0 0 1 284.20914 76.76812] CT
0.302 GC
N
f-1586420743
f
GR
GS
[1 0 0 1 282.57242 70.51107] CT
0.302 GC
N
f-1586420743
f
GR
GS
[1 0 0 1 279.3215 52.43899] CT
0.302 GC
N
f-1586420743
f
GR
GS
[1 0 0 1 288.09274 74.24127] CT
0.302 GC
N
f-1586420743
f
GR
GS
[1 0 0 1 276.69626 88.2409] CT
0.302 GC
N
f-1586420743
f
GR
GS
[1 0 0 1 295.49536 93.42564] CT
0.302 GC
N
f-1586420743
f
GR
GS
[1 0 0 1 291.58182 33] CT
0.302 GC
N
f-1586420743
f
GR
GS
[1 0 0 1 286.18652 58.81894] CT
0.302 GC
N
f-1586420743
f
GR
GS
[1 0 0 1 299.97446 93.8297] CT
0.302 GC
N
f-1586420743
f
GR
GS
[1 0 0 1 302.97345 83.09377] CT
0.302 GC
N
f-1586420743
f
GR
GS
[1 0 0 1 284.74286 72.21315] CT
0.302 GC
N
f-1586420743
f
GR
GS
[1 0 0 1 292.69992 81.18174] CT
0.302 GC
N
f-1586420743
f
GR
GS
[1 0 0 1 290.56805 84.66128] CT
0.302 GC
N
f-1586420743
f
GR
GS
[1 0 0 1 287.23227 88.87288] CT
0.302 GC
N
f-1586420743
f
GR
GS
[1 0 0 1 302.96689 108.12012] CT
0.302 GC
N
f-1586420743
f
GR
GS
[1 0 0 1 307.49677 80.5342] CT
0.302 GC
N
f-1586420743
f
GR
GS
[1 0 0 1 296.24628 119.59248] CT
0.302 GC
N
f-1586420743
f
GR
GS
[1 0 0 1 286.83173 62.4334] CT
0.302 GC
N
f-1586420743
f
GR
GS
[1 0 0 1 284.92468 60.58546] CT
0.302 GC
N
f-1586420743
f
GR
GS
1 GC
N
/f1434451346{441.5 228.5 M
639 228.5 L
639 33 L
441.5 33 L
cp}def
f1434451346
f
GR
GS
0.149 GC
2 setlinecap
1 LJ
0.5 LW
N
441.5 228.5 M
639 228.5 L
S
GR
GS
0.149 GC
2 setlinecap
1 LJ
0.5 LW
N
500.75 228.5 M
500.75 226.525 L
S
GR
GS
0.149 GC
2 setlinecap
1 LJ
0.5 LW
N
579.75 228.5 M
579.75 226.525 L
S
GR
GS
[1 0 0 1 500.75 234.89999] CT
0.149 GC
/Helvetica 22 F
GS
[1 0 0 1 0 0] CT
-14.5 21 moveto 
1 -1 scale
(YA) t 
GR
GR
GS
[1 0 0 1 579.75 234.89999] CT
0.149 GC
/Helvetica 22 F
GS
[1 0 0 1 0 0] CT
-15.5 21 moveto 
1 -1 scale
(OA) t 
GR
GR
GS
[1 0 0 1 540.25012 261.89999] CT
0.149 GC
/Helvetica 22 F
GS
[1 0 0 1 0 0] CT
-53.5 21 moveto 
1 -1 scale
(Age Group) t 
GR
GR
GS
0.149 GC
2 setlinecap
1 LJ
0.5 LW
N
441.5 228.5 M
441.5 33 L
S
GR
GS
0.149 GC
2 setlinecap
1 LJ
0.5 LW
N
441.5 228.5 M
443.475 228.5 L
S
GR
GS
0.149 GC
2 setlinecap
1 LJ
0.5 LW
N
441.5 179.625 M
443.475 179.625 L
S
GR
GS
0.149 GC
2 setlinecap
1 LJ
0.5 LW
N
441.5 130.75 M
443.475 130.75 L
S
GR
GS
0.149 GC
2 setlinecap
1 LJ
0.5 LW
N
441.5 81.875 M
443.475 81.875 L
S
GR
GS
0.149 GC
2 setlinecap
1 LJ
0.5 LW
N
441.5 33 M
443.475 33 L
S
GR
GS
[1 0 0 1 435.10001 228.5] CT
0.149 GC
/Helvetica 22 F
GS
[1 0 0 1 0 0] CT
-21 8 moveto 
1 -1 scale
(-2) t 
GR
GR
GS
[1 0 0 1 435.10001 179.625] CT
0.149 GC
/Helvetica 22 F
GS
[1 0 0 1 0 0] CT
-21 8 moveto 
1 -1 scale
(-1) t 
GR
GR
GS
[1 0 0 1 435.10001 130.75] CT
0.149 GC
/Helvetica 22 F
GS
[1 0 0 1 0 0] CT
-13 8 moveto 
1 -1 scale
(0) t 
GR
GR
GS
[1 0 0 1 435.10001 81.875] CT
0.149 GC
/Helvetica 22 F
GS
[1 0 0 1 0 0] CT
-13 8 moveto 
1 -1 scale
(1) t 
GR
GR
GS
[1 0 0 1 435.10001 33] CT
0.149 GC
/Helvetica 22 F
GS
[1 0 0 1 0 0] CT
-13 8 moveto 
1 -1 scale
(2) t 
GR
GR
GS
[0 -1 1 0 411.10001 130.74991] CT
0.149 GC
/Helvetica 22 F
GS
[1 0 0 1 0 0] CT
-78.5 -5 moveto 
1 -1 scale
(Threshold linear) t 
GR
GR
GS
[1 0 0 1 442 28] CT
0.149 GC
N
3.234 -0.641 M
3.234 -0.813 3.344 -0.953 QT
7.922 -5.5 L
3.344 -10.078 L
3.234 -10.188 3.234 -10.359 QT
3.234 -10.531 3.359 -10.672 QT
3.484 -10.813 3.672 -10.813 QT
3.828 -10.813 4 -10.672 QT
8.563 -6.109 L
13.094 -10.672 L
13.281 -10.813 13.422 -10.813 QT
13.594 -10.813 13.727 -10.68 QT
13.859 -10.547 13.859 -10.359 QT
13.859 -10.188 13.75 -10.078 QT
9.172 -5.5 L
13.75 -0.953 L
13.859 -0.813 13.859 -0.641 QT
13.859 -0.453 13.727 -0.32 QT
13.594 -0.188 13.422 -0.188 QT
13.25 -0.188 13.094 -0.359 QT
8.563 -4.891 L
4 -0.359 L
3.844 -0.188 3.672 -0.188 QT
3.484 -0.188 3.359 -0.328 QT
3.234 -0.469 3.234 -0.641 QT
cp
f
GR
GS
[1 0 0 1 460 28] CT
0.149 GC
/Helvetica 22 F
GS
[1 0 0 1 0 0] CT
0 0 moveto 
1 -1 scale
(10) t 
GR
GR
GS
[1 0 0 1 485 17] CT
0.149 GC
/Helvetica 17.6 F
GS
[1 0 0 1 0 0] CT
0 0 moveto 
1 -1 scale
(-16) t 
GR
GR
GS
[1 0 0 1 540.25049 30.25001] CT
/Helvetica-Bold 22 F
GS
[1 0 0 1 0 0] CT
-59.5 -5 moveto 
1 -1 scale
(p = 0.76393) t 
GR
GR
GS
0.149 GC
1 LJ
0.5 LW
N
441.5 130.75 M
639 130.75 L
S
GR
GS
1 0.6 0.6 RC
N
/f355278818{469.15 130.75 M
469.15 155.433 L
532.35 155.433 L
532.35 130.75 L
cp}def
f355278818
f
GR
GS
[1 0 0 1 502.33755 156.62531] CT
0.302 GC
N
f-1586420743
f
GR
GS
[1 0 0 1 490.65433 157.66479] CT
0.302 GC
N
f-1586420743
f
GR
GS
[1 0 0 1 506.39035 170.95209] CT
0.302 GC
N
f-1586420743
f
GR
GS
[1 0 0 1 486.70975 117.11962] CT
0.302 GC
N
f-1586420743
f
GR
GS
[1 0 0 1 486.02621 109.04435] CT
0.302 GC
N
f-1586420743
f
GR
GS
[1 0 0 1 494.00397 185.88647] CT
0.302 GC
N
f-1586420743
f
GR
GS
[1 0 0 1 487.39554 120.99421] CT
0.302 GC
N
f-1586420743
f
GR
GS
[1 0 0 1 513.40808 150.45111] CT
0.302 GC
N
f-1586420743
f
GR
GS
[1 0 0 1 511.70276 155.9193] CT
0.302 GC
N
f-1586420743
f
GR
GS
[1 0 0 1 497.45407 136.28577] CT
0.302 GC
N
f-1586420743
f
GR
GS
[1 0 0 1 490.29721 174.3098] CT
0.302 GC
N
f-1586420743
f
GR
GS
[1 0 0 1 498.55228 217.59311] CT
0.302 GC
N
f-1586420743
f
GR
GS
[1 0 0 1 498.10248 174.63428] CT
0.302 GC
N
f-1586420743
f
GR
GS
[1 0 0 1 507.97891 174.37607] CT
0.302 GC
N
f-1586420743
f
GR
GS
[1 0 0 1 497.79456 134.6895] CT
0.302 GC
N
f-1586420743
f
GR
GS
[1 0 0 1 515.0271 209.32529] CT
0.302 GC
N
f-1586420743
f
GR
GS
[1 0 0 1 513.76874 134.37645] CT
0.302 GC
N
f-1586420743
f
GR
GS
[1 0 0 1 515.01471 148.1501] CT
0.302 GC
N
f-1586420743
f
GR
GS
[1 0 0 1 495.88364 172.93085] CT
0.302 GC
N
f-1586420743
f
GR
GS
[1 0 0 1 494.1217 150.50783] CT
0.302 GC
N
f-1586420743
f
GR
GS
[1 0 0 1 512.96973 164.40501] CT
0.302 GC
N
f-1586420743
f
GR
GS
[1 0 0 1 491.58698 139.90401] CT
0.302 GC
N
f-1586420743
f
GR
GS
[1 0 0 1 489.08569 133.15463] CT
0.302 GC
N
f-1586420743
f
GR
GS
[1 0 0 1 513.56262 137.11827] CT
0.302 GC
N
f-1586420743
f
GR
GS
[1 0 0 1 497.66995 155.13837] CT
0.302 GC
N
f-1586420743
f
GR
GS
[1 0 0 1 491.76807 106.1671] CT
0.302 GC
N
f-1586420743
f
GR
GS
[1 0 0 1 487.43817 165.59914] CT
0.302 GC
N
f-1586420743
f
GR
GS
[1 0 0 1 514.43469 199.95189] CT
0.302 GC
N
f-1586420743
f
GR
GS
[1 0 0 1 504.00073 172.59442] CT
0.302 GC
N
f-1586420743
f
GR
GS
[1 0 0 1 496.87875 174.36571] CT
0.302 GC
N
f-1586420743
f
GR
GS
[1 0 0 1 505.96182 171.79308] CT
0.302 GC
N
f-1586420743
f
GR
GS
[1 0 0 1 509.98322 178.60149] CT
0.302 GC
N
f-1586420743
f
GR
GS
[1 0 0 1 495.48834 140.21326] CT
0.302 GC
N
f-1586420743
f
GR
GS
[1 0 0 1 506.83801 142.10706] CT
0.302 GC
N
f-1586420743
f
GR
GS
[1 0 0 1 491.39056 99.29293] CT
0.302 GC
N
f-1586420743
f
GR
GS
[1 0 0 1 515.24536 122.05647] CT
0.302 GC
N
f-1586420743
f
GR
GS
[1 0 0 1 507.44391 147.0363] CT
0.302 GC
N
f-1586420743
f
GR
GS
[1 0 0 1 490.22424 182.22662] CT
0.302 GC
N
f-1586420743
f
GR
GS
[1 0 0 1 498.94177 123.40333] CT
0.302 GC
N
f-1586420743
f
GR
GS
[1 0 0 1 504.95261 180.71454] CT
0.302 GC
N
f-1586420743
f
GR
GS
[1 0 0 1 514.33698 212.27106] CT
0.302 GC
N
f-1586420743
f
GR
GS
[1 0 0 1 501.67685 150.60977] CT
0.302 GC
N
f-1586420743
f
GR
GS
[1 0 0 1 506.46387 133.78986] CT
0.302 GC
N
f-1586420743
f
GR
GS
[1 0 0 1 514.12305 135.45056] CT
0.302 GC
N
f-1586420743
f
GR
GS
[1 0 0 1 489.77957 118.0106] CT
0.302 GC
N
f-1586420743
f
GR
GS
[1 0 0 1 497.77078 170.12051] CT
0.302 GC
N
f-1586420743
f
GR
GS
[1 0 0 1 494.82425 186.24951] CT
0.302 GC
N
f-1586420743
f
GR
GS
[1 0 0 1 506.8772 164.84479] CT
0.302 GC
N
f-1586420743
f
GR
GS
[1 0 0 1 513.09576 157.21242] CT
0.302 GC
N
f-1586420743
f
GR
GS
1 0.6 0.6 RC
N
/f-1497141986{548.15 130.75 M
548.15 157.101 L
611.35 157.101 L
611.35 130.75 L
cp}def
f-1497141986
f
GR
GS
[1 0 0 1 579.4552 154.15202] CT
0.302 GC
N
f-1586420743
f
GR
GS
[1 0 0 1 589.414 150.9547] CT
0.302 GC
N
f-1586420743
f
GR
GS
[1 0 0 1 574.2655 142.8176] CT
0.302 GC
N
f-1586420743
f
GR
GS
[1 0 0 1 581.32617 180.37837] CT
0.302 GC
N
f-1586420743
f
GR
GS
[1 0 0 1 576.2356 138.10124] CT
0.302 GC
N
f-1586420743
f
GR
GS
[1 0 0 1 592.28979 161.47241] CT
0.302 GC
N
f-1586420743
f
GR
GS
[1 0 0 1 585.31537 156.83241] CT
0.302 GC
N
f-1586420743
f
GR
GS
[1 0 0 1 590.12732 121.86078] CT
0.302 GC
N
f-1586420743
f
GR
GS
[1 0 0 1 572.77356 150.9769] CT
0.302 GC
N
f-1586420743
f
GR
GS
[1 0 0 1 588.20734 190.89676] CT
0.302 GC
N
f-1586420743
f
GR
GS
[1 0 0 1 570.7774 180.92406] CT
0.302 GC
N
f-1586420743
f
GR
GS
[1 0 0 1 565.02637 168.23425] CT
0.302 GC
N
f-1586420743
f
GR
GS
[1 0 0 1 577.74506 136.60728] CT
0.302 GC
N
f-1586420743
f
GR
GS
[1 0 0 1 593.55487 178.87143] CT
0.302 GC
N
f-1586420743
f
GR
GS
[1 0 0 1 572.23199 148.451] CT
0.302 GC
N
f-1586420743
f
GR
GS
[1 0 0 1 581.95398 210.59317] CT
0.302 GC
N
f-1586420743
f
GR
GS
[1 0 0 1 575.31189 170.32361] CT
0.302 GC
N
f-1586420743
f
GR
GS
[1 0 0 1 564.7981 144.01988] CT
0.302 GC
N
f-1586420743
f
GR
GS
[1 0 0 1 590.08368 139.68137] CT
0.302 GC
N
f-1586420743
f
GR
GS
[1 0 0 1 572.13385 164.79729] CT
0.302 GC
N
f-1586420743
f
GR
GS
[1 0 0 1 565.39996 209.8007] CT
0.302 GC
N
f-1586420743
f
GR
GS
[1 0 0 1 571.73853 112.06777] CT
0.302 GC
N
f-1586420743
f
GR
GS
[1 0 0 1 584.82916 155.75403] CT
0.302 GC
N
f-1586420743
f
GR
GS
[1 0 0 1 574.35931 133.67] CT
0.302 GC
N
f-1586420743
f
GR
GS
[1 0 0 1 584.7901 174.04942] CT
0.302 GC
N
f-1586420743
f
GR
GS
[1 0 0 1 564.36096 130.15974] CT
0.302 GC
N
f-1586420743
f
GR
GS
[1 0 0 1 586.64093 176.49686] CT
0.302 GC
N
f-1586420743
f
GR
GS
[1 0 0 1 576.30933 199.96893] CT
0.302 GC
N
f-1586420743
f
GR
GS
[1 0 0 1 565.00879 144.68932] CT
0.302 GC
N
f-1586420743
f
GR
GS
[1 0 0 1 576.78009 164.59372] CT
0.302 GC
N
f-1586420743
f
GR
GS
[1 0 0 1 586.58533 138.86449] CT
0.302 GC
N
f-1586420743
f
GR
GS
[1 0 0 1 593.06421 158.54605] CT
0.302 GC
N
f-1586420743
f
GR
GS
[1 0 0 1 595.04492 154.99013] CT
0.302 GC
N
f-1586420743
f
GR
GS
[1 0 0 1 595.02612 163.7972] CT
0.302 GC
N
f-1586420743
f
GR
GS
[1 0 0 1 592.27325 177.01431] CT
0.302 GC
N
f-1586420743
f
GR
GS
[1 0 0 1 591.30621 158.60315] CT
0.302 GC
N
f-1586420743
f
GR
GS
[1 0 0 1 589.26038 175.68245] CT
0.302 GC
N
f-1586420743
f
GR
GS
[1 0 0 1 581.4873 185.23032] CT
0.302 GC
N
f-1586420743
f
GR
GS
[1 0 0 1 577.18634 124.49947] CT
0.302 GC
N
f-1586420743
f
GR
GS
[1 0 0 1 567.9671 152.21632] CT
0.302 GC
N
f-1586420743
f
GR
GS
[1 0 0 1 584.63599 161.41075] CT
0.302 GC
N
f-1586420743
f
GR
GS
[1 0 0 1 591.25128 129.04152] CT
0.302 GC
N
f-1586420743
f
GR
GS
[1 0 0 1 572.62732 146.03488] CT
0.302 GC
N
f-1586420743
f
GR
GS
[1 0 0 1 590.49921 144.4016] CT
0.302 GC
N
f-1586420743
f
GR
GS
[1 0 0 1 566.18585 164.4944] CT
0.302 GC
N
f-1586420743
f
GR
GS
[1 0 0 1 575.9198 188.55643] CT
0.302 GC
N
f-1586420743
f
GR
GS
[1 0 0 1 572.42413 138.25377] CT
0.302 GC
N
f-1586420743
f
GR
GS
[1 0 0 1 568.78229 129.36046] CT
0.302 GC
N
f-1586420743
f
GR
GS
[1 0 0 1 583.88959 159.27498] CT
0.302 GC
N
f-1586420743
f
GR
GS
[1 0 0 1 573.94745 42.88053] CT
0.302 GC
N
f-1586420743
f
GR
GS
[1 0 0 1 594.25793 217.74437] CT
0.302 GC
N
f-1586420743
f
GR
GS
[1 0 0 1 583.07916 140.68884] CT
0.302 GC
N
f-1586420743
f
GR
GS
[1 0 0 1 582.16589 182.5519] CT
0.302 GC
N
f-1586420743
f
GR
GS
1 GC
N
/f-964002302{729 228.5 M
926.5 228.5 L
926.5 33 L
729 33 L
cp}def
f-964002302
f
GR
GS
0.149 GC
2 setlinecap
1 LJ
0.5 LW
N
729 228.5 M
926.5 228.5 L
S
GR
GS
0.149 GC
2 setlinecap
1 LJ
0.5 LW
N
788.25 228.5 M
788.25 226.525 L
S
GR
GS
0.149 GC
2 setlinecap
1 LJ
0.5 LW
N
867.25 228.5 M
867.25 226.525 L
S
GR
GS
[1 0 0 1 788.25 234.89999] CT
0.149 GC
/Helvetica 22 F
GS
[1 0 0 1 0 0] CT
-14.5 21 moveto 
1 -1 scale
(YA) t 
GR
GR
GS
[1 0 0 1 867.25 234.89999] CT
0.149 GC
/Helvetica 22 F
GS
[1 0 0 1 0 0] CT
-15.5 21 moveto 
1 -1 scale
(OA) t 
GR
GR
GS
[1 0 0 1 827.75012 261.89999] CT
0.149 GC
/Helvetica 22 F
GS
[1 0 0 1 0 0] CT
-53.5 21 moveto 
1 -1 scale
(Age Group) t 
GR
GR
GS
0.149 GC
2 setlinecap
1 LJ
0.5 LW
N
729 228.5 M
729 33 L
S
GR
GS
0.149 GC
2 setlinecap
1 LJ
0.5 LW
N
729 228.077 M
730.975 228.077 L
S
GR
GS
0.149 GC
2 setlinecap
1 LJ
0.5 LW
N
729 136.909 M
730.975 136.909 L
S
GR
GS
0.149 GC
2 setlinecap
1 LJ
0.5 LW
N
729 45.74 M
730.975 45.74 L
S
GR
GS
[1 0 0 1 722.59998 228.07732] CT
0.149 GC
/Helvetica 22 F
GS
[1 0 0 1 0 0] CT
-13 8 moveto 
1 -1 scale
(0) t 
GR
GR
GS
[1 0 0 1 722.59998 136.90881] CT
0.149 GC
/Helvetica 22 F
GS
[1 0 0 1 0 0] CT
-43 8 moveto 
1 -1 scale
(0.05) t 
GR
GR
GS
[1 0 0 1 722.59998 45.74031] CT
0.149 GC
/Helvetica 22 F
GS
[1 0 0 1 0 0] CT
-31 8 moveto 
1 -1 scale
(0.1) t 
GR
GR
GS
[0 -1 1 0 676.59998 130.74991] CT
0.149 GC
/Helvetica 22 F
GS
[1 0 0 1 0 0] CT
-52 -5 moveto 
1 -1 scale
(NDT linear) t 
GR
GR
GS
[1 0 0 1 827.75079 30.24999] CT
/Helvetica-Bold 22 F
GS
[1 0 0 1 0 0] CT
-65.5 -5 moveto 
1 -1 scale
(p = 0.007317) t 
GR
GR
GS
0.149 GC
1 LJ
0.5 LW
N
729 228.077 M
926.5 228.077 L
S
GR
GS
1 0.6 0.6 RC
N
/f-393105074{819.85 228.077 M
819.85 107.115 L
756.65 107.115 L
756.65 228.077 L
cp}def
f-393105074
f
GR
GS
[1 0 0 1 797.9632 79.56859] CT
0.302 GC
N
f-1586420743
f
GR
GS
[1 0 0 1 793.14697 110.75098] CT
0.302 GC
N
f-1586420743
f
GR
GS
[1 0 0 1 800.20203 49.45411] CT
0.302 GC
N
f-1586420743
f
GR
GS
[1 0 0 1 800.96497 103.16796] CT
0.302 GC
N
f-1586420743
f
GR
GS
[1 0 0 1 777.26056 112.01563] CT
0.302 GC
N
f-1586420743
f
GR
GS
[1 0 0 1 778.53552 99.2114] CT
0.302 GC
N
f-1586420743
f
GR
GS
[1 0 0 1 797.44482 123.76031] CT
0.302 GC
N
f-1586420743
f
GR
GS
[1 0 0 1 774.36829 42.32679] CT
0.302 GC
N
f-1586420743
f
GR
GS
[1 0 0 1 784.76855 123.96002] CT
0.302 GC
N
f-1586420743
f
GR
GS
[1 0 0 1 781.92889 104.43317] CT
0.302 GC
N
f-1586420743
f
GR
GS
[1 0 0 1 795.65009 140.145] CT
0.302 GC
N
f-1586420743
f
GR
GS
[1 0 0 1 775.74298 63.81762] CT
0.302 GC
N
f-1586420743
f
GR
GS
[1 0 0 1 797.49536 81.72152] CT
0.302 GC
N
f-1586420743
f
GR
GS
[1 0 0 1 797.18427 157.20305] CT
0.302 GC
N
f-1586420743
f
GR
GS
[1 0 0 1 789.27374 84.94678] CT
0.302 GC
N
f-1586420743
f
GR
GS
[1 0 0 1 780.45593 42.7944] CT
0.302 GC
N
f-1586420743
f
GR
GS
[1 0 0 1 774.69214 87.23431] CT
0.302 GC
N
f-1586420743
f
GR
GS
[1 0 0 1 792.2254 119.38998] CT
0.302 GC
N
f-1586420743
f
GR
GS
[1 0 0 1 773.22992 70.83669] CT
0.302 GC
N
f-1586420743
f
GR
GS
[1 0 0 1 774.41052 98.66139] CT
0.302 GC
N
f-1586420743
f
GR
GS
[1 0 0 1 776.54572 146.61638] CT
0.302 GC
N
f-1586420743
f
GR
GS
[1 0 0 1 786.68939 67.22081] CT
0.302 GC
N
f-1586420743
f
GR
GS
[1 0 0 1 793.6958 78.9753] CT
0.302 GC
N
f-1586420743
f
GR
GS
[1 0 0 1 788.20087 125.22115] CT
0.302 GC
N
f-1586420743
f
GR
GS
[1 0 0 1 773.99158 139.53621] CT
0.302 GC
N
f-1586420743
f
GR
GS
[1 0 0 1 782.36713 78.52833] CT
0.302 GC
N
f-1586420743
f
GR
GS
[1 0 0 1 792.72552 59.73629] CT
0.302 GC
N
f-1586420743
f
GR
GS
[1 0 0 1 797.2998 168.04538] CT
0.302 GC
N
f-1586420743
f
GR
GS
[1 0 0 1 781.58716 103.66029] CT
0.302 GC
N
f-1586420743
f
GR
GS
[1 0 0 1 788.18262 56.40886] CT
0.302 GC
N
f-1586420743
f
GR
GS
[1 0 0 1 798.31256 213.0235] CT
0.302 GC
N
f-1586420743
f
GR
GS
[1 0 0 1 791.25604 136.5027] CT
0.302 GC
N
f-1586420743
f
GR
GS
[1 0 0 1 789.401 133.39436] CT
0.302 GC
N
f-1586420743
f
GR
GS
[1 0 0 1 782.90558 108.37324] CT
0.302 GC
N
f-1586420743
f
GR
GS
[1 0 0 1 785.45941 149.27957] CT
0.302 GC
N
f-1586420743
f
GR
GS
[1 0 0 1 797.54059 67.83968] CT
0.302 GC
N
f-1586420743
f
GR
GS
[1 0 0 1 783.29535 117.5152] CT
0.302 GC
N
f-1586420743
f
GR
GS
[1 0 0 1 787.06836 100.91494] CT
0.302 GC
N
f-1586420743
f
GR
GS
[1 0 0 1 784.07324 173.2811] CT
0.302 GC
N
f-1586420743
f
GR
GS
[1 0 0 1 793.92444 93.68829] CT
0.302 GC
N
f-1586420743
f
GR
GS
[1 0 0 1 790.39185 82.74467] CT
0.302 GC
N
f-1586420743
f
GR
GS
[1 0 0 1 793.04614 140.80615] CT
0.302 GC
N
f-1586420743
f
GR
GS
[1 0 0 1 785.04126 106.23545] CT
0.302 GC
N
f-1586420743
f
GR
GS
[1 0 0 1 787.53851 165.65724] CT
0.302 GC
N
f-1586420743
f
GR
GS
[1 0 0 1 774.5542 137.90102] CT
0.302 GC
N
f-1586420743
f
GR
GS
[1 0 0 1 785.43848 77.69769] CT
0.302 GC
N
f-1586420743
f
GR
GS
[1 0 0 1 803.0733 116.85951] CT
0.302 GC
N
f-1586420743
f
GR
GS
[1 0 0 1 797.12079 119.30518] CT
0.302 GC
N
f-1586420743
f
GR
GS
[1 0 0 1 795.487 88.2459] CT
0.302 GC
N
f-1586420743
f
GR
GS
1 0.6 0.6 RC
N
/f316679662{898.85 228.077 M
898.85 132.779 L
835.65 132.779 L
835.65 228.077 L
cp}def
f316679662
f
GR
GS
[1 0 0 1 875.64459 185.38747] CT
0.302 GC
N
f-1586420743
f
GR
GS
[1 0 0 1 875.35797 81.48298] CT
0.302 GC
N
f-1586420743
f
GR
GS
[1 0 0 1 878.09735 33] CT
0.302 GC
N
f-1586420743
f
GR
GS
[1 0 0 1 875.78699 157.31349] CT
0.302 GC
N
f-1586420743
f
GR
GS
[1 0 0 1 882.37567 100.98949] CT
0.302 GC
N
f-1586420743
f
GR
GS
[1 0 0 1 854.96893 197.14053] CT
0.302 GC
N
f-1586420743
f
GR
GS
[1 0 0 1 863.966 121.9936] CT
0.302 GC
N
f-1586420743
f
GR
GS
[1 0 0 1 866.99915 154.91577] CT
0.302 GC
N
f-1586420743
f
GR
GS
[1 0 0 1 852.6181 131.72453] CT
0.302 GC
N
f-1586420743
f
GR
GS
[1 0 0 1 882.24048 110.98099] CT
0.302 GC
N
f-1586420743
f
GR
GS
[1 0 0 1 874.40509 43.09719] CT
0.302 GC
N
f-1586420743
f
GR
GS
[1 0 0 1 856.12567 113.13921] CT
0.302 GC
N
f-1586420743
f
GR
GS
[1 0 0 1 856.12347 215.59563] CT
0.302 GC
N
f-1586420743
f
GR
GS
[1 0 0 1 873.72247 125.05519] CT
0.302 GC
N
f-1586420743
f
GR
GS
[1 0 0 1 863.48938 101.89703] CT
0.302 GC
N
f-1586420743
f
GR
GS
[1 0 0 1 853.86462 110.46489] CT
0.302 GC
N
f-1586420743
f
GR
GS
[1 0 0 1 864.43256 71.52956] CT
0.302 GC
N
f-1586420743
f
GR
GS
[1 0 0 1 855.96851 155.66701] CT
0.302 GC
N
f-1586420743
f
GR
GS
[1 0 0 1 880.84583 226.97185] CT
0.302 GC
N
f-1586420743
f
GR
GS
[1 0 0 1 851.59912 209.74245] CT
0.302 GC
N
f-1586420743
f
GR
GS
[1 0 0 1 871.99127 123.38287] CT
0.302 GC
N
f-1586420743
f
GR
GS
[1 0 0 1 872.8916 95.90409] CT
0.302 GC
N
f-1586420743
f
GR
GS
[1 0 0 1 859.46448 161.50626] CT
0.302 GC
N
f-1586420743
f
GR
GS
[1 0 0 1 878.09454 167.3017] CT
0.302 GC
N
f-1586420743
f
GR
GS
[1 0 0 1 860.73907 104.61338] CT
0.302 GC
N
f-1586420743
f
GR
GS
[1 0 0 1 852.29877 228.5] CT
0.302 GC
N
f-1586420743
f
GR
GS
[1 0 0 1 854.3985 107.75666] CT
0.302 GC
N
f-1586420743
f
GR
GS
[1 0 0 1 876.66315 99.07544] CT
0.302 GC
N
f-1586420743
f
GR
GS
[1 0 0 1 873.9303 134.21123] CT
0.302 GC
N
f-1586420743
f
GR
GS
[1 0 0 1 876.20569 33.16932] CT
0.302 GC
N
f-1586420743
f
GR
GS
[1 0 0 1 871.16595 197.29662] CT
0.302 GC
N
f-1586420743
f
GR
GS
[1 0 0 1 877.53314 101.74206] CT
0.302 GC
N
f-1586420743
f
GR
GS
[1 0 0 1 852.5567 73.50971] CT
0.302 GC
N
f-1586420743
f
GR
GS
[1 0 0 1 864.263 204.31393] CT
0.302 GC
N
f-1586420743
f
GR
GS
[1 0 0 1 859.33954 131.23534] CT
0.302 GC
N
f-1586420743
f
GR
GS
[1 0 0 1 866.64636 134.08057] CT
0.302 GC
N
f-1586420743
f
GR
GS
[1 0 0 1 879.28455 90.33924] CT
0.302 GC
N
f-1586420743
f
GR
GS
[1 0 0 1 860.31964 176.57213] CT
0.302 GC
N
f-1586420743
f
GR
GS
[1 0 0 1 870.38293 70.63682] CT
0.302 GC
N
f-1586420743
f
GR
GS
[1 0 0 1 852.27875 175.93494] CT
0.302 GC
N
f-1586420743
f
GR
GS
[1 0 0 1 856.35431 215.07388] CT
0.302 GC
N
f-1586420743
f
GR
GS
[1 0 0 1 877.80157 217.94739] CT
0.302 GC
N
f-1586420743
f
GR
GS
[1 0 0 1 857.60864 162.70718] CT
0.302 GC
N
f-1586420743
f
GR
GS
[1 0 0 1 877.67133 73.13157] CT
0.302 GC
N
f-1586420743
f
GR
GS
[1 0 0 1 862.13318 123.52187] CT
0.302 GC
N
f-1586420743
f
GR
GS
[1 0 0 1 872.65729 37.53966] CT
0.302 GC
N
f-1586420743
f
GR
GS
[1 0 0 1 853.1048 221.73529] CT
0.302 GC
N
f-1586420743
f
GR
GS
[1 0 0 1 874.65417 59.38782] CT
0.302 GC
N
f-1586420743
f
GR
GS
[1 0 0 1 867.23364 174.39474] CT
0.302 GC
N
f-1586420743
f
GR
GS
[1 0 0 1 881.2583 54.28571] CT
0.302 GC
N
f-1586420743
f
GR
GS
[1 0 0 1 860.60681 116.61521] CT
0.302 GC
N
f-1586420743
f
GR
GS
[1 0 0 1 865.11737 129.60178] CT
0.302 GC
N
f-1586420743
f
GR
GS
[1 0 0 1 854.12219 192.1882] CT
0.302 GC
N
f-1586420743
f
GR
%%Trailer
%%Pages: 1
%%EOF
