%!PS-Adobe-3.0 EPSF-3.0
%%Creator: (MATLAB, The Mathworks, Inc. Version 9.7.0.1190202 \(R2019b\). Operating System: Mac OS X)
%%Title: /Users/julian.kosciessa/Volumes/tardis/LNDG/stateswitch/stsw_beh_task/behavior/figures/a03s_mediansplit.eps
%%CreationDate: 2023-07-13T13:51:02
%%Pages: (atend)
%%BoundingBox:    69     0   703   276
%%LanguageLevel: 3
%%EndComments
%%BeginProlog
%%BeginResource: procset (Apache XML Graphics Std ProcSet) 1.2 0
%%Version: 1.2 0
%%Copyright: (Copyright 2001-2003,2010 The Apache Software Foundation. License terms: http://www.apache.org/licenses/LICENSE-2.0)
/bd{bind def}bind def
/ld{load def}bd
/GR/grestore ld
/GS/gsave ld
/RM/rmoveto ld
/C/curveto ld
/t/show ld
/L/lineto ld
/ML/setmiterlimit ld
/CT/concat ld
/f/fill ld
/N/newpath ld
/S/stroke ld
/CC/setcmykcolor ld
/A/ashow ld
/cp/closepath ld
/RC/setrgbcolor ld
/LJ/setlinejoin ld
/GC/setgray ld
/LW/setlinewidth ld
/M/moveto ld
/re {4 2 roll M
1 index 0 rlineto
0 exch rlineto
neg 0 rlineto
cp } bd
/_ctm matrix def
/_tm matrix def
/BT { _ctm currentmatrix pop matrix _tm copy pop 0 0 moveto } bd
/ET { _ctm setmatrix } bd
/iTm { _ctm setmatrix _tm concat } bd
/Tm { _tm astore pop iTm 0 0 moveto } bd
/ux 0.0 def
/uy 0.0 def
/F {
  /Tp exch def
  /Tf exch def
  Tf findfont Tp scalefont setfont
  /cf Tf def  /cs Tp def
} bd
/ULS {currentpoint /uy exch def /ux exch def} bd
/ULE {
  /Tcx currentpoint pop def
  gsave
  newpath
  cf findfont cs scalefont dup
  /FontMatrix get 0 get /Ts exch def /FontInfo get dup
  /UnderlinePosition get Ts mul /To exch def
  /UnderlineThickness get Ts mul /Tt exch def
  ux uy To add moveto  Tcx uy To add lineto
  Tt setlinewidth stroke
  grestore
} bd
/OLE {
  /Tcx currentpoint pop def
  gsave
  newpath
  cf findfont cs scalefont dup
  /FontMatrix get 0 get /Ts exch def /FontInfo get dup
  /UnderlinePosition get Ts mul /To exch def
  /UnderlineThickness get Ts mul /Tt exch def
  ux uy To add cs add moveto Tcx uy To add cs add lineto
  Tt setlinewidth stroke
  grestore
} bd
/SOE {
  /Tcx currentpoint pop def
  gsave
  newpath
  cf findfont cs scalefont dup
  /FontMatrix get 0 get /Ts exch def /FontInfo get dup
  /UnderlinePosition get Ts mul /To exch def
  /UnderlineThickness get Ts mul /Tt exch def
  ux uy To add cs 10 mul 26 idiv add moveto Tcx uy To add cs 10 mul 26 idiv add lineto
  Tt setlinewidth stroke
  grestore
} bd
/QT {
/Y22 exch store
/X22 exch store
/Y21 exch store
/X21 exch store
currentpoint
/Y21 load 2 mul add 3 div exch
/X21 load 2 mul add 3 div exch
/X21 load 2 mul /X22 load add 3 div
/Y21 load 2 mul /Y22 load add 3 div
/X22 load /Y22 load curveto
} bd
/SSPD {
dup length /d exch dict def
{
/v exch def
/k exch def
currentpagedevice k known {
/cpdv currentpagedevice k get def
v cpdv ne {
/upd false def
/nullv v type /nulltype eq def
/nullcpdv cpdv type /nulltype eq def
nullv nullcpdv or
{
/upd true def
} {
/sametype v type cpdv type eq def
sametype {
v type /arraytype eq {
/vlen v length def
/cpdvlen cpdv length def
vlen cpdvlen eq {
0 1 vlen 1 sub {
/i exch def
/obj v i get def
/cpdobj cpdv i get def
obj cpdobj ne {
/upd true def
exit
} if
} for
} {
/upd true def
} ifelse
} {
v type /dicttype eq {
v {
/dv exch def
/dk exch def
/cpddv cpdv dk get def
dv cpddv ne {
/upd true def
exit
} if
} forall
} {
/upd true def
} ifelse
} ifelse
} if
} ifelse
upd true eq {
d k v put
} if
} if
} if
} forall
d length 0 gt {
d setpagedevice
} if
} bd
/RE { % /NewFontName [NewEncodingArray] /FontName RE -
  findfont dup length dict begin
  {
    1 index /FID ne
    {def} {pop pop} ifelse
  } forall
  /Encoding exch def
  /FontName 1 index def
  currentdict definefont pop
  end
} bind def
%%EndResource
%%BeginResource: procset (Apache XML Graphics EPS ProcSet) 1.0 0
%%Version: 1.0 0
%%Copyright: (Copyright 2002-2003 The Apache Software Foundation. License terms: http://www.apache.org/licenses/LICENSE-2.0)
/BeginEPSF { %def
/b4_Inc_state save def         % Save state for cleanup
/dict_count countdictstack def % Count objects on dict stack
/op_count count 1 sub def      % Count objects on operand stack
userdict begin                 % Push userdict on dict stack
/showpage { } def              % Redefine showpage, { } = null proc
0 setgray 0 setlinecap         % Prepare graphics state
1 setlinewidth 0 setlinejoin
10 setmiterlimit [ ] 0 setdash newpath
/languagelevel where           % If level not equal to 1 then
{pop languagelevel             % set strokeadjust and
1 ne                           % overprint to their defaults.
{false setstrokeadjust false setoverprint
} if
} if
} bd
/EndEPSF { %def
count op_count sub {pop} repeat            % Clean up stacks
countdictstack dict_count sub {end} repeat
b4_Inc_state restore
} bd
%%EndResource
%FOPBeginFontDict
%%IncludeResource: font Courier-Oblique
%%IncludeResource: font Courier-BoldOblique
%%IncludeResource: font Courier-Bold
%%IncludeResource: font ZapfDingbats
%%IncludeResource: font Symbol
%%IncludeResource: font Helvetica
%%IncludeResource: font Helvetica-Oblique
%%IncludeResource: font Helvetica-Bold
%%IncludeResource: font Helvetica-BoldOblique
%%IncludeResource: font Times-Roman
%%IncludeResource: font Times-Italic
%%IncludeResource: font Times-Bold
%%IncludeResource: font Times-BoldItalic
%%IncludeResource: font Courier
%FOPEndFontDict
%%BeginResource: encoding WinAnsiEncoding
/WinAnsiEncoding [
/.notdef /.notdef /.notdef /.notdef /.notdef
/.notdef /.notdef /.notdef /.notdef /.notdef
/.notdef /.notdef /.notdef /.notdef /.notdef
/.notdef /.notdef /.notdef /.notdef /.notdef
/.notdef /.notdef /.notdef /.notdef /.notdef
/.notdef /.notdef /.notdef /.notdef /.notdef
/.notdef /.notdef /space /exclam /quotedbl
/numbersign /dollar /percent /ampersand /quotesingle
/parenleft /parenright /asterisk /plus /comma
/hyphen /period /slash /zero /one
/two /three /four /five /six
/seven /eight /nine /colon /semicolon
/less /equal /greater /question /at
/A /B /C /D /E
/F /G /H /I /J
/K /L /M /N /O
/P /Q /R /S /T
/U /V /W /X /Y
/Z /bracketleft /backslash /bracketright /asciicircum
/underscore /quoteleft /a /b /c
/d /e /f /g /h
/i /j /k /l /m
/n /o /p /q /r
/s /t /u /v /w
/x /y /z /braceleft /bar
/braceright /asciitilde /bullet /Euro /bullet
/quotesinglbase /florin /quotedblbase /ellipsis /dagger
/daggerdbl /circumflex /perthousand /Scaron /guilsinglleft
/OE /bullet /Zcaron /bullet /bullet
/quoteleft /quoteright /quotedblleft /quotedblright /bullet
/endash /emdash /asciitilde /trademark /scaron
/guilsinglright /oe /bullet /zcaron /Ydieresis
/space /exclamdown /cent /sterling /currency
/yen /brokenbar /section /dieresis /copyright
/ordfeminine /guillemotleft /logicalnot /sfthyphen /registered
/macron /degree /plusminus /twosuperior /threesuperior
/acute /mu /paragraph /middot /cedilla
/onesuperior /ordmasculine /guillemotright /onequarter /onehalf
/threequarters /questiondown /Agrave /Aacute /Acircumflex
/Atilde /Adieresis /Aring /AE /Ccedilla
/Egrave /Eacute /Ecircumflex /Edieresis /Igrave
/Iacute /Icircumflex /Idieresis /Eth /Ntilde
/Ograve /Oacute /Ocircumflex /Otilde /Odieresis
/multiply /Oslash /Ugrave /Uacute /Ucircumflex
/Udieresis /Yacute /Thorn /germandbls /agrave
/aacute /acircumflex /atilde /adieresis /aring
/ae /ccedilla /egrave /eacute /ecircumflex
/edieresis /igrave /iacute /icircumflex /idieresis
/eth /ntilde /ograve /oacute /ocircumflex
/otilde /odieresis /divide /oslash /ugrave
/uacute /ucircumflex /udieresis /yacute /thorn
/ydieresis
] def
%%EndResource
%FOPBeginFontReencode
/Courier-Oblique findfont
dup length dict begin
  {1 index /FID ne {def} {pop pop} ifelse} forall
  /Encoding WinAnsiEncoding def
  currentdict
end
/Courier-Oblique exch definefont pop
/Courier-BoldOblique findfont
dup length dict begin
  {1 index /FID ne {def} {pop pop} ifelse} forall
  /Encoding WinAnsiEncoding def
  currentdict
end
/Courier-BoldOblique exch definefont pop
/Courier-Bold findfont
dup length dict begin
  {1 index /FID ne {def} {pop pop} ifelse} forall
  /Encoding WinAnsiEncoding def
  currentdict
end
/Courier-Bold exch definefont pop
/Helvetica findfont
dup length dict begin
  {1 index /FID ne {def} {pop pop} ifelse} forall
  /Encoding WinAnsiEncoding def
  currentdict
end
/Helvetica exch definefont pop
/Helvetica-Oblique findfont
dup length dict begin
  {1 index /FID ne {def} {pop pop} ifelse} forall
  /Encoding WinAnsiEncoding def
  currentdict
end
/Helvetica-Oblique exch definefont pop
/Helvetica-Bold findfont
dup length dict begin
  {1 index /FID ne {def} {pop pop} ifelse} forall
  /Encoding WinAnsiEncoding def
  currentdict
end
/Helvetica-Bold exch definefont pop
/Helvetica-BoldOblique findfont
dup length dict begin
  {1 index /FID ne {def} {pop pop} ifelse} forall
  /Encoding WinAnsiEncoding def
  currentdict
end
/Helvetica-BoldOblique exch definefont pop
/Times-Roman findfont
dup length dict begin
  {1 index /FID ne {def} {pop pop} ifelse} forall
  /Encoding WinAnsiEncoding def
  currentdict
end
/Times-Roman exch definefont pop
/Times-Italic findfont
dup length dict begin
  {1 index /FID ne {def} {pop pop} ifelse} forall
  /Encoding WinAnsiEncoding def
  currentdict
end
/Times-Italic exch definefont pop
/Times-Bold findfont
dup length dict begin
  {1 index /FID ne {def} {pop pop} ifelse} forall
  /Encoding WinAnsiEncoding def
  currentdict
end
/Times-Bold exch definefont pop
/Times-BoldItalic findfont
dup length dict begin
  {1 index /FID ne {def} {pop pop} ifelse} forall
  /Encoding WinAnsiEncoding def
  currentdict
end
/Times-BoldItalic exch definefont pop
/Courier findfont
dup length dict begin
  {1 index /FID ne {def} {pop pop} ifelse} forall
  /Encoding WinAnsiEncoding def
  currentdict
end
/Courier exch definefont pop
%FOPEndFontReencode
%%EndProlog
%%Page: 1 1
%%PageBoundingBox: 0 0 778 279
%%BeginPageSetup
[1 0 0 -1 0 279] CT
%%EndPageSetup
GS
[0.99949 0 0 1.0009 0 -0.25] CT
1 GC
N
0 0 778 279 re
f
GR
GS
[0.99949 0 0 1.0009 0 -0.25] CT
1 GC
N
0 0 778 279 re
f
GR
GS
[0.99949 0 0 1.0009 0 -0.25] CT
1 GC
N
113 229.5 M
267 229.5 L
267 27 L
113 27 L
cp
f
GR
GS
[0.99949 0 0 1.0009 0 -0.25] CT
0.149 GC
2 setlinecap
1 LJ
0.5 LW
N
113 229.5 M
267 229.5 L
S
GR
GS
[0.99949 0 0 1.0009 0 -0.25] CT
0.149 GC
2 setlinecap
1 LJ
0.5 LW
N
132.25 229.5 M
132.25 227.475 L
S
GR
GS
[0.99949 0 0 1.0009 0 -0.25] CT
0.149 GC
2 setlinecap
1 LJ
0.5 LW
N
170.75 229.5 M
170.75 227.475 L
S
GR
GS
[0.99949 0 0 1.0009 0 -0.25] CT
0.149 GC
2 setlinecap
1 LJ
0.5 LW
N
209.25 229.5 M
209.25 227.475 L
S
GR
GS
[0.99949 0 0 1.0009 0 -0.25] CT
0.149 GC
2 setlinecap
1 LJ
0.5 LW
N
247.75 229.5 M
247.75 227.475 L
S
GR
GS
[0.99949 0 0 1.0009 132.18201 235.06067] CT
0.149 GC
/Helvetica 18 F
GS
[1 0 0 1 0 0] CT
-5.5 18 moveto 
1 -1 scale
(1) t 
GR
GR
GS
[0.99949 0 0 1.0009 170.66222 235.06067] CT
0.149 GC
/Helvetica 18 F
GS
[1 0 0 1 0 0] CT
-5.5 18 moveto 
1 -1 scale
(2) t 
GR
GR
GS
[0.99949 0 0 1.0009 209.14243 235.06067] CT
0.149 GC
/Helvetica 18 F
GS
[1 0 0 1 0 0] CT
-5.5 18 moveto 
1 -1 scale
(3) t 
GR
GR
GS
[0.99949 0 0 1.0009 247.62263 235.06067] CT
0.149 GC
/Helvetica 18 F
GS
[1 0 0 1 0 0] CT
-5.5 18 moveto 
1 -1 scale
(4) t 
GR
GR
GS
[0.99949 0 0 1.0009 189.9024 257.58083] CT
0.149 GC
/Helvetica 18 F
GS
[1 0 0 1 0 0] CT
-46 18 moveto 
1 -1 scale
(# of targets) t 
GR
GR
GS
[0.99949 0 0 1.0009 0 -0.25] CT
0.149 GC
2 setlinecap
1 LJ
0.5 LW
N
113 229.5 M
113 27 L
S
GR
GS
[0.99949 0 0 1.0009 0 -0.25] CT
0.149 GC
2 setlinecap
1 LJ
0.5 LW
N
113 207 M
115.025 207 L
S
GR
GS
[0.99949 0 0 1.0009 0 -0.25] CT
0.149 GC
2 setlinecap
1 LJ
0.5 LW
N
113 162 M
115.025 162 L
S
GR
GS
[0.99949 0 0 1.0009 0 -0.25] CT
0.149 GC
2 setlinecap
1 LJ
0.5 LW
N
113 117 M
115.025 117 L
S
GR
GS
[0.99949 0 0 1.0009 0 -0.25] CT
0.149 GC
2 setlinecap
1 LJ
0.5 LW
N
113 72 M
115.025 72 L
S
GR
GS
[0.99949 0 0 1.0009 0 -0.25] CT
0.149 GC
2 setlinecap
1 LJ
0.5 LW
N
113 27 M
115.025 27 L
S
GR
GS
[0.99949 0 0 1.0009 107.34479 206.93548] CT
0.149 GC
/Helvetica 18 F
GS
[1 0 0 1 0 0] CT
-18 7 moveto 
1 -1 scale
(-1) t 
GR
GR
GS
[0.99949 0 0 1.0009 107.34479 161.89516] CT
0.149 GC
/Helvetica 18 F
GS
[1 0 0 1 0 0] CT
-11 7 moveto 
1 -1 scale
(0) t 
GR
GR
GS
[0.99949 0 0 1.0009 107.34479 116.85484] CT
0.149 GC
/Helvetica 18 F
GS
[1 0 0 1 0 0] CT
-11 7 moveto 
1 -1 scale
(1) t 
GR
GR
GS
[0.99949 0 0 1.0009 107.34479 71.81452] CT
0.149 GC
/Helvetica 18 F
GS
[1 0 0 1 0 0] CT
-11 7 moveto 
1 -1 scale
(2) t 
GR
GR
GS
[0.99949 0 0 1.0009 107.34479 26.77419] CT
0.149 GC
/Helvetica 18 F
GS
[1 0 0 1 0 0] CT
-11 7 moveto 
1 -1 scale
(3) t 
GR
GR
GS
[0 -1.0009 0.99949 0 86.85533 128.11483] CT
0.149 GC
/Helvetica 18 F
GS
[1 0 0 1 0 0] CT
-42.5 -4 moveto 
1 -1 scale
(BOLD LV1) t 
GR
GR
GS
[0.99949 0 0 1.0009 112.94191 22.77061] CT
0.149 GC
N
2.641 -0.516 M
2.641 -0.656 2.734 -0.781 QT
6.484 -4.5 L
2.734 -8.25 L
2.641 -8.328 2.641 -8.484 QT
2.641 -8.609 2.75 -8.727 QT
2.859 -8.844 3 -8.844 QT
3.125 -8.844 3.281 -8.734 QT
7 -5 L
10.719 -8.734 L
10.859 -8.844 10.984 -8.844 QT
11.125 -8.844 11.234 -8.734 QT
11.344 -8.625 11.344 -8.484 QT
11.344 -8.328 11.25 -8.25 QT
7.5 -4.5 L
11.25 -0.781 L
11.344 -0.656 11.344 -0.516 QT
11.344 -0.375 11.234 -0.266 QT
11.125 -0.156 10.984 -0.156 QT
10.844 -0.156 10.719 -0.297 QT
7 -4 L
3.281 -0.297 L
3.141 -0.156 3 -0.156 QT
2.859 -0.156 2.75 -0.273 QT
2.641 -0.391 2.641 -0.516 QT
cp
f
GR
GS
[0.99949 0 0 1.0009 126.93471 22.77061] CT
0.149 GC
/Helvetica 18 F
GS
[1 0 0 1 0 0] CT
0 0 moveto 
1 -1 scale
(10) t 
GR
GR
GS
[0.99949 0 0 1.0009 147.92391 13.76254] CT
0.149 GC
/Helvetica 14.4 F
GS
[1 0 0 1 0 0] CT
0 0 moveto 
1 -1 scale
(4) t 
GR
GR
GS
[0.99949 0 0 1.0009 0 -0.25] CT
1 LJ
2 LW
N
132.25 201.366 M
132.25 205.051 L
S
GR
GS
[0.99949 0 0 1.0009 0 -0.25] CT
1 LJ
2 LW
N
170.75 94.125 M
170.75 100.056 L
S
GR
GS
[0.99949 0 0 1.0009 0 -0.25] CT
1 LJ
2 LW
N
209.25 72.936 M
209.25 79.724 L
S
GR
GS
[0.99949 0 0 1.0009 0 -0.25] CT
1 LJ
2 LW
N
247.75 66.772 M
247.75 71.892 L
S
GR
GS
[0.99949 0 0 1.0009 0 -0.25] CT
1 LJ
2 LW
N
132.25 201.366 M
132.25 197.681 L
S
GR
GS
[0.99949 0 0 1.0009 0 -0.25] CT
1 LJ
2 LW
N
170.75 94.125 M
170.75 88.194 L
S
GR
GS
[0.99949 0 0 1.0009 0 -0.25] CT
1 LJ
2 LW
N
209.25 72.936 M
209.25 66.148 L
S
GR
GS
[0.99949 0 0 1.0009 0 -0.25] CT
1 LJ
2 LW
N
247.75 66.772 M
247.75 61.651 L
S
GR
GS
[0.99949 0 0 1.0009 0 -0.25] CT
1 LJ
2 LW
N
132.25 201.366 M
170.75 94.125 L
209.25 72.936 L
247.75 66.772 L
S
GR
GS
[0.99949 0 0 1.0009 132.18201 204.98459] CT
N
-3 0 M
3 0 L
f
GR
GS
[0.99949 0 0 1.0009 132.18201 204.98459] CT
10.0 ML
2 LW
N
-3 0 M
3 0 L
S
GR
GS
[0.99949 0 0 1.0009 170.66222 99.89575] CT
N
/f1394637256{-3 0 M
3 0 L}def
f1394637256
f
GR
GS
[0.99949 0 0 1.0009 170.66222 99.89575] CT
10.0 ML
2 LW
N
-3 0 M
3 0 L
S
GR
GS
[0.99949 0 0 1.0009 209.14243 79.54501] CT
N
f1394637256
f
GR
GS
[0.99949 0 0 1.0009 209.14243 79.54501] CT
10.0 ML
2 LW
N
-3 0 M
3 0 L
S
GR
GS
[0.99949 0 0 1.0009 247.62263 71.70628] CT
N
f1394637256
f
GR
GS
[0.99949 0 0 1.0009 247.62263 71.70628] CT
10.0 ML
2 LW
N
-3 0 M
3 0 L
S
GR
GS
[0.99949 0 0 1.0009 132.18201 197.6081] CT
N
f1394637256
f
GR
GS
[0.99949 0 0 1.0009 132.18201 197.6081] CT
10.0 ML
2 LW
N
-3 0 M
3 0 L
S
GR
GS
[0.99949 0 0 1.0009 170.66222 88.02326] CT
N
f1394637256
f
GR
GS
[0.99949 0 0 1.0009 170.66222 88.02326] CT
10.0 ML
2 LW
N
-3 0 M
3 0 L
S
GR
GS
[0.99949 0 0 1.0009 209.14243 65.95764] CT
N
f1394637256
f
GR
GS
[0.99949 0 0 1.0009 209.14243 65.95764] CT
10.0 ML
2 LW
N
-3 0 M
3 0 L
S
GR
GS
[0.99949 0 0 1.0009 247.62263 61.45652] CT
N
f1394637256
f
GR
GS
[0.99949 0 0 1.0009 247.62263 61.45652] CT
10.0 ML
2 LW
N
-3 0 M
3 0 L
S
GR
GS
[0.99949 0 0 1.0009 0 -0.25] CT
1 LJ
2 LW
N
132.25 155.849 M
132.25 159.396 L
S
GR
GS
[0.99949 0 0 1.0009 0 -0.25] CT
1 LJ
2 LW
N
170.75 125.276 M
170.75 130.007 L
S
GR
GS
[0.99949 0 0 1.0009 0 -0.25] CT
1 LJ
2 LW
N
209.25 119.185 M
209.25 124.208 L
S
GR
GS
[0.99949 0 0 1.0009 0 -0.25] CT
1 LJ
2 LW
N
247.75 118.841 M
247.75 122.959 L
S
GR
GS
[0.99949 0 0 1.0009 0 -0.25] CT
1 LJ
2 LW
N
132.25 155.849 M
132.25 152.301 L
S
GR
GS
[0.99949 0 0 1.0009 0 -0.25] CT
1 LJ
2 LW
N
170.75 125.276 M
170.75 120.546 L
S
GR
GS
[0.99949 0 0 1.0009 0 -0.25] CT
1 LJ
2 LW
N
209.25 119.185 M
209.25 114.162 L
S
GR
GS
[0.99949 0 0 1.0009 0 -0.25] CT
1 LJ
2 LW
N
247.75 118.841 M
247.75 114.723 L
S
GR
GS
[0.99949 0 0 1.0009 0 -0.25] CT
[8 8] 0 setdash
2 LJ
2 LW
N
132.25 155.849 M
170.75 125.276 L
209.25 119.185 L
247.75 118.841 L
S
GR
GS
[0.99949 0 0 1.0009 132.18201 159.28904] CT
N
f1394637256
f
GR
GS
[0.99949 0 0 1.0009 132.18201 159.28904] CT
10.0 ML
2 LW
N
-3 0 M
3 0 L
S
GR
GS
[0.99949 0 0 1.0009 170.66222 129.87357] CT
N
f1394637256
f
GR
GS
[0.99949 0 0 1.0009 170.66222 129.87357] CT
10.0 ML
2 LW
N
-3 0 M
3 0 L
S
GR
GS
[0.99949 0 0 1.0009 209.14243 124.06976] CT
N
f1394637256
f
GR
GS
[0.99949 0 0 1.0009 209.14243 124.06976] CT
10.0 ML
2 LW
N
-3 0 M
3 0 L
S
GR
GS
[0.99949 0 0 1.0009 247.62263 122.81885] CT
N
f1394637256
f
GR
GS
[0.99949 0 0 1.0009 247.62263 122.81885] CT
10.0 ML
2 LW
N
-3 0 M
3 0 L
S
GR
GS
[0.99949 0 0 1.0009 132.18201 152.18747] CT
N
f1394637256
f
GR
GS
[0.99949 0 0 1.0009 132.18201 152.18747] CT
10.0 ML
2 LW
N
-3 0 M
3 0 L
S
GR
GS
[0.99949 0 0 1.0009 170.66222 120.40359] CT
N
f1394637256
f
GR
GS
[0.99949 0 0 1.0009 170.66222 120.40359] CT
10.0 ML
2 LW
N
-3 0 M
3 0 L
S
GR
GS
[0.99949 0 0 1.0009 209.14243 114.01399] CT
N
f1394637256
f
GR
GS
[0.99949 0 0 1.0009 209.14243 114.01399] CT
10.0 ML
2 LW
N
-3 0 M
3 0 L
S
GR
GS
[0.99949 0 0 1.0009 247.62263 114.57535] CT
N
f1394637256
f
GR
GS
[0.99949 0 0 1.0009 247.62263 114.57535] CT
10.0 ML
2 LW
N
-3 0 M
3 0 L
S
GR
GS
[0.99949 0 0 1.0009 0 -0.25] CT
1 GC
N
/f-308970202{331 229.5 M
485 229.5 L
485 27 L
331 27 L
cp}def
f-308970202
f
GR
GS
[0.99949 0 0 1.0009 0 -0.25] CT
0.149 GC
2 setlinecap
1 LJ
0.5 LW
N
331 229.5 M
485 229.5 L
S
GR
GS
[0.99949 0 0 1.0009 0 -0.25] CT
0.149 GC
2 setlinecap
1 LJ
0.5 LW
N
350.25 229.5 M
350.25 227.475 L
S
GR
GS
[0.99949 0 0 1.0009 0 -0.25] CT
0.149 GC
2 setlinecap
1 LJ
0.5 LW
N
388.75 229.5 M
388.75 227.475 L
S
GR
GS
[0.99949 0 0 1.0009 0 -0.25] CT
0.149 GC
2 setlinecap
1 LJ
0.5 LW
N
427.25 229.5 M
427.25 227.475 L
S
GR
GS
[0.99949 0 0 1.0009 0 -0.25] CT
0.149 GC
2 setlinecap
1 LJ
0.5 LW
N
465.75 229.5 M
465.75 227.475 L
S
GR
GS
[0.99949 0 0 1.0009 350.06994 235.06067] CT
0.149 GC
/Helvetica 18 F
GS
[1 0 0 1 0 0] CT
-5.5 18 moveto 
1 -1 scale
(1) t 
GR
GR
GS
[0.99949 0 0 1.0009 388.55015 235.06067] CT
0.149 GC
/Helvetica 18 F
GS
[1 0 0 1 0 0] CT
-5.5 18 moveto 
1 -1 scale
(2) t 
GR
GR
GS
[0.99949 0 0 1.0009 427.03035 235.06067] CT
0.149 GC
/Helvetica 18 F
GS
[1 0 0 1 0 0] CT
-5.5 18 moveto 
1 -1 scale
(3) t 
GR
GR
GS
[0.99949 0 0 1.0009 465.51056 235.06067] CT
0.149 GC
/Helvetica 18 F
GS
[1 0 0 1 0 0] CT
-5.5 18 moveto 
1 -1 scale
(4) t 
GR
GR
GS
[0.99949 0 0 1.0009 407.79031 257.58083] CT
0.149 GC
/Helvetica 18 F
GS
[1 0 0 1 0 0] CT
-46 18 moveto 
1 -1 scale
(# of targets) t 
GR
GR
GS
[0.99949 0 0 1.0009 0 -0.25] CT
0.149 GC
2 setlinecap
1 LJ
0.5 LW
N
331 229.5 M
331 27 L
S
GR
GS
[0.99949 0 0 1.0009 0 -0.25] CT
0.149 GC
2 setlinecap
1 LJ
0.5 LW
N
331 229.5 M
333.025 229.5 L
S
GR
GS
[0.99949 0 0 1.0009 0 -0.25] CT
0.149 GC
2 setlinecap
1 LJ
0.5 LW
N
331 189 M
333.025 189 L
S
GR
GS
[0.99949 0 0 1.0009 0 -0.25] CT
0.149 GC
2 setlinecap
1 LJ
0.5 LW
N
331 148.5 M
333.025 148.5 L
S
GR
GS
[0.99949 0 0 1.0009 0 -0.25] CT
0.149 GC
2 setlinecap
1 LJ
0.5 LW
N
331 108 M
333.025 108 L
S
GR
GS
[0.99949 0 0 1.0009 0 -0.25] CT
0.149 GC
2 setlinecap
1 LJ
0.5 LW
N
331 67.5 M
333.025 67.5 L
S
GR
GS
[0.99949 0 0 1.0009 0 -0.25] CT
0.149 GC
2 setlinecap
1 LJ
0.5 LW
N
331 27 M
333.025 27 L
S
GR
GS
[0.99949 0 0 1.0009 325.23271 229.45565] CT
0.149 GC
/Helvetica 18 F
GS
[1 0 0 1 0 0] CT
-26 7 moveto 
1 -1 scale
(0.5) t 
GR
GR
GS
[0.99949 0 0 1.0009 325.23271 188.91934] CT
0.149 GC
/Helvetica 18 F
GS
[1 0 0 1 0 0] CT
-26 7 moveto 
1 -1 scale
(0.6) t 
GR
GR
GS
[0.99949 0 0 1.0009 325.23271 148.38306] CT
0.149 GC
/Helvetica 18 F
GS
[1 0 0 1 0 0] CT
-26 7 moveto 
1 -1 scale
(0.7) t 
GR
GR
GS
[0.99949 0 0 1.0009 325.23271 107.84677] CT
0.149 GC
/Helvetica 18 F
GS
[1 0 0 1 0 0] CT
-26 7 moveto 
1 -1 scale
(0.8) t 
GR
GR
GS
[0.99949 0 0 1.0009 325.23271 67.31049] CT
0.149 GC
/Helvetica 18 F
GS
[1 0 0 1 0 0] CT
-26 7 moveto 
1 -1 scale
(0.9) t 
GR
GR
GS
[0.99949 0 0 1.0009 325.23271 26.77419] CT
0.149 GC
/Helvetica 18 F
GS
[1 0 0 1 0 0] CT
-11 7 moveto 
1 -1 scale
(1) t 
GR
GR
GS
[0 -1.0009 0.99949 0 296.74736 128.11483] CT
0.149 GC
/Helvetica 18 F
GS
[1 0 0 1 0 0] CT
-38 -4 moveto 
1 -1 scale
(Accuracy) t 
GR
GR
GS
[0.99949 0 0 1.0009 0 -0.25] CT
1 LJ
2 LW
N
350.25 126.665 M
350.25 145.894 L
S
GR
GS
[0.99949 0 0 1.0009 0 -0.25] CT
1 LJ
2 LW
N
388.75 147.554 M
388.75 166.009 L
S
GR
GS
[0.99949 0 0 1.0009 0 -0.25] CT
1 LJ
2 LW
N
427.25 156.903 M
427.25 174.561 L
S
GR
GS
[0.99949 0 0 1.0009 0 -0.25] CT
1 LJ
2 LW
N
465.75 163.61 M
465.75 181.15 L
S
GR
GS
[0.99949 0 0 1.0009 0 -0.25] CT
1 LJ
2 LW
N
350.25 126.665 M
350.25 107.435 L
S
GR
GS
[0.99949 0 0 1.0009 0 -0.25] CT
1 LJ
2 LW
N
388.75 147.554 M
388.75 129.1 L
S
GR
GS
[0.99949 0 0 1.0009 0 -0.25] CT
1 LJ
2 LW
N
427.25 156.903 M
427.25 139.246 L
S
GR
GS
[0.99949 0 0 1.0009 0 -0.25] CT
1 LJ
2 LW
N
465.75 163.61 M
465.75 146.069 L
S
GR
GS
[0.99949 0 0 1.0009 0 -0.25] CT
1 LJ
2 LW
N
350.25 126.665 M
388.75 147.554 L
427.25 156.903 L
465.75 163.61 L
S
GR
GS
[0.99949 0 0 1.0009 350.06994 145.77488] CT
N
f1394637256
f
GR
GS
[0.99949 0 0 1.0009 350.06994 145.77488] CT
10.0 ML
2 LW
N
-3 0 M
3 0 L
S
GR
GS
[0.99949 0 0 1.0009 388.55015 165.90747] CT
N
f1394637256
f
GR
GS
[0.99949 0 0 1.0009 388.55015 165.90747] CT
10.0 ML
2 LW
N
-3 0 M
3 0 L
S
GR
GS
[0.99949 0 0 1.0009 427.03035 174.46725] CT
N
f1394637256
f
GR
GS
[0.99949 0 0 1.0009 427.03035 174.46725] CT
10.0 ML
2 LW
N
-3 0 M
3 0 L
S
GR
GS
[0.99949 0 0 1.0009 465.51056 181.06231] CT
N
f1394637256
f
GR
GS
[0.99949 0 0 1.0009 465.51056 181.06231] CT
10.0 ML
2 LW
N
-3 0 M
3 0 L
S
GR
GS
[0.99949 0 0 1.0009 350.06994 107.28124] CT
N
f1394637256
f
GR
GS
[0.99949 0 0 1.0009 350.06994 107.28124] CT
10.0 ML
2 LW
N
-3 0 M
3 0 L
S
GR
GS
[0.99949 0 0 1.0009 388.55015 128.96534] CT
N
f1394637256
f
GR
GS
[0.99949 0 0 1.0009 388.55015 128.96534] CT
10.0 ML
2 LW
N
-3 0 M
3 0 L
S
GR
GS
[0.99949 0 0 1.0009 427.03035 139.12088] CT
N
f1394637256
f
GR
GS
[0.99949 0 0 1.0009 427.03035 139.12088] CT
10.0 ML
2 LW
N
-3 0 M
3 0 L
S
GR
GS
[0.99949 0 0 1.0009 465.51056 145.95038] CT
N
f1394637256
f
GR
GS
[0.99949 0 0 1.0009 465.51056 145.95038] CT
10.0 ML
2 LW
N
-3 0 M
3 0 L
S
GR
GS
[0.99949 0 0 1.0009 0 -0.25] CT
1 LJ
2 LW
N
350.25 139.948 M
350.25 148.762 L
S
GR
GS
[0.99949 0 0 1.0009 0 -0.25] CT
1 LJ
2 LW
N
388.75 161.024 M
388.75 169.46 L
S
GR
GS
[0.99949 0 0 1.0009 0 -0.25] CT
1 LJ
2 LW
N
427.25 166.587 M
427.25 174.814 L
S
GR
GS
[0.99949 0 0 1.0009 0 -0.25] CT
1 LJ
2 LW
N
465.75 169.186 M
465.75 177.057 L
S
GR
GS
[0.99949 0 0 1.0009 0 -0.25] CT
1 LJ
2 LW
N
350.25 139.948 M
350.25 131.134 L
S
GR
GS
[0.99949 0 0 1.0009 0 -0.25] CT
1 LJ
2 LW
N
388.75 161.024 M
388.75 152.587 L
S
GR
GS
[0.99949 0 0 1.0009 0 -0.25] CT
1 LJ
2 LW
N
427.25 166.587 M
427.25 158.36 L
S
GR
GS
[0.99949 0 0 1.0009 0 -0.25] CT
1 LJ
2 LW
N
465.75 169.186 M
465.75 161.315 L
S
GR
GS
[0.99949 0 0 1.0009 0 -0.25] CT
[8 8] 0 setdash
2 LJ
2 LW
N
350.25 139.948 M
388.75 161.024 L
427.25 166.587 L
465.75 169.186 L
S
GR
GS
[0.99949 0 0 1.0009 350.06994 148.64563] CT
N
f1394637256
f
GR
GS
[0.99949 0 0 1.0009 350.06994 148.64563] CT
10.0 ML
2 LW
N
-3 0 M
3 0 L
S
GR
GS
[0.99949 0 0 1.0009 388.55015 169.36219] CT
N
f1394637256
f
GR
GS
[0.99949 0 0 1.0009 388.55015 169.36219] CT
10.0 ML
2 LW
N
-3 0 M
3 0 L
S
GR
GS
[0.99949 0 0 1.0009 427.03035 174.72055] CT
N
f1394637256
f
GR
GS
[0.99949 0 0 1.0009 427.03035 174.72055] CT
10.0 ML
2 LW
N
-3 0 M
3 0 L
S
GR
GS
[0.99949 0 0 1.0009 465.51056 176.96537] CT
N
f1394637256
f
GR
GS
[0.99949 0 0 1.0009 465.51056 176.96537] CT
10.0 ML
2 LW
N
-3 0 M
3 0 L
S
GR
GS
[0.99949 0 0 1.0009 350.06994 131.00169] CT
N
f1394637256
f
GR
GS
[0.99949 0 0 1.0009 350.06994 131.00169] CT
10.0 ML
2 LW
N
-3 0 M
3 0 L
S
GR
GS
[0.99949 0 0 1.0009 388.55015 152.47343] CT
N
f1394637256
f
GR
GS
[0.99949 0 0 1.0009 388.55015 152.47343] CT
10.0 ML
2 LW
N
-3 0 M
3 0 L
S
GR
GS
[0.99949 0 0 1.0009 427.03035 158.25172] CT
N
f1394637256
f
GR
GS
[0.99949 0 0 1.0009 427.03035 158.25172] CT
10.0 ML
2 LW
N
-3 0 M
3 0 L
S
GR
GS
[0.99949 0 0 1.0009 465.51056 161.20996] CT
N
f1394637256
f
GR
GS
[0.99949 0 0 1.0009 465.51056 161.20996] CT
10.0 ML
2 LW
N
-3 0 M
3 0 L
S
GR
GS
[0.99949 0 0 1.0009 0 -0.25] CT
1 GC
N
/f235422484{549.5 229.5 M
703 229.5 L
703 27 L
549.5 27 L
cp}def
f235422484
f
GR
GS
[0.99949 0 0 1.0009 0 -0.25] CT
0.149 GC
2 setlinecap
1 LJ
0.5 LW
N
549.5 229.5 M
703 229.5 L
S
GR
GS
[0.99949 0 0 1.0009 0 -0.25] CT
0.149 GC
2 setlinecap
1 LJ
0.5 LW
N
568.688 229.5 M
568.688 227.475 L
S
GR
GS
[0.99949 0 0 1.0009 0 -0.25] CT
0.149 GC
2 setlinecap
1 LJ
0.5 LW
N
607.063 229.5 M
607.063 227.475 L
S
GR
GS
[0.99949 0 0 1.0009 0 -0.25] CT
0.149 GC
2 setlinecap
1 LJ
0.5 LW
N
645.438 229.5 M
645.438 227.475 L
S
GR
GS
[0.99949 0 0 1.0009 0 -0.25] CT
0.149 GC
2 setlinecap
1 LJ
0.5 LW
N
683.813 229.5 M
683.813 227.475 L
S
GR
GS
[0.99949 0 0 1.0009 568.39514 235.06067] CT
0.149 GC
/Helvetica 18 F
GS
[1 0 0 1 0 0] CT
-5.5 18 moveto 
1 -1 scale
(1) t 
GR
GR
GS
[0.99949 0 0 1.0009 606.75041 235.06067] CT
0.149 GC
/Helvetica 18 F
GS
[1 0 0 1 0 0] CT
-5.5 18 moveto 
1 -1 scale
(2) t 
GR
GR
GS
[0.99949 0 0 1.0009 645.10569 235.06067] CT
0.149 GC
/Helvetica 18 F
GS
[1 0 0 1 0 0] CT
-5.5 18 moveto 
1 -1 scale
(3) t 
GR
GR
GS
[0.99949 0 0 1.0009 683.46096 235.06067] CT
0.149 GC
/Helvetica 18 F
GS
[1 0 0 1 0 0] CT
-5.5 18 moveto 
1 -1 scale
(4) t 
GR
GR
GS
[0.99949 0 0 1.0009 625.92811 257.58083] CT
0.149 GC
/Helvetica 18 F
GS
[1 0 0 1 0 0] CT
-46 18 moveto 
1 -1 scale
(# of targets) t 
GR
GR
GS
[0.99949 0 0 1.0009 0 -0.25] CT
0.149 GC
2 setlinecap
1 LJ
0.5 LW
N
549.5 229.5 M
549.5 27 L
S
GR
GS
[0.99949 0 0 1.0009 0 -0.25] CT
0.149 GC
2 setlinecap
1 LJ
0.5 LW
N
549.5 200.571 M
551.525 200.571 L
S
GR
GS
[0.99949 0 0 1.0009 0 -0.25] CT
0.149 GC
2 setlinecap
1 LJ
0.5 LW
N
549.5 142.714 M
551.525 142.714 L
S
GR
GS
[0.99949 0 0 1.0009 0 -0.25] CT
0.149 GC
2 setlinecap
1 LJ
0.5 LW
N
549.5 84.857 M
551.525 84.857 L
S
GR
GS
[0.99949 0 0 1.0009 0 -0.25] CT
0.149 GC
2 setlinecap
1 LJ
0.5 LW
N
549.5 27 M
551.525 27 L
S
GR
GS
[0.99949 0 0 1.0009 543.62041 200.50115] CT
0.149 GC
/Helvetica 18 F
GS
[1 0 0 1 0 0] CT
-26 7 moveto 
1 -1 scale
(0.5) t 
GR
GR
GS
[0.99949 0 0 1.0009 543.62041 142.59216] CT
0.149 GC
/Helvetica 18 F
GS
[1 0 0 1 0 0] CT
-11 7 moveto 
1 -1 scale
(1) t 
GR
GR
GS
[0.99949 0 0 1.0009 543.62041 84.68318] CT
0.149 GC
/Helvetica 18 F
GS
[1 0 0 1 0 0] CT
-26 7 moveto 
1 -1 scale
(1.5) t 
GR
GR
GS
[0.99949 0 0 1.0009 543.62041 26.77419] CT
0.149 GC
/Helvetica 18 F
GS
[1 0 0 1 0 0] CT
-11 7 moveto 
1 -1 scale
(2) t 
GR
GR
GS
[0 -1.0009 0.99949 0 515.13506 128.11483] CT
0.149 GC
/Helvetica 18 F
GS
[1 0 0 1 0 0] CT
-35 -4 moveto 
1 -1 scale
(Drift rate) t 
GR
GR
GS
[0.99949 0 0 1.0009 0 -0.25] CT
1 LJ
2 LW
N
568.688 62.198 M
568.688 79.881 L
S
GR
GS
[0.99949 0 0 1.0009 0 -0.25] CT
1 LJ
2 LW
N
607.063 145.08 M
607.063 156.677 L
S
GR
GS
[0.99949 0 0 1.0009 0 -0.25] CT
1 LJ
2 LW
N
645.438 163.991 M
645.438 173.559 L
S
GR
GS
[0.99949 0 0 1.0009 0 -0.25] CT
1 LJ
2 LW
N
683.813 170.757 M
683.813 180.487 L
S
GR
GS
[0.99949 0 0 1.0009 0 -0.25] CT
1 LJ
2 LW
N
568.688 62.198 M
568.688 44.516 L
S
GR
GS
[0.99949 0 0 1.0009 0 -0.25] CT
1 LJ
2 LW
N
607.063 145.08 M
607.063 133.482 L
S
GR
GS
[0.99949 0 0 1.0009 0 -0.25] CT
1 LJ
2 LW
N
645.438 163.991 M
645.438 154.422 L
S
GR
GS
[0.99949 0 0 1.0009 0 -0.25] CT
1 LJ
2 LW
N
683.813 170.757 M
683.813 161.028 L
S
GR
GS
[0.99949 0 0 1.0009 0 -0.25] CT
1 LJ
2 LW
N
568.688 62.198 M
607.063 145.08 L
645.438 163.991 L
683.813 170.757 L
S
GR
GS
[0.99949 0 0 1.0009 568.39514 79.70277] CT
N
f1394637256
f
GR
GS
[0.99949 0 0 1.0009 568.39514 79.70277] CT
10.0 ML
2 LW
N
-3 0 M
3 0 L
S
GR
GS
[0.99949 0 0 1.0009 606.75041 156.56752] CT
N
f1394637256
f
GR
GS
[0.99949 0 0 1.0009 606.75041 156.56752] CT
10.0 ML
2 LW
N
-3 0 M
3 0 L
S
GR
GS
[0.99949 0 0 1.0009 645.10569 173.46488] CT
N
f1394637256
f
GR
GS
[0.99949 0 0 1.0009 645.10569 173.46488] CT
10.0 ML
2 LW
N
-3 0 M
3 0 L
S
GR
GS
[0.99949 0 0 1.0009 683.46096 180.39851] CT
N
f1394637256
f
GR
GS
[0.99949 0 0 1.0009 683.46096 180.39851] CT
10.0 ML
2 LW
N
-3 0 M
3 0 L
S
GR
GS
[0.99949 0 0 1.0009 568.39514 44.3055] CT
N
f1394637256
f
GR
GS
[0.99949 0 0 1.0009 568.39514 44.3055] CT
10.0 ML
2 LW
N
-3 0 M
3 0 L
S
GR
GS
[0.99949 0 0 1.0009 606.75041 133.35186] CT
N
f1394637256
f
GR
GS
[0.99949 0 0 1.0009 606.75041 133.35186] CT
10.0 ML
2 LW
N
-3 0 M
3 0 L
S
GR
GS
[0.99949 0 0 1.0009 645.10569 154.31029] CT
N
f1394637256
f
GR
GS
[0.99949 0 0 1.0009 645.10569 154.31029] CT
10.0 ML
2 LW
N
-3 0 M
3 0 L
S
GR
GS
[0.99949 0 0 1.0009 683.46096 160.92208] CT
N
f1394637256
f
GR
GS
[0.99949 0 0 1.0009 683.46096 160.92208] CT
10.0 ML
2 LW
N
-3 0 M
3 0 L
S
GR
GS
[0.99949 0 0 1.0009 0 -0.25] CT
1 LJ
2 LW
N
568.688 116.255 M
568.688 129.798 L
S
GR
GS
[0.99949 0 0 1.0009 0 -0.25] CT
1 LJ
2 LW
N
607.063 180.78 M
607.063 189.047 L
S
GR
GS
[0.99949 0 0 1.0009 0 -0.25] CT
1 LJ
2 LW
N
645.438 190.233 M
645.438 198.048 L
S
GR
GS
[0.99949 0 0 1.0009 0 -0.25] CT
1 LJ
2 LW
N
683.813 194.563 M
683.813 201.965 L
S
GR
GS
[0.99949 0 0 1.0009 0 -0.25] CT
1 LJ
2 LW
N
568.688 116.255 M
568.688 102.712 L
S
GR
GS
[0.99949 0 0 1.0009 0 -0.25] CT
1 LJ
2 LW
N
607.063 180.78 M
607.063 172.512 L
S
GR
GS
[0.99949 0 0 1.0009 0 -0.25] CT
1 LJ
2 LW
N
645.438 190.233 M
645.438 182.418 L
S
GR
GS
[0.99949 0 0 1.0009 0 -0.25] CT
1 LJ
2 LW
N
683.813 194.563 M
683.813 187.161 L
S
GR
GS
[0.99949 0 0 1.0009 0 -0.25] CT
[8 8] 0 setdash
2 LJ
2 LW
N
568.688 116.255 M
607.063 180.78 L
645.438 190.233 L
683.813 194.563 L
S
GR
GS
[0.99949 0 0 1.0009 568.39514 129.66446] CT
N
f1394637256
f
GR
GS
[0.99949 0 0 1.0009 568.39514 129.66446] CT
10.0 ML
2 LW
N
-3 0 M
3 0 L
S
GR
GS
[0.99949 0 0 1.0009 606.75041 188.96687] CT
N
f1394637256
f
GR
GS
[0.99949 0 0 1.0009 606.75041 188.96687] CT
10.0 ML
2 LW
N
-3 0 M
3 0 L
S
GR
GS
[0.99949 0 0 1.0009 645.10569 197.97519] CT
N
f1394637256
f
GR
GS
[0.99949 0 0 1.0009 645.10569 197.97519] CT
10.0 ML
2 LW
N
-3 0 M
3 0 L
S
GR
GS
[0.99949 0 0 1.0009 683.46096 201.89598] CT
N
f1394637256
f
GR
GS
[0.99949 0 0 1.0009 683.46096 201.89598] CT
10.0 ML
2 LW
N
-3 0 M
3 0 L
S
GR
GS
[0.99949 0 0 1.0009 568.39514 102.55377] CT
N
f1394637256
f
GR
GS
[0.99949 0 0 1.0009 568.39514 102.55377] CT
10.0 ML
2 LW
N
-3 0 M
3 0 L
S
GR
GS
[0.99949 0 0 1.0009 606.75041 172.4167] CT
N
f1394637256
f
GR
GS
[0.99949 0 0 1.0009 606.75041 172.4167] CT
10.0 ML
2 LW
N
-3 0 M
3 0 L
S
GR
GS
[0.99949 0 0 1.0009 645.10569 182.33158] CT
N
f1394637256
f
GR
GS
[0.99949 0 0 1.0009 645.10569 182.33158] CT
10.0 ML
2 LW
N
-3 0 M
3 0 L
S
GR
GS
[0.99949 0 0 1.0009 683.46096 187.07837] CT
N
f1394637256
f
GR
GS
[0.99949 0 0 1.0009 683.46096 187.07837] CT
10.0 ML
2 LW
N
-3 0 M
3 0 L
S
GR
%%Trailer
%%Pages: 1
%%EOF
