%!PS-Adobe-3.0 EPSF-3.0
%%Creator: (MATLAB, The Mathworks, Inc. Version 9.3.0.713579 \(R2017b\). Operating System: Mac OS X)
%%Title: /Volumes/LNDG/Projects/StateSwitch/dynamic/data/behavior/STSW_dynamic/B_reliabilityAcrossSessions/C_figures/E2_vsGuess_YA.eps
%%CreationDate: 2020-02-26T15:35:41
%%Pages: (atend)
%%BoundingBox:    76     5   931   282
%%LanguageLevel: 3
%%EndComments
%%BeginProlog
%%BeginResource: procset (Apache XML Graphics Std ProcSet) 1.2 0
%%Version: 1.2 0
%%Copyright: (Copyright 2001-2003,2010 The Apache Software Foundation. License terms: http://www.apache.org/licenses/LICENSE-2.0)
/bd{bind def}bind def
/ld{load def}bd
/GR/grestore ld
/GS/gsave ld
/RM/rmoveto ld
/C/curveto ld
/t/show ld
/L/lineto ld
/ML/setmiterlimit ld
/CT/concat ld
/f/fill ld
/N/newpath ld
/S/stroke ld
/CC/setcmykcolor ld
/A/ashow ld
/cp/closepath ld
/RC/setrgbcolor ld
/LJ/setlinejoin ld
/GC/setgray ld
/LW/setlinewidth ld
/M/moveto ld
/re {4 2 roll M
1 index 0 rlineto
0 exch rlineto
neg 0 rlineto
cp } bd
/_ctm matrix def
/_tm matrix def
/BT { _ctm currentmatrix pop matrix _tm copy pop 0 0 moveto } bd
/ET { _ctm setmatrix } bd
/iTm { _ctm setmatrix _tm concat } bd
/Tm { _tm astore pop iTm 0 0 moveto } bd
/ux 0.0 def
/uy 0.0 def
/F {
  /Tp exch def
  /Tf exch def
  Tf findfont Tp scalefont setfont
  /cf Tf def  /cs Tp def
} bd
/ULS {currentpoint /uy exch def /ux exch def} bd
/ULE {
  /Tcx currentpoint pop def
  gsave
  newpath
  cf findfont cs scalefont dup
  /FontMatrix get 0 get /Ts exch def /FontInfo get dup
  /UnderlinePosition get Ts mul /To exch def
  /UnderlineThickness get Ts mul /Tt exch def
  ux uy To add moveto  Tcx uy To add lineto
  Tt setlinewidth stroke
  grestore
} bd
/OLE {
  /Tcx currentpoint pop def
  gsave
  newpath
  cf findfont cs scalefont dup
  /FontMatrix get 0 get /Ts exch def /FontInfo get dup
  /UnderlinePosition get Ts mul /To exch def
  /UnderlineThickness get Ts mul /Tt exch def
  ux uy To add cs add moveto Tcx uy To add cs add lineto
  Tt setlinewidth stroke
  grestore
} bd
/SOE {
  /Tcx currentpoint pop def
  gsave
  newpath
  cf findfont cs scalefont dup
  /FontMatrix get 0 get /Ts exch def /FontInfo get dup
  /UnderlinePosition get Ts mul /To exch def
  /UnderlineThickness get Ts mul /Tt exch def
  ux uy To add cs 10 mul 26 idiv add moveto Tcx uy To add cs 10 mul 26 idiv add lineto
  Tt setlinewidth stroke
  grestore
} bd
/QT {
/Y22 exch store
/X22 exch store
/Y21 exch store
/X21 exch store
currentpoint
/Y21 load 2 mul add 3 div exch
/X21 load 2 mul add 3 div exch
/X21 load 2 mul /X22 load add 3 div
/Y21 load 2 mul /Y22 load add 3 div
/X22 load /Y22 load curveto
} bd
/SSPD {
dup length /d exch dict def
{
/v exch def
/k exch def
currentpagedevice k known {
/cpdv currentpagedevice k get def
v cpdv ne {
/upd false def
/nullv v type /nulltype eq def
/nullcpdv cpdv type /nulltype eq def
nullv nullcpdv or
{
/upd true def
} {
/sametype v type cpdv type eq def
sametype {
v type /arraytype eq {
/vlen v length def
/cpdvlen cpdv length def
vlen cpdvlen eq {
0 1 vlen 1 sub {
/i exch def
/obj v i get def
/cpdobj cpdv i get def
obj cpdobj ne {
/upd true def
exit
} if
} for
} {
/upd true def
} ifelse
} {
v type /dicttype eq {
v {
/dv exch def
/dk exch def
/cpddv cpdv dk get def
dv cpddv ne {
/upd true def
exit
} if
} forall
} {
/upd true def
} ifelse
} ifelse
} if
} ifelse
upd true eq {
d k v put
} if
} if
} if
} forall
d length 0 gt {
d setpagedevice
} if
} bd
/RE { % /NewFontName [NewEncodingArray] /FontName RE -
  findfont dup length dict begin
  {
    1 index /FID ne
    {def} {pop pop} ifelse
  } forall
  /Encoding exch def
  /FontName 1 index def
  currentdict definefont pop
  end
} bind def
%%EndResource
%%BeginResource: procset (Apache XML Graphics EPS ProcSet) 1.0 0
%%Version: 1.0 0
%%Copyright: (Copyright 2002-2003 The Apache Software Foundation. License terms: http://www.apache.org/licenses/LICENSE-2.0)
/BeginEPSF { %def
/b4_Inc_state save def         % Save state for cleanup
/dict_count countdictstack def % Count objects on dict stack
/op_count count 1 sub def      % Count objects on operand stack
userdict begin                 % Push userdict on dict stack
/showpage { } def              % Redefine showpage, { } = null proc
0 setgray 0 setlinecap         % Prepare graphics state
1 setlinewidth 0 setlinejoin
10 setmiterlimit [ ] 0 setdash newpath
/languagelevel where           % If level not equal to 1 then
{pop languagelevel             % set strokeadjust and
1 ne                           % overprint to their defaults.
{false setstrokeadjust false setoverprint
} if
} if
} bd
/EndEPSF { %def
count op_count sub {pop} repeat            % Clean up stacks
countdictstack dict_count sub {end} repeat
b4_Inc_state restore
} bd
%%EndResource
%FOPBeginFontDict
%%IncludeResource: font Courier-Oblique
%%IncludeResource: font Courier-BoldOblique
%%IncludeResource: font Courier-Bold
%%IncludeResource: font ZapfDingbats
%%IncludeResource: font Symbol
%%IncludeResource: font Helvetica
%%IncludeResource: font Helvetica-Oblique
%%IncludeResource: font Helvetica-Bold
%%IncludeResource: font Helvetica-BoldOblique
%%IncludeResource: font Times-Roman
%%IncludeResource: font Times-Italic
%%IncludeResource: font Times-Bold
%%IncludeResource: font Times-BoldItalic
%%IncludeResource: font Courier
%FOPEndFontDict
%%BeginResource: encoding WinAnsiEncoding
/WinAnsiEncoding [
/.notdef /.notdef /.notdef /.notdef /.notdef
/.notdef /.notdef /.notdef /.notdef /.notdef
/.notdef /.notdef /.notdef /.notdef /.notdef
/.notdef /.notdef /.notdef /.notdef /.notdef
/.notdef /.notdef /.notdef /.notdef /.notdef
/.notdef /.notdef /.notdef /.notdef /.notdef
/.notdef /.notdef /space /exclam /quotedbl
/numbersign /dollar /percent /ampersand /quotesingle
/parenleft /parenright /asterisk /plus /comma
/hyphen /period /slash /zero /one
/two /three /four /five /six
/seven /eight /nine /colon /semicolon
/less /equal /greater /question /at
/A /B /C /D /E
/F /G /H /I /J
/K /L /M /N /O
/P /Q /R /S /T
/U /V /W /X /Y
/Z /bracketleft /backslash /bracketright /asciicircum
/underscore /quoteleft /a /b /c
/d /e /f /g /h
/i /j /k /l /m
/n /o /p /q /r
/s /t /u /v /w
/x /y /z /braceleft /bar
/braceright /asciitilde /bullet /Euro /bullet
/quotesinglbase /florin /quotedblbase /ellipsis /dagger
/daggerdbl /circumflex /perthousand /Scaron /guilsinglleft
/OE /bullet /Zcaron /bullet /bullet
/quoteleft /quoteright /quotedblleft /quotedblright /bullet
/endash /emdash /asciitilde /trademark /scaron
/guilsinglright /oe /bullet /zcaron /Ydieresis
/space /exclamdown /cent /sterling /currency
/yen /brokenbar /section /dieresis /copyright
/ordfeminine /guillemotleft /logicalnot /sfthyphen /registered
/macron /degree /plusminus /twosuperior /threesuperior
/acute /mu /paragraph /middot /cedilla
/onesuperior /ordmasculine /guillemotright /onequarter /onehalf
/threequarters /questiondown /Agrave /Aacute /Acircumflex
/Atilde /Adieresis /Aring /AE /Ccedilla
/Egrave /Eacute /Ecircumflex /Edieresis /Igrave
/Iacute /Icircumflex /Idieresis /Eth /Ntilde
/Ograve /Oacute /Ocircumflex /Otilde /Odieresis
/multiply /Oslash /Ugrave /Uacute /Ucircumflex
/Udieresis /Yacute /Thorn /germandbls /agrave
/aacute /acircumflex /atilde /adieresis /aring
/ae /ccedilla /egrave /eacute /ecircumflex
/edieresis /igrave /iacute /icircumflex /idieresis
/eth /ntilde /ograve /oacute /ocircumflex
/otilde /odieresis /divide /oslash /ugrave
/uacute /ucircumflex /udieresis /yacute /thorn
/ydieresis
] def
%%EndResource
%FOPBeginFontReencode
/Courier-Oblique findfont
dup length dict begin
  {1 index /FID ne {def} {pop pop} ifelse} forall
  /Encoding WinAnsiEncoding def
  currentdict
end
/Courier-Oblique exch definefont pop
/Courier-BoldOblique findfont
dup length dict begin
  {1 index /FID ne {def} {pop pop} ifelse} forall
  /Encoding WinAnsiEncoding def
  currentdict
end
/Courier-BoldOblique exch definefont pop
/Courier-Bold findfont
dup length dict begin
  {1 index /FID ne {def} {pop pop} ifelse} forall
  /Encoding WinAnsiEncoding def
  currentdict
end
/Courier-Bold exch definefont pop
/Helvetica findfont
dup length dict begin
  {1 index /FID ne {def} {pop pop} ifelse} forall
  /Encoding WinAnsiEncoding def
  currentdict
end
/Helvetica exch definefont pop
/Helvetica-Oblique findfont
dup length dict begin
  {1 index /FID ne {def} {pop pop} ifelse} forall
  /Encoding WinAnsiEncoding def
  currentdict
end
/Helvetica-Oblique exch definefont pop
/Helvetica-Bold findfont
dup length dict begin
  {1 index /FID ne {def} {pop pop} ifelse} forall
  /Encoding WinAnsiEncoding def
  currentdict
end
/Helvetica-Bold exch definefont pop
/Helvetica-BoldOblique findfont
dup length dict begin
  {1 index /FID ne {def} {pop pop} ifelse} forall
  /Encoding WinAnsiEncoding def
  currentdict
end
/Helvetica-BoldOblique exch definefont pop
/Times-Roman findfont
dup length dict begin
  {1 index /FID ne {def} {pop pop} ifelse} forall
  /Encoding WinAnsiEncoding def
  currentdict
end
/Times-Roman exch definefont pop
/Times-Italic findfont
dup length dict begin
  {1 index /FID ne {def} {pop pop} ifelse} forall
  /Encoding WinAnsiEncoding def
  currentdict
end
/Times-Italic exch definefont pop
/Times-Bold findfont
dup length dict begin
  {1 index /FID ne {def} {pop pop} ifelse} forall
  /Encoding WinAnsiEncoding def
  currentdict
end
/Times-Bold exch definefont pop
/Times-BoldItalic findfont
dup length dict begin
  {1 index /FID ne {def} {pop pop} ifelse} forall
  /Encoding WinAnsiEncoding def
  currentdict
end
/Times-BoldItalic exch definefont pop
/Courier findfont
dup length dict begin
  {1 index /FID ne {def} {pop pop} ifelse} forall
  /Encoding WinAnsiEncoding def
  currentdict
end
/Courier exch definefont pop
%FOPEndFontReencode
%%EndProlog
%%Page: 1 1
%%PageBoundingBox: 0 0 1024 288
%%BeginPageSetup
[1 0 0 -1 0 288] CT
%%EndPageSetup
GS
1 GC
N
0 0 1024 288 re
f
GR
GS
1 GC
N
0 0 1024 288 re
f
GR
GS
1 GC
N
133 256.5 M
476 256.5 L
476 29 L
133 29 L
cp
f
GR
GS
0.149 GC
2 setlinecap
1 LJ
0.5 LW
N
133 256.5 M
476 256.5 L
S
GR
GS
0.149 GC
2 setlinecap
1 LJ
0.5 LW
N
175.875 256.5 M
175.875 253.07 L
S
GR
GS
0.149 GC
2 setlinecap
1 LJ
0.5 LW
N
261.625 256.5 M
261.625 253.07 L
S
GR
GS
0.149 GC
2 setlinecap
1 LJ
0.5 LW
N
347.375 256.5 M
347.375 253.07 L
S
GR
GS
0.149 GC
2 setlinecap
1 LJ
0.5 LW
N
433.125 256.5 M
433.125 253.07 L
S
GR
GS
[1 0 0 1 175.875 262.5] CT
0.149 GC
/Helvetica 20 F
GS
[1 0 0 1 0 0] CT
-24.5 20 moveto 
1 -1 scale
(Color) t 
GR
GR
GS
[1 0 0 1 261.625 262.5] CT
0.149 GC
/Helvetica 20 F
GS
[1 0 0 1 0 0] CT
-40 20 moveto 
1 -1 scale
(Direction) t 
GR
GR
GS
[1 0 0 1 347.375 262.5] CT
0.149 GC
/Helvetica 20 F
GS
[1 0 0 1 0 0] CT
-19 20 moveto 
1 -1 scale
(Size) t 
GR
GR
GS
[1 0 0 1 433.125 262.5] CT
0.149 GC
/Helvetica 20 F
GS
[1 0 0 1 0 0] CT
-49.5 20 moveto 
1 -1 scale
(Luminance) t 
GR
GR
GS
0.149 GC
2 setlinecap
1 LJ
0.5 LW
N
133 256.5 M
133 29 L
S
GR
GS
0.149 GC
2 setlinecap
1 LJ
0.5 LW
N
133 256.5 M
136.43 256.5 L
S
GR
GS
0.149 GC
2 setlinecap
1 LJ
0.5 LW
N
133 211 M
136.43 211 L
S
GR
GS
0.149 GC
2 setlinecap
1 LJ
0.5 LW
N
133 165.5 M
136.43 165.5 L
S
GR
GS
0.149 GC
2 setlinecap
1 LJ
0.5 LW
N
133 120 M
136.43 120 L
S
GR
GS
0.149 GC
2 setlinecap
1 LJ
0.5 LW
N
133 74.5 M
136.43 74.5 L
S
GR
GS
0.149 GC
2 setlinecap
1 LJ
0.5 LW
N
133 29 M
136.43 29 L
S
GR
GS
[1 0 0 1 127 256.5] CT
0.149 GC
/Helvetica 20 F
GS
[1 0 0 1 0 0] CT
-12 7.5 moveto 
1 -1 scale
(0) t 
GR
GR
GS
[1 0 0 1 127 211] CT
0.149 GC
/Helvetica 20 F
GS
[1 0 0 1 0 0] CT
-28 7.5 moveto 
1 -1 scale
(0.2) t 
GR
GR
GS
[1 0 0 1 127 165.5] CT
0.149 GC
/Helvetica 20 F
GS
[1 0 0 1 0 0] CT
-28 7.5 moveto 
1 -1 scale
(0.4) t 
GR
GR
GS
[1 0 0 1 127 119.99999] CT
0.149 GC
/Helvetica 20 F
GS
[1 0 0 1 0 0] CT
-28 7.5 moveto 
1 -1 scale
(0.6) t 
GR
GR
GS
[1 0 0 1 127 74.5] CT
0.149 GC
/Helvetica 20 F
GS
[1 0 0 1 0 0] CT
-28 7.5 moveto 
1 -1 scale
(0.8) t 
GR
GR
GS
[1 0 0 1 127 29] CT
0.149 GC
/Helvetica 20 F
GS
[1 0 0 1 0 0] CT
-12 7.5 moveto 
1 -1 scale
(1) t 
GR
GR
GS
[0 -1 1 0 96 142.74989] CT
0.149 GC
/Helvetica 20 F
GS
[1 0 0 1 0 0] CT
-70 -5 moveto 
1 -1 scale
(Mean Accuracy) t 
GR
GR
GS
[1 0 0 1 304.50027 26.49999] CT
/Helvetica-Bold 20 F
GS
[1 0 0 1 0 0] CT
-60 -5 moveto 
1 -1 scale
(EEG session) t 
GR
GR
GS
0.149 GC
1 LJ
0.5 LW
N
133 256.5 M
476 256.5 L
S
GR
GS
1 0.8 0.8 RC
N
175.875 256.5 M
175.875 44.147 L
141.575 44.147 L
141.575 256.5 L
cp
f
GR
GS
0.8 GC
N
210.175 256.5 M
210.175 68.243 L
175.875 68.243 L
175.875 256.5 L
cp
f
GR
GS
1 0.8 0.8 RC
N
261.625 256.5 M
261.625 56.832 L
227.325 56.832 L
227.325 256.5 L
cp
f
GR
GS
0.8 GC
N
295.925 256.5 M
295.925 63.327 L
261.625 63.327 L
261.625 256.5 L
cp
f
GR
GS
1 0.8 0.8 RC
N
347.375 256.5 M
347.375 52.295 L
313.075 52.295 L
313.075 256.5 L
cp
f
GR
GS
0.8 GC
N
381.675 256.5 M
381.675 78.562 L
347.375 78.562 L
347.375 256.5 L
cp
f
GR
GS
1 0.8 0.8 RC
N
433.125 256.5 M
433.125 75.408 L
398.825 75.408 L
398.825 256.5 L
cp
f
GR
GS
0.8 GC
N
467.425 256.5 M
467.425 106.749 L
433.125 106.749 L
433.125 256.5 L
cp
f
GR
GS
[8 8] 0 setdash
2 LJ
2 LW
N
132.959 142.75 M
476.041 142.75 L
S
GR
GS
[1 0 0 1 152.45926 43.21875] CT
1 0.302 0.302 RC
N
1.581 0 M
1.581 -0.873 0.873 -1.581 0 -1.581 C
-0.873 -1.581 -1.581 -0.873 -1.581 0 C
-1.581 0.873 -0.873 1.581 0 1.581 C
0.873 1.581 1.581 0.873 1.581 0 C
f
GR
GS
[1 0 0 1 174.9342 57.4375] CT
1 0.302 0.302 RC
N
/f-27201882{1.581 0 M
1.581 -0.873 0.873 -1.581 0 -1.581 C
-0.873 -1.581 -1.581 -0.873 -1.581 0 C
-1.581 0.873 -0.873 1.581 0 1.581 C
0.873 1.581 1.581 0.873 1.581 0 C}def
f-27201882
f
GR
GS
[1 0 0 1 150.43204 29] CT
1 0.302 0.302 RC
N
f-27201882
f
GR
GS
[1 0 0 1 161.02654 43.21875] CT
1 0.302 0.302 RC
N
f-27201882
f
GR
GS
[1 0 0 1 153.65089 43.21875] CT
1 0.302 0.302 RC
N
f-27201882
f
GR
GS
[1 0 0 1 152.27762 29] CT
1 0.302 0.302 RC
N
f-27201882
f
GR
GS
[1 0 0 1 141.89734 29] CT
1 0.302 0.302 RC
N
f-27201882
f
GR
GS
[1 0 0 1 164.49178 29] CT
1 0.302 0.302 RC
N
f-27201882
f
GR
GS
[1 0 0 1 171.95409 71.65625] CT
1 0.302 0.302 RC
N
f-27201882
f
GR
GS
[1 0 0 1 156.0262 128.53125] CT
1 0.302 0.302 RC
N
f-27201882
f
GR
GS
[1 0 0 1 171.02429 57.4375] CT
1 0.302 0.302 RC
N
f-27201882
f
GR
GS
[1 0 0 1 174.09114 29] CT
1 0.302 0.302 RC
N
f-27201882
f
GR
GS
[1 0 0 1 154.47546 85.875] CT
1 0.302 0.302 RC
N
f-27201882
f
GR
GS
[1 0 0 1 148.54796 44.16666] CT
1 0.302 0.302 RC
N
f-27201882
f
GR
GS
[1 0 0 1 147.72052 29] CT
1 0.302 0.302 RC
N
f-27201882
f
GR
GS
[1 0 0 1 152.08089 29] CT
1 0.302 0.302 RC
N
f-27201882
f
GR
GS
[1 0 0 1 170.74069 29] CT
1 0.302 0.302 RC
N
f-27201882
f
GR
GS
[1 0 0 1 159.60316 57.4375] CT
1 0.302 0.302 RC
N
f-27201882
f
GR
GS
[1 0 0 1 169.99057 43.21875] CT
1 0.302 0.302 RC
N
f-27201882
f
GR
GS
[1 0 0 1 145.24086 114.3125] CT
1 0.302 0.302 RC
N
f-27201882
f
GR
GS
[1 0 0 1 162.74298 29] CT
1 0.302 0.302 RC
N
f-27201882
f
GR
GS
[1 0 0 1 161.01715 29] CT
1 0.302 0.302 RC
N
f-27201882
f
GR
GS
[1 0 0 1 150.52512 43.21875] CT
1 0.302 0.302 RC
N
f-27201882
f
GR
GS
[1 0 0 1 141.65417 57.4375] CT
1 0.302 0.302 RC
N
f-27201882
f
GR
GS
[1 0 0 1 151.42786 29] CT
1 0.302 0.302 RC
N
f-27201882
f
GR
GS
[1 0 0 1 169.74457 71.65625] CT
1 0.302 0.302 RC
N
f-27201882
f
GR
GS
[1 0 0 1 172.27745 29] CT
1 0.302 0.302 RC
N
f-27201882
f
GR
GS
[1 0 0 1 175.73122 71.65625] CT
1 0.302 0.302 RC
N
f-27201882
f
GR
GS
[1 0 0 1 141.86444 43.21875] CT
1 0.302 0.302 RC
N
f-27201882
f
GR
GS
[1 0 0 1 166.71152 43.21875] CT
1 0.302 0.302 RC
N
f-27201882
f
GR
GS
[1 0 0 1 144.47737 29] CT
1 0.302 0.302 RC
N
f-27201882
f
GR
GS
[1 0 0 1 163.29886 43.21875] CT
1 0.302 0.302 RC
N
f-27201882
f
GR
GS
[1 0 0 1 169.18947 29] CT
1 0.302 0.302 RC
N
f-27201882
f
GR
GS
[1 0 0 1 170.0428 57.4375] CT
1 0.302 0.302 RC
N
f-27201882
f
GR
GS
[1 0 0 1 161.0307 43.21875] CT
1 0.302 0.302 RC
N
f-27201882
f
GR
GS
[1 0 0 1 150.49449 43.21875] CT
1 0.302 0.302 RC
N
f-27201882
f
GR
GS
[1 0 0 1 168.48445 29] CT
1 0.302 0.302 RC
N
f-27201882
f
GR
GS
[1 0 0 1 147.37874 29] CT
1 0.302 0.302 RC
N
f-27201882
f
GR
GS
[1 0 0 1 150.98206 29] CT
1 0.302 0.302 RC
N
f-27201882
f
GR
GS
[1 0 0 1 141.74318 29] CT
1 0.302 0.302 RC
N
f-27201882
f
GR
GS
[1 0 0 1 155.21135 29] CT
1 0.302 0.302 RC
N
f-27201882
f
GR
GS
[1 0 0 1 142.48572 29] CT
1 0.302 0.302 RC
N
f-27201882
f
GR
GS
[1 0 0 1 170.89117 29] CT
1 0.302 0.302 RC
N
f-27201882
f
GR
GS
[1 0 0 1 148.60278 43.21875] CT
1 0.302 0.302 RC
N
f-27201882
f
GR
GS
[1 0 0 1 171.08502 29] CT
1 0.302 0.302 RC
N
f-27201882
f
GR
GS
[1 0 0 1 143.50008 29] CT
1 0.302 0.302 RC
N
f-27201882
f
GR
GS
[1 0 0 1 149.24146 57.4375] CT
1 0.302 0.302 RC
N
f-27201882
f
GR
GS
[1 0 0 1 228.87813 29] CT
1 0.302 0.302 RC
N
f-27201882
f
GR
GS
[1 0 0 1 253.08401 85.875] CT
1 0.302 0.302 RC
N
f-27201882
f
GR
GS
[1 0 0 1 251.26833 29] CT
1 0.302 0.302 RC
N
f-27201882
f
GR
GS
[1 0 0 1 258.83942 156.96875] CT
1 0.302 0.302 RC
N
f-27201882
f
GR
GS
[1 0 0 1 258.50104 114.3125] CT
1 0.302 0.302 RC
N
f-27201882
f
GR
GS
[1 0 0 1 254.95447 29] CT
1 0.302 0.302 RC
N
f-27201882
f
GR
GS
[1 0 0 1 261.61395 43.21875] CT
1 0.302 0.302 RC
N
f-27201882
f
GR
GS
[1 0 0 1 254.79129 85.875] CT
1 0.302 0.302 RC
N
f-27201882
f
GR
GS
[1 0 0 1 238.401 29] CT
1 0.302 0.302 RC
N
f-27201882
f
GR
GS
[1 0 0 1 228.18745 29] CT
1 0.302 0.302 RC
N
f-27201882
f
GR
GS
[1 0 0 1 252.46085 43.21875] CT
1 0.302 0.302 RC
N
f-27201882
f
GR
GS
[1 0 0 1 243.54158 29] CT
1 0.302 0.302 RC
N
f-27201882
f
GR
GS
[1 0 0 1 240.79079 29] CT
1 0.302 0.302 RC
N
f-27201882
f
GR
GS
[1 0 0 1 256.82349 29] CT
1 0.302 0.302 RC
N
f-27201882
f
GR
GS
[1 0 0 1 229.29593 57.4375] CT
1 0.302 0.302 RC
N
f-27201882
f
GR
GS
[1 0 0 1 240.51489 29] CT
1 0.302 0.302 RC
N
f-27201882
f
GR
GS
[1 0 0 1 232.19012 29] CT
1 0.302 0.302 RC
N
f-27201882
f
GR
GS
[1 0 0 1 228.89188 29] CT
1 0.302 0.302 RC
N
f-27201882
f
GR
GS
[1 0 0 1 251.26622 142.75] CT
1 0.302 0.302 RC
N
f-27201882
f
GR
GS
[1 0 0 1 258.65845 142.75] CT
1 0.302 0.302 RC
N
f-27201882
f
GR
GS
[1 0 0 1 240.48061 29] CT
1 0.302 0.302 RC
N
f-27201882
f
GR
GS
[1 0 0 1 235.6637 29] CT
1 0.302 0.302 RC
N
f-27201882
f
GR
GS
[1 0 0 1 258.43845 71.65625] CT
1 0.302 0.302 RC
N
f-27201882
f
GR
GS
[1 0 0 1 251.40422 171.1875] CT
1 0.302 0.302 RC
N
f-27201882
f
GR
GS
[1 0 0 1 258.04538 85.875] CT
1 0.302 0.302 RC
N
f-27201882
f
GR
GS
[1 0 0 1 259.84048 85.875] CT
1 0.302 0.302 RC
N
f-27201882
f
GR
GS
[1 0 0 1 259.45352 43.21875] CT
1 0.302 0.302 RC
N
f-27201882
f
GR
GS
[1 0 0 1 261.51477 29] CT
1 0.302 0.302 RC
N
f-27201882
f
GR
GS
[1 0 0 1 240.94012 57.4375] CT
1 0.302 0.302 RC
N
f-27201882
f
GR
GS
[1 0 0 1 249.96082 29] CT
1 0.302 0.302 RC
N
f-27201882
f
GR
GS
[1 0 0 1 255.5522 71.65625] CT
1 0.302 0.302 RC
N
f-27201882
f
GR
GS
[1 0 0 1 248.67218 29] CT
1 0.302 0.302 RC
N
f-27201882
f
GR
GS
[1 0 0 1 251.35237 29] CT
1 0.302 0.302 RC
N
f-27201882
f
GR
GS
[1 0 0 1 244.11537 29] CT
1 0.302 0.302 RC
N
f-27201882
f
GR
GS
[1 0 0 1 244.77742 57.4375] CT
1 0.302 0.302 RC
N
f-27201882
f
GR
GS
[1 0 0 1 254.06917 29] CT
1 0.302 0.302 RC
N
f-27201882
f
GR
GS
[1 0 0 1 228.71367 29] CT
1 0.302 0.302 RC
N
f-27201882
f
GR
GS
[1 0 0 1 258.22955 29] CT
1 0.302 0.302 RC
N
f-27201882
f
GR
GS
[1 0 0 1 252.43417 29] CT
1 0.302 0.302 RC
N
f-27201882
f
GR
GS
[1 0 0 1 248.44637 29] CT
1 0.302 0.302 RC
N
f-27201882
f
GR
GS
[1 0 0 1 253.22795 29] CT
1 0.302 0.302 RC
N
f-27201882
f
GR
GS
[1 0 0 1 237.08221 85.875] CT
1 0.302 0.302 RC
N
f-27201882
f
GR
GS
[1 0 0 1 234.39934 29] CT
1 0.302 0.302 RC
N
f-27201882
f
GR
GS
[1 0 0 1 249.69499 142.75] CT
1 0.302 0.302 RC
N
f-27201882
f
GR
GS
[1 0 0 1 259.15952 29] CT
1 0.302 0.302 RC
N
f-27201882
f
GR
GS
[1 0 0 1 254.92188 142.75] CT
1 0.302 0.302 RC
N
f-27201882
f
GR
GS
[1 0 0 1 239.34496 29] CT
1 0.302 0.302 RC
N
f-27201882
f
GR
GS
[1 0 0 1 322.34247 29] CT
1 0.302 0.302 RC
N
f-27201882
f
GR
GS
[1 0 0 1 338.61539 43.21875] CT
1 0.302 0.302 RC
N
f-27201882
f
GR
GS
[1 0 0 1 337.87363 29] CT
1 0.302 0.302 RC
N
f-27201882
f
GR
GS
[1 0 0 1 342.46051 43.21875] CT
1 0.302 0.302 RC
N
f-27201882
f
GR
GS
[1 0 0 1 344.59048 43.21875] CT
1 0.302 0.302 RC
N
f-27201882
f
GR
GS
[1 0 0 1 322.302 100.09375] CT
1 0.302 0.302 RC
N
f-27201882
f
GR
GS
[1 0 0 1 336.67862 43.21875] CT
1 0.302 0.302 RC
N
f-27201882
f
GR
GS
[1 0 0 1 334.27228 43.21875] CT
1 0.302 0.302 RC
N
f-27201882
f
GR
GS
[1 0 0 1 315.52927 71.65625] CT
1 0.302 0.302 RC
N
f-27201882
f
GR
GS
[1 0 0 1 319.53705 43.21875] CT
1 0.302 0.302 RC
N
f-27201882
f
GR
GS
[1 0 0 1 324.58505 43.21875] CT
1 0.302 0.302 RC
N
f-27201882
f
GR
GS
[1 0 0 1 323.74387 43.21875] CT
1 0.302 0.302 RC
N
f-27201882
f
GR
GS
[1 0 0 1 327.48801 29] CT
1 0.302 0.302 RC
N
f-27201882
f
GR
GS
[1 0 0 1 316.08444 85.875] CT
1 0.302 0.302 RC
N
f-27201882
f
GR
GS
[1 0 0 1 332.2785 85.875] CT
1 0.302 0.302 RC
N
f-27201882
f
GR
GS
[1 0 0 1 335.97455 43.21875] CT
1 0.302 0.302 RC
N
f-27201882
f
GR
GS
[1 0 0 1 317.02985 43.21875] CT
1 0.302 0.302 RC
N
f-27201882
f
GR
GS
[1 0 0 1 323.90216 71.65625] CT
1 0.302 0.302 RC
N
f-27201882
f
GR
GS
[1 0 0 1 346.71631 71.65625] CT
1 0.302 0.302 RC
N
f-27201882
f
GR
GS
[1 0 0 1 343.46033 85.875] CT
1 0.302 0.302 RC
N
f-27201882
f
GR
GS
[1 0 0 1 313.85562 29] CT
1 0.302 0.302 RC
N
f-27201882
f
GR
GS
[1 0 0 1 342.6857 43.21875] CT
1 0.302 0.302 RC
N
f-27201882
f
GR
GS
[1 0 0 1 321.47827 71.65625] CT
1 0.302 0.302 RC
N
f-27201882
f
GR
GS
[1 0 0 1 327.94754 43.21875] CT
1 0.302 0.302 RC
N
f-27201882
f
GR
GS
[1 0 0 1 317.71841 29] CT
1 0.302 0.302 RC
N
f-27201882
f
GR
GS
[1 0 0 1 320.47006 57.4375] CT
1 0.302 0.302 RC
N
f-27201882
f
GR
GS
[1 0 0 1 339.64819 57.4375] CT
1 0.302 0.302 RC
N
f-27201882
f
GR
GS
[1 0 0 1 316.06549 57.4375] CT
1 0.302 0.302 RC
N
f-27201882
f
GR
GS
[1 0 0 1 326.80795 71.65625] CT
1 0.302 0.302 RC
N
f-27201882
f
GR
GS
[1 0 0 1 333.3158 29] CT
1 0.302 0.302 RC
N
f-27201882
f
GR
GS
[1 0 0 1 319.81577 29] CT
1 0.302 0.302 RC
N
f-27201882
f
GR
GS
[1 0 0 1 336.97568 71.65625] CT
1 0.302 0.302 RC
N
f-27201882
f
GR
GS
[1 0 0 1 333.41385 57.4375] CT
1 0.302 0.302 RC
N
f-27201882
f
GR
GS
[1 0 0 1 328.9967 57.4375] CT
1 0.302 0.302 RC
N
f-27201882
f
GR
GS
[1 0 0 1 321.34662 100.09375] CT
1 0.302 0.302 RC
N
f-27201882
f
GR
GS
[1 0 0 1 327.23303 57.4375] CT
1 0.302 0.302 RC
N
f-27201882
f
GR
GS
[1 0 0 1 339.50296 43.21875] CT
1 0.302 0.302 RC
N
f-27201882
f
GR
GS
[1 0 0 1 314.28711 57.4375] CT
1 0.302 0.302 RC
N
f-27201882
f
GR
GS
[1 0 0 1 333.91397 43.21875] CT
1 0.302 0.302 RC
N
f-27201882
f
GR
GS
[1 0 0 1 315.80093 57.4375] CT
1 0.302 0.302 RC
N
f-27201882
f
GR
GS
[1 0 0 1 327.32242 29] CT
1 0.302 0.302 RC
N
f-27201882
f
GR
GS
[1 0 0 1 346.87686 71.65625] CT
1 0.302 0.302 RC
N
f-27201882
f
GR
GS
[1 0 0 1 341.97784 43.21875] CT
1 0.302 0.302 RC
N
f-27201882
f
GR
GS
[1 0 0 1 314.87241 43.21875] CT
1 0.302 0.302 RC
N
f-27201882
f
GR
GS
[1 0 0 1 338.02887 43.21875] CT
1 0.302 0.302 RC
N
f-27201882
f
GR
GS
[1 0 0 1 317.01807 43.21875] CT
1 0.302 0.302 RC
N
f-27201882
f
GR
GS
[1 0 0 1 329.72357 29] CT
1 0.302 0.302 RC
N
f-27201882
f
GR
GS
[1 0 0 1 428.6178 85.875] CT
1 0.302 0.302 RC
N
f-27201882
f
GR
GS
[1 0 0 1 399.39795 100.09375] CT
1 0.302 0.302 RC
N
f-27201882
f
GR
GS
[1 0 0 1 426.91357 57.4375] CT
1 0.302 0.302 RC
N
f-27201882
f
GR
GS
[1 0 0 1 425.71185 43.21875] CT
1 0.302 0.302 RC
N
f-27201882
f
GR
GS
[1 0 0 1 405.46918 71.65625] CT
1 0.302 0.302 RC
N
f-27201882
f
GR
GS
[1 0 0 1 430.13556 71.65625] CT
1 0.302 0.302 RC
N
f-27201882
f
GR
GS
[1 0 0 1 422.27557 57.4375] CT
1 0.302 0.302 RC
N
f-27201882
f
GR
GS
[1 0 0 1 429.29688 57.4375] CT
1 0.302 0.302 RC
N
f-27201882
f
GR
GS
[1 0 0 1 423.27643 29] CT
1 0.302 0.302 RC
N
f-27201882
f
GR
GS
[1 0 0 1 415.45679 71.65625] CT
1 0.302 0.302 RC
N
f-27201882
f
GR
GS
[1 0 0 1 427.40436 57.4375] CT
1 0.302 0.302 RC
N
f-27201882
f
GR
GS
[1 0 0 1 401.93762 71.65625] CT
1 0.302 0.302 RC
N
f-27201882
f
GR
GS
[1 0 0 1 399.69937 71.65625] CT
1 0.302 0.302 RC
N
f-27201882
f
GR
GS
[1 0 0 1 410.34045 100.09375] CT
1 0.302 0.302 RC
N
f-27201882
f
GR
GS
[1 0 0 1 415.52646 85.875] CT
1 0.302 0.302 RC
N
f-27201882
f
GR
GS
[1 0 0 1 406.55493 43.21875] CT
1 0.302 0.302 RC
N
f-27201882
f
GR
GS
[1 0 0 1 417.8515 100.09375] CT
1 0.302 0.302 RC
N
f-27201882
f
GR
GS
[1 0 0 1 422.18839 85.875] CT
1 0.302 0.302 RC
N
f-27201882
f
GR
GS
[1 0 0 1 427.46356 85.875] CT
1 0.302 0.302 RC
N
f-27201882
f
GR
GS
[1 0 0 1 429.55344 128.53125] CT
1 0.302 0.302 RC
N
f-27201882
f
GR
GS
[1 0 0 1 413.83463 100.09375] CT
1 0.302 0.302 RC
N
f-27201882
f
GR
GS
[1 0 0 1 412.53317 29] CT
1 0.302 0.302 RC
N
f-27201882
f
GR
GS
[1 0 0 1 413.92111 71.65625] CT
1 0.302 0.302 RC
N
f-27201882
f
GR
GS
[1 0 0 1 409.44519 71.65625] CT
1 0.302 0.302 RC
N
f-27201882
f
GR
GS
[1 0 0 1 414.15552 85.875] CT
1 0.302 0.302 RC
N
f-27201882
f
GR
GS
[1 0 0 1 431.90359 71.65625] CT
1 0.302 0.302 RC
N
f-27201882
f
GR
GS
[1 0 0 1 414.68353 114.3125] CT
1 0.302 0.302 RC
N
f-27201882
f
GR
GS
[1 0 0 1 415.83752 114.3125] CT
1 0.302 0.302 RC
N
f-27201882
f
GR
GS
[1 0 0 1 399.56381 85.875] CT
1 0.302 0.302 RC
N
f-27201882
f
GR
GS
[1 0 0 1 405.42038 71.65625] CT
1 0.302 0.302 RC
N
f-27201882
f
GR
GS
[1 0 0 1 429.63101 114.3125] CT
1 0.302 0.302 RC
N
f-27201882
f
GR
GS
[1 0 0 1 412.1777 100.09375] CT
1 0.302 0.302 RC
N
f-27201882
f
GR
GS
[1 0 0 1 402.32516 57.4375] CT
1 0.302 0.302 RC
N
f-27201882
f
GR
GS
[1 0 0 1 410.81964 43.21875] CT
1 0.302 0.302 RC
N
f-27201882
f
GR
GS
[1 0 0 1 404.94913 57.4375] CT
1 0.302 0.302 RC
N
f-27201882
f
GR
GS
[1 0 0 1 407.36884 43.21875] CT
1 0.302 0.302 RC
N
f-27201882
f
GR
GS
[1 0 0 1 420.81076 57.4375] CT
1 0.302 0.302 RC
N
f-27201882
f
GR
GS
[1 0 0 1 432.29337 71.65625] CT
1 0.302 0.302 RC
N
f-27201882
f
GR
GS
[1 0 0 1 430.40378 43.21875] CT
1 0.302 0.302 RC
N
f-27201882
f
GR
GS
[1 0 0 1 400.67056 119.99999] CT
1 0.302 0.302 RC
N
f-27201882
f
GR
GS
[1 0 0 1 429.80081 57.4375] CT
1 0.302 0.302 RC
N
f-27201882
f
GR
GS
[1 0 0 1 405.34198 29] CT
1 0.302 0.302 RC
N
f-27201882
f
GR
GS
[1 0 0 1 432.8717 100.09375] CT
1 0.302 0.302 RC
N
f-27201882
f
GR
GS
[1 0 0 1 410.02393 100.09375] CT
1 0.302 0.302 RC
N
f-27201882
f
GR
GS
[1 0 0 1 406.62973 71.65625] CT
1 0.302 0.302 RC
N
f-27201882
f
GR
GS
[1 0 0 1 431.19427 85.875] CT
1 0.302 0.302 RC
N
f-27201882
f
GR
GS
[1 0 0 1 426.63705 100.09375] CT
1 0.302 0.302 RC
N
f-27201882
f
GR
GS
[1 0 0 1 207.58344 43.21875] CT
0.302 GC
N
f-27201882
f
GR
GS
[1 0 0 1 200.51962 100.09375] CT
0.302 GC
N
f-27201882
f
GR
GS
[1 0 0 1 206.03349 57.4375] CT
0.302 GC
N
f-27201882
f
GR
GS
[1 0 0 1 205.54662 29] CT
0.302 GC
N
f-27201882
f
GR
GS
[1 0 0 1 188.13469 71.65625] CT
0.302 GC
N
f-27201882
f
GR
GS
[1 0 0 1 180.54929 85.875] CT
0.302 GC
N
f-27201882
f
GR
GS
[1 0 0 1 203.51326 57.4375] CT
0.302 GC
N
f-27201882
f
GR
GS
[1 0 0 1 199.23758 29] CT
0.302 GC
N
f-27201882
f
GR
GS
[1 0 0 1 190.67159 43.21875] CT
0.302 GC
N
f-27201882
f
GR
GS
[1 0 0 1 208.36105 57.4375] CT
0.302 GC
N
f-27201882
f
GR
GS
[1 0 0 1 208.50023 100.09375] CT
0.302 GC
N
f-27201882
f
GR
GS
[1 0 0 1 176.97537 43.21875] CT
0.302 GC
N
f-27201882
f
GR
GS
[1 0 0 1 185.34752 71.65625] CT
0.302 GC
N
f-27201882
f
GR
GS
[1 0 0 1 178.19893 71.65625] CT
0.302 GC
N
f-27201882
f
GR
GS
[1 0 0 1 204.23935 57.4375] CT
0.302 GC
N
f-27201882
f
GR
GS
[1 0 0 1 189.4689 85.875] CT
0.302 GC
N
f-27201882
f
GR
GS
[1 0 0 1 195.80936 43.21875] CT
0.302 GC
N
f-27201882
f
GR
GS
[1 0 0 1 187.6582 57.4375] CT
0.302 GC
N
f-27201882
f
GR
GS
[1 0 0 1 209.1875 71.65625] CT
0.302 GC
N
f-27201882
f
GR
GS
[1 0 0 1 196.57182 134] CT
0.302 GC
N
f-27201882
f
GR
GS
[1 0 0 1 198.77509 85.875] CT
0.302 GC
N
f-27201882
f
GR
GS
[1 0 0 1 205.48706 57.4375] CT
0.302 GC
N
f-27201882
f
GR
GS
[1 0 0 1 190.28398 43.21875] CT
0.302 GC
N
f-27201882
f
GR
GS
[1 0 0 1 178.39299 71.65625] CT
0.302 GC
N
f-27201882
f
GR
GS
[1 0 0 1 205.76392 142.75] CT
0.302 GC
N
f-27201882
f
GR
GS
[1 0 0 1 199.70164 57.4375] CT
0.302 GC
N
f-27201882
f
GR
GS
[1 0 0 1 204.73587 57.4375] CT
0.302 GC
N
f-27201882
f
GR
GS
[1 0 0 1 199.07022 57.4375] CT
0.302 GC
N
f-27201882
f
GR
GS
[1 0 0 1 199.93309 104.83333] CT
0.302 GC
N
f-27201882
f
GR
GS
[1 0 0 1 206.58781 57.4375] CT
0.302 GC
N
f-27201882
f
GR
GS
[1 0 0 1 196.0233 128.53125] CT
0.302 GC
N
f-27201882
f
GR
GS
[1 0 0 1 187.02921 71.65625] CT
0.302 GC
N
f-27201882
f
GR
GS
[1 0 0 1 209.99838 57.4375] CT
0.302 GC
N
f-27201882
f
GR
GS
[1 0 0 1 182.99356 43.21875] CT
0.302 GC
N
f-27201882
f
GR
GS
[1 0 0 1 185.69347 100.09375] CT
0.302 GC
N
f-27201882
f
GR
GS
[1 0 0 1 204.45062 57.4375] CT
0.302 GC
N
f-27201882
f
GR
GS
[1 0 0 1 202.29449 43.21875] CT
0.302 GC
N
f-27201882
f
GR
GS
[1 0 0 1 182.75487 85.875] CT
0.302 GC
N
f-27201882
f
GR
GS
[1 0 0 1 202.10649 29] CT
0.302 GC
N
f-27201882
f
GR
GS
[1 0 0 1 197.00117 100.09375] CT
0.302 GC
N
f-27201882
f
GR
GS
[1 0 0 1 208.94937 57.4375] CT
0.302 GC
N
f-27201882
f
GR
GS
[1 0 0 1 193.15161 85.875] CT
0.302 GC
N
f-27201882
f
GR
GS
[1 0 0 1 192.29448 57.4375] CT
0.302 GC
N
f-27201882
f
GR
GS
[1 0 0 1 195.9644 57.4375] CT
0.302 GC
N
f-27201882
f
GR
GS
[1 0 0 1 209.47499 71.65625] CT
0.302 GC
N
f-27201882
f
GR
GS
[1 0 0 1 187.84909 71.65625] CT
0.302 GC
N
f-27201882
f
GR
GS
[1 0 0 1 184.82739 43.21875] CT
0.302 GC
N
f-27201882
f
GR
GS
[1 0 0 1 281.86002 43.21875] CT
0.302 GC
N
f-27201882
f
GR
GS
[1 0 0 1 287.19168 85.875] CT
0.302 GC
N
f-27201882
f
GR
GS
[1 0 0 1 264.43704 29] CT
0.302 GC
N
f-27201882
f
GR
GS
[1 0 0 1 274.48599 135.16666] CT
0.302 GC
N
f-27201882
f
GR
GS
[1 0 0 1 264.60941 114.3125] CT
0.302 GC
N
f-27201882
f
GR
GS
[1 0 0 1 272.5376 57.4375] CT
0.302 GC
N
f-27201882
f
GR
GS
[1 0 0 1 277.17081 29] CT
0.302 GC
N
f-27201882
f
GR
GS
[1 0 0 1 267.15009 100.09375] CT
0.302 GC
N
f-27201882
f
GR
GS
[1 0 0 1 263.67847 29] CT
0.302 GC
N
f-27201882
f
GR
GS
[1 0 0 1 276.88388 71.65625] CT
0.302 GC
N
f-27201882
f
GR
GS
[1 0 0 1 271.40988 29] CT
0.302 GC
N
f-27201882
f
GR
GS
[1 0 0 1 268.45682 29] CT
0.302 GC
N
f-27201882
f
GR
GS
[1 0 0 1 279.11154 29] CT
0.302 GC
N
f-27201882
f
GR
GS
[1 0 0 1 262.29309 43.21875] CT
0.302 GC
N
f-27201882
f
GR
GS
[1 0 0 1 290.0975 71.65625] CT
0.302 GC
N
f-27201882
f
GR
GS
[1 0 0 1 268.49823 29] CT
0.302 GC
N
f-27201882
f
GR
GS
[1 0 0 1 276.2561 29] CT
0.302 GC
N
f-27201882
f
GR
GS
[1 0 0 1 286.76993 29] CT
0.302 GC
N
f-27201882
f
GR
GS
[1 0 0 1 279.69412 171.1875] CT
0.302 GC
N
f-27201882
f
GR
GS
[1 0 0 1 270.86194 71.65625] CT
0.302 GC
N
f-27201882
f
GR
GS
[1 0 0 1 287.96176 43.21875] CT
0.302 GC
N
f-27201882
f
GR
GS
[1 0 0 1 294.36133 43.21875] CT
0.302 GC
N
f-27201882
f
GR
GS
[1 0 0 1 265.66168 29] CT
0.302 GC
N
f-27201882
f
GR
GS
[1 0 0 1 262.47867 171.1875] CT
0.302 GC
N
f-27201882
f
GR
GS
[1 0 0 1 276.10098 114.3125] CT
0.302 GC
N
f-27201882
f
GR
GS
[1 0 0 1 263.83337 128.53125] CT
0.302 GC
N
f-27201882
f
GR
GS
[1 0 0 1 265.93317 43.21875] CT
0.302 GC
N
f-27201882
f
GR
GS
[1 0 0 1 264.79492 29] CT
0.302 GC
N
f-27201882
f
GR
GS
[1 0 0 1 269.60623 85.875] CT
0.302 GC
N
f-27201882
f
GR
GS
[1 0 0 1 268.86893 29] CT
0.302 GC
N
f-27201882
f
GR
GS
[1 0 0 1 282.5415 128.53125] CT
0.302 GC
N
f-27201882
f
GR
GS
[1 0 0 1 275.15729 29] CT
0.302 GC
N
f-27201882
f
GR
GS
[1 0 0 1 286.55075 29] CT
0.302 GC
N
f-27201882
f
GR
GS
[1 0 0 1 294.59753 29] CT
0.302 GC
N
f-27201882
f
GR
GS
[1 0 0 1 287.35745 85.875] CT
0.302 GC
N
f-27201882
f
GR
GS
[1 0 0 1 264.32578 29] CT
0.302 GC
N
f-27201882
f
GR
GS
[1 0 0 1 291.39581 57.4375] CT
0.302 GC
N
f-27201882
f
GR
GS
[1 0 0 1 274.06805 43.21875] CT
0.302 GC
N
f-27201882
f
GR
GS
[1 0 0 1 288.96234 29] CT
0.302 GC
N
f-27201882
f
GR
GS
[1 0 0 1 288.59808 29] CT
0.302 GC
N
f-27201882
f
GR
GS
[1 0 0 1 272.99048 29] CT
0.302 GC
N
f-27201882
f
GR
GS
[1 0 0 1 294.20972 128.53125] CT
0.302 GC
N
f-27201882
f
GR
GS
[1 0 0 1 290.04221 85.875] CT
0.302 GC
N
f-27201882
f
GR
GS
[1 0 0 1 283.20416 128.53125] CT
0.302 GC
N
f-27201882
f
GR
GS
[1 0 0 1 271.76489 29] CT
0.302 GC
N
f-27201882
f
GR
GS
[1 0 0 1 282.78827 114.3125] CT
0.302 GC
N
f-27201882
f
GR
GS
[1 0 0 1 295.53067 29] CT
0.302 GC
N
f-27201882
f
GR
GS
[1 0 0 1 359.1745 119.99999] CT
0.302 GC
N
f-27201882
f
GR
GS
[1 0 0 1 355.59482 57.4375] CT
0.302 GC
N
f-27201882
f
GR
GS
[1 0 0 1 347.38861 57.4375] CT
0.302 GC
N
f-27201882
f
GR
GS
[1 0 0 1 378.56363 43.21875] CT
0.302 GC
N
f-27201882
f
GR
GS
[1 0 0 1 368.89963 43.21875] CT
0.302 GC
N
f-27201882
f
GR
GS
[1 0 0 1 374.34268 57.4375] CT
0.302 GC
N
f-27201882
f
GR
GS
[1 0 0 1 373.05597 57.4375] CT
0.302 GC
N
f-27201882
f
GR
GS
[1 0 0 1 368.53458 71.65625] CT
0.302 GC
N
f-27201882
f
GR
GS
[1 0 0 1 353.66568 57.4375] CT
0.302 GC
N
f-27201882
f
GR
GS
[1 0 0 1 376.31024 114.3125] CT
0.302 GC
N
f-27201882
f
GR
GS
[1 0 0 1 371.93356 114.3125] CT
0.302 GC
N
f-27201882
f
GR
GS
[1 0 0 1 369.73178 71.65625] CT
0.302 GC
N
f-27201882
f
GR
GS
[1 0 0 1 368.39429 43.21875] CT
0.302 GC
N
f-27201882
f
GR
GS
[1 0 0 1 377.34586 85.875] CT
0.302 GC
N
f-27201882
f
GR
GS
[1 0 0 1 374.56384 71.65625] CT
0.302 GC
N
f-27201882
f
GR
GS
[1 0 0 1 372.22278 71.65625] CT
0.302 GC
N
f-27201882
f
GR
GS
[1 0 0 1 361.409 43.21875] CT
0.302 GC
N
f-27201882
f
GR
GS
[1 0 0 1 381.59451 71.65625] CT
0.302 GC
N
f-27201882
f
GR
GS
[1 0 0 1 368.77164 85.875] CT
0.302 GC
N
f-27201882
f
GR
GS
[1 0 0 1 359.48856 171.1875] CT
0.302 GC
N
f-27201882
f
GR
GS
[1 0 0 1 353.64243 57.4375] CT
0.302 GC
N
f-27201882
f
GR
GS
[1 0 0 1 358.38202 43.21875] CT
0.302 GC
N
f-27201882
f
GR
GS
[1 0 0 1 356.1423 100.09375] CT
0.302 GC
N
f-27201882
f
GR
GS
[1 0 0 1 379.65421 114.3125] CT
0.302 GC
N
f-27201882
f
GR
GS
[1 0 0 1 378.00171 114.3125] CT
0.302 GC
N
f-27201882
f
GR
GS
[1 0 0 1 381.26517 114.3125] CT
0.302 GC
N
f-27201882
f
GR
GS
[1 0 0 1 380.0448 85.875] CT
0.302 GC
N
f-27201882
f
GR
GS
[1 0 0 1 377.36029 77.75001] CT
0.302 GC
N
f-27201882
f
GR
GS
[1 0 0 1 352.93994 142.75] CT
0.302 GC
N
f-27201882
f
GR
GS
[1 0 0 1 352.4064 43.21875] CT
0.302 GC
N
f-27201882
f
GR
GS
[1 0 0 1 369.66324 100.09375] CT
0.302 GC
N
f-27201882
f
GR
GS
[1 0 0 1 374.47495 85.875] CT
0.302 GC
N
f-27201882
f
GR
GS
[1 0 0 1 349.85495 71.65625] CT
0.302 GC
N
f-27201882
f
GR
GS
[1 0 0 1 355.76202 57.4375] CT
0.302 GC
N
f-27201882
f
GR
GS
[1 0 0 1 347.74225 85.875] CT
0.302 GC
N
f-27201882
f
GR
GS
[1 0 0 1 355.35117 57.4375] CT
0.302 GC
N
f-27201882
f
GR
GS
[1 0 0 1 356.11655 29] CT
0.302 GC
N
f-27201882
f
GR
GS
[1 0 0 1 378.66302 71.65625] CT
0.302 GC
N
f-27201882
f
GR
GS
[1 0 0 1 359.98184 57.4375] CT
0.302 GC
N
f-27201882
f
GR
GS
[1 0 0 1 348.67957 128.53125] CT
0.302 GC
N
f-27201882
f
GR
GS
[1 0 0 1 369.69855 71.65625] CT
0.302 GC
N
f-27201882
f
GR
GS
[1 0 0 1 375.37637 57.4375] CT
0.302 GC
N
f-27201882
f
GR
GS
[1 0 0 1 350.24765 85.875] CT
0.302 GC
N
f-27201882
f
GR
GS
[1 0 0 1 347.7688 57.4375] CT
0.302 GC
N
f-27201882
f
GR
GS
[1 0 0 1 359.91562 71.65625] CT
0.302 GC
N
f-27201882
f
GR
GS
[1 0 0 1 361.53284 71.65625] CT
0.302 GC
N
f-27201882
f
GR
GS
[1 0 0 1 361.6445 128.53125] CT
0.302 GC
N
f-27201882
f
GR
GS
[1 0 0 1 449.0188 100.09375] CT
0.302 GC
N
f-27201882
f
GR
GS
[1 0 0 1 449.10904 100.09375] CT
0.302 GC
N
f-27201882
f
GR
GS
[1 0 0 1 451.92685 57.4375] CT
0.302 GC
N
f-27201882
f
GR
GS
[1 0 0 1 451.39633 71.65625] CT
0.302 GC
N
f-27201882
f
GR
GS
[1 0 0 1 450.53885 85.875] CT
0.302 GC
N
f-27201882
f
GR
GS
[1 0 0 1 459.91644 114.3125] CT
0.302 GC
N
f-27201882
f
GR
GS
[1 0 0 1 443.0708 100.09375] CT
0.302 GC
N
f-27201882
f
GR
GS
[1 0 0 1 452.0072 128.53125] CT
0.302 GC
N
f-27201882
f
GR
GS
[1 0 0 1 452.836 89.66666] CT
0.302 GC
N
f-27201882
f
GR
GS
[1 0 0 1 440.1185 85.875] CT
0.302 GC
N
f-27201882
f
GR
GS
[1 0 0 1 452.16965 100.09375] CT
0.302 GC
N
f-27201882
f
GR
GS
[1 0 0 1 440.46921 57.4375] CT
0.302 GC
N
f-27201882
f
GR
GS
[1 0 0 1 451.96106 85.875] CT
0.302 GC
N
f-27201882
f
GR
GS
[1 0 0 1 435.5181 142.75] CT
0.302 GC
N
f-27201882
f
GR
GS
[1 0 0 1 462.63837 156.96875] CT
0.302 GC
N
f-27201882
f
GR
GS
[1 0 0 1 440.27252 85.875] CT
0.302 GC
N
f-27201882
f
GR
GS
[1 0 0 1 441.31009 114.3125] CT
0.302 GC
N
f-27201882
f
GR
GS
[1 0 0 1 446.17908 114.3125] CT
0.302 GC
N
f-27201882
f
GR
GS
[1 0 0 1 442.98166 100.09375] CT
0.302 GC
N
f-27201882
f
GR
GS
[1 0 0 1 458.86792 171.1875] CT
0.302 GC
N
f-27201882
f
GR
GS
[1 0 0 1 444.06458 114.3125] CT
0.302 GC
N
f-27201882
f
GR
GS
[1 0 0 1 436.80777 57.4375] CT
0.302 GC
N
f-27201882
f
GR
GS
[1 0 0 1 460.77548 114.3125] CT
0.302 GC
N
f-27201882
f
GR
GS
[1 0 0 1 441.7706 85.875] CT
0.302 GC
N
f-27201882
f
GR
GS
[1 0 0 1 450.40894 71.65625] CT
0.302 GC
N
f-27201882
f
GR
GS
[1 0 0 1 434.49188 100.09375] CT
0.302 GC
N
f-27201882
f
GR
GS
[1 0 0 1 454.53485 104.83333] CT
0.302 GC
N
f-27201882
f
GR
GS
[1 0 0 1 446.41428 104.83333] CT
0.302 GC
N
f-27201882
f
GR
GS
[1 0 0 1 443.69879 142.75] CT
0.302 GC
N
f-27201882
f
GR
GS
[1 0 0 1 444.51431 85.875] CT
0.302 GC
N
f-27201882
f
GR
GS
[1 0 0 1 465.07864 156.96875] CT
0.302 GC
N
f-27201882
f
GR
GS
[1 0 0 1 449.17703 180.66667] CT
0.302 GC
N
f-27201882
f
GR
GS
[1 0 0 1 433.12744 85.875] CT
0.302 GC
N
f-27201882
f
GR
GS
[1 0 0 1 458.01929 114.3125] CT
0.302 GC
N
f-27201882
f
GR
GS
[1 0 0 1 446.82727 156.96875] CT
0.302 GC
N
f-27201882
f
GR
GS
[1 0 0 1 433.91129 74.5] CT
0.302 GC
N
f-27201882
f
GR
GS
[1 0 0 1 454.99957 100.09375] CT
0.302 GC
N
f-27201882
f
GR
GS
[1 0 0 1 448.19476 114.3125] CT
0.302 GC
N
f-27201882
f
GR
GS
[1 0 0 1 453.4227 74.5] CT
0.302 GC
N
f-27201882
f
GR
GS
[1 0 0 1 454.32187 128.53125] CT
0.302 GC
N
f-27201882
f
GR
GS
[1 0 0 1 448.70053 100.09375] CT
0.302 GC
N
f-27201882
f
GR
GS
[1 0 0 1 434.80862 100.09375] CT
0.302 GC
N
f-27201882
f
GR
GS
[1 0 0 1 457.81049 142.75] CT
0.302 GC
N
f-27201882
f
GR
GS
[1 0 0 1 458.51019 114.3125] CT
0.302 GC
N
f-27201882
f
GR
GS
[1 0 0 1 447.00961 114.3125] CT
0.302 GC
N
f-27201882
f
GR
GS
[1 0 0 1 434.88846 114.3125] CT
0.302 GC
N
f-27201882
f
GR
GS
[1 0 0 1 465.64157 100.09375] CT
0.302 GC
N
f-27201882
f
GR
GS
1 LJ
4 LW
N
158.725 40.928 M
158.725 47.365 L
S
GR
GS
1 LJ
4 LW
N
158.725 40.928 M
158.725 40.928 L
S
GR
GS
1 LJ
4 LW
N
158.725 47.365 M
158.725 47.365 L
S
GR
GS
1 LJ
4 LW
N
244.475 50.671 M
244.475 62.993 L
S
GR
GS
1 LJ
4 LW
N
244.475 50.671 M
244.475 50.671 L
S
GR
GS
1 LJ
4 LW
N
244.475 62.993 M
244.475 62.993 L
S
GR
GS
1 LJ
4 LW
N
330.225 49.478 M
330.225 55.111 L
S
GR
GS
1 LJ
4 LW
N
330.225 49.478 M
330.225 49.478 L
S
GR
GS
1 LJ
4 LW
N
330.225 55.111 M
330.225 55.111 L
S
GR
GS
1 LJ
4 LW
N
415.975 71.722 M
415.975 79.094 L
S
GR
GS
1 LJ
4 LW
N
415.975 71.722 M
415.975 71.722 L
S
GR
GS
1 LJ
4 LW
N
415.975 79.094 M
415.975 79.094 L
S
GR
GS
1 LJ
4 LW
N
193.025 64.4 M
193.025 72.086 L
S
GR
GS
1 LJ
4 LW
N
193.025 64.4 M
193.025 64.4 L
S
GR
GS
1 LJ
4 LW
N
193.025 72.086 M
193.025 72.086 L
S
GR
GS
1 LJ
4 LW
N
278.775 57.091 M
278.775 69.562 L
S
GR
GS
1 LJ
4 LW
N
278.775 57.091 M
278.775 57.091 L
S
GR
GS
1 LJ
4 LW
N
278.775 69.562 M
278.775 69.562 L
S
GR
GS
1 LJ
4 LW
N
364.525 74.135 M
364.525 82.99 L
S
GR
GS
1 LJ
4 LW
N
364.525 74.135 M
364.525 74.135 L
S
GR
GS
1 LJ
4 LW
N
364.525 82.99 M
364.525 82.99 L
S
GR
GS
1 LJ
4 LW
N
450.275 102.545 M
450.275 110.954 L
S
GR
GS
1 LJ
4 LW
N
450.275 102.545 M
450.275 102.545 L
S
GR
GS
1 LJ
4 LW
N
450.275 110.954 M
450.275 110.954 L
S
GR
GS
[1 0 0 1 158.72501 233.75] CT
/Helvetica-Bold 20 F
GS
[1 0 0 1 0 0] CT
-12.5 7.5 moveto 
1 -1 scale
(***) t 
GR
GR
GS
[1 0 0 1 193.02501 233.75] CT
/Helvetica-Bold 20 F
GS
[1 0 0 1 0 0] CT
-12.5 7.5 moveto 
1 -1 scale
(***) t 
GR
GR
GS
[1 0 0 1 244.47499 233.75] CT
/Helvetica-Bold 20 F
GS
[1 0 0 1 0 0] CT
-12.5 7.5 moveto 
1 -1 scale
(***) t 
GR
GR
GS
[1 0 0 1 278.77499 233.75] CT
/Helvetica-Bold 20 F
GS
[1 0 0 1 0 0] CT
-12.5 7.5 moveto 
1 -1 scale
(***) t 
GR
GR
GS
[1 0 0 1 330.22501 233.75] CT
/Helvetica-Bold 20 F
GS
[1 0 0 1 0 0] CT
-12.5 7.5 moveto 
1 -1 scale
(***) t 
GR
GR
GS
[1 0 0 1 364.52499 233.75] CT
/Helvetica-Bold 20 F
GS
[1 0 0 1 0 0] CT
-12.5 7.5 moveto 
1 -1 scale
(***) t 
GR
GR
GS
[1 0 0 1 415.97501 233.75] CT
/Helvetica-Bold 20 F
GS
[1 0 0 1 0 0] CT
-12.5 7.5 moveto 
1 -1 scale
(***) t 
GR
GR
GS
[1 0 0 1 450.27499 233.75] CT
/Helvetica-Bold 20 F
GS
[1 0 0 1 0 0] CT
-12.5 7.5 moveto 
1 -1 scale
(***) t 
GR
GR
GS
1 GC
N
/f1766222540{584 256.5 M
926.5 256.5 L
926.5 29 L
584 29 L
cp}def
f1766222540
f
GR
GS
0.149 GC
2 setlinecap
1 LJ
0.5 LW
N
584 256.5 M
926.5 256.5 L
S
GR
GS
0.149 GC
2 setlinecap
1 LJ
0.5 LW
N
626.813 256.5 M
626.813 253.075 L
S
GR
GS
0.149 GC
2 setlinecap
1 LJ
0.5 LW
N
712.438 256.5 M
712.438 253.075 L
S
GR
GS
0.149 GC
2 setlinecap
1 LJ
0.5 LW
N
798.063 256.5 M
798.063 253.075 L
S
GR
GS
0.149 GC
2 setlinecap
1 LJ
0.5 LW
N
883.688 256.5 M
883.688 253.075 L
S
GR
GS
[1 0 0 1 626.8125 262.5] CT
0.149 GC
/Helvetica 20 F
GS
[1 0 0 1 0 0] CT
-24.5 20 moveto 
1 -1 scale
(Color) t 
GR
GR
GS
[1 0 0 1 712.4375 262.5] CT
0.149 GC
/Helvetica 20 F
GS
[1 0 0 1 0 0] CT
-40 20 moveto 
1 -1 scale
(Direction) t 
GR
GR
GS
[1 0 0 1 798.0625 262.5] CT
0.149 GC
/Helvetica 20 F
GS
[1 0 0 1 0 0] CT
-19 20 moveto 
1 -1 scale
(Size) t 
GR
GR
GS
[1 0 0 1 883.6875 262.5] CT
0.149 GC
/Helvetica 20 F
GS
[1 0 0 1 0 0] CT
-49.5 20 moveto 
1 -1 scale
(Luminance) t 
GR
GR
GS
0.149 GC
2 setlinecap
1 LJ
0.5 LW
N
584 256.5 M
584 29 L
S
GR
GS
0.149 GC
2 setlinecap
1 LJ
0.5 LW
N
584 256.5 M
587.425 256.5 L
S
GR
GS
0.149 GC
2 setlinecap
1 LJ
0.5 LW
N
584 211 M
587.425 211 L
S
GR
GS
0.149 GC
2 setlinecap
1 LJ
0.5 LW
N
584 165.5 M
587.425 165.5 L
S
GR
GS
0.149 GC
2 setlinecap
1 LJ
0.5 LW
N
584 120 M
587.425 120 L
S
GR
GS
0.149 GC
2 setlinecap
1 LJ
0.5 LW
N
584 74.5 M
587.425 74.5 L
S
GR
GS
0.149 GC
2 setlinecap
1 LJ
0.5 LW
N
584 29 M
587.425 29 L
S
GR
GS
[1 0 0 1 578 256.5] CT
0.149 GC
/Helvetica 20 F
GS
[1 0 0 1 0 0] CT
-12 7.5 moveto 
1 -1 scale
(0) t 
GR
GR
GS
[1 0 0 1 578 211] CT
0.149 GC
/Helvetica 20 F
GS
[1 0 0 1 0 0] CT
-28 7.5 moveto 
1 -1 scale
(0.2) t 
GR
GR
GS
[1 0 0 1 578 165.5] CT
0.149 GC
/Helvetica 20 F
GS
[1 0 0 1 0 0] CT
-28 7.5 moveto 
1 -1 scale
(0.4) t 
GR
GR
GS
[1 0 0 1 578 119.99999] CT
0.149 GC
/Helvetica 20 F
GS
[1 0 0 1 0 0] CT
-28 7.5 moveto 
1 -1 scale
(0.6) t 
GR
GR
GS
[1 0 0 1 578 74.5] CT
0.149 GC
/Helvetica 20 F
GS
[1 0 0 1 0 0] CT
-28 7.5 moveto 
1 -1 scale
(0.8) t 
GR
GR
GS
[1 0 0 1 578 29] CT
0.149 GC
/Helvetica 20 F
GS
[1 0 0 1 0 0] CT
-12 7.5 moveto 
1 -1 scale
(1) t 
GR
GR
GS
[0 -1 1 0 547 142.74989] CT
0.149 GC
/Helvetica 20 F
GS
[1 0 0 1 0 0] CT
-70 -5 moveto 
1 -1 scale
(Mean Accuracy) t 
GR
GR
GS
[1 0 0 1 755.25073 26.49999] CT
/Helvetica-Bold 20 F
GS
[1 0 0 1 0 0] CT
-58.5 -5 moveto 
1 -1 scale
(MRI session) t 
GR
GR
GS
0.149 GC
1 LJ
0.5 LW
N
584 256.5 M
926.5 256.5 L
S
GR
GS
1 0.8 0.8 RC
N
/f443849288{626.813 256.5 M
626.813 41.571 L
592.563 41.571 L
592.563 256.5 L
cp}def
f443849288
f
GR
GS
0.8 GC
N
/f-1282542604{661.063 256.5 M
661.063 56.016 L
626.813 56.016 L
626.813 256.5 L
cp}def
f-1282542604
f
GR
GS
1 0.8 0.8 RC
N
/f-1283804082{712.438 256.5 M
712.438 63.418 L
678.188 63.418 L
678.188 256.5 L
cp}def
f-1283804082
f
GR
GS
0.8 GC
N
/f-472115822{746.688 256.5 M
746.688 72.875 L
712.438 72.875 L
712.438 256.5 L
cp}def
f-472115822
f
GR
GS
1 0.8 0.8 RC
N
/f803424426{798.063 256.5 M
798.063 64.682 L
763.813 64.682 L
763.813 256.5 L
cp}def
f803424426
f
GR
GS
0.8 GC
N
/f-347192552{832.313 256.5 M
832.313 90.402 L
798.063 90.402 L
798.063 256.5 L
cp}def
f-347192552
f
GR
GS
1 0.8 0.8 RC
N
/f-1119835010{883.688 256.5 M
883.688 86.304 L
849.438 86.304 L
849.438 256.5 L
cp}def
f-1119835010
f
GR
GS
0.8 GC
N
/f-167215724{917.938 256.5 M
917.938 106.391 L
883.688 106.391 L
883.688 256.5 L
cp}def
f-167215724
f
GR
GS
[8 8] 0 setdash
2 LJ
2 LW
N
583.959 142.75 M
926.541 142.75 L
S
GR
GS
[1 0 0 1 622.61298 29] CT
1 0.302 0.302 RC
N
f-27201882
f
GR
GS
[1 0 0 1 620.90948 29] CT
1 0.302 0.302 RC
N
f-27201882
f
GR
GS
[1 0 0 1 607.92828 57.4375] CT
1 0.302 0.302 RC
N
f-27201882
f
GR
GS
[1 0 0 1 622.85577 29] CT
1 0.302 0.302 RC
N
f-27201882
f
GR
GS
[1 0 0 1 621.80237 43.21875] CT
1 0.302 0.302 RC
N
f-27201882
f
GR
GS
[1 0 0 1 614.7475 29] CT
1 0.302 0.302 RC
N
f-27201882
f
GR
GS
[1 0 0 1 609.9198 43.21875] CT
1 0.302 0.302 RC
N
f-27201882
f
GR
GS
[1 0 0 1 595.16626 43.21875] CT
1 0.302 0.302 RC
N
f-27201882
f
GR
GS
[1 0 0 1 604.97491 43.21875] CT
1 0.302 0.302 RC
N
f-27201882
f
GR
GS
[1 0 0 1 600.47736 71.65625] CT
1 0.302 0.302 RC
N
f-27201882
f
GR
GS
[1 0 0 1 622.02368 29] CT
1 0.302 0.302 RC
N
f-27201882
f
GR
GS
[1 0 0 1 614.29034 71.65625] CT
1 0.302 0.302 RC
N
f-27201882
f
GR
GS
[1 0 0 1 617.61493 29] CT
1 0.302 0.302 RC
N
f-27201882
f
GR
GS
[1 0 0 1 597.91766 43.21875] CT
1 0.302 0.302 RC
N
f-27201882
f
GR
GS
[1 0 0 1 625.08789 43.21875] CT
1 0.302 0.302 RC
N
f-27201882
f
GR
GS
[1 0 0 1 606.27698 114.3125] CT
1 0.302 0.302 RC
N
f-27201882
f
GR
GS
[1 0 0 1 613.5025 59.33333] CT
1 0.302 0.302 RC
N
f-27201882
f
GR
GS
[1 0 0 1 619.91077 43.21875] CT
1 0.302 0.302 RC
N
f-27201882
f
GR
GS
[1 0 0 1 616.07068 29] CT
1 0.302 0.302 RC
N
f-27201882
f
GR
GS
[1 0 0 1 592.56415 71.65625] CT
1 0.302 0.302 RC
N
f-27201882
f
GR
GS
[1 0 0 1 609.7785 29] CT
1 0.302 0.302 RC
N
f-27201882
f
GR
GS
[1 0 0 1 626.32001 29] CT
1 0.302 0.302 RC
N
f-27201882
f
GR
GS
[1 0 0 1 592.80237 43.21875] CT
1 0.302 0.302 RC
N
f-27201882
f
GR
GS
[1 0 0 1 593.96436 29] CT
1 0.302 0.302 RC
N
f-27201882
f
GR
GS
[1 0 0 1 596.10474 29] CT
1 0.302 0.302 RC
N
f-27201882
f
GR
GS
[1 0 0 1 613.22919 43.21875] CT
1 0.302 0.302 RC
N
f-27201882
f
GR
GS
[1 0 0 1 594.14453 71.65625] CT
1 0.302 0.302 RC
N
f-27201882
f
GR
GS
[1 0 0 1 607.0116 29] CT
1 0.302 0.302 RC
N
f-27201882
f
GR
GS
[1 0 0 1 604.75079 43.21875] CT
1 0.302 0.302 RC
N
f-27201882
f
GR
GS
[1 0 0 1 616.4577 29] CT
1 0.302 0.302 RC
N
f-27201882
f
GR
GS
[1 0 0 1 604.99451 43.21875] CT
1 0.302 0.302 RC
N
f-27201882
f
GR
GS
[1 0 0 1 603.67853 29] CT
1 0.302 0.302 RC
N
f-27201882
f
GR
GS
[1 0 0 1 615.76605 29] CT
1 0.302 0.302 RC
N
f-27201882
f
GR
GS
[1 0 0 1 612.53888 29] CT
1 0.302 0.302 RC
N
f-27201882
f
GR
GS
[1 0 0 1 600.7981 43.21875] CT
1 0.302 0.302 RC
N
f-27201882
f
GR
GS
[1 0 0 1 605.40167 29] CT
1 0.302 0.302 RC
N
f-27201882
f
GR
GS
[1 0 0 1 599.57465 29] CT
1 0.302 0.302 RC
N
f-27201882
f
GR
GS
[1 0 0 1 601.42102 29] CT
1 0.302 0.302 RC
N
f-27201882
f
GR
GS
[1 0 0 1 621.58301 29] CT
1 0.302 0.302 RC
N
f-27201882
f
GR
GS
[1 0 0 1 607.18866 57.4375] CT
1 0.302 0.302 RC
N
f-27201882
f
GR
GS
[1 0 0 1 615.06415 43.21875] CT
1 0.302 0.302 RC
N
f-27201882
f
GR
GS
[1 0 0 1 610.75854 29] CT
1 0.302 0.302 RC
N
f-27201882
f
GR
GS
[1 0 0 1 710.2804 29] CT
1 0.302 0.302 RC
N
f-27201882
f
GR
GS
[1 0 0 1 689.60724 128.53125] CT
1 0.302 0.302 RC
N
f-27201882
f
GR
GS
[1 0 0 1 690.54871 29] CT
1 0.302 0.302 RC
N
f-27201882
f
GR
GS
[1 0 0 1 703.75488 142.75] CT
1 0.302 0.302 RC
N
f-27201882
f
GR
GS
[1 0 0 1 707.7771 185.40625] CT
1 0.302 0.302 RC
N
f-27201882
f
GR
GS
[1 0 0 1 678.94287 100.09375] CT
1 0.302 0.302 RC
N
f-27201882
f
GR
GS
[1 0 0 1 707.28369 29] CT
1 0.302 0.302 RC
N
f-27201882
f
GR
GS
[1 0 0 1 705.84869 57.4375] CT
1 0.302 0.302 RC
N
f-27201882
f
GR
GS
[1 0 0 1 696.77783 57.4375] CT
1 0.302 0.302 RC
N
f-27201882
f
GR
GS
[1 0 0 1 693.04456 29] CT
1 0.302 0.302 RC
N
f-27201882
f
GR
GS
[1 0 0 1 698.82098 43.21875] CT
1 0.302 0.302 RC
N
f-27201882
f
GR
GS
[1 0 0 1 689.66486 43.21875] CT
1 0.302 0.302 RC
N
f-27201882
f
GR
GS
[1 0 0 1 704.83765 29] CT
1 0.302 0.302 RC
N
f-27201882
f
GR
GS
[1 0 0 1 681.50012 29] CT
1 0.302 0.302 RC
N
f-27201882
f
GR
GS
[1 0 0 1 693.66693 142.75] CT
1 0.302 0.302 RC
N
f-27201882
f
GR
GS
[1 0 0 1 704.28424 156.96875] CT
1 0.302 0.302 RC
N
f-27201882
f
GR
GS
[1 0 0 1 699.62231 29] CT
1 0.302 0.302 RC
N
f-27201882
f
GR
GS
[1 0 0 1 678.23859 29] CT
1 0.302 0.302 RC
N
f-27201882
f
GR
GS
[1 0 0 1 678.77563 114.3125] CT
1 0.302 0.302 RC
N
f-27201882
f
GR
GS
[1 0 0 1 693.83478 156.96875] CT
1 0.302 0.302 RC
N
f-27201882
f
GR
GS
[1 0 0 1 685.77606 29] CT
1 0.302 0.302 RC
N
f-27201882
f
GR
GS
[1 0 0 1 690.90863 43.21875] CT
1 0.302 0.302 RC
N
f-27201882
f
GR
GS
[1 0 0 1 693.29968 85.875] CT
1 0.302 0.302 RC
N
f-27201882
f
GR
GS
[1 0 0 1 680.26611 85.875] CT
1 0.302 0.302 RC
N
f-27201882
f
GR
GS
[1 0 0 1 690.65594 43.21875] CT
1 0.302 0.302 RC
N
f-27201882
f
GR
GS
[1 0 0 1 691.09528 114.3125] CT
1 0.302 0.302 RC
N
f-27201882
f
GR
GS
[1 0 0 1 688.505 43.21875] CT
1 0.302 0.302 RC
N
f-27201882
f
GR
GS
[1 0 0 1 709.64233 29] CT
1 0.302 0.302 RC
N
f-27201882
f
GR
GS
[1 0 0 1 694.53674 29] CT
1 0.302 0.302 RC
N
f-27201882
f
GR
GS
[1 0 0 1 684.36597 71.65625] CT
1 0.302 0.302 RC
N
f-27201882
f
GR
GS
[1 0 0 1 688.36102 29] CT
1 0.302 0.302 RC
N
f-27201882
f
GR
GS
[1 0 0 1 706.591 29] CT
1 0.302 0.302 RC
N
f-27201882
f
GR
GS
[1 0 0 1 699.35828 29] CT
1 0.302 0.302 RC
N
f-27201882
f
GR
GS
[1 0 0 1 700.91577 29] CT
1 0.302 0.302 RC
N
f-27201882
f
GR
GS
[1 0 0 1 699.29248 29] CT
1 0.302 0.302 RC
N
f-27201882
f
GR
GS
[1 0 0 1 687.13586 29] CT
1 0.302 0.302 RC
N
f-27201882
f
GR
GS
[1 0 0 1 708.07056 119.99999] CT
1 0.302 0.302 RC
N
f-27201882
f
GR
GS
[1 0 0 1 678.37134 29] CT
1 0.302 0.302 RC
N
f-27201882
f
GR
GS
[1 0 0 1 690.69751 89.66666] CT
1 0.302 0.302 RC
N
f-27201882
f
GR
GS
[1 0 0 1 698.46252 29] CT
1 0.302 0.302 RC
N
f-27201882
f
GR
GS
[1 0 0 1 709.86322 57.4375] CT
1 0.302 0.302 RC
N
f-27201882
f
GR
GS
[1 0 0 1 693.87415 29] CT
1 0.302 0.302 RC
N
f-27201882
f
GR
GS
[1 0 0 1 778.34161 43.21875] CT
1 0.302 0.302 RC
N
f-27201882
f
GR
GS
[1 0 0 1 786.24493 71.65625] CT
1 0.302 0.302 RC
N
f-27201882
f
GR
GS
[1 0 0 1 789.98761 43.21875] CT
1 0.302 0.302 RC
N
f-27201882
f
GR
GS
[1 0 0 1 776.81531 29] CT
1 0.302 0.302 RC
N
f-27201882
f
GR
GS
[1 0 0 1 779.36438 85.875] CT
1 0.302 0.302 RC
N
f-27201882
f
GR
GS
[1 0 0 1 785.86273 71.65625] CT
1 0.302 0.302 RC
N
f-27201882
f
GR
GS
[1 0 0 1 788.99152 44.16666] CT
1 0.302 0.302 RC
N
f-27201882
f
GR
GS
[1 0 0 1 785.52087 29] CT
1 0.302 0.302 RC
N
f-27201882
f
GR
GS
[1 0 0 1 790.62836 71.65625] CT
1 0.302 0.302 RC
N
f-27201882
f
GR
GS
[1 0 0 1 764.99365 43.21875] CT
1 0.302 0.302 RC
N
f-27201882
f
GR
GS
[1 0 0 1 767.26703 71.65625] CT
1 0.302 0.302 RC
N
f-27201882
f
GR
GS
[1 0 0 1 765.24213 57.4375] CT
1 0.302 0.302 RC
N
f-27201882
f
GR
GS
[1 0 0 1 769.31024 85.875] CT
1 0.302 0.302 RC
N
f-27201882
f
GR
GS
[1 0 0 1 792.41138 43.21875] CT
1 0.302 0.302 RC
N
f-27201882
f
GR
GS
[1 0 0 1 782.97314 57.4375] CT
1 0.302 0.302 RC
N
f-27201882
f
GR
GS
[1 0 0 1 769.70422 71.65625] CT
1 0.302 0.302 RC
N
f-27201882
f
GR
GS
[1 0 0 1 795.96637 74.5] CT
1 0.302 0.302 RC
N
f-27201882
f
GR
GS
[1 0 0 1 782.38147 59.33333] CT
1 0.302 0.302 RC
N
f-27201882
f
GR
GS
[1 0 0 1 792.24884 57.4375] CT
1 0.302 0.302 RC
N
f-27201882
f
GR
GS
[1 0 0 1 774.68494 71.65625] CT
1 0.302 0.302 RC
N
f-27201882
f
GR
GS
[1 0 0 1 771.78381 29] CT
1 0.302 0.302 RC
N
f-27201882
f
GR
GS
[1 0 0 1 787.85577 85.875] CT
1 0.302 0.302 RC
N
f-27201882
f
GR
GS
[1 0 0 1 781.61511 57.4375] CT
1 0.302 0.302 RC
N
f-27201882
f
GR
GS
[1 0 0 1 773.61298 57.4375] CT
1 0.302 0.302 RC
N
f-27201882
f
GR
GS
[1 0 0 1 764.76031 29] CT
1 0.302 0.302 RC
N
f-27201882
f
GR
GS
[1 0 0 1 769.04602 57.4375] CT
1 0.302 0.302 RC
N
f-27201882
f
GR
GS
[1 0 0 1 790.66187 100.09375] CT
1 0.302 0.302 RC
N
f-27201882
f
GR
GS
[1 0 0 1 781.57977 57.4375] CT
1 0.302 0.302 RC
N
f-27201882
f
GR
GS
[1 0 0 1 778.08868 71.65625] CT
1 0.302 0.302 RC
N
f-27201882
f
GR
GS
[1 0 0 1 767.53027 128.53125] CT
1 0.302 0.302 RC
N
f-27201882
f
GR
GS
[1 0 0 1 785.4389 100.09375] CT
1 0.302 0.302 RC
N
f-27201882
f
GR
GS
[1 0 0 1 768.15314 57.4375] CT
1 0.302 0.302 RC
N
f-27201882
f
GR
GS
[1 0 0 1 783.69952 29] CT
1 0.302 0.302 RC
N
f-27201882
f
GR
GS
[1 0 0 1 770.13165 114.3125] CT
1 0.302 0.302 RC
N
f-27201882
f
GR
GS
[1 0 0 1 780.76318 57.4375] CT
1 0.302 0.302 RC
N
f-27201882
f
GR
GS
[1 0 0 1 775.30133 71.65625] CT
1 0.302 0.302 RC
N
f-27201882
f
GR
GS
[1 0 0 1 770.89709 114.3125] CT
1 0.302 0.302 RC
N
f-27201882
f
GR
GS
[1 0 0 1 767.41443 29] CT
1 0.302 0.302 RC
N
f-27201882
f
GR
GS
[1 0 0 1 769.0744 85.875] CT
1 0.302 0.302 RC
N
f-27201882
f
GR
GS
[1 0 0 1 793.72406 71.65625] CT
1 0.302 0.302 RC
N
f-27201882
f
GR
GS
[1 0 0 1 788.62219 100.09375] CT
1 0.302 0.302 RC
N
f-27201882
f
GR
GS
[1 0 0 1 763.93524 29] CT
1 0.302 0.302 RC
N
f-27201882
f
GR
GS
[1 0 0 1 877.19421 114.3125] CT
1 0.302 0.302 RC
N
f-27201882
f
GR
GS
[1 0 0 1 857.85004 128.53125] CT
1 0.302 0.302 RC
N
f-27201882
f
GR
GS
[1 0 0 1 879.78082 100.09375] CT
1 0.302 0.302 RC
N
f-27201882
f
GR
GS
[1 0 0 1 878.18286 57.4375] CT
1 0.302 0.302 RC
N
f-27201882
f
GR
GS
[1 0 0 1 861.61566 71.65625] CT
1 0.302 0.302 RC
N
f-27201882
f
GR
GS
[1 0 0 1 860.23468 100.09375] CT
1 0.302 0.302 RC
N
f-27201882
f
GR
GS
[1 0 0 1 854.71838 71.65625] CT
1 0.302 0.302 RC
N
f-27201882
f
GR
GS
[1 0 0 1 862.74097 57.4375] CT
1 0.302 0.302 RC
N
f-27201882
f
GR
GS
[1 0 0 1 859.8988 100.09375] CT
1 0.302 0.302 RC
N
f-27201882
f
GR
GS
[1 0 0 1 877.56281 100.09375] CT
1 0.302 0.302 RC
N
f-27201882
f
GR
GS
[1 0 0 1 859.0235 85.875] CT
1 0.302 0.302 RC
N
f-27201882
f
GR
GS
[1 0 0 1 878.59979 100.09375] CT
1 0.302 0.302 RC
N
f-27201882
f
GR
GS
[1 0 0 1 856.12604 85.875] CT
1 0.302 0.302 RC
N
f-27201882
f
GR
GS
[1 0 0 1 861.59631 71.65625] CT
1 0.302 0.302 RC
N
f-27201882
f
GR
GS
[1 0 0 1 861.28717 43.21875] CT
1 0.302 0.302 RC
N
f-27201882
f
GR
GS
[1 0 0 1 869.49536 211] CT
1 0.302 0.302 RC
N
f-27201882
f
GR
GS
[1 0 0 1 865.06409 128.53125] CT
1 0.302 0.302 RC
N
f-27201882
f
GR
GS
[1 0 0 1 850.75439 43.21875] CT
1 0.302 0.302 RC
N
f-27201882
f
GR
GS
[1 0 0 1 862.45306 100.09375] CT
1 0.302 0.302 RC
N
f-27201882
f
GR
GS
[1 0 0 1 868.15466 43.21875] CT
1 0.302 0.302 RC
N
f-27201882
f
GR
GS
[1 0 0 1 851.77533 57.4375] CT
1 0.302 0.302 RC
N
f-27201882
f
GR
GS
[1 0 0 1 856.74048 128.53125] CT
1 0.302 0.302 RC
N
f-27201882
f
GR
GS
[1 0 0 1 875.875 128.53125] CT
1 0.302 0.302 RC
N
f-27201882
f
GR
GS
[1 0 0 1 871.02795 29] CT
1 0.302 0.302 RC
N
f-27201882
f
GR
GS
[1 0 0 1 877.13623 114.3125] CT
1 0.302 0.302 RC
N
f-27201882
f
GR
GS
[1 0 0 1 850.17352 142.75] CT
1 0.302 0.302 RC
N
f-27201882
f
GR
GS
[1 0 0 1 849.84015 100.09375] CT
1 0.302 0.302 RC
N
f-27201882
f
GR
GS
[1 0 0 1 863.09625 85.875] CT
1 0.302 0.302 RC
N
f-27201882
f
GR
GS
[1 0 0 1 856.61957 57.4375] CT
1 0.302 0.302 RC
N
f-27201882
f
GR
GS
[1 0 0 1 869.57361 89.66666] CT
1 0.302 0.302 RC
N
f-27201882
f
GR
GS
[1 0 0 1 877.61572 43.21875] CT
1 0.302 0.302 RC
N
f-27201882
f
GR
GS
[1 0 0 1 875.09332 71.65625] CT
1 0.302 0.302 RC
N
f-27201882
f
GR
GS
[1 0 0 1 881.26074 71.65625] CT
1 0.302 0.302 RC
N
f-27201882
f
GR
GS
[1 0 0 1 867.4032 29] CT
1 0.302 0.302 RC
N
f-27201882
f
GR
GS
[1 0 0 1 867.88611 128.53125] CT
1 0.302 0.302 RC
N
f-27201882
f
GR
GS
[1 0 0 1 872.29236 57.4375] CT
1 0.302 0.302 RC
N
f-27201882
f
GR
GS
[1 0 0 1 879.2782 57.4375] CT
1 0.302 0.302 RC
N
f-27201882
f
GR
GS
[1 0 0 1 855.64789 71.65625] CT
1 0.302 0.302 RC
N
f-27201882
f
GR
GS
[1 0 0 1 873.3819 74.5] CT
1 0.302 0.302 RC
N
f-27201882
f
GR
GS
[1 0 0 1 855.90765 100.09375] CT
1 0.302 0.302 RC
N
f-27201882
f
GR
GS
[1 0 0 1 856.28119 100.09375] CT
1 0.302 0.302 RC
N
f-27201882
f
GR
GS
[1 0 0 1 875.84308 71.65625] CT
1 0.302 0.302 RC
N
f-27201882
f
GR
GS
[1 0 0 1 644.96143 43.21875] CT
0.302 GC
N
f-27201882
f
GR
GS
[1 0 0 1 626.974 29] CT
0.302 GC
N
f-27201882
f
GR
GS
[1 0 0 1 659.53363 57.4375] CT
0.302 GC
N
f-27201882
f
GR
GS
[1 0 0 1 656.85931 29] CT
0.302 GC
N
f-27201882
f
GR
GS
[1 0 0 1 656.68909 57.4375] CT
0.302 GC
N
f-27201882
f
GR
GS
[1 0 0 1 643.73285 29] CT
0.302 GC
N
f-27201882
f
GR
GS
[1 0 0 1 645.00275 43.21875] CT
0.302 GC
N
f-27201882
f
GR
GS
[1 0 0 1 627.91742 57.4375] CT
0.302 GC
N
f-27201882
f
GR
GS
[1 0 0 1 652.50537 43.21875] CT
0.302 GC
N
f-27201882
f
GR
GS
[1 0 0 1 652.78607 43.21875] CT
0.302 GC
N
f-27201882
f
GR
GS
[1 0 0 1 646.7995 57.4375] CT
0.302 GC
N
f-27201882
f
GR
GS
[1 0 0 1 639.48901 29] CT
0.302 GC
N
f-27201882
f
GR
GS
[1 0 0 1 643.66351 43.21875] CT
0.302 GC
N
f-27201882
f
GR
GS
[1 0 0 1 644.86853 57.4375] CT
0.302 GC
N
f-27201882
f
GR
GS
[1 0 0 1 642.18134 71.65625] CT
0.302 GC
N
f-27201882
f
GR
GS
[1 0 0 1 631.68976 171.1875] CT
0.302 GC
N
f-27201882
f
GR
GS
[1 0 0 1 649.16901 85.875] CT
0.302 GC
N
f-27201882
f
GR
GS
[1 0 0 1 649.91998 57.4375] CT
0.302 GC
N
f-27201882
f
GR
GS
[1 0 0 1 652.49188 43.21875] CT
0.302 GC
N
f-27201882
f
GR
GS
[1 0 0 1 637.29047 57.4375] CT
0.302 GC
N
f-27201882
f
GR
GS
[1 0 0 1 654.36139 85.875] CT
0.302 GC
N
f-27201882
f
GR
GS
[1 0 0 1 637.08636 43.21875] CT
0.302 GC
N
f-27201882
f
GR
GS
[1 0 0 1 636.19995 100.09375] CT
0.302 GC
N
f-27201882
f
GR
GS
[1 0 0 1 636.0766 100.09375] CT
0.302 GC
N
f-27201882
f
GR
GS
[1 0 0 1 652.96204 100.09375] CT
0.302 GC
N
f-27201882
f
GR
GS
[1 0 0 1 637.72369 66.91667] CT
0.302 GC
N
f-27201882
f
GR
GS
[1 0 0 1 639.03992 100.09375] CT
0.302 GC
N
f-27201882
f
GR
GS
[1 0 0 1 649.94775 43.21875] CT
0.302 GC
N
f-27201882
f
GR
GS
[1 0 0 1 627.96118 43.21875] CT
0.302 GC
N
f-27201882
f
GR
GS
[1 0 0 1 631.95074 29] CT
0.302 GC
N
f-27201882
f
GR
GS
[1 0 0 1 641.25061 29] CT
0.302 GC
N
f-27201882
f
GR
GS
[1 0 0 1 634.10413 57.4375] CT
0.302 GC
N
f-27201882
f
GR
GS
[1 0 0 1 652.84497 29] CT
0.302 GC
N
f-27201882
f
GR
GS
[1 0 0 1 648.8457 43.21875] CT
0.302 GC
N
f-27201882
f
GR
GS
[1 0 0 1 655.57037 29] CT
0.302 GC
N
f-27201882
f
GR
GS
[1 0 0 1 633.9295 29] CT
0.302 GC
N
f-27201882
f
GR
GS
[1 0 0 1 641.82593 59.33333] CT
0.302 GC
N
f-27201882
f
GR
GS
[1 0 0 1 651.88757 71.65625] CT
0.302 GC
N
f-27201882
f
GR
GS
[1 0 0 1 630.40027 29] CT
0.302 GC
N
f-27201882
f
GR
GS
[1 0 0 1 642.03882 71.65625] CT
0.302 GC
N
f-27201882
f
GR
GS
[1 0 0 1 643.61395 43.21875] CT
0.302 GC
N
f-27201882
f
GR
GS
[1 0 0 1 650.59662 43.21875] CT
0.302 GC
N
f-27201882
f
GR
GS
[1 0 0 1 744.31769 29] CT
0.302 GC
N
f-27201882
f
GR
GS
[1 0 0 1 717.7514 171.1875] CT
0.302 GC
N
f-27201882
f
GR
GS
[1 0 0 1 714.24182 29] CT
0.302 GC
N
f-27201882
f
GR
GS
[1 0 0 1 733.28467 185.40625] CT
0.302 GC
N
f-27201882
f
GR
GS
[1 0 0 1 720.75824 100.09375] CT
0.302 GC
N
f-27201882
f
GR
GS
[1 0 0 1 731.55939 57.4375] CT
0.302 GC
N
f-27201882
f
GR
GS
[1 0 0 1 735.67615 29] CT
0.302 GC
N
f-27201882
f
GR
GS
[1 0 0 1 728.41528 71.65625] CT
0.302 GC
N
f-27201882
f
GR
GS
[1 0 0 1 734.98785 29] CT
0.302 GC
N
f-27201882
f
GR
GS
[1 0 0 1 740.12347 29] CT
0.302 GC
N
f-27201882
f
GR
GS
[1 0 0 1 741.77057 43.21875] CT
0.302 GC
N
f-27201882
f
GR
GS
[1 0 0 1 736.78503 43.21875] CT
0.302 GC
N
f-27201882
f
GR
GS
[1 0 0 1 721.45667 57.4375] CT
0.302 GC
N
f-27201882
f
GR
GS
[1 0 0 1 722.57916 29] CT
0.302 GC
N
f-27201882
f
GR
GS
[1 0 0 1 718.80273 171.1875] CT
0.302 GC
N
f-27201882
f
GR
GS
[1 0 0 1 732.96613 114.3125] CT
0.302 GC
N
f-27201882
f
GR
GS
[1 0 0 1 739.09418 29] CT
0.302 GC
N
f-27201882
f
GR
GS
[1 0 0 1 715.71747 29] CT
0.302 GC
N
f-27201882
f
GR
GS
[1 0 0 1 726.47919 114.3125] CT
0.302 GC
N
f-27201882
f
GR
GS
[1 0 0 1 734.05768 156.96875] CT
0.302 GC
N
f-27201882
f
GR
GS
[1 0 0 1 738.64948 43.21875] CT
0.302 GC
N
f-27201882
f
GR
GS
[1 0 0 1 730.09705 57.4375] CT
0.302 GC
N
f-27201882
f
GR
GS
[1 0 0 1 714.04004 71.65625] CT
0.302 GC
N
f-27201882
f
GR
GS
[1 0 0 1 727.52942 185.40625] CT
0.302 GC
N
f-27201882
f
GR
GS
[1 0 0 1 739.19598 29] CT
0.302 GC
N
f-27201882
f
GR
GS
[1 0 0 1 746.38428 161.70833] CT
0.302 GC
N
f-27201882
f
GR
GS
[1 0 0 1 741.52533 43.21875] CT
0.302 GC
N
f-27201882
f
GR
GS
[1 0 0 1 714.492 57.4375] CT
0.302 GC
N
f-27201882
f
GR
GS
[1 0 0 1 738.69781 29] CT
0.302 GC
N
f-27201882
f
GR
GS
[1 0 0 1 737.26556 100.09375] CT
0.302 GC
N
f-27201882
f
GR
GS
[1 0 0 1 738.2854 43.21875] CT
0.302 GC
N
f-27201882
f
GR
GS
[1 0 0 1 719.33655 29] CT
0.302 GC
N
f-27201882
f
GR
GS
[1 0 0 1 723.52899 57.4375] CT
0.302 GC
N
f-27201882
f
GR
GS
[1 0 0 1 732.88745 29] CT
0.302 GC
N
f-27201882
f
GR
GS
[1 0 0 1 745.90363 100.09375] CT
0.302 GC
N
f-27201882
f
GR
GS
[1 0 0 1 727.89893 43.21875] CT
0.302 GC
N
f-27201882
f
GR
GS
[1 0 0 1 729.43597 180.66667] CT
0.302 GC
N
f-27201882
f
GR
GS
[1 0 0 1 745.71674 29] CT
0.302 GC
N
f-27201882
f
GR
GS
[1 0 0 1 738.57037 119.99999] CT
0.302 GC
N
f-27201882
f
GR
GS
[1 0 0 1 745.99445 29] CT
0.302 GC
N
f-27201882
f
GR
GS
[1 0 0 1 719.38446 74.5] CT
0.302 GC
N
f-27201882
f
GR
GS
[1 0 0 1 713.52216 29] CT
0.302 GC
N
f-27201882
f
GR
GS
[1 0 0 1 803.47906 71.65625] CT
0.302 GC
N
f-27201882
f
GR
GS
[1 0 0 1 822.71234 114.3125] CT
0.302 GC
N
f-27201882
f
GR
GS
[1 0 0 1 824.68439 57.4375] CT
0.302 GC
N
f-27201882
f
GR
GS
[1 0 0 1 820.15228 29] CT
0.302 GC
N
f-27201882
f
GR
GS
[1 0 0 1 809.64124 114.3125] CT
0.302 GC
N
f-27201882
f
GR
GS
[1 0 0 1 820.48431 100.09375] CT
0.302 GC
N
f-27201882
f
GR
GS
[1 0 0 1 799.62622 142.75] CT
0.302 GC
N
f-27201882
f
GR
GS
[1 0 0 1 827.77386 43.21875] CT
0.302 GC
N
f-27201882
f
GR
GS
[1 0 0 1 801.58893 57.4375] CT
0.302 GC
N
f-27201882
f
GR
GS
[1 0 0 1 830.49622 100.09375] CT
0.302 GC
N
f-27201882
f
GR
GS
[1 0 0 1 811.0603 57.4375] CT
0.302 GC
N
f-27201882
f
GR
GS
[1 0 0 1 802.66986 57.4375] CT
0.302 GC
N
f-27201882
f
GR
GS
[1 0 0 1 808.77863 100.09375] CT
0.302 GC
N
f-27201882
f
GR
GS
[1 0 0 1 828.84241 71.65625] CT
0.302 GC
N
f-27201882
f
GR
GS
[1 0 0 1 824.80457 114.3125] CT
0.302 GC
N
f-27201882
f
GR
GS
[1 0 0 1 804.67419 171.1875] CT
0.302 GC
N
f-27201882
f
GR
GS
[1 0 0 1 804.01996 71.65625] CT
0.302 GC
N
f-27201882
f
GR
GS
[1 0 0 1 828.65857 71.65625] CT
0.302 GC
N
f-27201882
f
GR
GS
[1 0 0 1 824.46118 156.96875] CT
0.302 GC
N
f-27201882
f
GR
GS
[1 0 0 1 825.1925 71.65625] CT
0.302 GC
N
f-27201882
f
GR
GS
[1 0 0 1 805.37689 85.875] CT
0.302 GC
N
f-27201882
f
GR
GS
[1 0 0 1 804.68555 71.65625] CT
0.302 GC
N
f-27201882
f
GR
GS
[1 0 0 1 820.21332 100.09375] CT
0.302 GC
N
f-27201882
f
GR
GS
[1 0 0 1 801.87408 71.65625] CT
0.302 GC
N
f-27201882
f
GR
GS
[1 0 0 1 815.39001 57.4375] CT
0.302 GC
N
f-27201882
f
GR
GS
[1 0 0 1 821.52106 142.75] CT
0.302 GC
N
f-27201882
f
GR
GS
[1 0 0 1 803.44067 71.65625] CT
0.302 GC
N
f-27201882
f
GR
GS
[1 0 0 1 810.85059 142.75] CT
0.302 GC
N
f-27201882
f
GR
GS
[1 0 0 1 825.74927 71.65625] CT
0.302 GC
N
f-27201882
f
GR
GS
[1 0 0 1 829.20679 165.5] CT
0.302 GC
N
f-27201882
f
GR
GS
[1 0 0 1 803.5661 43.21875] CT
0.302 GC
N
f-27201882
f
GR
GS
[1 0 0 1 823.33722 43.21875] CT
0.302 GC
N
f-27201882
f
GR
GS
[1 0 0 1 817.09509 43.21875] CT
0.302 GC
N
f-27201882
f
GR
GS
[1 0 0 1 804.49658 114.3125] CT
0.302 GC
N
f-27201882
f
GR
GS
[1 0 0 1 821.6955 142.75] CT
0.302 GC
N
f-27201882
f
GR
GS
[1 0 0 1 808.33118 71.65625] CT
0.302 GC
N
f-27201882
f
GR
GS
[1 0 0 1 819.71771 93.99999] CT
0.302 GC
N
f-27201882
f
GR
GS
[1 0 0 1 806.13806 71.65625] CT
0.302 GC
N
f-27201882
f
GR
GS
[1 0 0 1 814.82251 74.5] CT
0.302 GC
N
f-27201882
f
GR
GS
[1 0 0 1 824.03302 100.09375] CT
0.302 GC
N
f-27201882
f
GR
GS
[1 0 0 1 819.30463 171.1875] CT
0.302 GC
N
f-27201882
f
GR
GS
[1 0 0 1 806.54883 71.65625] CT
0.302 GC
N
f-27201882
f
GR
GS
[1 0 0 1 906.05988 114.3125] CT
0.302 GC
N
f-27201882
f
GR
GS
[1 0 0 1 895.01691 142.75] CT
0.302 GC
N
f-27201882
f
GR
GS
[1 0 0 1 887.7702 114.3125] CT
0.302 GC
N
f-27201882
f
GR
GS
[1 0 0 1 906.18481 43.21875] CT
0.302 GC
N
f-27201882
f
GR
GS
[1 0 0 1 916.13324 114.3125] CT
0.302 GC
N
f-27201882
f
GR
GS
[1 0 0 1 912.49701 100.09375] CT
0.302 GC
N
f-27201882
f
GR
GS
[1 0 0 1 888.70129 114.3125] CT
0.302 GC
N
f-27201882
f
GR
GS
[1 0 0 1 907.23413 71.65625] CT
0.302 GC
N
f-27201882
f
GR
GS
[1 0 0 1 906.43677 128.53125] CT
0.302 GC
N
f-27201882
f
GR
GS
[1 0 0 1 901.17175 57.4375] CT
0.302 GC
N
f-27201882
f
GR
GS
[1 0 0 1 898.57672 114.3125] CT
0.302 GC
N
f-27201882
f
GR
GS
[1 0 0 1 896.82538 128.53125] CT
0.302 GC
N
f-27201882
f
GR
GS
[1 0 0 1 912.53607 114.3125] CT
0.302 GC
N
f-27201882
f
GR
GS
[1 0 0 1 892.27863 85.875] CT
0.302 GC
N
f-27201882
f
GR
GS
[1 0 0 1 893.67065 128.53125] CT
0.302 GC
N
f-27201882
f
GR
GS
[1 0 0 1 902.9007 171.1875] CT
0.302 GC
N
f-27201882
f
GR
GS
[1 0 0 1 905.15076 142.75] CT
0.302 GC
N
f-27201882
f
GR
GS
[1 0 0 1 899.09039 85.875] CT
0.302 GC
N
f-27201882
f
GR
GS
[1 0 0 1 913.29407 85.875] CT
0.302 GC
N
f-27201882
f
GR
GS
[1 0 0 1 916.36053 100.09375] CT
0.302 GC
N
f-27201882
f
GR
GS
[1 0 0 1 911.65356 114.3125] CT
0.302 GC
N
f-27201882
f
GR
GS
[1 0 0 1 908.34967 100.09375] CT
0.302 GC
N
f-27201882
f
GR
GS
[1 0 0 1 887.86743 156.96875] CT
0.302 GC
N
f-27201882
f
GR
GS
[1 0 0 1 886.52869 71.65625] CT
0.302 GC
N
f-27201882
f
GR
GS
[1 0 0 1 912.42749 85.875] CT
0.302 GC
N
f-27201882
f
GR
GS
[1 0 0 1 895.69391 161.70833] CT
0.302 GC
N
f-27201882
f
GR
GS
[1 0 0 1 914.70557 142.75] CT
0.302 GC
N
f-27201882
f
GR
GS
[1 0 0 1 903.48029 128.53125] CT
0.302 GC
N
f-27201882
f
GR
GS
[1 0 0 1 885.43719 43.21875] CT
0.302 GC
N
f-27201882
f
GR
GS
[1 0 0 1 891.07367 128.53125] CT
0.302 GC
N
f-27201882
f
GR
GS
[1 0 0 1 888.71143 85.875] CT
0.302 GC
N
f-27201882
f
GR
GS
[1 0 0 1 897.9458 100.09375] CT
0.302 GC
N
f-27201882
f
GR
GS
[1 0 0 1 913.74384 85.875] CT
0.302 GC
N
f-27201882
f
GR
GS
[1 0 0 1 886.87134 29] CT
0.302 GC
N
f-27201882
f
GR
GS
[1 0 0 1 915.53467 128.53125] CT
0.302 GC
N
f-27201882
f
GR
GS
[1 0 0 1 915.73993 57.4375] CT
0.302 GC
N
f-27201882
f
GR
GS
[1 0 0 1 892.776 89.66666] CT
0.302 GC
N
f-27201882
f
GR
GS
[1 0 0 1 884.90955 114.3125] CT
0.302 GC
N
f-27201882
f
GR
GS
[1 0 0 1 899.664 128.53125] CT
0.302 GC
N
f-27201882
f
GR
GS
[1 0 0 1 903.70251 114.3125] CT
0.302 GC
N
f-27201882
f
GR
GS
[1 0 0 1 908.57843 128.53125] CT
0.302 GC
N
f-27201882
f
GR
GS
[1 0 0 1 895.10968 114.3125] CT
0.302 GC
N
f-27201882
f
GR
GS
1 LJ
4 LW
N
609.688 38.815 M
609.688 44.328 L
S
GR
GS
1 LJ
4 LW
N
609.688 38.815 M
609.688 38.815 L
S
GR
GS
1 LJ
4 LW
N
609.688 44.328 M
609.688 44.328 L
S
GR
GS
1 LJ
4 LW
N
695.313 56.329 M
695.313 70.508 L
S
GR
GS
1 LJ
4 LW
N
695.313 56.329 M
695.313 56.329 L
S
GR
GS
1 LJ
4 LW
N
695.313 70.508 M
695.313 70.508 L
S
GR
GS
1 LJ
4 LW
N
780.938 60.739 M
780.938 68.625 L
S
GR
GS
1 LJ
4 LW
N
780.938 60.739 M
780.938 60.739 L
S
GR
GS
1 LJ
4 LW
N
780.938 68.625 M
780.938 68.625 L
S
GR
GS
1 LJ
4 LW
N
866.563 80.831 M
866.563 91.777 L
S
GR
GS
1 LJ
4 LW
N
866.563 80.831 M
866.563 80.831 L
S
GR
GS
1 LJ
4 LW
N
866.563 91.777 M
866.563 91.777 L
S
GR
GS
1 LJ
4 LW
N
643.938 51.64 M
643.938 60.391 L
S
GR
GS
1 LJ
4 LW
N
643.938 51.64 M
643.938 51.64 L
S
GR
GS
1 LJ
4 LW
N
643.938 60.391 M
643.938 60.391 L
S
GR
GS
1 LJ
4 LW
N
729.563 64.722 M
729.563 81.028 L
S
GR
GS
1 LJ
4 LW
N
729.563 64.722 M
729.563 64.722 L
S
GR
GS
1 LJ
4 LW
N
729.563 81.028 M
729.563 81.028 L
S
GR
GS
1 LJ
4 LW
N
815.188 84.526 M
815.188 96.278 L
S
GR
GS
1 LJ
4 LW
N
815.188 84.526 M
815.188 84.526 L
S
GR
GS
1 LJ
4 LW
N
815.188 96.278 M
815.188 96.278 L
S
GR
GS
1 LJ
4 LW
N
900.813 101.424 M
900.813 111.357 L
S
GR
GS
1 LJ
4 LW
N
900.813 101.424 M
900.813 101.424 L
S
GR
GS
1 LJ
4 LW
N
900.813 111.357 M
900.813 111.357 L
S
GR
GS
[1 0 0 1 609.6875 233.75] CT
/Helvetica-Bold 20 F
GS
[1 0 0 1 0 0] CT
-12.5 7.5 moveto 
1 -1 scale
(***) t 
GR
GR
GS
[1 0 0 1 643.9375 233.75] CT
/Helvetica-Bold 20 F
GS
[1 0 0 1 0 0] CT
-12.5 7.5 moveto 
1 -1 scale
(***) t 
GR
GR
GS
[1 0 0 1 695.3125 233.75] CT
/Helvetica-Bold 20 F
GS
[1 0 0 1 0 0] CT
-12.5 7.5 moveto 
1 -1 scale
(***) t 
GR
GR
GS
[1 0 0 1 729.5625 233.75] CT
/Helvetica-Bold 20 F
GS
[1 0 0 1 0 0] CT
-12.5 7.5 moveto 
1 -1 scale
(***) t 
GR
GR
GS
[1 0 0 1 780.9375 233.75] CT
/Helvetica-Bold 20 F
GS
[1 0 0 1 0 0] CT
-12.5 7.5 moveto 
1 -1 scale
(***) t 
GR
GR
GS
[1 0 0 1 815.1875 233.75] CT
/Helvetica-Bold 20 F
GS
[1 0 0 1 0 0] CT
-12.5 7.5 moveto 
1 -1 scale
(***) t 
GR
GR
GS
[1 0 0 1 866.5625 233.75] CT
/Helvetica-Bold 20 F
GS
[1 0 0 1 0 0] CT
-12.5 7.5 moveto 
1 -1 scale
(***) t 
GR
GR
GS
[1 0 0 1 900.8125 233.75] CT
/Helvetica-Bold 20 F
GS
[1 0 0 1 0 0] CT
-12.5 7.5 moveto 
1 -1 scale
(***) t 
GR
GR
%%Trailer
%%Pages: 1
%%EOF
