%!PS-Adobe-3.0 EPSF-3.0
%%Creator: (MATLAB, The Mathworks, Inc. Version 9.8.0.1323502 \(R2020a\). Operating System: Mac OS X)
%%Title: /Users/kosciessa/Desktop/mntTardisLNDG/LNDG/stateswitch/stsw_beh_task/behavior/figures/E2_vsGuess_yaoa.eps
%%CreationDate: 2022-03-06T14:05:25
%%Pages: (atend)
%%BoundingBox:     4     7   354   269
%%LanguageLevel: 3
%%EndComments
%%BeginProlog
%%BeginResource: procset (Apache XML Graphics Std ProcSet) 1.2 0
%%Version: 1.2 0
%%Copyright: (Copyright 2001-2003,2010 The Apache Software Foundation. License terms: http://www.apache.org/licenses/LICENSE-2.0)
/bd{bind def}bind def
/ld{load def}bd
/GR/grestore ld
/GS/gsave ld
/RM/rmoveto ld
/C/curveto ld
/t/show ld
/L/lineto ld
/ML/setmiterlimit ld
/CT/concat ld
/f/fill ld
/N/newpath ld
/S/stroke ld
/CC/setcmykcolor ld
/A/ashow ld
/cp/closepath ld
/RC/setrgbcolor ld
/LJ/setlinejoin ld
/GC/setgray ld
/LW/setlinewidth ld
/M/moveto ld
/re {4 2 roll M
1 index 0 rlineto
0 exch rlineto
neg 0 rlineto
cp } bd
/_ctm matrix def
/_tm matrix def
/BT { _ctm currentmatrix pop matrix _tm copy pop 0 0 moveto } bd
/ET { _ctm setmatrix } bd
/iTm { _ctm setmatrix _tm concat } bd
/Tm { _tm astore pop iTm 0 0 moveto } bd
/ux 0.0 def
/uy 0.0 def
/F {
  /Tp exch def
  /Tf exch def
  Tf findfont Tp scalefont setfont
  /cf Tf def  /cs Tp def
} bd
/ULS {currentpoint /uy exch def /ux exch def} bd
/ULE {
  /Tcx currentpoint pop def
  gsave
  newpath
  cf findfont cs scalefont dup
  /FontMatrix get 0 get /Ts exch def /FontInfo get dup
  /UnderlinePosition get Ts mul /To exch def
  /UnderlineThickness get Ts mul /Tt exch def
  ux uy To add moveto  Tcx uy To add lineto
  Tt setlinewidth stroke
  grestore
} bd
/OLE {
  /Tcx currentpoint pop def
  gsave
  newpath
  cf findfont cs scalefont dup
  /FontMatrix get 0 get /Ts exch def /FontInfo get dup
  /UnderlinePosition get Ts mul /To exch def
  /UnderlineThickness get Ts mul /Tt exch def
  ux uy To add cs add moveto Tcx uy To add cs add lineto
  Tt setlinewidth stroke
  grestore
} bd
/SOE {
  /Tcx currentpoint pop def
  gsave
  newpath
  cf findfont cs scalefont dup
  /FontMatrix get 0 get /Ts exch def /FontInfo get dup
  /UnderlinePosition get Ts mul /To exch def
  /UnderlineThickness get Ts mul /Tt exch def
  ux uy To add cs 10 mul 26 idiv add moveto Tcx uy To add cs 10 mul 26 idiv add lineto
  Tt setlinewidth stroke
  grestore
} bd
/QT {
/Y22 exch store
/X22 exch store
/Y21 exch store
/X21 exch store
currentpoint
/Y21 load 2 mul add 3 div exch
/X21 load 2 mul add 3 div exch
/X21 load 2 mul /X22 load add 3 div
/Y21 load 2 mul /Y22 load add 3 div
/X22 load /Y22 load curveto
} bd
/SSPD {
dup length /d exch dict def
{
/v exch def
/k exch def
currentpagedevice k known {
/cpdv currentpagedevice k get def
v cpdv ne {
/upd false def
/nullv v type /nulltype eq def
/nullcpdv cpdv type /nulltype eq def
nullv nullcpdv or
{
/upd true def
} {
/sametype v type cpdv type eq def
sametype {
v type /arraytype eq {
/vlen v length def
/cpdvlen cpdv length def
vlen cpdvlen eq {
0 1 vlen 1 sub {
/i exch def
/obj v i get def
/cpdobj cpdv i get def
obj cpdobj ne {
/upd true def
exit
} if
} for
} {
/upd true def
} ifelse
} {
v type /dicttype eq {
v {
/dv exch def
/dk exch def
/cpddv cpdv dk get def
dv cpddv ne {
/upd true def
exit
} if
} forall
} {
/upd true def
} ifelse
} ifelse
} if
} ifelse
upd true eq {
d k v put
} if
} if
} if
} forall
d length 0 gt {
d setpagedevice
} if
} bd
/RE { % /NewFontName [NewEncodingArray] /FontName RE -
  findfont dup length dict begin
  {
    1 index /FID ne
    {def} {pop pop} ifelse
  } forall
  /Encoding exch def
  /FontName 1 index def
  currentdict definefont pop
  end
} bind def
%%EndResource
%%BeginResource: procset (Apache XML Graphics EPS ProcSet) 1.0 0
%%Version: 1.0 0
%%Copyright: (Copyright 2002-2003 The Apache Software Foundation. License terms: http://www.apache.org/licenses/LICENSE-2.0)
/BeginEPSF { %def
/b4_Inc_state save def         % Save state for cleanup
/dict_count countdictstack def % Count objects on dict stack
/op_count count 1 sub def      % Count objects on operand stack
userdict begin                 % Push userdict on dict stack
/showpage { } def              % Redefine showpage, { } = null proc
0 setgray 0 setlinecap         % Prepare graphics state
1 setlinewidth 0 setlinejoin
10 setmiterlimit [ ] 0 setdash newpath
/languagelevel where           % If level not equal to 1 then
{pop languagelevel             % set strokeadjust and
1 ne                           % overprint to their defaults.
{false setstrokeadjust false setoverprint
} if
} if
} bd
/EndEPSF { %def
count op_count sub {pop} repeat            % Clean up stacks
countdictstack dict_count sub {end} repeat
b4_Inc_state restore
} bd
%%EndResource
%FOPBeginFontDict
%%IncludeResource: font Courier-Oblique
%%IncludeResource: font Courier-BoldOblique
%%IncludeResource: font Courier-Bold
%%IncludeResource: font ZapfDingbats
%%IncludeResource: font Symbol
%%IncludeResource: font Helvetica
%%IncludeResource: font Helvetica-Oblique
%%IncludeResource: font Helvetica-Bold
%%IncludeResource: font Helvetica-BoldOblique
%%IncludeResource: font Times-Roman
%%IncludeResource: font Times-Italic
%%IncludeResource: font Times-Bold
%%IncludeResource: font Times-BoldItalic
%%IncludeResource: font Courier
%FOPEndFontDict
%%BeginResource: encoding WinAnsiEncoding
/WinAnsiEncoding [
/.notdef /.notdef /.notdef /.notdef /.notdef
/.notdef /.notdef /.notdef /.notdef /.notdef
/.notdef /.notdef /.notdef /.notdef /.notdef
/.notdef /.notdef /.notdef /.notdef /.notdef
/.notdef /.notdef /.notdef /.notdef /.notdef
/.notdef /.notdef /.notdef /.notdef /.notdef
/.notdef /.notdef /space /exclam /quotedbl
/numbersign /dollar /percent /ampersand /quotesingle
/parenleft /parenright /asterisk /plus /comma
/hyphen /period /slash /zero /one
/two /three /four /five /six
/seven /eight /nine /colon /semicolon
/less /equal /greater /question /at
/A /B /C /D /E
/F /G /H /I /J
/K /L /M /N /O
/P /Q /R /S /T
/U /V /W /X /Y
/Z /bracketleft /backslash /bracketright /asciicircum
/underscore /quoteleft /a /b /c
/d /e /f /g /h
/i /j /k /l /m
/n /o /p /q /r
/s /t /u /v /w
/x /y /z /braceleft /bar
/braceright /asciitilde /bullet /Euro /bullet
/quotesinglbase /florin /quotedblbase /ellipsis /dagger
/daggerdbl /circumflex /perthousand /Scaron /guilsinglleft
/OE /bullet /Zcaron /bullet /bullet
/quoteleft /quoteright /quotedblleft /quotedblright /bullet
/endash /emdash /asciitilde /trademark /scaron
/guilsinglright /oe /bullet /zcaron /Ydieresis
/space /exclamdown /cent /sterling /currency
/yen /brokenbar /section /dieresis /copyright
/ordfeminine /guillemotleft /logicalnot /sfthyphen /registered
/macron /degree /plusminus /twosuperior /threesuperior
/acute /mu /paragraph /middot /cedilla
/onesuperior /ordmasculine /guillemotright /onequarter /onehalf
/threequarters /questiondown /Agrave /Aacute /Acircumflex
/Atilde /Adieresis /Aring /AE /Ccedilla
/Egrave /Eacute /Ecircumflex /Edieresis /Igrave
/Iacute /Icircumflex /Idieresis /Eth /Ntilde
/Ograve /Oacute /Ocircumflex /Otilde /Odieresis
/multiply /Oslash /Ugrave /Uacute /Ucircumflex
/Udieresis /Yacute /Thorn /germandbls /agrave
/aacute /acircumflex /atilde /adieresis /aring
/ae /ccedilla /egrave /eacute /ecircumflex
/edieresis /igrave /iacute /icircumflex /idieresis
/eth /ntilde /ograve /oacute /ocircumflex
/otilde /odieresis /divide /oslash /ugrave
/uacute /ucircumflex /udieresis /yacute /thorn
/ydieresis
] def
%%EndResource
%FOPBeginFontReencode
/Courier-Oblique findfont
dup length dict begin
  {1 index /FID ne {def} {pop pop} ifelse} forall
  /Encoding WinAnsiEncoding def
  currentdict
end
/Courier-Oblique exch definefont pop
/Courier-BoldOblique findfont
dup length dict begin
  {1 index /FID ne {def} {pop pop} ifelse} forall
  /Encoding WinAnsiEncoding def
  currentdict
end
/Courier-BoldOblique exch definefont pop
/Courier-Bold findfont
dup length dict begin
  {1 index /FID ne {def} {pop pop} ifelse} forall
  /Encoding WinAnsiEncoding def
  currentdict
end
/Courier-Bold exch definefont pop
/Helvetica findfont
dup length dict begin
  {1 index /FID ne {def} {pop pop} ifelse} forall
  /Encoding WinAnsiEncoding def
  currentdict
end
/Helvetica exch definefont pop
/Helvetica-Oblique findfont
dup length dict begin
  {1 index /FID ne {def} {pop pop} ifelse} forall
  /Encoding WinAnsiEncoding def
  currentdict
end
/Helvetica-Oblique exch definefont pop
/Helvetica-Bold findfont
dup length dict begin
  {1 index /FID ne {def} {pop pop} ifelse} forall
  /Encoding WinAnsiEncoding def
  currentdict
end
/Helvetica-Bold exch definefont pop
/Helvetica-BoldOblique findfont
dup length dict begin
  {1 index /FID ne {def} {pop pop} ifelse} forall
  /Encoding WinAnsiEncoding def
  currentdict
end
/Helvetica-BoldOblique exch definefont pop
/Times-Roman findfont
dup length dict begin
  {1 index /FID ne {def} {pop pop} ifelse} forall
  /Encoding WinAnsiEncoding def
  currentdict
end
/Times-Roman exch definefont pop
/Times-Italic findfont
dup length dict begin
  {1 index /FID ne {def} {pop pop} ifelse} forall
  /Encoding WinAnsiEncoding def
  currentdict
end
/Times-Italic exch definefont pop
/Times-Bold findfont
dup length dict begin
  {1 index /FID ne {def} {pop pop} ifelse} forall
  /Encoding WinAnsiEncoding def
  currentdict
end
/Times-Bold exch definefont pop
/Times-BoldItalic findfont
dup length dict begin
  {1 index /FID ne {def} {pop pop} ifelse} forall
  /Encoding WinAnsiEncoding def
  currentdict
end
/Times-BoldItalic exch definefont pop
/Courier findfont
dup length dict begin
  {1 index /FID ne {def} {pop pop} ifelse} forall
  /Encoding WinAnsiEncoding def
  currentdict
end
/Courier exch definefont pop
%FOPEndFontReencode
%%EndProlog
%%Page: 1 1
%%PageBoundingBox: 0 0 384 288
%%BeginPageSetup
[1 0 0 -1 0 288] CT
%%EndPageSetup
GS
1 GC
N
0 0 384 288 re
f
GR
GS
1 GC
N
0 0 384 288 re
f
GR
GS
1 GC
N
55.5 256.5 M
347.5 256.5 L
347.5 21.5 L
55.5 21.5 L
cp
f
GR
GS
0.149 GC
2 setlinecap
1 LJ
0.5 LW
N
55.5 256.5 M
347.5 256.5 L
S
GR
GS
0.149 GC
2 setlinecap
1 LJ
0.5 LW
N
92 256.5 M
92 253.58 L
S
GR
GS
0.149 GC
2 setlinecap
1 LJ
0.5 LW
N
165 256.5 M
165 253.58 L
S
GR
GS
0.149 GC
2 setlinecap
1 LJ
0.5 LW
N
238 256.5 M
238 253.58 L
S
GR
GS
0.149 GC
2 setlinecap
1 LJ
0.5 LW
N
311 256.5 M
311 253.58 L
S
GR
GS
[1 0 0 1 92 262.10001] CT
0.149 GC
/Helvetica 18 F
GS
[1 0 0 1 0 0] CT
-22 18 moveto 
1 -1 scale
(Color) t 
GR
GR
GS
[1 0 0 1 165 262.10001] CT
0.149 GC
/Helvetica 18 F
GS
[1 0 0 1 0 0] CT
-36 18 moveto 
1 -1 scale
(Direction) t 
GR
GR
GS
[1 0 0 1 238 262.10001] CT
0.149 GC
/Helvetica 18 F
GS
[1 0 0 1 0 0] CT
-17 18 moveto 
1 -1 scale
(Size) t 
GR
GR
GS
[1 0 0 1 311 262.10001] CT
0.149 GC
/Helvetica 18 F
GS
[1 0 0 1 0 0] CT
-44.5 18 moveto 
1 -1 scale
(Luminance) t 
GR
GR
GS
0.149 GC
2 setlinecap
1 LJ
0.5 LW
N
55.5 256.5 M
55.5 21.5 L
S
GR
GS
0.149 GC
2 setlinecap
1 LJ
0.5 LW
N
55.5 256.5 M
58.42 256.5 L
S
GR
GS
0.149 GC
2 setlinecap
1 LJ
0.5 LW
N
55.5 222.929 M
58.42 222.929 L
S
GR
GS
0.149 GC
2 setlinecap
1 LJ
0.5 LW
N
55.5 189.357 M
58.42 189.357 L
S
GR
GS
0.149 GC
2 setlinecap
1 LJ
0.5 LW
N
55.5 155.786 M
58.42 155.786 L
S
GR
GS
0.149 GC
2 setlinecap
1 LJ
0.5 LW
N
55.5 122.214 M
58.42 122.214 L
S
GR
GS
0.149 GC
2 setlinecap
1 LJ
0.5 LW
N
55.5 88.643 M
58.42 88.643 L
S
GR
GS
0.149 GC
2 setlinecap
1 LJ
0.5 LW
N
55.5 55.071 M
58.42 55.071 L
S
GR
GS
[1 0 0 1 49.9 256.5] CT
0.149 GC
/Helvetica 18 F
GS
[1 0 0 1 0 0] CT
-26 7 moveto 
1 -1 scale
(0.3) t 
GR
GR
GS
[1 0 0 1 49.9 222.92857] CT
0.149 GC
/Helvetica 18 F
GS
[1 0 0 1 0 0] CT
-26 7 moveto 
1 -1 scale
(0.4) t 
GR
GR
GS
[1 0 0 1 49.9 189.35715] CT
0.149 GC
/Helvetica 18 F
GS
[1 0 0 1 0 0] CT
-26 7 moveto 
1 -1 scale
(0.5) t 
GR
GR
GS
[1 0 0 1 49.9 155.78571] CT
0.149 GC
/Helvetica 18 F
GS
[1 0 0 1 0 0] CT
-26 7 moveto 
1 -1 scale
(0.6) t 
GR
GR
GS
[1 0 0 1 49.9 122.21429] CT
0.149 GC
/Helvetica 18 F
GS
[1 0 0 1 0 0] CT
-26 7 moveto 
1 -1 scale
(0.7) t 
GR
GR
GS
[1 0 0 1 49.9 88.64285] CT
0.149 GC
/Helvetica 18 F
GS
[1 0 0 1 0 0] CT
-26 7 moveto 
1 -1 scale
(0.8) t 
GR
GR
GS
[1 0 0 1 49.9 55.07144] CT
0.149 GC
/Helvetica 18 F
GS
[1 0 0 1 0 0] CT
-26 7 moveto 
1 -1 scale
(0.9) t 
GR
GR
GS
[0 -1 1 0 21.4 138.99989] CT
0.149 GC
/Helvetica 18 F
GS
[1 0 0 1 0 0] CT
-63 -4 moveto 
1 -1 scale
(Mean Accuracy) t 
GR
GR
GS
0.149 GC
1 LJ
0.5 LW
N
55.5 256.5 M
347.5 256.5 L
S
GR
GS
1 0.8 0.8 RC
N
92 256.5 M
92 57.961 L
62.8 57.961 L
62.8 256.5 L
cp
f
GR
GS
0.8 GC
N
121.2 256.5 M
121.2 101.063 L
92 101.063 L
92 256.5 L
cp
f
GR
GS
1 0.8 0.8 RC
N
165 256.5 M
165 72.449 L
135.8 72.449 L
135.8 256.5 L
cp
f
GR
GS
0.8 GC
N
194.2 256.5 M
194.2 111.447 L
165 111.447 L
165 256.5 L
cp
f
GR
GS
1 0.8 0.8 RC
N
238 256.5 M
238 88.209 L
208.8 88.209 L
208.8 256.5 L
cp
f
GR
GS
0.8 GC
N
267.2 256.5 M
267.2 144.925 L
238 144.925 L
238 256.5 L
cp
f
GR
GS
1 0.8 0.8 RC
N
311 256.5 M
311 119.267 L
281.8 119.267 L
281.8 256.5 L
cp
f
GR
GS
0.8 GC
N
340.2 256.5 M
340.2 169.004 L
311 169.004 L
311 256.5 L
cp
f
GR
GS
[8 8] 0 setdash
2 LJ
2 LW
N
55.465 189.357 M
347.535 189.357 L
S
GR
GS
[1 0 0 1 81.6227 45.10491] CT
1 0.302 0.302 RC
N
2.236 0 M
2.236 -1.235 1.235 -2.236 0 -2.236 C
-1.235 -2.236 -2.236 -1.235 -2.236 0 C
-2.236 1.235 -1.235 2.236 0 2.236 C
1.235 2.236 2.236 1.235 2.236 0 C
cp
f
GR
GS
[1 0 0 1 75.40599 68.70982] CT
1 0.302 0.302 RC
N
/f-1586420743{2.236 0 M
2.236 -1.235 1.235 -2.236 0 -2.236 C
-1.235 -2.236 -2.236 -1.235 -2.236 0 C
-2.236 1.235 -1.235 2.236 0 2.236 C
1.235 2.236 2.236 1.235 2.236 0 C
cp}def
f-1586420743
f
GR
GS
[1 0 0 1 75.98266 68.70982] CT
1 0.302 0.302 RC
N
f-1586420743
f
GR
GS
[1 0 0 1 63.03369 24.12277] CT
1 0.302 0.302 RC
N
f-1586420743
f
GR
GS
[1 0 0 1 90.63914 52.97321] CT
1 0.302 0.302 RC
N
f-1586420743
f
GR
GS
[1 0 0 1 82.70214 58.21875] CT
1 0.302 0.302 RC
N
f-1586420743
f
GR
GS
[1 0 0 1 71.99658 40.03422] CT
1 0.302 0.302 RC
N
f-1586420743
f
GR
GS
[1 0 0 1 72.99893 34.61384] CT
1 0.302 0.302 RC
N
f-1586420743
f
GR
GS
[1 0 0 1 90.4857 63.46429] CT
1 0.302 0.302 RC
N
f-1586420743
f
GR
GS
[1 0 0 1 74.16341 50.35044] CT
1 0.302 0.302 RC
N
f-1586420743
f
GR
GS
[1 0 0 1 67.18113 64.1637] CT
1 0.302 0.302 RC
N
f-1586420743
f
GR
GS
[1 0 0 1 86.53591 63.46429] CT
1 0.302 0.302 RC
N
f-1586420743
f
GR
GS
[1 0 0 1 81.56435 45.10491] CT
1 0.302 0.302 RC
N
f-1586420743
f
GR
GS
[1 0 0 1 76.26004 53.14806] CT
1 0.302 0.302 RC
N
f-1586420743
f
GR
GS
[1 0 0 1 87.68255 71.33259] CT
1 0.302 0.302 RC
N
f-1586420743
f
GR
GS
[1 0 0 1 77.4323 159.64204] CT
1 0.302 0.302 RC
N
f-1586420743
f
GR
GS
[1 0 0 1 85.68316 84.79613] CT
1 0.302 0.302 RC
N
f-1586420743
f
GR
GS
[1 0 0 1 91.08045 45.10491] CT
1 0.302 0.302 RC
N
f-1586420743
f
GR
GS
[1 0 0 1 80.95219 47.72768] CT
1 0.302 0.302 RC
N
f-1586420743
f
GR
GS
[1 0 0 1 64.61929 60.84152] CT
1 0.302 0.302 RC
N
f-1586420743
f
GR
GS
[1 0 0 1 89.73763 87.0692] CT
1 0.302 0.302 RC
N
f-1586420743
f
GR
GS
[1 0 0 1 71.01219 45.10491] CT
1 0.302 0.302 RC
N
f-1586420743
f
GR
GS
[1 0 0 1 81.44267 82.52307] CT
1 0.302 0.302 RC
N
f-1586420743
f
GR
GS
[1 0 0 1 85.25646 80.82452] CT
1 0.302 0.302 RC
N
f-1586420743
f
GR
GS
[1 0 0 1 70.21793 68.70982] CT
1 0.302 0.302 RC
N
f-1586420743
f
GR
GS
[1 0 0 1 64.02008 100.85554] CT
1 0.302 0.302 RC
N
f-1586420743
f
GR
GS
[1 0 0 1 68.01746 79.20089] CT
1 0.302 0.302 RC
N
f-1586420743
f
GR
GS
[1 0 0 1 75.45747 39.85938] CT
1 0.302 0.302 RC
N
f-1586420743
f
GR
GS
[1 0 0 1 78.71465 47.72768] CT
1 0.302 0.302 RC
N
f-1586420743
f
GR
GS
[1 0 0 1 82.32813 72.03201] CT
1 0.302 0.302 RC
N
f-1586420743
f
GR
GS
[1 0 0 1 83.36148 39.85938] CT
1 0.302 0.302 RC
N
f-1586420743
f
GR
GS
[1 0 0 1 73.46725 31.99107] CT
1 0.302 0.302 RC
N
f-1586420743
f
GR
GS
[1 0 0 1 90.14841 45.10491] CT
1 0.302 0.302 RC
N
f-1586420743
f
GR
GS
[1 0 0 1 76.08528 34.61384] CT
1 0.302 0.302 RC
N
f-1586420743
f
GR
GS
[1 0 0 1 90.48323 45.10491] CT
1 0.302 0.302 RC
N
f-1586420743
f
GR
GS
[1 0 0 1 85.59778 39.85938] CT
1 0.302 0.302 RC
N
f-1586420743
f
GR
GS
[1 0 0 1 81.22749 40.20907] CT
1 0.302 0.302 RC
N
f-1586420743
f
GR
GS
[1 0 0 1 66.15662 47.72768] CT
1 0.302 0.302 RC
N
f-1586420743
f
GR
GS
[1 0 0 1 65.59447 37.5863] CT
1 0.302 0.302 RC
N
f-1586420743
f
GR
GS
[1 0 0 1 85.39708 60.84152] CT
1 0.302 0.302 RC
N
f-1586420743
f
GR
GS
[1 0 0 1 87.33324 58.21875] CT
1 0.302 0.302 RC
N
f-1586420743
f
GR
GS
[1 0 0 1 85.60172 47.72768] CT
1 0.302 0.302 RC
N
f-1586420743
f
GR
GS
[1 0 0 1 146.80653 34.61384] CT
1 0.302 0.302 RC
N
f-1586420743
f
GR
GS
[1 0 0 1 164.40207 150.01563] CT
1 0.302 0.302 RC
N
f-1586420743
f
GR
GS
[1 0 0 1 141.88863 24.12277] CT
1 0.302 0.302 RC
N
f-1586420743
f
GR
GS
[1 0 0 1 142.59074 187.95833] CT
1 0.302 0.302 RC
N
f-1586420743
f
GR
GS
[1 0 0 1 162.6622 157.88393] CT
1 0.302 0.302 RC
N
f-1586420743
f
GR
GS
[1 0 0 1 163.20944 60.84152] CT
1 0.302 0.302 RC
N
f-1586420743
f
GR
GS
[1 0 0 1 159.9552 24.12277] CT
1 0.302 0.302 RC
N
f-1586420743
f
GR
GS
[1 0 0 1 144.39252 97.56026] CT
1 0.302 0.302 RC
N
f-1586420743
f
GR
GS
[1 0 0 1 160.79019 45.10491] CT
1 0.302 0.302 RC
N
f-1586420743
f
GR
GS
[1 0 0 1 153.9368 24.12277] CT
1 0.302 0.302 RC
N
f-1586420743
f
GR
GS
[1 0 0 1 146.23793 31.99107] CT
1 0.302 0.302 RC
N
f-1586420743
f
GR
GS
[1 0 0 1 152.40198 26.74553] CT
1 0.302 0.302 RC
N
f-1586420743
f
GR
GS
[1 0 0 1 163.75674 26.74553] CT
1 0.302 0.302 RC
N
f-1586420743
f
GR
GS
[1 0 0 1 136.93675 24.12277] CT
1 0.302 0.302 RC
N
f-1586420743
f
GR
GS
[1 0 0 1 157.99377 191.9799] CT
1 0.302 0.302 RC
N
f-1586420743
f
GR
GS
[1 0 0 1 159.23668 181.48885] CT
1 0.302 0.302 RC
N
f-1586420743
f
GR
GS
[1 0 0 1 153.84692 34.61384] CT
1 0.302 0.302 RC
N
f-1586420743
f
GR
GS
[1 0 0 1 163.07588 26.74553] CT
1 0.302 0.302 RC
N
f-1586420743
f
GR
GS
[1 0 0 1 147.34335 92.31474] CT
1 0.302 0.302 RC
N
f-1586420743
f
GR
GS
[1 0 0 1 147.388 212.96205] CT
1 0.302 0.302 RC
N
f-1586420743
f
GR
GS
[1 0 0 1 137.90463 63.46429] CT
1 0.302 0.302 RC
N
f-1586420743
f
GR
GS
[1 0 0 1 161.06731 41.89931] CT
1 0.302 0.302 RC
N
f-1586420743
f
GR
GS
[1 0 0 1 164.18294 69.75893] CT
1 0.302 0.302 RC
N
f-1586420743
f
GR
GS
[1 0 0 1 136.68965 131.45451] CT
1 0.302 0.302 RC
N
f-1586420743
f
GR
GS
[1 0 0 1 154.88408 29.3683] CT
1 0.302 0.302 RC
N
f-1586420743
f
GR
GS
[1 0 0 1 152.93477 151.36674] CT
1 0.302 0.302 RC
N
f-1586420743
f
GR
GS
[1 0 0 1 146.55281 34.61384] CT
1 0.302 0.302 RC
N
f-1586420743
f
GR
GS
[1 0 0 1 137.34676 34.61384] CT
1 0.302 0.302 RC
N
f-1586420743
f
GR
GS
[1 0 0 1 144.7851 21.5] CT
1 0.302 0.302 RC
N
f-1586420743
f
GR
GS
[1 0 0 1 161.5096 94.9375] CT
1 0.302 0.302 RC
N
f-1586420743
f
GR
GS
[1 0 0 1 160.88791 29.3683] CT
1 0.302 0.302 RC
N
f-1586420743
f
GR
GS
[1 0 0 1 161.20076 26.74553] CT
1 0.302 0.302 RC
N
f-1586420743
f
GR
GS
[1 0 0 1 143.4176 39.85938] CT
1 0.302 0.302 RC
N
f-1586420743
f
GR
GS
[1 0 0 1 161.90773 21.5] CT
1 0.302 0.302 RC
N
f-1586420743
f
GR
GS
[1 0 0 1 137.88908 37.23661] CT
1 0.302 0.302 RC
N
f-1586420743
f
GR
GS
[1 0 0 1 139.53868 29.3683] CT
1 0.302 0.302 RC
N
f-1586420743
f
GR
GS
[1 0 0 1 135.80867 166.9762] CT
1 0.302 0.302 RC
N
f-1586420743
f
GR
GS
[1 0 0 1 154.22829 31.99107] CT
1 0.302 0.302 RC
N
f-1586420743
f
GR
GS
[1 0 0 1 158.78438 157.00966] CT
1 0.302 0.302 RC
N
f-1586420743
f
GR
GS
[1 0 0 1 161.87823 24.12277] CT
1 0.302 0.302 RC
N
f-1586420743
f
GR
GS
[1 0 0 1 162.23944 115.04538] CT
1 0.302 0.302 RC
N
f-1586420743
f
GR
GS
[1 0 0 1 159.73032 34.61384] CT
1 0.302 0.302 RC
N
f-1586420743
f
GR
GS
[1 0 0 1 235.48213 82.87277] CT
1 0.302 0.302 RC
N
f-1586420743
f
GR
GS
[1 0 0 1 229.17944 76.57813] CT
1 0.302 0.302 RC
N
f-1586420743
f
GR
GS
[1 0 0 1 212.70387 68.70982] CT
1 0.302 0.302 RC
N
f-1586420743
f
GR
GS
[1 0 0 1 216.48225 39.85938] CT
1 0.302 0.302 RC
N
f-1586420743
f
GR
GS
[1 0 0 1 229.30843 94.9375] CT
1 0.302 0.302 RC
N
f-1586420743
f
GR
GS
[1 0 0 1 216.47354 108.05134] CT
1 0.302 0.302 RC
N
f-1586420743
f
GR
GS
[1 0 0 1 234.13391 92.48958] CT
1 0.302 0.302 RC
N
f-1586420743
f
GR
GS
[1 0 0 1 216.33284 66.08705] CT
1 0.302 0.302 RC
N
f-1586420743
f
GR
GS
[1 0 0 1 223.2047 76.57813] CT
1 0.302 0.302 RC
N
f-1586420743
f
GR
GS
[1 0 0 1 225.74152 81.82366] CT
1 0.302 0.302 RC
N
f-1586420743
f
GR
GS
[1 0 0 1 221.73132 92.31474] CT
1 0.302 0.302 RC
N
f-1586420743
f
GR
GS
[1 0 0 1 225.36847 52.97321] CT
1 0.302 0.302 RC
N
f-1586420743
f
GR
GS
[1 0 0 1 215.12953 79.20089] CT
1 0.302 0.302 RC
N
f-1586420743
f
GR
GS
[1 0 0 1 235.16354 71.33259] CT
1 0.302 0.302 RC
N
f-1586420743
f
GR
GS
[1 0 0 1 215.50566 113.29688] CT
1 0.302 0.302 RC
N
f-1586420743
f
GR
GS
[1 0 0 1 230.62947 157.88393] CT
1 0.302 0.302 RC
N
f-1586420743
f
GR
GS
[1 0 0 1 215.83569 94.23808] CT
1 0.302 0.302 RC
N
f-1586420743
f
GR
GS
[1 0 0 1 232.11818 66.43675] CT
1 0.302 0.302 RC
N
f-1586420743
f
GR
GS
[1 0 0 1 212.3663 123.78795] CT
1 0.302 0.302 RC
N
f-1586420743
f
GR
GS
[1 0 0 1 217.69276 68.70982] CT
1 0.302 0.302 RC
N
f-1586420743
f
GR
GS
[1 0 0 1 215.3856 81.82366] CT
1 0.302 0.302 RC
N
f-1586420743
f
GR
GS
[1 0 0 1 227.53296 99.71676] CT
1 0.302 0.302 RC
N
f-1586420743
f
GR
GS
[1 0 0 1 223.91394 98.68432] CT
1 0.302 0.302 RC
N
f-1586420743
f
GR
GS
[1 0 0 1 234.40714 115.91964] CT
1 0.302 0.302 RC
N
f-1586420743
f
GR
GS
[1 0 0 1 214.7928 45.10491] CT
1 0.302 0.302 RC
N
f-1586420743
f
GR
GS
[1 0 0 1 212.03531 126.41071] CT
1 0.302 0.302 RC
N
f-1586420743
f
GR
GS
[1 0 0 1 215.82123 110.67411] CT
1 0.302 0.302 RC
N
f-1586420743
f
GR
GS
[1 0 0 1 213.36859 97.90997] CT
1 0.302 0.302 RC
N
f-1586420743
f
GR
GS
[1 0 0 1 216.37784 68.70982] CT
1 0.302 0.302 RC
N
f-1586420743
f
GR
GS
[1 0 0 1 235.30997 127.98437] CT
1 0.302 0.302 RC
N
f-1586420743
f
GR
GS
[1 0 0 1 222.43872 79.37574] CT
1 0.302 0.302 RC
N
f-1586420743
f
GR
GS
[1 0 0 1 235.54825 52.97321] CT
1 0.302 0.302 RC
N
f-1586420743
f
GR
GS
[1 0 0 1 218.35637 52.97321] CT
1 0.302 0.302 RC
N
f-1586420743
f
GR
GS
[1 0 0 1 225.18211 79.20089] CT
1 0.302 0.302 RC
N
f-1586420743
f
GR
GS
[1 0 0 1 221.51402 142.14732] CT
1 0.302 0.302 RC
N
f-1586420743
f
GR
GS
[1 0 0 1 213.13081 60.84152] CT
1 0.302 0.302 RC
N
f-1586420743
f
GR
GS
[1 0 0 1 222.42789 91.71525] CT
1 0.302 0.302 RC
N
f-1586420743
f
GR
GS
[1 0 0 1 216.24548 73.95536] CT
1 0.302 0.302 RC
N
f-1586420743
f
GR
GS
[1 0 0 1 219.10048 84.72119] CT
1 0.302 0.302 RC
N
f-1586420743
f
GR
GS
[1 0 0 1 210.81834 94.9375] CT
1 0.302 0.302 RC
N
f-1586420743
f
GR
GS
[1 0 0 1 235.2092 121.16518] CT
1 0.302 0.302 RC
N
f-1586420743
f
GR
GS
[1 0 0 1 237.43871 89.69196] CT
1 0.302 0.302 RC
N
f-1586420743
f
GR
GS
[1 0 0 1 284.82224 131.65625] CT
1 0.302 0.302 RC
N
f-1586420743
f
GR
GS
[1 0 0 1 290.54202 170.99777] CT
1 0.302 0.302 RC
N
f-1586420743
f
GR
GS
[1 0 0 1 302.93829 100.18304] CT
1 0.302 0.302 RC
N
f-1586420743
f
GR
GS
[1 0 0 1 296.35004 60.84152] CT
1 0.302 0.302 RC
N
f-1586420743
f
GR
GS
[1 0 0 1 283.99442 115.91964] CT
1 0.302 0.302 RC
N
f-1586420743
f
GR
GS
[1 0 0 1 297.35745 121.16518] CT
1 0.302 0.302 RC
N
f-1586420743
f
GR
GS
[1 0 0 1 294.09888 102.8058] CT
1 0.302 0.302 RC
N
f-1586420743
f
GR
GS
[1 0 0 1 282.53439 97.56026] CT
1 0.302 0.302 RC
N
f-1586420743
f
GR
GS
[1 0 0 1 305.83655 121.86459] CT
1 0.302 0.302 RC
N
f-1586420743
f
GR
GS
[1 0 0 1 296.4418 95.28719] CT
1 0.302 0.302 RC
N
f-1586420743
f
GR
GS
[1 0 0 1 308.74408 140.39882] CT
1 0.302 0.302 RC
N
f-1586420743
f
GR
GS
[1 0 0 1 283.02402 110.67411] CT
1 0.302 0.302 RC
N
f-1586420743
f
GR
GS
[1 0 0 1 292.16214 131.65625] CT
1 0.302 0.302 RC
N
f-1586420743
f
GR
GS
[1 0 0 1 302.63333 123.78795] CT
1 0.302 0.302 RC
N
f-1586420743
f
GR
GS
[1 0 0 1 305.57401 131.1317] CT
1 0.302 0.302 RC
N
f-1586420743
f
GR
GS
[1 0 0 1 309.99854 199.32365] CT
1 0.302 0.302 RC
N
f-1586420743
f
GR
GS
[1 0 0 1 283.0473 132.53052] CT
1 0.302 0.302 RC
N
f-1586420743
f
GR
GS
[1 0 0 1 287.61133 74.1302] CT
1 0.302 0.302 RC
N
f-1586420743
f
GR
GS
[1 0 0 1 284.14163 115.91964] CT
1 0.302 0.302 RC
N
f-1586420743
f
GR
GS
[1 0 0 1 298.26608 105.42857] CT
1 0.302 0.302 RC
N
f-1586420743
f
GR
GS
[1 0 0 1 309.72879 100.70758] CT
1 0.302 0.302 RC
N
f-1586420743
f
GR
GS
[1 0 0 1 293.35083 150.11848] CT
1 0.302 0.302 RC
N
f-1586420743
f
GR
GS
[1 0 0 1 296.60205 141.79762] CT
1 0.302 0.302 RC
N
f-1586420743
f
GR
GS
[1 0 0 1 289.58493 131.57677] CT
1 0.302 0.302 RC
N
f-1586420743
f
GR
GS
[1 0 0 1 284.00598 115.91964] CT
1 0.302 0.302 RC
N
f-1586420743
f
GR
GS
[1 0 0 1 298.89896 190.2314] CT
1 0.302 0.302 RC
N
f-1586420743
f
GR
GS
[1 0 0 1 289.42374 162.2552] CT
1 0.302 0.302 RC
N
f-1586420743
f
GR
GS
[1 0 0 1 296.46426 108.05134] CT
1 0.302 0.302 RC
N
f-1586420743
f
GR
GS
[1 0 0 1 285.48358 71.33259] CT
1 0.302 0.302 RC
N
f-1586420743
f
GR
GS
[1 0 0 1 307.52914 139.00002] CT
1 0.302 0.302 RC
N
f-1586420743
f
GR
GS
[1 0 0 1 303.04532 77.10267] CT
1 0.302 0.302 RC
N
f-1586420743
f
GR
GS
[1 0 0 1 310.12653 92.66443] CT
1 0.302 0.302 RC
N
f-1586420743
f
GR
GS
[1 0 0 1 296.99985 113.29688] CT
1 0.302 0.302 RC
N
f-1586420743
f
GR
GS
[1 0 0 1 282.66699 40.38392] CT
1 0.302 0.302 RC
N
f-1586420743
f
GR
GS
[1 0 0 1 281.99878 164.17857] CT
1 0.302 0.302 RC
N
f-1586420743
f
GR
GS
[1 0 0 1 309.48401 76.57813] CT
1 0.302 0.302 RC
N
f-1586420743
f
GR
GS
[1 0 0 1 301.93063 90.56622] CT
1 0.302 0.302 RC
N
f-1586420743
f
GR
GS
[1 0 0 1 302.36777 142.14732] CT
1 0.302 0.302 RC
N
f-1586420743
f
GR
GS
[1 0 0 1 298.20728 116.96876] CT
1 0.302 0.302 RC
N
f-1586420743
f
GR
GS
[1 0 0 1 307.59317 123.78795] CT
1 0.302 0.302 RC
N
f-1586420743
f
GR
GS
[1 0 0 1 299.66092 148.26712] CT
1 0.302 0.302 RC
N
f-1586420743
f
GR
GS
[1 0 0 1 301.25943 129.03348] CT
1 0.302 0.302 RC
N
f-1586420743
f
GR
GS
[1 0 0 1 94.55707 121.16518] CT
0.302 GC
N
f-1586420743
f
GR
GS
[1 0 0 1 114.75271 84.44643] CT
0.302 GC
N
f-1586420743
f
GR
GS
[1 0 0 1 109.46735 55.59598] CT
0.302 GC
N
f-1586420743
f
GR
GS
[1 0 0 1 96.68228 199.00085] CT
0.302 GC
N
f-1586420743
f
GR
GS
[1 0 0 1 93.97664 47.72768] CT
0.302 GC
N
f-1586420743
f
GR
GS
[1 0 0 1 95.90887 83.88921] CT
0.302 GC
N
f-1586420743
f
GR
GS
[1 0 0 1 115.29494 45.10491] CT
0.302 GC
N
f-1586420743
f
GR
GS
[1 0 0 1 96.97818 108.05134] CT
0.302 GC
N
f-1586420743
f
GR
GS
[1 0 0 1 92.39038 115.91964] CT
0.302 GC
N
f-1586420743
f
GR
GS
[1 0 0 1 93.98888 52.97321] CT
0.302 GC
N
f-1586420743
f
GR
GS
[1 0 0 1 97.03907 84.44643] CT
0.302 GC
N
f-1586420743
f
GR
GS
[1 0 0 1 116.86948 155.46098] CT
0.302 GC
N
f-1586420743
f
GR
GS
[1 0 0 1 108.25309 110.67411] CT
0.302 GC
N
f-1586420743
f
GR
GS
[1 0 0 1 118.61899 115.91964] CT
0.302 GC
N
f-1586420743
f
GR
GS
[1 0 0 1 116.81362 110.67411] CT
0.302 GC
N
f-1586420743
f
GR
GS
[1 0 0 1 113.81854 73.95536] CT
0.302 GC
N
f-1586420743
f
GR
GS
[1 0 0 1 92.75156 97.56026] CT
0.302 GC
N
f-1586420743
f
GR
GS
[1 0 0 1 99.5789 63.46429] CT
0.302 GC
N
f-1586420743
f
GR
GS
[1 0 0 1 120.1823 108.05134] CT
0.302 GC
N
f-1586420743
f
GR
GS
[1 0 0 1 117.31474 140.54868] CT
0.302 GC
N
f-1586420743
f
GR
GS
[1 0 0 1 111.23808 68.70982] CT
0.302 GC
N
f-1586420743
f
GR
GS
[1 0 0 1 103.89178 100.18304] CT
0.302 GC
N
f-1586420743
f
GR
GS
[1 0 0 1 110.60911 84.62128] CT
0.302 GC
N
f-1586420743
f
GR
GS
[1 0 0 1 102.6573 105.42857] CT
0.302 GC
N
f-1586420743
f
GR
GS
[1 0 0 1 97.71737 55.94568] CT
0.302 GC
N
f-1586420743
f
GR
GS
[1 0 0 1 118.14069 73.14695] CT
0.302 GC
N
f-1586420743
f
GR
GS
[1 0 0 1 101.45499 63.46429] CT
0.302 GC
N
f-1586420743
f
GR
GS
[1 0 0 1 112.33839 60.84152] CT
0.302 GC
N
f-1586420743
f
GR
GS
[1 0 0 1 101.98135 100.18304] CT
0.302 GC
N
f-1586420743
f
GR
GS
[1 0 0 1 105.12975 102.8058] CT
0.302 GC
N
f-1586420743
f
GR
GS
[1 0 0 1 99.31643 79.49232] CT
0.302 GC
N
f-1586420743
f
GR
GS
[1 0 0 1 103.19075 71.33259] CT
0.302 GC
N
f-1586420743
f
GR
GS
[1 0 0 1 112.83546 129.03348] CT
0.302 GC
N
f-1586420743
f
GR
GS
[1 0 0 1 107.31656 83.57217] CT
0.302 GC
N
f-1586420743
f
GR
GS
[1 0 0 1 102.19438 150.01563] CT
0.302 GC
N
f-1586420743
f
GR
GS
[1 0 0 1 119.13402 176.2433] CT
0.302 GC
N
f-1586420743
f
GR
GS
[1 0 0 1 105.11591 151.75803] CT
0.302 GC
N
f-1586420743
f
GR
GS
[1 0 0 1 96.65592 90.99663] CT
0.302 GC
N
f-1586420743
f
GR
GS
[1 0 0 1 113.38239 79.20089] CT
0.302 GC
N
f-1586420743
f
GR
GS
[1 0 0 1 116.83414 110.67411] CT
0.302 GC
N
f-1586420743
f
GR
GS
[1 0 0 1 104.28692 198.34949] CT
0.302 GC
N
f-1586420743
f
GR
GS
[1 0 0 1 113.03848 193.02902] CT
0.302 GC
N
f-1586420743
f
GR
GS
[1 0 0 1 99.20694 205.09375] CT
0.302 GC
N
f-1586420743
f
GR
GS
[1 0 0 1 98.54372 58.21875] CT
0.302 GC
N
f-1586420743
f
GR
GS
[1 0 0 1 119.52102 73.95536] CT
0.302 GC
N
f-1586420743
f
GR
GS
[1 0 0 1 104.71251 73.95536] CT
0.302 GC
N
f-1586420743
f
GR
GS
[1 0 0 1 101.93515 134.27902] CT
0.302 GC
N
f-1586420743
f
GR
GS
[1 0 0 1 106.11003 72.55655] CT
0.302 GC
N
f-1586420743
f
GR
GS
[1 0 0 1 118.70559 58.21875] CT
0.302 GC
N
f-1586420743
f
GR
GS
[1 0 0 1 120.93406 34.61384] CT
0.302 GC
N
f-1586420743
f
GR
GS
[1 0 0 1 103.42641 76.57813] CT
0.302 GC
N
f-1586420743
f
GR
GS
[1 0 0 1 96.34041 141.44791] CT
0.302 GC
N
f-1586420743
f
GR
GS
[1 0 0 1 113.69788 123.78795] CT
0.302 GC
N
f-1586420743
f
GR
GS
[1 0 0 1 171.38211 125.53645] CT
0.302 GC
N
f-1586420743
f
GR
GS
[1 0 0 1 178.99329 76.57813] CT
0.302 GC
N
f-1586420743
f
GR
GS
[1 0 0 1 173.33469 45.10491] CT
0.302 GC
N
f-1586420743
f
GR
GS
[1 0 0 1 192.55339 180.66454] CT
0.302 GC
N
f-1586420743
f
GR
GS
[1 0 0 1 187.70596 123.78795] CT
0.302 GC
N
f-1586420743
f
GR
GS
[1 0 0 1 179.37392 149.16251] CT
0.302 GC
N
f-1586420743
f
GR
GS
[1 0 0 1 176.92949 60.84152] CT
0.302 GC
N
f-1586420743
f
GR
GS
[1 0 0 1 176.45602 75.35416] CT
0.302 GC
N
f-1586420743
f
GR
GS
[1 0 0 1 179.20461 73.95536] CT
0.302 GC
N
f-1586420743
f
GR
GS
[1 0 0 1 171.27586 47.72768] CT
0.302 GC
N
f-1586420743
f
GR
GS
[1 0 0 1 168.3172 68.88467] CT
0.302 GC
N
f-1586420743
f
GR
GS
[1 0 0 1 168.58046 191.9799] CT
0.302 GC
N
f-1586420743
f
GR
GS
[1 0 0 1 181.28683 92.31474] CT
0.302 GC
N
f-1586420743
f
GR
GS
[1 0 0 1 167.2673 45.10491] CT
0.302 GC
N
f-1586420743
f
GR
GS
[1 0 0 1 180.16461 50.35044] CT
0.302 GC
N
f-1586420743
f
GR
GS
[1 0 0 1 193.59695 97.56026] CT
0.302 GC
N
f-1586420743
f
GR
GS
[1 0 0 1 186.26567 71.33259] CT
0.302 GC
N
f-1586420743
f
GR
GS
[1 0 0 1 175.8286 176.2433] CT
0.302 GC
N
f-1586420743
f
GR
GS
[1 0 0 1 171.06998 129.73289] CT
0.302 GC
N
f-1586420743
f
GR
GS
[1 0 0 1 174.39781 195.30208] CT
0.302 GC
N
f-1586420743
f
GR
GS
[1 0 0 1 174.71536 110.67411] CT
0.302 GC
N
f-1586420743
f
GR
GS
[1 0 0 1 192.3438 150.01563] CT
0.302 GC
N
f-1586420743
f
GR
GS
[1 0 0 1 182.93686 157.88393] CT
0.302 GC
N
f-1586420743
f
GR
GS
[1 0 0 1 184.56754 165.75223] CT
0.302 GC
N
f-1586420743
f
GR
GS
[1 0 0 1 165.37971 177.29242] CT
0.302 GC
N
f-1586420743
f
GR
GS
[1 0 0 1 167.60568 121.99332] CT
0.302 GC
N
f-1586420743
f
GR
GS
[1 0 0 1 177.27927 79.20089] CT
0.302 GC
N
f-1586420743
f
GR
GS
[1 0 0 1 171.54585 123.78795] CT
0.302 GC
N
f-1586420743
f
GR
GS
[1 0 0 1 190.94142 100.18304] CT
0.302 GC
N
f-1586420743
f
GR
GS
[1 0 0 1 192.57567 131.65625] CT
0.302 GC
N
f-1586420743
f
GR
GS
[1 0 0 1 173.79784 103.99797] CT
0.302 GC
N
f-1586420743
f
GR
GS
[1 0 0 1 165.466 71.33259] CT
0.302 GC
N
f-1586420743
f
GR
GS
[1 0 0 1 181.57915 105.42857] CT
0.302 GC
N
f-1586420743
f
GR
GS
[1 0 0 1 183.64757 157.88393] CT
0.302 GC
N
f-1586420743
f
GR
GS
[1 0 0 1 170.05513 45.10491] CT
0.302 GC
N
f-1586420743
f
GR
GS
[1 0 0 1 188.35777 150.01563] CT
0.302 GC
N
f-1586420743
f
GR
GS
[1 0 0 1 183.04384 147.98849] CT
0.302 GC
N
f-1586420743
f
GR
GS
[1 0 0 1 190.73857 155.26115] CT
0.302 GC
N
f-1586420743
f
GR
GS
[1 0 0 1 182.45084 71.33259] CT
0.302 GC
N
f-1586420743
f
GR
GS
[1 0 0 1 170.72818 123.78795] CT
0.302 GC
N
f-1586420743
f
GR
GS
[1 0 0 1 165.0121 189.35715] CT
0.302 GC
N
f-1586420743
f
GR
GS
[1 0 0 1 169.68108 165.75223] CT
0.302 GC
N
f-1586420743
f
GR
GS
[1 0 0 1 191.47192 94.9375] CT
0.302 GC
N
f-1586420743
f
GR
GS
[1 0 0 1 166.31293 58.21875] CT
0.302 GC
N
f-1586420743
f
GR
GS
[1 0 0 1 167.15291 94.9375] CT
0.302 GC
N
f-1586420743
f
GR
GS
[1 0 0 1 165.54907 168.375] CT
0.302 GC
N
f-1586420743
f
GR
GS
[1 0 0 1 175.46683 163.12947] CT
0.302 GC
N
f-1586420743
f
GR
GS
[1 0 0 1 180.93013 42.48214] CT
0.302 GC
N
f-1586420743
f
GR
GS
[1 0 0 1 194.13989 52.97321] CT
0.302 GC
N
f-1586420743
f
GR
GS
[1 0 0 1 187.53624 81.82366] CT
0.302 GC
N
f-1586420743
f
GR
GS
[1 0 0 1 169.25845 39.85938] CT
0.302 GC
N
f-1586420743
f
GR
GS
[1 0 0 1 191.2493 95.11235] CT
0.302 GC
N
f-1586420743
f
GR
GS
[1 0 0 1 184.38625 131.65625] CT
0.302 GC
N
f-1586420743
f
GR
GS
[1 0 0 1 239.52406 198.97397] CT
0.302 GC
N
f-1586420743
f
GR
GS
[1 0 0 1 245.87753 126.41071] CT
0.302 GC
N
f-1586420743
f
GR
GS
[1 0 0 1 249.29651 123.78795] CT
0.302 GC
N
f-1586420743
f
GR
GS
[1 0 0 1 262.6322 196.17633] CT
0.302 GC
N
f-1586420743
f
GR
GS
[1 0 0 1 263.81235 115.91964] CT
0.302 GC
N
f-1586420743
f
GR
GS
[1 0 0 1 241.81723 179.89981] CT
0.302 GC
N
f-1586420743
f
GR
GS
[1 0 0 1 258.53049 76.57813] CT
0.302 GC
N
f-1586420743
f
GR
GS
[1 0 0 1 255.36432 173.62053] CT
0.302 GC
N
f-1586420743
f
GR
GS
[1 0 0 1 250.81642 123.78795] CT
0.302 GC
N
f-1586420743
f
GR
GS
[1 0 0 1 261.36276 147.39285] CT
0.302 GC
N
f-1586420743
f
GR
GS
[1 0 0 1 239.37537 131.65625] CT
0.302 GC
N
f-1586420743
f
GR
GS
[1 0 0 1 265.6637 167.15105] CT
0.302 GC
N
f-1586420743
f
GR
GS
[1 0 0 1 241.52916 89.69196] CT
0.302 GC
N
f-1586420743
f
GR
GS
[1 0 0 1 247.96826 105.42857] CT
0.302 GC
N
f-1586420743
f
GR
GS
[1 0 0 1 244.30435 147.39285] CT
0.302 GC
N
f-1586420743
f
GR
GS
[1 0 0 1 265.88641 92.31474] CT
0.302 GC
N
f-1586420743
f
GR
GS
[1 0 0 1 253.16882 129.03348] CT
0.302 GC
N
f-1586420743
f
GR
GS
[1 0 0 1 252.34435 181.48885] CT
0.302 GC
N
f-1586420743
f
GR
GS
[1 0 0 1 257.77771 189.35715] CT
0.302 GC
N
f-1586420743
f
GR
GS
[1 0 0 1 239.15225 204.9189] CT
0.302 GC
N
f-1586420743
f
GR
GS
[1 0 0 1 247.62558 136.90178] CT
0.302 GC
N
f-1586420743
f
GR
GS
[1 0 0 1 260.39999 102.8058] CT
0.302 GC
N
f-1586420743
f
GR
GS
[1 0 0 1 242.32549 148.26712] CT
0.302 GC
N
f-1586420743
f
GR
GS
[1 0 0 1 252.70686 157.88393] CT
0.302 GC
N
f-1586420743
f
GR
GS
[1 0 0 1 240.00325 136.90178] CT
0.302 GC
N
f-1586420743
f
GR
GS
[1 0 0 1 252.01811 135.62785] CT
0.302 GC
N
f-1586420743
f
GR
GS
[1 0 0 1 263.49408 102.8058] CT
0.302 GC
N
f-1586420743
f
GR
GS
[1 0 0 1 248.57025 108.05134] CT
0.302 GC
N
f-1586420743
f
GR
GS
[1 0 0 1 256.13864 178.86607] CT
0.302 GC
N
f-1586420743
f
GR
GS
[1 0 0 1 260.12924 134.27902] CT
0.302 GC
N
f-1586420743
f
GR
GS
[1 0 0 1 263.34274 171.87202] CT
0.302 GC
N
f-1586420743
f
GR
GS
[1 0 0 1 238.76163 118.54241] CT
0.302 GC
N
f-1586420743
f
GR
GS
[1 0 0 1 240.97757 173.62053] CT
0.302 GC
N
f-1586420743
f
GR
GS
[1 0 0 1 243.53143 177.81696] CT
0.302 GC
N
f-1586420743
f
GR
GS
[1 0 0 1 241.90761 110.67411] CT
0.302 GC
N
f-1586420743
f
GR
GS
[1 0 0 1 246.28175 170.99777] CT
0.302 GC
N
f-1586420743
f
GR
GS
[1 0 0 1 239.41759 195.19833] CT
0.302 GC
N
f-1586420743
f
GR
GS
[1 0 0 1 261.28485 170.99777] CT
0.302 GC
N
f-1586420743
f
GR
GS
[1 0 0 1 243.14928 110.67411] CT
0.302 GC
N
f-1586420743
f
GR
GS
[1 0 0 1 254.77238 102.8058] CT
0.302 GC
N
f-1586420743
f
GR
GS
[1 0 0 1 246.67726 178.86607] CT
0.302 GC
N
f-1586420743
f
GR
GS
[1 0 0 1 238.54329 173.62053] CT
0.302 GC
N
f-1586420743
f
GR
GS
[1 0 0 1 242.18753 163.12947] CT
0.302 GC
N
f-1586420743
f
GR
GS
[1 0 0 1 264.32333 142.14732] CT
0.302 GC
N
f-1586420743
f
GR
GS
[1 0 0 1 244.18111 152.6384] CT
0.302 GC
N
f-1586420743
f
GR
GS
[1 0 0 1 241.55612 115.91964] CT
0.302 GC
N
f-1586420743
f
GR
GS
[1 0 0 1 240.20985 144.7701] CT
0.302 GC
N
f-1586420743
f
GR
GS
[1 0 0 1 255.83614 165.75223] CT
0.302 GC
N
f-1586420743
f
GR
GS
[1 0 0 1 253.16708 173.62053] CT
0.302 GC
N
f-1586420743
f
GR
GS
[1 0 0 1 265.00775 97.56026] CT
0.302 GC
N
f-1586420743
f
GR
GS
[1 0 0 1 257.71234 87.0692] CT
0.302 GC
N
f-1586420743
f
GR
GS
[1 0 0 1 250.07852 163.12947] CT
0.302 GC
N
f-1586420743
f
GR
GS
[1 0 0 1 261.73859 176.2433] CT
0.302 GC
N
f-1586420743
f
GR
GS
[1 0 0 1 332.14911 159.10789] CT
0.302 GC
N
f-1586420743
f
GR
GS
[1 0 0 1 334.94394 184.1116] CT
0.302 GC
N
f-1586420743
f
GR
GS
[1 0 0 1 315.40228 152.6384] CT
0.302 GC
N
f-1586420743
f
GR
GS
[1 0 0 1 312.00409 202.64583] CT
0.302 GC
N
f-1586420743
f
GR
GS
[1 0 0 1 336.74136 168.375] CT
0.302 GC
N
f-1586420743
f
GR
GS
[1 0 0 1 335.58591 171.97194] CT
0.302 GC
N
f-1586420743
f
GR
GS
[1 0 0 1 337.08685 147.39285] CT
0.302 GC
N
f-1586420743
f
GR
GS
[1 0 0 1 315.60449 176.2433] CT
0.302 GC
N
f-1586420743
f
GR
GS
[1 0 0 1 319.66425 199.84822] CT
0.302 GC
N
f-1586420743
f
GR
GS
[1 0 0 1 326.41714 165.75223] CT
0.302 GC
N
f-1586420743
f
GR
GS
[1 0 0 1 322.79001 151.23958] CT
0.302 GC
N
f-1586420743
f
GR
GS
[1 0 0 1 332.87924 144.12064] CT
0.302 GC
N
f-1586420743
f
GR
GS
[1 0 0 1 312.88113 142.14732] CT
0.302 GC
N
f-1586420743
f
GR
GS
[1 0 0 1 334.2955 184.1116] CT
0.302 GC
N
f-1586420743
f
GR
GS
[1 0 0 1 318.20419 184.1116] CT
0.302 GC
N
f-1586420743
f
GR
GS
[1 0 0 1 329.36191 170.99777] CT
0.302 GC
N
f-1586420743
f
GR
GS
[1 0 0 1 333.02197 173.62053] CT
0.302 GC
N
f-1586420743
f
GR
GS
[1 0 0 1 315.38834 134.27902] CT
0.302 GC
N
f-1586420743
f
GR
GS
[1 0 0 1 332.07281 176.2433] CT
0.302 GC
N
f-1586420743
f
GR
GS
[1 0 0 1 326.86118 202.38068] CT
0.302 GC
N
f-1586420743
f
GR
GS
[1 0 0 1 321.00256 156.31027] CT
0.302 GC
N
f-1586420743
f
GR
GS
[1 0 0 1 320.62848 170.99777] CT
0.302 GC
N
f-1586420743
f
GR
GS
[1 0 0 1 323.60333 185.51042] CT
0.302 GC
N
f-1586420743
f
GR
GS
[1 0 0 1 330.21198 152.6384] CT
0.302 GC
N
f-1586420743
f
GR
GS
[1 0 0 1 315.00482 151.06474] CT
0.302 GC
N
f-1586420743
f
GR
GS
[1 0 0 1 320.67883 173.09599] CT
0.302 GC
N
f-1586420743
f
GR
GS
[1 0 0 1 330.22797 129.03348] CT
0.302 GC
N
f-1586420743
f
GR
GS
[1 0 0 1 332.90057 159.98215] CT
0.302 GC
N
f-1586420743
f
GR
GS
[1 0 0 1 318.26993 147.39285] CT
0.302 GC
N
f-1586420743
f
GR
GS
[1 0 0 1 333.22586 181.48885] CT
0.302 GC
N
f-1586420743
f
GR
GS
[1 0 0 1 327.06131 191.93956] CT
0.302 GC
N
f-1586420743
f
GR
GS
[1 0 0 1 315.30115 144.7701] CT
0.302 GC
N
f-1586420743
f
GR
GS
[1 0 0 1 316.18387 197.22545] CT
0.302 GC
N
f-1586420743
f
GR
GS
[1 0 0 1 319.93631 171.69719] CT
0.302 GC
N
f-1586420743
f
GR
GS
[1 0 0 1 322.56943 160.5067] CT
0.302 GC
N
f-1586420743
f
GR
GS
[1 0 0 1 339.48288 173.62053] CT
0.302 GC
N
f-1586420743
f
GR
GS
[1 0 0 1 321.41309 166.70335] CT
0.302 GC
N
f-1586420743
f
GR
GS
[1 0 0 1 324.08499 173.62053] CT
0.302 GC
N
f-1586420743
f
GR
GS
[1 0 0 1 311.4996 123.78795] CT
0.302 GC
N
f-1586420743
f
GR
GS
[1 0 0 1 319.42233 178.86607] CT
0.302 GC
N
f-1586420743
f
GR
GS
[1 0 0 1 339.04016 210.33928] CT
0.302 GC
N
f-1586420743
f
GR
GS
[1 0 0 1 314.54074 202.47098] CT
0.302 GC
N
f-1586420743
f
GR
GS
[1 0 0 1 335.54556 189.35715] CT
0.302 GC
N
f-1586420743
f
GR
GS
[1 0 0 1 318.35397 150.01563] CT
0.302 GC
N
f-1586420743
f
GR
GS
[1 0 0 1 315.82373 160.5067] CT
0.302 GC
N
f-1586420743
f
GR
GS
[1 0 0 1 320.30258 169.59895] CT
0.302 GC
N
f-1586420743
f
GR
GS
[1 0 0 1 318.50571 168.375] CT
0.302 GC
N
f-1586420743
f
GR
GS
[1 0 0 1 315.0723 191.84593] CT
0.302 GC
N
f-1586420743
f
GR
GS
[1 0 0 1 332.97351 184.1116] CT
0.302 GC
N
f-1586420743
f
GR
GS
[1 0 0 1 319.14462 157.00966] CT
0.302 GC
N
f-1586420743
f
GR
GS
[1 0 0 1 331.56088 118.54241] CT
0.302 GC
N
f-1586420743
f
GR
GS
[1 0 0 1 319.52753 181.48885] CT
0.302 GC
N
f-1586420743
f
GR
GS
[1 0 0 1 339.53513 191.9799] CT
0.302 GC
N
f-1586420743
f
GR
GS
[1 0 0 1 77.4 239.71429] CT
/Helvetica-Bold 18 F
GS
[1 0 0 1 0 0] CT
-11 7 moveto 
1 -1 scale
(***) t 
GR
GR
GS
[1 0 0 1 106.60001 239.71429] CT
/Helvetica-Bold 18 F
GS
[1 0 0 1 0 0] CT
-11 7 moveto 
1 -1 scale
(***) t 
GR
GR
GS
[1 0 0 1 150.39999 239.71429] CT
/Helvetica-Bold 18 F
GS
[1 0 0 1 0 0] CT
-11 7 moveto 
1 -1 scale
(***) t 
GR
GR
GS
[1 0 0 1 179.60001 239.71429] CT
/Helvetica-Bold 18 F
GS
[1 0 0 1 0 0] CT
-11 7 moveto 
1 -1 scale
(***) t 
GR
GR
GS
[1 0 0 1 223.39999 239.71429] CT
/Helvetica-Bold 18 F
GS
[1 0 0 1 0 0] CT
-11 7 moveto 
1 -1 scale
(***) t 
GR
GR
GS
[1 0 0 1 252.60001 239.71429] CT
/Helvetica-Bold 18 F
GS
[1 0 0 1 0 0] CT
-11 7 moveto 
1 -1 scale
(***) t 
GR
GR
GS
[1 0 0 1 296.39999 239.71429] CT
/Helvetica-Bold 18 F
GS
[1 0 0 1 0 0] CT
-11 7 moveto 
1 -1 scale
(***) t 
GR
GR
GS
[1 0 0 1 325.59998 239.71429] CT
/Helvetica-Bold 18 F
GS
[1 0 0 1 0 0] CT
-11 7 moveto 
1 -1 scale
(***) t 
GR
GR
%%Trailer
%%Pages: 1
%%EOF
