%!PS-Adobe-3.0 EPSF-3.0
%%Creator: (MATLAB, The Mathworks, Inc. Version 9.1.0.441655 \(R2016b\). Operating System: Mac OS X)
%%Title: /Volumes/LNDG/Projects/StateSwitch/dynamic/data/behavior/STSW_dynamic/B_reliabilityAcrossSessions/C_figures/E2_vsGuess_OA.eps
%%CreationDate: 2021-04-20T14:07:15
%%Pages: (atend)
%%BoundingBox:    76     5   931   282
%%LanguageLevel: 3
%%EndComments
%%BeginProlog
%%BeginResource: procset (Apache XML Graphics Std ProcSet) 1.2 0
%%Version: 1.2 0
%%Copyright: (Copyright 2001-2003,2010 The Apache Software Foundation. License terms: http://www.apache.org/licenses/LICENSE-2.0)
/bd{bind def}bind def
/ld{load def}bd
/GR/grestore ld
/M/moveto ld
/LJ/setlinejoin ld
/C/curveto ld
/f/fill ld
/LW/setlinewidth ld
/GC/setgray ld
/t/show ld
/N/newpath ld
/CT/concat ld
/cp/closepath ld
/S/stroke ld
/L/lineto ld
/CC/setcmykcolor ld
/A/ashow ld
/GS/gsave ld
/RC/setrgbcolor ld
/RM/rmoveto ld
/ML/setmiterlimit ld
/re {4 2 roll M
1 index 0 rlineto
0 exch rlineto
neg 0 rlineto
cp } bd
/_ctm matrix def
/_tm matrix def
/BT { _ctm currentmatrix pop matrix _tm copy pop 0 0 moveto } bd
/ET { _ctm setmatrix } bd
/iTm { _ctm setmatrix _tm concat } bd
/Tm { _tm astore pop iTm 0 0 moveto } bd
/ux 0.0 def
/uy 0.0 def
/F {
  /Tp exch def
  /Tf exch def
  Tf findfont Tp scalefont setfont
  /cf Tf def  /cs Tp def
} bd
/ULS {currentpoint /uy exch def /ux exch def} bd
/ULE {
  /Tcx currentpoint pop def
  gsave
  newpath
  cf findfont cs scalefont dup
  /FontMatrix get 0 get /Ts exch def /FontInfo get dup
  /UnderlinePosition get Ts mul /To exch def
  /UnderlineThickness get Ts mul /Tt exch def
  ux uy To add moveto  Tcx uy To add lineto
  Tt setlinewidth stroke
  grestore
} bd
/OLE {
  /Tcx currentpoint pop def
  gsave
  newpath
  cf findfont cs scalefont dup
  /FontMatrix get 0 get /Ts exch def /FontInfo get dup
  /UnderlinePosition get Ts mul /To exch def
  /UnderlineThickness get Ts mul /Tt exch def
  ux uy To add cs add moveto Tcx uy To add cs add lineto
  Tt setlinewidth stroke
  grestore
} bd
/SOE {
  /Tcx currentpoint pop def
  gsave
  newpath
  cf findfont cs scalefont dup
  /FontMatrix get 0 get /Ts exch def /FontInfo get dup
  /UnderlinePosition get Ts mul /To exch def
  /UnderlineThickness get Ts mul /Tt exch def
  ux uy To add cs 10 mul 26 idiv add moveto Tcx uy To add cs 10 mul 26 idiv add lineto
  Tt setlinewidth stroke
  grestore
} bd
/QT {
/Y22 exch store
/X22 exch store
/Y21 exch store
/X21 exch store
currentpoint
/Y21 load 2 mul add 3 div exch
/X21 load 2 mul add 3 div exch
/X21 load 2 mul /X22 load add 3 div
/Y21 load 2 mul /Y22 load add 3 div
/X22 load /Y22 load curveto
} bd
/SSPD {
dup length /d exch dict def
{
/v exch def
/k exch def
currentpagedevice k known {
/cpdv currentpagedevice k get def
v cpdv ne {
/upd false def
/nullv v type /nulltype eq def
/nullcpdv cpdv type /nulltype eq def
nullv nullcpdv or
{
/upd true def
} {
/sametype v type cpdv type eq def
sametype {
v type /arraytype eq {
/vlen v length def
/cpdvlen cpdv length def
vlen cpdvlen eq {
0 1 vlen 1 sub {
/i exch def
/obj v i get def
/cpdobj cpdv i get def
obj cpdobj ne {
/upd true def
exit
} if
} for
} {
/upd true def
} ifelse
} {
v type /dicttype eq {
v {
/dv exch def
/dk exch def
/cpddv cpdv dk get def
dv cpddv ne {
/upd true def
exit
} if
} forall
} {
/upd true def
} ifelse
} ifelse
} if
} ifelse
upd true eq {
d k v put
} if
} if
} if
} forall
d length 0 gt {
d setpagedevice
} if
} bd
/RE { % /NewFontName [NewEncodingArray] /FontName RE -
  findfont dup length dict begin
  {
    1 index /FID ne
    {def} {pop pop} ifelse
  } forall
  /Encoding exch def
  /FontName 1 index def
  currentdict definefont pop
  end
} bind def
%%EndResource
%%BeginResource: procset (Apache XML Graphics EPS ProcSet) 1.0 0
%%Version: 1.0 0
%%Copyright: (Copyright 2002-2003 The Apache Software Foundation. License terms: http://www.apache.org/licenses/LICENSE-2.0)
/BeginEPSF { %def
/b4_Inc_state save def         % Save state for cleanup
/dict_count countdictstack def % Count objects on dict stack
/op_count count 1 sub def      % Count objects on operand stack
userdict begin                 % Push userdict on dict stack
/showpage { } def              % Redefine showpage, { } = null proc
0 setgray 0 setlinecap         % Prepare graphics state
1 setlinewidth 0 setlinejoin
10 setmiterlimit [ ] 0 setdash newpath
/languagelevel where           % If level not equal to 1 then
{pop languagelevel             % set strokeadjust and
1 ne                           % overprint to their defaults.
{false setstrokeadjust false setoverprint
} if
} if
} bd
/EndEPSF { %def
count op_count sub {pop} repeat            % Clean up stacks
countdictstack dict_count sub {end} repeat
b4_Inc_state restore
} bd
%%EndResource
%FOPBeginFontDict
%%IncludeResource: font Courier-Bold
%%IncludeResource: font Helvetica
%%IncludeResource: font Courier-BoldOblique
%%IncludeResource: font Courier-Oblique
%%IncludeResource: font Times-Roman
%%IncludeResource: font Helvetica-BoldOblique
%%IncludeResource: font Helvetica-Bold
%%IncludeResource: font Helvetica-Oblique
%%IncludeResource: font Times-BoldItalic
%%IncludeResource: font Courier
%%IncludeResource: font Times-Italic
%%IncludeResource: font Times-Bold
%%IncludeResource: font Symbol
%%IncludeResource: font ZapfDingbats
%FOPEndFontDict
%%BeginResource: encoding WinAnsiEncoding
/WinAnsiEncoding [
/.notdef /.notdef /.notdef /.notdef /.notdef
/.notdef /.notdef /.notdef /.notdef /.notdef
/.notdef /.notdef /.notdef /.notdef /.notdef
/.notdef /.notdef /.notdef /.notdef /.notdef
/.notdef /.notdef /.notdef /.notdef /.notdef
/.notdef /.notdef /.notdef /.notdef /.notdef
/.notdef /.notdef /space /exclam /quotedbl
/numbersign /dollar /percent /ampersand /quotesingle
/parenleft /parenright /asterisk /plus /comma
/hyphen /period /slash /zero /one
/two /three /four /five /six
/seven /eight /nine /colon /semicolon
/less /equal /greater /question /at
/A /B /C /D /E
/F /G /H /I /J
/K /L /M /N /O
/P /Q /R /S /T
/U /V /W /X /Y
/Z /bracketleft /backslash /bracketright /asciicircum
/underscore /quoteleft /a /b /c
/d /e /f /g /h
/i /j /k /l /m
/n /o /p /q /r
/s /t /u /v /w
/x /y /z /braceleft /bar
/braceright /asciitilde /bullet /Euro /bullet
/quotesinglbase /florin /quotedblbase /ellipsis /dagger
/daggerdbl /circumflex /perthousand /Scaron /guilsinglleft
/OE /bullet /Zcaron /bullet /bullet
/quoteleft /quoteright /quotedblleft /quotedblright /bullet
/endash /emdash /asciitilde /trademark /scaron
/guilsinglright /oe /bullet /zcaron /Ydieresis
/space /exclamdown /cent /sterling /currency
/yen /brokenbar /section /dieresis /copyright
/ordfeminine /guillemotleft /logicalnot /sfthyphen /registered
/macron /degree /plusminus /twosuperior /threesuperior
/acute /mu /paragraph /middot /cedilla
/onesuperior /ordmasculine /guillemotright /onequarter /onehalf
/threequarters /questiondown /Agrave /Aacute /Acircumflex
/Atilde /Adieresis /Aring /AE /Ccedilla
/Egrave /Eacute /Ecircumflex /Edieresis /Igrave
/Iacute /Icircumflex /Idieresis /Eth /Ntilde
/Ograve /Oacute /Ocircumflex /Otilde /Odieresis
/multiply /Oslash /Ugrave /Uacute /Ucircumflex
/Udieresis /Yacute /Thorn /germandbls /agrave
/aacute /acircumflex /atilde /adieresis /aring
/ae /ccedilla /egrave /eacute /ecircumflex
/edieresis /igrave /iacute /icircumflex /idieresis
/eth /ntilde /ograve /oacute /ocircumflex
/otilde /odieresis /divide /oslash /ugrave
/uacute /ucircumflex /udieresis /yacute /thorn
/ydieresis
] def
%%EndResource
%FOPBeginFontReencode
/Courier-Bold findfont
dup length dict begin
  {1 index /FID ne {def} {pop pop} ifelse} forall
  /Encoding WinAnsiEncoding def
  currentdict
end
/Courier-Bold exch definefont pop
/Helvetica findfont
dup length dict begin
  {1 index /FID ne {def} {pop pop} ifelse} forall
  /Encoding WinAnsiEncoding def
  currentdict
end
/Helvetica exch definefont pop
/Courier-BoldOblique findfont
dup length dict begin
  {1 index /FID ne {def} {pop pop} ifelse} forall
  /Encoding WinAnsiEncoding def
  currentdict
end
/Courier-BoldOblique exch definefont pop
/Courier-Oblique findfont
dup length dict begin
  {1 index /FID ne {def} {pop pop} ifelse} forall
  /Encoding WinAnsiEncoding def
  currentdict
end
/Courier-Oblique exch definefont pop
/Times-Roman findfont
dup length dict begin
  {1 index /FID ne {def} {pop pop} ifelse} forall
  /Encoding WinAnsiEncoding def
  currentdict
end
/Times-Roman exch definefont pop
/Helvetica-BoldOblique findfont
dup length dict begin
  {1 index /FID ne {def} {pop pop} ifelse} forall
  /Encoding WinAnsiEncoding def
  currentdict
end
/Helvetica-BoldOblique exch definefont pop
/Helvetica-Bold findfont
dup length dict begin
  {1 index /FID ne {def} {pop pop} ifelse} forall
  /Encoding WinAnsiEncoding def
  currentdict
end
/Helvetica-Bold exch definefont pop
/Helvetica-Oblique findfont
dup length dict begin
  {1 index /FID ne {def} {pop pop} ifelse} forall
  /Encoding WinAnsiEncoding def
  currentdict
end
/Helvetica-Oblique exch definefont pop
/Times-BoldItalic findfont
dup length dict begin
  {1 index /FID ne {def} {pop pop} ifelse} forall
  /Encoding WinAnsiEncoding def
  currentdict
end
/Times-BoldItalic exch definefont pop
/Courier findfont
dup length dict begin
  {1 index /FID ne {def} {pop pop} ifelse} forall
  /Encoding WinAnsiEncoding def
  currentdict
end
/Courier exch definefont pop
/Times-Italic findfont
dup length dict begin
  {1 index /FID ne {def} {pop pop} ifelse} forall
  /Encoding WinAnsiEncoding def
  currentdict
end
/Times-Italic exch definefont pop
/Times-Bold findfont
dup length dict begin
  {1 index /FID ne {def} {pop pop} ifelse} forall
  /Encoding WinAnsiEncoding def
  currentdict
end
/Times-Bold exch definefont pop
%FOPEndFontReencode
%%EndProlog
%%Page: 1 1
%%PageBoundingBox: 0 0 1024 288
%%BeginPageSetup
[1 0 0 -1 0 288] CT
%%EndPageSetup
GS
1 GC
N
0 0 1024 288 re
f
GR
GS
1 GC
N
0 0 1024 288 re
f
GR
GS
1 GC
N
133 256.5 M
476 256.5 L
476 29 L
133 29 L
cp
f
GR
GS
0.149 GC
2 setlinecap
1 LJ
0.5 LW
N
133 256.5 M
476 256.5 L
S
GR
GS
0.149 GC
2 setlinecap
1 LJ
0.5 LW
N
175.875 256.5 M
175.875 253.07 L
S
GR
GS
0.149 GC
2 setlinecap
1 LJ
0.5 LW
N
261.625 256.5 M
261.625 253.07 L
S
GR
GS
0.149 GC
2 setlinecap
1 LJ
0.5 LW
N
347.375 256.5 M
347.375 253.07 L
S
GR
GS
0.149 GC
2 setlinecap
1 LJ
0.5 LW
N
433.125 256.5 M
433.125 253.07 L
S
GR
GS
[1 0 0 1 175.875 262.5] CT
0.149 GC
/Helvetica 20 F
GS
[1 0 0 1 0 0] CT
-24.5 20 moveto 
1 -1 scale
(Color) t 
GR
GR
GS
[1 0 0 1 261.625 262.5] CT
0.149 GC
/Helvetica 20 F
GS
[1 0 0 1 0 0] CT
-40 20 moveto 
1 -1 scale
(Direction) t 
GR
GR
GS
[1 0 0 1 347.375 262.5] CT
0.149 GC
/Helvetica 20 F
GS
[1 0 0 1 0 0] CT
-19 20 moveto 
1 -1 scale
(Size) t 
GR
GR
GS
[1 0 0 1 433.125 262.5] CT
0.149 GC
/Helvetica 20 F
GS
[1 0 0 1 0 0] CT
-49.5 20 moveto 
1 -1 scale
(Luminance) t 
GR
GR
GS
0.149 GC
2 setlinecap
1 LJ
0.5 LW
N
133 256.5 M
133 29 L
S
GR
GS
0.149 GC
2 setlinecap
1 LJ
0.5 LW
N
133 256.5 M
136.43 256.5 L
S
GR
GS
0.149 GC
2 setlinecap
1 LJ
0.5 LW
N
133 211 M
136.43 211 L
S
GR
GS
0.149 GC
2 setlinecap
1 LJ
0.5 LW
N
133 165.5 M
136.43 165.5 L
S
GR
GS
0.149 GC
2 setlinecap
1 LJ
0.5 LW
N
133 120 M
136.43 120 L
S
GR
GS
0.149 GC
2 setlinecap
1 LJ
0.5 LW
N
133 74.5 M
136.43 74.5 L
S
GR
GS
0.149 GC
2 setlinecap
1 LJ
0.5 LW
N
133 29 M
136.43 29 L
S
GR
GS
[1 0 0 1 127 256.5] CT
0.149 GC
/Helvetica 20 F
GS
[1 0 0 1 0 0] CT
-12 7.5 moveto 
1 -1 scale
(0) t 
GR
GR
GS
[1 0 0 1 127 211] CT
0.149 GC
/Helvetica 20 F
GS
[1 0 0 1 0 0] CT
-28 7.5 moveto 
1 -1 scale
(0.2) t 
GR
GR
GS
[1 0 0 1 127 165.5] CT
0.149 GC
/Helvetica 20 F
GS
[1 0 0 1 0 0] CT
-28 7.5 moveto 
1 -1 scale
(0.4) t 
GR
GR
GS
[1 0 0 1 127 119.99999] CT
0.149 GC
/Helvetica 20 F
GS
[1 0 0 1 0 0] CT
-28 7.5 moveto 
1 -1 scale
(0.6) t 
GR
GR
GS
[1 0 0 1 127 74.5] CT
0.149 GC
/Helvetica 20 F
GS
[1 0 0 1 0 0] CT
-28 7.5 moveto 
1 -1 scale
(0.8) t 
GR
GR
GS
[1 0 0 1 127 29] CT
0.149 GC
/Helvetica 20 F
GS
[1 0 0 1 0 0] CT
-12 7.5 moveto 
1 -1 scale
(1) t 
GR
GR
GS
[0 -1 1 0 96 142.74989] CT
0.149 GC
/Helvetica 20 F
GS
[1 0 0 1 0 0] CT
-70 -5 moveto 
1 -1 scale
(Mean Accuracy) t 
GR
GR
GS
[1 0 0 1 304.50027 26.49999] CT
/Helvetica-Bold 20 F
GS
[1 0 0 1 0 0] CT
-60 -5 moveto 
1 -1 scale
(EEG session) t 
GR
GR
GS
0.149 GC
1 LJ
0.5 LW
N
133 256.5 M
476 256.5 L
S
GR
GS
1 0.8 0.8 RC
N
141.575 256.5 M
175.875 256.5 L
175.875 71.237 L
141.575 71.237 L
cp
f
GR
GS
0.8 GC
N
175.875 256.5 M
210.175 256.5 L
210.175 98.928 L
175.875 98.928 L
cp
f
GR
GS
1 0.8 0.8 RC
N
227.325 256.5 M
261.625 256.5 L
261.625 61.837 L
227.325 61.837 L
cp
f
GR
GS
0.8 GC
N
261.625 256.5 M
295.925 256.5 L
295.925 76.362 L
261.625 76.362 L
cp
f
GR
GS
1 0.8 0.8 RC
N
313.075 256.5 M
347.375 256.5 L
347.375 83.813 L
313.075 83.813 L
cp
f
GR
GS
0.8 GC
N
347.375 256.5 M
381.675 256.5 L
381.675 117.943 L
347.375 117.943 L
cp
f
GR
GS
1 0.8 0.8 RC
N
398.825 256.5 M
433.125 256.5 L
433.125 123.386 L
398.825 123.386 L
cp
f
GR
GS
0.8 GC
N
433.125 256.5 M
467.425 256.5 L
467.425 132.546 L
433.125 132.546 L
cp
f
GR
GS
[8 8] 0 setdash
2 LJ
2 LW
N
132.959 142.75 M
476.041 142.75 L
S
GR
GS
[1 0 0 1 166.30035 57.4375] CT
1 0.302 0.302 RC
N
1.081 -0.5 M
1.081 -1.373 0.373 -2.081 -0.5 -2.081 C
-1.373 -2.081 -2.081 -1.373 -2.081 -0.5 C
-2.081 0.373 -1.373 1.081 -0.5 1.081 C
0.373 1.081 1.081 0.373 1.081 -0.5 C
f
GR
GS
[1 0 0 1 142.21342 43.21875] CT
1 0.302 0.302 RC
N
/f597852097{1.081 -0.5 M
1.081 -1.373 0.373 -2.081 -0.5 -2.081 C
-1.373 -2.081 -2.081 -1.373 -2.081 -0.5 C
-2.081 0.373 -1.373 1.081 -0.5 1.081 C
0.373 1.081 1.081 0.373 1.081 -0.5 C}def
f597852097
f
GR
GS
[1 0 0 1 164.71983 43.21875] CT
1 0.302 0.302 RC
N
f597852097
f
GR
GS
[1 0 0 1 156.61586 114.3125] CT
1 0.302 0.302 RC
N
f597852097
f
GR
GS
[1 0 0 1 156.59222 29] CT
1 0.302 0.302 RC
N
f597852097
f
GR
GS
[1 0 0 1 145.58936 57.4375] CT
1 0.302 0.302 RC
N
f597852097
f
GR
GS
[1 0 0 1 169.51859 29] CT
1 0.302 0.302 RC
N
f597852097
f
GR
GS
[1 0 0 1 152.71754 43.21875] CT
1 0.302 0.302 RC
N
f597852097
f
GR
GS
[1 0 0 1 150.02063 100.09375] CT
1 0.302 0.302 RC
N
f597852097
f
GR
GS
[1 0 0 1 153.33006 43.21875] CT
1 0.302 0.302 RC
N
f597852097
f
GR
GS
[1 0 0 1 154.46124 57.4375] CT
1 0.302 0.302 RC
N
f597852097
f
GR
GS
[1 0 0 1 160.32179 159] CT
1 0.302 0.302 RC
N
f597852097
f
GR
GS
[1 0 0 1 160.84886 71.65625] CT
1 0.302 0.302 RC
N
f597852097
f
GR
GS
[1 0 0 1 155.1517 85.875] CT
1 0.302 0.302 RC
N
f597852097
f
GR
GS
[1 0 0 1 155.2309 71.65625] CT
1 0.302 0.302 RC
N
f597852097
f
GR
GS
[1 0 0 1 159.25209 71.65625] CT
1 0.302 0.302 RC
N
f597852097
f
GR
GS
[1 0 0 1 164.1283 57.4375] CT
1 0.302 0.302 RC
N
f597852097
f
GR
GS
[1 0 0 1 174.19139 57.4375] CT
1 0.302 0.302 RC
N
f597852097
f
GR
GS
[1 0 0 1 166.35155 128.53125] CT
1 0.302 0.302 RC
N
f597852097
f
GR
GS
[1 0 0 1 155.29773 126.49999] CT
1 0.302 0.302 RC
N
f597852097
f
GR
GS
[1 0 0 1 170.10818 57.4375] CT
1 0.302 0.302 RC
N
f597852097
f
GR
GS
[1 0 0 1 146.1828 43.21875] CT
1 0.302 0.302 RC
N
f597852097
f
GR
GS
[1 0 0 1 143.649 57.4375] CT
1 0.302 0.302 RC
N
f597852097
f
GR
GS
[1 0 0 1 144.46468 29] CT
1 0.302 0.302 RC
N
f597852097
f
GR
GS
[1 0 0 1 147.19672 57.4375] CT
1 0.302 0.302 RC
N
f597852097
f
GR
GS
[1 0 0 1 152.69574 29] CT
1 0.302 0.302 RC
N
f597852097
f
GR
GS
[1 0 0 1 151.92422 29] CT
1 0.302 0.302 RC
N
f597852097
f
GR
GS
[1 0 0 1 141.97566 29] CT
1 0.302 0.302 RC
N
f597852097
f
GR
GS
[1 0 0 1 160.09375 29] CT
1 0.302 0.302 RC
N
f597852097
f
GR
GS
[1 0 0 1 144.84628 43.21875] CT
1 0.302 0.302 RC
N
f597852097
f
GR
GS
[1 0 0 1 146.60046 54.27777] CT
1 0.302 0.302 RC
N
f597852097
f
GR
GS
[1 0 0 1 163.22314 57.4375] CT
1 0.302 0.302 RC
N
f597852097
f
GR
GS
[1 0 0 1 171.04968 71.65625] CT
1 0.302 0.302 RC
N
f597852097
f
GR
GS
[1 0 0 1 174.9908 43.21875] CT
1 0.302 0.302 RC
N
f597852097
f
GR
GS
[1 0 0 1 161.15475 114.3125] CT
1 0.302 0.302 RC
N
f597852097
f
GR
GS
[1 0 0 1 175.76697 57.4375] CT
1 0.302 0.302 RC
N
f597852097
f
GR
GS
[1 0 0 1 160.56148 171.1875] CT
1 0.302 0.302 RC
N
f597852097
f
GR
GS
[1 0 0 1 159.25523 46.5] CT
1 0.302 0.302 RC
N
f597852097
f
GR
GS
[1 0 0 1 152.91739 85.875] CT
1 0.302 0.302 RC
N
f597852097
f
GR
GS
[1 0 0 1 156.32407 71.65625] CT
1 0.302 0.302 RC
N
f597852097
f
GR
GS
[1 0 0 1 158.44395 191.5] CT
1 0.302 0.302 RC
N
f597852097
f
GR
GS
[1 0 0 1 144.01157 142.75] CT
1 0.302 0.302 RC
N
f597852097
f
GR
GS
[1 0 0 1 172.02446 213.84375] CT
1 0.302 0.302 RC
N
f597852097
f
GR
GS
[1 0 0 1 143.79193 43.21875] CT
1 0.302 0.302 RC
N
f597852097
f
GR
GS
[1 0 0 1 156.53615 57.4375] CT
1 0.302 0.302 RC
N
f597852097
f
GR
GS
[1 0 0 1 169.92839 43.21875] CT
1 0.302 0.302 RC
N
f597852097
f
GR
GS
[1 0 0 1 155.10754 85.875] CT
1 0.302 0.302 RC
N
f597852097
f
GR
GS
[1 0 0 1 162.61719 43.21875] CT
1 0.302 0.302 RC
N
f597852097
f
GR
GS
[1 0 0 1 169.65437 43.21875] CT
1 0.302 0.302 RC
N
f597852097
f
GR
GS
[1 0 0 1 171.97285 57.4375] CT
1 0.302 0.302 RC
N
f597852097
f
GR
GS
[1 0 0 1 173.51213 43.21875] CT
1 0.302 0.302 RC
N
f597852097
f
GR
GS
[1 0 0 1 148.11891 100.09375] CT
1 0.302 0.302 RC
N
f597852097
f
GR
GS
[1 0 0 1 150.44437 85.875] CT
1 0.302 0.302 RC
N
f597852097
f
GR
GS
[1 0 0 1 258.1218 59.33333] CT
1 0.302 0.302 RC
N
f597852097
f
GR
GS
[1 0 0 1 247.67731 29] CT
1 0.302 0.302 RC
N
f597852097
f
GR
GS
[1 0 0 1 244.60672 29] CT
1 0.302 0.302 RC
N
f597852097
f
GR
GS
[1 0 0 1 248.34438 114.3125] CT
1 0.302 0.302 RC
N
f597852097
f
GR
GS
[1 0 0 1 255.43118 29] CT
1 0.302 0.302 RC
N
f597852097
f
GR
GS
[1 0 0 1 245.5688 57.4375] CT
1 0.302 0.302 RC
N
f597852097
f
GR
GS
[1 0 0 1 234.25618 29] CT
1 0.302 0.302 RC
N
f597852097
f
GR
GS
[1 0 0 1 242.89355 29] CT
1 0.302 0.302 RC
N
f597852097
f
GR
GS
[1 0 0 1 242.00235 43.21875] CT
1 0.302 0.302 RC
N
f597852097
f
GR
GS
[1 0 0 1 260.4606 29] CT
1 0.302 0.302 RC
N
f597852097
f
GR
GS
[1 0 0 1 248.59288 44.16666] CT
1 0.302 0.302 RC
N
f597852097
f
GR
GS
[1 0 0 1 251.17688 142.75] CT
1 0.302 0.302 RC
N
f597852097
f
GR
GS
[1 0 0 1 252.02664 29] CT
1 0.302 0.302 RC
N
f597852097
f
GR
GS
[1 0 0 1 239.22351 29] CT
1 0.302 0.302 RC
N
f597852097
f
GR
GS
[1 0 0 1 245.05777 29] CT
1 0.302 0.302 RC
N
f597852097
f
GR
GS
[1 0 0 1 246.41963 29] CT
1 0.302 0.302 RC
N
f597852097
f
GR
GS
[1 0 0 1 232.69279 29] CT
1 0.302 0.302 RC
N
f597852097
f
GR
GS
[1 0 0 1 246.60352 156.96875] CT
1 0.302 0.302 RC
N
f597852097
f
GR
GS
[1 0 0 1 251.15675 43.21875] CT
1 0.302 0.302 RC
N
f597852097
f
GR
GS
[1 0 0 1 241.95242 195.83333] CT
1 0.302 0.302 RC
N
f597852097
f
GR
GS
[1 0 0 1 256.00906 29] CT
1 0.302 0.302 RC
N
f597852097
f
GR
GS
[1 0 0 1 252.41158 128.53125] CT
1 0.302 0.302 RC
N
f597852097
f
GR
GS
[1 0 0 1 239.67407 142.75] CT
1 0.302 0.302 RC
N
f597852097
f
GR
GS
[1 0 0 1 242.9045 171.1875] CT
1 0.302 0.302 RC
N
f597852097
f
GR
GS
[1 0 0 1 240.57817 119.99999] CT
1 0.302 0.302 RC
N
f597852097
f
GR
GS
[1 0 0 1 253.92651 71.65625] CT
1 0.302 0.302 RC
N
f597852097
f
GR
GS
[1 0 0 1 252.5105 29] CT
1 0.302 0.302 RC
N
f597852097
f
GR
GS
[1 0 0 1 242.08353 57.4375] CT
1 0.302 0.302 RC
N
f597852097
f
GR
GS
[1 0 0 1 251.12071 29] CT
1 0.302 0.302 RC
N
f597852097
f
GR
GS
[1 0 0 1 259.74582 71.65625] CT
1 0.302 0.302 RC
N
f597852097
f
GR
GS
[1 0 0 1 254.22418 43.21875] CT
1 0.302 0.302 RC
N
f597852097
f
GR
GS
[1 0 0 1 251.52611 29] CT
1 0.302 0.302 RC
N
f597852097
f
GR
GS
[1 0 0 1 231.07516 29] CT
1 0.302 0.302 RC
N
f597852097
f
GR
GS
[1 0 0 1 240.69962 43.21875] CT
1 0.302 0.302 RC
N
f597852097
f
GR
GS
[1 0 0 1 247.59303 57.4375] CT
1 0.302 0.302 RC
N
f597852097
f
GR
GS
[1 0 0 1 243.08173 43.21875] CT
1 0.302 0.302 RC
N
f597852097
f
GR
GS
[1 0 0 1 229.05167 29] CT
1 0.302 0.302 RC
N
f597852097
f
GR
GS
[1 0 0 1 235.16899 114.3125] CT
1 0.302 0.302 RC
N
f597852097
f
GR
GS
[1 0 0 1 255.93768 100.09375] CT
1 0.302 0.302 RC
N
f597852097
f
GR
GS
[1 0 0 1 227.86162 43.21875] CT
1 0.302 0.302 RC
N
f597852097
f
GR
GS
[1 0 0 1 256.95029 142.75] CT
1 0.302 0.302 RC
N
f597852097
f
GR
GS
[1 0 0 1 230.00276 57.4375] CT
1 0.302 0.302 RC
N
f597852097
f
GR
GS
[1 0 0 1 250.27316 43.21875] CT
1 0.302 0.302 RC
N
f597852097
f
GR
GS
[1 0 0 1 244.48224 29] CT
1 0.302 0.302 RC
N
f597852097
f
GR
GS
[1 0 0 1 234.80219 29] CT
1 0.302 0.302 RC
N
f597852097
f
GR
GS
[1 0 0 1 246.93143 114.3125] CT
1 0.302 0.302 RC
N
f597852097
f
GR
GS
[1 0 0 1 231.5161 100.09375] CT
1 0.302 0.302 RC
N
f597852097
f
GR
GS
[1 0 0 1 250.34601 29] CT
1 0.302 0.302 RC
N
f597852097
f
GR
GS
[1 0 0 1 247.89078 29] CT
1 0.302 0.302 RC
N
f597852097
f
GR
GS
[1 0 0 1 229.24498 29] CT
1 0.302 0.302 RC
N
f597852097
f
GR
GS
[1 0 0 1 229.25757 29] CT
1 0.302 0.302 RC
N
f597852097
f
GR
GS
[1 0 0 1 232.55577 44.16666] CT
1 0.302 0.302 RC
N
f597852097
f
GR
GS
[1 0 0 1 227.998 43.21875] CT
1 0.302 0.302 RC
N
f597852097
f
GR
GS
[1 0 0 1 328.00153 114.3125] CT
1 0.302 0.302 RC
N
f597852097
f
GR
GS
[1 0 0 1 341.62018 29] CT
1 0.302 0.302 RC
N
f597852097
f
GR
GS
[1 0 0 1 334.25146 57.4375] CT
1 0.302 0.302 RC
N
f597852097
f
GR
GS
[1 0 0 1 330.91544 114.3125] CT
1 0.302 0.302 RC
N
f597852097
f
GR
GS
[1 0 0 1 342.70569 85.875] CT
1 0.302 0.302 RC
N
f597852097
f
GR
GS
[1 0 0 1 316.42603 114.3125] CT
1 0.302 0.302 RC
N
f597852097
f
GR
GS
[1 0 0 1 344.22119 43.21875] CT
1 0.302 0.302 RC
N
f597852097
f
GR
GS
[1 0 0 1 316.77997 85.875] CT
1 0.302 0.302 RC
N
f597852097
f
GR
GS
[1 0 0 1 330.80798 43.21875] CT
1 0.302 0.302 RC
N
f597852097
f
GR
GS
[1 0 0 1 317.98523 71.65625] CT
1 0.302 0.302 RC
N
f597852097
f
GR
GS
[1 0 0 1 332.26141 43.21875] CT
1 0.302 0.302 RC
N
f597852097
f
GR
GS
[1 0 0 1 313.23209 85.875] CT
1 0.302 0.302 RC
N
f597852097
f
GR
GS
[1 0 0 1 339.37219 29] CT
1 0.302 0.302 RC
N
f597852097
f
GR
GS
[1 0 0 1 342.18573 29] CT
1 0.302 0.302 RC
N
f597852097
f
GR
GS
[1 0 0 1 344.52197 100.09375] CT
1 0.302 0.302 RC
N
f597852097
f
GR
GS
[1 0 0 1 346.92801 29] CT
1 0.302 0.302 RC
N
f597852097
f
GR
GS
[1 0 0 1 330.40106 71.65625] CT
1 0.302 0.302 RC
N
f597852097
f
GR
GS
[1 0 0 1 322.38477 100.09375] CT
1 0.302 0.302 RC
N
f597852097
f
GR
GS
[1 0 0 1 316.53076 142.75] CT
1 0.302 0.302 RC
N
f597852097
f
GR
GS
[1 0 0 1 330.4942 114.3125] CT
1 0.302 0.302 RC
N
f597852097
f
GR
GS
[1 0 0 1 333.16138 85.875] CT
1 0.302 0.302 RC
N
f597852097
f
GR
GS
[1 0 0 1 339.24203 85.875] CT
1 0.302 0.302 RC
N
f597852097
f
GR
GS
[1 0 0 1 315.92062 71.65625] CT
1 0.302 0.302 RC
N
f597852097
f
GR
GS
[1 0 0 1 335.76776 142.75] CT
1 0.302 0.302 RC
N
f597852097
f
GR
GS
[1 0 0 1 330.80737 57.4375] CT
1 0.302 0.302 RC
N
f597852097
f
GR
GS
[1 0 0 1 318.94193 100.09375] CT
1 0.302 0.302 RC
N
f597852097
f
GR
GS
[1 0 0 1 345.26752 43.21875] CT
1 0.302 0.302 RC
N
f597852097
f
GR
GS
[1 0 0 1 333.32858 71.65625] CT
1 0.302 0.302 RC
N
f597852097
f
GR
GS
[1 0 0 1 328.18878 100.09375] CT
1 0.302 0.302 RC
N
f597852097
f
GR
GS
[1 0 0 1 345.38281 128.53125] CT
1 0.302 0.302 RC
N
f597852097
f
GR
GS
[1 0 0 1 335.57285 135.16666] CT
1 0.302 0.302 RC
N
f597852097
f
GR
GS
[1 0 0 1 328.57672 85.875] CT
1 0.302 0.302 RC
N
f597852097
f
GR
GS
[1 0 0 1 341.87662 114.3125] CT
1 0.302 0.302 RC
N
f597852097
f
GR
GS
[1 0 0 1 331.34399 100.09375] CT
1 0.302 0.302 RC
N
f597852097
f
GR
GS
[1 0 0 1 332.07333 71.65625] CT
1 0.302 0.302 RC
N
f597852097
f
GR
GS
[1 0 0 1 336.40125 29] CT
1 0.302 0.302 RC
N
f597852097
f
GR
GS
[1 0 0 1 325.66962 169] CT
1 0.302 0.302 RC
N
f597852097
f
GR
GS
[1 0 0 1 321.28265 85.875] CT
1 0.302 0.302 RC
N
f597852097
f
GR
GS
[1 0 0 1 332.93207 71.65625] CT
1 0.302 0.302 RC
N
f597852097
f
GR
GS
[1 0 0 1 342.80923 43.21875] CT
1 0.302 0.302 RC
N
f597852097
f
GR
GS
[1 0 0 1 327.02747 114.3125] CT
1 0.302 0.302 RC
N
f597852097
f
GR
GS
[1 0 0 1 316.93768 114.3125] CT
1 0.302 0.302 RC
N
f597852097
f
GR
GS
[1 0 0 1 328.29892 85.875] CT
1 0.302 0.302 RC
N
f597852097
f
GR
GS
[1 0 0 1 323.37131 29] CT
1 0.302 0.302 RC
N
f597852097
f
GR
GS
[1 0 0 1 326.84256 100.09375] CT
1 0.302 0.302 RC
N
f597852097
f
GR
GS
[1 0 0 1 341.65936 71.65625] CT
1 0.302 0.302 RC
N
f597852097
f
GR
GS
[1 0 0 1 326.91946 85.875] CT
1 0.302 0.302 RC
N
f597852097
f
GR
GS
[1 0 0 1 326.45804 128.53125] CT
1 0.302 0.302 RC
N
f597852097
f
GR
GS
[1 0 0 1 325.43839 85.875] CT
1 0.302 0.302 RC
N
f597852097
f
GR
GS
[1 0 0 1 317.88577 100.09375] CT
1 0.302 0.302 RC
N
f597852097
f
GR
GS
[1 0 0 1 321.99747 57.4375] CT
1 0.302 0.302 RC
N
f597852097
f
GR
GS
[1 0 0 1 316.05276 85.875] CT
1 0.302 0.302 RC
N
f597852097
f
GR
GS
[1 0 0 1 327.80334 85.875] CT
1 0.302 0.302 RC
N
f597852097
f
GR
GS
[1 0 0 1 407.64978 85.875] CT
1 0.302 0.302 RC
N
f597852097
f
GR
GS
[1 0 0 1 409.03113 171.1875] CT
1 0.302 0.302 RC
N
f597852097
f
GR
GS
[1 0 0 1 413.39764 85.875] CT
1 0.302 0.302 RC
N
f597852097
f
GR
GS
[1 0 0 1 402.91382 171.1875] CT
1 0.302 0.302 RC
N
f597852097
f
GR
GS
[1 0 0 1 415.80579 100.09375] CT
1 0.302 0.302 RC
N
f597852097
f
GR
GS
[1 0 0 1 423.05478 180.66667] CT
1 0.302 0.302 RC
N
f597852097
f
GR
GS
[1 0 0 1 407.17957 128.53125] CT
1 0.302 0.302 RC
N
f597852097
f
GR
GS
[1 0 0 1 425.7529 114.3125] CT
1 0.302 0.302 RC
N
f597852097
f
GR
GS
[1 0 0 1 401.36627 142.75] CT
1 0.302 0.302 RC
N
f597852097
f
GR
GS
[1 0 0 1 412.33521 100.09375] CT
1 0.302 0.302 RC
N
f597852097
f
GR
GS
[1 0 0 1 398.94144 114.3125] CT
1 0.302 0.302 RC
N
f597852097
f
GR
GS
[1 0 0 1 406.39423 61.5] CT
1 0.302 0.302 RC
N
f597852097
f
GR
GS
[1 0 0 1 398.8696 57.4375] CT
1 0.302 0.302 RC
N
f597852097
f
GR
GS
[1 0 0 1 405.31387 128.53125] CT
1 0.302 0.302 RC
N
f597852097
f
GR
GS
[1 0 0 1 403.71219 128.53125] CT
1 0.302 0.302 RC
N
f597852097
f
GR
GS
[1 0 0 1 408.01999 85.875] CT
1 0.302 0.302 RC
N
f597852097
f
GR
GS
[1 0 0 1 404.82379 114.3125] CT
1 0.302 0.302 RC
N
f597852097
f
GR
GS
[1 0 0 1 403.58066 100.09375] CT
1 0.302 0.302 RC
N
f597852097
f
GR
GS
[1 0 0 1 419.36679 128.53125] CT
1 0.302 0.302 RC
N
f597852097
f
GR
GS
[1 0 0 1 429.73129 134] CT
1 0.302 0.302 RC
N
f597852097
f
GR
GS
[1 0 0 1 431.04572 114.3125] CT
1 0.302 0.302 RC
N
f597852097
f
GR
GS
[1 0 0 1 406.41162 142.75] CT
1 0.302 0.302 RC
N
f597852097
f
GR
GS
[1 0 0 1 415.38065 128.53125] CT
1 0.302 0.302 RC
N
f597852097
f
GR
GS
[1 0 0 1 411.72217 156.96875] CT
1 0.302 0.302 RC
N
f597852097
f
GR
GS
[1 0 0 1 416.79065 85.875] CT
1 0.302 0.302 RC
N
f597852097
f
GR
GS
[1 0 0 1 407.91013 114.3125] CT
1 0.302 0.302 RC
N
f597852097
f
GR
GS
[1 0 0 1 401.16965 114.3125] CT
1 0.302 0.302 RC
N
f597852097
f
GR
GS
[1 0 0 1 413.79102 142.75] CT
1 0.302 0.302 RC
N
f597852097
f
GR
GS
[1 0 0 1 404.78815 114.3125] CT
1 0.302 0.302 RC
N
f597852097
f
GR
GS
[1 0 0 1 399.72049 85.875] CT
1 0.302 0.302 RC
N
f597852097
f
GR
GS
[1 0 0 1 431.57047 128.53125] CT
1 0.302 0.302 RC
N
f597852097
f
GR
GS
[1 0 0 1 413.59445 100.09375] CT
1 0.302 0.302 RC
N
f597852097
f
GR
GS
[1 0 0 1 431.80646 142.75] CT
1 0.302 0.302 RC
N
f597852097
f
GR
GS
[1 0 0 1 424.97583 128.53125] CT
1 0.302 0.302 RC
N
f597852097
f
GR
GS
[1 0 0 1 399.07706 100.09375] CT
1 0.302 0.302 RC
N
f597852097
f
GR
GS
[1 0 0 1 422.15033 142.75] CT
1 0.302 0.302 RC
N
f597852097
f
GR
GS
[1 0 0 1 423.03909 175.25] CT
1 0.302 0.302 RC
N
f597852097
f
GR
GS
[1 0 0 1 420.95291 100.09375] CT
1 0.302 0.302 RC
N
f597852097
f
GR
GS
[1 0 0 1 417.76923 43.21875] CT
1 0.302 0.302 RC
N
f597852097
f
GR
GS
[1 0 0 1 406.30612 185.40625] CT
1 0.302 0.302 RC
N
f597852097
f
GR
GS
[1 0 0 1 425.31717 199.625] CT
1 0.302 0.302 RC
N
f597852097
f
GR
GS
[1 0 0 1 406.64636 114.3125] CT
1 0.302 0.302 RC
N
f597852097
f
GR
GS
[1 0 0 1 411.54565 156.96875] CT
1 0.302 0.302 RC
N
f597852097
f
GR
GS
[1 0 0 1 429.38385 100.09375] CT
1 0.302 0.302 RC
N
f597852097
f
GR
GS
[1 0 0 1 428.19873 85.875] CT
1 0.302 0.302 RC
N
f597852097
f
GR
GS
[1 0 0 1 412.62848 114.3125] CT
1 0.302 0.302 RC
N
f597852097
f
GR
GS
[1 0 0 1 409.73306 171.1875] CT
1 0.302 0.302 RC
N
f597852097
f
GR
GS
[1 0 0 1 419.7012 150.33333] CT
1 0.302 0.302 RC
N
f597852097
f
GR
GS
[1 0 0 1 430.04471 100.09375] CT
1 0.302 0.302 RC
N
f597852097
f
GR
GS
[1 0 0 1 430.00708 180.66667] CT
1 0.302 0.302 RC
N
f597852097
f
GR
GS
[1 0 0 1 419.1167 71.65625] CT
1 0.302 0.302 RC
N
f597852097
f
GR
GS
[1 0 0 1 410.23221 156.96875] CT
1 0.302 0.302 RC
N
f597852097
f
GR
GS
[1 0 0 1 428.08508 156.96875] CT
1 0.302 0.302 RC
N
f597852097
f
GR
GS
[1 0 0 1 191.04924 85.875] CT
0.302 GC
N
f597852097
f
GR
GS
[1 0 0 1 206.89439 85.875] CT
0.302 GC
N
f597852097
f
GR
GS
[1 0 0 1 177.01306 29] CT
0.302 GC
N
f597852097
f
GR
GS
[1 0 0 1 194.13724 128.53125] CT
0.302 GC
N
f597852097
f
GR
GS
[1 0 0 1 200.45085 85.875] CT
0.302 GC
N
f597852097
f
GR
GS
[1 0 0 1 182.02505 104.83333] CT
0.302 GC
N
f597852097
f
GR
GS
[1 0 0 1 187.41808 57.4375] CT
0.302 GC
N
f597852097
f
GR
GS
[1 0 0 1 182.31355 128.53125] CT
0.302 GC
N
f597852097
f
GR
GS
[1 0 0 1 186.9171 100.09375] CT
0.302 GC
N
f597852097
f
GR
GS
[1 0 0 1 189.72728 71.65625] CT
0.302 GC
N
f597852097
f
GR
GS
[1 0 0 1 194.69083 71.65625] CT
0.302 GC
N
f597852097
f
GR
GS
[1 0 0 1 177.54674 135.16666] CT
0.302 GC
N
f597852097
f
GR
GS
[1 0 0 1 194.83371 142.75] CT
0.302 GC
N
f597852097
f
GR
GS
[1 0 0 1 185.30103 114.3125] CT
0.302 GC
N
f597852097
f
GR
GS
[1 0 0 1 184.15851 114.3125] CT
0.302 GC
N
f597852097
f
GR
GS
[1 0 0 1 184.21487 85.875] CT
0.302 GC
N
f597852097
f
GR
GS
[1 0 0 1 181.16266 43.21875] CT
0.302 GC
N
f597852097
f
GR
GS
[1 0 0 1 208.68008 85.875] CT
0.302 GC
N
f597852097
f
GR
GS
[1 0 0 1 207.96819 171.1875] CT
0.302 GC
N
f597852097
f
GR
GS
[1 0 0 1 203.95691 135.16666] CT
0.302 GC
N
f597852097
f
GR
GS
[1 0 0 1 200.85439 114.3125] CT
0.302 GC
N
f597852097
f
GR
GS
[1 0 0 1 181.90533 85.875] CT
0.302 GC
N
f597852097
f
GR
GS
[1 0 0 1 188.23572 85.875] CT
0.302 GC
N
f597852097
f
GR
GS
[1 0 0 1 182.35049 114.3125] CT
0.302 GC
N
f597852097
f
GR
GS
[1 0 0 1 175.91611 57.4375] CT
0.302 GC
N
f597852097
f
GR
GS
[1 0 0 1 186.7282 71.65625] CT
0.302 GC
N
f597852097
f
GR
GS
[1 0 0 1 199.87186 57.4375] CT
0.302 GC
N
f597852097
f
GR
GS
[1 0 0 1 197.32124 71.65625] CT
0.302 GC
N
f597852097
f
GR
GS
[1 0 0 1 194.50203 156.96875] CT
0.302 GC
N
f597852097
f
GR
GS
[1 0 0 1 190.93398 100.09375] CT
0.302 GC
N
f597852097
f
GR
GS
[1 0 0 1 185.73375 104.83333] CT
0.302 GC
N
f597852097
f
GR
GS
[1 0 0 1 193.08191 71.65625] CT
0.302 GC
N
f597852097
f
GR
GS
[1 0 0 1 201.99603 85.875] CT
0.302 GC
N
f597852097
f
GR
GS
[1 0 0 1 202.0256 59.33333] CT
0.302 GC
N
f597852097
f
GR
GS
[1 0 0 1 195.63371 185.40625] CT
0.302 GC
N
f597852097
f
GR
GS
[1 0 0 1 201.51984 71.65625] CT
0.302 GC
N
f597852097
f
GR
GS
[1 0 0 1 198.01683 98.99999] CT
0.302 GC
N
f597852097
f
GR
GS
[1 0 0 1 180.10143 89.66666] CT
0.302 GC
N
f597852097
f
GR
GS
[1 0 0 1 193.17584 71.65625] CT
0.302 GC
N
f597852097
f
GR
GS
[1 0 0 1 187.78607 114.3125] CT
0.302 GC
N
f597852097
f
GR
GS
[1 0 0 1 179.03566 142.75] CT
0.302 GC
N
f597852097
f
GR
GS
[1 0 0 1 180.94623 128.53125] CT
0.302 GC
N
f597852097
f
GR
GS
[1 0 0 1 182.67223 171.1875] CT
0.302 GC
N
f597852097
f
GR
GS
[1 0 0 1 198.93387 100.09375] CT
0.302 GC
N
f597852097
f
GR
GS
[1 0 0 1 190.67583 57.4375] CT
0.302 GC
N
f597852097
f
GR
GS
[1 0 0 1 199.69305 100.09375] CT
0.302 GC
N
f597852097
f
GR
GS
[1 0 0 1 184.68271 142.75] CT
0.302 GC
N
f597852097
f
GR
GS
[1 0 0 1 176.20973 135.16666] CT
0.302 GC
N
f597852097
f
GR
GS
[1 0 0 1 194.13231 71.65625] CT
0.302 GC
N
f597852097
f
GR
GS
[1 0 0 1 185.45815 43.21875] CT
0.302 GC
N
f597852097
f
GR
GS
[1 0 0 1 208.3307 100.09375] CT
0.302 GC
N
f597852097
f
GR
GS
[1 0 0 1 206.966 89.66666] CT
0.302 GC
N
f597852097
f
GR
GS
[1 0 0 1 189.34409 114.3125] CT
0.302 GC
N
f597852097
f
GR
GS
[1 0 0 1 262.47754 128.53125] CT
0.302 GC
N
f597852097
f
GR
GS
[1 0 0 1 284.65527 43.21875] CT
0.302 GC
N
f597852097
f
GR
GS
[1 0 0 1 290.33994 43.21875] CT
0.302 GC
N
f597852097
f
GR
GS
[1 0 0 1 294.94745 142.75] CT
0.302 GC
N
f597852097
f
GR
GS
[1 0 0 1 263.57782 100.09375] CT
0.302 GC
N
f597852097
f
GR
GS
[1 0 0 1 277.07111 77.75001] CT
0.302 GC
N
f597852097
f
GR
GS
[1 0 0 1 281.60373 43.21875] CT
0.302 GC
N
f597852097
f
GR
GS
[1 0 0 1 285.17667 85.875] CT
0.302 GC
N
f597852097
f
GR
GS
[1 0 0 1 286.30154 29] CT
0.302 GC
N
f597852097
f
GR
GS
[1 0 0 1 283.92139 43.21875] CT
0.302 GC
N
f597852097
f
GR
GS
[1 0 0 1 286.55817 85.875] CT
0.302 GC
N
f597852097
f
GR
GS
[1 0 0 1 274.44797 128.53125] CT
0.302 GC
N
f597852097
f
GR
GS
[1 0 0 1 281.57327 29] CT
0.302 GC
N
f597852097
f
GR
GS
[1 0 0 1 265.60788 43.21875] CT
0.302 GC
N
f597852097
f
GR
GS
[1 0 0 1 263.60254 29] CT
0.302 GC
N
f597852097
f
GR
GS
[1 0 0 1 295.23093 43.21875] CT
0.302 GC
N
f597852097
f
GR
GS
[1 0 0 1 271.39447 43.21875] CT
0.302 GC
N
f597852097
f
GR
GS
[1 0 0 1 282.03262 142.75] CT
0.302 GC
N
f597852097
f
GR
GS
[1 0 0 1 294.62711 89.66666] CT
0.302 GC
N
f597852097
f
GR
GS
[1 0 0 1 267.99719 128.53125] CT
0.302 GC
N
f597852097
f
GR
GS
[1 0 0 1 268.24628 29] CT
0.302 GC
N
f597852097
f
GR
GS
[1 0 0 1 273.34338 57.4375] CT
0.302 GC
N
f597852097
f
GR
GS
[1 0 0 1 293.62341 128.53125] CT
0.302 GC
N
f597852097
f
GR
GS
[1 0 0 1 275.0249 85.875] CT
0.302 GC
N
f597852097
f
GR
GS
[1 0 0 1 270.99634 128.53125] CT
0.302 GC
N
f597852097
f
GR
GS
[1 0 0 1 266.83679 57.4375] CT
0.302 GC
N
f597852097
f
GR
GS
[1 0 0 1 275.24582 71.65625] CT
0.302 GC
N
f597852097
f
GR
GS
[1 0 0 1 274.47797 100.09375] CT
0.302 GC
N
f597852097
f
GR
GS
[1 0 0 1 266.12222 43.21875] CT
0.302 GC
N
f597852097
f
GR
GS
[1 0 0 1 276.54691 142.75] CT
0.302 GC
N
f597852097
f
GR
GS
[1 0 0 1 264.76392 57.4375] CT
0.302 GC
N
f597852097
f
GR
GS
[1 0 0 1 282.7067 29] CT
0.302 GC
N
f597852097
f
GR
GS
[1 0 0 1 262.00159 29] CT
0.302 GC
N
f597852097
f
GR
GS
[1 0 0 1 281.28781 142.75] CT
0.302 GC
N
f597852097
f
GR
GS
[1 0 0 1 288.71274 43.21875] CT
0.302 GC
N
f597852097
f
GR
GS
[1 0 0 1 269.69809 114.3125] CT
0.302 GC
N
f597852097
f
GR
GS
[1 0 0 1 276.99207 169] CT
0.302 GC
N
f597852097
f
GR
GS
[1 0 0 1 281.15399 85.875] CT
0.302 GC
N
f597852097
f
GR
GS
[1 0 0 1 263.73108 71.65625] CT
0.302 GC
N
f597852097
f
GR
GS
[1 0 0 1 278.64771 85.875] CT
0.302 GC
N
f597852097
f
GR
GS
[1 0 0 1 283.6564 114.3125] CT
0.302 GC
N
f597852097
f
GR
GS
[1 0 0 1 269.21442 142.75] CT
0.302 GC
N
f597852097
f
GR
GS
[1 0 0 1 290.33603 43.21875] CT
0.302 GC
N
f597852097
f
GR
GS
[1 0 0 1 294.93289 29] CT
0.302 GC
N
f597852097
f
GR
GS
[1 0 0 1 290.65558 29] CT
0.302 GC
N
f597852097
f
GR
GS
[1 0 0 1 278.98077 85.875] CT
0.302 GC
N
f597852097
f
GR
GS
[1 0 0 1 271.19043 128.53125] CT
0.302 GC
N
f597852097
f
GR
GS
[1 0 0 1 287.23398 29] CT
0.302 GC
N
f597852097
f
GR
GS
[1 0 0 1 269.75171 71.65625] CT
0.302 GC
N
f597852097
f
GR
GS
[1 0 0 1 294.46194 43.21875] CT
0.302 GC
N
f597852097
f
GR
GS
[1 0 0 1 282.89993 29] CT
0.302 GC
N
f597852097
f
GR
GS
[1 0 0 1 282.21399 43.21875] CT
0.302 GC
N
f597852097
f
GR
GS
[1 0 0 1 267.54532 85.875] CT
0.302 GC
N
f597852097
f
GR
GS
[1 0 0 1 350.47391 114.3125] CT
0.302 GC
N
f597852097
f
GR
GS
[1 0 0 1 356.13049 114.3125] CT
0.302 GC
N
f597852097
f
GR
GS
[1 0 0 1 376.82397 128.53125] CT
0.302 GC
N
f597852097
f
GR
GS
[1 0 0 1 378.6246 171.1875] CT
0.302 GC
N
f597852097
f
GR
GS
[1 0 0 1 371.37244 171.1875] CT
0.302 GC
N
f597852097
f
GR
GS
[1 0 0 1 372.24875 159] CT
0.302 GC
N
f597852097
f
GR
GS
[1 0 0 1 355.2601 85.875] CT
0.302 GC
N
f597852097
f
GR
GS
[1 0 0 1 367.13364 156.96875] CT
0.302 GC
N
f597852097
f
GR
GS
[1 0 0 1 375.17953 71.65625] CT
0.302 GC
N
f597852097
f
GR
GS
[1 0 0 1 361.22684 100.09375] CT
0.302 GC
N
f597852097
f
GR
GS
[1 0 0 1 381.27847 71.65625] CT
0.302 GC
N
f597852097
f
GR
GS
[1 0 0 1 350.46198 150.33333] CT
0.302 GC
N
f597852097
f
GR
GS
[1 0 0 1 358.38327 71.65625] CT
0.302 GC
N
f597852097
f
GR
GS
[1 0 0 1 364.91632 114.3125] CT
0.302 GC
N
f597852097
f
GR
GS
[1 0 0 1 349.4538 114.3125] CT
0.302 GC
N
f597852097
f
GR
GS
[1 0 0 1 372.26608 85.875] CT
0.302 GC
N
f597852097
f
GR
GS
[1 0 0 1 366.46487 100.09375] CT
0.302 GC
N
f597852097
f
GR
GS
[1 0 0 1 365.53204 156.96875] CT
0.302 GC
N
f597852097
f
GR
GS
[1 0 0 1 375.84338 156.96875] CT
0.302 GC
N
f597852097
f
GR
GS
[1 0 0 1 376.83044 185.40625] CT
0.302 GC
N
f597852097
f
GR
GS
[1 0 0 1 374.43869 128.53125] CT
0.302 GC
N
f597852097
f
GR
GS
[1 0 0 1 358.27667 100.09375] CT
0.302 GC
N
f597852097
f
GR
GS
[1 0 0 1 362.88571 100.09375] CT
0.302 GC
N
f597852097
f
GR
GS
[1 0 0 1 373.17642 85.875] CT
0.302 GC
N
f597852097
f
GR
GS
[1 0 0 1 351.14325 114.3125] CT
0.302 GC
N
f597852097
f
GR
GS
[1 0 0 1 351.13916 128.53125] CT
0.302 GC
N
f597852097
f
GR
GS
[1 0 0 1 356.63202 85.875] CT
0.302 GC
N
f597852097
f
GR
GS
[1 0 0 1 365.37006 100.09375] CT
0.302 GC
N
f597852097
f
GR
GS
[1 0 0 1 380.73694 156.96875] CT
0.302 GC
N
f597852097
f
GR
GS
[1 0 0 1 371.742 100.09375] CT
0.302 GC
N
f597852097
f
GR
GS
[1 0 0 1 358.07181 142.75] CT
0.302 GC
N
f597852097
f
GR
GS
[1 0 0 1 357.37198 85.875] CT
0.302 GC
N
f597852097
f
GR
GS
[1 0 0 1 376.54227 142.75] CT
0.302 GC
N
f597852097
f
GR
GS
[1 0 0 1 378.6445 171.1875] CT
0.302 GC
N
f597852097
f
GR
GS
[1 0 0 1 369.30215 85.875] CT
0.302 GC
N
f597852097
f
GR
GS
[1 0 0 1 356.13419 57.4375] CT
0.302 GC
N
f597852097
f
GR
GS
[1 0 0 1 350.41626 126.49999] CT
0.302 GC
N
f597852097
f
GR
GS
[1 0 0 1 376.12717 185.40625] CT
0.302 GC
N
f597852097
f
GR
GS
[1 0 0 1 367.43085 85.875] CT
0.302 GC
N
f597852097
f
GR
GS
[1 0 0 1 379.89514 57.4375] CT
0.302 GC
N
f597852097
f
GR
GS
[1 0 0 1 349.46829 100.09375] CT
0.302 GC
N
f597852097
f
GR
GS
[1 0 0 1 367.42819 142.75] CT
0.302 GC
N
f597852097
f
GR
GS
[1 0 0 1 357.15421 114.3125] CT
0.302 GC
N
f597852097
f
GR
GS
[1 0 0 1 375.7662 156.96875] CT
0.302 GC
N
f597852097
f
GR
GS
[1 0 0 1 353.92584 142.75] CT
0.302 GC
N
f597852097
f
GR
GS
[1 0 0 1 362.55377 85.875] CT
0.302 GC
N
f597852097
f
GR
GS
[1 0 0 1 360.86902 128.53125] CT
0.302 GC
N
f597852097
f
GR
GS
[1 0 0 1 375.7265 100.09375] CT
0.302 GC
N
f597852097
f
GR
GS
[1 0 0 1 370.59167 156.96875] CT
0.302 GC
N
f597852097
f
GR
GS
[1 0 0 1 354.49579 100.09375] CT
0.302 GC
N
f597852097
f
GR
GS
[1 0 0 1 358.28598 57.4375] CT
0.302 GC
N
f597852097
f
GR
GS
[1 0 0 1 351.96472 57.4375] CT
0.302 GC
N
f597852097
f
GR
GS
[1 0 0 1 370.40619 185.40625] CT
0.302 GC
N
f597852097
f
GR
GS
[1 0 0 1 452.70999 142.75] CT
0.302 GC
N
f597852097
f
GR
GS
[1 0 0 1 438.948 85.875] CT
0.302 GC
N
f597852097
f
GR
GS
[1 0 0 1 438.18961 100.09375] CT
0.302 GC
N
f597852097
f
GR
GS
[1 0 0 1 449.45456 171.1875] CT
0.302 GC
N
f597852097
f
GR
GS
[1 0 0 1 464.27292 171.1875] CT
0.302 GC
N
f597852097
f
GR
GS
[1 0 0 1 452.06461 126.49999] CT
0.302 GC
N
f597852097
f
GR
GS
[1 0 0 1 434.25485 114.3125] CT
0.302 GC
N
f597852097
f
GR
GS
[1 0 0 1 434.97247 128.53125] CT
0.302 GC
N
f597852097
f
GR
GS
[1 0 0 1 460.73868 156.96875] CT
0.302 GC
N
f597852097
f
GR
GS
[1 0 0 1 448.60718 128.53125] CT
0.302 GC
N
f597852097
f
GR
GS
[1 0 0 1 446.24976 156.96875] CT
0.302 GC
N
f597852097
f
GR
GS
[1 0 0 1 460.20978 135.16666] CT
0.302 GC
N
f597852097
f
GR
GS
[1 0 0 1 445.62003 185.40625] CT
0.302 GC
N
f597852097
f
GR
GS
[1 0 0 1 451.38458 142.75] CT
0.302 GC
N
f597852097
f
GR
GS
[1 0 0 1 457.53482 171.1875] CT
0.302 GC
N
f597852097
f
GR
GS
[1 0 0 1 463.01663 142.75] CT
0.302 GC
N
f597852097
f
GR
GS
[1 0 0 1 444.39905 142.75] CT
0.302 GC
N
f597852097
f
GR
GS
[1 0 0 1 455.42407 85.875] CT
0.302 GC
N
f597852097
f
GR
GS
[1 0 0 1 466.56189 100.09375] CT
0.302 GC
N
f597852097
f
GR
GS
[1 0 0 1 435.73068 110.25] CT
0.302 GC
N
f597852097
f
GR
GS
[1 0 0 1 453.25974 119.99999] CT
0.302 GC
N
f597852097
f
GR
GS
[1 0 0 1 447.32129 142.75] CT
0.302 GC
N
f597852097
f
GR
GS
[1 0 0 1 443.72836 142.75] CT
0.302 GC
N
f597852097
f
GR
GS
[1 0 0 1 442.1745 85.875] CT
0.302 GC
N
f597852097
f
GR
GS
[1 0 0 1 459.15067 100.09375] CT
0.302 GC
N
f597852097
f
GR
GS
[1 0 0 1 467.26093 171.1875] CT
0.302 GC
N
f597852097
f
GR
GS
[1 0 0 1 439.52438 100.09375] CT
0.302 GC
N
f597852097
f
GR
GS
[1 0 0 1 459.91827 100.09375] CT
0.302 GC
N
f597852097
f
GR
GS
[1 0 0 1 439.84085 142.75] CT
0.302 GC
N
f597852097
f
GR
GS
[1 0 0 1 467.1629 128.53125] CT
0.302 GC
N
f597852097
f
GR
GS
[1 0 0 1 460.64258 134] CT
0.302 GC
N
f597852097
f
GR
GS
[1 0 0 1 447.67596 100.09375] CT
0.302 GC
N
f597852097
f
GR
GS
[1 0 0 1 458.12503 142.75] CT
0.302 GC
N
f597852097
f
GR
GS
[1 0 0 1 450.21851 142.75] CT
0.302 GC
N
f597852097
f
GR
GS
[1 0 0 1 460.87335 156.96875] CT
0.302 GC
N
f597852097
f
GR
GS
[1 0 0 1 445.35324 156.96875] CT
0.302 GC
N
f597852097
f
GR
GS
[1 0 0 1 435.63724 142.75] CT
0.302 GC
N
f597852097
f
GR
GS
[1 0 0 1 453.39603 128.53125] CT
0.302 GC
N
f597852097
f
GR
GS
[1 0 0 1 464.34445 128.53125] CT
0.302 GC
N
f597852097
f
GR
GS
[1 0 0 1 439.77118 128.53125] CT
0.302 GC
N
f597852097
f
GR
GS
[1 0 0 1 447.9552 128.53125] CT
0.302 GC
N
f597852097
f
GR
GS
[1 0 0 1 458.8212 171.1875] CT
0.302 GC
N
f597852097
f
GR
GS
[1 0 0 1 434.46902 142.75] CT
0.302 GC
N
f597852097
f
GR
GS
[1 0 0 1 465.58395 100.09375] CT
0.302 GC
N
f597852097
f
GR
GS
[1 0 0 1 459.319 114.3125] CT
0.302 GC
N
f597852097
f
GR
GS
[1 0 0 1 452.29257 128.53125] CT
0.302 GC
N
f597852097
f
GR
GS
[1 0 0 1 439.43082 156.96875] CT
0.302 GC
N
f597852097
f
GR
GS
[1 0 0 1 450.20465 159] CT
0.302 GC
N
f597852097
f
GR
GS
[1 0 0 1 450.88708 128.53125] CT
0.302 GC
N
f597852097
f
GR
GS
[1 0 0 1 467.22751 171.1875] CT
0.302 GC
N
f597852097
f
GR
GS
[1 0 0 1 462.44644 71.65625] CT
0.302 GC
N
f597852097
f
GR
GS
[1 0 0 1 466.13547 100.09375] CT
0.302 GC
N
f597852097
f
GR
GS
[1 0 0 1 456.41269 156.96875] CT
0.302 GC
N
f597852097
f
GR
GS
1 LJ
4 LW
N
158.725 65.357 M
158.725 77.116 L
S
GR
GS
1 LJ
4 LW
N
158.725 65.357 M
158.725 65.357 L
S
GR
GS
1 LJ
4 LW
N
158.725 77.116 M
158.725 77.116 L
S
GR
GS
1 LJ
4 LW
N
244.475 55.633 M
244.475 68.042 L
S
GR
GS
1 LJ
4 LW
N
244.475 55.633 M
244.475 55.633 L
S
GR
GS
1 LJ
4 LW
N
244.475 68.042 M
244.475 68.042 L
S
GR
GS
1 LJ
4 LW
N
330.225 79.2 M
330.225 88.426 L
S
GR
GS
1 LJ
4 LW
N
330.225 79.2 M
330.225 79.2 L
S
GR
GS
1 LJ
4 LW
N
330.225 88.426 M
330.225 88.426 L
S
GR
GS
1 LJ
4 LW
N
415.975 118.568 M
415.975 128.205 L
S
GR
GS
1 LJ
4 LW
N
415.975 118.568 M
415.975 118.568 L
S
GR
GS
1 LJ
4 LW
N
415.975 128.205 M
415.975 128.205 L
S
GR
GS
1 LJ
4 LW
N
193.025 94.18 M
193.025 103.677 L
S
GR
GS
1 LJ
4 LW
N
193.025 94.18 M
193.025 94.18 L
S
GR
GS
1 LJ
4 LW
N
193.025 103.677 M
193.025 103.677 L
S
GR
GS
1 LJ
4 LW
N
278.775 70.695 M
278.775 82.03 L
S
GR
GS
1 LJ
4 LW
N
278.775 70.695 M
278.775 70.695 L
S
GR
GS
1 LJ
4 LW
N
278.775 82.03 M
278.775 82.03 L
S
GR
GS
1 LJ
4 LW
N
364.525 112.93 M
364.525 122.956 L
S
GR
GS
1 LJ
4 LW
N
364.525 112.93 M
364.525 112.93 L
S
GR
GS
1 LJ
4 LW
N
364.525 122.956 M
364.525 122.956 L
S
GR
GS
1 LJ
4 LW
N
450.275 128.865 M
450.275 136.228 L
S
GR
GS
1 LJ
4 LW
N
450.275 128.865 M
450.275 128.865 L
S
GR
GS
1 LJ
4 LW
N
450.275 136.228 M
450.275 136.228 L
S
GR
GS
[1 0 0 1 158.72501 233.75] CT
/Helvetica-Bold 20 F
GS
[1 0 0 1 0 0] CT
-12.5 7.5 moveto 
1 -1 scale
(***) t 
GR
GR
GS
[1 0 0 1 193.02501 233.75] CT
/Helvetica-Bold 20 F
GS
[1 0 0 1 0 0] CT
-12.5 7.5 moveto 
1 -1 scale
(***) t 
GR
GR
GS
[1 0 0 1 244.47499 233.75] CT
/Helvetica-Bold 20 F
GS
[1 0 0 1 0 0] CT
-12.5 7.5 moveto 
1 -1 scale
(***) t 
GR
GR
GS
[1 0 0 1 278.77499 233.75] CT
/Helvetica-Bold 20 F
GS
[1 0 0 1 0 0] CT
-12.5 7.5 moveto 
1 -1 scale
(***) t 
GR
GR
GS
[1 0 0 1 330.22501 233.75] CT
/Helvetica-Bold 20 F
GS
[1 0 0 1 0 0] CT
-12.5 7.5 moveto 
1 -1 scale
(***) t 
GR
GR
GS
[1 0 0 1 364.52499 233.75] CT
/Helvetica-Bold 20 F
GS
[1 0 0 1 0 0] CT
-12.5 7.5 moveto 
1 -1 scale
(***) t 
GR
GR
GS
[1 0 0 1 415.97501 233.75] CT
/Helvetica-Bold 20 F
GS
[1 0 0 1 0 0] CT
-12.5 7.5 moveto 
1 -1 scale
(***) t 
GR
GR
GS
[1 0 0 1 450.27499 233.75] CT
/Helvetica-Bold 20 F
GS
[1 0 0 1 0 0] CT
-8.5 7.5 moveto 
1 -1 scale
(**) t 
GR
GR
GS
1 GC
N
/f1766222540{584 256.5 M
926.5 256.5 L
926.5 29 L
584 29 L
cp}def
f1766222540
f
GR
GS
0.149 GC
2 setlinecap
1 LJ
0.5 LW
N
584 256.5 M
926.5 256.5 L
S
GR
GS
0.149 GC
2 setlinecap
1 LJ
0.5 LW
N
626.813 256.5 M
626.813 253.075 L
S
GR
GS
0.149 GC
2 setlinecap
1 LJ
0.5 LW
N
712.438 256.5 M
712.438 253.075 L
S
GR
GS
0.149 GC
2 setlinecap
1 LJ
0.5 LW
N
798.063 256.5 M
798.063 253.075 L
S
GR
GS
0.149 GC
2 setlinecap
1 LJ
0.5 LW
N
883.688 256.5 M
883.688 253.075 L
S
GR
GS
[1 0 0 1 626.8125 262.5] CT
0.149 GC
/Helvetica 20 F
GS
[1 0 0 1 0 0] CT
-24.5 20 moveto 
1 -1 scale
(Color) t 
GR
GR
GS
[1 0 0 1 712.4375 262.5] CT
0.149 GC
/Helvetica 20 F
GS
[1 0 0 1 0 0] CT
-40 20 moveto 
1 -1 scale
(Direction) t 
GR
GR
GS
[1 0 0 1 798.0625 262.5] CT
0.149 GC
/Helvetica 20 F
GS
[1 0 0 1 0 0] CT
-19 20 moveto 
1 -1 scale
(Size) t 
GR
GR
GS
[1 0 0 1 883.6875 262.5] CT
0.149 GC
/Helvetica 20 F
GS
[1 0 0 1 0 0] CT
-49.5 20 moveto 
1 -1 scale
(Luminance) t 
GR
GR
GS
0.149 GC
2 setlinecap
1 LJ
0.5 LW
N
584 256.5 M
584 29 L
S
GR
GS
0.149 GC
2 setlinecap
1 LJ
0.5 LW
N
584 256.5 M
587.425 256.5 L
S
GR
GS
0.149 GC
2 setlinecap
1 LJ
0.5 LW
N
584 211 M
587.425 211 L
S
GR
GS
0.149 GC
2 setlinecap
1 LJ
0.5 LW
N
584 165.5 M
587.425 165.5 L
S
GR
GS
0.149 GC
2 setlinecap
1 LJ
0.5 LW
N
584 120 M
587.425 120 L
S
GR
GS
0.149 GC
2 setlinecap
1 LJ
0.5 LW
N
584 74.5 M
587.425 74.5 L
S
GR
GS
0.149 GC
2 setlinecap
1 LJ
0.5 LW
N
584 29 M
587.425 29 L
S
GR
GS
[1 0 0 1 578 256.5] CT
0.149 GC
/Helvetica 20 F
GS
[1 0 0 1 0 0] CT
-12 7.5 moveto 
1 -1 scale
(0) t 
GR
GR
GS
[1 0 0 1 578 211] CT
0.149 GC
/Helvetica 20 F
GS
[1 0 0 1 0 0] CT
-28 7.5 moveto 
1 -1 scale
(0.2) t 
GR
GR
GS
[1 0 0 1 578 165.5] CT
0.149 GC
/Helvetica 20 F
GS
[1 0 0 1 0 0] CT
-28 7.5 moveto 
1 -1 scale
(0.4) t 
GR
GR
GS
[1 0 0 1 578 119.99999] CT
0.149 GC
/Helvetica 20 F
GS
[1 0 0 1 0 0] CT
-28 7.5 moveto 
1 -1 scale
(0.6) t 
GR
GR
GS
[1 0 0 1 578 74.5] CT
0.149 GC
/Helvetica 20 F
GS
[1 0 0 1 0 0] CT
-28 7.5 moveto 
1 -1 scale
(0.8) t 
GR
GR
GS
[1 0 0 1 578 29] CT
0.149 GC
/Helvetica 20 F
GS
[1 0 0 1 0 0] CT
-12 7.5 moveto 
1 -1 scale
(1) t 
GR
GR
GS
[0 -1 1 0 547 142.74989] CT
0.149 GC
/Helvetica 20 F
GS
[1 0 0 1 0 0] CT
-70 -5 moveto 
1 -1 scale
(Mean Accuracy) t 
GR
GR
GS
[1 0 0 1 755.25073 26.49999] CT
/Helvetica-Bold 20 F
GS
[1 0 0 1 0 0] CT
-58.5 -5 moveto 
1 -1 scale
(MRI session) t 
GR
GR
GS
0.149 GC
1 LJ
0.5 LW
N
584 256.5 M
926.5 256.5 L
S
GR
GS
1 0.8 0.8 RC
N
/f-130653880{592.563 256.5 M
626.813 256.5 L
626.813 54.397 L
592.563 54.397 L
cp}def
f-130653880
f
GR
GS
0.8 GC
N
/f1617272264{626.813 256.5 M
661.063 256.5 L
661.063 88.33 L
626.813 88.33 L
cp}def
f1617272264
f
GR
GS
1 0.8 0.8 RC
N
/f408414862{678.188 256.5 M
712.438 256.5 L
712.438 96.445 L
678.188 96.445 L
cp}def
f408414862
f
GR
GS
0.8 GC
N
/f-1601566180{712.438 256.5 M
746.688 256.5 L
746.688 111.487 L
712.438 111.487 L
cp}def
f-1601566180
f
GR
GS
1 0.8 0.8 RC
N
/f-887424220{763.813 256.5 M
798.063 256.5 L
798.063 105.119 L
763.813 105.119 L
cp}def
f-887424220
f
GR
GS
0.8 GC
N
/f-1294571022{798.063 256.5 M
832.313 256.5 L
832.313 124.722 L
798.063 124.722 L
cp}def
f-1294571022
f
GR
GS
1 0.8 0.8 RC
N
/f43524046{849.438 256.5 M
883.688 256.5 L
883.688 119.982 L
849.438 119.982 L
cp}def
f43524046
f
GR
GS
0.8 GC
N
/f-1795878060{883.688 256.5 M
917.938 256.5 L
917.938 135.197 L
883.688 135.197 L
cp}def
f-1795878060
f
GR
GS
[8 8] 0 setdash
2 LJ
2 LW
N
583.959 142.75 M
926.541 142.75 L
S
GR
GS
[1 0 0 1 606.38245 57.4375] CT
1 0.302 0.302 RC
N
f597852097
f
GR
GS
[1 0 0 1 624.58551 43.21875] CT
1 0.302 0.302 RC
N
f597852097
f
GR
GS
[1 0 0 1 608.98486 43.21875] CT
1 0.302 0.302 RC
N
f597852097
f
GR
GS
[1 0 0 1 600.50134 165.5] CT
1 0.302 0.302 RC
N
f597852097
f
GR
GS
[1 0 0 1 606.13544 29] CT
1 0.302 0.302 RC
N
f597852097
f
GR
GS
[1 0 0 1 616.71143 29] CT
1 0.302 0.302 RC
N
f597852097
f
GR
GS
[1 0 0 1 611.69318 29] CT
1 0.302 0.302 RC
N
f597852097
f
GR
GS
[1 0 0 1 618.47711 85.875] CT
1 0.302 0.302 RC
N
f597852097
f
GR
GS
[1 0 0 1 626.65771 29] CT
1 0.302 0.302 RC
N
f597852097
f
GR
GS
[1 0 0 1 625.52576 43.21875] CT
1 0.302 0.302 RC
N
f597852097
f
GR
GS
[1 0 0 1 610.88855 29] CT
1 0.302 0.302 RC
N
f597852097
f
GR
GS
[1 0 0 1 625.57507 71.65625] CT
1 0.302 0.302 RC
N
f597852097
f
GR
GS
[1 0 0 1 596.52271 29] CT
1 0.302 0.302 RC
N
f597852097
f
GR
GS
[1 0 0 1 594.32458 57.4375] CT
1 0.302 0.302 RC
N
f597852097
f
GR
GS
[1 0 0 1 602.98645 29] CT
1 0.302 0.302 RC
N
f597852097
f
GR
GS
[1 0 0 1 612.43408 29] CT
1 0.302 0.302 RC
N
f597852097
f
GR
GS
[1 0 0 1 610.74805 100.09375] CT
1 0.302 0.302 RC
N
f597852097
f
GR
GS
[1 0 0 1 623.42889 29] CT
1 0.302 0.302 RC
N
f597852097
f
GR
GS
[1 0 0 1 611.07635 29] CT
1 0.302 0.302 RC
N
f597852097
f
GR
GS
[1 0 0 1 607.35785 57.4375] CT
1 0.302 0.302 RC
N
f597852097
f
GR
GS
[1 0 0 1 611.14886 29] CT
1 0.302 0.302 RC
N
f597852097
f
GR
GS
[1 0 0 1 616.96271 57.4375] CT
1 0.302 0.302 RC
N
f597852097
f
GR
GS
[1 0 0 1 593.13361 29] CT
1 0.302 0.302 RC
N
f597852097
f
GR
GS
[1 0 0 1 619.99402 29] CT
1 0.302 0.302 RC
N
f597852097
f
GR
GS
[1 0 0 1 597.44342 29] CT
1 0.302 0.302 RC
N
f597852097
f
GR
GS
[1 0 0 1 608.95026 29] CT
1 0.302 0.302 RC
N
f597852097
f
GR
GS
[1 0 0 1 601.35913 57.4375] CT
1 0.302 0.302 RC
N
f597852097
f
GR
GS
[1 0 0 1 605.20392 57.4375] CT
1 0.302 0.302 RC
N
f597852097
f
GR
GS
[1 0 0 1 615.22797 29] CT
1 0.302 0.302 RC
N
f597852097
f
GR
GS
[1 0 0 1 598.37158 43.21875] CT
1 0.302 0.302 RC
N
f597852097
f
GR
GS
[1 0 0 1 602.11084 29] CT
1 0.302 0.302 RC
N
f597852097
f
GR
GS
[1 0 0 1 599.35162 43.21875] CT
1 0.302 0.302 RC
N
f597852097
f
GR
GS
[1 0 0 1 599.24371 128.53125] CT
1 0.302 0.302 RC
N
f597852097
f
GR
GS
[1 0 0 1 603.75677 44.16666] CT
1 0.302 0.302 RC
N
f597852097
f
GR
GS
[1 0 0 1 622.71405 57.4375] CT
1 0.302 0.302 RC
N
f597852097
f
GR
GS
[1 0 0 1 608.69775 256.5] CT
1 0.302 0.302 RC
N
f597852097
f
GR
GS
[1 0 0 1 606.39844 57.4375] CT
1 0.302 0.302 RC
N
f597852097
f
GR
GS
[1 0 0 1 598.70117 43.21875] CT
1 0.302 0.302 RC
N
f597852097
f
GR
GS
[1 0 0 1 625.74817 43.21875] CT
1 0.302 0.302 RC
N
f597852097
f
GR
GS
[1 0 0 1 606.51788 43.21875] CT
1 0.302 0.302 RC
N
f597852097
f
GR
GS
[1 0 0 1 621.48621 100.09375] CT
1 0.302 0.302 RC
N
f597852097
f
GR
GS
[1 0 0 1 613.63739 185.40625] CT
1 0.302 0.302 RC
N
f597852097
f
GR
GS
[1 0 0 1 605.46143 29] CT
1 0.302 0.302 RC
N
f597852097
f
GR
GS
[1 0 0 1 622.60596 29] CT
1 0.302 0.302 RC
N
f597852097
f
GR
GS
[1 0 0 1 619.44373 43.21875] CT
1 0.302 0.302 RC
N
f597852097
f
GR
GS
[1 0 0 1 608.48718 29] CT
1 0.302 0.302 RC
N
f597852097
f
GR
GS
[1 0 0 1 620.44122 43.21875] CT
1 0.302 0.302 RC
N
f597852097
f
GR
GS
[1 0 0 1 623.33423 29] CT
1 0.302 0.302 RC
N
f597852097
f
GR
GS
[1 0 0 1 607.26392 43.21875] CT
1 0.302 0.302 RC
N
f597852097
f
GR
GS
[1 0 0 1 604.01331 29] CT
1 0.302 0.302 RC
N
f597852097
f
GR
GS
[1 0 0 1 612.99768 29] CT
1 0.302 0.302 RC
N
f597852097
f
GR
GS
[1 0 0 1 623.45569 100.09375] CT
1 0.302 0.302 RC
N
f597852097
f
GR
GS
[1 0 0 1 616.60828 43.21875] CT
1 0.302 0.302 RC
N
f597852097
f
GR
GS
[1 0 0 1 691.11536 114.3125] CT
1 0.302 0.302 RC
N
f597852097
f
GR
GS
[1 0 0 1 703.35974 43.21875] CT
1 0.302 0.302 RC
N
f597852097
f
GR
GS
[1 0 0 1 710.86554 29] CT
1 0.302 0.302 RC
N
f597852097
f
GR
GS
[1 0 0 1 696.77887 142.75] CT
1 0.302 0.302 RC
N
f597852097
f
GR
GS
[1 0 0 1 696.6861 100.09375] CT
1 0.302 0.302 RC
N
f597852097
f
GR
GS
[1 0 0 1 688.84302 119.99999] CT
1 0.302 0.302 RC
N
f597852097
f
GR
GS
[1 0 0 1 680.62726 57.4375] CT
1 0.302 0.302 RC
N
f597852097
f
GR
GS
[1 0 0 1 684.42035 43.21875] CT
1 0.302 0.302 RC
N
f597852097
f
GR
GS
[1 0 0 1 681.37238 57.4375] CT
1 0.302 0.302 RC
N
f597852097
f
GR
GS
[1 0 0 1 694.06201 29] CT
1 0.302 0.302 RC
N
f597852097
f
GR
GS
[1 0 0 1 678.50714 29] CT
1 0.302 0.302 RC
N
f597852097
f
GR
GS
[1 0 0 1 709.52716 128.53125] CT
1 0.302 0.302 RC
N
f597852097
f
GR
GS
[1 0 0 1 700.20142 85.875] CT
1 0.302 0.302 RC
N
f597852097
f
GR
GS
[1 0 0 1 678.23608 43.21875] CT
1 0.302 0.302 RC
N
f597852097
f
GR
GS
[1 0 0 1 679.22821 71.65625] CT
1 0.302 0.302 RC
N
f597852097
f
GR
GS
[1 0 0 1 685.32764 114.3125] CT
1 0.302 0.302 RC
N
f597852097
f
GR
GS
[1 0 0 1 693.77008 71.65625] CT
1 0.302 0.302 RC
N
f597852097
f
GR
GS
[1 0 0 1 682.54639 142.75] CT
1 0.302 0.302 RC
N
f597852097
f
GR
GS
[1 0 0 1 678.4837 142.75] CT
1 0.302 0.302 RC
N
f597852097
f
GR
GS
[1 0 0 1 703.08997 142.75] CT
1 0.302 0.302 RC
N
f597852097
f
GR
GS
[1 0 0 1 690.31598 142.75] CT
1 0.302 0.302 RC
N
f597852097
f
GR
GS
[1 0 0 1 704.91779 128.53125] CT
1 0.302 0.302 RC
N
f597852097
f
GR
GS
[1 0 0 1 693.14301 57.4375] CT
1 0.302 0.302 RC
N
f597852097
f
GR
GS
[1 0 0 1 693.13953 85.875] CT
1 0.302 0.302 RC
N
f597852097
f
GR
GS
[1 0 0 1 679.87305 142.75] CT
1 0.302 0.302 RC
N
f597852097
f
GR
GS
[1 0 0 1 679.88739 71.65625] CT
1 0.302 0.302 RC
N
f597852097
f
GR
GS
[1 0 0 1 681.30768 71.65625] CT
1 0.302 0.302 RC
N
f597852097
f
GR
GS
[1 0 0 1 698.53326 85.875] CT
1 0.302 0.302 RC
N
f597852097
f
GR
GS
[1 0 0 1 686.44464 100.09375] CT
1 0.302 0.302 RC
N
f597852097
f
GR
GS
[1 0 0 1 707.00439 85.875] CT
1 0.302 0.302 RC
N
f597852097
f
GR
GS
[1 0 0 1 707.54706 114.3125] CT
1 0.302 0.302 RC
N
f597852097
f
GR
GS
[1 0 0 1 711.19122 85.875] CT
1 0.302 0.302 RC
N
f597852097
f
GR
GS
[1 0 0 1 694.93231 128.53125] CT
1 0.302 0.302 RC
N
f597852097
f
GR
GS
[1 0 0 1 685.73309 156.96875] CT
1 0.302 0.302 RC
N
f597852097
f
GR
GS
[1 0 0 1 685.93512 29] CT
1 0.302 0.302 RC
N
f597852097
f
GR
GS
[1 0 0 1 696.57251 100.09375] CT
1 0.302 0.302 RC
N
f597852097
f
GR
GS
[1 0 0 1 704.28973 128.53125] CT
1 0.302 0.302 RC
N
f597852097
f
GR
GS
[1 0 0 1 690.09167 142.75] CT
1 0.302 0.302 RC
N
f597852097
f
GR
GS
[1 0 0 1 693.98468 43.21875] CT
1 0.302 0.302 RC
N
f597852097
f
GR
GS
[1 0 0 1 700.08435 85.875] CT
1 0.302 0.302 RC
N
f597852097
f
GR
GS
[1 0 0 1 709.60626 142.75] CT
1 0.302 0.302 RC
N
f597852097
f
GR
GS
[1 0 0 1 683.72137 156.96875] CT
1 0.302 0.302 RC
N
f597852097
f
GR
GS
[1 0 0 1 702.698 85.875] CT
1 0.302 0.302 RC
N
f597852097
f
GR
GS
[1 0 0 1 697.97504 114.3125] CT
1 0.302 0.302 RC
N
f597852097
f
GR
GS
[1 0 0 1 693.02802 128.53125] CT
1 0.302 0.302 RC
N
f597852097
f
GR
GS
[1 0 0 1 708.47284 156.96875] CT
1 0.302 0.302 RC
N
f597852097
f
GR
GS
[1 0 0 1 691.64954 171.1875] CT
1 0.302 0.302 RC
N
f597852097
f
GR
GS
[1 0 0 1 684.31738 57.4375] CT
1 0.302 0.302 RC
N
f597852097
f
GR
GS
[1 0 0 1 699.87915 29] CT
1 0.302 0.302 RC
N
f597852097
f
GR
GS
[1 0 0 1 699.55951 142.75] CT
1 0.302 0.302 RC
N
f597852097
f
GR
GS
[1 0 0 1 689.41949 29] CT
1 0.302 0.302 RC
N
f597852097
f
GR
GS
[1 0 0 1 705.68909 57.4375] CT
1 0.302 0.302 RC
N
f597852097
f
GR
GS
[1 0 0 1 712.41962 142.75] CT
1 0.302 0.302 RC
N
f597852097
f
GR
GS
[1 0 0 1 797.41101 185.40625] CT
1 0.302 0.302 RC
N
f597852097
f
GR
GS
[1 0 0 1 768.16351 100.09375] CT
1 0.302 0.302 RC
N
f597852097
f
GR
GS
[1 0 0 1 771.76672 85.875] CT
1 0.302 0.302 RC
N
f597852097
f
GR
GS
[1 0 0 1 764.62189 150.33333] CT
1 0.302 0.302 RC
N
f597852097
f
GR
GS
[1 0 0 1 784.61707 57.4375] CT
1 0.302 0.302 RC
N
f597852097
f
GR
GS
[1 0 0 1 767.60773 135.16666] CT
1 0.302 0.302 RC
N
f597852097
f
GR
GS
[1 0 0 1 777.76801 29] CT
1 0.302 0.302 RC
N
f597852097
f
GR
GS
[1 0 0 1 794.0921 171.1875] CT
1 0.302 0.302 RC
N
f597852097
f
GR
GS
[1 0 0 1 782.58606 142.75] CT
1 0.302 0.302 RC
N
f597852097
f
GR
GS
[1 0 0 1 776.45087 100.09375] CT
1 0.302 0.302 RC
N
f597852097
f
GR
GS
[1 0 0 1 770.94836 71.65625] CT
1 0.302 0.302 RC
N
f597852097
f
GR
GS
[1 0 0 1 778.91479 114.3125] CT
1 0.302 0.302 RC
N
f597852097
f
GR
GS
[1 0 0 1 796.56219 29] CT
1 0.302 0.302 RC
N
f597852097
f
GR
GS
[1 0 0 1 768.06036 85.875] CT
1 0.302 0.302 RC
N
f597852097
f
GR
GS
[1 0 0 1 779.93616 100.09375] CT
1 0.302 0.302 RC
N
f597852097
f
GR
GS
[1 0 0 1 793.16119 71.65625] CT
1 0.302 0.302 RC
N
f597852097
f
GR
GS
[1 0 0 1 765.29865 57.4375] CT
1 0.302 0.302 RC
N
f597852097
f
GR
GS
[1 0 0 1 787.50067 71.65625] CT
1 0.302 0.302 RC
N
f597852097
f
GR
GS
[1 0 0 1 797.34271 142.75] CT
1 0.302 0.302 RC
N
f597852097
f
GR
GS
[1 0 0 1 773.5144 156.96875] CT
1 0.302 0.302 RC
N
f597852097
f
GR
GS
[1 0 0 1 768.39447 100.09375] CT
1 0.302 0.302 RC
N
f597852097
f
GR
GS
[1 0 0 1 787.28333 85.875] CT
1 0.302 0.302 RC
N
f597852097
f
GR
GS
[1 0 0 1 794.9613 119.99999] CT
1 0.302 0.302 RC
N
f597852097
f
GR
GS
[1 0 0 1 784.73474 128.53125] CT
1 0.302 0.302 RC
N
f597852097
f
GR
GS
[1 0 0 1 794.6369 100.09375] CT
1 0.302 0.302 RC
N
f597852097
f
GR
GS
[1 0 0 1 770.43762 57.4375] CT
1 0.302 0.302 RC
N
f597852097
f
GR
GS
[1 0 0 1 789.65155 71.65625] CT
1 0.302 0.302 RC
N
f597852097
f
GR
GS
[1 0 0 1 775.67194 43.21875] CT
1 0.302 0.302 RC
N
f597852097
f
GR
GS
[1 0 0 1 778.15039 142.75] CT
1 0.302 0.302 RC
N
f597852097
f
GR
GS
[1 0 0 1 769.14594 100.09375] CT
1 0.302 0.302 RC
N
f597852097
f
GR
GS
[1 0 0 1 791.86328 199.625] CT
1 0.302 0.302 RC
N
f597852097
f
GR
GS
[1 0 0 1 785.21613 43.21875] CT
1 0.302 0.302 RC
N
f597852097
f
GR
GS
[1 0 0 1 789.10822 128.53125] CT
1 0.302 0.302 RC
N
f597852097
f
GR
GS
[1 0 0 1 791.38757 104.83333] CT
1 0.302 0.302 RC
N
f597852097
f
GR
GS
[1 0 0 1 766.11487 57.4375] CT
1 0.302 0.302 RC
N
f597852097
f
GR
GS
[1 0 0 1 796.37708 199.625] CT
1 0.302 0.302 RC
N
f597852097
f
GR
GS
[1 0 0 1 780.85449 114.3125] CT
1 0.302 0.302 RC
N
f597852097
f
GR
GS
[1 0 0 1 789.67627 85.875] CT
1 0.302 0.302 RC
N
f597852097
f
GR
GS
[1 0 0 1 789.23987 114.3125] CT
1 0.302 0.302 RC
N
f597852097
f
GR
GS
[1 0 0 1 792.27869 85.875] CT
1 0.302 0.302 RC
N
f597852097
f
GR
GS
[1 0 0 1 769.17267 171.1875] CT
1 0.302 0.302 RC
N
f597852097
f
GR
GS
[1 0 0 1 779.47534 156.96875] CT
1 0.302 0.302 RC
N
f597852097
f
GR
GS
[1 0 0 1 784.98242 85.875] CT
1 0.302 0.302 RC
N
f597852097
f
GR
GS
[1 0 0 1 795.73981 85.875] CT
1 0.302 0.302 RC
N
f597852097
f
GR
GS
[1 0 0 1 792.41425 142.75] CT
1 0.302 0.302 RC
N
f597852097
f
GR
GS
[1 0 0 1 794.48077 100.09375] CT
1 0.302 0.302 RC
N
f597852097
f
GR
GS
[1 0 0 1 783.76373 128.53125] CT
1 0.302 0.302 RC
N
f597852097
f
GR
GS
[1 0 0 1 783.77155 100.09375] CT
1 0.302 0.302 RC
N
f597852097
f
GR
GS
[1 0 0 1 793.09369 100.09375] CT
1 0.302 0.302 RC
N
f597852097
f
GR
GS
[1 0 0 1 765.00665 57.4375] CT
1 0.302 0.302 RC
N
f597852097
f
GR
GS
[1 0 0 1 794.13812 43.21875] CT
1 0.302 0.302 RC
N
f597852097
f
GR
GS
[1 0 0 1 777.77728 100.09375] CT
1 0.302 0.302 RC
N
f597852097
f
GR
GS
[1 0 0 1 765.05859 156.96875] CT
1 0.302 0.302 RC
N
f597852097
f
GR
GS
[1 0 0 1 874.99304 114.3125] CT
1 0.302 0.302 RC
N
f597852097
f
GR
GS
[1 0 0 1 854.74036 114.3125] CT
1 0.302 0.302 RC
N
f597852097
f
GR
GS
[1 0 0 1 854.36639 128.53125] CT
1 0.302 0.302 RC
N
f597852097
f
GR
GS
[1 0 0 1 870.19159 199.625] CT
1 0.302 0.302 RC
N
f597852097
f
GR
GS
[1 0 0 1 858.15344 128.53125] CT
1 0.302 0.302 RC
N
f597852097
f
GR
GS
[1 0 0 1 860.53979 104.83333] CT
1 0.302 0.302 RC
N
f597852097
f
GR
GS
[1 0 0 1 863.19885 100.09375] CT
1 0.302 0.302 RC
N
f597852097
f
GR
GS
[1 0 0 1 863.35577 142.75] CT
1 0.302 0.302 RC
N
f597852097
f
GR
GS
[1 0 0 1 862.66455 142.75] CT
1 0.302 0.302 RC
N
f597852097
f
GR
GS
[1 0 0 1 870.32318 156.96875] CT
1 0.302 0.302 RC
N
f597852097
f
GR
GS
[1 0 0 1 855.1535 85.875] CT
1 0.302 0.302 RC
N
f597852097
f
GR
GS
[1 0 0 1 855.87964 71.65625] CT
1 0.302 0.302 RC
N
f597852097
f
GR
GS
[1 0 0 1 852.67853 128.53125] CT
1 0.302 0.302 RC
N
f597852097
f
GR
GS
[1 0 0 1 860.50665 114.3125] CT
1 0.302 0.302 RC
N
f597852097
f
GR
GS
[1 0 0 1 875.7962 128.53125] CT
1 0.302 0.302 RC
N
f597852097
f
GR
GS
[1 0 0 1 857.45605 71.65625] CT
1 0.302 0.302 RC
N
f597852097
f
GR
GS
[1 0 0 1 874.79504 128.53125] CT
1 0.302 0.302 RC
N
f597852097
f
GR
GS
[1 0 0 1 873.1665 114.3125] CT
1 0.302 0.302 RC
N
f597852097
f
GR
GS
[1 0 0 1 877.66217 185.40625] CT
1 0.302 0.302 RC
N
f597852097
f
GR
GS
[1 0 0 1 877.79572 165.5] CT
1 0.302 0.302 RC
N
f597852097
f
GR
GS
[1 0 0 1 859.48535 128.53125] CT
1 0.302 0.302 RC
N
f597852097
f
GR
GS
[1 0 0 1 860.03339 100.09375] CT
1 0.302 0.302 RC
N
f597852097
f
GR
GS
[1 0 0 1 867.35126 128.53125] CT
1 0.302 0.302 RC
N
f597852097
f
GR
GS
[1 0 0 1 860.57898 114.3125] CT
1 0.302 0.302 RC
N
f597852097
f
GR
GS
[1 0 0 1 877.9281 119.99999] CT
1 0.302 0.302 RC
N
f597852097
f
GR
GS
[1 0 0 1 877.19006 97.25] CT
1 0.302 0.302 RC
N
f597852097
f
GR
GS
[1 0 0 1 868.51471 85.875] CT
1 0.302 0.302 RC
N
f597852097
f
GR
GS
[1 0 0 1 858.44403 128.53125] CT
1 0.302 0.302 RC
N
f597852097
f
GR
GS
[1 0 0 1 872.74689 71.65625] CT
1 0.302 0.302 RC
N
f597852097
f
GR
GS
[1 0 0 1 857.44012 85.875] CT
1 0.302 0.302 RC
N
f597852097
f
GR
GS
[1 0 0 1 865.07007 128.53125] CT
1 0.302 0.302 RC
N
f597852097
f
GR
GS
[1 0 0 1 862.60895 57.4375] CT
1 0.302 0.302 RC
N
f597852097
f
GR
GS
[1 0 0 1 867.88458 156.96875] CT
1 0.302 0.302 RC
N
f597852097
f
GR
GS
[1 0 0 1 883.40332 142.75] CT
1 0.302 0.302 RC
N
f597852097
f
GR
GS
[1 0 0 1 875.30377 114.3125] CT
1 0.302 0.302 RC
N
f597852097
f
GR
GS
[1 0 0 1 883.01807 142.75] CT
1 0.302 0.302 RC
N
f597852097
f
GR
GS
[1 0 0 1 857.47882 85.875] CT
1 0.302 0.302 RC
N
f597852097
f
GR
GS
[1 0 0 1 867.54065 185.40625] CT
1 0.302 0.302 RC
N
f597852097
f
GR
GS
[1 0 0 1 851.19922 57.4375] CT
1 0.302 0.302 RC
N
f597852097
f
GR
GS
[1 0 0 1 875.36047 85.875] CT
1 0.302 0.302 RC
N
f597852097
f
GR
GS
[1 0 0 1 870.0553 156.96875] CT
1 0.302 0.302 RC
N
f597852097
f
GR
GS
[1 0 0 1 878.79553 156.96875] CT
1 0.302 0.302 RC
N
f597852097
f
GR
GS
[1 0 0 1 883.28601 114.3125] CT
1 0.302 0.302 RC
N
f597852097
f
GR
GS
[1 0 0 1 881.27234 156.96875] CT
1 0.302 0.302 RC
N
f597852097
f
GR
GS
[1 0 0 1 863.46338 100.09375] CT
1 0.302 0.302 RC
N
f597852097
f
GR
GS
[1 0 0 1 849.44922 100.09375] CT
1 0.302 0.302 RC
N
f597852097
f
GR
GS
[1 0 0 1 867.96259 114.3125] CT
1 0.302 0.302 RC
N
f597852097
f
GR
GS
[1 0 0 1 856.55231 128.53125] CT
1 0.302 0.302 RC
N
f597852097
f
GR
GS
[1 0 0 1 856.94794 128.53125] CT
1 0.302 0.302 RC
N
f597852097
f
GR
GS
[1 0 0 1 860.59637 71.65625] CT
1 0.302 0.302 RC
N
f597852097
f
GR
GS
[1 0 0 1 852.72375 85.875] CT
1 0.302 0.302 RC
N
f597852097
f
GR
GS
[1 0 0 1 875.04053 142.75] CT
1 0.302 0.302 RC
N
f597852097
f
GR
GS
[1 0 0 1 875.07391 156.96875] CT
1 0.302 0.302 RC
N
f597852097
f
GR
GS
[1 0 0 1 645.42047 71.65625] CT
0.302 GC
N
f597852097
f
GR
GS
[1 0 0 1 638.39355 100.09375] CT
0.302 GC
N
f597852097
f
GR
GS
[1 0 0 1 655.31995 43.21875] CT
0.302 GC
N
f597852097
f
GR
GS
[1 0 0 1 645.7381 171.1875] CT
0.302 GC
N
f597852097
f
GR
GS
[1 0 0 1 659.60834 43.21875] CT
0.302 GC
N
f597852097
f
GR
GS
[1 0 0 1 657.39203 104.83333] CT
0.302 GC
N
f597852097
f
GR
GS
[1 0 0 1 639.02277 71.65625] CT
0.302 GC
N
f597852097
f
GR
GS
[1 0 0 1 645.52679 100.09375] CT
0.302 GC
N
f597852097
f
GR
GS
[1 0 0 1 638.68634 114.3125] CT
0.302 GC
N
f597852097
f
GR
GS
[1 0 0 1 648.14349 43.21875] CT
0.302 GC
N
f597852097
f
GR
GS
[1 0 0 1 654.09692 100.09375] CT
0.302 GC
N
f597852097
f
GR
GS
[1 0 0 1 652.3587 100.09375] CT
0.302 GC
N
f597852097
f
GR
GS
[1 0 0 1 631.11212 71.65625] CT
0.302 GC
N
f597852097
f
GR
GS
[1 0 0 1 654.97949 114.3125] CT
0.302 GC
N
f597852097
f
GR
GS
[1 0 0 1 627.67389 85.875] CT
0.302 GC
N
f597852097
f
GR
GS
[1 0 0 1 641.00671 43.21875] CT
0.302 GC
N
f597852097
f
GR
GS
[1 0 0 1 651.86322 57.4375] CT
0.302 GC
N
f597852097
f
GR
GS
[1 0 0 1 653.57458 57.4375] CT
0.302 GC
N
f597852097
f
GR
GS
[1 0 0 1 639.39203 71.65625] CT
0.302 GC
N
f597852097
f
GR
GS
[1 0 0 1 652.32422 74.5] CT
0.302 GC
N
f597852097
f
GR
GS
[1 0 0 1 657.37268 29] CT
0.302 GC
N
f597852097
f
GR
GS
[1 0 0 1 635.12164 128.53125] CT
0.302 GC
N
f597852097
f
GR
GS
[1 0 0 1 631.25122 57.4375] CT
0.302 GC
N
f597852097
f
GR
GS
[1 0 0 1 634.52106 100.09375] CT
0.302 GC
N
f597852097
f
GR
GS
[1 0 0 1 638.80048 59.33333] CT
0.302 GC
N
f597852097
f
GR
GS
[1 0 0 1 636.64514 61.5] CT
0.302 GC
N
f597852097
f
GR
GS
[1 0 0 1 658.57898 71.65625] CT
0.302 GC
N
f597852097
f
GR
GS
[1 0 0 1 628.57001 29] CT
0.302 GC
N
f597852097
f
GR
GS
[1 0 0 1 647.11133 114.3125] CT
0.302 GC
N
f597852097
f
GR
GS
[1 0 0 1 632.39178 142.75] CT
0.302 GC
N
f597852097
f
GR
GS
[1 0 0 1 655.52789 85.875] CT
0.302 GC
N
f597852097
f
GR
GS
[1 0 0 1 632.55145 29] CT
0.302 GC
N
f597852097
f
GR
GS
[1 0 0 1 644.01288 114.3125] CT
0.302 GC
N
f597852097
f
GR
GS
[1 0 0 1 661.03955 74.5] CT
0.302 GC
N
f597852097
f
GR
GS
[1 0 0 1 638.98523 114.3125] CT
0.302 GC
N
f597852097
f
GR
GS
[1 0 0 1 628.42493 185.40625] CT
0.302 GC
N
f597852097
f
GR
GS
[1 0 0 1 634.13037 156.96875] CT
0.302 GC
N
f597852097
f
GR
GS
[1 0 0 1 640.43848 128.53125] CT
0.302 GC
N
f597852097
f
GR
GS
[1 0 0 1 638.24066 71.65625] CT
0.302 GC
N
f597852097
f
GR
GS
[1 0 0 1 634.67639 100.09375] CT
0.302 GC
N
f597852097
f
GR
GS
[1 0 0 1 658.87463 199.625] CT
0.302 GC
N
f597852097
f
GR
GS
[1 0 0 1 650.21173 142.75] CT
0.302 GC
N
f597852097
f
GR
GS
[1 0 0 1 659.76489 142.75] CT
0.302 GC
N
f597852097
f
GR
GS
[1 0 0 1 641.81311 43.21875] CT
0.302 GC
N
f597852097
f
GR
GS
[1 0 0 1 659.01904 85.875] CT
0.302 GC
N
f597852097
f
GR
GS
[1 0 0 1 627.01233 71.65625] CT
0.302 GC
N
f597852097
f
GR
GS
[1 0 0 1 647.71552 57.4375] CT
0.302 GC
N
f597852097
f
GR
GS
[1 0 0 1 654.24933 85.875] CT
0.302 GC
N
f597852097
f
GR
GS
[1 0 0 1 634.79211 43.21875] CT
0.302 GC
N
f597852097
f
GR
GS
[1 0 0 1 658.74957 29] CT
0.302 GC
N
f597852097
f
GR
GS
[1 0 0 1 652.95422 85.875] CT
0.302 GC
N
f597852097
f
GR
GS
[1 0 0 1 655.11841 100.09375] CT
0.302 GC
N
f597852097
f
GR
GS
[1 0 0 1 646.45361 100.09375] CT
0.302 GC
N
f597852097
f
GR
GS
[1 0 0 1 739.58344 142.75] CT
0.302 GC
N
f597852097
f
GR
GS
[1 0 0 1 723.70715 114.3125] CT
0.302 GC
N
f597852097
f
GR
GS
[1 0 0 1 720.09106 43.21875] CT
0.302 GC
N
f597852097
f
GR
GS
[1 0 0 1 723.13672 128.53125] CT
0.302 GC
N
f597852097
f
GR
GS
[1 0 0 1 732.45746 142.75] CT
0.302 GC
N
f597852097
f
GR
GS
[1 0 0 1 740.86206 156.96875] CT
0.302 GC
N
f597852097
f
GR
GS
[1 0 0 1 722.38586 57.4375] CT
0.302 GC
N
f597852097
f
GR
GS
[1 0 0 1 726.22498 85.875] CT
0.302 GC
N
f597852097
f
GR
GS
[1 0 0 1 741.96295 128.53125] CT
0.302 GC
N
f597852097
f
GR
GS
[1 0 0 1 733.49231 71.65625] CT
0.302 GC
N
f597852097
f
GR
GS
[1 0 0 1 746.38568 85.875] CT
0.302 GC
N
f597852097
f
GR
GS
[1 0 0 1 719.41418 171.1875] CT
0.302 GC
N
f597852097
f
GR
GS
[1 0 0 1 740.76941 128.53125] CT
0.302 GC
N
f597852097
f
GR
GS
[1 0 0 1 735.58575 57.4375] CT
0.302 GC
N
f597852097
f
GR
GS
[1 0 0 1 720.96405 71.65625] CT
0.302 GC
N
f597852097
f
GR
GS
[1 0 0 1 728.73315 128.53125] CT
0.302 GC
N
f597852097
f
GR
GS
[1 0 0 1 726.10583 71.65625] CT
0.302 GC
N
f597852097
f
GR
GS
[1 0 0 1 732.96826 128.53125] CT
0.302 GC
N
f597852097
f
GR
GS
[1 0 0 1 739.85541 142.75] CT
0.302 GC
N
f597852097
f
GR
GS
[1 0 0 1 716.03613 128.53125] CT
0.302 GC
N
f597852097
f
GR
GS
[1 0 0 1 740.5719 142.75] CT
0.302 GC
N
f597852097
f
GR
GS
[1 0 0 1 741.24469 156.96875] CT
0.302 GC
N
f597852097
f
GR
GS
[1 0 0 1 724.57935 114.3125] CT
0.302 GC
N
f597852097
f
GR
GS
[1 0 0 1 727.16736 114.3125] CT
0.302 GC
N
f597852097
f
GR
GS
[1 0 0 1 732.03668 114.3125] CT
0.302 GC
N
f597852097
f
GR
GS
[1 0 0 1 736.44073 135.16666] CT
0.302 GC
N
f597852097
f
GR
GS
[1 0 0 1 737.86713 100.09375] CT
0.302 GC
N
f597852097
f
GR
GS
[1 0 0 1 738.39502 142.75] CT
0.302 GC
N
f597852097
f
GR
GS
[1 0 0 1 725.76514 128.53125] CT
0.302 GC
N
f597852097
f
GR
GS
[1 0 0 1 727.14111 142.75] CT
0.302 GC
N
f597852097
f
GR
GS
[1 0 0 1 745.19232 142.75] CT
0.302 GC
N
f597852097
f
GR
GS
[1 0 0 1 732.06177 114.3125] CT
0.302 GC
N
f597852097
f
GR
GS
[1 0 0 1 741.54047 71.65625] CT
0.302 GC
N
f597852097
f
GR
GS
[1 0 0 1 721.90234 100.09375] CT
0.302 GC
N
f597852097
f
GR
GS
[1 0 0 1 733.75208 43.21875] CT
0.302 GC
N
f597852097
f
GR
GS
[1 0 0 1 732.58887 156.96875] CT
0.302 GC
N
f597852097
f
GR
GS
[1 0 0 1 745.43628 114.3125] CT
0.302 GC
N
f597852097
f
GR
GS
[1 0 0 1 715.3797 142.75] CT
0.302 GC
N
f597852097
f
GR
GS
[1 0 0 1 729.57959 85.875] CT
0.302 GC
N
f597852097
f
GR
GS
[1 0 0 1 730.30194 128.53125] CT
0.302 GC
N
f597852097
f
GR
GS
[1 0 0 1 715.5257 114.3125] CT
0.302 GC
N
f597852097
f
GR
GS
[1 0 0 1 743.4223 114.3125] CT
0.302 GC
N
f597852097
f
GR
GS
[1 0 0 1 742.72778 114.3125] CT
0.302 GC
N
f597852097
f
GR
GS
[1 0 0 1 727.4729 71.65625] CT
0.302 GC
N
f597852097
f
GR
GS
[1 0 0 1 739.21149 71.65625] CT
0.302 GC
N
f597852097
f
GR
GS
[1 0 0 1 717.5224 171.1875] CT
0.302 GC
N
f597852097
f
GR
GS
[1 0 0 1 733.6662 156.96875] CT
0.302 GC
N
f597852097
f
GR
GS
[1 0 0 1 721.36389 71.65625] CT
0.302 GC
N
f597852097
f
GR
GS
[1 0 0 1 727.70123 71.65625] CT
0.302 GC
N
f597852097
f
GR
GS
[1 0 0 1 741.34448 57.4375] CT
0.302 GC
N
f597852097
f
GR
GS
[1 0 0 1 719.15753 71.65625] CT
0.302 GC
N
f597852097
f
GR
GS
[1 0 0 1 722.84442 128.53125] CT
0.302 GC
N
f597852097
f
GR
GS
[1 0 0 1 728.99036 114.3125] CT
0.302 GC
N
f597852097
f
GR
GS
[1 0 0 1 809.63257 156.96875] CT
0.302 GC
N
f597852097
f
GR
GS
[1 0 0 1 825.41064 128.53125] CT
0.302 GC
N
f597852097
f
GR
GS
[1 0 0 1 831.88397 114.3125] CT
0.302 GC
N
f597852097
f
GR
GS
[1 0 0 1 803.50989 135.16666] CT
0.302 GC
N
f597852097
f
GR
GS
[1 0 0 1 806.1756 71.65625] CT
0.302 GC
N
f597852097
f
GR
GS
[1 0 0 1 822.11414 142.75] CT
0.302 GC
N
f597852097
f
GR
GS
[1 0 0 1 810.92242 71.65625] CT
0.302 GC
N
f597852097
f
GR
GS
[1 0 0 1 831.41193 128.53125] CT
0.302 GC
N
f597852097
f
GR
GS
[1 0 0 1 831.36395 142.75] CT
0.302 GC
N
f597852097
f
GR
GS
[1 0 0 1 820.10913 128.53125] CT
0.302 GC
N
f597852097
f
GR
GS
[1 0 0 1 827.52087 142.75] CT
0.302 GC
N
f597852097
f
GR
GS
[1 0 0 1 811.82703 100.09375] CT
0.302 GC
N
f597852097
f
GR
GS
[1 0 0 1 819.70612 114.3125] CT
0.302 GC
N
f597852097
f
GR
GS
[1 0 0 1 831.80688 142.75] CT
0.302 GC
N
f597852097
f
GR
GS
[1 0 0 1 817.22461 142.75] CT
0.302 GC
N
f597852097
f
GR
GS
[1 0 0 1 830.03802 128.53125] CT
0.302 GC
N
f597852097
f
GR
GS
[1 0 0 1 822.73425 85.875] CT
0.302 GC
N
f597852097
f
GR
GS
[1 0 0 1 814.64081 171.1875] CT
0.302 GC
N
f597852097
f
GR
GS
[1 0 0 1 819.94928 156.96875] CT
0.302 GC
N
f597852097
f
GR
GS
[1 0 0 1 828.46405 135.16666] CT
0.302 GC
N
f597852097
f
GR
GS
[1 0 0 1 804.86926 114.3125] CT
0.302 GC
N
f597852097
f
GR
GS
[1 0 0 1 811.60382 71.65625] CT
0.302 GC
N
f597852097
f
GR
GS
[1 0 0 1 832.04449 135.16666] CT
0.302 GC
N
f597852097
f
GR
GS
[1 0 0 1 811.84302 128.53125] CT
0.302 GC
N
f597852097
f
GR
GS
[1 0 0 1 820.62836 114.3125] CT
0.302 GC
N
f597852097
f
GR
GS
[1 0 0 1 828.93365 150.33333] CT
0.302 GC
N
f597852097
f
GR
GS
[1 0 0 1 832.15436 100.09375] CT
0.302 GC
N
f597852097
f
GR
GS
[1 0 0 1 820.43335 128.53125] CT
0.302 GC
N
f597852097
f
GR
GS
[1 0 0 1 801.77643 142.75] CT
0.302 GC
N
f597852097
f
GR
GS
[1 0 0 1 799.29938 85.875] CT
0.302 GC
N
f597852097
f
GR
GS
[1 0 0 1 819.23212 104.83333] CT
0.302 GC
N
f597852097
f
GR
GS
[1 0 0 1 817.48718 156.96875] CT
0.302 GC
N
f597852097
f
GR
GS
[1 0 0 1 831.00977 156.96875] CT
0.302 GC
N
f597852097
f
GR
GS
[1 0 0 1 823.61658 150.33333] CT
0.302 GC
N
f597852097
f
GR
GS
[1 0 0 1 820.75366 71.65625] CT
0.302 GC
N
f597852097
f
GR
GS
[1 0 0 1 815.98596 128.53125] CT
0.302 GC
N
f597852097
f
GR
GS
[1 0 0 1 806.96387 100.09375] CT
0.302 GC
N
f597852097
f
GR
GS
[1 0 0 1 831.0108 128.53125] CT
0.302 GC
N
f597852097
f
GR
GS
[1 0 0 1 816.56451 100.09375] CT
0.302 GC
N
f597852097
f
GR
GS
[1 0 0 1 799.09924 114.3125] CT
0.302 GC
N
f597852097
f
GR
GS
[1 0 0 1 821.91125 85.875] CT
0.302 GC
N
f597852097
f
GR
GS
[1 0 0 1 815.86279 171.1875] CT
0.302 GC
N
f597852097
f
GR
GS
[1 0 0 1 800.08429 128.53125] CT
0.302 GC
N
f597852097
f
GR
GS
[1 0 0 1 828.54626 128.53125] CT
0.302 GC
N
f597852097
f
GR
GS
[1 0 0 1 809.37195 128.53125] CT
0.302 GC
N
f597852097
f
GR
GS
[1 0 0 1 805.92975 128.53125] CT
0.302 GC
N
f597852097
f
GR
GS
[1 0 0 1 801.96521 100.09375] CT
0.302 GC
N
f597852097
f
GR
GS
[1 0 0 1 808.71161 171.1875] CT
0.302 GC
N
f597852097
f
GR
GS
[1 0 0 1 805.88629 156.96875] CT
0.302 GC
N
f597852097
f
GR
GS
[1 0 0 1 820.39343 85.875] CT
0.302 GC
N
f597852097
f
GR
GS
[1 0 0 1 800.32849 142.75] CT
0.302 GC
N
f597852097
f
GR
GS
[1 0 0 1 807.49603 185.40625] CT
0.302 GC
N
f597852097
f
GR
GS
[1 0 0 1 807.71484 71.65625] CT
0.302 GC
N
f597852097
f
GR
GS
[1 0 0 1 913.82977 114.3125] CT
0.302 GC
N
f597852097
f
GR
GS
[1 0 0 1 898.90582 185.40625] CT
0.302 GC
N
f597852097
f
GR
GS
[1 0 0 1 909.57758 114.3125] CT
0.302 GC
N
f597852097
f
GR
GS
[1 0 0 1 904.3504 142.75] CT
0.302 GC
N
f597852097
f
GR
GS
[1 0 0 1 910.51434 142.75] CT
0.302 GC
N
f597852097
f
GR
GS
[1 0 0 1 887.5896 110.25] CT
0.302 GC
N
f597852097
f
GR
GS
[1 0 0 1 917.20331 85.875] CT
0.302 GC
N
f597852097
f
GR
GS
[1 0 0 1 912.75189 114.3125] CT
0.302 GC
N
f597852097
f
GR
GS
[1 0 0 1 885.42212 171.1875] CT
0.302 GC
N
f597852097
f
GR
GS
[1 0 0 1 899.65491 156.96875] CT
0.302 GC
N
f597852097
f
GR
GS
[1 0 0 1 894.84113 135.16666] CT
0.302 GC
N
f597852097
f
GR
GS
[1 0 0 1 905.27203 114.3125] CT
0.302 GC
N
f597852097
f
GR
GS
[1 0 0 1 891.57526 128.53125] CT
0.302 GC
N
f597852097
f
GR
GS
[1 0 0 1 903.54858 114.3125] CT
0.302 GC
N
f597852097
f
GR
GS
[1 0 0 1 904.34558 100.09375] CT
0.302 GC
N
f597852097
f
GR
GS
[1 0 0 1 904.23334 156.96875] CT
0.302 GC
N
f597852097
f
GR
GS
[1 0 0 1 899.04614 128.53125] CT
0.302 GC
N
f597852097
f
GR
GS
[1 0 0 1 884.90076 114.3125] CT
0.302 GC
N
f597852097
f
GR
GS
[1 0 0 1 901.28564 142.75] CT
0.302 GC
N
f597852097
f
GR
GS
[1 0 0 1 897.65228 171.1875] CT
0.302 GC
N
f597852097
f
GR
GS
[1 0 0 1 887.38812 156.96875] CT
0.302 GC
N
f597852097
f
GR
GS
[1 0 0 1 899.43823 185.40625] CT
0.302 GC
N
f597852097
f
GR
GS
[1 0 0 1 899.13025 150.33333] CT
0.302 GC
N
f597852097
f
GR
GS
[1 0 0 1 902.56403 114.3125] CT
0.302 GC
N
f597852097
f
GR
GS
[1 0 0 1 911.27258 114.3125] CT
0.302 GC
N
f597852097
f
GR
GS
[1 0 0 1 907.69165 119.99999] CT
0.302 GC
N
f597852097
f
GR
GS
[1 0 0 1 913.56158 128.53125] CT
0.302 GC
N
f597852097
f
GR
GS
[1 0 0 1 885.4751 104.83333] CT
0.302 GC
N
f597852097
f
GR
GS
[1 0 0 1 891.21161 171.1875] CT
0.302 GC
N
f597852097
f
GR
GS
[1 0 0 1 899.43024 156.96875] CT
0.302 GC
N
f597852097
f
GR
GS
[1 0 0 1 916.51727 156.96875] CT
0.302 GC
N
f597852097
f
GR
GS
[1 0 0 1 910.74652 142.75] CT
0.302 GC
N
f597852097
f
GR
GS
[1 0 0 1 899.16418 156.96875] CT
0.302 GC
N
f597852097
f
GR
GS
[1 0 0 1 895.10742 119.99999] CT
0.302 GC
N
f597852097
f
GR
GS
[1 0 0 1 885.71155 100.09375] CT
0.302 GC
N
f597852097
f
GR
GS
[1 0 0 1 909.06348 100.09375] CT
0.302 GC
N
f597852097
f
GR
GS
[1 0 0 1 901.04523 100.09375] CT
0.302 GC
N
f597852097
f
GR
GS
[1 0 0 1 890.53497 142.75] CT
0.302 GC
N
f597852097
f
GR
GS
[1 0 0 1 898.31891 100.09375] CT
0.302 GC
N
f597852097
f
GR
GS
[1 0 0 1 889.46515 156.96875] CT
0.302 GC
N
f597852097
f
GR
GS
[1 0 0 1 909.43304 185.40625] CT
0.302 GC
N
f597852097
f
GR
GS
[1 0 0 1 896.30353 156.96875] CT
0.302 GC
N
f597852097
f
GR
GS
[1 0 0 1 915.94476 142.75] CT
0.302 GC
N
f597852097
f
GR
GS
[1 0 0 1 884.27563 185.40625] CT
0.302 GC
N
f597852097
f
GR
GS
[1 0 0 1 912.0827 185.40625] CT
0.302 GC
N
f597852097
f
GR
GS
[1 0 0 1 905.14825 114.3125] CT
0.302 GC
N
f597852097
f
GR
GS
[1 0 0 1 902.13953 128.53125] CT
0.302 GC
N
f597852097
f
GR
GS
[1 0 0 1 905.96735 142.75] CT
0.302 GC
N
f597852097
f
GR
GS
[1 0 0 1 908.57458 142.75] CT
0.302 GC
N
f597852097
f
GR
GS
[1 0 0 1 886.92377 71.65625] CT
0.302 GC
N
f597852097
f
GR
GS
[1 0 0 1 913.74438 114.3125] CT
0.302 GC
N
f597852097
f
GR
GS
[1 0 0 1 884.17938 142.75] CT
0.302 GC
N
f597852097
f
GR
GS
[1 0 0 1 893.7674 128.53125] CT
0.302 GC
N
f597852097
f
GR
GS
1 LJ
4 LW
N
609.688 48.376 M
609.688 60.418 L
S
GR
GS
1 LJ
4 LW
N
609.688 48.376 M
609.688 48.376 L
S
GR
GS
1 LJ
4 LW
N
609.688 60.418 M
609.688 60.418 L
S
GR
GS
1 LJ
4 LW
N
695.313 90.589 M
695.313 102.301 L
S
GR
GS
1 LJ
4 LW
N
695.313 90.589 M
695.313 90.589 L
S
GR
GS
1 LJ
4 LW
N
695.313 102.301 M
695.313 102.301 L
S
GR
GS
1 LJ
4 LW
N
780.938 99.291 M
780.938 110.948 L
S
GR
GS
1 LJ
4 LW
N
780.938 99.291 M
780.938 99.291 L
S
GR
GS
1 LJ
4 LW
N
780.938 110.948 M
780.938 110.948 L
S
GR
GS
1 LJ
4 LW
N
866.563 115.502 M
866.563 124.462 L
S
GR
GS
1 LJ
4 LW
N
866.563 115.502 M
866.563 115.502 L
S
GR
GS
1 LJ
4 LW
N
866.563 124.462 M
866.563 124.462 L
S
GR
GS
1 LJ
4 LW
N
643.938 82.8 M
643.938 93.861 L
S
GR
GS
1 LJ
4 LW
N
643.938 82.8 M
643.938 82.8 L
S
GR
GS
1 LJ
4 LW
N
643.938 93.861 M
643.938 93.861 L
S
GR
GS
1 LJ
4 LW
N
729.563 106.779 M
729.563 116.194 L
S
GR
GS
1 LJ
4 LW
N
729.563 106.779 M
729.563 106.779 L
S
GR
GS
1 LJ
4 LW
N
729.563 116.194 M
729.563 116.194 L
S
GR
GS
1 LJ
4 LW
N
815.188 120.747 M
815.188 128.696 L
S
GR
GS
1 LJ
4 LW
N
815.188 120.747 M
815.188 120.747 L
S
GR
GS
1 LJ
4 LW
N
815.188 128.696 M
815.188 128.696 L
S
GR
GS
1 LJ
4 LW
N
900.813 131.376 M
900.813 139.019 L
S
GR
GS
1 LJ
4 LW
N
900.813 131.376 M
900.813 131.376 L
S
GR
GS
1 LJ
4 LW
N
900.813 139.019 M
900.813 139.019 L
S
GR
GS
[1 0 0 1 609.6875 233.75] CT
/Helvetica-Bold 20 F
GS
[1 0 0 1 0 0] CT
-12.5 7.5 moveto 
1 -1 scale
(***) t 
GR
GR
GS
[1 0 0 1 643.9375 233.75] CT
/Helvetica-Bold 20 F
GS
[1 0 0 1 0 0] CT
-12.5 7.5 moveto 
1 -1 scale
(***) t 
GR
GR
GS
[1 0 0 1 695.3125 233.75] CT
/Helvetica-Bold 20 F
GS
[1 0 0 1 0 0] CT
-12.5 7.5 moveto 
1 -1 scale
(***) t 
GR
GR
GS
[1 0 0 1 729.5625 233.75] CT
/Helvetica-Bold 20 F
GS
[1 0 0 1 0 0] CT
-12.5 7.5 moveto 
1 -1 scale
(***) t 
GR
GR
GS
[1 0 0 1 780.9375 233.75] CT
/Helvetica-Bold 20 F
GS
[1 0 0 1 0 0] CT
-12.5 7.5 moveto 
1 -1 scale
(***) t 
GR
GR
GS
[1 0 0 1 815.1875 233.75] CT
/Helvetica-Bold 20 F
GS
[1 0 0 1 0 0] CT
-12.5 7.5 moveto 
1 -1 scale
(***) t 
GR
GR
GS
[1 0 0 1 866.5625 233.75] CT
/Helvetica-Bold 20 F
GS
[1 0 0 1 0 0] CT
-12.5 7.5 moveto 
1 -1 scale
(***) t 
GR
GR
GS
[1 0 0 1 900.8125 233.75] CT
/Helvetica 20 F
GS
[1 0 0 1 0 0] CT
-16.5 7.5 moveto 
1 -1 scale
(n.s.) t 
GR
GR
%%Trailer
%%Pages: 1
%%EOF
