%!PS-Adobe-3.0 EPSF-3.0
%%Creator: (MATLAB, The Mathworks, Inc. Version 9.7.0.1190202 \(R2019b\). Operating System: Mac OS X)
%%Title: /Users/julian.kosciessa/Volumes/tardis/LNDG/stateswitch/stsw_beh_task/behavior/figures/a03s_mediansplit_yaoa.eps
%%CreationDate: 2023-07-13T14:49:23
%%Pages: (atend)
%%BoundingBox:    81     0   703   220
%%LanguageLevel: 3
%%EndComments
%%BeginProlog
%%BeginResource: procset (Apache XML Graphics Std ProcSet) 1.2 0
%%Version: 1.2 0
%%Copyright: (Copyright 2001-2003,2010 The Apache Software Foundation. License terms: http://www.apache.org/licenses/LICENSE-2.0)
/bd{bind def}bind def
/ld{load def}bd
/GR/grestore ld
/GS/gsave ld
/RM/rmoveto ld
/C/curveto ld
/t/show ld
/L/lineto ld
/ML/setmiterlimit ld
/CT/concat ld
/f/fill ld
/N/newpath ld
/S/stroke ld
/CC/setcmykcolor ld
/A/ashow ld
/cp/closepath ld
/RC/setrgbcolor ld
/LJ/setlinejoin ld
/GC/setgray ld
/LW/setlinewidth ld
/M/moveto ld
/re {4 2 roll M
1 index 0 rlineto
0 exch rlineto
neg 0 rlineto
cp } bd
/_ctm matrix def
/_tm matrix def
/BT { _ctm currentmatrix pop matrix _tm copy pop 0 0 moveto } bd
/ET { _ctm setmatrix } bd
/iTm { _ctm setmatrix _tm concat } bd
/Tm { _tm astore pop iTm 0 0 moveto } bd
/ux 0.0 def
/uy 0.0 def
/F {
  /Tp exch def
  /Tf exch def
  Tf findfont Tp scalefont setfont
  /cf Tf def  /cs Tp def
} bd
/ULS {currentpoint /uy exch def /ux exch def} bd
/ULE {
  /Tcx currentpoint pop def
  gsave
  newpath
  cf findfont cs scalefont dup
  /FontMatrix get 0 get /Ts exch def /FontInfo get dup
  /UnderlinePosition get Ts mul /To exch def
  /UnderlineThickness get Ts mul /Tt exch def
  ux uy To add moveto  Tcx uy To add lineto
  Tt setlinewidth stroke
  grestore
} bd
/OLE {
  /Tcx currentpoint pop def
  gsave
  newpath
  cf findfont cs scalefont dup
  /FontMatrix get 0 get /Ts exch def /FontInfo get dup
  /UnderlinePosition get Ts mul /To exch def
  /UnderlineThickness get Ts mul /Tt exch def
  ux uy To add cs add moveto Tcx uy To add cs add lineto
  Tt setlinewidth stroke
  grestore
} bd
/SOE {
  /Tcx currentpoint pop def
  gsave
  newpath
  cf findfont cs scalefont dup
  /FontMatrix get 0 get /Ts exch def /FontInfo get dup
  /UnderlinePosition get Ts mul /To exch def
  /UnderlineThickness get Ts mul /Tt exch def
  ux uy To add cs 10 mul 26 idiv add moveto Tcx uy To add cs 10 mul 26 idiv add lineto
  Tt setlinewidth stroke
  grestore
} bd
/QT {
/Y22 exch store
/X22 exch store
/Y21 exch store
/X21 exch store
currentpoint
/Y21 load 2 mul add 3 div exch
/X21 load 2 mul add 3 div exch
/X21 load 2 mul /X22 load add 3 div
/Y21 load 2 mul /Y22 load add 3 div
/X22 load /Y22 load curveto
} bd
/SSPD {
dup length /d exch dict def
{
/v exch def
/k exch def
currentpagedevice k known {
/cpdv currentpagedevice k get def
v cpdv ne {
/upd false def
/nullv v type /nulltype eq def
/nullcpdv cpdv type /nulltype eq def
nullv nullcpdv or
{
/upd true def
} {
/sametype v type cpdv type eq def
sametype {
v type /arraytype eq {
/vlen v length def
/cpdvlen cpdv length def
vlen cpdvlen eq {
0 1 vlen 1 sub {
/i exch def
/obj v i get def
/cpdobj cpdv i get def
obj cpdobj ne {
/upd true def
exit
} if
} for
} {
/upd true def
} ifelse
} {
v type /dicttype eq {
v {
/dv exch def
/dk exch def
/cpddv cpdv dk get def
dv cpddv ne {
/upd true def
exit
} if
} forall
} {
/upd true def
} ifelse
} ifelse
} if
} ifelse
upd true eq {
d k v put
} if
} if
} if
} forall
d length 0 gt {
d setpagedevice
} if
} bd
/RE { % /NewFontName [NewEncodingArray] /FontName RE -
  findfont dup length dict begin
  {
    1 index /FID ne
    {def} {pop pop} ifelse
  } forall
  /Encoding exch def
  /FontName 1 index def
  currentdict definefont pop
  end
} bind def
%%EndResource
%%BeginResource: procset (Apache XML Graphics EPS ProcSet) 1.0 0
%%Version: 1.0 0
%%Copyright: (Copyright 2002-2003 The Apache Software Foundation. License terms: http://www.apache.org/licenses/LICENSE-2.0)
/BeginEPSF { %def
/b4_Inc_state save def         % Save state for cleanup
/dict_count countdictstack def % Count objects on dict stack
/op_count count 1 sub def      % Count objects on operand stack
userdict begin                 % Push userdict on dict stack
/showpage { } def              % Redefine showpage, { } = null proc
0 setgray 0 setlinecap         % Prepare graphics state
1 setlinewidth 0 setlinejoin
10 setmiterlimit [ ] 0 setdash newpath
/languagelevel where           % If level not equal to 1 then
{pop languagelevel             % set strokeadjust and
1 ne                           % overprint to their defaults.
{false setstrokeadjust false setoverprint
} if
} if
} bd
/EndEPSF { %def
count op_count sub {pop} repeat            % Clean up stacks
countdictstack dict_count sub {end} repeat
b4_Inc_state restore
} bd
%%EndResource
%FOPBeginFontDict
%%IncludeResource: font Courier-Oblique
%%IncludeResource: font Courier-BoldOblique
%%IncludeResource: font Courier-Bold
%%IncludeResource: font ZapfDingbats
%%IncludeResource: font Symbol
%%IncludeResource: font Helvetica
%%IncludeResource: font Helvetica-Oblique
%%IncludeResource: font Helvetica-Bold
%%IncludeResource: font Helvetica-BoldOblique
%%IncludeResource: font Times-Roman
%%IncludeResource: font Times-Italic
%%IncludeResource: font Times-Bold
%%IncludeResource: font Times-BoldItalic
%%IncludeResource: font Courier
%FOPEndFontDict
%%BeginResource: encoding WinAnsiEncoding
/WinAnsiEncoding [
/.notdef /.notdef /.notdef /.notdef /.notdef
/.notdef /.notdef /.notdef /.notdef /.notdef
/.notdef /.notdef /.notdef /.notdef /.notdef
/.notdef /.notdef /.notdef /.notdef /.notdef
/.notdef /.notdef /.notdef /.notdef /.notdef
/.notdef /.notdef /.notdef /.notdef /.notdef
/.notdef /.notdef /space /exclam /quotedbl
/numbersign /dollar /percent /ampersand /quotesingle
/parenleft /parenright /asterisk /plus /comma
/hyphen /period /slash /zero /one
/two /three /four /five /six
/seven /eight /nine /colon /semicolon
/less /equal /greater /question /at
/A /B /C /D /E
/F /G /H /I /J
/K /L /M /N /O
/P /Q /R /S /T
/U /V /W /X /Y
/Z /bracketleft /backslash /bracketright /asciicircum
/underscore /quoteleft /a /b /c
/d /e /f /g /h
/i /j /k /l /m
/n /o /p /q /r
/s /t /u /v /w
/x /y /z /braceleft /bar
/braceright /asciitilde /bullet /Euro /bullet
/quotesinglbase /florin /quotedblbase /ellipsis /dagger
/daggerdbl /circumflex /perthousand /Scaron /guilsinglleft
/OE /bullet /Zcaron /bullet /bullet
/quoteleft /quoteright /quotedblleft /quotedblright /bullet
/endash /emdash /asciitilde /trademark /scaron
/guilsinglright /oe /bullet /zcaron /Ydieresis
/space /exclamdown /cent /sterling /currency
/yen /brokenbar /section /dieresis /copyright
/ordfeminine /guillemotleft /logicalnot /sfthyphen /registered
/macron /degree /plusminus /twosuperior /threesuperior
/acute /mu /paragraph /middot /cedilla
/onesuperior /ordmasculine /guillemotright /onequarter /onehalf
/threequarters /questiondown /Agrave /Aacute /Acircumflex
/Atilde /Adieresis /Aring /AE /Ccedilla
/Egrave /Eacute /Ecircumflex /Edieresis /Igrave
/Iacute /Icircumflex /Idieresis /Eth /Ntilde
/Ograve /Oacute /Ocircumflex /Otilde /Odieresis
/multiply /Oslash /Ugrave /Uacute /Ucircumflex
/Udieresis /Yacute /Thorn /germandbls /agrave
/aacute /acircumflex /atilde /adieresis /aring
/ae /ccedilla /egrave /eacute /ecircumflex
/edieresis /igrave /iacute /icircumflex /idieresis
/eth /ntilde /ograve /oacute /ocircumflex
/otilde /odieresis /divide /oslash /ugrave
/uacute /ucircumflex /udieresis /yacute /thorn
/ydieresis
] def
%%EndResource
%FOPBeginFontReencode
/Courier-Oblique findfont
dup length dict begin
  {1 index /FID ne {def} {pop pop} ifelse} forall
  /Encoding WinAnsiEncoding def
  currentdict
end
/Courier-Oblique exch definefont pop
/Courier-BoldOblique findfont
dup length dict begin
  {1 index /FID ne {def} {pop pop} ifelse} forall
  /Encoding WinAnsiEncoding def
  currentdict
end
/Courier-BoldOblique exch definefont pop
/Courier-Bold findfont
dup length dict begin
  {1 index /FID ne {def} {pop pop} ifelse} forall
  /Encoding WinAnsiEncoding def
  currentdict
end
/Courier-Bold exch definefont pop
/Helvetica findfont
dup length dict begin
  {1 index /FID ne {def} {pop pop} ifelse} forall
  /Encoding WinAnsiEncoding def
  currentdict
end
/Helvetica exch definefont pop
/Helvetica-Oblique findfont
dup length dict begin
  {1 index /FID ne {def} {pop pop} ifelse} forall
  /Encoding WinAnsiEncoding def
  currentdict
end
/Helvetica-Oblique exch definefont pop
/Helvetica-Bold findfont
dup length dict begin
  {1 index /FID ne {def} {pop pop} ifelse} forall
  /Encoding WinAnsiEncoding def
  currentdict
end
/Helvetica-Bold exch definefont pop
/Helvetica-BoldOblique findfont
dup length dict begin
  {1 index /FID ne {def} {pop pop} ifelse} forall
  /Encoding WinAnsiEncoding def
  currentdict
end
/Helvetica-BoldOblique exch definefont pop
/Times-Roman findfont
dup length dict begin
  {1 index /FID ne {def} {pop pop} ifelse} forall
  /Encoding WinAnsiEncoding def
  currentdict
end
/Times-Roman exch definefont pop
/Times-Italic findfont
dup length dict begin
  {1 index /FID ne {def} {pop pop} ifelse} forall
  /Encoding WinAnsiEncoding def
  currentdict
end
/Times-Italic exch definefont pop
/Times-Bold findfont
dup length dict begin
  {1 index /FID ne {def} {pop pop} ifelse} forall
  /Encoding WinAnsiEncoding def
  currentdict
end
/Times-Bold exch definefont pop
/Times-BoldItalic findfont
dup length dict begin
  {1 index /FID ne {def} {pop pop} ifelse} forall
  /Encoding WinAnsiEncoding def
  currentdict
end
/Times-BoldItalic exch definefont pop
/Courier findfont
dup length dict begin
  {1 index /FID ne {def} {pop pop} ifelse} forall
  /Encoding WinAnsiEncoding def
  currentdict
end
/Courier exch definefont pop
%FOPEndFontReencode
%%EndProlog
%%Page: 1 1
%%PageBoundingBox: 0 0 778 223
%%BeginPageSetup
[1 0 0 -1 0 223] CT
%%EndPageSetup
GS
[0.99949 0 0 1.00179 0 -0.39999] CT
1 GC
N
0 0 778 223 re
f
GR
GS
[0.99949 0 0 1.00179 0 -0.39999] CT
1 GC
N
0 0 778 223 re
f
GR
GS
[0.99949 0 0 1.00179 0 -0.39999] CT
1 GC
N
124.5 173.5 M
222.5 173.5 L
222.5 27 L
124.5 27 L
cp
f
GR
GS
[0.99949 0 0 1.00179 0 -0.39999] CT
0.149 GC
2 setlinecap
1 LJ
0.5 LW
N
124.5 173.5 M
222.5 173.5 L
S
GR
GS
[0.99949 0 0 1.00179 0 -0.39999] CT
0.149 GC
2 setlinecap
1 LJ
0.5 LW
N
136.75 173.5 M
136.75 172.035 L
S
GR
GS
[0.99949 0 0 1.00179 0 -0.39999] CT
0.149 GC
2 setlinecap
1 LJ
0.5 LW
N
161.25 173.5 M
161.25 172.035 L
S
GR
GS
[0.99949 0 0 1.00179 0 -0.39999] CT
0.149 GC
2 setlinecap
1 LJ
0.5 LW
N
185.75 173.5 M
185.75 172.035 L
S
GR
GS
[0.99949 0 0 1.00179 0 -0.39999] CT
0.149 GC
2 setlinecap
1 LJ
0.5 LW
N
210.25 173.5 M
210.25 172.035 L
S
GR
GS
[0.99949 0 0 1.00179 136.6797 179.02126] CT
0.149 GC
/Helvetica 18 F
GS
[1 0 0 1 0 0] CT
-5.5 18 moveto 
1 -1 scale
(1) t 
GR
GR
GS
[0.99949 0 0 1.00179 161.1671 179.02126] CT
0.149 GC
/Helvetica 18 F
GS
[1 0 0 1 0 0] CT
-5.5 18 moveto 
1 -1 scale
(2) t 
GR
GR
GS
[0.99949 0 0 1.00179 185.65451 179.02126] CT
0.149 GC
/Helvetica 18 F
GS
[1 0 0 1 0 0] CT
-5.5 18 moveto 
1 -1 scale
(3) t 
GR
GR
GS
[0.99949 0 0 1.00179 210.14191 179.02126] CT
0.149 GC
/Helvetica 18 F
GS
[1 0 0 1 0 0] CT
-5.5 18 moveto 
1 -1 scale
(4) t 
GR
GR
GS
[0.99949 0 0 1.00179 173.41085 201.56161] CT
0.149 GC
/Helvetica 18 F
GS
[1 0 0 1 0 0] CT
-46 18 moveto 
1 -1 scale
(# of targets) t 
GR
GR
GS
[0.99949 0 0 1.00179 0 -0.39999] CT
0.149 GC
2 setlinecap
1 LJ
0.5 LW
N
124.5 173.5 M
124.5 27 L
S
GR
GS
[0.99949 0 0 1.00179 0 -0.39999] CT
0.149 GC
2 setlinecap
1 LJ
0.5 LW
N
124.5 157.222 M
125.965 157.222 L
S
GR
GS
[0.99949 0 0 1.00179 0 -0.39999] CT
0.149 GC
2 setlinecap
1 LJ
0.5 LW
N
124.5 124.667 M
125.965 124.667 L
S
GR
GS
[0.99949 0 0 1.00179 0 -0.39999] CT
0.149 GC
2 setlinecap
1 LJ
0.5 LW
N
124.5 92.111 M
125.965 92.111 L
S
GR
GS
[0.99949 0 0 1.00179 0 -0.39999] CT
0.149 GC
2 setlinecap
1 LJ
0.5 LW
N
124.5 59.556 M
125.965 59.556 L
S
GR
GS
[0.99949 0 0 1.00179 0 -0.39999] CT
0.149 GC
2 setlinecap
1 LJ
0.5 LW
N
124.5 27 M
125.965 27 L
S
GR
GS
[0.99949 0 0 1.00179 118.83888 157.10424] CT
0.149 GC
/Helvetica 18 F
GS
[1 0 0 1 0 0] CT
-18 7 moveto 
1 -1 scale
(-1) t 
GR
GR
GS
[0.99949 0 0 1.00179 118.83888 124.49028] CT
0.149 GC
/Helvetica 18 F
GS
[1 0 0 1 0 0] CT
-11 7 moveto 
1 -1 scale
(0) t 
GR
GR
GS
[0.99949 0 0 1.00179 118.83888 91.87634] CT
0.149 GC
/Helvetica 18 F
GS
[1 0 0 1 0 0] CT
-11 7 moveto 
1 -1 scale
(1) t 
GR
GR
GS
[0.99949 0 0 1.00179 118.83888 59.26239] CT
0.149 GC
/Helvetica 18 F
GS
[1 0 0 1 0 0] CT
-11 7 moveto 
1 -1 scale
(2) t 
GR
GR
GS
[0.99949 0 0 1.00179 118.83888 26.64844] CT
0.149 GC
/Helvetica 18 F
GS
[1 0 0 1 0 0] CT
-11 7 moveto 
1 -1 scale
(3) t 
GR
GR
GS
[0 -1.00179 0.99949 0 98.34941 100.02976] CT
0.149 GC
/Helvetica 18 F
GS
[1 0 0 1 0 0] CT
-42.5 -4 moveto 
1 -1 scale
(BOLD LV1) t 
GR
GR
GS
[0.99949 0 0 1.00179 124.93574 22.64126] CT
0.149 GC
N
2.641 -0.516 M
2.641 -0.656 2.734 -0.781 QT
6.484 -4.5 L
2.734 -8.25 L
2.641 -8.328 2.641 -8.484 QT
2.641 -8.609 2.75 -8.727 QT
2.859 -8.844 3 -8.844 QT
3.125 -8.844 3.281 -8.734 QT
7 -5 L
10.719 -8.734 L
10.859 -8.844 10.984 -8.844 QT
11.125 -8.844 11.234 -8.734 QT
11.344 -8.625 11.344 -8.484 QT
11.344 -8.328 11.25 -8.25 QT
7.5 -4.5 L
11.25 -0.781 L
11.344 -0.656 11.344 -0.516 QT
11.344 -0.375 11.234 -0.266 QT
11.125 -0.156 10.984 -0.156 QT
10.844 -0.156 10.719 -0.297 QT
7 -4 L
3.281 -0.297 L
3.141 -0.156 3 -0.156 QT
2.859 -0.156 2.75 -0.273 QT
2.641 -0.391 2.641 -0.516 QT
cp
f
GR
GS
[0.99949 0 0 1.00179 138.92854 22.64126] CT
0.149 GC
/Helvetica 18 F
GS
[1 0 0 1 0 0] CT
0 0 moveto 
1 -1 scale
(10) t 
GR
GR
GS
[0.99949 0 0 1.00179 159.91775 13.62512] CT
0.149 GC
/Helvetica 14.4 F
GS
[1 0 0 1 0 0] CT
0 0 moveto 
1 -1 scale
(4) t 
GR
GR
GS
[0.99949 0 0 1.00179 0 -0.39999] CT
1 LJ
2 LW
N
136.75 151.685 M
136.75 155.865 L
S
GR
GS
[0.99949 0 0 1.00179 0 -0.39999] CT
1 LJ
2 LW
N
161.25 58.257 M
161.25 63.096 L
S
GR
GS
[0.99949 0 0 1.00179 0 -0.39999] CT
1 LJ
2 LW
N
185.75 37.662 M
185.75 42.217 L
S
GR
GS
[0.99949 0 0 1.00179 0 -0.39999] CT
1 LJ
2 LW
N
210.25 39.167 M
210.25 42.631 L
S
GR
GS
[0.99949 0 0 1.00179 0 -0.39999] CT
1 LJ
2 LW
N
136.75 151.685 M
136.75 147.505 L
S
GR
GS
[0.99949 0 0 1.00179 0 -0.39999] CT
1 LJ
2 LW
N
161.25 58.257 M
161.25 53.418 L
S
GR
GS
[0.99949 0 0 1.00179 0 -0.39999] CT
1 LJ
2 LW
N
185.75 37.662 M
185.75 33.107 L
S
GR
GS
[0.99949 0 0 1.00179 0 -0.39999] CT
1 LJ
2 LW
N
210.25 39.167 M
210.25 35.703 L
S
GR
GS
[0.99949 0 0 1.00179 0 -0.39999] CT
1 LJ
2 LW
N
136.75 151.685 M
161.25 58.257 L
185.75 37.662 L
210.25 39.167 L
S
GR
GS
[0.99949 0 0 1.00179 136.6797 155.74472] CT
N
-3 0 M
3 0 L
f
GR
GS
[0.99949 0 0 1.00179 136.6797 155.74472] CT
10.0 ML
2 LW
N
-3 0 M
3 0 L
S
GR
GS
[0.99949 0 0 1.00179 161.1671 62.80913] CT
N
/f1394637256{-3 0 M
3 0 L}def
f1394637256
f
GR
GS
[0.99949 0 0 1.00179 161.1671 62.80913] CT
10.0 ML
2 LW
N
-3 0 M
3 0 L
S
GR
GS
[0.99949 0 0 1.00179 185.65451 41.89232] CT
N
f1394637256
f
GR
GS
[0.99949 0 0 1.00179 185.65451 41.89232] CT
10.0 ML
2 LW
N
-3 0 M
3 0 L
S
GR
GS
[0.99949 0 0 1.00179 210.14191 42.30763] CT
N
f1394637256
f
GR
GS
[0.99949 0 0 1.00179 210.14191 42.30763] CT
10.0 ML
2 LW
N
-3 0 M
3 0 L
S
GR
GS
[0.99949 0 0 1.00179 136.6797 147.36936] CT
N
f1394637256
f
GR
GS
[0.99949 0 0 1.00179 136.6797 147.36936] CT
10.0 ML
2 LW
N
-3 0 M
3 0 L
S
GR
GS
[0.99949 0 0 1.00179 161.1671 53.114] CT
N
f1394637256
f
GR
GS
[0.99949 0 0 1.00179 161.1671 53.114] CT
10.0 ML
2 LW
N
-3 0 M
3 0 L
S
GR
GS
[0.99949 0 0 1.00179 185.65451 32.76633] CT
N
f1394637256
f
GR
GS
[0.99949 0 0 1.00179 185.65451 32.76633] CT
10.0 ML
2 LW
N
-3 0 M
3 0 L
S
GR
GS
[0.99949 0 0 1.00179 210.14191 35.36694] CT
N
f1394637256
f
GR
GS
[0.99949 0 0 1.00179 210.14191 35.36694] CT
10.0 ML
2 LW
N
-3 0 M
3 0 L
S
GR
GS
[0.99949 0 0 1.00179 0 -0.39999] CT
1 LJ
2 LW
N
136.75 122.084 M
136.75 125.189 L
S
GR
GS
[0.99949 0 0 1.00179 0 -0.39999] CT
1 LJ
2 LW
N
161.25 83.646 M
161.25 88.005 L
S
GR
GS
[0.99949 0 0 1.00179 0 -0.39999] CT
1 LJ
2 LW
N
185.75 78.705 M
185.75 83.376 L
S
GR
GS
[0.99949 0 0 1.00179 0 -0.39999] CT
1 LJ
2 LW
N
210.25 82.677 M
210.25 86.112 L
S
GR
GS
[0.99949 0 0 1.00179 0 -0.39999] CT
1 LJ
2 LW
N
136.75 122.084 M
136.75 118.978 L
S
GR
GS
[0.99949 0 0 1.00179 0 -0.39999] CT
1 LJ
2 LW
N
161.25 83.646 M
161.25 79.288 L
S
GR
GS
[0.99949 0 0 1.00179 0 -0.39999] CT
1 LJ
2 LW
N
185.75 78.705 M
185.75 74.034 L
S
GR
GS
[0.99949 0 0 1.00179 0 -0.39999] CT
1 LJ
2 LW
N
210.25 82.677 M
210.25 79.242 L
S
GR
GS
[0.99949 0 0 1.00179 0 -0.39999] CT
[8 8] 0 setdash
2 LJ
2 LW
N
136.75 122.084 M
161.25 83.646 L
185.75 78.705 L
210.25 82.677 L
S
GR
GS
[0.99949 0 0 1.00179 136.6797 125.01362] CT
N
f1394637256
f
GR
GS
[0.99949 0 0 1.00179 136.6797 125.01362] CT
10.0 ML
2 LW
N
-3 0 M
3 0 L
S
GR
GS
[0.99949 0 0 1.00179 161.1671 87.76254] CT
N
f1394637256
f
GR
GS
[0.99949 0 0 1.00179 161.1671 87.76254] CT
10.0 ML
2 LW
N
-3 0 M
3 0 L
S
GR
GS
[0.99949 0 0 1.00179 185.65451 83.12579] CT
N
f1394637256
f
GR
GS
[0.99949 0 0 1.00179 185.65451 83.12579] CT
10.0 ML
2 LW
N
-3 0 M
3 0 L
S
GR
GS
[0.99949 0 0 1.00179 210.14191 85.86641] CT
N
f1394637256
f
GR
GS
[0.99949 0 0 1.00179 210.14191 85.86641] CT
10.0 ML
2 LW
N
-3 0 M
3 0 L
S
GR
GS
[0.99949 0 0 1.00179 136.6797 118.79144] CT
N
f1394637256
f
GR
GS
[0.99949 0 0 1.00179 136.6797 118.79144] CT
10.0 ML
2 LW
N
-3 0 M
3 0 L
S
GR
GS
[0.99949 0 0 1.00179 161.1671 79.03054] CT
N
f1394637256
f
GR
GS
[0.99949 0 0 1.00179 161.1671 79.03054] CT
10.0 ML
2 LW
N
-3 0 M
3 0 L
S
GR
GS
[0.99949 0 0 1.00179 185.65451 73.76675] CT
N
f1394637256
f
GR
GS
[0.99949 0 0 1.00179 185.65451 73.76675] CT
10.0 ML
2 LW
N
-3 0 M
3 0 L
S
GR
GS
[0.99949 0 0 1.00179 210.14191 78.98407] CT
N
f1394637256
f
GR
GS
[0.99949 0 0 1.00179 210.14191 78.98407] CT
10.0 ML
2 LW
N
-3 0 M
3 0 L
S
GR
GS
[0.99949 0 0 1.00179 0 -0.39999] CT
1 GC
N
/f485843716{284.5 173.5 M
383 173.5 L
383 27 L
284.5 27 L
cp}def
f485843716
f
GR
GS
[0.99949 0 0 1.00179 0 -0.39999] CT
0.149 GC
2 setlinecap
1 LJ
0.5 LW
N
284.5 173.5 M
383 173.5 L
S
GR
GS
[0.99949 0 0 1.00179 0 -0.39999] CT
0.149 GC
2 setlinecap
1 LJ
0.5 LW
N
296.813 173.5 M
296.813 172.035 L
S
GR
GS
[0.99949 0 0 1.00179 0 -0.39999] CT
0.149 GC
2 setlinecap
1 LJ
0.5 LW
N
321.438 173.5 M
321.438 172.035 L
S
GR
GS
[0.99949 0 0 1.00179 0 -0.39999] CT
0.149 GC
2 setlinecap
1 LJ
0.5 LW
N
346.063 173.5 M
346.063 172.035 L
S
GR
GS
[0.99949 0 0 1.00179 0 -0.39999] CT
0.149 GC
2 setlinecap
1 LJ
0.5 LW
N
370.688 173.5 M
370.688 172.035 L
S
GR
GS
[0.99949 0 0 1.00179 296.65991 179.02126] CT
0.149 GC
/Helvetica 18 F
GS
[1 0 0 1 0 0] CT
-5.5 18 moveto 
1 -1 scale
(1) t 
GR
GR
GS
[0.99949 0 0 1.00179 321.27225 179.02126] CT
0.149 GC
/Helvetica 18 F
GS
[1 0 0 1 0 0] CT
-5.5 18 moveto 
1 -1 scale
(2) t 
GR
GR
GS
[0.99949 0 0 1.00179 345.88459 179.02126] CT
0.149 GC
/Helvetica 18 F
GS
[1 0 0 1 0 0] CT
-5.5 18 moveto 
1 -1 scale
(3) t 
GR
GR
GS
[0.99949 0 0 1.00179 370.49693 179.02126] CT
0.149 GC
/Helvetica 18 F
GS
[1 0 0 1 0 0] CT
-5.5 18 moveto 
1 -1 scale
(4) t 
GR
GR
GS
[0.99949 0 0 1.00179 333.57848 201.56161] CT
0.149 GC
/Helvetica 18 F
GS
[1 0 0 1 0 0] CT
-46 18 moveto 
1 -1 scale
(# of targets) t 
GR
GR
GS
[0.99949 0 0 1.00179 0 -0.39999] CT
0.149 GC
2 setlinecap
1 LJ
0.5 LW
N
284.5 173.5 M
284.5 27 L
S
GR
GS
[0.99949 0 0 1.00179 0 -0.39999] CT
0.149 GC
2 setlinecap
1 LJ
0.5 LW
N
284.5 157.222 M
285.965 157.222 L
S
GR
GS
[0.99949 0 0 1.00179 0 -0.39999] CT
0.149 GC
2 setlinecap
1 LJ
0.5 LW
N
284.5 124.667 M
285.965 124.667 L
S
GR
GS
[0.99949 0 0 1.00179 0 -0.39999] CT
0.149 GC
2 setlinecap
1 LJ
0.5 LW
N
284.5 92.111 M
285.965 92.111 L
S
GR
GS
[0.99949 0 0 1.00179 0 -0.39999] CT
0.149 GC
2 setlinecap
1 LJ
0.5 LW
N
284.5 59.556 M
285.965 59.556 L
S
GR
GS
[0.99949 0 0 1.00179 0 -0.39999] CT
0.149 GC
2 setlinecap
1 LJ
0.5 LW
N
284.5 27 M
285.965 27 L
S
GR
GS
[0.99949 0 0 1.00179 278.75661 157.10424] CT
0.149 GC
/Helvetica 18 F
GS
[1 0 0 1 0 0] CT
-18 7 moveto 
1 -1 scale
(-1) t 
GR
GR
GS
[0.99949 0 0 1.00179 278.75661 124.49028] CT
0.149 GC
/Helvetica 18 F
GS
[1 0 0 1 0 0] CT
-11 7 moveto 
1 -1 scale
(0) t 
GR
GR
GS
[0.99949 0 0 1.00179 278.75661 91.87634] CT
0.149 GC
/Helvetica 18 F
GS
[1 0 0 1 0 0] CT
-11 7 moveto 
1 -1 scale
(1) t 
GR
GR
GS
[0.99949 0 0 1.00179 278.75661 59.26239] CT
0.149 GC
/Helvetica 18 F
GS
[1 0 0 1 0 0] CT
-11 7 moveto 
1 -1 scale
(2) t 
GR
GR
GS
[0.99949 0 0 1.00179 278.75661 26.64844] CT
0.149 GC
/Helvetica 18 F
GS
[1 0 0 1 0 0] CT
-11 7 moveto 
1 -1 scale
(3) t 
GR
GR
GS
[0 -1.00179 0.99949 0 258.26715 100.02976] CT
0.149 GC
/Helvetica 18 F
GS
[1 0 0 1 0 0] CT
-42.5 -4 moveto 
1 -1 scale
(BOLD LV1) t 
GR
GR
GS
[0.99949 0 0 1.00179 284.85348 22.64126] CT
0.149 GC
N
/f-1265391899{2.641 -0.516 M
2.641 -0.656 2.734 -0.781 QT
6.484 -4.5 L
2.734 -8.25 L
2.641 -8.328 2.641 -8.484 QT
2.641 -8.609 2.75 -8.727 QT
2.859 -8.844 3 -8.844 QT
3.125 -8.844 3.281 -8.734 QT
7 -5 L
10.719 -8.734 L
10.859 -8.844 10.984 -8.844 QT
11.125 -8.844 11.234 -8.734 QT
11.344 -8.625 11.344 -8.484 QT
11.344 -8.328 11.25 -8.25 QT
7.5 -4.5 L
11.25 -0.781 L
11.344 -0.656 11.344 -0.516 QT
11.344 -0.375 11.234 -0.266 QT
11.125 -0.156 10.984 -0.156 QT
10.844 -0.156 10.719 -0.297 QT
7 -4 L
3.281 -0.297 L
3.141 -0.156 3 -0.156 QT
2.859 -0.156 2.75 -0.273 QT
2.641 -0.391 2.641 -0.516 QT
cp}def
f-1265391899
f
GR
GS
[0.99949 0 0 1.00179 298.84629 22.64126] CT
0.149 GC
/Helvetica 18 F
GS
[1 0 0 1 0 0] CT
0 0 moveto 
1 -1 scale
(10) t 
GR
GR
GS
[0.99949 0 0 1.00179 319.83549 13.62512] CT
0.149 GC
/Helvetica 14.4 F
GS
[1 0 0 1 0 0] CT
0 0 moveto 
1 -1 scale
(4) t 
GR
GR
GS
[0.99949 0 0 1.00179 0 -0.39999] CT
1 0 0 RC
1 LJ
2 LW
N
296.813 154.218 M
296.813 157.78 L
S
GR
GS
[0.99949 0 0 1.00179 0 -0.39999] CT
1 0 0 RC
1 LJ
2 LW
N
321.438 88.253 M
321.438 92.963 L
S
GR
GS
[0.99949 0 0 1.00179 0 -0.39999] CT
1 0 0 RC
1 LJ
2 LW
N
346.063 76.785 M
346.063 81.835 L
S
GR
GS
[0.99949 0 0 1.00179 0 -0.39999] CT
1 0 0 RC
1 LJ
2 LW
N
370.688 67.951 M
370.688 71.892 L
S
GR
GS
[0.99949 0 0 1.00179 0 -0.39999] CT
1 0 0 RC
1 LJ
2 LW
N
296.813 154.218 M
296.813 150.655 L
S
GR
GS
[0.99949 0 0 1.00179 0 -0.39999] CT
1 0 0 RC
1 LJ
2 LW
N
321.438 88.253 M
321.438 83.542 L
S
GR
GS
[0.99949 0 0 1.00179 0 -0.39999] CT
1 0 0 RC
1 LJ
2 LW
N
346.063 76.785 M
346.063 71.735 L
S
GR
GS
[0.99949 0 0 1.00179 0 -0.39999] CT
1 0 0 RC
1 LJ
2 LW
N
370.688 67.951 M
370.688 64.01 L
S
GR
GS
[0.99949 0 0 1.00179 0 -0.39999] CT
1 0 0 RC
1 LJ
2 LW
N
296.813 154.218 M
321.438 88.253 L
346.063 76.785 L
370.688 67.951 L
S
GR
GS
[0.99949 0 0 1.00179 296.65991 157.66347] CT
1 0 0 RC
N
f1394637256
f
GR
GS
[0.99949 0 0 1.00179 296.65991 157.66347] CT
1 0 0 RC
10.0 ML
2 LW
N
-3 0 M
3 0 L
S
GR
GS
[0.99949 0 0 1.00179 321.27225 92.72959] CT
1 0 0 RC
N
f1394637256
f
GR
GS
[0.99949 0 0 1.00179 321.27225 92.72959] CT
1 0 0 RC
10.0 ML
2 LW
N
-3 0 M
3 0 L
S
GR
GS
[0.99949 0 0 1.00179 345.88459 81.58162] CT
1 0 0 RC
N
f1394637256
f
GR
GS
[0.99949 0 0 1.00179 345.88459 81.58162] CT
1 0 0 RC
10.0 ML
2 LW
N
-3 0 M
3 0 L
S
GR
GS
[0.99949 0 0 1.00179 370.49693 71.62078] CT
1 0 0 RC
N
f1394637256
f
GR
GS
[0.99949 0 0 1.00179 370.49693 71.62078] CT
1 0 0 RC
10.0 ML
2 LW
N
-3 0 M
3 0 L
S
GR
GS
[0.99949 0 0 1.00179 296.65991 150.52534] CT
1 0 0 RC
N
f1394637256
f
GR
GS
[0.99949 0 0 1.00179 296.65991 150.52534] CT
1 0 0 RC
10.0 ML
2 LW
N
-3 0 M
3 0 L
S
GR
GS
[0.99949 0 0 1.00179 321.27225 83.29212] CT
1 0 0 RC
N
f1394637256
f
GR
GS
[0.99949 0 0 1.00179 321.27225 83.29212] CT
1 0 0 RC
10.0 ML
2 LW
N
-3 0 M
3 0 L
S
GR
GS
[0.99949 0 0 1.00179 345.88459 71.46324] CT
1 0 0 RC
N
f1394637256
f
GR
GS
[0.99949 0 0 1.00179 345.88459 71.46324] CT
1 0 0 RC
10.0 ML
2 LW
N
-3 0 M
3 0 L
S
GR
GS
[0.99949 0 0 1.00179 370.49693 63.72446] CT
1 0 0 RC
N
f1394637256
f
GR
GS
[0.99949 0 0 1.00179 370.49693 63.72446] CT
1 0 0 RC
10.0 ML
2 LW
N
-3 0 M
3 0 L
S
GR
GS
[0.99949 0 0 1.00179 0 -0.39999] CT
1 0 0 RC
1 LJ
2 LW
N
296.813 118.841 M
296.813 122.708 L
S
GR
GS
[0.99949 0 0 1.00179 0 -0.39999] CT
1 0 0 RC
1 LJ
2 LW
N
321.438 108.748 M
321.438 112.096 L
S
GR
GS
[0.99949 0 0 1.00179 0 -0.39999] CT
1 0 0 RC
1 LJ
2 LW
N
346.063 104.735 M
346.063 108.368 L
S
GR
GS
[0.99949 0 0 1.00179 0 -0.39999] CT
1 0 0 RC
1 LJ
2 LW
N
370.688 101.375 M
370.688 104.965 L
S
GR
GS
[0.99949 0 0 1.00179 0 -0.39999] CT
1 0 0 RC
1 LJ
2 LW
N
296.813 118.841 M
296.813 114.973 L
S
GR
GS
[0.99949 0 0 1.00179 0 -0.39999] CT
1 0 0 RC
1 LJ
2 LW
N
321.438 108.748 M
321.438 105.399 L
S
GR
GS
[0.99949 0 0 1.00179 0 -0.39999] CT
1 0 0 RC
1 LJ
2 LW
N
346.063 104.735 M
346.063 101.102 L
S
GR
GS
[0.99949 0 0 1.00179 0 -0.39999] CT
1 0 0 RC
1 LJ
2 LW
N
370.688 101.375 M
370.688 97.786 L
S
GR
GS
[0.99949 0 0 1.00179 0 -0.39999] CT
1 0 0 RC
[8 8] 0 setdash
2 LJ
2 LW
N
296.813 118.841 M
321.438 108.748 L
346.063 104.735 L
370.688 101.375 L
S
GR
GS
[0.99949 0 0 1.00179 296.65991 122.52841] CT
1 0 0 RC
N
f1394637256
f
GR
GS
[0.99949 0 0 1.00179 296.65991 122.52841] CT
1 0 0 RC
10.0 ML
2 LW
N
-3 0 M
3 0 L
S
GR
GS
[0.99949 0 0 1.00179 321.27225 111.89687] CT
1 0 0 RC
N
f1394637256
f
GR
GS
[0.99949 0 0 1.00179 321.27225 111.89687] CT
1 0 0 RC
10.0 ML
2 LW
N
-3 0 M
3 0 L
S
GR
GS
[0.99949 0 0 1.00179 345.88459 108.16243] CT
1 0 0 RC
N
f1394637256
f
GR
GS
[0.99949 0 0 1.00179 345.88459 108.16243] CT
1 0 0 RC
10.0 ML
2 LW
N
-3 0 M
3 0 L
S
GR
GS
[0.99949 0 0 1.00179 370.49693 104.75345] CT
1 0 0 RC
N
f1394637256
f
GR
GS
[0.99949 0 0 1.00179 370.49693 104.75345] CT
1 0 0 RC
10.0 ML
2 LW
N
-3 0 M
3 0 L
S
GR
GS
[0.99949 0 0 1.00179 296.65991 114.77914] CT
1 0 0 RC
N
f1394637256
f
GR
GS
[0.99949 0 0 1.00179 296.65991 114.77914] CT
1 0 0 RC
10.0 ML
2 LW
N
-3 0 M
3 0 L
S
GR
GS
[0.99949 0 0 1.00179 321.27225 105.18856] CT
1 0 0 RC
N
f1394637256
f
GR
GS
[0.99949 0 0 1.00179 321.27225 105.18856] CT
1 0 0 RC
10.0 ML
2 LW
N
-3 0 M
3 0 L
S
GR
GS
[0.99949 0 0 1.00179 345.88459 100.88301] CT
1 0 0 RC
N
f1394637256
f
GR
GS
[0.99949 0 0 1.00179 345.88459 100.88301] CT
1 0 0 RC
10.0 ML
2 LW
N
-3 0 M
3 0 L
S
GR
GS
[0.99949 0 0 1.00179 370.49693 97.56101] CT
1 0 0 RC
N
f1394637256
f
GR
GS
[0.99949 0 0 1.00179 370.49693 97.56101] CT
1 0 0 RC
10.0 ML
2 LW
N
-3 0 M
3 0 L
S
GR
GS
[0.99949 0 0 1.00179 0 -0.39999] CT
1 GC
N
/f1497623992{445 173.5 M
543 173.5 L
543 27 L
445 27 L
cp}def
f1497623992
f
GR
GS
[0.99949 0 0 1.00179 0 -0.39999] CT
0.149 GC
2 setlinecap
1 LJ
0.5 LW
N
445 173.5 M
543 173.5 L
S
GR
GS
[0.99949 0 0 1.00179 0 -0.39999] CT
0.149 GC
2 setlinecap
1 LJ
0.5 LW
N
457.25 173.5 M
457.25 172.035 L
S
GR
GS
[0.99949 0 0 1.00179 0 -0.39999] CT
0.149 GC
2 setlinecap
1 LJ
0.5 LW
N
481.75 173.5 M
481.75 172.035 L
S
GR
GS
[0.99949 0 0 1.00179 0 -0.39999] CT
0.149 GC
2 setlinecap
1 LJ
0.5 LW
N
506.25 173.5 M
506.25 172.035 L
S
GR
GS
[0.99949 0 0 1.00179 0 -0.39999] CT
0.149 GC
2 setlinecap
1 LJ
0.5 LW
N
530.75 173.5 M
530.75 172.035 L
S
GR
GS
[0.99949 0 0 1.00179 457.01493 179.02125] CT
0.149 GC
/Helvetica 18 F
GS
[1 0 0 1 0 0] CT
-5.5 18 moveto 
1 -1 scale
(1) t 
GR
GR
GS
[0.99949 0 0 1.00179 481.50234 179.02125] CT
0.149 GC
/Helvetica 18 F
GS
[1 0 0 1 0 0] CT
-5.5 18 moveto 
1 -1 scale
(2) t 
GR
GR
GS
[0.99949 0 0 1.00179 505.98974 179.02125] CT
0.149 GC
/Helvetica 18 F
GS
[1 0 0 1 0 0] CT
-5.5 18 moveto 
1 -1 scale
(3) t 
GR
GR
GS
[0.99949 0 0 1.00179 530.47715 179.02125] CT
0.149 GC
/Helvetica 18 F
GS
[1 0 0 1 0 0] CT
-5.5 18 moveto 
1 -1 scale
(4) t 
GR
GR
GS
[0.99949 0 0 1.00179 493.7461 201.56162] CT
0.149 GC
/Helvetica 18 F
GS
[1 0 0 1 0 0] CT
-46 18 moveto 
1 -1 scale
(# of targets) t 
GR
GR
GS
[0.99949 0 0 1.00179 0 -0.39999] CT
0.149 GC
2 setlinecap
1 LJ
0.5 LW
N
445 173.5 M
445 27 L
S
GR
GS
[0.99949 0 0 1.00179 0 -0.39999] CT
0.149 GC
2 setlinecap
1 LJ
0.5 LW
N
445 144.2 M
446.465 144.2 L
S
GR
GS
[0.99949 0 0 1.00179 0 -0.39999] CT
0.149 GC
2 setlinecap
1 LJ
0.5 LW
N
445 85.6 M
446.465 85.6 L
S
GR
GS
[0.99949 0 0 1.00179 0 -0.39999] CT
0.149 GC
2 setlinecap
1 LJ
0.5 LW
N
445 27 M
446.465 27 L
S
GR
GS
[0.99949 0 0 1.00179 439.1741 144.05865] CT
0.149 GC
/Helvetica 18 F
GS
[1 0 0 1 0 0] CT
-26 7 moveto 
1 -1 scale
(0.6) t 
GR
GR
GS
[0.99949 0 0 1.00179 439.1741 85.35354] CT
0.149 GC
/Helvetica 18 F
GS
[1 0 0 1 0 0] CT
-26 7 moveto 
1 -1 scale
(0.8) t 
GR
GR
GS
[0.99949 0 0 1.00179 439.1741 26.64844] CT
0.149 GC
/Helvetica 18 F
GS
[1 0 0 1 0 0] CT
-11 7 moveto 
1 -1 scale
(1) t 
GR
GR
GS
[0 -1.00179 0.99949 0 410.68875 100.02976] CT
0.149 GC
/Helvetica 18 F
GS
[1 0 0 1 0 0] CT
-38 -4 moveto 
1 -1 scale
(Accuracy) t 
GR
GR
GS
[0.99949 0 0 1.00179 0 -0.39999] CT
1 LJ
2 LW
N
457.25 75.637 M
457.25 94.713 L
S
GR
GS
[0.99949 0 0 1.00179 0 -0.39999] CT
1 LJ
2 LW
N
481.75 85.229 M
481.75 103.549 L
S
GR
GS
[0.99949 0 0 1.00179 0 -0.39999] CT
1 LJ
2 LW
N
506.25 95.334 M
506.25 113.123 L
S
GR
GS
[0.99949 0 0 1.00179 0 -0.39999] CT
1 LJ
2 LW
N
530.75 98.915 M
530.75 116.658 L
S
GR
GS
[0.99949 0 0 1.00179 0 -0.39999] CT
1 LJ
2 LW
N
457.25 75.637 M
457.25 56.562 L
S
GR
GS
[0.99949 0 0 1.00179 0 -0.39999] CT
1 LJ
2 LW
N
481.75 85.229 M
481.75 66.91 L
S
GR
GS
[0.99949 0 0 1.00179 0 -0.39999] CT
1 LJ
2 LW
N
506.25 95.334 M
506.25 77.545 L
S
GR
GS
[0.99949 0 0 1.00179 0 -0.39999] CT
1 LJ
2 LW
N
530.75 98.915 M
530.75 81.173 L
S
GR
GS
[0.99949 0 0 1.00179 0 -0.39999] CT
1 LJ
2 LW
N
457.25 75.637 M
481.75 85.229 L
506.25 95.334 L
530.75 98.915 L
S
GR
GS
[0.99949 0 0 1.00179 457.01493 94.48241] CT
N
f1394637256
f
GR
GS
[0.99949 0 0 1.00179 457.01493 94.48241] CT
10.0 ML
2 LW
N
-3 0 M
3 0 L
S
GR
GS
[0.99949 0 0 1.00179 481.50234 103.33497] CT
N
f1394637256
f
GR
GS
[0.99949 0 0 1.00179 481.50234 103.33497] CT
10.0 ML
2 LW
N
-3 0 M
3 0 L
S
GR
GS
[0.99949 0 0 1.00179 505.98974 112.92573] CT
N
f1394637256
f
GR
GS
[0.99949 0 0 1.00179 505.98974 112.92573] CT
10.0 ML
2 LW
N
-3 0 M
3 0 L
S
GR
GS
[0.99949 0 0 1.00179 530.47715 116.46713] CT
N
f1394637256
f
GR
GS
[0.99949 0 0 1.00179 530.47715 116.46713] CT
10.0 ML
2 LW
N
-3 0 M
3 0 L
S
GR
GS
[0.99949 0 0 1.00179 457.01493 56.2632] CT
N
f1394637256
f
GR
GS
[0.99949 0 0 1.00179 457.01493 56.2632] CT
10.0 ML
2 LW
N
-3 0 M
3 0 L
S
GR
GS
[0.99949 0 0 1.00179 481.50234 66.62959] CT
N
f1394637256
f
GR
GS
[0.99949 0 0 1.00179 481.50234 66.62959] CT
10.0 ML
2 LW
N
-3 0 M
3 0 L
S
GR
GS
[0.99949 0 0 1.00179 505.98974 77.28422] CT
N
f1394637256
f
GR
GS
[0.99949 0 0 1.00179 505.98974 77.28422] CT
10.0 ML
2 LW
N
-3 0 M
3 0 L
S
GR
GS
[0.99949 0 0 1.00179 530.47715 80.91872] CT
N
f1394637256
f
GR
GS
[0.99949 0 0 1.00179 530.47715 80.91872] CT
10.0 ML
2 LW
N
-3 0 M
3 0 L
S
GR
GS
[0.99949 0 0 1.00179 0 -0.39999] CT
1 LJ
2 LW
N
457.25 78.569 M
457.25 85.674 L
S
GR
GS
[0.99949 0 0 1.00179 0 -0.39999] CT
1 LJ
2 LW
N
481.75 94.031 M
481.75 100.825 L
S
GR
GS
[0.99949 0 0 1.00179 0 -0.39999] CT
1 LJ
2 LW
N
506.25 101.231 M
506.25 109.239 L
S
GR
GS
[0.99949 0 0 1.00179 0 -0.39999] CT
1 LJ
2 LW
N
530.75 105.179 M
530.75 114.342 L
S
GR
GS
[0.99949 0 0 1.00179 0 -0.39999] CT
1 LJ
2 LW
N
457.25 78.569 M
457.25 71.464 L
S
GR
GS
[0.99949 0 0 1.00179 0 -0.39999] CT
1 LJ
2 LW
N
481.75 94.031 M
481.75 87.237 L
S
GR
GS
[0.99949 0 0 1.00179 0 -0.39999] CT
1 LJ
2 LW
N
506.25 101.231 M
506.25 93.223 L
S
GR
GS
[0.99949 0 0 1.00179 0 -0.39999] CT
1 LJ
2 LW
N
530.75 105.179 M
530.75 96.017 L
S
GR
GS
[0.99949 0 0 1.00179 0 -0.39999] CT
[8 8] 0 setdash
2 LJ
2 LW
N
457.25 78.569 M
481.75 94.031 L
506.25 101.231 L
530.75 105.179 L
S
GR
GS
[0.99949 0 0 1.00179 457.01493 85.42806] CT
N
f1394637256
f
GR
GS
[0.99949 0 0 1.00179 457.01493 85.42806] CT
10.0 ML
2 LW
N
-3 0 M
3 0 L
S
GR
GS
[0.99949 0 0 1.00179 481.50234 100.60555] CT
N
f1394637256
f
GR
GS
[0.99949 0 0 1.00179 481.50234 100.60555] CT
10.0 ML
2 LW
N
-3 0 M
3 0 L
S
GR
GS
[0.99949 0 0 1.00179 505.98974 109.03479] CT
N
f1394637256
f
GR
GS
[0.99949 0 0 1.00179 505.98974 109.03479] CT
10.0 ML
2 LW
N
-3 0 M
3 0 L
S
GR
GS
[0.99949 0 0 1.00179 530.47715 114.14672] CT
N
f1394637256
f
GR
GS
[0.99949 0 0 1.00179 530.47715 114.14672] CT
10.0 ML
2 LW
N
-3 0 M
3 0 L
S
GR
GS
[0.99949 0 0 1.00179 457.01493 71.19243] CT
N
f1394637256
f
GR
GS
[0.99949 0 0 1.00179 457.01493 71.19243] CT
10.0 ML
2 LW
N
-3 0 M
3 0 L
S
GR
GS
[0.99949 0 0 1.00179 481.50234 86.9934] CT
N
f1394637256
f
GR
GS
[0.99949 0 0 1.00179 481.50234 86.9934] CT
10.0 ML
2 LW
N
-3 0 M
3 0 L
S
GR
GS
[0.99949 0 0 1.00179 505.98974 92.99043] CT
N
f1394637256
f
GR
GS
[0.99949 0 0 1.00179 505.98974 92.99043] CT
10.0 ML
2 LW
N
-3 0 M
3 0 L
S
GR
GS
[0.99949 0 0 1.00179 530.47715 95.78879] CT
N
f1394637256
f
GR
GS
[0.99949 0 0 1.00179 530.47715 95.78879] CT
10.0 ML
2 LW
N
-3 0 M
3 0 L
S
GR
GS
[0.99949 0 0 1.00179 0 -0.39999] CT
1 0 0 RC
1 LJ
2 LW
N
457.25 118.428 M
457.25 137.574 L
S
GR
GS
[0.99949 0 0 1.00179 0 -0.39999] CT
1 0 0 RC
1 LJ
2 LW
N
481.75 138.087 M
481.75 155.581 L
S
GR
GS
[0.99949 0 0 1.00179 0 -0.39999] CT
1 0 0 RC
1 LJ
2 LW
N
506.25 142.099 M
506.25 158.966 L
S
GR
GS
[0.99949 0 0 1.00179 0 -0.39999] CT
1 0 0 RC
1 LJ
2 LW
N
530.75 147.997 M
530.75 164.488 L
S
GR
GS
[0.99949 0 0 1.00179 0 -0.39999] CT
1 0 0 RC
1 LJ
2 LW
N
457.25 118.428 M
457.25 99.282 L
S
GR
GS
[0.99949 0 0 1.00179 0 -0.39999] CT
1 0 0 RC
1 LJ
2 LW
N
481.75 138.087 M
481.75 120.593 L
S
GR
GS
[0.99949 0 0 1.00179 0 -0.39999] CT
1 0 0 RC
1 LJ
2 LW
N
506.25 142.099 M
506.25 125.233 L
S
GR
GS
[0.99949 0 0 1.00179 0 -0.39999] CT
1 0 0 RC
1 LJ
2 LW
N
530.75 147.997 M
530.75 131.507 L
S
GR
GS
[0.99949 0 0 1.00179 0 -0.39999] CT
1 0 0 RC
1 LJ
2 LW
N
457.25 118.428 M
481.75 138.087 L
506.25 142.099 L
530.75 147.997 L
S
GR
GS
[0.99949 0 0 1.00179 457.01493 137.42072] CT
1 0 0 RC
N
f1394637256
f
GR
GS
[0.99949 0 0 1.00179 457.01493 137.42072] CT
1 0 0 RC
10.0 ML
2 LW
N
-3 0 M
3 0 L
S
GR
GS
[0.99949 0 0 1.00179 481.50234 155.45971] CT
1 0 0 RC
N
f1394637256
f
GR
GS
[0.99949 0 0 1.00179 481.50234 155.45971] CT
1 0 0 RC
10.0 ML
2 LW
N
-3 0 M
3 0 L
S
GR
GS
[0.99949 0 0 1.00179 505.98974 158.85102] CT
1 0 0 RC
N
f1394637256
f
GR
GS
[0.99949 0 0 1.00179 505.98974 158.85102] CT
1 0 0 RC
10.0 ML
2 LW
N
-3 0 M
3 0 L
S
GR
GS
[0.99949 0 0 1.00179 530.47715 164.38279] CT
1 0 0 RC
N
f1394637256
f
GR
GS
[0.99949 0 0 1.00179 530.47715 164.38279] CT
1 0 0 RC
10.0 ML
2 LW
N
-3 0 M
3 0 L
S
GR
GS
[0.99949 0 0 1.00179 457.01493 99.05983] CT
1 0 0 RC
N
f1394637256
f
GR
GS
[0.99949 0 0 1.00179 457.01493 99.05983] CT
1 0 0 RC
10.0 ML
2 LW
N
-3 0 M
3 0 L
S
GR
GS
[0.99949 0 0 1.00179 481.50234 120.40939] CT
1 0 0 RC
N
f1394637256
f
GR
GS
[0.99949 0 0 1.00179 481.50234 120.40939] CT
1 0 0 RC
10.0 ML
2 LW
N
-3 0 M
3 0 L
S
GR
GS
[0.99949 0 0 1.00179 505.98974 125.05765] CT
1 0 0 RC
N
f1394637256
f
GR
GS
[0.99949 0 0 1.00179 505.98974 125.05765] CT
1 0 0 RC
10.0 ML
2 LW
N
-3 0 M
3 0 L
S
GR
GS
[0.99949 0 0 1.00179 530.47715 131.34247] CT
1 0 0 RC
N
f1394637256
f
GR
GS
[0.99949 0 0 1.00179 530.47715 131.34247] CT
1 0 0 RC
10.0 ML
2 LW
N
-3 0 M
3 0 L
S
GR
GS
[0.99949 0 0 1.00179 0 -0.39999] CT
1 0 0 RC
1 LJ
2 LW
N
457.25 130.924 M
457.25 136.762 L
S
GR
GS
[0.99949 0 0 1.00179 0 -0.39999] CT
1 0 0 RC
1 LJ
2 LW
N
481.75 146.013 M
481.75 151.189 L
S
GR
GS
[0.99949 0 0 1.00179 0 -0.39999] CT
1 0 0 RC
1 LJ
2 LW
N
506.25 147.699 M
506.25 152.635 L
S
GR
GS
[0.99949 0 0 1.00179 0 -0.39999] CT
1 0 0 RC
1 LJ
2 LW
N
530.75 148.055 M
530.75 151.535 L
S
GR
GS
[0.99949 0 0 1.00179 0 -0.39999] CT
1 0 0 RC
1 LJ
2 LW
N
457.25 130.924 M
457.25 125.087 L
S
GR
GS
[0.99949 0 0 1.00179 0 -0.39999] CT
1 0 0 RC
1 LJ
2 LW
N
481.75 146.013 M
481.75 140.838 L
S
GR
GS
[0.99949 0 0 1.00179 0 -0.39999] CT
1 0 0 RC
1 LJ
2 LW
N
506.25 147.699 M
506.25 142.762 L
S
GR
GS
[0.99949 0 0 1.00179 0 -0.39999] CT
1 0 0 RC
1 LJ
2 LW
N
530.75 148.055 M
530.75 144.576 L
S
GR
GS
[0.99949 0 0 1.00179 0 -0.39999] CT
1 0 0 RC
[8 8] 0 setdash
2 LJ
2 LW
N
457.25 130.924 M
481.75 146.013 L
506.25 147.699 L
530.75 148.055 L
S
GR
GS
[0.99949 0 0 1.00179 457.01493 136.60769] CT
1 0 0 RC
N
f1394637256
f
GR
GS
[0.99949 0 0 1.00179 457.01493 136.60769] CT
1 0 0 RC
10.0 ML
2 LW
N
-3 0 M
3 0 L
S
GR
GS
[0.99949 0 0 1.00179 481.50234 151.05979] CT
1 0 0 RC
N
f1394637256
f
GR
GS
[0.99949 0 0 1.00179 481.50234 151.05979] CT
1 0 0 RC
10.0 ML
2 LW
N
-3 0 M
3 0 L
S
GR
GS
[0.99949 0 0 1.00179 505.98974 152.50866] CT
1 0 0 RC
N
f1394637256
f
GR
GS
[0.99949 0 0 1.00179 505.98974 152.50866] CT
1 0 0 RC
10.0 ML
2 LW
N
-3 0 M
3 0 L
S
GR
GS
[0.99949 0 0 1.00179 530.47715 151.40669] CT
1 0 0 RC
N
f1394637256
f
GR
GS
[0.99949 0 0 1.00179 530.47715 151.40669] CT
1 0 0 RC
10.0 ML
2 LW
N
-3 0 M
3 0 L
S
GR
GS
[0.99949 0 0 1.00179 457.01493 124.91094] CT
1 0 0 RC
N
f1394637256
f
GR
GS
[0.99949 0 0 1.00179 457.01493 124.91094] CT
1 0 0 RC
10.0 ML
2 LW
N
-3 0 M
3 0 L
S
GR
GS
[0.99949 0 0 1.00179 481.50234 140.69104] CT
1 0 0 RC
N
f1394637256
f
GR
GS
[0.99949 0 0 1.00179 481.50234 140.69104] CT
1 0 0 RC
10.0 ML
2 LW
N
-3 0 M
3 0 L
S
GR
GS
[0.99949 0 0 1.00179 505.98974 142.61832] CT
1 0 0 RC
N
f1394637256
f
GR
GS
[0.99949 0 0 1.00179 505.98974 142.61832] CT
1 0 0 RC
10.0 ML
2 LW
N
-3 0 M
3 0 L
S
GR
GS
[0.99949 0 0 1.00179 530.47715 144.43532] CT
1 0 0 RC
N
f1394637256
f
GR
GS
[0.99949 0 0 1.00179 530.47715 144.43532] CT
1 0 0 RC
10.0 ML
2 LW
N
-3 0 M
3 0 L
S
GR
GS
[0.99949 0 0 1.00179 0 -0.39999] CT
1 GC
N
/f-133027092{605 173.5 M
703 173.5 L
703 27 L
605 27 L
cp}def
f-133027092
f
GR
GS
[0.99949 0 0 1.00179 0 -0.39999] CT
0.149 GC
2 setlinecap
1 LJ
0.5 LW
N
605 173.5 M
703 173.5 L
S
GR
GS
[0.99949 0 0 1.00179 0 -0.39999] CT
0.149 GC
2 setlinecap
1 LJ
0.5 LW
N
617.25 173.5 M
617.25 172.035 L
S
GR
GS
[0.99949 0 0 1.00179 0 -0.39999] CT
0.149 GC
2 setlinecap
1 LJ
0.5 LW
N
641.75 173.5 M
641.75 172.035 L
S
GR
GS
[0.99949 0 0 1.00179 0 -0.39999] CT
0.149 GC
2 setlinecap
1 LJ
0.5 LW
N
666.25 173.5 M
666.25 172.035 L
S
GR
GS
[0.99949 0 0 1.00179 0 -0.39999] CT
0.149 GC
2 setlinecap
1 LJ
0.5 LW
N
690.75 173.5 M
690.75 172.035 L
S
GR
GS
[0.99949 0 0 1.00179 616.93268 179.02126] CT
0.149 GC
/Helvetica 18 F
GS
[1 0 0 1 0 0] CT
-5.5 18 moveto 
1 -1 scale
(1) t 
GR
GR
GS
[0.99949 0 0 1.00179 641.42008 179.02126] CT
0.149 GC
/Helvetica 18 F
GS
[1 0 0 1 0 0] CT
-5.5 18 moveto 
1 -1 scale
(2) t 
GR
GR
GS
[0.99949 0 0 1.00179 665.90749 179.02126] CT
0.149 GC
/Helvetica 18 F
GS
[1 0 0 1 0 0] CT
-5.5 18 moveto 
1 -1 scale
(3) t 
GR
GR
GS
[0.99949 0 0 1.00179 690.39489 179.02126] CT
0.149 GC
/Helvetica 18 F
GS
[1 0 0 1 0 0] CT
-5.5 18 moveto 
1 -1 scale
(4) t 
GR
GR
GS
[0.99949 0 0 1.00179 653.66385 201.56162] CT
0.149 GC
/Helvetica 18 F
GS
[1 0 0 1 0 0] CT
-46 18 moveto 
1 -1 scale
(# of targets) t 
GR
GR
GS
[0.99949 0 0 1.00179 0 -0.39999] CT
0.149 GC
2 setlinecap
1 LJ
0.5 LW
N
605 173.5 M
605 27 L
S
GR
GS
[0.99949 0 0 1.00179 0 -0.39999] CT
0.149 GC
2 setlinecap
1 LJ
0.5 LW
N
605 173.5 M
606.465 173.5 L
S
GR
GS
[0.99949 0 0 1.00179 0 -0.39999] CT
0.149 GC
2 setlinecap
1 LJ
0.5 LW
N
605 124.667 M
606.465 124.667 L
S
GR
GS
[0.99949 0 0 1.00179 0 -0.39999] CT
0.149 GC
2 setlinecap
1 LJ
0.5 LW
N
605 75.833 M
606.465 75.833 L
S
GR
GS
[0.99949 0 0 1.00179 0 -0.39999] CT
0.149 GC
2 setlinecap
1 LJ
0.5 LW
N
605 27 M
606.465 27 L
S
GR
GS
[0.99949 0 0 1.00179 599.09188 173.41121] CT
0.149 GC
/Helvetica 18 F
GS
[1 0 0 1 0 0] CT
-11 7 moveto 
1 -1 scale
(0) t 
GR
GR
GS
[0.99949 0 0 1.00179 599.09188 124.49028] CT
0.149 GC
/Helvetica 18 F
GS
[1 0 0 1 0 0] CT
-11 7 moveto 
1 -1 scale
(1) t 
GR
GR
GS
[0.99949 0 0 1.00179 599.09188 75.56936] CT
0.149 GC
/Helvetica 18 F
GS
[1 0 0 1 0 0] CT
-11 7 moveto 
1 -1 scale
(2) t 
GR
GR
GS
[0.99949 0 0 1.00179 599.09188 26.64844] CT
0.149 GC
/Helvetica 18 F
GS
[1 0 0 1 0 0] CT
-11 7 moveto 
1 -1 scale
(3) t 
GR
GR
GS
[0 -1.00179 0.99949 0 585.59882 100.02976] CT
0.149 GC
/Helvetica 18 F
GS
[1 0 0 1 0 0] CT
-35 -4 moveto 
1 -1 scale
(Drift rate) t 
GR
GR
GS
[0.99949 0 0 1.00179 0 -0.39999] CT
1 LJ
2 LW
N
617.25 60.7 M
617.25 70.408 L
S
GR
GS
[0.99949 0 0 1.00179 0 -0.39999] CT
1 LJ
2 LW
N
641.75 105.331 M
641.75 111.259 L
S
GR
GS
[0.99949 0 0 1.00179 0 -0.39999] CT
1 LJ
2 LW
N
666.25 116.833 M
666.25 121.928 L
S
GR
GS
[0.99949 0 0 1.00179 0 -0.39999] CT
1 LJ
2 LW
N
690.75 119.947 M
690.75 125.24 L
S
GR
GS
[0.99949 0 0 1.00179 0 -0.39999] CT
1 LJ
2 LW
N
617.25 60.7 M
617.25 50.992 L
S
GR
GS
[0.99949 0 0 1.00179 0 -0.39999] CT
1 LJ
2 LW
N
641.75 105.331 M
641.75 99.402 L
S
GR
GS
[0.99949 0 0 1.00179 0 -0.39999] CT
1 LJ
2 LW
N
666.25 116.833 M
666.25 111.737 L
S
GR
GS
[0.99949 0 0 1.00179 0 -0.39999] CT
1 LJ
2 LW
N
690.75 119.947 M
690.75 114.653 L
S
GR
GS
[0.99949 0 0 1.00179 0 -0.39999] CT
1 LJ
2 LW
N
617.25 60.7 M
641.75 105.331 L
666.25 116.833 L
690.75 119.947 L
S
GR
GS
[0.99949 0 0 1.00179 616.93268 70.1339] CT
N
f1394637256
f
GR
GS
[0.99949 0 0 1.00179 616.93268 70.1339] CT
10.0 ML
2 LW
N
-3 0 M
3 0 L
S
GR
GS
[0.99949 0 0 1.00179 641.42008 111.05871] CT
N
f1394637256
f
GR
GS
[0.99949 0 0 1.00179 641.42008 111.05871] CT
10.0 ML
2 LW
N
-3 0 M
3 0 L
S
GR
GS
[0.99949 0 0 1.00179 665.90749 121.74709] CT
N
f1394637256
f
GR
GS
[0.99949 0 0 1.00179 665.90749 121.74709] CT
10.0 ML
2 LW
N
-3 0 M
3 0 L
S
GR
GS
[0.99949 0 0 1.00179 690.39489 125.06479] CT
N
f1394637256
f
GR
GS
[0.99949 0 0 1.00179 690.39489 125.06479] CT
10.0 ML
2 LW
N
-3 0 M
3 0 L
S
GR
GS
[0.99949 0 0 1.00179 616.93268 50.68367] CT
N
f1394637256
f
GR
GS
[0.99949 0 0 1.00179 616.93268 50.68367] CT
10.0 ML
2 LW
N
-3 0 M
3 0 L
S
GR
GS
[0.99949 0 0 1.00179 641.42008 99.1805] CT
N
f1394637256
f
GR
GS
[0.99949 0 0 1.00179 641.42008 99.1805] CT
10.0 ML
2 LW
N
-3 0 M
3 0 L
S
GR
GS
[0.99949 0 0 1.00179 665.90749 111.53761] CT
N
f1394637256
f
GR
GS
[0.99949 0 0 1.00179 665.90749 111.53761] CT
10.0 ML
2 LW
N
-3 0 M
3 0 L
S
GR
GS
[0.99949 0 0 1.00179 690.39489 114.45863] CT
N
f1394637256
f
GR
GS
[0.99949 0 0 1.00179 690.39489 114.45863] CT
10.0 ML
2 LW
N
-3 0 M
3 0 L
S
GR
GS
[0.99949 0 0 1.00179 0 -0.39999] CT
1 LJ
2 LW
N
617.25 83.444 M
617.25 90.367 L
S
GR
GS
[0.99949 0 0 1.00179 0 -0.39999] CT
1 LJ
2 LW
N
641.75 121.933 M
641.75 125.66 L
S
GR
GS
[0.99949 0 0 1.00179 0 -0.39999] CT
1 LJ
2 LW
N
666.25 128.323 M
666.25 132.655 L
S
GR
GS
[0.99949 0 0 1.00179 0 -0.39999] CT
1 LJ
2 LW
N
690.75 131.21 M
690.75 135.86 L
S
GR
GS
[0.99949 0 0 1.00179 0 -0.39999] CT
1 LJ
2 LW
N
617.25 83.444 M
617.25 76.521 L
S
GR
GS
[0.99949 0 0 1.00179 0 -0.39999] CT
1 LJ
2 LW
N
641.75 121.933 M
641.75 118.205 L
S
GR
GS
[0.99949 0 0 1.00179 0 -0.39999] CT
1 LJ
2 LW
N
666.25 128.323 M
666.25 123.99 L
S
GR
GS
[0.99949 0 0 1.00179 0 -0.39999] CT
1 LJ
2 LW
N
690.75 131.21 M
690.75 126.561 L
S
GR
GS
[0.99949 0 0 1.00179 0 -0.39999] CT
[8 8] 0 setdash
2 LJ
2 LW
N
617.25 83.444 M
641.75 121.933 L
666.25 128.323 L
690.75 131.21 L
S
GR
GS
[0.99949 0 0 1.00179 616.93268 90.12928] CT
N
f1394637256
f
GR
GS
[0.99949 0 0 1.00179 616.93268 90.12928] CT
10.0 ML
2 LW
N
-3 0 M
3 0 L
S
GR
GS
[0.99949 0 0 1.00179 641.42008 125.4857] CT
N
f1394637256
f
GR
GS
[0.99949 0 0 1.00179 641.42008 125.4857] CT
10.0 ML
2 LW
N
-3 0 M
3 0 L
S
GR
GS
[0.99949 0 0 1.00179 665.90749 132.4929] CT
N
f1394637256
f
GR
GS
[0.99949 0 0 1.00179 665.90749 132.4929] CT
10.0 ML
2 LW
N
-3 0 M
3 0 L
S
GR
GS
[0.99949 0 0 1.00179 690.39489 135.70373] CT
N
f1394637256
f
GR
GS
[0.99949 0 0 1.00179 690.39489 135.70373] CT
10.0 ML
2 LW
N
-3 0 M
3 0 L
S
GR
GS
[0.99949 0 0 1.00179 616.93268 76.25856] CT
N
f1394637256
f
GR
GS
[0.99949 0 0 1.00179 616.93268 76.25856] CT
10.0 ML
2 LW
N
-3 0 M
3 0 L
S
GR
GS
[0.99949 0 0 1.00179 641.42008 118.01722] CT
N
f1394637256
f
GR
GS
[0.99949 0 0 1.00179 641.42008 118.01722] CT
10.0 ML
2 LW
N
-3 0 M
3 0 L
S
GR
GS
[0.99949 0 0 1.00179 665.90749 123.81257] CT
N
f1394637256
f
GR
GS
[0.99949 0 0 1.00179 665.90749 123.81257] CT
10.0 ML
2 LW
N
-3 0 M
3 0 L
S
GR
GS
[0.99949 0 0 1.00179 690.39489 126.38782] CT
N
f1394637256
f
GR
GS
[0.99949 0 0 1.00179 690.39489 126.38782] CT
10.0 ML
2 LW
N
-3 0 M
3 0 L
S
GR
GS
[0.99949 0 0 1.00179 0 -0.39999] CT
1 0 0 RC
1 LJ
2 LW
N
617.25 115.383 M
617.25 121.936 L
S
GR
GS
[0.99949 0 0 1.00179 0 -0.39999] CT
1 0 0 RC
1 LJ
2 LW
N
641.75 142.411 M
641.75 146.835 L
S
GR
GS
[0.99949 0 0 1.00179 0 -0.39999] CT
1 0 0 RC
1 LJ
2 LW
N
666.25 147.492 M
666.25 150.934 L
S
GR
GS
[0.99949 0 0 1.00179 0 -0.39999] CT
1 0 0 RC
1 LJ
2 LW
N
690.75 150.135 M
690.75 153.764 L
S
GR
GS
[0.99949 0 0 1.00179 0 -0.39999] CT
1 0 0 RC
1 LJ
2 LW
N
617.25 115.383 M
617.25 108.83 L
S
GR
GS
[0.99949 0 0 1.00179 0 -0.39999] CT
1 0 0 RC
1 LJ
2 LW
N
641.75 142.411 M
641.75 137.986 L
S
GR
GS
[0.99949 0 0 1.00179 0 -0.39999] CT
1 0 0 RC
1 LJ
2 LW
N
666.25 147.492 M
666.25 144.049 L
S
GR
GS
[0.99949 0 0 1.00179 0 -0.39999] CT
1 0 0 RC
1 LJ
2 LW
N
690.75 150.135 M
690.75 146.505 L
S
GR
GS
[0.99949 0 0 1.00179 0 -0.39999] CT
1 0 0 RC
1 LJ
2 LW
N
617.25 115.383 M
641.75 142.411 L
666.25 147.492 L
690.75 150.135 L
S
GR
GS
[0.99949 0 0 1.00179 616.93268 121.75521] CT
1 0 0 RC
N
f1394637256
f
GR
GS
[0.99949 0 0 1.00179 616.93268 121.75521] CT
1 0 0 RC
10.0 ML
2 LW
N
-3 0 M
3 0 L
S
GR
GS
[0.99949 0 0 1.00179 641.42008 146.69867] CT
1 0 0 RC
N
f1394637256
f
GR
GS
[0.99949 0 0 1.00179 641.42008 146.69867] CT
1 0 0 RC
10.0 ML
2 LW
N
-3 0 M
3 0 L
S
GR
GS
[0.99949 0 0 1.00179 665.90749 150.8046] CT
1 0 0 RC
N
f1394637256
f
GR
GS
[0.99949 0 0 1.00179 665.90749 150.8046] CT
1 0 0 RC
10.0 ML
2 LW
N
-3 0 M
3 0 L
S
GR
GS
[0.99949 0 0 1.00179 690.39489 153.63961] CT
1 0 0 RC
N
f1394637256
f
GR
GS
[0.99949 0 0 1.00179 690.39489 153.63961] CT
1 0 0 RC
10.0 ML
2 LW
N
-3 0 M
3 0 L
S
GR
GS
[0.99949 0 0 1.00179 616.93268 108.62556] CT
1 0 0 RC
N
f1394637256
f
GR
GS
[0.99949 0 0 1.00179 616.93268 108.62556] CT
1 0 0 RC
10.0 ML
2 LW
N
-3 0 M
3 0 L
S
GR
GS
[0.99949 0 0 1.00179 641.42008 137.83372] CT
1 0 0 RC
N
f1394637256
f
GR
GS
[0.99949 0 0 1.00179 641.42008 137.83372] CT
1 0 0 RC
10.0 ML
2 LW
N
-3 0 M
3 0 L
S
GR
GS
[0.99949 0 0 1.00179 665.90749 143.90755] CT
1 0 0 RC
N
f1394637256
f
GR
GS
[0.99949 0 0 1.00179 665.90749 143.90755] CT
1 0 0 RC
10.0 ML
2 LW
N
-3 0 M
3 0 L
S
GR
GS
[0.99949 0 0 1.00179 690.39489 146.36815] CT
1 0 0 RC
N
f1394637256
f
GR
GS
[0.99949 0 0 1.00179 690.39489 146.36815] CT
1 0 0 RC
10.0 ML
2 LW
N
-3 0 M
3 0 L
S
GR
GS
[0.99949 0 0 1.00179 0 -0.39999] CT
1 0 0 RC
1 LJ
2 LW
N
617.25 135.647 M
617.25 138.983 L
S
GR
GS
[0.99949 0 0 1.00179 0 -0.39999] CT
1 0 0 RC
1 LJ
2 LW
N
641.75 154.582 M
641.75 156.834 L
S
GR
GS
[0.99949 0 0 1.00179 0 -0.39999] CT
1 0 0 RC
1 LJ
2 LW
N
666.25 156.803 M
666.25 158.919 L
S
GR
GS
[0.99949 0 0 1.00179 0 -0.39999] CT
1 0 0 RC
1 LJ
2 LW
N
690.75 157.849 M
690.75 159.228 L
S
GR
GS
[0.99949 0 0 1.00179 0 -0.39999] CT
1 0 0 RC
1 LJ
2 LW
N
617.25 135.647 M
617.25 132.311 L
S
GR
GS
[0.99949 0 0 1.00179 0 -0.39999] CT
1 0 0 RC
1 LJ
2 LW
N
641.75 154.582 M
641.75 152.33 L
S
GR
GS
[0.99949 0 0 1.00179 0 -0.39999] CT
1 0 0 RC
1 LJ
2 LW
N
666.25 156.803 M
666.25 154.687 L
S
GR
GS
[0.99949 0 0 1.00179 0 -0.39999] CT
1 0 0 RC
1 LJ
2 LW
N
690.75 157.849 M
690.75 156.47 L
S
GR
GS
[0.99949 0 0 1.00179 0 -0.39999] CT
1 0 0 RC
[8 8] 0 setdash
2 LJ
2 LW
N
617.25 135.647 M
641.75 154.582 L
666.25 156.803 L
690.75 157.849 L
S
GR
GS
[0.99949 0 0 1.00179 616.93268 138.83264] CT
1 0 0 RC
N
f1394637256
f
GR
GS
[0.99949 0 0 1.00179 616.93268 138.83264] CT
1 0 0 RC
10.0 ML
2 LW
N
-3 0 M
3 0 L
S
GR
GS
[0.99949 0 0 1.00179 641.42008 156.71538] CT
1 0 0 RC
N
f1394637256
f
GR
GS
[0.99949 0 0 1.00179 641.42008 156.71538] CT
1 0 0 RC
10.0 ML
2 LW
N
-3 0 M
3 0 L
S
GR
GS
[0.99949 0 0 1.00179 665.90749 158.80406] CT
1 0 0 RC
N
f1394637256
f
GR
GS
[0.99949 0 0 1.00179 665.90749 158.80406] CT
1 0 0 RC
10.0 ML
2 LW
N
-3 0 M
3 0 L
S
GR
GS
[0.99949 0 0 1.00179 690.39489 159.11336] CT
1 0 0 RC
N
f1394637256
f
GR
GS
[0.99949 0 0 1.00179 690.39489 159.11336] CT
1 0 0 RC
10.0 ML
2 LW
N
-3 0 M
3 0 L
S
GR
GS
[0.99949 0 0 1.00179 616.93268 132.14803] CT
1 0 0 RC
N
f1394637256
f
GR
GS
[0.99949 0 0 1.00179 616.93268 132.14803] CT
1 0 0 RC
10.0 ML
2 LW
N
-3 0 M
3 0 L
S
GR
GS
[0.99949 0 0 1.00179 641.42008 152.20365] CT
1 0 0 RC
N
f1394637256
f
GR
GS
[0.99949 0 0 1.00179 641.42008 152.20365] CT
1 0 0 RC
10.0 ML
2 LW
N
-3 0 M
3 0 L
S
GR
GS
[0.99949 0 0 1.00179 665.90749 154.56422] CT
1 0 0 RC
N
f1394637256
f
GR
GS
[0.99949 0 0 1.00179 665.90749 154.56422] CT
1 0 0 RC
10.0 ML
2 LW
N
-3 0 M
3 0 L
S
GR
GS
[0.99949 0 0 1.00179 690.39489 156.35032] CT
1 0 0 RC
N
f1394637256
f
GR
GS
[0.99949 0 0 1.00179 690.39489 156.35032] CT
1 0 0 RC
10.0 ML
2 LW
N
-3 0 M
3 0 L
S
GR
%%Trailer
%%Pages: 1
%%EOF
