%!PS-Adobe-3.0 EPSF-3.0
%%Creator: (MATLAB, The Mathworks, Inc. Version 9.7.0.1190202 \(R2019b\). Operating System: Mac OS X)
%%Title: /Users/julian.kosciessa/Volumes/tardis/LNDG/stateswitch/stsw_beh_task/behavior/figures/a03s_featuresorted.eps
%%CreationDate: 2023-07-13T18:13:29
%%Pages: (atend)
%%BoundingBox:     4     0   235   264
%%LanguageLevel: 3
%%EndComments
%%BeginProlog
%%BeginResource: procset (Apache XML Graphics Std ProcSet) 1.2 0
%%Version: 1.2 0
%%Copyright: (Copyright 2001-2003,2010 The Apache Software Foundation. License terms: http://www.apache.org/licenses/LICENSE-2.0)
/bd{bind def}bind def
/ld{load def}bd
/GR/grestore ld
/GS/gsave ld
/RM/rmoveto ld
/C/curveto ld
/t/show ld
/L/lineto ld
/ML/setmiterlimit ld
/CT/concat ld
/f/fill ld
/N/newpath ld
/S/stroke ld
/CC/setcmykcolor ld
/A/ashow ld
/cp/closepath ld
/RC/setrgbcolor ld
/LJ/setlinejoin ld
/GC/setgray ld
/LW/setlinewidth ld
/M/moveto ld
/re {4 2 roll M
1 index 0 rlineto
0 exch rlineto
neg 0 rlineto
cp } bd
/_ctm matrix def
/_tm matrix def
/BT { _ctm currentmatrix pop matrix _tm copy pop 0 0 moveto } bd
/ET { _ctm setmatrix } bd
/iTm { _ctm setmatrix _tm concat } bd
/Tm { _tm astore pop iTm 0 0 moveto } bd
/ux 0.0 def
/uy 0.0 def
/F {
  /Tp exch def
  /Tf exch def
  Tf findfont Tp scalefont setfont
  /cf Tf def  /cs Tp def
} bd
/ULS {currentpoint /uy exch def /ux exch def} bd
/ULE {
  /Tcx currentpoint pop def
  gsave
  newpath
  cf findfont cs scalefont dup
  /FontMatrix get 0 get /Ts exch def /FontInfo get dup
  /UnderlinePosition get Ts mul /To exch def
  /UnderlineThickness get Ts mul /Tt exch def
  ux uy To add moveto  Tcx uy To add lineto
  Tt setlinewidth stroke
  grestore
} bd
/OLE {
  /Tcx currentpoint pop def
  gsave
  newpath
  cf findfont cs scalefont dup
  /FontMatrix get 0 get /Ts exch def /FontInfo get dup
  /UnderlinePosition get Ts mul /To exch def
  /UnderlineThickness get Ts mul /Tt exch def
  ux uy To add cs add moveto Tcx uy To add cs add lineto
  Tt setlinewidth stroke
  grestore
} bd
/SOE {
  /Tcx currentpoint pop def
  gsave
  newpath
  cf findfont cs scalefont dup
  /FontMatrix get 0 get /Ts exch def /FontInfo get dup
  /UnderlinePosition get Ts mul /To exch def
  /UnderlineThickness get Ts mul /Tt exch def
  ux uy To add cs 10 mul 26 idiv add moveto Tcx uy To add cs 10 mul 26 idiv add lineto
  Tt setlinewidth stroke
  grestore
} bd
/QT {
/Y22 exch store
/X22 exch store
/Y21 exch store
/X21 exch store
currentpoint
/Y21 load 2 mul add 3 div exch
/X21 load 2 mul add 3 div exch
/X21 load 2 mul /X22 load add 3 div
/Y21 load 2 mul /Y22 load add 3 div
/X22 load /Y22 load curveto
} bd
/SSPD {
dup length /d exch dict def
{
/v exch def
/k exch def
currentpagedevice k known {
/cpdv currentpagedevice k get def
v cpdv ne {
/upd false def
/nullv v type /nulltype eq def
/nullcpdv cpdv type /nulltype eq def
nullv nullcpdv or
{
/upd true def
} {
/sametype v type cpdv type eq def
sametype {
v type /arraytype eq {
/vlen v length def
/cpdvlen cpdv length def
vlen cpdvlen eq {
0 1 vlen 1 sub {
/i exch def
/obj v i get def
/cpdobj cpdv i get def
obj cpdobj ne {
/upd true def
exit
} if
} for
} {
/upd true def
} ifelse
} {
v type /dicttype eq {
v {
/dv exch def
/dk exch def
/cpddv cpdv dk get def
dv cpddv ne {
/upd true def
exit
} if
} forall
} {
/upd true def
} ifelse
} ifelse
} if
} ifelse
upd true eq {
d k v put
} if
} if
} if
} forall
d length 0 gt {
d setpagedevice
} if
} bd
/RE { % /NewFontName [NewEncodingArray] /FontName RE -
  findfont dup length dict begin
  {
    1 index /FID ne
    {def} {pop pop} ifelse
  } forall
  /Encoding exch def
  /FontName 1 index def
  currentdict definefont pop
  end
} bind def
%%EndResource
%%BeginResource: procset (Apache XML Graphics EPS ProcSet) 1.0 0
%%Version: 1.0 0
%%Copyright: (Copyright 2002-2003 The Apache Software Foundation. License terms: http://www.apache.org/licenses/LICENSE-2.0)
/BeginEPSF { %def
/b4_Inc_state save def         % Save state for cleanup
/dict_count countdictstack def % Count objects on dict stack
/op_count count 1 sub def      % Count objects on operand stack
userdict begin                 % Push userdict on dict stack
/showpage { } def              % Redefine showpage, { } = null proc
0 setgray 0 setlinecap         % Prepare graphics state
1 setlinewidth 0 setlinejoin
10 setmiterlimit [ ] 0 setdash newpath
/languagelevel where           % If level not equal to 1 then
{pop languagelevel             % set strokeadjust and
1 ne                           % overprint to their defaults.
{false setstrokeadjust false setoverprint
} if
} if
} bd
/EndEPSF { %def
count op_count sub {pop} repeat            % Clean up stacks
countdictstack dict_count sub {end} repeat
b4_Inc_state restore
} bd
%%EndResource
%FOPBeginFontDict
%%IncludeResource: font Courier-Oblique
%%IncludeResource: font Courier-BoldOblique
%%IncludeResource: font Courier-Bold
%%IncludeResource: font ZapfDingbats
%%IncludeResource: font Symbol
%%IncludeResource: font Helvetica
%%IncludeResource: font Helvetica-Oblique
%%IncludeResource: font Helvetica-Bold
%%IncludeResource: font Helvetica-BoldOblique
%%IncludeResource: font Times-Roman
%%IncludeResource: font Times-Italic
%%IncludeResource: font Times-Bold
%%IncludeResource: font Times-BoldItalic
%%IncludeResource: font Courier
%FOPEndFontDict
%%BeginResource: encoding WinAnsiEncoding
/WinAnsiEncoding [
/.notdef /.notdef /.notdef /.notdef /.notdef
/.notdef /.notdef /.notdef /.notdef /.notdef
/.notdef /.notdef /.notdef /.notdef /.notdef
/.notdef /.notdef /.notdef /.notdef /.notdef
/.notdef /.notdef /.notdef /.notdef /.notdef
/.notdef /.notdef /.notdef /.notdef /.notdef
/.notdef /.notdef /space /exclam /quotedbl
/numbersign /dollar /percent /ampersand /quotesingle
/parenleft /parenright /asterisk /plus /comma
/hyphen /period /slash /zero /one
/two /three /four /five /six
/seven /eight /nine /colon /semicolon
/less /equal /greater /question /at
/A /B /C /D /E
/F /G /H /I /J
/K /L /M /N /O
/P /Q /R /S /T
/U /V /W /X /Y
/Z /bracketleft /backslash /bracketright /asciicircum
/underscore /quoteleft /a /b /c
/d /e /f /g /h
/i /j /k /l /m
/n /o /p /q /r
/s /t /u /v /w
/x /y /z /braceleft /bar
/braceright /asciitilde /bullet /Euro /bullet
/quotesinglbase /florin /quotedblbase /ellipsis /dagger
/daggerdbl /circumflex /perthousand /Scaron /guilsinglleft
/OE /bullet /Zcaron /bullet /bullet
/quoteleft /quoteright /quotedblleft /quotedblright /bullet
/endash /emdash /asciitilde /trademark /scaron
/guilsinglright /oe /bullet /zcaron /Ydieresis
/space /exclamdown /cent /sterling /currency
/yen /brokenbar /section /dieresis /copyright
/ordfeminine /guillemotleft /logicalnot /sfthyphen /registered
/macron /degree /plusminus /twosuperior /threesuperior
/acute /mu /paragraph /middot /cedilla
/onesuperior /ordmasculine /guillemotright /onequarter /onehalf
/threequarters /questiondown /Agrave /Aacute /Acircumflex
/Atilde /Adieresis /Aring /AE /Ccedilla
/Egrave /Eacute /Ecircumflex /Edieresis /Igrave
/Iacute /Icircumflex /Idieresis /Eth /Ntilde
/Ograve /Oacute /Ocircumflex /Otilde /Odieresis
/multiply /Oslash /Ugrave /Uacute /Ucircumflex
/Udieresis /Yacute /Thorn /germandbls /agrave
/aacute /acircumflex /atilde /adieresis /aring
/ae /ccedilla /egrave /eacute /ecircumflex
/edieresis /igrave /iacute /icircumflex /idieresis
/eth /ntilde /ograve /oacute /ocircumflex
/otilde /odieresis /divide /oslash /ugrave
/uacute /ucircumflex /udieresis /yacute /thorn
/ydieresis
] def
%%EndResource
%FOPBeginFontReencode
/Courier-Oblique findfont
dup length dict begin
  {1 index /FID ne {def} {pop pop} ifelse} forall
  /Encoding WinAnsiEncoding def
  currentdict
end
/Courier-Oblique exch definefont pop
/Courier-BoldOblique findfont
dup length dict begin
  {1 index /FID ne {def} {pop pop} ifelse} forall
  /Encoding WinAnsiEncoding def
  currentdict
end
/Courier-BoldOblique exch definefont pop
/Courier-Bold findfont
dup length dict begin
  {1 index /FID ne {def} {pop pop} ifelse} forall
  /Encoding WinAnsiEncoding def
  currentdict
end
/Courier-Bold exch definefont pop
/Helvetica findfont
dup length dict begin
  {1 index /FID ne {def} {pop pop} ifelse} forall
  /Encoding WinAnsiEncoding def
  currentdict
end
/Helvetica exch definefont pop
/Helvetica-Oblique findfont
dup length dict begin
  {1 index /FID ne {def} {pop pop} ifelse} forall
  /Encoding WinAnsiEncoding def
  currentdict
end
/Helvetica-Oblique exch definefont pop
/Helvetica-Bold findfont
dup length dict begin
  {1 index /FID ne {def} {pop pop} ifelse} forall
  /Encoding WinAnsiEncoding def
  currentdict
end
/Helvetica-Bold exch definefont pop
/Helvetica-BoldOblique findfont
dup length dict begin
  {1 index /FID ne {def} {pop pop} ifelse} forall
  /Encoding WinAnsiEncoding def
  currentdict
end
/Helvetica-BoldOblique exch definefont pop
/Times-Roman findfont
dup length dict begin
  {1 index /FID ne {def} {pop pop} ifelse} forall
  /Encoding WinAnsiEncoding def
  currentdict
end
/Times-Roman exch definefont pop
/Times-Italic findfont
dup length dict begin
  {1 index /FID ne {def} {pop pop} ifelse} forall
  /Encoding WinAnsiEncoding def
  currentdict
end
/Times-Italic exch definefont pop
/Times-Bold findfont
dup length dict begin
  {1 index /FID ne {def} {pop pop} ifelse} forall
  /Encoding WinAnsiEncoding def
  currentdict
end
/Times-Bold exch definefont pop
/Times-BoldItalic findfont
dup length dict begin
  {1 index /FID ne {def} {pop pop} ifelse} forall
  /Encoding WinAnsiEncoding def
  currentdict
end
/Times-BoldItalic exch definefont pop
/Courier findfont
dup length dict begin
  {1 index /FID ne {def} {pop pop} ifelse} forall
  /Encoding WinAnsiEncoding def
  currentdict
end
/Courier exch definefont pop
%FOPEndFontReencode
%%EndProlog
%%Page: 1 1
%%PageBoundingBox: 0 0 259 279
%%BeginPageSetup
[1 0 0 -1 0 279] CT
%%EndPageSetup
GS
[1.00077 0 0 1.0009 0 -0.25] CT
N
0 0 M
259 0 L
259 279 L
0 279 L
0 0 L
cp
clip
1 GC
N
0 0 259 279 re
f
GR
GS
[1.00077 0 0 1.0009 0 -0.25] CT
1 GC
N
0 0 259 279 re
f
GR
GS
[1.00077 0 0 1.0009 0 -0.25] CT
1 GC
N
56 229 M
234.5 229 L
234.5 21 L
56 21 L
cp
f
GR
GS
[1.00077 0 0 1.0009 0 -0.25] CT
0.149 GC
2 setlinecap
1 LJ
0.5 LW
N
56 229 M
234.5 229 L
S
GR
GS
[1.00077 0 0 1.0009 0 -0.25] CT
0.149 GC
2 setlinecap
1 LJ
0.5 LW
N
78.313 229 M
78.313 226.92 L
S
GR
GS
[1.00077 0 0 1.0009 0 -0.25] CT
0.149 GC
2 setlinecap
1 LJ
0.5 LW
N
122.938 229 M
122.938 226.92 L
S
GR
GS
[1.00077 0 0 1.0009 0 -0.25] CT
0.149 GC
2 setlinecap
1 LJ
0.5 LW
N
167.563 229 M
167.563 226.92 L
S
GR
GS
[1.00077 0 0 1.0009 0 -0.25] CT
0.149 GC
2 setlinecap
1 LJ
0.5 LW
N
212.188 229 M
212.188 226.92 L
S
GR
GS
[1.00077 0 0 1.0009 78.37297 234.56021] CT
0.149 GC
/Helvetica 18 F
GS
[1 0 0 1 0 0] CT
-5.5 18 moveto 
1 -1 scale
(1) t 
GR
GR
GS
[1.00077 0 0 1.0009 123.03242 234.56021] CT
0.149 GC
/Helvetica 18 F
GS
[1 0 0 1 0 0] CT
-5.5 18 moveto 
1 -1 scale
(2) t 
GR
GR
GS
[1.00077 0 0 1.0009 167.69188 234.56021] CT
0.149 GC
/Helvetica 18 F
GS
[1 0 0 1 0 0] CT
-5.5 18 moveto 
1 -1 scale
(3) t 
GR
GR
GS
[1.00077 0 0 1.0009 212.35134 234.56021] CT
0.149 GC
/Helvetica 18 F
GS
[1 0 0 1 0 0] CT
-5.5 18 moveto 
1 -1 scale
(4) t 
GR
GR
GS
[1.00077 0 0 1.0009 145.36224 257.48073] CT
0.149 GC
/Helvetica 18 F
GS
[1 0 0 1 0 0] CT
-46 18 moveto 
1 -1 scale
(# of targets) t 
GR
GR
GS
[1.00077 0 0 1.0009 0 -0.25] CT
0.149 GC
2 setlinecap
1 LJ
0.5 LW
N
56 229 M
56 21 L
S
GR
GS
[1.00077 0 0 1.0009 0 -0.25] CT
0.149 GC
2 setlinecap
1 LJ
0.5 LW
N
56 229 M
58.08 229 L
S
GR
GS
[1.00077 0 0 1.0009 0 -0.25] CT
0.149 GC
2 setlinecap
1 LJ
0.5 LW
N
56 187.4 M
58.08 187.4 L
S
GR
GS
[1.00077 0 0 1.0009 0 -0.25] CT
0.149 GC
2 setlinecap
1 LJ
0.5 LW
N
56 145.8 M
58.08 145.8 L
S
GR
GS
[1.00077 0 0 1.0009 0 -0.25] CT
0.149 GC
2 setlinecap
1 LJ
0.5 LW
N
56 104.2 M
58.08 104.2 L
S
GR
GS
[1.00077 0 0 1.0009 0 -0.25] CT
0.149 GC
2 setlinecap
1 LJ
0.5 LW
N
56 62.6 M
58.08 62.6 L
S
GR
GS
[1.00077 0 0 1.0009 0 -0.25] CT
0.149 GC
2 setlinecap
1 LJ
0.5 LW
N
56 21 M
58.08 21 L
S
GR
GS
[1.00077 0 0 1.0009 50.43892 228.9552] CT
0.149 GC
/Helvetica 18 F
GS
[1 0 0 1 0 0] CT
-26 7 moveto 
1 -1 scale
(0.5) t 
GR
GR
GS
[1.00077 0 0 1.0009 50.43892 187.31792] CT
0.149 GC
/Helvetica 18 F
GS
[1 0 0 1 0 0] CT
-26 7 moveto 
1 -1 scale
(0.6) t 
GR
GR
GS
[1.00077 0 0 1.0009 50.43892 145.68065] CT
0.149 GC
/Helvetica 18 F
GS
[1 0 0 1 0 0] CT
-26 7 moveto 
1 -1 scale
(0.7) t 
GR
GR
GS
[1.00077 0 0 1.0009 50.43892 104.04337] CT
0.149 GC
/Helvetica 18 F
GS
[1 0 0 1 0 0] CT
-26 7 moveto 
1 -1 scale
(0.8) t 
GR
GR
GS
[1.00077 0 0 1.0009 50.43892 62.4061] CT
0.149 GC
/Helvetica 18 F
GS
[1 0 0 1 0 0] CT
-26 7 moveto 
1 -1 scale
(0.9) t 
GR
GR
GS
[1.00077 0 0 1.0009 50.43892 20.76882] CT
0.149 GC
/Helvetica 18 F
GS
[1 0 0 1 0 0] CT
-11 7 moveto 
1 -1 scale
(1) t 
GR
GR
GS
[0 -1.0009 1.00077 0 21.5166 124.86191] CT
0.149 GC
/Helvetica 18 F
GS
[1 0 0 1 0 0] CT
-63 -4 moveto 
1 -1 scale
(Mean Accuracy) t 
GR
GR
GS
[1.00077 0 0 1.0009 0 -0.25] CT
1 LJ
2 LW
N
78.313 31.833 M
78.313 34.632 L
S
GR
GS
[1.00077 0 0 1.0009 0 -0.25] CT
1 LJ
2 LW
N
122.938 51.021 M
122.938 56.337 L
S
GR
GS
[1.00077 0 0 1.0009 0 -0.25] CT
1 LJ
2 LW
N
167.563 64.215 M
167.563 70.639 L
S
GR
GS
[1.00077 0 0 1.0009 0 -0.25] CT
1 LJ
2 LW
N
212.188 67.779 M
212.188 75.785 L
S
GR
GS
[1.00077 0 0 1.0009 0 -0.25] CT
1 LJ
2 LW
N
78.313 31.833 M
78.313 29.034 L
S
GR
GS
[1.00077 0 0 1.0009 0 -0.25] CT
1 LJ
2 LW
N
122.938 51.021 M
122.938 45.705 L
S
GR
GS
[1.00077 0 0 1.0009 0 -0.25] CT
1 LJ
2 LW
N
167.563 64.215 M
167.563 57.792 L
S
GR
GS
[1.00077 0 0 1.0009 0 -0.25] CT
1 LJ
2 LW
N
212.188 67.779 M
212.188 59.774 L
S
GR
GS
[1.00077 0 0 1.0009 0 -0.25] CT
[8 8] 0 setdash
2 LJ
2 LW
N
78.313 31.833 M
122.938 51.021 L
167.563 64.215 L
212.188 67.779 L
S
GR
GS
[1.00077 0 0 1.0009 78.37297 34.41347] CT
N
-3 0 M
3 0 L
f
GR
GS
[1.00077 0 0 1.0009 78.37297 34.41347] CT
10.0 ML
2 LW
N
-3 0 M
3 0 L
S
GR
GS
[1.00077 0 0 1.0009 123.03242 56.13699] CT
N
/f1394637256{-3 0 M
3 0 L}def
f1394637256
f
GR
GS
[1.00077 0 0 1.0009 123.03242 56.13699] CT
10.0 ML
2 LW
N
-3 0 M
3 0 L
S
GR
GS
[1.00077 0 0 1.0009 167.69188 70.45246] CT
N
f1394637256
f
GR
GS
[1.00077 0 0 1.0009 167.69188 70.45246] CT
10.0 ML
2 LW
N
-3 0 M
3 0 L
S
GR
GS
[1.00077 0 0 1.0009 212.35134 75.60267] CT
N
f1394637256
f
GR
GS
[1.00077 0 0 1.0009 212.35134 75.60267] CT
10.0 ML
2 LW
N
-3 0 M
3 0 L
S
GR
GS
[1.00077 0 0 1.0009 78.37297 28.81024] CT
N
f1394637256
f
GR
GS
[1.00077 0 0 1.0009 78.37297 28.81024] CT
10.0 ML
2 LW
N
-3 0 M
3 0 L
S
GR
GS
[1.00077 0 0 1.0009 123.03242 45.49571] CT
N
f1394637256
f
GR
GS
[1.00077 0 0 1.0009 123.03242 45.49571] CT
10.0 ML
2 LW
N
-3 0 M
3 0 L
S
GR
GS
[1.00077 0 0 1.0009 167.69188 57.59344] CT
N
f1394637256
f
GR
GS
[1.00077 0 0 1.0009 167.69188 57.59344] CT
10.0 ML
2 LW
N
-3 0 M
3 0 L
S
GR
GS
[1.00077 0 0 1.0009 212.35134 59.57752] CT
N
f1394637256
f
GR
GS
[1.00077 0 0 1.0009 212.35134 59.57752] CT
10.0 ML
2 LW
N
-3 0 M
3 0 L
S
GR
GS
[1.00077 0 0 1.0009 0 -0.25] CT
1 LJ
2 LW
N
78.313 93.731 M
78.313 99.331 L
S
GR
GS
[1.00077 0 0 1.0009 0 -0.25] CT
1 LJ
2 LW
N
122.938 111.059 M
122.938 116.541 L
S
GR
GS
[1.00077 0 0 1.0009 0 -0.25] CT
1 LJ
2 LW
N
167.563 121.784 M
167.563 127.804 L
S
GR
GS
[1.00077 0 0 1.0009 0 -0.25] CT
1 LJ
2 LW
N
212.188 129.978 M
212.188 136.244 L
S
GR
GS
[1.00077 0 0 1.0009 0 -0.25] CT
1 LJ
2 LW
N
78.313 93.731 M
78.313 88.132 L
S
GR
GS
[1.00077 0 0 1.0009 0 -0.25] CT
1 LJ
2 LW
N
122.938 111.059 M
122.938 105.577 L
S
GR
GS
[1.00077 0 0 1.0009 0 -0.25] CT
1 LJ
2 LW
N
167.563 121.784 M
167.563 115.763 L
S
GR
GS
[1.00077 0 0 1.0009 0 -0.25] CT
1 LJ
2 LW
N
212.188 129.978 M
212.188 123.712 L
S
GR
GS
[1.00077 0 0 1.0009 0 -0.25] CT
1 LJ
2 LW
N
78.313 93.731 M
122.938 111.059 L
167.563 121.784 L
212.188 129.978 L
S
GR
GS
[1.00077 0 0 1.0009 78.37297 99.16968] CT
N
f1394637256
f
GR
GS
[1.00077 0 0 1.0009 78.37297 99.16968] CT
10.0 ML
2 LW
N
-3 0 M
3 0 L
S
GR
GS
[1.00077 0 0 1.0009 123.03242 116.39548] CT
N
f1394637256
f
GR
GS
[1.00077 0 0 1.0009 123.03242 116.39548] CT
10.0 ML
2 LW
N
-3 0 M
3 0 L
S
GR
GS
[1.00077 0 0 1.0009 167.69188 127.6685] CT
N
f1394637256
f
GR
GS
[1.00077 0 0 1.0009 167.69188 127.6685] CT
10.0 ML
2 LW
N
-3 0 M
3 0 L
S
GR
GS
[1.00077 0 0 1.0009 212.35134 136.11651] CT
N
f1394637256
f
GR
GS
[1.00077 0 0 1.0009 212.35134 136.11651] CT
10.0 ML
2 LW
N
-3 0 M
3 0 L
S
GR
GS
[1.00077 0 0 1.0009 78.37297 87.96072] CT
N
f1394637256
f
GR
GS
[1.00077 0 0 1.0009 78.37297 87.96072] CT
10.0 ML
2 LW
N
-3 0 M
3 0 L
S
GR
GS
[1.00077 0 0 1.0009 123.03242 105.42127] CT
N
f1394637256
f
GR
GS
[1.00077 0 0 1.0009 123.03242 105.42127] CT
10.0 ML
2 LW
N
-3 0 M
3 0 L
S
GR
GS
[1.00077 0 0 1.0009 167.69188 115.61705] CT
N
f1394637256
f
GR
GS
[1.00077 0 0 1.0009 167.69188 115.61705] CT
10.0 ML
2 LW
N
-3 0 M
3 0 L
S
GR
GS
[1.00077 0 0 1.0009 212.35134 123.57303] CT
N
f1394637256
f
GR
GS
[1.00077 0 0 1.0009 212.35134 123.57303] CT
10.0 ML
2 LW
N
-3 0 M
3 0 L
S
GR
GS
[1.00077 0 0 1.0009 0 -0.25] CT
1 0 0 RC
1 LJ
2 LW
N
78.313 106.723 M
78.313 112.834 L
S
GR
GS
[1.00077 0 0 1.0009 0 -0.25] CT
1 0 0 RC
1 LJ
2 LW
N
122.938 149.448 M
122.938 155.828 L
S
GR
GS
[1.00077 0 0 1.0009 0 -0.25] CT
1 0 0 RC
1 LJ
2 LW
N
167.563 151.217 M
167.563 156.848 L
S
GR
GS
[1.00077 0 0 1.0009 0 -0.25] CT
1 0 0 RC
1 LJ
2 LW
N
212.188 157.747 M
212.188 162.889 L
S
GR
GS
[1.00077 0 0 1.0009 0 -0.25] CT
1 0 0 RC
1 LJ
2 LW
N
78.313 106.723 M
78.313 100.613 L
S
GR
GS
[1.00077 0 0 1.0009 0 -0.25] CT
1 0 0 RC
1 LJ
2 LW
N
122.938 149.448 M
122.938 143.067 L
S
GR
GS
[1.00077 0 0 1.0009 0 -0.25] CT
1 0 0 RC
1 LJ
2 LW
N
167.563 151.217 M
167.563 145.587 L
S
GR
GS
[1.00077 0 0 1.0009 0 -0.25] CT
1 0 0 RC
1 LJ
2 LW
N
212.188 157.747 M
212.188 152.606 L
S
GR
GS
[1.00077 0 0 1.0009 0 -0.25] CT
1 0 0 RC
1 LJ
2 LW
N
78.313 106.723 M
122.938 149.448 L
167.563 151.217 L
212.188 157.747 L
S
GR
GS
[1.00077 0 0 1.0009 78.37297 112.68463] CT
1 0 0 RC
N
f1394637256
f
GR
GS
[1.00077 0 0 1.0009 78.37297 112.68463] CT
1 0 0 RC
10.0 ML
2 LW
N
-3 0 M
3 0 L
S
GR
GS
[1.00077 0 0 1.0009 123.03242 155.71734] CT
1 0 0 RC
N
f1394637256
f
GR
GS
[1.00077 0 0 1.0009 123.03242 155.71734] CT
1 0 0 RC
10.0 ML
2 LW
N
-3 0 M
3 0 L
S
GR
GS
[1.00077 0 0 1.0009 167.69188 156.73809] CT
1 0 0 RC
N
f1394637256
f
GR
GS
[1.00077 0 0 1.0009 167.69188 156.73809] CT
1 0 0 RC
10.0 ML
2 LW
N
-3 0 M
3 0 L
S
GR
GS
[1.00077 0 0 1.0009 212.35134 162.78489] CT
1 0 0 RC
N
f1394637256
f
GR
GS
[1.00077 0 0 1.0009 212.35134 162.78489] CT
1 0 0 RC
10.0 ML
2 LW
N
-3 0 M
3 0 L
S
GR
GS
[1.00077 0 0 1.0009 78.37297 100.4529] CT
1 0 0 RC
N
f1394637256
f
GR
GS
[1.00077 0 0 1.0009 78.37297 100.4529] CT
1 0 0 RC
10.0 ML
2 LW
N
-3 0 M
3 0 L
S
GR
GS
[1.00077 0 0 1.0009 123.03242 142.94561] CT
1 0 0 RC
N
f1394637256
f
GR
GS
[1.00077 0 0 1.0009 123.03242 142.94561] CT
1 0 0 RC
10.0 ML
2 LW
N
-3 0 M
3 0 L
S
GR
GS
[1.00077 0 0 1.0009 167.69188 145.46758] CT
1 0 0 RC
N
f1394637256
f
GR
GS
[1.00077 0 0 1.0009 167.69188 145.46758] CT
1 0 0 RC
10.0 ML
2 LW
N
-3 0 M
3 0 L
S
GR
GS
[1.00077 0 0 1.0009 212.35134 152.4925] CT
1 0 0 RC
N
f1394637256
f
GR
GS
[1.00077 0 0 1.0009 212.35134 152.4925] CT
1 0 0 RC
10.0 ML
2 LW
N
-3 0 M
3 0 L
S
GR
GS
[1.00077 0 0 1.0009 0 -0.25] CT
1 0 0 RC
1 LJ
2 LW
N
78.313 206.543 M
78.313 212.569 L
S
GR
GS
[1.00077 0 0 1.0009 0 -0.25] CT
1 0 0 RC
1 LJ
2 LW
N
122.938 202.722 M
122.938 208.212 L
S
GR
GS
[1.00077 0 0 1.0009 0 -0.25] CT
1 0 0 RC
1 LJ
2 LW
N
167.563 206.155 M
167.563 210.732 L
S
GR
GS
[1.00077 0 0 1.0009 0 -0.25] CT
1 0 0 RC
1 LJ
2 LW
N
212.188 208.258 M
212.188 212.792 L
S
GR
GS
[1.00077 0 0 1.0009 0 -0.25] CT
1 0 0 RC
1 LJ
2 LW
N
78.313 206.543 M
78.313 200.518 L
S
GR
GS
[1.00077 0 0 1.0009 0 -0.25] CT
1 0 0 RC
1 LJ
2 LW
N
122.938 202.722 M
122.938 197.232 L
S
GR
GS
[1.00077 0 0 1.0009 0 -0.25] CT
1 0 0 RC
1 LJ
2 LW
N
167.563 206.155 M
167.563 201.578 L
S
GR
GS
[1.00077 0 0 1.0009 0 -0.25] CT
1 0 0 RC
1 LJ
2 LW
N
212.188 208.258 M
212.188 203.725 L
S
GR
GS
[1.00077 0 0 1.0009 0 -0.25] CT
1 0 0 RC
[8 8] 0 setdash
2 LJ
2 LW
N
78.313 206.543 M
122.938 202.722 L
167.563 206.155 L
212.188 208.258 L
S
GR
GS
[1.00077 0 0 1.0009 78.37297 212.50941] CT
1 0 0 RC
N
f1394637256
f
GR
GS
[1.00077 0 0 1.0009 78.37297 212.50941] CT
1 0 0 RC
10.0 ML
2 LW
N
-3 0 M
3 0 L
S
GR
GS
[1.00077 0 0 1.0009 123.03242 208.1487] CT
1 0 0 RC
N
f1394637256
f
GR
GS
[1.00077 0 0 1.0009 123.03242 208.1487] CT
1 0 0 RC
10.0 ML
2 LW
N
-3 0 M
3 0 L
S
GR
GS
[1.00077 0 0 1.0009 167.69188 210.67072] CT
1 0 0 RC
N
f1394637256
f
GR
GS
[1.00077 0 0 1.0009 167.69188 210.67072] CT
1 0 0 RC
10.0 ML
2 LW
N
-3 0 M
3 0 L
S
GR
GS
[1.00077 0 0 1.0009 212.35134 212.73221] CT
1 0 0 RC
N
f1394637256
f
GR
GS
[1.00077 0 0 1.0009 212.35134 212.73221] CT
1 0 0 RC
10.0 ML
2 LW
N
-3 0 M
3 0 L
S
GR
GS
[1.00077 0 0 1.0009 78.37297 200.44751] CT
1 0 0 RC
N
f1394637256
f
GR
GS
[1.00077 0 0 1.0009 78.37297 200.44751] CT
1 0 0 RC
10.0 ML
2 LW
N
-3 0 M
3 0 L
S
GR
GS
[1.00077 0 0 1.0009 123.03242 197.15862] CT
1 0 0 RC
N
f1394637256
f
GR
GS
[1.00077 0 0 1.0009 123.03242 197.15862] CT
1 0 0 RC
10.0 ML
2 LW
N
-3 0 M
3 0 L
S
GR
GS
[1.00077 0 0 1.0009 167.69188 201.50899] CT
1 0 0 RC
N
f1394637256
f
GR
GS
[1.00077 0 0 1.0009 167.69188 201.50899] CT
1 0 0 RC
10.0 ML
2 LW
N
-3 0 M
3 0 L
S
GR
GS
[1.00077 0 0 1.0009 212.35134 203.65782] CT
1 0 0 RC
N
f1394637256
f
GR
GS
[1.00077 0 0 1.0009 212.35134 203.65782] CT
1 0 0 RC
10.0 ML
2 LW
N
-3 0 M
3 0 L
S
GR
%%Trailer
%%Pages: 1
%%EOF
