%!PS-Adobe-3.0 EPSF-3.0
%%Creator: (MATLAB, The Mathworks, Inc. Version 9.3.0.713579 \(R2017b\). Operating System: Mac OS X)
%%Title: /Volumes/LNDG/Projects/StateSwitch/dynamic/data/behavior/STSW_dynamic/B_reliabilityAcrossSessions/C_figures/E2_EEG_byAtt_supplement.eps
%%CreationDate: 2020-11-27T15:57:59
%%Pages: (atend)
%%BoundingBox:    76     5   931   281
%%LanguageLevel: 3
%%EndComments
%%BeginProlog
%%BeginResource: procset (Apache XML Graphics Std ProcSet) 1.2 0
%%Version: 1.2 0
%%Copyright: (Copyright 2001-2003,2010 The Apache Software Foundation. License terms: http://www.apache.org/licenses/LICENSE-2.0)
/bd{bind def}bind def
/ld{load def}bd
/GR/grestore ld
/GS/gsave ld
/RM/rmoveto ld
/C/curveto ld
/t/show ld
/L/lineto ld
/ML/setmiterlimit ld
/CT/concat ld
/f/fill ld
/N/newpath ld
/S/stroke ld
/CC/setcmykcolor ld
/A/ashow ld
/cp/closepath ld
/RC/setrgbcolor ld
/LJ/setlinejoin ld
/GC/setgray ld
/LW/setlinewidth ld
/M/moveto ld
/re {4 2 roll M
1 index 0 rlineto
0 exch rlineto
neg 0 rlineto
cp } bd
/_ctm matrix def
/_tm matrix def
/BT { _ctm currentmatrix pop matrix _tm copy pop 0 0 moveto } bd
/ET { _ctm setmatrix } bd
/iTm { _ctm setmatrix _tm concat } bd
/Tm { _tm astore pop iTm 0 0 moveto } bd
/ux 0.0 def
/uy 0.0 def
/F {
  /Tp exch def
  /Tf exch def
  Tf findfont Tp scalefont setfont
  /cf Tf def  /cs Tp def
} bd
/ULS {currentpoint /uy exch def /ux exch def} bd
/ULE {
  /Tcx currentpoint pop def
  gsave
  newpath
  cf findfont cs scalefont dup
  /FontMatrix get 0 get /Ts exch def /FontInfo get dup
  /UnderlinePosition get Ts mul /To exch def
  /UnderlineThickness get Ts mul /Tt exch def
  ux uy To add moveto  Tcx uy To add lineto
  Tt setlinewidth stroke
  grestore
} bd
/OLE {
  /Tcx currentpoint pop def
  gsave
  newpath
  cf findfont cs scalefont dup
  /FontMatrix get 0 get /Ts exch def /FontInfo get dup
  /UnderlinePosition get Ts mul /To exch def
  /UnderlineThickness get Ts mul /Tt exch def
  ux uy To add cs add moveto Tcx uy To add cs add lineto
  Tt setlinewidth stroke
  grestore
} bd
/SOE {
  /Tcx currentpoint pop def
  gsave
  newpath
  cf findfont cs scalefont dup
  /FontMatrix get 0 get /Ts exch def /FontInfo get dup
  /UnderlinePosition get Ts mul /To exch def
  /UnderlineThickness get Ts mul /Tt exch def
  ux uy To add cs 10 mul 26 idiv add moveto Tcx uy To add cs 10 mul 26 idiv add lineto
  Tt setlinewidth stroke
  grestore
} bd
/QT {
/Y22 exch store
/X22 exch store
/Y21 exch store
/X21 exch store
currentpoint
/Y21 load 2 mul add 3 div exch
/X21 load 2 mul add 3 div exch
/X21 load 2 mul /X22 load add 3 div
/Y21 load 2 mul /Y22 load add 3 div
/X22 load /Y22 load curveto
} bd
/SSPD {
dup length /d exch dict def
{
/v exch def
/k exch def
currentpagedevice k known {
/cpdv currentpagedevice k get def
v cpdv ne {
/upd false def
/nullv v type /nulltype eq def
/nullcpdv cpdv type /nulltype eq def
nullv nullcpdv or
{
/upd true def
} {
/sametype v type cpdv type eq def
sametype {
v type /arraytype eq {
/vlen v length def
/cpdvlen cpdv length def
vlen cpdvlen eq {
0 1 vlen 1 sub {
/i exch def
/obj v i get def
/cpdobj cpdv i get def
obj cpdobj ne {
/upd true def
exit
} if
} for
} {
/upd true def
} ifelse
} {
v type /dicttype eq {
v {
/dv exch def
/dk exch def
/cpddv cpdv dk get def
dv cpddv ne {
/upd true def
exit
} if
} forall
} {
/upd true def
} ifelse
} ifelse
} if
} ifelse
upd true eq {
d k v put
} if
} if
} if
} forall
d length 0 gt {
d setpagedevice
} if
} bd
/RE { % /NewFontName [NewEncodingArray] /FontName RE -
  findfont dup length dict begin
  {
    1 index /FID ne
    {def} {pop pop} ifelse
  } forall
  /Encoding exch def
  /FontName 1 index def
  currentdict definefont pop
  end
} bind def
%%EndResource
%%BeginResource: procset (Apache XML Graphics EPS ProcSet) 1.0 0
%%Version: 1.0 0
%%Copyright: (Copyright 2002-2003 The Apache Software Foundation. License terms: http://www.apache.org/licenses/LICENSE-2.0)
/BeginEPSF { %def
/b4_Inc_state save def         % Save state for cleanup
/dict_count countdictstack def % Count objects on dict stack
/op_count count 1 sub def      % Count objects on operand stack
userdict begin                 % Push userdict on dict stack
/showpage { } def              % Redefine showpage, { } = null proc
0 setgray 0 setlinecap         % Prepare graphics state
1 setlinewidth 0 setlinejoin
10 setmiterlimit [ ] 0 setdash newpath
/languagelevel where           % If level not equal to 1 then
{pop languagelevel             % set strokeadjust and
1 ne                           % overprint to their defaults.
{false setstrokeadjust false setoverprint
} if
} if
} bd
/EndEPSF { %def
count op_count sub {pop} repeat            % Clean up stacks
countdictstack dict_count sub {end} repeat
b4_Inc_state restore
} bd
%%EndResource
%FOPBeginFontDict
%%IncludeResource: font Courier-Oblique
%%IncludeResource: font Courier-BoldOblique
%%IncludeResource: font Courier-Bold
%%IncludeResource: font ZapfDingbats
%%IncludeResource: font Symbol
%%IncludeResource: font Helvetica
%%IncludeResource: font Helvetica-Oblique
%%IncludeResource: font Helvetica-Bold
%%IncludeResource: font Helvetica-BoldOblique
%%IncludeResource: font Times-Roman
%%IncludeResource: font Times-Italic
%%IncludeResource: font Times-Bold
%%IncludeResource: font Times-BoldItalic
%%IncludeResource: font Courier
%FOPEndFontDict
%%BeginResource: encoding WinAnsiEncoding
/WinAnsiEncoding [
/.notdef /.notdef /.notdef /.notdef /.notdef
/.notdef /.notdef /.notdef /.notdef /.notdef
/.notdef /.notdef /.notdef /.notdef /.notdef
/.notdef /.notdef /.notdef /.notdef /.notdef
/.notdef /.notdef /.notdef /.notdef /.notdef
/.notdef /.notdef /.notdef /.notdef /.notdef
/.notdef /.notdef /space /exclam /quotedbl
/numbersign /dollar /percent /ampersand /quotesingle
/parenleft /parenright /asterisk /plus /comma
/hyphen /period /slash /zero /one
/two /three /four /five /six
/seven /eight /nine /colon /semicolon
/less /equal /greater /question /at
/A /B /C /D /E
/F /G /H /I /J
/K /L /M /N /O
/P /Q /R /S /T
/U /V /W /X /Y
/Z /bracketleft /backslash /bracketright /asciicircum
/underscore /quoteleft /a /b /c
/d /e /f /g /h
/i /j /k /l /m
/n /o /p /q /r
/s /t /u /v /w
/x /y /z /braceleft /bar
/braceright /asciitilde /bullet /Euro /bullet
/quotesinglbase /florin /quotedblbase /ellipsis /dagger
/daggerdbl /circumflex /perthousand /Scaron /guilsinglleft
/OE /bullet /Zcaron /bullet /bullet
/quoteleft /quoteright /quotedblleft /quotedblright /bullet
/endash /emdash /asciitilde /trademark /scaron
/guilsinglright /oe /bullet /zcaron /Ydieresis
/space /exclamdown /cent /sterling /currency
/yen /brokenbar /section /dieresis /copyright
/ordfeminine /guillemotleft /logicalnot /sfthyphen /registered
/macron /degree /plusminus /twosuperior /threesuperior
/acute /mu /paragraph /middot /cedilla
/onesuperior /ordmasculine /guillemotright /onequarter /onehalf
/threequarters /questiondown /Agrave /Aacute /Acircumflex
/Atilde /Adieresis /Aring /AE /Ccedilla
/Egrave /Eacute /Ecircumflex /Edieresis /Igrave
/Iacute /Icircumflex /Idieresis /Eth /Ntilde
/Ograve /Oacute /Ocircumflex /Otilde /Odieresis
/multiply /Oslash /Ugrave /Uacute /Ucircumflex
/Udieresis /Yacute /Thorn /germandbls /agrave
/aacute /acircumflex /atilde /adieresis /aring
/ae /ccedilla /egrave /eacute /ecircumflex
/edieresis /igrave /iacute /icircumflex /idieresis
/eth /ntilde /ograve /oacute /ocircumflex
/otilde /odieresis /divide /oslash /ugrave
/uacute /ucircumflex /udieresis /yacute /thorn
/ydieresis
] def
%%EndResource
%FOPBeginFontReencode
/Courier-Oblique findfont
dup length dict begin
  {1 index /FID ne {def} {pop pop} ifelse} forall
  /Encoding WinAnsiEncoding def
  currentdict
end
/Courier-Oblique exch definefont pop
/Courier-BoldOblique findfont
dup length dict begin
  {1 index /FID ne {def} {pop pop} ifelse} forall
  /Encoding WinAnsiEncoding def
  currentdict
end
/Courier-BoldOblique exch definefont pop
/Courier-Bold findfont
dup length dict begin
  {1 index /FID ne {def} {pop pop} ifelse} forall
  /Encoding WinAnsiEncoding def
  currentdict
end
/Courier-Bold exch definefont pop
/Helvetica findfont
dup length dict begin
  {1 index /FID ne {def} {pop pop} ifelse} forall
  /Encoding WinAnsiEncoding def
  currentdict
end
/Helvetica exch definefont pop
/Helvetica-Oblique findfont
dup length dict begin
  {1 index /FID ne {def} {pop pop} ifelse} forall
  /Encoding WinAnsiEncoding def
  currentdict
end
/Helvetica-Oblique exch definefont pop
/Helvetica-Bold findfont
dup length dict begin
  {1 index /FID ne {def} {pop pop} ifelse} forall
  /Encoding WinAnsiEncoding def
  currentdict
end
/Helvetica-Bold exch definefont pop
/Helvetica-BoldOblique findfont
dup length dict begin
  {1 index /FID ne {def} {pop pop} ifelse} forall
  /Encoding WinAnsiEncoding def
  currentdict
end
/Helvetica-BoldOblique exch definefont pop
/Times-Roman findfont
dup length dict begin
  {1 index /FID ne {def} {pop pop} ifelse} forall
  /Encoding WinAnsiEncoding def
  currentdict
end
/Times-Roman exch definefont pop
/Times-Italic findfont
dup length dict begin
  {1 index /FID ne {def} {pop pop} ifelse} forall
  /Encoding WinAnsiEncoding def
  currentdict
end
/Times-Italic exch definefont pop
/Times-Bold findfont
dup length dict begin
  {1 index /FID ne {def} {pop pop} ifelse} forall
  /Encoding WinAnsiEncoding def
  currentdict
end
/Times-Bold exch definefont pop
/Times-BoldItalic findfont
dup length dict begin
  {1 index /FID ne {def} {pop pop} ifelse} forall
  /Encoding WinAnsiEncoding def
  currentdict
end
/Times-BoldItalic exch definefont pop
/Courier findfont
dup length dict begin
  {1 index /FID ne {def} {pop pop} ifelse} forall
  /Encoding WinAnsiEncoding def
  currentdict
end
/Courier exch definefont pop
%FOPEndFontReencode
%%EndProlog
%%Page: 1 1
%%PageBoundingBox: 0 0 1024 288
%%BeginPageSetup
[1 0 0 -1 0 288] CT
%%EndPageSetup
GS
1 GC
N
0 0 1024 288 re
f
GR
GS
1 GC
N
0 0 1024 288 re
f
GR
GS
1 GC
N
133 256.5 M
476 256.5 L
476 29 L
133 29 L
cp
f
GR
GS
0.149 GC
2 setlinecap
1 LJ
0.5 LW
N
133 256.5 M
476 256.5 L
S
GR
GS
0.149 GC
2 setlinecap
1 LJ
0.5 LW
N
175.875 256.5 M
175.875 253.07 L
S
GR
GS
0.149 GC
2 setlinecap
1 LJ
0.5 LW
N
261.625 256.5 M
261.625 253.07 L
S
GR
GS
0.149 GC
2 setlinecap
1 LJ
0.5 LW
N
347.375 256.5 M
347.375 253.07 L
S
GR
GS
0.149 GC
2 setlinecap
1 LJ
0.5 LW
N
433.125 256.5 M
433.125 253.07 L
S
GR
GS
[1 0 0 1 175.875 262.5] CT
0.149 GC
/Helvetica 20 F
GS
[1 0 0 1 0 0] CT
-24.5 20 moveto 
1 -1 scale
(Color) t 
GR
GR
GS
[1 0 0 1 261.625 262.5] CT
0.149 GC
/Helvetica 20 F
GS
[1 0 0 1 0 0] CT
-40 20 moveto 
1 -1 scale
(Direction) t 
GR
GR
GS
[1 0 0 1 347.375 262.5] CT
0.149 GC
/Helvetica 20 F
GS
[1 0 0 1 0 0] CT
-19 20 moveto 
1 -1 scale
(Size) t 
GR
GR
GS
[1 0 0 1 433.125 262.5] CT
0.149 GC
/Helvetica 20 F
GS
[1 0 0 1 0 0] CT
-49.5 20 moveto 
1 -1 scale
(Luminance) t 
GR
GR
GS
0.149 GC
2 setlinecap
1 LJ
0.5 LW
N
133 256.5 M
133 29 L
S
GR
GS
0.149 GC
2 setlinecap
1 LJ
0.5 LW
N
133 256.5 M
136.43 256.5 L
S
GR
GS
0.149 GC
2 setlinecap
1 LJ
0.5 LW
N
133 211 M
136.43 211 L
S
GR
GS
0.149 GC
2 setlinecap
1 LJ
0.5 LW
N
133 165.5 M
136.43 165.5 L
S
GR
GS
0.149 GC
2 setlinecap
1 LJ
0.5 LW
N
133 120 M
136.43 120 L
S
GR
GS
0.149 GC
2 setlinecap
1 LJ
0.5 LW
N
133 74.5 M
136.43 74.5 L
S
GR
GS
0.149 GC
2 setlinecap
1 LJ
0.5 LW
N
133 29 M
136.43 29 L
S
GR
GS
[1 0 0 1 127 256.5] CT
0.149 GC
/Helvetica 20 F
GS
[1 0 0 1 0 0] CT
-12 7.5 moveto 
1 -1 scale
(0) t 
GR
GR
GS
[1 0 0 1 127 211] CT
0.149 GC
/Helvetica 20 F
GS
[1 0 0 1 0 0] CT
-28 7.5 moveto 
1 -1 scale
(0.1) t 
GR
GR
GS
[1 0 0 1 127 165.5] CT
0.149 GC
/Helvetica 20 F
GS
[1 0 0 1 0 0] CT
-28 7.5 moveto 
1 -1 scale
(0.2) t 
GR
GR
GS
[1 0 0 1 127 119.99999] CT
0.149 GC
/Helvetica 20 F
GS
[1 0 0 1 0 0] CT
-28 7.5 moveto 
1 -1 scale
(0.3) t 
GR
GR
GS
[1 0 0 1 127 74.5] CT
0.149 GC
/Helvetica 20 F
GS
[1 0 0 1 0 0] CT
-28 7.5 moveto 
1 -1 scale
(0.4) t 
GR
GR
GS
[1 0 0 1 127 29] CT
0.149 GC
/Helvetica 20 F
GS
[1 0 0 1 0 0] CT
-28 7.5 moveto 
1 -1 scale
(0.5) t 
GR
GR
GS
[0 -1 1 0 96 142.74989] CT
0.149 GC
/Helvetica 20 F
GS
[1 0 0 1 0 0] CT
-47 -5 moveto 
1 -1 scale
(linear beta) t 
GR
GR
GS
[1 0 0 1 304.50027 26.49999] CT
/Helvetica-Bold 20 F
GS
[1 0 0 1 0 0] CT
-51.5 -5 moveto 
1 -1 scale
(median RT) t 
GR
GR
GS
0.149 GC
1 LJ
0.5 LW
N
133 256.5 M
476 256.5 L
S
GR
GS
1 0.8 0.8 RC
N
175.875 256.5 M
175.875 151.991 L
141.575 151.991 L
141.575 256.5 L
cp
f
GR
GS
0.8 GC
N
210.175 256.5 M
210.175 177.683 L
175.875 177.683 L
175.875 256.5 L
cp
f
GR
GS
1 0.8 0.8 RC
N
261.625 256.5 M
261.625 168.52 L
227.325 168.52 L
227.325 256.5 L
cp
f
GR
GS
0.8 GC
N
295.925 256.5 M
295.925 183.5 L
261.625 183.5 L
261.625 256.5 L
cp
f
GR
GS
1 0.8 0.8 RC
N
347.375 256.5 M
347.375 144.657 L
313.075 144.657 L
313.075 256.5 L
cp
f
GR
GS
0.8 GC
N
381.675 256.5 M
381.675 167.974 L
347.375 167.974 L
347.375 256.5 L
cp
f
GR
GS
1 0.8 0.8 RC
N
433.125 256.5 M
433.125 136.25 L
398.825 136.25 L
398.825 256.5 L
cp
f
GR
GS
0.8 GC
N
467.425 256.5 M
467.425 171.427 L
433.125 171.427 L
433.125 256.5 L
cp
f
GR
GS
[1 0 0 1 174.30318 155.14404] CT
1 0.302 0.302 RC
N
1.581 0 M
1.581 -0.873 0.873 -1.581 0 -1.581 C
-0.873 -1.581 -1.581 -0.873 -1.581 0 C
-1.581 0.873 -0.873 1.581 0 1.581 C
0.873 1.581 1.581 0.873 1.581 0 C
f
GR
GS
[1 0 0 1 142.66995 141.83403] CT
1 0.302 0.302 RC
N
/f-27201882{1.581 0 M
1.581 -0.873 0.873 -1.581 0 -1.581 C
-0.873 -1.581 -1.581 -0.873 -1.581 0 C
-1.581 0.873 -0.873 1.581 0 1.581 C
0.873 1.581 1.581 0.873 1.581 0 C}def
f-27201882
f
GR
GS
[1 0 0 1 153.81561 131.56346] CT
1 0.302 0.302 RC
N
f-27201882
f
GR
GS
[1 0 0 1 164.30403 167.60468] CT
1 0.302 0.302 RC
N
f-27201882
f
GR
GS
[1 0 0 1 149.47714 172.44279] CT
1 0.302 0.302 RC
N
f-27201882
f
GR
GS
[1 0 0 1 165.96671 125.64209] CT
1 0.302 0.302 RC
N
f-27201882
f
GR
GS
[1 0 0 1 162.99785 156.07315] CT
1 0.302 0.302 RC
N
f-27201882
f
GR
GS
[1 0 0 1 161.83287 144.61523] CT
1 0.302 0.302 RC
N
f-27201882
f
GR
GS
[1 0 0 1 164.22803 239.79236] CT
1 0.302 0.302 RC
N
f-27201882
f
GR
GS
[1 0 0 1 143.20613 199.46657] CT
1 0.302 0.302 RC
N
f-27201882
f
GR
GS
[1 0 0 1 153.53831 140.36938] CT
1 0.302 0.302 RC
N
f-27201882
f
GR
GS
[1 0 0 1 157.05598 155.08659] CT
1 0.302 0.302 RC
N
f-27201882
f
GR
GS
[1 0 0 1 149.83804 176.4342] CT
1 0.302 0.302 RC
N
f-27201882
f
GR
GS
[1 0 0 1 166.10104 127.75567] CT
1 0.302 0.302 RC
N
f-27201882
f
GR
GS
[1 0 0 1 170.94205 126.91051] CT
1 0.302 0.302 RC
N
f-27201882
f
GR
GS
[1 0 0 1 151.23071 117.17738] CT
1 0.302 0.302 RC
N
f-27201882
f
GR
GS
[1 0 0 1 166.65004 200.66109] CT
1 0.302 0.302 RC
N
f-27201882
f
GR
GS
[1 0 0 1 146.30026 148.82832] CT
1 0.302 0.302 RC
N
f-27201882
f
GR
GS
[1 0 0 1 170.2746 205.43181] CT
1 0.302 0.302 RC
N
f-27201882
f
GR
GS
[1 0 0 1 146.32904 222.32227] CT
1 0.302 0.302 RC
N
f-27201882
f
GR
GS
[1 0 0 1 161.75058 151.95383] CT
1 0.302 0.302 RC
N
f-27201882
f
GR
GS
[1 0 0 1 154.13417 118.04102] CT
1 0.302 0.302 RC
N
f-27201882
f
GR
GS
[1 0 0 1 158.85468 119.37016] CT
1 0.302 0.302 RC
N
f-27201882
f
GR
GS
[1 0 0 1 158.36809 109.9678] CT
1 0.302 0.302 RC
N
f-27201882
f
GR
GS
[1 0 0 1 171.65778 134.72586] CT
1 0.302 0.302 RC
N
f-27201882
f
GR
GS
[1 0 0 1 153.68776 148.66884] CT
1 0.302 0.302 RC
N
f-27201882
f
GR
GS
[1 0 0 1 156.99091 111.97063] CT
1 0.302 0.302 RC
N
f-27201882
f
GR
GS
[1 0 0 1 174.62408 175.13451] CT
1 0.302 0.302 RC
N
f-27201882
f
GR
GS
[1 0 0 1 143.02582 212.05807] CT
1 0.302 0.302 RC
N
f-27201882
f
GR
GS
[1 0 0 1 174.94746 126.87501] CT
1 0.302 0.302 RC
N
f-27201882
f
GR
GS
[1 0 0 1 148.06479 144.82634] CT
1 0.302 0.302 RC
N
f-27201882
f
GR
GS
[1 0 0 1 164.45723 160.74944] CT
1 0.302 0.302 RC
N
f-27201882
f
GR
GS
[1 0 0 1 161.68988 117.92661] CT
1 0.302 0.302 RC
N
f-27201882
f
GR
GS
[1 0 0 1 164.73135 151.12057] CT
1 0.302 0.302 RC
N
f-27201882
f
GR
GS
[1 0 0 1 153.95805 147.05775] CT
1 0.302 0.302 RC
N
f-27201882
f
GR
GS
[1 0 0 1 162.85056 167.87843] CT
1 0.302 0.302 RC
N
f-27201882
f
GR
GS
[1 0 0 1 169.39748 104.06771] CT
1 0.302 0.302 RC
N
f-27201882
f
GR
GS
[1 0 0 1 142.23553 133.52385] CT
1 0.302 0.302 RC
N
f-27201882
f
GR
GS
[1 0 0 1 144.45186 136.11778] CT
1 0.302 0.302 RC
N
f-27201882
f
GR
GS
[1 0 0 1 175.0107 137.01315] CT
1 0.302 0.302 RC
N
f-27201882
f
GR
GS
[1 0 0 1 163.91629 134.80449] CT
1 0.302 0.302 RC
N
f-27201882
f
GR
GS
[1 0 0 1 149.50645 162.69385] CT
1 0.302 0.302 RC
N
f-27201882
f
GR
GS
[1 0 0 1 155.41475 173.14726] CT
1 0.302 0.302 RC
N
f-27201882
f
GR
GS
[1 0 0 1 145.7603 120.81128] CT
1 0.302 0.302 RC
N
f-27201882
f
GR
GS
[1 0 0 1 150.78246 135.11803] CT
1 0.302 0.302 RC
N
f-27201882
f
GR
GS
[1 0 0 1 150.41913 162.67278] CT
1 0.302 0.302 RC
N
f-27201882
f
GR
GS
[1 0 0 1 152.95111 190.11829] CT
1 0.302 0.302 RC
N
f-27201882
f
GR
GS
[1 0 0 1 232.54662 145.45827] CT
1 0.302 0.302 RC
N
f-27201882
f
GR
GS
[1 0 0 1 239.26167 158.79146] CT
1 0.302 0.302 RC
N
f-27201882
f
GR
GS
[1 0 0 1 231.49789 141.19612] CT
1 0.302 0.302 RC
N
f-27201882
f
GR
GS
[1 0 0 1 257.65146 236.59015] CT
1 0.302 0.302 RC
N
f-27201882
f
GR
GS
[1 0 0 1 259.2254 189.6859] CT
1 0.302 0.302 RC
N
f-27201882
f
GR
GS
[1 0 0 1 241.01138 174.24745] CT
1 0.302 0.302 RC
N
f-27201882
f
GR
GS
[1 0 0 1 228.95087 179.06793] CT
1 0.302 0.302 RC
N
f-27201882
f
GR
GS
[1 0 0 1 239.06842 173.30621] CT
1 0.302 0.302 RC
N
f-27201882
f
GR
GS
[1 0 0 1 252.56863 216.67143] CT
1 0.302 0.302 RC
N
f-27201882
f
GR
GS
[1 0 0 1 254.5826 134.06346] CT
1 0.302 0.302 RC
N
f-27201882
f
GR
GS
[1 0 0 1 246.01527 156.22014] CT
1 0.302 0.302 RC
N
f-27201882
f
GR
GS
[1 0 0 1 250.86247 172.60176] CT
1 0.302 0.302 RC
N
f-27201882
f
GR
GS
[1 0 0 1 257.97659 178.40425] CT
1 0.302 0.302 RC
N
f-27201882
f
GR
GS
[1 0 0 1 229.20436 207.70026] CT
1 0.302 0.302 RC
N
f-27201882
f
GR
GS
[1 0 0 1 237.74059 182.43275] CT
1 0.302 0.302 RC
N
f-27201882
f
GR
GS
[1 0 0 1 228.90938 147.54498] CT
1 0.302 0.302 RC
N
f-27201882
f
GR
GS
[1 0 0 1 234.02985 217.72993] CT
1 0.302 0.302 RC
N
f-27201882
f
GR
GS
[1 0 0 1 252.02669 163.78053] CT
1 0.302 0.302 RC
N
f-27201882
f
GR
GS
[1 0 0 1 252.08113 214.80457] CT
1 0.302 0.302 RC
N
f-27201882
f
GR
GS
[1 0 0 1 257.4335 225.59338] CT
1 0.302 0.302 RC
N
f-27201882
f
GR
GS
[1 0 0 1 247.30246 175.60704] CT
1 0.302 0.302 RC
N
f-27201882
f
GR
GS
[1 0 0 1 229.74947 169.03032] CT
1 0.302 0.302 RC
N
f-27201882
f
GR
GS
[1 0 0 1 254.77777 159.50705] CT
1 0.302 0.302 RC
N
f-27201882
f
GR
GS
[1 0 0 1 237.13298 137.37083] CT
1 0.302 0.302 RC
N
f-27201882
f
GR
GS
[1 0 0 1 245.97266 156.22176] CT
1 0.302 0.302 RC
N
f-27201882
f
GR
GS
[1 0 0 1 261.10284 139.27184] CT
1 0.302 0.302 RC
N
f-27201882
f
GR
GS
[1 0 0 1 251.87276 118.23407] CT
1 0.302 0.302 RC
N
f-27201882
f
GR
GS
[1 0 0 1 256.10165 167.97655] CT
1 0.302 0.302 RC
N
f-27201882
f
GR
GS
[1 0 0 1 242.18584 210.72894] CT
1 0.302 0.302 RC
N
f-27201882
f
GR
GS
[1 0 0 1 243.46742 163.77892] CT
1 0.302 0.302 RC
N
f-27201882
f
GR
GS
[1 0 0 1 246.55746 182.29694] CT
1 0.302 0.302 RC
N
f-27201882
f
GR
GS
[1 0 0 1 236.55484 174.09206] CT
1 0.302 0.302 RC
N
f-27201882
f
GR
GS
[1 0 0 1 253.01634 157.92619] CT
1 0.302 0.302 RC
N
f-27201882
f
GR
GS
[1 0 0 1 244.60835 153.92825] CT
1 0.302 0.302 RC
N
f-27201882
f
GR
GS
[1 0 0 1 249.51057 146.8246] CT
1 0.302 0.302 RC
N
f-27201882
f
GR
GS
[1 0 0 1 237.88068 151.09134] CT
1 0.302 0.302 RC
N
f-27201882
f
GR
GS
[1 0 0 1 232.08325 112.66158] CT
1 0.302 0.302 RC
N
f-27201882
f
GR
GS
[1 0 0 1 243.63716 97.22947] CT
1 0.302 0.302 RC
N
f-27201882
f
GR
GS
[1 0 0 1 239.75735 156.57045] CT
1 0.302 0.302 RC
N
f-27201882
f
GR
GS
[1 0 0 1 254.3573 157.30365] CT
1 0.302 0.302 RC
N
f-27201882
f
GR
GS
[1 0 0 1 254.08914 160.47034] CT
1 0.302 0.302 RC
N
f-27201882
f
GR
GS
[1 0 0 1 250.25497 185.27075] CT
1 0.302 0.302 RC
N
f-27201882
f
GR
GS
[1 0 0 1 231.90417 172.70476] CT
1 0.302 0.302 RC
N
f-27201882
f
GR
GS
[1 0 0 1 228.06436 159.43687] CT
1 0.302 0.302 RC
N
f-27201882
f
GR
GS
[1 0 0 1 246.52753 156.27965] CT
1 0.302 0.302 RC
N
f-27201882
f
GR
GS
[1 0 0 1 237.6431 189.67984] CT
1 0.302 0.302 RC
N
f-27201882
f
GR
GS
[1 0 0 1 259.54675 193.05357] CT
1 0.302 0.302 RC
N
f-27201882
f
GR
GS
[1 0 0 1 346.72 103.26241] CT
1 0.302 0.302 RC
N
f-27201882
f
GR
GS
[1 0 0 1 322.9061 108.97597] CT
1 0.302 0.302 RC
N
f-27201882
f
GR
GS
[1 0 0 1 340.54315 118.29316] CT
1 0.302 0.302 RC
N
f-27201882
f
GR
GS
[1 0 0 1 343.81161 148.85783] CT
1 0.302 0.302 RC
N
f-27201882
f
GR
GS
[1 0 0 1 343.39676 150.26282] CT
1 0.302 0.302 RC
N
f-27201882
f
GR
GS
[1 0 0 1 345.44498 170.31226] CT
1 0.302 0.302 RC
N
f-27201882
f
GR
GS
[1 0 0 1 331.91113 150.76929] CT
1 0.302 0.302 RC
N
f-27201882
f
GR
GS
[1 0 0 1 338.05869 136.17847] CT
1 0.302 0.302 RC
N
f-27201882
f
GR
GS
[1 0 0 1 332.85782 187.80948] CT
1 0.302 0.302 RC
N
f-27201882
f
GR
GS
[1 0 0 1 313.96191 136.50726] CT
1 0.302 0.302 RC
N
f-27201882
f
GR
GS
[1 0 0 1 328.39102 119.39709] CT
1 0.302 0.302 RC
N
f-27201882
f
GR
GS
[1 0 0 1 335.24316 131.42444] CT
1 0.302 0.302 RC
N
f-27201882
f
GR
GS
[1 0 0 1 330.95227 195.49748] CT
1 0.302 0.302 RC
N
f-27201882
f
GR
GS
[1 0 0 1 325.84531 164.7213] CT
1 0.302 0.302 RC
N
f-27201882
f
GR
GS
[1 0 0 1 345.21872 177.02779] CT
1 0.302 0.302 RC
N
f-27201882
f
GR
GS
[1 0 0 1 341.52798 122.55921] CT
1 0.302 0.302 RC
N
f-27201882
f
GR
GS
[1 0 0 1 342.19861 194.82153] CT
1 0.302 0.302 RC
N
f-27201882
f
GR
GS
[1 0 0 1 325.85294 150.51378] CT
1 0.302 0.302 RC
N
f-27201882
f
GR
GS
[1 0 0 1 333.42123 180.12691] CT
1 0.302 0.302 RC
N
f-27201882
f
GR
GS
[1 0 0 1 343.00357 180.11293] CT
1 0.302 0.302 RC
N
f-27201882
f
GR
GS
[1 0 0 1 345.09409 167.24474] CT
1 0.302 0.302 RC
N
f-27201882
f
GR
GS
[1 0 0 1 336.00333 167.08733] CT
1 0.302 0.302 RC
N
f-27201882
f
GR
GS
[1 0 0 1 335.50208 119.8063] CT
1 0.302 0.302 RC
N
f-27201882
f
GR
GS
[1 0 0 1 315.54636 62.60441] CT
1 0.302 0.302 RC
N
f-27201882
f
GR
GS
[1 0 0 1 327.02573 114.81757] CT
1 0.302 0.302 RC
N
f-27201882
f
GR
GS
[1 0 0 1 335.95074 127.93999] CT
1 0.302 0.302 RC
N
f-27201882
f
GR
GS
[1 0 0 1 345.10178 54.79337] CT
1 0.302 0.302 RC
N
f-27201882
f
GR
GS
[1 0 0 1 340.89059 176.42259] CT
1 0.302 0.302 RC
N
f-27201882
f
GR
GS
[1 0 0 1 329.69501 206.0927] CT
1 0.302 0.302 RC
N
f-27201882
f
GR
GS
[1 0 0 1 339.03149 154.30945] CT
1 0.302 0.302 RC
N
f-27201882
f
GR
GS
[1 0 0 1 327.37973 154.02696] CT
1 0.302 0.302 RC
N
f-27201882
f
GR
GS
[1 0 0 1 346.40726 155.60773] CT
1 0.302 0.302 RC
N
f-27201882
f
GR
GS
[1 0 0 1 346.96252 153.08542] CT
1 0.302 0.302 RC
N
f-27201882
f
GR
GS
[1 0 0 1 342.71524 111.81998] CT
1 0.302 0.302 RC
N
f-27201882
f
GR
GS
[1 0 0 1 326.4137 154.53354] CT
1 0.302 0.302 RC
N
f-27201882
f
GR
GS
[1 0 0 1 328.67264 129.86664] CT
1 0.302 0.302 RC
N
f-27201882
f
GR
GS
[1 0 0 1 321.53638 110.33525] CT
1 0.302 0.302 RC
N
f-27201882
f
GR
GS
[1 0 0 1 339.98071 83.19726] CT
1 0.302 0.302 RC
N
f-27201882
f
GR
GS
[1 0 0 1 343.35632 132.91394] CT
1 0.302 0.302 RC
N
f-27201882
f
GR
GS
[1 0 0 1 344.41531 153.7561] CT
1 0.302 0.302 RC
N
f-27201882
f
GR
GS
[1 0 0 1 332.22418 119.31581] CT
1 0.302 0.302 RC
N
f-27201882
f
GR
GS
[1 0 0 1 333.61618 190.47665] CT
1 0.302 0.302 RC
N
f-27201882
f
GR
GS
[1 0 0 1 318.18146 173.87917] CT
1 0.302 0.302 RC
N
f-27201882
f
GR
GS
[1 0 0 1 343.93518 97.79207] CT
1 0.302 0.302 RC
N
f-27201882
f
GR
GS
[1 0 0 1 328.5235 162.0699] CT
1 0.302 0.302 RC
N
f-27201882
f
GR
GS
[1 0 0 1 320.12955 185.32497] CT
1 0.302 0.302 RC
N
f-27201882
f
GR
GS
[1 0 0 1 343.93301 152.34738] CT
1 0.302 0.302 RC
N
f-27201882
f
GR
GS
[1 0 0 1 424.98169 99.59553] CT
1 0.302 0.302 RC
N
f-27201882
f
GR
GS
[1 0 0 1 429.0943 93.64555] CT
1 0.302 0.302 RC
N
f-27201882
f
GR
GS
[1 0 0 1 408.59882 90.25092] CT
1 0.302 0.302 RC
N
f-27201882
f
GR
GS
[1 0 0 1 421.91666 113.0946] CT
1 0.302 0.302 RC
N
f-27201882
f
GR
GS
[1 0 0 1 403.03757 181.06651] CT
1 0.302 0.302 RC
N
f-27201882
f
GR
GS
[1 0 0 1 412.79602 176.55933] CT
1 0.302 0.302 RC
N
f-27201882
f
GR
GS
[1 0 0 1 408.26733 137.26108] CT
1 0.302 0.302 RC
N
f-27201882
f
GR
GS
[1 0 0 1 423.40677 150.38641] CT
1 0.302 0.302 RC
N
f-27201882
f
GR
GS
[1 0 0 1 408.54507 135.80304] CT
1 0.302 0.302 RC
N
f-27201882
f
GR
GS
[1 0 0 1 429.56464 130.47847] CT
1 0.302 0.302 RC
N
f-27201882
f
GR
GS
[1 0 0 1 427.17667 109.15838] CT
1 0.302 0.302 RC
N
f-27201882
f
GR
GS
[1 0 0 1 412.20291 144.19344] CT
1 0.302 0.302 RC
N
f-27201882
f
GR
GS
[1 0 0 1 415.90308 155.9781] CT
1 0.302 0.302 RC
N
f-27201882
f
GR
GS
[1 0 0 1 422.65683 169.64812] CT
1 0.302 0.302 RC
N
f-27201882
f
GR
GS
[1 0 0 1 427.44385 123.08092] CT
1 0.302 0.302 RC
N
f-27201882
f
GR
GS
[1 0 0 1 419.73529 91.91352] CT
1 0.302 0.302 RC
N
f-27201882
f
GR
GS
[1 0 0 1 418.53848 226.45949] CT
1 0.302 0.302 RC
N
f-27201882
f
GR
GS
[1 0 0 1 410.00824 149.75293] CT
1 0.302 0.302 RC
N
f-27201882
f
GR
GS
[1 0 0 1 414.48038 104.41933] CT
1 0.302 0.302 RC
N
f-27201882
f
GR
GS
[1 0 0 1 423.3082 186.14378] CT
1 0.302 0.302 RC
N
f-27201882
f
GR
GS
[1 0 0 1 429.1601 105.98105] CT
1 0.302 0.302 RC
N
f-27201882
f
GR
GS
[1 0 0 1 423.55035 96.32307] CT
1 0.302 0.302 RC
N
f-27201882
f
GR
GS
[1 0 0 1 421.96982 113.55551] CT
1 0.302 0.302 RC
N
f-27201882
f
GR
GS
[1 0 0 1 413.86584 93.83301] CT
1 0.302 0.302 RC
N
f-27201882
f
GR
GS
[1 0 0 1 413.84222 117.56417] CT
1 0.302 0.302 RC
N
f-27201882
f
GR
GS
[1 0 0 1 402.83939 159.62125] CT
1 0.302 0.302 RC
N
f-27201882
f
GR
GS
[1 0 0 1 426.76859 91.02383] CT
1 0.302 0.302 RC
N
f-27201882
f
GR
GS
[1 0 0 1 409.96753 181.20459] CT
1 0.302 0.302 RC
N
f-27201882
f
GR
GS
[1 0 0 1 407.27063 195.69577] CT
1 0.302 0.302 RC
N
f-27201882
f
GR
GS
[1 0 0 1 410.58008 164.07494] CT
1 0.302 0.302 RC
N
f-27201882
f
GR
GS
[1 0 0 1 411.71124 162.59636] CT
1 0.302 0.302 RC
N
f-27201882
f
GR
GS
[1 0 0 1 417.57181 155.62924] CT
1 0.302 0.302 RC
N
f-27201882
f
GR
GS
[1 0 0 1 418.09888 111.04676] CT
1 0.302 0.302 RC
N
f-27201882
f
GR
GS
[1 0 0 1 412.4017 98.78136] CT
1 0.302 0.302 RC
N
f-27201882
f
GR
GS
[1 0 0 1 412.4809 169.77101] CT
1 0.302 0.302 RC
N
f-27201882
f
GR
GS
[1 0 0 1 416.50211 100.37341] CT
1 0.302 0.302 RC
N
f-27201882
f
GR
GS
[1 0 0 1 421.3783 129.96254] CT
1 0.302 0.302 RC
N
f-27201882
f
GR
GS
[1 0 0 1 431.44138 104.48211] CT
1 0.302 0.302 RC
N
f-27201882
f
GR
GS
[1 0 0 1 423.60156 122.18713] CT
1 0.302 0.302 RC
N
f-27201882
f
GR
GS
[1 0 0 1 412.54773 126.06332] CT
1 0.302 0.302 RC
N
f-27201882
f
GR
GS
[1 0 0 1 427.35818 181.10265] CT
1 0.302 0.302 RC
N
f-27201882
f
GR
GS
[1 0 0 1 403.4328 104.34861] CT
1 0.302 0.302 RC
N
f-27201882
f
GR
GS
[1 0 0 1 400.89902 155.32668] CT
1 0.302 0.302 RC
N
f-27201882
f
GR
GS
[1 0 0 1 401.71466 123.64408] CT
1 0.302 0.302 RC
N
f-27201882
f
GR
GS
[1 0 0 1 404.44672 126.60746] CT
1 0.302 0.302 RC
N
f-27201882
f
GR
GS
[1 0 0 1 409.94574 165.18088] CT
1 0.302 0.302 RC
N
f-27201882
f
GR
GS
[1 0 0 1 409.17422 178.88803] CT
1 0.302 0.302 RC
N
f-27201882
f
GR
GS
[1 0 0 1 176.27567 153.25821] CT
0.302 GC
N
f-27201882
f
GR
GS
[1 0 0 1 194.39375 168.7719] CT
0.302 GC
N
f-27201882
f
GR
GS
[1 0 0 1 179.14629 166.38556] CT
0.302 GC
N
f-27201882
f
GR
GS
[1 0 0 1 180.90045 168.17424] CT
0.302 GC
N
f-27201882
f
GR
GS
[1 0 0 1 197.52313 169.96469] CT
0.302 GC
N
f-27201882
f
GR
GS
[1 0 0 1 205.34969 205.36414] CT
0.302 GC
N
f-27201882
f
GR
GS
[1 0 0 1 209.2908 166.67952] CT
0.302 GC
N
f-27201882
f
GR
GS
[1 0 0 1 195.45476 191.70085] CT
0.302 GC
N
f-27201882
f
GR
GS
[1 0 0 1 210.06696 181.02234] CT
0.302 GC
N
f-27201882
f
GR
GS
[1 0 0 1 194.86147 211.14211] CT
0.302 GC
N
f-27201882
f
GR
GS
[1 0 0 1 190.62407 146.07066] CT
0.302 GC
N
f-27201882
f
GR
GS
[1 0 0 1 178.31157 222.03882] CT
0.302 GC
N
f-27201882
f
GR
GS
[1 0 0 1 178.09193 150.39243] CT
0.302 GC
N
f-27201882
f
GR
GS
[1 0 0 1 190.83615 193.81256] CT
0.302 GC
N
f-27201882
f
GR
GS
[1 0 0 1 204.22839 199.63707] CT
0.302 GC
N
f-27201882
f
GR
GS
[1 0 0 1 189.40755 213.17981] CT
0.302 GC
N
f-27201882
f
GR
GS
[1 0 0 1 196.91719 235.09602] CT
0.302 GC
N
f-27201882
f
GR
GS
[1 0 0 1 203.95438 170.86365] CT
0.302 GC
N
f-27201882
f
GR
GS
[1 0 0 1 206.27286 185.20695] CT
0.302 GC
N
f-27201882
f
GR
GS
[1 0 0 1 207.81213 167.88632] CT
0.302 GC
N
f-27201882
f
GR
GS
[1 0 0 1 182.41891 207.42735] CT
0.302 GC
N
f-27201882
f
GR
GS
[1 0 0 1 184.74437 161.94019] CT
0.302 GC
N
f-27201882
f
GR
GS
[1 0 0 1 206.67178 157.6165] CT
0.302 GC
N
f-27201882
f
GR
GS
[1 0 0 1 193.15672 158.2507] CT
0.302 GC
N
f-27201882
f
GR
GS
[1 0 0 1 196.89438 149.15372] CT
0.302 GC
N
f-27201882
f
GR
GS
[1 0 0 1 203.98119 212.47888] CT
0.302 GC
N
f-27201882
f
GR
GS
[1 0 0 1 194.1188 177.23293] CT
0.302 GC
N
f-27201882
f
GR
GS
[1 0 0 1 182.80618 188.43523] CT
0.302 GC
N
f-27201882
f
GR
GS
[1 0 0 1 191.44354 205.80202] CT
0.302 GC
N
f-27201882
f
GR
GS
[1 0 0 1 190.55235 153.04732] CT
0.302 GC
N
f-27201882
f
GR
GS
[1 0 0 1 209.0106 139.60771] CT
0.302 GC
N
f-27201882
f
GR
GS
[1 0 0 1 197.1429 179.12636] CT
0.302 GC
N
f-27201882
f
GR
GS
[1 0 0 1 199.72687 179.69128] CT
0.302 GC
N
f-27201882
f
GR
GS
[1 0 0 1 200.57664 166.19975] CT
0.302 GC
N
f-27201882
f
GR
GS
[1 0 0 1 187.7735 97.77227] CT
0.302 GC
N
f-27201882
f
GR
GS
[1 0 0 1 193.60777 142.07651] CT
0.302 GC
N
f-27201882
f
GR
GS
[1 0 0 1 194.96962 190.7757] CT
0.302 GC
N
f-27201882
f
GR
GS
[1 0 0 1 181.24278 163.25613] CT
0.302 GC
N
f-27201882
f
GR
GS
[1 0 0 1 195.15352 212.38896] CT
0.302 GC
N
f-27201882
f
GR
GS
[1 0 0 1 199.70676 173.18872] CT
0.302 GC
N
f-27201882
f
GR
GS
[1 0 0 1 190.50243 154.07118] CT
0.302 GC
N
f-27201882
f
GR
GS
[1 0 0 1 204.55908 193.67046] CT
0.302 GC
N
f-27201882
f
GR
GS
[1 0 0 1 200.96158 188.56197] CT
0.302 GC
N
f-27201882
f
GR
GS
[1 0 0 1 188.22406 199.63023] CT
0.302 GC
N
f-27201882
f
GR
GS
[1 0 0 1 277.2045 186.84224] CT
0.302 GC
N
f-27201882
f
GR
GS
[1 0 0 1 274.87817 200.88907] CT
0.302 GC
N
f-27201882
f
GR
GS
[1 0 0 1 288.22653 151.91144] CT
0.302 GC
N
f-27201882
f
GR
GS
[1 0 0 1 286.81049 158.03766] CT
0.302 GC
N
f-27201882
f
GR
GS
[1 0 0 1 276.38351 201.90025] CT
0.302 GC
N
f-27201882
f
GR
GS
[1 0 0 1 285.42072 177.25883] CT
0.302 GC
N
f-27201882
f
GR
GS
[1 0 0 1 294.04581 170.80455] CT
0.302 GC
N
f-27201882
f
GR
GS
[1 0 0 1 288.52417 185.82147] CT
0.302 GC
N
f-27201882
f
GR
GS
[1 0 0 1 285.82611 177.55272] CT
0.302 GC
N
f-27201882
f
GR
GS
[1 0 0 1 265.37515 219.95227] CT
0.302 GC
N
f-27201882
f
GR
GS
[1 0 0 1 277.38174 164.66801] CT
0.302 GC
N
f-27201882
f
GR
GS
[1 0 0 1 269.46899 194.36777] CT
0.302 GC
N
f-27201882
f
GR
GS
[1 0 0 1 262.16159 193.64479] CT
0.302 GC
N
f-27201882
f
GR
GS
[1 0 0 1 291.25027 193.46812] CT
0.302 GC
N
f-27201882
f
GR
GS
[1 0 0 1 264.30276 155.80162] CT
0.302 GC
N
f-27201882
f
GR
GS
[1 0 0 1 284.57315 210.77933] CT
0.302 GC
N
f-27201882
f
GR
GS
[1 0 0 1 278.78223 207.69885] CT
0.302 GC
N
f-27201882
f
GR
GS
[1 0 0 1 269.1022 172.49693] CT
0.302 GC
N
f-27201882
f
GR
GS
[1 0 0 1 281.23141 209.63966] CT
0.302 GC
N
f-27201882
f
GR
GS
[1 0 0 1 265.81607 164.5793] CT
0.302 GC
N
f-27201882
f
GR
GS
[1 0 0 1 284.646 203.06358] CT
0.302 GC
N
f-27201882
f
GR
GS
[1 0 0 1 282.1908 137.72098] CT
0.302 GC
N
f-27201882
f
GR
GS
[1 0 0 1 263.54498 127.5517] CT
0.302 GC
N
f-27201882
f
GR
GS
[1 0 0 1 266.85577 212.63939] CT
0.302 GC
N
f-27201882
f
GR
GS
[1 0 0 1 262.298 223.30849] CT
0.302 GC
N
f-27201882
f
GR
GS
[1 0 0 1 276.55151 217.7061] CT
0.302 GC
N
f-27201882
f
GR
GS
[1 0 0 1 290.1702 186.48524] CT
0.302 GC
N
f-27201882
f
GR
GS
[1 0 0 1 282.80148 183.59993] CT
0.302 GC
N
f-27201882
f
GR
GS
[1 0 0 1 279.46542 199.54822] CT
0.302 GC
N
f-27201882
f
GR
GS
[1 0 0 1 291.25568 166.01251] CT
0.302 GC
N
f-27201882
f
GR
GS
[1 0 0 1 264.97604 163.08376] CT
0.302 GC
N
f-27201882
f
GR
GS
[1 0 0 1 292.77121 186.89212] CT
0.302 GC
N
f-27201882
f
GR
GS
[1 0 0 1 265.32999 201.89789] CT
0.302 GC
N
f-27201882
f
GR
GS
[1 0 0 1 279.358 178.07542] CT
0.302 GC
N
f-27201882
f
GR
GS
[1 0 0 1 266.53525 145.29764] CT
0.302 GC
N
f-27201882
f
GR
GS
[1 0 0 1 280.8114 181.29854] CT
0.302 GC
N
f-27201882
f
GR
GS
[1 0 0 1 261.78207 198.77051] CT
0.302 GC
N
f-27201882
f
GR
GS
[1 0 0 1 287.92218 170.38124] CT
0.302 GC
N
f-27201882
f
GR
GS
[1 0 0 1 290.73572 188.681] CT
0.302 GC
N
f-27201882
f
GR
GS
[1 0 0 1 293.07196 152.67021] CT
0.302 GC
N
f-27201882
f
GR
GS
[1 0 0 1 295.478 194.85065] CT
0.302 GC
N
f-27201882
f
GR
GS
[1 0 0 1 278.95108 167.6347] CT
0.302 GC
N
f-27201882
f
GR
GS
[1 0 0 1 270.93475 203.14322] CT
0.302 GC
N
f-27201882
f
GR
GS
[1 0 0 1 265.08075 185.55089] CT
0.302 GC
N
f-27201882
f
GR
GS
[1 0 0 1 364.79422 166.55534] CT
0.302 GC
N
f-27201882
f
GR
GS
[1 0 0 1 367.4614 174.08159] CT
0.302 GC
N
f-27201882
f
GR
GS
[1 0 0 1 373.54202 183.70566] CT
0.302 GC
N
f-27201882
f
GR
GS
[1 0 0 1 350.22061 157.41687] CT
0.302 GC
N
f-27201882
f
GR
GS
[1 0 0 1 370.06775 176.22083] CT
0.302 GC
N
f-27201882
f
GR
GS
[1 0 0 1 365.10739 152.9407] CT
0.302 GC
N
f-27201882
f
GR
GS
[1 0 0 1 353.24194 157.59433] CT
0.302 GC
N
f-27201882
f
GR
GS
[1 0 0 1 379.56754 152.99321] CT
0.302 GC
N
f-27201882
f
GR
GS
[1 0 0 1 367.62857 159.44014] CT
0.302 GC
N
f-27201882
f
GR
GS
[1 0 0 1 362.48877 247.61537] CT
0.302 GC
N
f-27201882
f
GR
GS
[1 0 0 1 362.87674 164.26627] CT
0.302 GC
N
f-27201882
f
GR
GS
[1 0 0 1 365.64398 138.38921] CT
0.302 GC
N
f-27201882
f
GR
GS
[1 0 0 1 370.70126 148.82326] CT
0.302 GC
N
f-27201882
f
GR
GS
[1 0 0 1 359.9696 204.81046] CT
0.302 GC
N
f-27201882
f
GR
GS
[1 0 0 1 355.58267 172.46468] CT
0.302 GC
N
f-27201882
f
GR
GS
[1 0 0 1 367.23206 196.24712] CT
0.302 GC
N
f-27201882
f
GR
GS
[1 0 0 1 377.10922 226.17726] CT
0.302 GC
N
f-27201882
f
GR
GS
[1 0 0 1 361.32745 167.87318] CT
0.302 GC
N
f-27201882
f
GR
GS
[1 0 0 1 351.2377 151.73483] CT
0.302 GC
N
f-27201882
f
GR
GS
[1 0 0 1 362.59891 200.79984] CT
0.302 GC
N
f-27201882
f
GR
GS
[1 0 0 1 357.67133 173.36751] CT
0.302 GC
N
f-27201882
f
GR
GS
[1 0 0 1 361.14255 139.04137] CT
0.302 GC
N
f-27201882
f
GR
GS
[1 0 0 1 375.95938 129.78601] CT
0.302 GC
N
f-27201882
f
GR
GS
[1 0 0 1 360.75806 151.55099] CT
0.302 GC
N
f-27201882
f
GR
GS
[1 0 0 1 359.7384 155.6577] CT
0.302 GC
N
f-27201882
f
GR
GS
[1 0 0 1 352.18576 208.56085] CT
0.302 GC
N
f-27201882
f
GR
GS
[1 0 0 1 356.29745 162.3231] CT
0.302 GC
N
f-27201882
f
GR
GS
[1 0 0 1 350.35275 176.42076] CT
0.302 GC
N
f-27201882
f
GR
GS
[1 0 0 1 362.10333 214.44241] CT
0.302 GC
N
f-27201882
f
GR
GS
[1 0 0 1 356.1998 143.50449] CT
0.302 GC
N
f-27201882
f
GR
GS
[1 0 0 1 357.58115 171.7325] CT
0.302 GC
N
f-27201882
f
GR
GS
[1 0 0 1 361.94763 145.54642] CT
0.302 GC
N
f-27201882
f
GR
GS
[1 0 0 1 351.46381 193.04091] CT
0.302 GC
N
f-27201882
f
GR
GS
[1 0 0 1 364.35577 152.33307] CT
0.302 GC
N
f-27201882
f
GR
GS
[1 0 0 1 371.60477 49.2552] CT
0.302 GC
N
f-27201882
f
GR
GS
[1 0 0 1 355.72955 163.05316] CT
0.302 GC
N
f-27201882
f
GR
GS
[1 0 0 1 374.30292 187.7019] CT
0.302 GC
N
f-27201882
f
GR
GS
[1 0 0 1 349.91629 152.0869] CT
0.302 GC
N
f-27201882
f
GR
GS
[1 0 0 1 360.88519 185.48781] CT
0.302 GC
N
f-27201882
f
GR
GS
[1 0 0 1 347.49142 154.12169] CT
0.302 GC
N
f-27201882
f
GR
GS
[1 0 0 1 354.94421 130.11571] CT
0.302 GC
N
f-27201882
f
GR
GS
[1 0 0 1 347.41962 173.79845] CT
0.302 GC
N
f-27201882
f
GR
GS
[1 0 0 1 353.86386 181.6026] CT
0.302 GC
N
f-27201882
f
GR
GS
[1 0 0 1 352.26221 196.18335] CT
0.302 GC
N
f-27201882
f
GR
GS
[1 0 0 1 442.31998 155.70929] CT
0.302 GC
N
f-27201882
f
GR
GS
[1 0 0 1 439.12378 141.08969] CT
0.302 GC
N
f-27201882
f
GR
GS
[1 0 0 1 437.88065 226.12332] CT
0.302 GC
N
f-27201882
f
GR
GS
[1 0 0 1 453.66678 160.62309] CT
0.302 GC
N
f-27201882
f
GR
GS
[1 0 0 1 464.03128 190.59998] CT
0.302 GC
N
f-27201882
f
GR
GS
[1 0 0 1 465.34573 143.56441] CT
0.302 GC
N
f-27201882
f
GR
GS
[1 0 0 1 440.71164 151.62537] CT
0.302 GC
N
f-27201882
f
GR
GS
[1 0 0 1 449.68063 136.52364] CT
0.302 GC
N
f-27201882
f
GR
GS
[1 0 0 1 446.02219 138.00824] CT
0.302 GC
N
f-27201882
f
GR
GS
[1 0 0 1 451.09067 228.98825] CT
0.302 GC
N
f-27201882
f
GR
GS
[1 0 0 1 448.09103 191.99988] CT
0.302 GC
N
f-27201882
f
GR
GS
[1 0 0 1 434.02048 151.00169] CT
0.302 GC
N
f-27201882
f
GR
GS
[1 0 0 1 447.89447 177.09326] CT
0.302 GC
N
f-27201882
f
GR
GS
[1 0 0 1 466.10648 226.79614] CT
0.302 GC
N
f-27201882
f
GR
GS
[1 0 0 1 459.27582 177.49672] CT
0.302 GC
N
f-27201882
f
GR
GS
[1 0 0 1 433.37708 170.3109] CT
0.302 GC
N
f-27201882
f
GR
GS
[1 0 0 1 456.45035 230.34117] CT
0.302 GC
N
f-27201882
f
GR
GS
[1 0 0 1 457.33908 168.85257] CT
0.302 GC
N
f-27201882
f
GR
GS
[1 0 0 1 455.2529 143.27814] CT
0.302 GC
N
f-27201882
f
GR
GS
[1 0 0 1 452.06921 204.47966] CT
0.302 GC
N
f-27201882
f
GR
GS
[1 0 0 1 440.60614 168.37749] CT
0.302 GC
N
f-27201882
f
GR
GS
[1 0 0 1 459.61716 138.37357] CT
0.302 GC
N
f-27201882
f
GR
GS
[1 0 0 1 440.94638 153.23529] CT
0.302 GC
N
f-27201882
f
GR
GS
[1 0 0 1 463.68384 164.75145] CT
0.302 GC
N
f-27201882
f
GR
GS
[1 0 0 1 462.49872 185.46245] CT
0.302 GC
N
f-27201882
f
GR
GS
[1 0 0 1 446.92847 185.55377] CT
0.302 GC
N
f-27201882
f
GR
GS
[1 0 0 1 444.03305 163.71809] CT
0.302 GC
N
f-27201882
f
GR
GS
[1 0 0 1 454.00119 199.61166] CT
0.302 GC
N
f-27201882
f
GR
GS
[1 0 0 1 464.3447 191.65446] CT
0.302 GC
N
f-27201882
f
GR
GS
[1 0 0 1 464.30707 161.25681] CT
0.302 GC
N
f-27201882
f
GR
GS
[1 0 0 1 453.41669 123.64169] CT
0.302 GC
N
f-27201882
f
GR
GS
[1 0 0 1 444.5322 201.72926] CT
0.302 GC
N
f-27201882
f
GR
GS
[1 0 0 1 462.3851 172.48135] CT
0.302 GC
N
f-27201882
f
GR
GS
[1 0 0 1 448.29922 206.11198] CT
0.302 GC
N
f-27201882
f
GR
GS
[1 0 0 1 464.14438 108.44699] CT
0.302 GC
N
f-27201882
f
GR
GS
[1 0 0 1 434.26306 130.33563] CT
0.302 GC
N
f-27201882
f
GR
GS
[1 0 0 1 451.38724 219.05406] CT
0.302 GC
N
f-27201882
f
GR
GS
[1 0 0 1 457.70087 169.85136] CT
0.302 GC
N
f-27201882
f
GR
GS
[1 0 0 1 439.27505 170.94374] CT
0.302 GC
N
f-27201882
f
GR
GS
[1 0 0 1 444.66806 157.3562] CT
0.302 GC
N
f-27201882
f
GR
GS
[1 0 0 1 439.56354 165.8313] CT
0.302 GC
N
f-27201882
f
GR
GS
[1 0 0 1 444.16708 146.58197] CT
0.302 GC
N
f-27201882
f
GR
GS
[1 0 0 1 446.97729 177.69807] CT
0.302 GC
N
f-27201882
f
GR
GS
[1 0 0 1 451.94083 166.22583] CT
0.302 GC
N
f-27201882
f
GR
GS
1 LJ
4 LW
N
158.725 147.557 M
158.725 156.424 L
S
GR
GS
1 LJ
4 LW
N
158.725 147.557 M
158.725 147.557 L
S
GR
GS
1 LJ
4 LW
N
158.725 156.424 M
158.725 156.424 L
S
GR
GS
1 LJ
4 LW
N
244.475 164.399 M
244.475 172.641 L
S
GR
GS
1 LJ
4 LW
N
244.475 164.399 M
244.475 164.399 L
S
GR
GS
1 LJ
4 LW
N
244.475 172.641 M
244.475 172.641 L
S
GR
GS
1 LJ
4 LW
N
330.225 139.764 M
330.225 149.551 L
S
GR
GS
1 LJ
4 LW
N
330.225 139.764 M
330.225 139.764 L
S
GR
GS
1 LJ
4 LW
N
330.225 149.551 M
330.225 149.551 L
S
GR
GS
1 LJ
4 LW
N
415.975 131.392 M
415.975 141.109 L
S
GR
GS
1 LJ
4 LW
N
415.975 131.392 M
415.975 131.392 L
S
GR
GS
1 LJ
4 LW
N
415.975 141.109 M
415.975 141.109 L
S
GR
GS
1 LJ
4 LW
N
193.025 173.904 M
193.025 181.462 L
S
GR
GS
1 LJ
4 LW
N
193.025 173.904 M
193.025 173.904 L
S
GR
GS
1 LJ
4 LW
N
193.025 181.462 M
193.025 181.462 L
S
GR
GS
1 LJ
4 LW
N
278.775 180.268 M
278.775 186.731 L
S
GR
GS
1 LJ
4 LW
N
278.775 180.268 M
278.775 180.268 L
S
GR
GS
1 LJ
4 LW
N
278.775 186.731 M
278.775 186.731 L
S
GR
GS
1 LJ
4 LW
N
364.525 163.512 M
364.525 172.436 L
S
GR
GS
1 LJ
4 LW
N
364.525 163.512 M
364.525 163.512 L
S
GR
GS
1 LJ
4 LW
N
364.525 172.436 M
364.525 172.436 L
S
GR
GS
1 LJ
4 LW
N
450.275 167.22 M
450.275 175.634 L
S
GR
GS
1 LJ
4 LW
N
450.275 167.22 M
450.275 167.22 L
S
GR
GS
1 LJ
4 LW
N
450.275 175.634 M
450.275 175.634 L
S
GR
GS
[1 0 0 1 158.72501 247.39999] CT
/Helvetica-Bold 20 F
GS
[1 0 0 1 0 0] CT
-12.5 7.5 moveto 
1 -1 scale
(***) t 
GR
GR
GS
[1 0 0 1 193.02501 247.39999] CT
/Helvetica-Bold 20 F
GS
[1 0 0 1 0 0] CT
-12.5 7.5 moveto 
1 -1 scale
(***) t 
GR
GR
GS
[1 0 0 1 244.47499 247.39999] CT
/Helvetica-Bold 20 F
GS
[1 0 0 1 0 0] CT
-12.5 7.5 moveto 
1 -1 scale
(***) t 
GR
GR
GS
[1 0 0 1 278.77499 247.39999] CT
/Helvetica-Bold 20 F
GS
[1 0 0 1 0 0] CT
-12.5 7.5 moveto 
1 -1 scale
(***) t 
GR
GR
GS
[1 0 0 1 330.22501 247.39999] CT
/Helvetica-Bold 20 F
GS
[1 0 0 1 0 0] CT
-12.5 7.5 moveto 
1 -1 scale
(***) t 
GR
GR
GS
[1 0 0 1 364.52499 247.39999] CT
/Helvetica-Bold 20 F
GS
[1 0 0 1 0 0] CT
-12.5 7.5 moveto 
1 -1 scale
(***) t 
GR
GR
GS
[1 0 0 1 415.97501 247.39999] CT
/Helvetica-Bold 20 F
GS
[1 0 0 1 0 0] CT
-12.5 7.5 moveto 
1 -1 scale
(***) t 
GR
GR
GS
[1 0 0 1 450.27499 247.39999] CT
/Helvetica-Bold 20 F
GS
[1 0 0 1 0 0] CT
-12.5 7.5 moveto 
1 -1 scale
(***) t 
GR
GR
GS
1 GC
N
/f1766222540{584 256.5 M
926.5 256.5 L
926.5 29 L
584 29 L
cp}def
f1766222540
f
GR
GS
0.149 GC
2 setlinecap
1 LJ
0.5 LW
N
584 256.5 M
926.5 256.5 L
S
GR
GS
0.149 GC
2 setlinecap
1 LJ
0.5 LW
N
626.813 256.5 M
626.813 253.075 L
S
GR
GS
0.149 GC
2 setlinecap
1 LJ
0.5 LW
N
712.438 256.5 M
712.438 253.075 L
S
GR
GS
0.149 GC
2 setlinecap
1 LJ
0.5 LW
N
798.063 256.5 M
798.063 253.075 L
S
GR
GS
0.149 GC
2 setlinecap
1 LJ
0.5 LW
N
883.688 256.5 M
883.688 253.075 L
S
GR
GS
[1 0 0 1 626.8125 262.5] CT
0.149 GC
/Helvetica 20 F
GS
[1 0 0 1 0 0] CT
-24.5 20 moveto 
1 -1 scale
(Color) t 
GR
GR
GS
[1 0 0 1 712.4375 262.5] CT
0.149 GC
/Helvetica 20 F
GS
[1 0 0 1 0 0] CT
-40 20 moveto 
1 -1 scale
(Direction) t 
GR
GR
GS
[1 0 0 1 798.0625 262.5] CT
0.149 GC
/Helvetica 20 F
GS
[1 0 0 1 0 0] CT
-19 20 moveto 
1 -1 scale
(Size) t 
GR
GR
GS
[1 0 0 1 883.6875 262.5] CT
0.149 GC
/Helvetica 20 F
GS
[1 0 0 1 0 0] CT
-49.5 20 moveto 
1 -1 scale
(Luminance) t 
GR
GR
GS
0.149 GC
2 setlinecap
1 LJ
0.5 LW
N
584 256.5 M
584 29 L
S
GR
GS
0.149 GC
2 setlinecap
1 LJ
0.5 LW
N
584 256.5 M
587.425 256.5 L
S
GR
GS
0.149 GC
2 setlinecap
1 LJ
0.5 LW
N
584 199.625 M
587.425 199.625 L
S
GR
GS
0.149 GC
2 setlinecap
1 LJ
0.5 LW
N
584 142.75 M
587.425 142.75 L
S
GR
GS
0.149 GC
2 setlinecap
1 LJ
0.5 LW
N
584 85.875 M
587.425 85.875 L
S
GR
GS
0.149 GC
2 setlinecap
1 LJ
0.5 LW
N
584 29 M
587.425 29 L
S
GR
GS
[1 0 0 1 578 256.5] CT
0.149 GC
/Helvetica 20 F
GS
[1 0 0 1 0 0] CT
-36 7.5 moveto 
1 -1 scale
(-0.2) t 
GR
GR
GS
[1 0 0 1 578 199.625] CT
0.149 GC
/Helvetica 20 F
GS
[1 0 0 1 0 0] CT
-36 7.5 moveto 
1 -1 scale
(-0.1) t 
GR
GR
GS
[1 0 0 1 578 142.75] CT
0.149 GC
/Helvetica 20 F
GS
[1 0 0 1 0 0] CT
-12 7.5 moveto 
1 -1 scale
(0) t 
GR
GR
GS
[1 0 0 1 578 85.875] CT
0.149 GC
/Helvetica 20 F
GS
[1 0 0 1 0 0] CT
-28 7.5 moveto 
1 -1 scale
(0.1) t 
GR
GR
GS
[1 0 0 1 578 29] CT
0.149 GC
/Helvetica 20 F
GS
[1 0 0 1 0 0] CT
-28 7.5 moveto 
1 -1 scale
(0.2) t 
GR
GR
GS
[0 -1 1 0 539 142.74989] CT
0.149 GC
/Helvetica 20 F
GS
[1 0 0 1 0 0] CT
-47 -5 moveto 
1 -1 scale
(linear beta) t 
GR
GR
GS
[1 0 0 1 755.25073 26.5] CT
/Helvetica-Bold 20 F
GS
[1 0 0 1 0 0] CT
-74.5 -5 moveto 
1 -1 scale
(mean Accuracy) t 
GR
GR
GS
0.149 GC
1 LJ
0.5 LW
N
584 142.75 M
926.5 142.75 L
S
GR
GS
1 0.8 0.8 RC
N
/f2073819310{592.563 142.75 M
592.563 162.71 L
626.813 162.71 L
626.813 142.75 L
cp}def
f2073819310
f
GR
GS
0.8 GC
N
/f-711938020{626.813 142.75 M
626.813 157.264 L
661.063 157.264 L
661.063 142.75 L
cp}def
f-711938020
f
GR
GS
1 0.8 0.8 RC
N
/f-1411658416{678.188 142.75 M
678.188 147.633 L
712.438 147.633 L
712.438 142.75 L
cp}def
f-1411658416
f
GR
GS
0.8 GC
N
/f1605014314{712.438 142.75 M
712.438 148.455 L
746.688 148.455 L
746.688 142.75 L
cp}def
f1605014314
f
GR
GS
1 0.8 0.8 RC
N
/f-472606884{763.813 142.75 M
763.813 165.064 L
798.063 165.064 L
798.063 142.75 L
cp}def
f-472606884
f
GR
GS
0.8 GC
N
/f1276836014{798.063 142.75 M
798.063 163.33 L
832.313 163.33 L
832.313 142.75 L
cp}def
f1276836014
f
GR
GS
1 0.8 0.8 RC
N
/f-595192336{849.438 142.75 M
849.438 169.196 L
883.688 169.196 L
883.688 142.75 L
cp}def
f-595192336
f
GR
GS
0.8 GC
N
/f-995490736{883.688 142.75 M
883.688 158.439 L
917.938 158.439 L
917.938 142.75 L
cp}def
f-995490736
f
GR
GS
[1 0 0 1 594.23181 139.19531] CT
1 0.302 0.302 RC
N
f-27201882
f
GR
GS
[1 0 0 1 611.49359 171.1875] CT
1 0.302 0.302 RC
N
f-27201882
f
GR
GS
[1 0 0 1 601.97479 164.07813] CT
1 0.302 0.302 RC
N
f-27201882
f
GR
GS
[1 0 0 1 600.83392 132.08594] CT
1 0.302 0.302 RC
N
f-27201882
f
GR
GS
[1 0 0 1 597.84247 167.63281] CT
1 0.302 0.302 RC
N
f-27201882
f
GR
GS
[1 0 0 1 625.31976 206.73438] CT
1 0.302 0.302 RC
N
f-27201882
f
GR
GS
[1 0 0 1 624.60889 171.1875] CT
1 0.302 0.302 RC
N
f-27201882
f
GR
GS
[1 0 0 1 620.60345 142.75] CT
1 0.302 0.302 RC
N
f-27201882
f
GR
GS
[1 0 0 1 617.50549 117.86719] CT
1 0.302 0.302 RC
N
f-27201882
f
GR
GS
[1 0 0 1 598.58405 96.53906] CT
1 0.302 0.302 RC
N
f-27201882
f
GR
GS
[1 0 0 1 604.90521 178.29688] CT
1 0.302 0.302 RC
N
f-27201882
f
GR
GS
[1 0 0 1 599.02856 146.30469] CT
1 0.302 0.302 RC
N
f-27201882
f
GR
GS
[1 0 0 1 592.60352 139.19531] CT
1 0.302 0.302 RC
N
f-27201882
f
GR
GS
[1 0 0 1 603.39984 171.1875] CT
1 0.302 0.302 RC
N
f-27201882
f
GR
GS
[1 0 0 1 616.52435 160.52344] CT
1 0.302 0.302 RC
N
f-27201882
f
GR
GS
[1 0 0 1 613.97748 192.51563] CT
1 0.302 0.302 RC
N
f-27201882
f
GR
GS
[1 0 0 1 611.16235 153.41406] CT
1 0.302 0.302 RC
N
f-27201882
f
GR
GS
[1 0 0 1 607.59955 139.4323] CT
1 0.302 0.302 RC
N
f-27201882
f
GR
GS
[1 0 0 1 602.40686 167.63281] CT
1 0.302 0.302 RC
N
f-27201882
f
GR
GS
[1 0 0 1 609.74432 161.07031] CT
1 0.302 0.302 RC
N
f-27201882
f
GR
GS
[1 0 0 1 618.64545 185.40625] CT
1 0.302 0.302 RC
N
f-27201882
f
GR
GS
[1 0 0 1 618.67499 171.1875] CT
1 0.302 0.302 RC
N
f-27201882
f
GR
GS
[1 0 0 1 618.16992 135.64063] CT
1 0.302 0.302 RC
N
f-27201882
f
GR
GS
[1 0 0 1 614.67206 153.41406] CT
1 0.302 0.302 RC
N
f-27201882
f
GR
GS
[1 0 0 1 596.78278 238.72656] CT
1 0.302 0.302 RC
N
f-27201882
f
GR
GS
[1 0 0 1 609.83813 139.19531] CT
1 0.302 0.302 RC
N
f-27201882
f
GR
GS
[1 0 0 1 604.45618 164.07813] CT
1 0.302 0.302 RC
N
f-27201882
f
GR
GS
[1 0 0 1 595.71857 133.03386] CT
1 0.302 0.302 RC
N
f-27201882
f
GR
GS
[1 0 0 1 597.62634 189.97656] CT
1 0.302 0.302 RC
N
f-27201882
f
GR
GS
[1 0 0 1 599.34979 146.30469] CT
1 0.302 0.302 RC
N
f-27201882
f
GR
GS
[1 0 0 1 615.58777 224.50781] CT
1 0.302 0.302 RC
N
f-27201882
f
GR
GS
[1 0 0 1 607.34174 164.07813] CT
1 0.302 0.302 RC
N
f-27201882
f
GR
GS
[1 0 0 1 616.34583 164.07813] CT
1 0.302 0.302 RC
N
f-27201882
f
GR
GS
[1 0 0 1 601.35736 128.53125] CT
1 0.302 0.302 RC
N
f-27201882
f
GR
GS
[1 0 0 1 592.89673 171.1875] CT
1 0.302 0.302 RC
N
f-27201882
f
GR
GS
[1 0 0 1 610.79321 153.41406] CT
1 0.302 0.302 RC
N
f-27201882
f
GR
GS
[1 0 0 1 602.13165 153.41406] CT
1 0.302 0.302 RC
N
f-27201882
f
GR
GS
[1 0 0 1 624.97089 185.40625] CT
1 0.302 0.302 RC
N
f-27201882
f
GR
GS
[1 0 0 1 623.60815 142.75] CT
1 0.302 0.302 RC
N
f-27201882
f
GR
GS
[1 0 0 1 606.01196 199.625] CT
1 0.302 0.302 RC
N
f-27201882
f
GR
GS
[1 0 0 1 593.41382 171.1875] CT
1 0.302 0.302 RC
N
f-27201882
f
GR
GS
[1 0 0 1 615.5592 185.40625] CT
1 0.302 0.302 RC
N
f-27201882
f
GR
GS
[1 0 0 1 621.2356 167.63281] CT
1 0.302 0.302 RC
N
f-27201882
f
GR
GS
[1 0 0 1 625.83636 160.99739] CT
1 0.302 0.302 RC
N
f-27201882
f
GR
GS
[1 0 0 1 594.51245 178.29688] CT
1 0.302 0.302 RC
N
f-27201882
f
GR
GS
[1 0 0 1 607.98608 178.29688] CT
1 0.302 0.302 RC
N
f-27201882
f
GR
GS
[1 0 0 1 612.51208 142.75] CT
1 0.302 0.302 RC
N
f-27201882
f
GR
GS
[1 0 0 1 701.70483 146.30469] CT
1 0.302 0.302 RC
N
f-27201882
f
GR
GS
[1 0 0 1 702.82806 139.19531] CT
1 0.302 0.302 RC
N
f-27201882
f
GR
GS
[1 0 0 1 700.45142 139.19531] CT
1 0.302 0.302 RC
N
f-27201882
f
GR
GS
[1 0 0 1 703.08435 126.39844] CT
1 0.302 0.302 RC
N
f-27201882
f
GR
GS
[1 0 0 1 698.10669 139.19531] CT
1 0.302 0.302 RC
N
f-27201882
f
GR
GS
[1 0 0 1 682.16455 156.96875] CT
1 0.302 0.302 RC
N
f-27201882
f
GR
GS
[1 0 0 1 680.16217 132.08594] CT
1 0.302 0.302 RC
N
f-27201882
f
GR
GS
[1 0 0 1 711.74445 167.63281] CT
1 0.302 0.302 RC
N
f-27201882
f
GR
GS
[1 0 0 1 687.94269 139.19531] CT
1 0.302 0.302 RC
N
f-27201882
f
GR
GS
[1 0 0 1 698.56537 167.63281] CT
1 0.302 0.302 RC
N
f-27201882
f
GR
GS
[1 0 0 1 711.14154 132.08594] CT
1 0.302 0.302 RC
N
f-27201882
f
GR
GS
[1 0 0 1 684.55042 142.75] CT
1 0.302 0.302 RC
N
f-27201882
f
GR
GS
[1 0 0 1 684.79913 142.75] CT
1 0.302 0.302 RC
N
f-27201882
f
GR
GS
[1 0 0 1 689.88879 153.41406] CT
1 0.302 0.302 RC
N
f-27201882
f
GR
GS
[1 0 0 1 710.13928 135.64063] CT
1 0.302 0.302 RC
N
f-27201882
f
GR
GS
[1 0 0 1 691.56787 142.75] CT
1 0.302 0.302 RC
N
f-27201882
f
GR
GS
[1 0 0 1 687.54517 142.75] CT
1 0.302 0.302 RC
N
f-27201882
f
GR
GS
[1 0 0 1 683.39166 142.75] CT
1 0.302 0.302 RC
N
f-27201882
f
GR
GS
[1 0 0 1 691.78845 156.96875] CT
1 0.302 0.302 RC
N
f-27201882
f
GR
GS
[1 0 0 1 691.02173 103.64844] CT
1 0.302 0.302 RC
N
f-27201882
f
GR
GS
[1 0 0 1 682.67816 164.07813] CT
1 0.302 0.302 RC
N
f-27201882
f
GR
GS
[1 0 0 1 693.08765 156.96875] CT
1 0.302 0.302 RC
N
f-27201882
f
GR
GS
[1 0 0 1 699.23846 107.20313] CT
1 0.302 0.302 RC
N
f-27201882
f
GR
GS
[1 0 0 1 678.56354 135.64063] CT
1 0.302 0.302 RC
N
f-27201882
f
GR
GS
[1 0 0 1 697.82166 178.29688] CT
1 0.302 0.302 RC
N
f-27201882
f
GR
GS
[1 0 0 1 705.23572 171.1875] CT
1 0.302 0.302 RC
N
f-27201882
f
GR
GS
[1 0 0 1 686.24884 149.06944] CT
1 0.302 0.302 RC
N
f-27201882
f
GR
GS
[1 0 0 1 693.53217 135.64063] CT
1 0.302 0.302 RC
N
f-27201882
f
GR
GS
[1 0 0 1 697.68805 167.35938] CT
1 0.302 0.302 RC
N
f-27201882
f
GR
GS
[1 0 0 1 680.29053 142.75] CT
1 0.302 0.302 RC
N
f-27201882
f
GR
GS
[1 0 0 1 695.18542 185.40625] CT
1 0.302 0.302 RC
N
f-27201882
f
GR
GS
[1 0 0 1 700.18677 135.64063] CT
1 0.302 0.302 RC
N
f-27201882
f
GR
GS
[1 0 0 1 685.76587 142.75] CT
1 0.302 0.302 RC
N
f-27201882
f
GR
GS
[1 0 0 1 706.85669 142.75] CT
1 0.302 0.302 RC
N
f-27201882
f
GR
GS
[1 0 0 1 711.44684 171.1875] CT
1 0.302 0.302 RC
N
f-27201882
f
GR
GS
[1 0 0 1 707.17578 139.19531] CT
1 0.302 0.302 RC
N
f-27201882
f
GR
GS
[1 0 0 1 695.51801 164.07813] CT
1 0.302 0.302 RC
N
f-27201882
f
GR
GS
[1 0 0 1 687.73901 156.96875] CT
1 0.302 0.302 RC
N
f-27201882
f
GR
GS
[1 0 0 1 703.75916 142.75] CT
1 0.302 0.302 RC
N
f-27201882
f
GR
GS
[1 0 0 1 686.30237 142.75] CT
1 0.302 0.302 RC
N
f-27201882
f
GR
GS
[1 0 0 1 710.97656 146.30469] CT
1 0.302 0.302 RC
N
f-27201882
f
GR
GS
[1 0 0 1 699.4314 164.07813] CT
1 0.302 0.302 RC
N
f-27201882
f
GR
GS
[1 0 0 1 698.74646 185.40625] CT
1 0.302 0.302 RC
N
f-27201882
f
GR
GS
[1 0 0 1 684.09918 139.19531] CT
1 0.302 0.302 RC
N
f-27201882
f
GR
GS
[1 0 0 1 681.28186 142.75] CT
1 0.302 0.302 RC
N
f-27201882
f
GR
GS
[1 0 0 1 686.93024 130.19011] CT
1 0.302 0.302 RC
N
f-27201882
f
GR
GS
[1 0 0 1 707.59351 149.85938] CT
1 0.302 0.302 RC
N
f-27201882
f
GR
GS
[1 0 0 1 795.01654 218.10938] CT
1 0.302 0.302 RC
N
f-27201882
f
GR
GS
[1 0 0 1 787.77496 149.85938] CT
1 0.302 0.302 RC
N
f-27201882
f
GR
GS
[1 0 0 1 788.65002 171.1875] CT
1 0.302 0.302 RC
N
f-27201882
f
GR
GS
[1 0 0 1 771.6861 139.19531] CT
1 0.302 0.302 RC
N
f-27201882
f
GR
GS
[1 0 0 1 791.57654 149.85938] CT
1 0.302 0.302 RC
N
f-27201882
f
GR
GS
[1 0 0 1 777.6441 114.3125] CT
1 0.302 0.302 RC
N
f-27201882
f
GR
GS
[1 0 0 1 797.66656 160.52344] CT
1 0.302 0.302 RC
N
f-27201882
f
GR
GS
[1 0 0 1 766.89496 164.07813] CT
1 0.302 0.302 RC
N
f-27201882
f
GR
GS
[1 0 0 1 774.80475 139.19531] CT
1 0.302 0.302 RC
N
f-27201882
f
GR
GS
[1 0 0 1 781.32825 196.07031] CT
1 0.302 0.302 RC
N
f-27201882
f
GR
GS
[1 0 0 1 765.88824 192.51563] CT
1 0.302 0.302 RC
N
f-27201882
f
GR
GS
[1 0 0 1 788.6673 164.07813] CT
1 0.302 0.302 RC
N
f-27201882
f
GR
GS
[1 0 0 1 782.87451 149.85938] CT
1 0.302 0.302 RC
N
f-27201882
f
GR
GS
[1 0 0 1 781.94305 156.96875] CT
1 0.302 0.302 RC
N
f-27201882
f
GR
GS
[1 0 0 1 792.23938 114.3125] CT
1 0.302 0.302 RC
N
f-27201882
f
GR
GS
[1 0 0 1 793.22498 160.52344] CT
1 0.302 0.302 RC
N
f-27201882
f
GR
GS
[1 0 0 1 790.83673 135.64063] CT
1 0.302 0.302 RC
N
f-27201882
f
GR
GS
[1 0 0 1 774.6983 146.30469] CT
1 0.302 0.302 RC
N
f-27201882
f
GR
GS
[1 0 0 1 779.3006 142.75] CT
1 0.302 0.302 RC
N
f-27201882
f
GR
GS
[1 0 0 1 789.57629 220.95313] CT
1 0.302 0.302 RC
N
f-27201882
f
GR
GS
[1 0 0 1 767.57526 179.2448] CT
1 0.302 0.302 RC
N
f-27201882
f
GR
GS
[1 0 0 1 767.57117 146.30469] CT
1 0.302 0.302 RC
N
f-27201882
f
GR
GS
[1 0 0 1 781.78131 146.30469] CT
1 0.302 0.302 RC
N
f-27201882
f
GR
GS
[1 0 0 1 797.12579 206.73438] CT
1 0.302 0.302 RC
N
f-27201882
f
GR
GS
[1 0 0 1 788.14398 210.28906] CT
1 0.302 0.302 RC
N
f-27201882
f
GR
GS
[1 0 0 1 774.49371 210.28906] CT
1 0.302 0.302 RC
N
f-27201882
f
GR
GS
[1 0 0 1 773.79492 161.55035] CT
1 0.302 0.302 RC
N
f-27201882
f
GR
GS
[1 0 0 1 792.93726 165.09375] CT
1 0.302 0.302 RC
N
f-27201882
f
GR
GS
[1 0 0 1 795.03644 217.39844] CT
1 0.302 0.302 RC
N
f-27201882
f
GR
GS
[1 0 0 1 785.7077 149.85938] CT
1 0.302 0.302 RC
N
f-27201882
f
GR
GS
[1 0 0 1 772.55896 206.73438] CT
1 0.302 0.302 RC
N
f-27201882
f
GR
GS
[1 0 0 1 766.8493 149.85938] CT
1 0.302 0.302 RC
N
f-27201882
f
GR
GS
[1 0 0 1 792.52277 171.1875] CT
1 0.302 0.302 RC
N
f-27201882
f
GR
GS
[1 0 0 1 783.83911 146.30469] CT
1 0.302 0.302 RC
N
f-27201882
f
GR
GS
[1 0 0 1 796.28522 135.64063] CT
1 0.302 0.302 RC
N
f-27201882
f
GR
GS
[1 0 0 1 765.90277 142.75] CT
1 0.302 0.302 RC
N
f-27201882
f
GR
GS
[1 0 0 1 783.83649 124.97656] CT
1 0.302 0.302 RC
N
f-27201882
f
GR
GS
[1 0 0 1 773.57745 149.85938] CT
1 0.302 0.302 RC
N
f-27201882
f
GR
GS
[1 0 0 1 792.16235 153.41406] CT
1 0.302 0.302 RC
N
f-27201882
f
GR
GS
[1 0 0 1 770.35376 213.84375] CT
1 0.302 0.302 RC
N
f-27201882
f
GR
GS
[1 0 0 1 778.96912 174.74219] CT
1 0.302 0.302 RC
N
f-27201882
f
GR
GS
[1 0 0 1 777.28687 139.19531] CT
1 0.302 0.302 RC
N
f-27201882
f
GR
GS
[1 0 0 1 792.12268 171.1875] CT
1 0.302 0.302 RC
N
f-27201882
f
GR
GS
[1 0 0 1 786.99536 153.41406] CT
1 0.302 0.302 RC
N
f-27201882
f
GR
GS
[1 0 0 1 770.92291 167.63281] CT
1 0.302 0.302 RC
N
f-27201882
f
GR
GS
[1 0 0 1 774.70758 153.41406] CT
1 0.302 0.302 RC
N
f-27201882
f
GR
GS
[1 0 0 1 768.39551 224.50781] CT
1 0.302 0.302 RC
N
f-27201882
f
GR
GS
[1 0 0 1 872.43512 164.07813] CT
1 0.302 0.302 RC
N
f-27201882
f
GR
GS
[1 0 0 1 868.99396 160.52344] CT
1 0.302 0.302 RC
N
f-27201882
f
GR
GS
[1 0 0 1 855.25201 142.75] CT
1 0.302 0.302 RC
N
f-27201882
f
GR
GS
[1 0 0 1 854.49469 185.40625] CT
1 0.302 0.302 RC
N
f-27201882
f
GR
GS
[1 0 0 1 880.53998 153.41406] CT
1 0.302 0.302 RC
N
f-27201882
f
GR
GS
[1 0 0 1 868.34949 171.1875] CT
1 0.302 0.302 RC
N
f-27201882
f
GR
GS
[1 0 0 1 850.56567 181.85156] CT
1 0.302 0.302 RC
N
f-27201882
f
GR
GS
[1 0 0 1 851.28229 199.625] CT
1 0.302 0.302 RC
N
f-27201882
f
GR
GS
[1 0 0 1 877.01093 195.35938] CT
1 0.302 0.302 RC
N
f-27201882
f
GR
GS
[1 0 0 1 864.89709 156.96875] CT
1 0.302 0.302 RC
N
f-27201882
f
GR
GS
[1 0 0 1 862.54315 183.51042] CT
1 0.302 0.302 RC
N
f-27201882
f
GR
GS
[1 0 0 1 876.48279 136.11458] CT
1 0.302 0.302 RC
N
f-27201882
f
GR
GS
[1 0 0 1 861.91431 160.52344] CT
1 0.302 0.302 RC
N
f-27201882
f
GR
GS
[1 0 0 1 867.67047 180.66667] CT
1 0.302 0.302 RC
N
f-27201882
f
GR
GS
[1 0 0 1 873.81177 196.07031] CT
1 0.302 0.302 RC
N
f-27201882
f
GR
GS
[1 0 0 1 879.28558 174.74219] CT
1 0.302 0.302 RC
N
f-27201882
f
GR
GS
[1 0 0 1 860.69513 149.85938] CT
1 0.302 0.302 RC
N
f-27201882
f
GR
GS
[1 0 0 1 871.70404 164.07813] CT
1 0.302 0.302 RC
N
f-27201882
f
GR
GS
[1 0 0 1 882.82562 150.8073] CT
1 0.302 0.302 RC
N
f-27201882
f
GR
GS
[1 0 0 1 852.03937 171.1875] CT
1 0.302 0.302 RC
N
f-27201882
f
GR
GS
[1 0 0 1 869.54291 164.07813] CT
1 0.302 0.302 RC
N
f-27201882
f
GR
GS
[1 0 0 1 863.6131 170.95052] CT
1 0.302 0.302 RC
N
f-27201882
f
GR
GS
[1 0 0 1 858.47382 174.74219] CT
1 0.302 0.302 RC
N
f-27201882
f
GR
GS
[1 0 0 1 875.42523 153.41406] CT
1 0.302 0.302 RC
N
f-27201882
f
GR
GS
[1 0 0 1 883.52368 131.375] CT
1 0.302 0.302 RC
N
f-27201882
f
GR
GS
[1 0 0 1 855.82758 149.85938] CT
1 0.302 0.302 RC
N
f-27201882
f
GR
GS
[1 0 0 1 876.19171 147.35019] CT
1 0.302 0.302 RC
N
f-27201882
f
GR
GS
[1 0 0 1 856.14355 150.8073] CT
1 0.302 0.302 RC
N
f-27201882
f
GR
GS
[1 0 0 1 883.42578 207.81155] CT
1 0.302 0.302 RC
N
f-27201882
f
GR
GS
[1 0 0 1 876.91498 153.41406] CT
1 0.302 0.302 RC
N
f-27201882
f
GR
GS
[1 0 0 1 863.96729 174.74219] CT
1 0.302 0.302 RC
N
f-27201882
f
GR
GS
[1 0 0 1 874.40106 196.07031] CT
1 0.302 0.302 RC
N
f-27201882
f
GR
GS
[1 0 0 1 866.5061 164.07813] CT
1 0.302 0.302 RC
N
f-27201882
f
GR
GS
[1 0 0 1 877.14545 185.40625] CT
1 0.302 0.302 RC
N
f-27201882
f
GR
GS
[1 0 0 1 861.64795 207.91927] CT
1 0.302 0.302 RC
N
f-27201882
f
GR
GS
[1 0 0 1 851.94611 173.32031] CT
1 0.302 0.302 RC
N
f-27201882
f
GR
GS
[1 0 0 1 869.67896 171.66145] CT
1 0.302 0.302 RC
N
f-27201882
f
GR
GS
[1 0 0 1 880.61145 178.29688] CT
1 0.302 0.302 RC
N
f-27201882
f
GR
GS
[1 0 0 1 856.07397 162.65625] CT
1 0.302 0.302 RC
N
f-27201882
f
GR
GS
[1 0 0 1 864.24609 142.03906] CT
1 0.302 0.302 RC
N
f-27201882
f
GR
GS
[1 0 0 1 875.09625 185.40625] CT
1 0.302 0.302 RC
N
f-27201882
f
GR
GS
[1 0 0 1 850.77954 220.71614] CT
1 0.302 0.302 RC
N
f-27201882
f
GR
GS
[1 0 0 1 881.84912 171.1875] CT
1 0.302 0.302 RC
N
f-27201882
f
GR
GS
[1 0 0 1 875.59332 153.41406] CT
1 0.302 0.302 RC
N
f-27201882
f
GR
GS
[1 0 0 1 868.57709 185.40625] CT
1 0.302 0.302 RC
N
f-27201882
f
GR
GS
[1 0 0 1 855.73413 161.70833] CT
1 0.302 0.302 RC
N
f-27201882
f
GR
GS
[1 0 0 1 866.49225 135.64063] CT
1 0.302 0.302 RC
N
f-27201882
f
GR
GS
[1 0 0 1 644.54871 149.85938] CT
0.302 GC
N
f-27201882
f
GR
GS
[1 0 0 1 660.8653 142.75] CT
0.302 GC
N
f-27201882
f
GR
GS
[1 0 0 1 656.09119 142.75] CT
0.302 GC
N
f-27201882
f
GR
GS
[1 0 0 1 659.77484 142.75] CT
0.302 GC
N
f-27201882
f
GR
GS
[1 0 0 1 650.06622 160.52344] CT
0.302 GC
N
f-27201882
f
GR
GS
[1 0 0 1 640.63245 160.52344] CT
0.302 GC
N
f-27201882
f
GR
GS
[1 0 0 1 658.83551 149.85938] CT
0.302 GC
N
f-27201882
f
GR
GS
[1 0 0 1 643.23486 138.95833] CT
0.302 GC
N
f-27201882
f
GR
GS
[1 0 0 1 634.75134 153.41406] CT
0.302 GC
N
f-27201882
f
GR
GS
[1 0 0 1 640.38544 132.08594] CT
0.302 GC
N
f-27201882
f
GR
GS
[1 0 0 1 652.72711 121.42188] CT
0.302 GC
N
f-27201882
f
GR
GS
[1 0 0 1 659.77576 171.1875] CT
0.302 GC
N
f-27201882
f
GR
GS
[1 0 0 1 659.82507 107.20313] CT
0.302 GC
N
f-27201882
f
GR
GS
[1 0 0 1 630.77271 164.07813] CT
0.302 GC
N
f-27201882
f
GR
GS
[1 0 0 1 628.57458 153.41406] CT
0.302 GC
N
f-27201882
f
GR
GS
[1 0 0 1 637.23645 164.07813] CT
0.302 GC
N
f-27201882
f
GR
GS
[1 0 0 1 646.68408 205.71875] CT
0.302 GC
N
f-27201882
f
GR
GS
[1 0 0 1 644.99805 176.875] CT
0.302 GC
N
f-27201882
f
GR
GS
[1 0 0 1 657.67889 153.41406] CT
0.302 GC
N
f-27201882
f
GR
GS
[1 0 0 1 645.32635 188.96094] CT
0.302 GC
N
f-27201882
f
GR
GS
[1 0 0 1 641.60785 156.96875] CT
0.302 GC
N
f-27201882
f
GR
GS
[1 0 0 1 645.39886 135.64063] CT
0.302 GC
N
f-27201882
f
GR
GS
[1 0 0 1 651.21271 185.40625] CT
0.302 GC
N
f-27201882
f
GR
GS
[1 0 0 1 654.24402 160.52344] CT
0.302 GC
N
f-27201882
f
GR
GS
[1 0 0 1 631.69342 185.40625] CT
0.302 GC
N
f-27201882
f
GR
GS
[1 0 0 1 643.20026 213.84375] CT
0.302 GC
N
f-27201882
f
GR
GS
[1 0 0 1 635.60913 188.96094] CT
0.302 GC
N
f-27201882
f
GR
GS
[1 0 0 1 639.45392 166.72136] CT
0.302 GC
N
f-27201882
f
GR
GS
[1 0 0 1 649.47797 171.1875] CT
0.302 GC
N
f-27201882
f
GR
GS
[1 0 0 1 632.62158 153.41406] CT
0.302 GC
N
f-27201882
f
GR
GS
[1 0 0 1 636.36084 142.75] CT
0.302 GC
N
f-27201882
f
GR
GS
[1 0 0 1 633.60162 147.25261] CT
0.302 GC
N
f-27201882
f
GR
GS
[1 0 0 1 633.49371 135.64063] CT
0.302 GC
N
f-27201882
f
GR
GS
[1 0 0 1 638.00677 167.63281] CT
0.302 GC
N
f-27201882
f
GR
GS
[1 0 0 1 656.96405 146.30469] CT
0.302 GC
N
f-27201882
f
GR
GS
[1 0 0 1 642.94775 146.30469] CT
0.302 GC
N
f-27201882
f
GR
GS
[1 0 0 1 640.64844 132.08594] CT
0.302 GC
N
f-27201882
f
GR
GS
[1 0 0 1 632.95117 146.30469] CT
0.302 GC
N
f-27201882
f
GR
GS
[1 0 0 1 659.99817 169.05469] CT
0.302 GC
N
f-27201882
f
GR
GS
[1 0 0 1 640.76788 188.96094] CT
0.302 GC
N
f-27201882
f
GR
GS
[1 0 0 1 655.73621 146.30469] CT
0.302 GC
N
f-27201882
f
GR
GS
[1 0 0 1 647.88739 139.19531] CT
0.302 GC
N
f-27201882
f
GR
GS
[1 0 0 1 639.71143 149.85938] CT
0.302 GC
N
f-27201882
f
GR
GS
[1 0 0 1 656.85596 164.07813] CT
0.302 GC
N
f-27201882
f
GR
GS
[1 0 0 1 739.31873 135.64063] CT
0.302 GC
N
f-27201882
f
GR
GS
[1 0 0 1 728.36218 185.40625] CT
0.302 GC
N
f-27201882
f
GR
GS
[1 0 0 1 740.31622 142.75] CT
0.302 GC
N
f-27201882
f
GR
GS
[1 0 0 1 743.20923 174.74219] CT
0.302 GC
N
f-27201882
f
GR
GS
[1 0 0 1 727.13892 132.08594] CT
0.302 GC
N
f-27201882
f
GR
GS
[1 0 0 1 723.88831 46.77344] CT
0.302 GC
N
f-27201882
f
GR
GS
[1 0 0 1 732.87268 117.86719] CT
0.302 GC
N
f-27201882
f
GR
GS
[1 0 0 1 743.33069 142.75] CT
0.302 GC
N
f-27201882
f
GR
GS
[1 0 0 1 736.48328 149.85938] CT
0.302 GC
N
f-27201882
f
GR
GS
[1 0 0 1 725.36536 121.42188] CT
0.302 GC
N
f-27201882
f
GR
GS
[1 0 0 1 731.02887 146.30469] CT
0.302 GC
N
f-27201882
f
GR
GS
[1 0 0 1 723.09302 146.30469] CT
0.302 GC
N
f-27201882
f
GR
GS
[1 0 0 1 718.67035 142.75] CT
0.302 GC
N
f-27201882
f
GR
GS
[1 0 0 1 715.62238 164.07813] CT
0.302 GC
N
f-27201882
f
GR
GS
[1 0 0 1 728.31201 146.30469] CT
0.302 GC
N
f-27201882
f
GR
GS
[1 0 0 1 712.75714 167.63281] CT
0.302 GC
N
f-27201882
f
GR
GS
[1 0 0 1 743.77716 107.20313] CT
0.302 GC
N
f-27201882
f
GR
GS
[1 0 0 1 734.45142 139.19531] CT
0.302 GC
N
f-27201882
f
GR
GS
[1 0 0 1 712.48608 142.75] CT
0.302 GC
N
f-27201882
f
GR
GS
[1 0 0 1 713.47821 149.85938] CT
0.302 GC
N
f-27201882
f
GR
GS
[1 0 0 1 719.57758 146.30469] CT
0.302 GC
N
f-27201882
f
GR
GS
[1 0 0 1 728.02008 139.19531] CT
0.302 GC
N
f-27201882
f
GR
GS
[1 0 0 1 716.79639 156.96875] CT
0.302 GC
N
f-27201882
f
GR
GS
[1 0 0 1 737.33997 156.96875] CT
0.302 GC
N
f-27201882
f
GR
GS
[1 0 0 1 724.56598 120] CT
0.302 GC
N
f-27201882
f
GR
GS
[1 0 0 1 739.16779 203.17969] CT
0.302 GC
N
f-27201882
f
GR
GS
[1 0 0 1 727.39301 132.08594] CT
0.302 GC
N
f-27201882
f
GR
GS
[1 0 0 1 727.38947 177.65057] CT
0.302 GC
N
f-27201882
f
GR
GS
[1 0 0 1 714.12305 139.19531] CT
0.302 GC
N
f-27201882
f
GR
GS
[1 0 0 1 714.13739 167.63281] CT
0.302 GC
N
f-27201882
f
GR
GS
[1 0 0 1 715.55768 142.75] CT
0.302 GC
N
f-27201882
f
GR
GS
[1 0 0 1 732.78326 164.07813] CT
0.302 GC
N
f-27201882
f
GR
GS
[1 0 0 1 720.69464 156.96875] CT
0.302 GC
N
f-27201882
f
GR
GS
[1 0 0 1 741.25439 142.75] CT
0.302 GC
N
f-27201882
f
GR
GS
[1 0 0 1 741.79706 160.52344] CT
0.302 GC
N
f-27201882
f
GR
GS
[1 0 0 1 745.44122 142.75] CT
0.302 GC
N
f-27201882
f
GR
GS
[1 0 0 1 729.18231 192.51563] CT
0.302 GC
N
f-27201882
f
GR
GS
[1 0 0 1 719.98309 149.85938] CT
0.302 GC
N
f-27201882
f
GR
GS
[1 0 0 1 720.18512 182.5625] CT
0.302 GC
N
f-27201882
f
GR
GS
[1 0 0 1 730.82245 142.75] CT
0.302 GC
N
f-27201882
f
GR
GS
[1 0 0 1 738.53973 172.60938] CT
0.302 GC
N
f-27201882
f
GR
GS
[1 0 0 1 724.34167 139.19531] CT
0.302 GC
N
f-27201882
f
GR
GS
[1 0 0 1 728.23468 155.54688] CT
0.302 GC
N
f-27201882
f
GR
GS
[1 0 0 1 734.33435 146.30469] CT
0.302 GC
N
f-27201882
f
GR
GS
[1 0 0 1 829.48126 160.52344] CT
0.302 GC
N
f-27201882
f
GR
GS
[1 0 0 1 803.59637 167.63281] CT
0.302 GC
N
f-27201882
f
GR
GS
[1 0 0 1 822.573 164.07813] CT
0.302 GC
N
f-27201882
f
GR
GS
[1 0 0 1 817.85004 135.64063] CT
0.302 GC
N
f-27201882
f
GR
GS
[1 0 0 1 812.90302 178.29688] CT
0.302 GC
N
f-27201882
f
GR
GS
[1 0 0 1 828.34784 164.07813] CT
0.302 GC
N
f-27201882
f
GR
GS
[1 0 0 1 811.52454 174.74219] CT
0.302 GC
N
f-27201882
f
GR
GS
[1 0 0 1 804.19238 213.13281] CT
0.302 GC
N
f-27201882
f
GR
GS
[1 0 0 1 819.75415 153.41406] CT
0.302 GC
N
f-27201882
f
GR
GS
[1 0 0 1 819.43451 128.53125] CT
0.302 GC
N
f-27201882
f
GR
GS
[1 0 0 1 832.29462 188.96094] CT
0.302 GC
N
f-27201882
f
GR
GS
[1 0 0 1 802.41351 146.30469] CT
0.302 GC
N
f-27201882
f
GR
GS
[1 0 0 1 798.87195 139.19531] CT
0.302 GC
N
f-27201882
f
GR
GS
[1 0 0 1 818.86707 156.96875] CT
0.302 GC
N
f-27201882
f
GR
GS
[1 0 0 1 801.85773 171.1875] CT
0.302 GC
N
f-27201882
f
GR
GS
[1 0 0 1 812.01801 210.28906] CT
0.302 GC
N
f-27201882
f
GR
GS
[1 0 0 1 828.34216 206.73438] CT
0.302 GC
N
f-27201882
f
GR
GS
[1 0 0 1 816.83606 137.0625] CT
0.302 GC
N
f-27201882
f
GR
GS
[1 0 0 1 810.70087 148.4375] CT
0.302 GC
N
f-27201882
f
GR
GS
[1 0 0 1 805.19836 171.1875] CT
0.302 GC
N
f-27201882
f
GR
GS
[1 0 0 1 813.16479 235.17188] CT
0.302 GC
N
f-27201882
f
GR
GS
[1 0 0 1 830.81219 135.64063] CT
0.302 GC
N
f-27201882
f
GR
GS
[1 0 0 1 802.31036 192.51563] CT
0.302 GC
N
f-27201882
f
GR
GS
[1 0 0 1 827.41119 135.64063] CT
0.302 GC
N
f-27201882
f
GR
GS
[1 0 0 1 799.54865 164.07813] CT
0.302 GC
N
f-27201882
f
GR
GS
[1 0 0 1 821.75067 146.30469] CT
0.302 GC
N
f-27201882
f
GR
GS
[1 0 0 1 831.59277 174.74219] CT
0.302 GC
N
f-27201882
f
GR
GS
[1 0 0 1 807.7644 216.21355] CT
0.302 GC
N
f-27201882
f
GR
GS
[1 0 0 1 802.64447 121.42188] CT
0.302 GC
N
f-27201882
f
GR
GS
[1 0 0 1 821.53333 189.43489] CT
0.302 GC
N
f-27201882
f
GR
GS
[1 0 0 1 829.2113 146.30469] CT
0.302 GC
N
f-27201882
f
GR
GS
[1 0 0 1 818.98474 163.36719] CT
0.302 GC
N
f-27201882
f
GR
GS
[1 0 0 1 828.8869 86.11198] CT
0.302 GC
N
f-27201882
f
GR
GS
[1 0 0 1 804.68762 124.97656] CT
0.302 GC
N
f-27201882
f
GR
GS
[1 0 0 1 823.90155 156.96875] CT
0.302 GC
N
f-27201882
f
GR
GS
[1 0 0 1 809.92194 146.30469] CT
0.302 GC
N
f-27201882
f
GR
GS
[1 0 0 1 812.40045 206.73438] CT
0.302 GC
N
f-27201882
f
GR
GS
[1 0 0 1 803.39594 149.85938] CT
0.302 GC
N
f-27201882
f
GR
GS
[1 0 0 1 826.11328 131.78125] CT
0.302 GC
N
f-27201882
f
GR
GS
[1 0 0 1 819.46613 178.29688] CT
0.302 GC
N
f-27201882
f
GR
GS
[1 0 0 1 823.35822 136.92708] CT
0.302 GC
N
f-27201882
f
GR
GS
[1 0 0 1 825.63757 167.63281] CT
0.302 GC
N
f-27201882
f
GR
GS
[1 0 0 1 800.36487 196.07031] CT
0.302 GC
N
f-27201882
f
GR
GS
[1 0 0 1 830.62708 167.63281] CT
0.302 GC
N
f-27201882
f
GR
GS
[1 0 0 1 900.72949 135.64063] CT
0.302 GC
N
f-27201882
f
GR
GS
[1 0 0 1 909.55121 149.85938] CT
0.302 GC
N
f-27201882
f
GR
GS
[1 0 0 1 909.11487 149.85938] CT
0.302 GC
N
f-27201882
f
GR
GS
[1 0 0 1 912.15369 124.97656] CT
0.302 GC
N
f-27201882
f
GR
GS
[1 0 0 1 889.04767 156.96875] CT
0.302 GC
N
f-27201882
f
GR
GS
[1 0 0 1 899.35028 174.74219] CT
0.302 GC
N
f-27201882
f
GR
GS
[1 0 0 1 904.85742 142.75] CT
0.302 GC
N
f-27201882
f
GR
GS
[1 0 0 1 915.61481 185.40625] CT
0.302 GC
N
f-27201882
f
GR
GS
[1 0 0 1 912.28931 153.41406] CT
0.302 GC
N
f-27201882
f
GR
GS
[1 0 0 1 914.35577 178.29688] CT
0.302 GC
N
f-27201882
f
GR
GS
[1 0 0 1 912.96869 107.20313] CT
0.302 GC
N
f-27201882
f
GR
GS
[1 0 0 1 914.01312 149.85938] CT
0.302 GC
N
f-27201882
f
GR
GS
[1 0 0 1 884.93359 167.63281] CT
0.302 GC
N
f-27201882
f
GR
GS
[1 0 0 1 909.24304 156.96875] CT
0.302 GC
N
f-27201882
f
GR
GS
[1 0 0 1 888.99042 160.52344] CT
0.302 GC
N
f-27201882
f
GR
GS
[1 0 0 1 888.61633 212.18489] CT
0.302 GC
N
f-27201882
f
GR
GS
[1 0 0 1 904.44159 116.44531] CT
0.302 GC
N
f-27201882
f
GR
GS
[1 0 0 1 892.40344 155.78386] CT
0.302 GC
N
f-27201882
f
GR
GS
[1 0 0 1 894.78979 185.40625] CT
0.302 GC
N
f-27201882
f
GR
GS
[1 0 0 1 897.44885 124.97656] CT
0.302 GC
N
f-27201882
f
GR
GS
[1 0 0 1 897.60577 117.86719] CT
0.302 GC
N
f-27201882
f
GR
GS
[1 0 0 1 896.91455 203.17969] CT
0.302 GC
N
f-27201882
f
GR
GS
[1 0 0 1 904.57324 188.96094] CT
0.302 GC
N
f-27201882
f
GR
GS
[1 0 0 1 890.12964 124.97656] CT
0.302 GC
N
f-27201882
f
GR
GS
[1 0 0 1 886.92853 171.1875] CT
0.302 GC
N
f-27201882
f
GR
GS
[1 0 0 1 894.75659 167.63281] CT
0.302 GC
N
f-27201882
f
GR
GS
[1 0 0 1 910.0462 117.86719] CT
0.302 GC
N
f-27201882
f
GR
GS
[1 0 0 1 891.70605 156.96875] CT
0.302 GC
N
f-27201882
f
GR
GS
[1 0 0 1 909.04504 164.07813] CT
0.302 GC
N
f-27201882
f
GR
GS
[1 0 0 1 907.4165 174.74219] CT
0.302 GC
N
f-27201882
f
GR
GS
[1 0 0 1 911.91217 139.19531] CT
0.302 GC
N
f-27201882
f
GR
GS
[1 0 0 1 912.04572 181.85156] CT
0.302 GC
N
f-27201882
f
GR
GS
[1 0 0 1 893.73535 181.85156] CT
0.302 GC
N
f-27201882
f
GR
GS
[1 0 0 1 894.28339 174.74219] CT
0.302 GC
N
f-27201882
f
GR
GS
[1 0 0 1 901.60126 153.41406] CT
0.302 GC
N
f-27201882
f
GR
GS
[1 0 0 1 894.82898 142.75] CT
0.302 GC
N
f-27201882
f
GR
GS
[1 0 0 1 912.1781 146.30469] CT
0.302 GC
N
f-27201882
f
GR
GS
[1 0 0 1 911.44012 153.41406] CT
0.302 GC
N
f-27201882
f
GR
GS
[1 0 0 1 902.76471 181.14063] CT
0.302 GC
N
f-27201882
f
GR
GS
[1 0 0 1 892.69403 185.40625] CT
0.302 GC
N
f-27201882
f
GR
GS
[1 0 0 1 906.99689 180.42969] CT
0.302 GC
N
f-27201882
f
GR
GS
[1 0 0 1 891.69012 146.30469] CT
0.302 GC
N
f-27201882
f
GR
GS
[1 0 0 1 899.32007 160.52344] CT
0.302 GC
N
f-27201882
f
GR
GS
[1 0 0 1 896.85889 167.63281] CT
0.302 GC
N
f-27201882
f
GR
GS
1 LJ
4 LW
N
609.688 158.959 M
609.688 166.461 L
S
GR
GS
1 LJ
4 LW
N
609.688 158.959 M
609.688 158.959 L
S
GR
GS
1 LJ
4 LW
N
609.688 166.461 M
609.688 166.461 L
S
GR
GS
1 LJ
4 LW
N
695.313 145.198 M
695.313 150.069 L
S
GR
GS
1 LJ
4 LW
N
695.313 145.198 M
695.313 145.198 L
S
GR
GS
1 LJ
4 LW
N
695.313 150.069 M
695.313 150.069 L
S
GR
GS
1 LJ
4 LW
N
780.938 160.9 M
780.938 169.229 L
S
GR
GS
1 LJ
4 LW
N
780.938 160.9 M
780.938 160.9 L
S
GR
GS
1 LJ
4 LW
N
780.938 169.229 M
780.938 169.229 L
S
GR
GS
1 LJ
4 LW
N
866.563 166.296 M
866.563 172.095 L
S
GR
GS
1 LJ
4 LW
N
866.563 166.296 M
866.563 166.296 L
S
GR
GS
1 LJ
4 LW
N
866.563 172.095 M
866.563 172.095 L
S
GR
GS
1 LJ
4 LW
N
643.938 154.204 M
643.938 160.324 L
S
GR
GS
1 LJ
4 LW
N
643.938 154.204 M
643.938 154.204 L
S
GR
GS
1 LJ
4 LW
N
643.938 160.324 M
643.938 160.324 L
S
GR
GS
1 LJ
4 LW
N
729.563 144.87 M
729.563 152.04 L
S
GR
GS
1 LJ
4 LW
N
729.563 144.87 M
729.563 144.87 L
S
GR
GS
1 LJ
4 LW
N
729.563 152.04 M
729.563 152.04 L
S
GR
GS
1 LJ
4 LW
N
815.188 159.085 M
815.188 167.576 L
S
GR
GS
1 LJ
4 LW
N
815.188 159.085 M
815.188 159.085 L
S
GR
GS
1 LJ
4 LW
N
815.188 167.576 M
815.188 167.576 L
S
GR
GS
1 LJ
4 LW
N
900.813 155.01 M
900.813 161.868 L
S
GR
GS
1 LJ
4 LW
N
900.813 155.01 M
900.813 155.01 L
S
GR
GS
1 LJ
4 LW
N
900.813 161.868 M
900.813 161.868 L
S
GR
GS
[1 0 0 1 609.6875 57.4375] CT
/Helvetica-Bold 20 F
GS
[1 0 0 1 0 0] CT
-12.5 7.5 moveto 
1 -1 scale
(***) t 
GR
GR
GS
[1 0 0 1 643.9375 57.4375] CT
/Helvetica-Bold 20 F
GS
[1 0 0 1 0 0] CT
-12.5 7.5 moveto 
1 -1 scale
(***) t 
GR
GR
GS
[1 0 0 1 695.3125 57.4375] CT
/Helvetica 20 F
GS
[1 0 0 1 0 0] CT
-16.5 7.5 moveto 
1 -1 scale
(n.s.) t 
GR
GR
GS
[1 0 0 1 729.5625 57.4375] CT
/Helvetica 20 F
GS
[1 0 0 1 0 0] CT
-16.5 7.5 moveto 
1 -1 scale
(n.s.) t 
GR
GR
GS
[1 0 0 1 780.9375 57.4375] CT
/Helvetica-Bold 20 F
GS
[1 0 0 1 0 0] CT
-12.5 7.5 moveto 
1 -1 scale
(***) t 
GR
GR
GS
[1 0 0 1 815.1875 57.4375] CT
/Helvetica-Bold 20 F
GS
[1 0 0 1 0 0] CT
-12.5 7.5 moveto 
1 -1 scale
(***) t 
GR
GR
GS
[1 0 0 1 866.5625 57.4375] CT
/Helvetica-Bold 20 F
GS
[1 0 0 1 0 0] CT
-12.5 7.5 moveto 
1 -1 scale
(***) t 
GR
GR
GS
[1 0 0 1 900.8125 57.4375] CT
/Helvetica-Bold 20 F
GS
[1 0 0 1 0 0] CT
-12.5 7.5 moveto 
1 -1 scale
(***) t 
GR
GR
%%Trailer
%%Pages: 1
%%EOF
