utimesec    7815.580000
stimesec    7.436000
ru_maxrss   1335952
ru_ixrss    0
ru_idrss    0
ru_isrss    0
ru_minflt   4262716
ru_majflt   0
ru_nswap    0
ru_inblock  0
ru_oublock  62840
ru_msgsnd   0
ru_msgrcv   0
ru_nsignals 0
ru_nvcsw    18664
ru_nivcsw   12402
