utimesec    702.204000
stimesec    0.248000
ru_maxrss   384040
ru_ixrss    0
ru_idrss    0
ru_isrss    0
ru_minflt   95112
ru_majflt   0
ru_nswap    0
ru_inblock  0
ru_oublock  11968
ru_msgsnd   0
ru_msgrcv   0
ru_nsignals 0
ru_nvcsw    5908
ru_nivcsw   1324
