1 Left_Cerebral_Exterior 1.23 0.0  0
2 Left_Cerebral_White_Matter 0.99 0.0 103
3 Left_Cerebral_Cortex 1.31 0.0 76
4 Left_Lateral_Ventricle 1.00 0.0 21
5 Left_Inf_Lat_Vent 1.20 0.0 32
7 Left_Cerebellum_White_Matter 1.08 0.0 91
8 Left_Cerebellum_Cortex 1.30 0.0 72
9 Left_Thalamus 1.26 0.0 101
10 Left_Thalamus_Proper 1.00 0.0 89
11 Left_Caudate 1.03 0.0 71
12 Left_Putamen 1.04 0.0 78
13 Left_Pallidum 1.01 0.0 96
14 Third_Ventricle 0.89 0.0 23
15 Fourth_Ventricle 1.50 0.0 23
16 Brain_Stem 1.08 0.0 84
17 Left_Hippocampus 1.20 0.0 67
18 Left_Amygdala 1.22 0.0 69
24 CSF 1.23 0.0 44
26 Left_Accumbens_area 1.03 0.0 65
28 Left_VentralDC 1.10 0.0 94
40 Right_Cerebral_Exterior 1.23 0.0  0
41 Right_Cerebral_White_Matter 1.00 0.0 102
42 Right_Cerebral_Cortex 1.31 0.0 76
43 Right_Lateral_Ventricle 1.54 0.0 19
44 Right_Inf_Lat_Vent 1.26 0.0 29
46 Right_Cerebellum_White_Matter 1.05 0.0 89
47 Right_Cerebellum_Cortex 1.29 0.0 71
48 Right_Thalamus 1.26 0.0  0
49 Right_Thalamus_Proper 1.07 0.0 87
50 Right_Caudate 1.13 0.0 75
51 Right_Putamen 1.07 0.0 82
52 Right_Pallidum 1.04 0.0 100
53 Right_Hippocampus 1.26 0.0 70
54 Right_Amygdala 1.26 0.0 72
58 Right_Accumbens_area 1.13 0.0 74
60 Right_VentralDC 1.10 0.0 92
72 Fifth_Ventricle 1.23 0.0 38
75  1.23 0.0  0
76  1.23 0.0  0
77 WM_hypointensities 0.99 0.0 76
78 Left_WM_hypointensities 0.99 0.0  0
79 Right_WM_hypointensities 0.99 0.0  0
80 non_WM_hypointensities 0.99 0.0 54
81 Left_non_WM_hypointensities 0.99 0.0  0
82 Right_non_WM_hypointensities 0.99 0.0  0
186  0.99 0.0  0
187  0.99 0.0  0
