# AZS
# compute_vox2vox talsrcimg talsrcimg_to_711-2C_as_mni_average_305_t4 /opt/freesurfer/6.0.0/average/711-2C_as_mni_average_305
# $Id: compute_vox2vox.c,v 1.3 2010/02/27 01:41:53 nicks Exp $
  0.944618 -0.006802  0.004100    7.5105
  0.021061  0.865714 -0.244350   28.3560
  0.022635  0.145226  0.818492    3.2012
  0.000000  0.000000  0.000000    1.0000
