# AZS
# compute_vox2vox talsrcimg talsrcimg_to_711-2C_as_mni_average_305_t4 /opt/freesurfer/6.0.0/average/711-2C_as_mni_average_305
# $Id: compute_vox2vox.c,v 1.3 2010/02/27 01:41:53 nicks Exp $
  0.965191 -0.038723 -0.011613    8.5146
  0.028848  0.813205 -0.138655   14.4896
 -0.007898 -0.010423  0.900492   30.5560
  0.000000  0.000000  0.000000    1.0000
