2238
1.000000
0.500000
0.100000
9.989656805992126e-01 -1.952025853097439e-02 -4.106182977557182e-02 1.605549693107605e+00 
3.621289506554604e-02 -2.044714242219925e-01 9.782024025917053e-01 -4.693724513053894e-01 
-2.749073132872581e-02 -9.786776900291443e-01 -2.035530954599380e-01 -2.943660020828247e+00 
0 0 0 1
round
