# AZS
# compute_vox2vox talsrcimg talsrcimg_to_711-2C_as_mni_average_305_t4 /opt/freesurfer/6.0.0/average/711-2C_as_mni_average_305
# $Id: compute_vox2vox.c,v 1.3 2010/02/27 01:41:53 nicks Exp $
  0.984172  0.023380 -0.004525   -0.0058
 -0.032603  0.952633 -0.213684   16.1974
 -0.007451  0.214200  0.986715  -11.9041
  0.000000  0.000000  0.000000    1.0000
