# AZS
# compute_vox2vox talsrcimg talsrcimg_to_711-2C_as_mni_average_305_t4 /opt/freesurfer/6.0.0/average/711-2C_as_mni_average_305
# $Id: compute_vox2vox.c,v 1.3 2010/02/27 01:41:53 nicks Exp $
  0.979010  0.005502  0.013536   -0.4674
  0.005491  0.885900 -0.217912   18.4299
 -0.014039  0.117536  0.939633    5.7106
  0.000000  0.000000  0.000000    1.0000
