# AZS
# compute_vox2vox talsrcimg talsrcimg_to_711-2C_as_mni_average_305_t4 /opt/freesurfer/6.0.0/average/711-2C_as_mni_average_305
# $Id: compute_vox2vox.c,v 1.3 2010/02/27 01:41:53 nicks Exp $
  0.955827  0.064033 -0.053648    0.3604
 -0.073700  0.849222 -0.164903   24.2455
  0.022882  0.096489  0.899860    5.4532
  0.000000  0.000000  0.000000    1.0000
