1 Left_Cerebral_Exterior 1.34 0.0  0
2 Left_Cerebral_White_Matter 1.00 0.0 104
3 Left_Cerebral_Cortex 1.38 0.0 80
4 Left_Lateral_Ventricle 1.14 0.0 23
5 Left_Inf_Lat_Vent 1.23 0.0 33
7 Left_Cerebellum_White_Matter 1.09 0.0 92
8 Left_Cerebellum_Cortex 1.28 0.0 71
9 Left_Thalamus 1.30 0.0 102
10 Left_Thalamus_Proper 1.10 0.0 98
11 Left_Caudate 1.11 0.0 76
12 Left_Putamen 1.11 0.0 83
13 Left_Pallidum 1.03 0.0 97
14 Third_Ventricle 1.00 0.0 24
15 Fourth_Ventricle 1.62 0.0 24
16 Brain_Stem 1.10 0.0 86
17 Left_Hippocampus 1.23 0.0 69
18 Left_Amygdala 1.29 0.0 75
24 CSF 1.34 0.0 48
26 Left_Accumbens_area 1.11 0.0 69
28 Left_VentralDC 1.12 0.0 95
40 Right_Cerebral_Exterior 1.34 0.0  0
41 Right_Cerebral_White_Matter 1.00 0.0 102
42 Right_Cerebral_Cortex 1.36 0.0 79
43 Right_Lateral_Ventricle 1.63 0.0 21
44 Right_Inf_Lat_Vent 1.28 0.0 30
46 Right_Cerebellum_White_Matter 1.10 0.0 92
47 Right_Cerebellum_Cortex 1.31 0.0 72
48 Right_Thalamus 1.30 0.0  0
49 Right_Thalamus_Proper 1.10 0.0 89
50 Right_Caudate 1.24 0.0 81
51 Right_Putamen 1.10 0.0 83
52 Right_Pallidum 1.01 0.0 94
53 Right_Hippocampus 1.28 0.0 71
54 Right_Amygdala 1.25 0.0 72
58 Right_Accumbens_area 1.24 0.0 81
60 Right_VentralDC 1.12 0.0 98
72 Fifth_Ventricle 1.34 0.0 42
75  1.34 0.0  0
76  1.34 0.0  0
77 WM_hypointensities 1.00 0.0 76
78 Left_WM_hypointensities 1.00 0.0  0
79 Right_WM_hypointensities 1.00 0.0  0
80 non_WM_hypointensities 1.00 0.0 43
81 Left_non_WM_hypointensities 1.00 0.0  0
82 Right_non_WM_hypointensities 1.00 0.0  0
186  1.00 0.0  0
187  1.00 0.0  0
