utimesec    7698.804000
stimesec    10.324000
ru_maxrss   1338112
ru_ixrss    0
ru_idrss    0
ru_isrss    0
ru_minflt   5689823
ru_majflt   0
ru_nswap    0
ru_inblock  0
ru_oublock  63216
ru_msgsnd   0
ru_msgrcv   0
ru_nsignals 0
ru_nvcsw    19472
ru_nivcsw   10332
