1 Left_Cerebral_Exterior 1.23 0.0  0
2 Left_Cerebral_White_Matter 1.02 0.0 105
3 Left_Cerebral_Cortex 1.14 0.0 68
4 Left_Lateral_Ventricle 1.23 0.0 24
5 Left_Inf_Lat_Vent 1.18 0.0 38
7 Left_Cerebellum_White_Matter 1.10 0.0 92
8 Left_Cerebellum_Cortex 1.26 0.0 72
9 Left_Thalamus 1.20 0.0 113
10 Left_Thalamus_Proper 1.12 0.0 95
11 Left_Caudate 1.12 0.0 80
12 Left_Putamen 1.12 0.0 88
13 Left_Pallidum 1.04 0.0 97
14 Third_Ventricle 1.23 0.0 28
15 Fourth_Ventricle 0.98 0.0 20
16 Brain_Stem 1.07 0.0 85
17 Left_Hippocampus 1.18 0.0 69
18 Left_Amygdala 1.25 0.0 72
24 CSF 1.23 0.0 42
26 Left_Accumbens_area 1.12 0.0 70
28 Left_VentralDC 1.10 0.0 97
40 Right_Cerebral_Exterior 1.23 0.0  0
41 Right_Cerebral_White_Matter 1.01 0.0 103
42 Right_Cerebral_Cortex 1.18 0.0 69
43 Right_Lateral_Ventricle 1.50 0.0 24
44 Right_Inf_Lat_Vent 1.23 0.0 32
46 Right_Cerebellum_White_Matter 1.01 0.0 84
47 Right_Cerebellum_Cortex 1.30 0.0 73
48 Right_Thalamus 1.20 0.0  0
49 Right_Thalamus_Proper 1.12 0.0 93
50 Right_Caudate 1.13 0.0 76
51 Right_Putamen 1.14 0.0 90
52 Right_Pallidum 1.03 0.0 99
53 Right_Hippocampus 1.23 0.0 67
54 Right_Amygdala 1.21 0.0 67
58 Right_Accumbens_area 1.13 0.0 73
60 Right_VentralDC 1.09 0.0 93
72 Fifth_Ventricle 1.23 0.0 44
75  1.23 0.0  0
76  1.23 0.0  0
77 WM_hypointensities 1.02 0.0 78
78 Left_WM_hypointensities 1.02 0.0  0
79 Right_WM_hypointensities 1.02 0.0  0
80 non_WM_hypointensities 1.02 0.0 48
81 Left_non_WM_hypointensities 1.02 0.0  0
82 Right_non_WM_hypointensities 1.02 0.0  0
186  1.02 0.0  0
187  1.02 0.0  0
