Logfile for pctsurfcon
Tue Apr 10 20:11:26 CEST 2018
Tue Apr 10 20:11:26 CEST 2018
setenv SUBJECTS_DIR /home/mpib/LNDG/StateSwitch/WIP_anat/analyses/A_FreeSurfer/B_data/A_FreeSurferDirs
setenv SUBJECTS_DIR /home/mpib/LNDG/StateSwitch/WIP_anat/analyses/A_FreeSurfer/B_data/A_FreeSurferDirs
cd /home/mpib/LNDG/StateSwitch/WIP_anat/analyses/A_FreeSurfer/B_data/A_FreeSurferDirs/2222/scripts
cd /home/mpib/LNDG/StateSwitch/WIP_anat/analyses/A_FreeSurfer/B_data/A_FreeSurferDirs/2222/scripts
/opt/freesurfer/6.0.0/bin/pctsurfcon
/opt/freesurfer/6.0.0/bin/pctsurfcon
$Id: pctsurfcon,v 1.15 2016/02/12 21:43:15 zkaufman Exp $
$Id: pctsurfcon,v 1.15 2016/02/12 21:43:15 zkaufman Exp $
Linux ood-32 4.9.0-5-amd64 #1 SMP Debian 4.9.65-3+deb9u2 (2018-01-04) x86_64 GNU/Linux
Linux ood-32 4.9.0-5-amd64 #1 SMP Debian 4.9.65-3+deb9u2 (2018-01-04) x86_64 GNU/Linux
FREESURFER_HOME /opt/freesurfer/6.0.0
FREESURFER_HOME /opt/freesurfer/6.0.0
Cleaning up
Cleaning up
