utimesec    6193.284000
stimesec    10.512000
ru_maxrss   264636
ru_ixrss    0
ru_idrss    0
ru_isrss    0
ru_minflt   64758
ru_majflt   0
ru_nswap    0
ru_inblock  0
ru_oublock  10040
ru_msgsnd   0
ru_msgrcv   0
ru_nsignals 0
ru_nvcsw    715249
ru_nivcsw   153319
