status file for recon-all
Tue Apr 10 14:19:30 CEST 2018
#@# T2/FLAIR Input Tue Apr 10 14:19:57 CEST 2018
#@# MotionCor Tue Apr 10 14:21:25 CEST 2018
#@# Talairach Tue Apr 10 14:22:49 CEST 2018
#@# Talairach Failure Detection Tue Apr 10 14:35:56 CEST 2018
#@# Nu Intensity Correction Tue Apr 10 14:36:01 CEST 2018
#@# Intensity Normalization Tue Apr 10 14:54:13 CEST 2018
#@# Skull Stripping Tue Apr 10 14:56:54 CEST 2018
#@# EM Registration Tue Apr 10 15:01:30 CEST 2018
#@# CA Normalize Tue Apr 10 15:05:40 CEST 2018
#@# CA Reg Tue Apr 10 15:07:43 CEST 2018
