utimesec    567.024000
stimesec    0.256000
ru_maxrss   434276
ru_ixrss    0
ru_idrss    0
ru_isrss    0
ru_minflt   107605
ru_majflt   0
ru_nswap    0
ru_inblock  0
ru_oublock  13480
ru_msgsnd   0
ru_msgrcv   0
ru_nsignals 0
ru_nvcsw    5094
ru_nivcsw   1577
