# AZS
# compute_vox2vox talsrcimg talsrcimg_to_711-2C_as_mni_average_305_t4 /opt/freesurfer/6.0.0/average/711-2C_as_mni_average_305
# $Id: compute_vox2vox.c,v 1.3 2010/02/27 01:41:53 nicks Exp $
  1.033862  0.016623 -0.031093   -2.4186
 -0.035365  0.768323 -0.208734   43.7286
  0.002061  0.115381  0.849177   15.0986
  0.000000  0.000000  0.000000    1.0000
