1 Left_Cerebral_Exterior 0.44 0.0  0
2 Left_Cerebral_White_Matter 1.00 0.0 103
3 Left_Cerebral_Cortex 1.02 0.0 60
4 Left_Lateral_Ventricle 0.44 0.0  9
5 Left_Inf_Lat_Vent 1.10 0.0 35
7 Left_Cerebellum_White_Matter 0.96 0.0 81
8 Left_Cerebellum_Cortex 1.04 0.0 60
9 Left_Thalamus 1.11 0.0 104
10 Left_Thalamus_Proper 1.11 0.0 94
11 Left_Caudate 1.21 0.0 86
12 Left_Putamen 1.04 0.0 83
13 Left_Pallidum 1.02 0.0 95
14 Third_Ventricle 0.44 0.0 10
15 Fourth_Ventricle 0.44 0.0  9
16 Brain_Stem 1.10 0.0 88
17 Left_Hippocampus 1.10 0.0 64
18 Left_Amygdala 1.04 0.0 60
24 CSF 0.44 0.0 15
26 Left_Accumbens_area 1.21 0.0 75
28 Left_VentralDC 1.05 0.0 94
40 Right_Cerebral_Exterior 0.44 0.0  0
41 Right_Cerebral_White_Matter 1.04 0.0 106
42 Right_Cerebral_Cortex 1.26 0.0 73
43 Right_Lateral_Ventricle 0.44 0.0  9
44 Right_Inf_Lat_Vent 1.20 0.0 31
46 Right_Cerebellum_White_Matter 0.98 0.0 81
47 Right_Cerebellum_Cortex 1.18 0.0 66
48 Right_Thalamus 1.11 0.0  0
49 Right_Thalamus_Proper 1.12 0.0 93
50 Right_Caudate 1.21 0.0 86
51 Right_Putamen 1.10 0.0 87
52 Right_Pallidum 0.99 0.0 95
53 Right_Hippocampus 1.20 0.0 66
54 Right_Amygdala 1.04 0.0 60
58 Right_Accumbens_area 1.21 0.0 77
60 Right_VentralDC 1.01 0.0 87
72 Fifth_Ventricle 0.44 0.0 16
75  0.44 0.0  0
76  0.44 0.0  0
77 WM_hypointensities 1.02 0.0 78
78 Left_WM_hypointensities 1.02 0.0  0
79 Right_WM_hypointensities 1.02 0.0  0
80 non_WM_hypointensities 1.02 0.0 48
81 Left_non_WM_hypointensities 1.02 0.0  0
82 Right_non_WM_hypointensities 1.02 0.0  0
186  1.02 0.0  0
187  1.02 0.0  0
