1 Left_Cerebral_Exterior 1.07 0.0  0
2 Left_Cerebral_White_Matter 1.03 0.0 106
3 Left_Cerebral_Cortex 1.41 0.0 83
4 Left_Lateral_Ventricle 1.10 0.0 22
5 Left_Inf_Lat_Vent 1.22 0.0 39
7 Left_Cerebellum_White_Matter 1.05 0.0 89
8 Left_Cerebellum_Cortex 1.26 0.0 72
9 Left_Thalamus 1.32 0.0 124
10 Left_Thalamus_Proper 1.07 0.0 91
11 Left_Caudate 1.15 0.0 82
12 Left_Putamen 1.11 0.0 87
13 Left_Pallidum 1.03 0.0 96
14 Third_Ventricle 1.02 0.0 24
15 Fourth_Ventricle 0.93 0.0 19
16 Brain_Stem 1.05 0.0 84
17 Left_Hippocampus 1.22 0.0 70
18 Left_Amygdala 1.27 0.0 73
24 CSF 1.07 0.0 36
26 Left_Accumbens_area 1.15 0.0 72
28 Left_VentralDC 1.04 0.0 93
40 Right_Cerebral_Exterior 1.07 0.0  0
41 Right_Cerebral_White_Matter 1.02 0.0 104
42 Right_Cerebral_Cortex 1.46 0.0 84
43 Right_Lateral_Ventricle 1.24 0.0 20
44 Right_Inf_Lat_Vent 1.29 0.0 34
46 Right_Cerebellum_White_Matter 1.01 0.0 84
47 Right_Cerebellum_Cortex 1.30 0.0 73
48 Right_Thalamus 1.32 0.0  0
49 Right_Thalamus_Proper 1.09 0.0 90
50 Right_Caudate 1.20 0.0 80
51 Right_Putamen 1.10 0.0 87
52 Right_Pallidum 1.01 0.0 97
53 Right_Hippocampus 1.29 0.0 71
54 Right_Amygdala 1.25 0.0 70
58 Right_Accumbens_area 1.20 0.0 76
60 Right_VentralDC 1.09 0.0 93
72 Fifth_Ventricle 1.07 0.0 39
75  1.07 0.0  0
76  1.07 0.0  0
77 WM_hypointensities 1.03 0.0 78
78 Left_WM_hypointensities 1.03 0.0  0
79 Right_WM_hypointensities 1.03 0.0  0
80 non_WM_hypointensities 1.03 0.0 48
81 Left_non_WM_hypointensities 1.03 0.0  0
82 Right_non_WM_hypointensities 1.03 0.0  0
186  1.03 0.0  0
187  1.03 0.0  0
