utimesec    19.720000
stimesec    0.388000
ru_maxrss   829764
ru_ixrss    0
ru_idrss    0
ru_isrss    0
ru_minflt   212738
ru_majflt   0
ru_nswap    0
ru_inblock  0
ru_oublock  2296
ru_msgsnd   0
ru_msgrcv   0
ru_nsignals 0
ru_nvcsw    4644
ru_nivcsw   80
