# AZS
# compute_vox2vox talsrcimg talsrcimg_to_711-2C_as_mni_average_305_t4 /opt/freesurfer/6.0.0/average/711-2C_as_mni_average_305
# $Id: compute_vox2vox.c,v 1.3 2010/02/27 01:41:53 nicks Exp $
  0.977934 -0.004583 -0.061490    9.6567
 -0.007294  0.732287 -0.520298   80.3915
  0.044832  0.411539  0.716480  -18.9505
  0.000000  0.000000  0.000000    1.0000
