utimesec    842.152000
stimesec    0.236000
ru_maxrss   417464
ru_ixrss    0
ru_idrss    0
ru_isrss    0
ru_minflt   103543
ru_majflt   0
ru_nswap    0
ru_inblock  0
ru_oublock  12800
ru_msgsnd   0
ru_msgrcv   0
ru_nsignals 0
ru_nvcsw    5041
ru_nivcsw   1289
