# AZS
# compute_vox2vox talsrcimg talsrcimg_to_711-2C_as_mni_average_305_t4 /opt/freesurfer/6.0.0/average/711-2C_as_mni_average_305
# $Id: compute_vox2vox.c,v 1.3 2010/02/27 01:41:53 nicks Exp $
  0.947911  0.036235 -0.005260    3.5804
 -0.066289  0.741233 -0.357329   65.4661
 -0.031815  0.272278  0.817159   -6.1798
  0.000000  0.000000  0.000000    1.0000
