utimesec    632.656000
stimesec    1.268000
ru_maxrss   601528
ru_ixrss    0
ru_idrss    0
ru_isrss    0
ru_minflt   157971
ru_majflt   0
ru_nswap    0
ru_inblock  0
ru_oublock  40
ru_msgsnd   0
ru_msgrcv   0
ru_nsignals 0
ru_nvcsw    1682
ru_nivcsw   1222
