utimesec    2802.688000
stimesec    3.444000
ru_maxrss   271872
ru_ixrss    0
ru_idrss    0
ru_isrss    0
ru_minflt   66591
ru_majflt   0
ru_nswap    0
ru_inblock  0
ru_oublock  8824
ru_msgsnd   0
ru_msgrcv   0
ru_nsignals 0
ru_nvcsw    216079
ru_nivcsw   131625
