# This file contains the column, row, slice (CRS) and talirach XYZ (TAL)
# of the cutting planes for the corpus callosum (CC) and pons
# as generated by mri_fill. 
CC-CRS 127 120 146
CC-TAL   1.0  18.0   8.0
