Logfile for bbregister
Tue Apr 10 19:25:32 CEST 2018

setenv SUBJECTS_DIR /home/mpib/LNDG/StateSwitch/WIP_anat/analyses/A_FreeSurfer/B_data/A_FreeSurferDirs
cd /home/mpib/LNDG/StateSwitch/WIP_anat/analyses/A_FreeSurfer/B_data/A_FreeSurferDirs/1257/scripts
/opt/freesurfer/6.0.0/bin/bbregister --s 1257 --mov /home/mpib/LNDG/StateSwitch/WIP_anat/analyses/A_FreeSurfer/B_data/A_FreeSurferDirs/1257/mri/orig/T2raw.mgz --lta /home/mpib/LNDG/StateSwitch/WIP_anat/analyses/A_FreeSurfer/B_data/A_FreeSurferDirs/1257/mri/transforms/T2raw.auto.lta --init-coreg --T2

$Id: bbregister,v 1.75 2016/05/10 20:02:28 greve Exp $
Linux ood-41 4.9.0-5-amd64 #1 SMP Debian 4.9.65-3+deb9u2 (2018-01-04) x86_64 GNU/Linux
FREESURFER_HOME /opt/freesurfer/6.0.0
mri_convert /home/mpib/LNDG/StateSwitch/WIP_anat/analyses/A_FreeSurfer/B_data/A_FreeSurferDirs/1257/mri/orig/T2raw.mgz /home/mpib/LNDG/StateSwitch/WIP_anat/analyses/A_FreeSurfer/B_data/A_FreeSurferDirs/1257/mri/transforms/tmp.bbregister.23461/template.nii
mri_convert.bin /home/mpib/LNDG/StateSwitch/WIP_anat/analyses/A_FreeSurfer/B_data/A_FreeSurferDirs/1257/mri/orig/T2raw.mgz /home/mpib/LNDG/StateSwitch/WIP_anat/analyses/A_FreeSurfer/B_data/A_FreeSurferDirs/1257/mri/transforms/tmp.bbregister.23461/template.nii 
$Id: mri_convert.c,v 1.226 2016/02/26 16:15:24 mreuter Exp $
reading from /home/mpib/LNDG/StateSwitch/WIP_anat/analyses/A_FreeSurfer/B_data/A_FreeSurferDirs/1257/mri/orig/T2raw.mgz...
TR=3200.00, TE=0.00, TI=0.00, flip angle=0.00
i_ras = (-0.999816, 4.48001e-11, -0.0191975)
j_ras = (0.00207331, 0.994151, -0.107979)
k_ras = (-0.0190852, 0.107999, 0.993968)
writing to /home/mpib/LNDG/StateSwitch/WIP_anat/analyses/A_FreeSurfer/B_data/A_FreeSurferDirs/1257/mri/transforms/tmp.bbregister.23461/template.nii...
mri_coreg --s 1257 --mov /home/mpib/LNDG/StateSwitch/WIP_anat/analyses/A_FreeSurfer/B_data/A_FreeSurferDirs/1257/mri/transforms/tmp.bbregister.23461/template.nii --regdat /home/mpib/LNDG/StateSwitch/WIP_anat/analyses/A_FreeSurfer/B_data/A_FreeSurferDirs/1257/mri/transforms/tmp.bbregister.23461/reg.init.dat --reg /home/mpib/LNDG/StateSwitch/WIP_anat/analyses/A_FreeSurfer/B_data/A_FreeSurferDirs/1257/mri/transforms/tmp.bbregister.23461/mri_coreg.lta --nthreads 4 --dof 6 --sep 4 --ftol .0001 --linmintol .01 --no-ref-mask

$Id: mri_coreg.c,v 1.27 2016/04/30 15:11:49 greve Exp $
cwd /home/mpib/LNDG/StateSwitch/WIP_anat/analyses/A_FreeSurfer/B_data/A_FreeSurferDirs/1257/scripts
cmdline mri_coreg --s 1257 --mov /home/mpib/LNDG/StateSwitch/WIP_anat/analyses/A_FreeSurfer/B_data/A_FreeSurferDirs/1257/mri/transforms/tmp.bbregister.23461/template.nii --regdat /home/mpib/LNDG/StateSwitch/WIP_anat/analyses/A_FreeSurfer/B_data/A_FreeSurferDirs/1257/mri/transforms/tmp.bbregister.23461/reg.init.dat --reg /home/mpib/LNDG/StateSwitch/WIP_anat/analyses/A_FreeSurfer/B_data/A_FreeSurferDirs/1257/mri/transforms/tmp.bbregister.23461/mri_coreg.lta --nthreads 4 --dof 6 --sep 4 --ftol .0001 --linmintol .01 --no-ref-mask 
sysname  Linux
hostname ood-41
machine  x86_64
user     kosciessa
dof    6
nsep    1
cras0    1
ftol    0.000100
linmintol    0.010000
bf       1
bflim    30.000000
bfnsamp    30
SmoothRef 0
SatPct    99.990000
MovOOB 0
optschema 1
Reading in mov /home/mpib/LNDG/StateSwitch/WIP_anat/analyses/A_FreeSurfer/B_data/A_FreeSurferDirs/1257/mri/transforms/tmp.bbregister.23461/template.nii
Reading in ref /home/mpib/LNDG/StateSwitch/WIP_anat/analyses/A_FreeSurfer/B_data/A_FreeSurferDirs/1257/mri/brainmask.mgz
Setting cras translation parameters to align centers
Creating random numbers for coordinate dithering
Performing intensity dithering
Initial parameters  3.6691 -6.8903  3.0124  0.0000  0.0000  0.0000  1.0000  1.0000  1.0000  0.0000  0.0000  0.0000 
Separation list (1):  4   min = 4
DoSmoothing 1
DoCoordDither 1
DoIntensityDither 1
nitersmax 4
ftol 1.000e-04
linmintol 1.000e-02
SatPct 99.990000
Hist FWHM 7.000000 7.000000
nthreads 4
movsat = 520.0000
mov gstd 1.8914 1.9381 1.9381
Smoothing mov
refsat = 115.0000
ref gstd 1.8914 1.8914 1.8914
Smoothing ref
COREGpreproc() done
Testing if mov and target overlap
Init cost   -1.0475332422
nhits = 170135 out of 16777216, Percent Overlap:  64.9
Initial  RefRAS-to-MovRAS
 1.00000   0.00000   0.00000   3.66911;
 0.00000   1.00000   0.00000  -6.89034;
 0.00000   0.00000   1.00000   3.01241;
 0.00000   0.00000   0.00000   1.00000;
Initial  RefVox-to-MovVox
 0.99982   0.01920   0.00000  -42.42419;
-0.00415   0.21596   1.98830  -25.01456;
 0.03817  -1.98794   0.21600   476.55527;
 0.00000   0.00000   0.00000   1.00000;
sep = 4 -----------------------------------
COREGoptBruteForce() 30 1 30
Turning on MovOOB for BruteForce Search
#BF# sep= 4 iter=0 lim=30.0 delta=2.00   3.66911   1.10966   3.01241   0.00000   0.00000   2.00000   -1.0467993
Turning  MovOOB back off after brute force search


---------------------------------
Init Powel Params dof = 6
Starting OpenPowel2(), sep = 4
InitialCost        -1.0558887720 
#@#  4  188  3.66911 1.10966 3.01241 0.00000 0.00000 2.00000   -1.0558888
fs_powell::minimize
  nparams 6
  maxfev 4
  ftol   0.000100
  linmin_xtol_   0.010000
  powell nthiter 0: fret = -1.055889
#@#  4  193  3.05108 1.10966 3.01241 0.00000 0.00000 2.00000   -1.0559678
#@#  4  195  3.27078 1.10966 3.01241 0.00000 0.00000 2.00000   -1.0560045
#@#  4  197  3.26078 1.10966 3.01241 0.00000 0.00000 2.00000   -1.0560049
#@#  4  200  3.25078 1.10966 3.01241 0.00000 0.00000 2.00000   -1.0560055
#@#  4  208  3.25078 1.12002 3.01241 0.00000 0.00000 2.00000   -1.0560058
#@#  4  210  3.25078 1.13010 3.01241 0.00000 0.00000 2.00000   -1.0560061
#@#  4  216  3.25078 1.13010 3.39438 0.00000 0.00000 2.00000   -1.0560620
#@#  4  217  3.25078 1.13010 3.35097 0.00000 0.00000 2.00000   -1.0560625
#@#  4  218  3.25078 1.13010 3.36097 0.00000 0.00000 2.00000   -1.0560629
#@#  4  221  3.25078 1.13010 3.36097 1.00000 0.00000 2.00000   -1.0562588
#@#  4  225  3.25078 1.13010 3.36097 0.61803 0.00000 2.00000   -1.0562613
#@#  4  226  3.25078 1.13010 3.36097 0.79972 0.00000 2.00000   -1.0562729
#@#  4  233  3.25078 1.13010 3.36097 0.79972 -0.61803 2.00000   -1.0563340
#@#  4  235  3.25078 1.13010 3.36097 0.79972 -0.42566 2.00000   -1.0563493
#@#  4  236  3.25078 1.13010 3.36097 0.79972 -0.43566 2.00000   -1.0563501
#@#  4  237  3.25078 1.13010 3.36097 0.79972 -0.47741 2.00000   -1.0563523
  powell nthiter 1: fret = -1.056352
#@#  4  258  3.63274 1.13010 3.36097 0.79972 -0.48741 2.00000   -1.0564189
#@#  4  259  3.57718 1.13010 3.36097 0.79972 -0.48741 2.00000   -1.0564249
#@#  4  267  3.57718 0.51207 3.36097 0.79972 -0.48741 2.00000   -1.0565538
#@#  4  269  3.57718 0.64443 3.36097 0.79972 -0.48741 2.00000   -1.0565665
#@#  4  278  3.57718 0.64443 3.37097 0.79972 -0.48741 2.00000   -1.0565668
#@#  4  285  3.57718 0.64443 3.37097 1.18169 -0.48741 2.00000   -1.0566283
#@#  4  287  3.57718 0.64443 3.37097 1.16896 -0.48741 2.00000   -1.0566286
#@#  4  290  3.57718 0.64443 3.37097 1.14838 -0.48741 2.00000   -1.0566288
#@#  4  299  3.57718 0.64443 3.37097 1.13838 -0.74517 2.00000   -1.0566591
#@#  4  300  3.57718 0.64443 3.37097 1.13838 -0.73517 2.00000   -1.0566596
#@#  4  309  3.57718 0.64443 3.37097 1.13838 -0.73517 2.17721   -1.0566688
#@#  4  313  3.90358 0.15876 3.38097 1.47704 -0.98292 2.35443   -1.0567569
#@#  4  319  3.77891 0.34427 3.37715 1.34768 -0.88829 2.28674   -1.0567580
#@#  4  320  3.83705 0.25775 3.37893 1.40801 -0.93242 2.31831   -1.0567652
#@#  4  321  3.84032 0.25290 3.37903 1.41140 -0.93490 2.32008   -1.0567653
  powell nthiter 2: fret = -1.056765
#@#  4  330  3.79026 0.25290 3.37903 1.41140 -0.93490 2.32008   -1.0567664
#@#  4  342  3.79026 0.25290 3.37903 1.41140 -0.93490 2.23026   -1.0567671
#@#  4  344  3.79026 0.25290 3.37903 1.41140 -0.93490 2.21995   -1.0567675
#@#  4  348  3.79026 0.25290 3.37903 1.41140 -0.93490 2.20995   -1.0567676
#@#  4  355  3.79026 0.25290 3.42351 1.41140 -0.93490 2.20995   -1.0567683
#@#  4  357  3.79026 0.25290 3.40337 1.41140 -0.93490 2.20995   -1.0567685
#@#  4  366  3.79026 0.25290 3.40337 1.43771 -0.93490 2.20995   -1.0567688
#@#  4  376  3.79026 0.25290 3.40337 1.43771 -0.99774 2.20995   -1.0567706
#@#  4  377  3.79026 0.25290 3.40337 1.43771 -0.98774 2.20995   -1.0567707
#@#  4  385  3.84023 0.17855 3.40490 1.48955 -1.02566 2.23708   -1.0567729
Powell done niters total = 2
OptTimeSec  8.3 sec
OptTimeMin  0.14 min
nEvals 389
Final parameters   3.84022689   0.17854966   3.40490031   1.48954928  -1.02566266   2.23707628 
Final cost   -1.056772966876147
 

---------------------------------
mri_coreg utimesec    219.060000
mri_coreg stimesec    1.072000
mri_coreg ru_maxrss   767768
mri_coreg ru_ixrss    0
mri_coreg ru_idrss    0
mri_coreg ru_isrss    0
mri_coreg ru_minflt   521753
mri_coreg ru_majflt   0
mri_coreg ru_nswap    0
mri_coreg ru_inblock  0
mri_coreg ru_oublock  16
mri_coreg ru_msgsnd   0
mri_coreg ru_msgrcv   0
mri_coreg ru_nsignals 0
mri_coreg ru_nvcsw    2886
mri_coreg ru_nivcsw   530
Final  RefRAS-to-MovRAS
 0.99908   0.03903  -0.01790   3.84023;
-0.03856   0.99892   0.02599   0.17855;
 0.01890  -0.02528   0.99950   3.40490;
 0.00000   0.00000   0.00000   1.00000;
Final  RefVox-to-MovVox
 0.99926   0.00129  -0.03854  -35.94001;
 0.07660   0.16425   1.99177  -14.40362;
 0.00890  -1.99324   0.16403   488.81699;
 0.00000   0.00000   0.00000   1.00000;
Final parameters  3.8402  0.1785  3.4049  1.4895 -1.0257  2.2371 
nhits = 169925 out of 16777216, Percent Overlap:  64.8
mri_coreg RunTimeSec 86.9 sec
To check run:
   tkregisterfv --mov /home/mpib/LNDG/StateSwitch/WIP_anat/analyses/A_FreeSurfer/B_data/A_FreeSurferDirs/1257/mri/transforms/tmp.bbregister.23461/template.nii --targ /home/mpib/LNDG/StateSwitch/WIP_anat/analyses/A_FreeSurfer/B_data/A_FreeSurferDirs/1257/mri/brainmask.mgz --reg /home/mpib/LNDG/StateSwitch/WIP_anat/analyses/A_FreeSurfer/B_data/A_FreeSurferDirs/1257/mri/transforms/tmp.bbregister.23461/mri_coreg.lta --s 1257 --surfs 

mri_coreg done

mri_segreg --mov /home/mpib/LNDG/StateSwitch/WIP_anat/analyses/A_FreeSurfer/B_data/A_FreeSurferDirs/1257/mri/transforms/tmp.bbregister.23461/template.nii --init-reg /home/mpib/LNDG/StateSwitch/WIP_anat/analyses/A_FreeSurfer/B_data/A_FreeSurferDirs/1257/mri/transforms/tmp.bbregister.23461/reg.init.dat --out-reg /home/mpib/LNDG/StateSwitch/WIP_anat/analyses/A_FreeSurfer/B_data/A_FreeSurferDirs/1257/mri/transforms/tmp.bbregister.23461/bbr.pass1.dat --subsamp-brute 100 --subsamp 100 --tol 1e-4 --tol1d 1e-3 --brute -4 4 4 --surf white --gm-proj-frac 0.5 --gm-gt-wm 0.5
$Id: mri_segreg.c,v 1.113 2016/05/10 03:23:20 greve Exp $
setenv SUBJECTS_DIR /home/mpib/LNDG/StateSwitch/WIP_anat/analyses/A_FreeSurfer/B_data/A_FreeSurferDirs
cd /home/mpib/LNDG/StateSwitch/WIP_anat/analyses/A_FreeSurfer/B_data/A_FreeSurferDirs/1257/scripts
mri_segreg --mov /home/mpib/LNDG/StateSwitch/WIP_anat/analyses/A_FreeSurfer/B_data/A_FreeSurferDirs/1257/mri/transforms/tmp.bbregister.23461/template.nii --init-reg /home/mpib/LNDG/StateSwitch/WIP_anat/analyses/A_FreeSurfer/B_data/A_FreeSurferDirs/1257/mri/transforms/tmp.bbregister.23461/reg.init.dat --out-reg /home/mpib/LNDG/StateSwitch/WIP_anat/analyses/A_FreeSurfer/B_data/A_FreeSurferDirs/1257/mri/transforms/tmp.bbregister.23461/bbr.pass1.dat --subsamp-brute 100 --subsamp 100 --tol 1e-4 --tol1d 1e-3 --brute -4 4 4 --surf white --gm-proj-frac 0.5 --gm-gt-wm 0.5 
sysname  Linux
hostname ood-41
machine  x86_64
user     kosciessa
movvol /home/mpib/LNDG/StateSwitch/WIP_anat/analyses/A_FreeSurfer/B_data/A_FreeSurferDirs/1257/mri/transforms/tmp.bbregister.23461/template.nii
regfile /home/mpib/LNDG/StateSwitch/WIP_anat/analyses/A_FreeSurfer/B_data/A_FreeSurferDirs/1257/mri/transforms/tmp.bbregister.23461/reg.init.dat
subject 1257
dof 6
outregfile /home/mpib/LNDG/StateSwitch/WIP_anat/analyses/A_FreeSurfer/B_data/A_FreeSurferDirs/1257/mri/transforms/tmp.bbregister.23461/bbr.pass1.dat
UseMask 0
UseLH 1
UseRH 1
nsubsamp 100
PenaltySign  -1
PenaltySlope 0.500000
PenaltyCenter 0.000000
surfname white
GMProjFrac 0.500000
WMProjAbs 2.000000
lhcostfile (null)
rhcostfile (null)
interp  trilinear (1)
frame  0
TolPowell 0.000100
nMaxItersPowell 36
n1dmin  3
Profile   0
Gdiag_no  -1
AddNoise  0 (0)
SynthSeed 1523829708
TransRandMax 0.000000
RotRandMax 0.000000
Translations 0.000000 0.000000 0.000000
Rotations   0.000000 0.000000 0.000000
Input reg
 0.99926   0.03854   0.00129   0.80249;
-0.00445   0.08201   0.99662  -0.09164;
 0.03830  -0.99589   0.08212  -7.68588;
 0.00000   0.00000   0.00000   1.00000;

Loading mov
Projecting LH Surfs
Loading lh.white surf
Loading lh.thickness for GM
GM Proj: 1 0.500000 2.000000
WM Proj: 0 0.500000 2.000000
Projecting RH Surfs
Loading rh.white surf
Loading rh.thickness for GM
Projecting RH Surfs
Using lh.cortex.label
Using rh.cortex.label
Computing relative cost
 0  -25.0 -25.0 -25.0   0.997414
 1  -25.0 -25.0  25.0   0.994661
 2  -25.0  25.0 -25.0   0.985691
 3  -25.0  25.0  25.0   1.021123
 4   25.0 -25.0 -25.0   1.002116
 5   25.0 -25.0  25.0   1.020104
 6   25.0  25.0 -25.0   1.021571
 7   25.0  25.0  25.0   0.999911
REL:  8  0.167153    8.042590  1.005324 rel = 0.166268 
Initial costs ----------------
Number of surface hits 2644
WM  Intensity   146.1371 +/-  27.5822
Ctx Intensity   190.2527 +/-  34.6693
Pct Contrast     25.9655 +/-  18.6250
Cost   0.1672
RelCost   0.1663

------------------------------------
Brute force preopt -4 4 4, n = 729
     0  -4.0000  -4.0000  -4.0000  -4.0000  -4.0000  -4.0000      0.9635   0.9635  0.0
     1  -4.0000  -4.0000  -4.0000  -4.0000  -4.0000   0.0000      0.9463   0.9463  0.0
     6  -4.0000  -4.0000  -4.0000  -4.0000   4.0000  -4.0000      0.9378   0.9378  0.0
     7  -4.0000  -4.0000  -4.0000  -4.0000   4.0000   0.0000      0.9109   0.9109  0.0
    15  -4.0000  -4.0000  -4.0000   0.0000   4.0000  -4.0000      0.8481   0.8481  0.0
    21  -4.0000  -4.0000  -4.0000   4.0000   0.0000  -4.0000      0.8294   0.8294  0.0
    39  -4.0000  -4.0000   0.0000   0.0000   0.0000  -4.0000      0.8257   0.8257  0.0
   102  -4.0000   0.0000  -4.0000   4.0000   0.0000  -4.0000      0.7779   0.7779  0.0
   120  -4.0000   0.0000   0.0000   0.0000   0.0000  -4.0000      0.7190   0.7190  0.0
   346   0.0000   0.0000  -4.0000   4.0000   0.0000   0.0000      0.6736   0.6736  0.0
   364   0.0000   0.0000   0.0000   0.0000   0.0000   0.0000      0.1672   0.1672  0.0
Brute Force --------------------------
Min cost was 0.167153
Number of iterations   729
Search time 1.634000 sec
Parameters at best (transmm, rotdeg)
  0.000   0.000   0.000  0.000  0.000  0.000 
--------------------------------------------

Starting Powell Minimization
Init Powel Params dof = 6
0 0
1 0
2 0
3 0
4 0
5 0
fs_powell::minimize
  nparams 6
  maxfev 36
  ftol   0.000100
  linmin_xtol_   0.001000
  powell nthiter 0: fret = 0.167153
   8 -0.019  0.000  0.000  0.000  0.000  0.000   0.1670881939
   9 -0.037  0.000  0.000  0.000  0.000  0.000   0.1669283057
  10 -0.070  0.000  0.000  0.000  0.000  0.000   0.1667259403
  12 -0.071  0.000  0.000  0.000  0.000  0.000   0.1667189143
  13 -0.076  0.000  0.000  0.000  0.000  0.000   0.1667051172
  15 -0.075  0.000  0.000  0.000  0.000  0.000   0.1667037531
  16 -0.074  0.000  0.000  0.000  0.000  0.000   0.1667037240
  22 -0.074 -0.618  0.000  0.000  0.000  0.000   0.1311233287
  24 -0.074 -0.532  0.000  0.000  0.000  0.000   0.1306712336
  25 -0.074 -0.557  0.000  0.000  0.000  0.000   0.1305672865
  26 -0.074 -0.558  0.000  0.000  0.000  0.000   0.1305648544
  29 -0.074 -0.559  0.000  0.000  0.000  0.000   0.1305643193
  35 -0.074 -0.559  0.382  0.000  0.000  0.000   0.1236868496
  36 -0.074 -0.559  0.284  0.000  0.000  0.000   0.1207161203
  39 -0.074 -0.559  0.275  0.000  0.000  0.000   0.1206905505
  41 -0.074 -0.559  0.278  0.000  0.000  0.000   0.1206806639
  52 -0.074 -0.559  0.278 -0.001  0.000  0.000   0.1206661701
  53 -0.074 -0.559  0.278 -0.004  0.000  0.000   0.1206508806
  55 -0.074 -0.559  0.278 -0.003  0.000  0.000   0.1206498251
  64 -0.074 -0.559  0.278 -0.003 -0.001  0.000   0.1206464888
  65 -0.074 -0.559  0.278 -0.003 -0.010  0.000   0.1206417144
  67 -0.074 -0.559  0.278 -0.003 -0.006  0.000   0.1206370129
  68 -0.074 -0.559  0.278 -0.003 -0.005  0.000   0.1206355080
  76 -0.074 -0.559  0.278 -0.003 -0.005  0.105   0.1189125875
  77 -0.074 -0.559  0.278 -0.003 -0.005  0.119   0.1186011197
  79 -0.074 -0.559  0.278 -0.003 -0.005  0.153   0.1181314729
  81 -0.074 -0.559  0.278 -0.003 -0.005  0.157   0.1181224424
  82 -0.074 -0.559  0.278 -0.003 -0.005  0.158   0.1181214415
  83 -0.074 -0.559  0.278 -0.003 -0.005  0.159   0.1181212697
  powell nthiter 1: fret = 0.118121
  96 -0.038 -0.559  0.278 -0.003 -0.005  0.159   0.1180320676
  97 -0.049 -0.559  0.278 -0.003 -0.005  0.159   0.1178923395
  98 -0.054 -0.559  0.278 -0.003 -0.005  0.159   0.1178641105
  99 -0.057 -0.559  0.278 -0.003 -0.005  0.159   0.1178548422
 101 -0.058 -0.559  0.278 -0.003 -0.005  0.159   0.1178544476
 110 -0.058 -0.591  0.278 -0.003 -0.005  0.159   0.1176199822
 111 -0.058 -0.587  0.278 -0.003 -0.005  0.159   0.1175714452
 112 -0.058 -0.580  0.278 -0.003 -0.005  0.159   0.1175455233
 114 -0.058 -0.582  0.278 -0.003 -0.005  0.159   0.1175420473
 125 -0.058 -0.582  0.282 -0.003 -0.005  0.159   0.1175150921
 138 -0.058 -0.582  0.282  0.007 -0.005  0.159   0.1173340882
 140 -0.058 -0.582  0.282  0.005 -0.005  0.159   0.1173184858
 151 -0.058 -0.582  0.282  0.005 -0.013  0.159   0.1170972753
 152 -0.058 -0.582  0.282  0.005 -0.029  0.159   0.1170070991
 154 -0.058 -0.582  0.282  0.005 -0.026  0.159   0.1169974016
 165 -0.058 -0.582  0.282  0.005 -0.026  0.169   0.1168704304
 166 -0.058 -0.582  0.282  0.005 -0.026  0.173   0.1168586071
 167 -0.058 -0.582  0.282  0.005 -0.026  0.172   0.1168579355
  powell nthiter 2: fret = 0.116858
 180 -0.057 -0.582  0.282  0.005 -0.026  0.172   0.1168431113
 181 -0.050 -0.582  0.282  0.005 -0.026  0.172   0.1168244323
 183 -0.052 -0.582  0.282  0.005 -0.026  0.172   0.1168226800
 184 -0.053 -0.582  0.282  0.005 -0.026  0.172   0.1168225149
 195 -0.053 -0.568  0.282  0.005 -0.026  0.172   0.1167459650
 197 -0.053 -0.572  0.282  0.005 -0.026  0.172   0.1167344676
 208 -0.053 -0.572  0.279  0.005 -0.026  0.172   0.1167061854
 209 -0.053 -0.572  0.277  0.005 -0.026  0.172   0.1167030971
 219 -0.053 -0.572  0.277  0.006 -0.026  0.172   0.1166610194
 220 -0.053 -0.572  0.277  0.018 -0.026  0.172   0.1166042395
 222 -0.053 -0.572  0.277  0.013 -0.026  0.172   0.1165415468
 232 -0.053 -0.572  0.277  0.013 -0.031  0.172   0.1165384709
 233 -0.053 -0.572  0.277  0.013 -0.030  0.172   0.1165352589
 234 -0.053 -0.572  0.277  0.013 -0.029  0.172   0.1165338931
 245 -0.053 -0.572  0.277  0.013 -0.029  0.175   0.1165302238
 246 -0.053 -0.572  0.277  0.013 -0.029  0.174   0.1165296183
 248 -0.047 -0.562  0.273  0.020 -0.032  0.176   0.1162039618
 251 -0.037 -0.546  0.266  0.033 -0.037  0.180   0.1157471851
 255 -0.030 -0.535  0.261  0.041 -0.041  0.182   0.1155849471
 256 -0.029 -0.532  0.259  0.044 -0.042  0.183   0.1155753027
 258 -0.029 -0.532  0.259  0.044 -0.042  0.183   0.1155752722
 260 -0.029 -0.532  0.259  0.044 -0.042  0.183   0.1155751234
 262 -0.029 -0.532  0.259  0.044 -0.042  0.183   0.1155750445
  powell nthiter 3: fret = 0.115575
 273 -0.024 -0.532  0.259  0.044 -0.042  0.183   0.1155529976
 274 -0.023 -0.532  0.259  0.044 -0.042  0.183   0.1155522026
 285 -0.023 -0.535  0.259  0.044 -0.042  0.183   0.1155473416
 286 -0.023 -0.534  0.259  0.044 -0.042  0.183   0.1155454951
 296 -0.023 -0.534  0.264  0.044 -0.042  0.183   0.1155354133
 307 -0.023 -0.534  0.264  0.044 -0.042  0.192   0.1153696276
 308 -0.023 -0.534  0.264  0.044 -0.042  0.199   0.1153344495
 309 -0.023 -0.534  0.264  0.044 -0.042  0.198   0.1153339426
 318 -0.023 -0.534  0.264  0.044 -0.044  0.198   0.1153133363
 320 -0.023 -0.534  0.264  0.044 -0.052  0.198   0.1152510953
 321 -0.023 -0.534  0.264  0.044 -0.053  0.198   0.1152509310
 328 -0.021 -0.530  0.263  0.047 -0.055  0.198   0.1152272371
 330 -0.020 -0.530  0.262  0.047 -0.055  0.198   0.1152269842
 333 -0.020 -0.529  0.262  0.047 -0.055  0.199   0.1152265835
  powell nthiter 4: fret = 0.115227
 346 -0.001 -0.529  0.262  0.047 -0.055  0.199   0.1151228333
 347 -0.004 -0.529  0.262  0.047 -0.055  0.199   0.1150962711
 348 -0.008 -0.529  0.262  0.047 -0.055  0.199   0.1150783488
 361 -0.008 -0.531  0.262  0.047 -0.055  0.199   0.1150757482
 371 -0.008 -0.531  0.268  0.047 -0.055  0.199   0.1150599852
 372 -0.008 -0.531  0.269  0.047 -0.055  0.199   0.1150593542
 382 -0.008 -0.531  0.269  0.047 -0.055  0.201   0.1150276912
 383 -0.008 -0.531  0.269  0.047 -0.055  0.208   0.1150116552
 385 -0.008 -0.531  0.269  0.047 -0.055  0.205   0.1150034360
 397 -0.008 -0.531  0.269  0.047 -0.059  0.205   0.1149984961
 398 -0.008 -0.531  0.269  0.047 -0.058  0.205   0.1149982148
 406 -0.009 -0.532  0.269  0.046 -0.057  0.205   0.1149960210
 408 -0.009 -0.532  0.269  0.046 -0.057  0.205   0.1149959249
 413 -0.009 -0.532  0.269  0.046 -0.057  0.205   0.1149956996
 416 -0.009 -0.532  0.269  0.046 -0.057  0.205   0.1149956810
 417  0.003 -0.535  0.276  0.045 -0.060  0.212   0.1148582703
 420  0.021 -0.539  0.288  0.043 -0.063  0.222   0.1148243398
 421  0.015 -0.538  0.284  0.044 -0.062  0.218   0.1148114184
 425  0.014 -0.538  0.283  0.044 -0.062  0.218   0.1148114182
 426  0.014 -0.538  0.283  0.044 -0.062  0.218   0.1148112613
  powell nthiter 5: fret = 0.114811
 437  0.014 -0.538  0.284  0.044 -0.062  0.218   0.1148111573
 438  0.014 -0.538  0.284  0.043 -0.062  0.218   0.1148109458
 453  0.014 -0.533  0.284  0.043 -0.062  0.218   0.1147869854
 464  0.014 -0.533  0.282  0.043 -0.062  0.218   0.1147836966
 465  0.014 -0.533  0.281  0.043 -0.062  0.218   0.1147827519
 478  0.014 -0.533  0.281  0.043 -0.062  0.219   0.1147816866
 488  0.014 -0.533  0.281  0.043 -0.065  0.219   0.1147760903
 489  0.014 -0.533  0.281  0.043 -0.064  0.219   0.1147754018
 496  0.019 -0.534  0.284  0.043 -0.065  0.222   0.1147684624
 497  0.019 -0.534  0.284  0.043 -0.065  0.222   0.1147681304
  powell nthiter 6: fret = 0.114768
 511  0.017 -0.537  0.285  0.041 -0.064  0.221   0.1147583799
 518  0.017 -0.537  0.285  0.041 -0.064  0.221   0.1147583496
 530  0.017 -0.533  0.285  0.041 -0.064  0.221   0.1147454353
 553  0.017 -0.533  0.285  0.041 -0.064  0.220   0.1147451222
 565  0.017 -0.533  0.285  0.041 -0.067  0.220   0.1147429269
 567  0.017 -0.533  0.285  0.041 -0.066  0.220   0.1147421813
 573  0.021 -0.534  0.288  0.040 -0.067  0.223   0.1147408133
 574  0.020 -0.534  0.286  0.041 -0.066  0.222   0.1147402872
 575  0.020 -0.534  0.287  0.041 -0.066  0.222   0.1147399882
 577  0.020 -0.534  0.287  0.041 -0.066  0.222   0.1147399562
 580  0.020 -0.534  0.287  0.041 -0.066  0.222   0.1147396407
 582  0.021 -0.534  0.290  0.038 -0.068  0.222   0.1147179685
 585  0.024 -0.534  0.295  0.034 -0.070  0.222   0.1147073732
  powell nthiter 7: fret = 0.114707
 608  0.023 -0.535  0.295  0.033 -0.069  0.222   0.1147064588
 621  0.034 -0.538  0.302  0.032 -0.072  0.228   0.1146939748
 628  0.035 -0.538  0.302  0.032 -0.072  0.229   0.1146939206
 629  0.035 -0.538  0.303  0.032 -0.072  0.229   0.1146934545
 644  0.035 -0.538  0.312  0.032 -0.072  0.229   0.1146803112
 646  0.035 -0.538  0.309  0.032 -0.072  0.229   0.1146666916
 658  0.035 -0.538  0.309  0.032 -0.072  0.232   0.1146574987
 659  0.035 -0.538  0.309  0.032 -0.072  0.231   0.1146566212
 670  0.035 -0.538  0.309  0.032 -0.079  0.231   0.1146185470
 674  0.036 -0.538  0.312  0.030 -0.080  0.232   0.1146180121
 678  0.036 -0.538  0.310  0.031 -0.080  0.231   0.1146163858
 679  0.035 -0.538  0.310  0.031 -0.079  0.231   0.1146161810
 684  0.035 -0.538  0.310  0.031 -0.079  0.231   0.1146158101
 688  0.035 -0.538  0.310  0.031 -0.079  0.231   0.1146156007
  powell nthiter 8: fret = 0.114616
 710  0.047 -0.541  0.317  0.030 -0.082  0.238   0.1146140379
 714  0.042 -0.540  0.314  0.031 -0.081  0.235   0.1145987312
 732  0.042 -0.540  0.315  0.031 -0.081  0.235   0.1145981533
 763  0.042 -0.540  0.315  0.031 -0.081  0.235   0.1145979403
 764  0.042 -0.540  0.315  0.031 -0.081  0.235   0.1145977870
 765  0.042 -0.540  0.314  0.031 -0.081  0.235   0.1145971410
 772  0.042 -0.540  0.314  0.031 -0.081  0.235   0.1145971168
  powell nthiter 9: fret = 0.114597
 781  0.041 -0.541  0.315  0.030 -0.080  0.235   0.1145921733
 782  0.041 -0.541  0.315  0.030 -0.080  0.235   0.1145920437
 784  0.041 -0.541  0.315  0.030 -0.080  0.235   0.1145918816
 794  0.040 -0.541  0.314  0.030 -0.080  0.235   0.1145914462
 795  0.040 -0.541  0.314  0.030 -0.080  0.235   0.1145911426
 797  0.040 -0.541  0.314  0.030 -0.080  0.235   0.1145908886
 822  0.040 -0.541  0.314  0.030 -0.080  0.234   0.1145902677
 834  0.040 -0.541  0.314  0.030 -0.082  0.234   0.1145876375
Powell done niters = 9
Computing relative cost
 0  -25.0 -25.0 -25.0   0.980677
 1  -25.0 -25.0  25.0   0.993728
 2  -25.0  25.0 -25.0   0.980474
 3  -25.0  25.0  25.0   1.036611
 4   25.0 -25.0 -25.0   1.006406
 5   25.0 -25.0  25.0   0.993018
 6   25.0  25.0 -25.0   1.028783
 7   25.0  25.0  25.0   0.995539
REL:  8  0.114588    8.015237  1.001905 rel = 0.11437 
Number of iterations     9
Min cost was 0.114588
Number of FunctionCalls   850
TolPowell 0.000100
nMaxItersPowell 36
OptimizationTime 1.372000 sec
Parameters at optimum (transmm)  0.04025 -0.54095  0.31432
Parameters at optimum (rotdeg)  0.03025 -0.08219  0.23375 
Final costs ----------------
Number of surface hits 2644
WM  Intensity   145.6291 +/-  26.5491
Ctx Intensity   190.6069 +/-  32.7702
Pct Contrast     26.6176 +/-  17.2771
Cost   0.1146
RelCost   0.1663
Reg at min cost was 
 0.99921   0.03963  -0.00289   0.85411;
-0.00039   0.08270   0.99657  -0.62521;
 0.03973  -0.99579   0.08265  -7.37046;
 0.00000   0.00000   0.00000   1.00000;

Writing optimal reg to /home/mpib/LNDG/StateSwitch/WIP_anat/analyses/A_FreeSurfer/B_data/A_FreeSurferDirs/1257/mri/transforms/tmp.bbregister.23461/bbr.pass1.dat, type = 14 
Original Reg 
 0.99926   0.03854   0.00129   0.80249;
-0.00445   0.08201   0.99662  -0.09164;
 0.03830  -0.99589   0.08212  -7.68588;
 0.00000   0.00000   0.00000   1.00000;

Original Reg - Optimal Reg
 0.00005  -0.00109   0.00418  -0.05162;
-0.00406  -0.00069   0.00005   0.53357;
-0.00143  -0.00010  -0.00053  -0.31543;
 0.00000   0.00000   0.00000   0.00000;

Computing change in lh position
LH rmsDiffMean 0.740973
Computing change in rh position
Surface-RMS-Diff-mm 0.665626 0.093482 0.869880
mri_segreg done
mri_segreg --mov /home/mpib/LNDG/StateSwitch/WIP_anat/analyses/A_FreeSurfer/B_data/A_FreeSurferDirs/1257/mri/transforms/tmp.bbregister.23461/template.nii --init-reg /home/mpib/LNDG/StateSwitch/WIP_anat/analyses/A_FreeSurfer/B_data/A_FreeSurferDirs/1257/mri/transforms/tmp.bbregister.23461/bbr.pass1.dat --out-reg /home/mpib/LNDG/StateSwitch/WIP_anat/analyses/A_FreeSurfer/B_data/A_FreeSurferDirs/1257/mri/transforms/T2raw.auto.dat --interp trilinear --wm-proj-abs 2 --tol 1e-8 --tol1d 1e-3 --c0 0 --mincost /home/mpib/LNDG/StateSwitch/WIP_anat/analyses/A_FreeSurfer/B_data/A_FreeSurferDirs/1257/mri/transforms/T2raw.auto.dat.mincost --dof 6 --nmax 36 --param /home/mpib/LNDG/StateSwitch/WIP_anat/analyses/A_FreeSurfer/B_data/A_FreeSurferDirs/1257/mri/transforms/T2raw.auto.dat.param --surf white --brute -0.1 0.1 0.1 --cur-reg /home/mpib/LNDG/StateSwitch/WIP_anat/analyses/A_FreeSurfer/B_data/A_FreeSurferDirs/1257/mri/transforms/tmp.bbregister.23461/reg.curopt.dat --gm-proj-frac 0.5 --nsub 1 --gm-gt-wm 0.5
$Id: mri_segreg.c,v 1.113 2016/05/10 03:23:20 greve Exp $
setenv SUBJECTS_DIR /home/mpib/LNDG/StateSwitch/WIP_anat/analyses/A_FreeSurfer/B_data/A_FreeSurferDirs
cd /home/mpib/LNDG/StateSwitch/WIP_anat/analyses/A_FreeSurfer/B_data/A_FreeSurferDirs/1257/scripts
mri_segreg --mov /home/mpib/LNDG/StateSwitch/WIP_anat/analyses/A_FreeSurfer/B_data/A_FreeSurferDirs/1257/mri/transforms/tmp.bbregister.23461/template.nii --init-reg /home/mpib/LNDG/StateSwitch/WIP_anat/analyses/A_FreeSurfer/B_data/A_FreeSurferDirs/1257/mri/transforms/tmp.bbregister.23461/bbr.pass1.dat --out-reg /home/mpib/LNDG/StateSwitch/WIP_anat/analyses/A_FreeSurfer/B_data/A_FreeSurferDirs/1257/mri/transforms/T2raw.auto.dat --interp trilinear --wm-proj-abs 2 --tol 1e-8 --tol1d 1e-3 --c0 0 --mincost /home/mpib/LNDG/StateSwitch/WIP_anat/analyses/A_FreeSurfer/B_data/A_FreeSurferDirs/1257/mri/transforms/T2raw.auto.dat.mincost --dof 6 --nmax 36 --param /home/mpib/LNDG/StateSwitch/WIP_anat/analyses/A_FreeSurfer/B_data/A_FreeSurferDirs/1257/mri/transforms/T2raw.auto.dat.param --surf white --brute -0.1 0.1 0.1 --cur-reg /home/mpib/LNDG/StateSwitch/WIP_anat/analyses/A_FreeSurfer/B_data/A_FreeSurferDirs/1257/mri/transforms/tmp.bbregister.23461/reg.curopt.dat --gm-proj-frac 0.5 --nsub 1 --gm-gt-wm 0.5 
sysname  Linux
hostname ood-41
machine  x86_64
user     kosciessa
movvol /home/mpib/LNDG/StateSwitch/WIP_anat/analyses/A_FreeSurfer/B_data/A_FreeSurferDirs/1257/mri/transforms/tmp.bbregister.23461/template.nii
regfile /home/mpib/LNDG/StateSwitch/WIP_anat/analyses/A_FreeSurfer/B_data/A_FreeSurferDirs/1257/mri/transforms/tmp.bbregister.23461/bbr.pass1.dat
subject 1257
dof 6
outregfile /home/mpib/LNDG/StateSwitch/WIP_anat/analyses/A_FreeSurfer/B_data/A_FreeSurferDirs/1257/mri/transforms/T2raw.auto.dat
UseMask 0
UseLH 1
UseRH 1
nsubsamp 1
PenaltySign  -1
PenaltySlope 0.500000
PenaltyCenter 0.000000
surfname white
GMProjFrac 0.500000
WMProjAbs 2.000000
lhcostfile (null)
rhcostfile (null)
interp  trilinear (1)
frame  0
TolPowell 0.000000
nMaxItersPowell 36
n1dmin  3
Profile   0
Gdiag_no  -1
AddNoise  0 (0)
SynthSeed 1523383039
TransRandMax 0.000000
RotRandMax 0.000000
Translations 0.000000 0.000000 0.000000
Rotations   0.000000 0.000000 0.000000
Input reg
 0.99921   0.03963  -0.00289   0.85411;
-0.00039   0.08270   0.99657  -0.62521;
 0.03973  -0.99579   0.08265  -7.37046;
 0.00000   0.00000   0.00000   1.00000;

Loading mov
Projecting LH Surfs
Loading lh.white surf
Loading lh.thickness for GM
GM Proj: 1 0.500000 2.000000
WM Proj: 0 0.500000 2.000000
Projecting RH Surfs
Loading rh.white surf
Loading rh.thickness for GM
Projecting RH Surfs
Using lh.cortex.label
Using rh.cortex.label
Computing relative cost
 0  -25.0 -25.0 -25.0   0.997333
 1  -25.0 -25.0  25.0   0.993525
 2  -25.0  25.0 -25.0   0.987846
 3  -25.0  25.0  25.0   1.012458
 4   25.0 -25.0 -25.0   1.012883
 5   25.0 -25.0  25.0   1.020251
 6   25.0  25.0 -25.0   1.019986
 7   25.0  25.0  25.0   1.003583
REL:  8  0.124894    8.047864  1.005983 rel = 0.124151 
Initial costs ----------------
Number of surface hits 262307
WM  Intensity   145.2745 +/-  26.5933
Ctx Intensity   190.4696 +/-  32.5579
Pct Contrast     26.8084 +/-  17.1953
Cost   0.1249
RelCost   0.1242

------------------------------------
Brute force preopt -0.1 0.1 0.1, n = 729
     0  -0.1000  -0.1000  -0.1000  -0.1000  -0.1000  -0.1000      0.1216   0.1216  0.0
     3  -0.1000  -0.1000  -0.1000  -0.1000   0.0000  -0.1000      0.1172   0.1172  0.0
    84  -0.1000   0.0000  -0.1000  -0.1000   0.0000  -0.1000      0.1167   0.1167  0.0
    87  -0.1000   0.0000  -0.1000  -0.1000   0.1000  -0.1000      0.1162   0.1162  0.0
   328   0.0000   0.0000  -0.1000  -0.1000   0.0000   0.0000      0.1154   0.1154  0.0
   364   0.0000   0.0000   0.0000   0.0000   0.0000   0.0000      0.1146   0.1146  0.0
   577   0.1000   0.0000  -0.1000   0.0000  -0.1000   0.0000      0.1141   0.1141  0.0
Brute Force --------------------------
Min cost was 0.114139
Number of iterations   729
Search time 1.216000 sec
Parameters at best (transmm, rotdeg)
  0.100   0.000  -0.100  0.000 -0.100  0.000 
--------------------------------------------

Starting Powell Minimization
Init Powel Params dof = 6
0 0.1
1 0
2 -0.1
3 0
4 -0.1
5 0
fs_powell::minimize
  nparams 6
  maxfev 36
  ftol   0.000000
  linmin_xtol_   0.001000
  powell nthiter 0: fret = 0.126258
   7  0.071  0.000 -0.100  0.000 -0.100  0.000   0.1261641727
   9  0.069  0.000 -0.100  0.000 -0.100  0.000   0.1261636637
  10  0.068  0.000 -0.100  0.000 -0.100  0.000   0.1261636286
  18  0.068  0.078 -0.100  0.000 -0.100  0.000   0.1261359369
  19  0.068  0.041 -0.100  0.000 -0.100  0.000   0.1261063435
  20  0.068  0.045 -0.100  0.000 -0.100  0.000   0.1261039755
  21  0.068  0.050 -0.100  0.000 -0.100  0.000   0.1260998463
  22  0.068  0.061 -0.100  0.000 -0.100  0.000   0.1260954696
  24  0.068  0.058 -0.100  0.000 -0.100  0.000   0.1260952445
  33  0.068  0.058 -0.028  0.000 -0.100  0.000   0.1256214864
  34  0.068  0.058 -0.018  0.000 -0.100  0.000   0.1256156727
  35  0.068  0.058 -0.019  0.000 -0.100  0.000   0.1256154102
  48  0.068  0.058 -0.019 -0.008 -0.100  0.000   0.1256063636
  50  0.068  0.058 -0.019 -0.007 -0.100  0.000   0.1256062176
  59  0.068  0.058 -0.019 -0.006  0.020  0.000   0.1242918307
  60  0.068  0.058 -0.019 -0.006  0.027  0.000   0.1242740718
  61  0.068  0.058 -0.019 -0.006  0.042  0.000   0.1242549777
  63  0.068  0.058 -0.019 -0.006  0.046  0.000   0.1242544390
  64  0.068  0.058 -0.019 -0.006  0.045  0.000   0.1242543218
  65  0.068  0.058 -0.019 -0.006  0.044  0.000   0.1242542782
  73  0.068  0.058 -0.019 -0.006  0.044  0.057   0.1239682954
  75  0.068  0.058 -0.019 -0.006  0.044  0.051   0.1239650134
  76  0.068  0.058 -0.019 -0.006  0.044  0.052   0.1239646436
  powell nthiter 1: fret = 0.123965
  85  0.069  0.058 -0.019 -0.006  0.044  0.052   0.1239642054
  95  0.069  0.043 -0.019 -0.006  0.044  0.052   0.1239399098
  96  0.069  0.037 -0.019 -0.006  0.044  0.052   0.1239390249
  97  0.069  0.039 -0.019 -0.006  0.044  0.052   0.1239381411
  98  0.069  0.040 -0.019 -0.006  0.044  0.052   0.1239380460
 107  0.069  0.040 -0.015 -0.006  0.044  0.052   0.1239367775
 127  0.069  0.040 -0.015 -0.006  0.041  0.052   0.1239358160
 138  0.069  0.040 -0.015 -0.006  0.041  0.049   0.1239352259
 140  0.069  0.040 -0.015 -0.006  0.041  0.050   0.1239351718
  powell nthiter 2: fret = 0.123935
 148  0.070  0.040 -0.015 -0.006  0.041  0.050   0.1239343319
 150  0.071  0.040 -0.015 -0.006  0.041  0.050   0.1239337993
 151  0.072  0.040 -0.015 -0.006  0.041  0.050   0.1239337740
 169  0.072  0.040 -0.014 -0.006  0.041  0.050   0.1239333156
 170  0.072  0.040 -0.012 -0.006  0.041  0.050   0.1239328319
 174  0.072  0.040 -0.004 -0.006  0.041  0.050   0.1239297116
 175  0.072  0.040  0.001 -0.006  0.041  0.050   0.1239291401
 177  0.072  0.040 -0.000 -0.006  0.041  0.050   0.1239290829
 178  0.072  0.040 -0.002 -0.006  0.041  0.050   0.1239288092
 187  0.072  0.040 -0.002 -0.010  0.041  0.050   0.1239246840
 188  0.072  0.040 -0.002 -0.012  0.041  0.050   0.1239244643
 198  0.072  0.040 -0.002 -0.012  0.036  0.050   0.1239199229
 209  0.072  0.040 -0.002 -0.012  0.036  0.052   0.1239191394
 210  0.072  0.040 -0.002 -0.012  0.036  0.053   0.1239190768
  powell nthiter 3: fret = 0.123919
 219  0.073  0.040 -0.002 -0.012  0.036  0.053   0.1239177031
 221  0.077  0.040 -0.002 -0.012  0.036  0.053   0.1239160979
 231  0.077  0.046 -0.002 -0.012  0.036  0.053   0.1239137798
 241  0.077  0.046  0.006 -0.012  0.036  0.053   0.1239129206
 242  0.077  0.046  0.002 -0.012  0.036  0.053   0.1239117170
 263  0.077  0.046  0.002 -0.012  0.034  0.053   0.1239102527
 272  0.077  0.046  0.002 -0.012  0.034  0.060   0.1239099681
 273  0.077  0.046  0.002 -0.012  0.034  0.057   0.1239089478
 276  0.081  0.051  0.007 -0.012  0.031  0.060   0.1239032282
 281  0.084  0.054  0.010 -0.012  0.030  0.063   0.1239025748
 284  0.083  0.054  0.009 -0.012  0.030  0.062   0.1239025343
 290  0.083  0.054  0.009 -0.012  0.030  0.062   0.1239025221
  powell nthiter 4: fret = 0.123903
 319  0.083  0.054  0.005 -0.012  0.030  0.062   0.1238990029
 322  0.083  0.054  0.004 -0.012  0.030  0.062   0.1238989341
 352  0.085  0.056  0.006 -0.012  0.029  0.064   0.1238985459
 353  0.084  0.055  0.005 -0.012  0.029  0.063   0.1238983522
 355  0.084  0.055  0.005 -0.012  0.029  0.063   0.1238983077
 356  0.084  0.055  0.005 -0.012  0.029  0.063   0.1238982863
  powell nthiter 5: fret = 0.123898
 378  0.084  0.053  0.005 -0.012  0.029  0.063   0.1238979668
 389  0.084  0.053  0.004 -0.012  0.029  0.063   0.1238978893
 403  0.084  0.053  0.004 -0.013  0.029  0.063   0.1238977311
 412  0.084  0.053  0.004 -0.013  0.031  0.063   0.1238977231
 414  0.084  0.053  0.004 -0.013  0.030  0.063   0.1238976024
 420  0.086  0.055  0.006 -0.013  0.029  0.065   0.1238970859
 421  0.086  0.054  0.006 -0.013  0.030  0.064   0.1238969577
 422  0.085  0.054  0.006 -0.013  0.030  0.064   0.1238969090
 427  0.085  0.054  0.005 -0.013  0.030  0.064   0.1238969058
 429  0.085  0.054  0.005 -0.013  0.030  0.064   0.1238968996
 431  0.086  0.053  0.006 -0.014  0.030  0.065   0.1238961656
 434  0.088  0.052  0.006 -0.015  0.031  0.067   0.1238958131
 435  0.088  0.052  0.006 -0.015  0.031  0.066   0.1238957693
 440  0.088  0.052  0.006 -0.015  0.031  0.066   0.1238957523
 447  0.088  0.052  0.006 -0.015  0.031  0.066   0.1238957508
  powell nthiter 6: fret = 0.123896
 456  0.088  0.052  0.006 -0.015  0.031  0.067   0.1238956482
 471  0.088  0.051  0.006 -0.015  0.031  0.067   0.1238953956
 481  0.088  0.051  0.007 -0.015  0.031  0.067   0.1238950070
 493  0.088  0.051  0.007 -0.014  0.031  0.067   0.1238948774
 505  0.089  0.051  0.007 -0.015  0.032  0.068   0.1238948642
 509  0.089  0.051  0.007 -0.015  0.032  0.068   0.1238947293
 512  0.088  0.051  0.007 -0.015  0.032  0.068   0.1238946938
 514  0.088  0.051  0.007 -0.015  0.032  0.068   0.1238946724
 516  0.088  0.051  0.007 -0.015  0.032  0.068   0.1238946565
 517  0.088  0.051  0.007 -0.015  0.032  0.068   0.1238946435
  powell nthiter 7: fret = 0.123895
 559  0.088  0.052  0.007 -0.014  0.032  0.068   0.1238946275
 575  0.089  0.052  0.007 -0.014  0.032  0.068   0.1238945355
 578  0.089  0.052  0.007 -0.014  0.032  0.068   0.1238945329
 579  0.089  0.052  0.007 -0.014  0.032  0.068   0.1238945244
 580  0.089  0.052  0.007 -0.014  0.032  0.068   0.1238944973
 581  0.089  0.052  0.007 -0.014  0.032  0.068   0.1238944724
 586  0.089  0.052  0.007 -0.014  0.032  0.068   0.1238944613
  powell nthiter 8: fret = 0.123894
 636  0.089  0.052  0.007 -0.014  0.031  0.068   0.1238943174
 639  0.090  0.051  0.007 -0.015  0.031  0.069   0.1238942030
 643  0.090  0.052  0.007 -0.015  0.031  0.069   0.1238941462
 646  0.090  0.052  0.007 -0.015  0.031  0.069   0.1238941115
 651  0.090  0.052  0.007 -0.015  0.031  0.069   0.1238941045
 652  0.090  0.052  0.007 -0.015  0.031  0.069   0.1238940857
  powell nthiter 9: fret = 0.123894
 719  0.090  0.052  0.007 -0.015  0.030  0.067   0.1238940182
 722  0.090  0.051  0.007 -0.015  0.029  0.068   0.1238939158
 726  0.090  0.051  0.007 -0.015  0.029  0.067   0.1238938847
 727  0.090  0.052  0.007 -0.015  0.030  0.067   0.1238938350
 728  0.090  0.052  0.007 -0.015  0.030  0.067   0.1238938274
 730  0.090  0.052  0.007 -0.015  0.030  0.067   0.1238938093
  powell nthiter 10: fret = 0.123894
 790  0.090  0.051  0.007 -0.015  0.029  0.067   0.1238937975
 798  0.090  0.051  0.007 -0.015  0.029  0.067   0.1238937527
 802  0.090  0.051  0.007 -0.015  0.029  0.067   0.1238937519
  powell nthiter 11: fret = 0.123894
 842  0.090  0.051  0.007 -0.014  0.029  0.067   0.1238936569
 859  0.090  0.051  0.007 -0.014  0.029  0.068   0.1238936558
 869  0.090  0.051  0.007 -0.014  0.029  0.068   0.1238936500
  powell nthiter 12: fret = 0.123894
 897  0.090  0.051  0.006 -0.014  0.029  0.068   0.1238936422
 933  0.090  0.051  0.006 -0.014  0.029  0.068   0.1238936307
 935  0.090  0.051  0.006 -0.014  0.029  0.068   0.1238936243
 938  0.090  0.051  0.006 -0.014  0.029  0.068   0.1238936177
  powell nthiter 13: fret = 0.123894
1007  0.090  0.051  0.006 -0.014  0.029  0.068   0.1238936169
Powell done niters = 13
Computing relative cost
 0  -25.0 -25.0 -25.0   0.997409
 1  -25.0 -25.0  25.0   0.991894
 2  -25.0  25.0 -25.0   0.987960
 3  -25.0  25.0  25.0   1.012102
 4   25.0 -25.0 -25.0   1.012788
 5   25.0 -25.0  25.0   1.020511
 6   25.0  25.0 -25.0   1.019632
 7   25.0  25.0  25.0   1.004757
REL:  8  0.123894    8.047054  1.005882 rel = 0.123169 
Number of iterations    13
Min cost was 0.123894
Number of FunctionCalls  1009
TolPowell 0.000000
nMaxItersPowell 36
OptimizationTime 93.111000 sec
Parameters at optimum (transmm)  0.09011  0.05133  0.00639
Parameters at optimum (rotdeg) -0.01410  0.02919  0.06754 
Final costs ----------------
Number of surface hits 262307
WM  Intensity   145.2651 +/-  26.5880
Ctx Intensity   190.4677 +/-  32.5149
Pct Contrast     26.8183 +/-  17.0870
Cost   0.1239
RelCost   0.1242
Reg at min cost was 
 0.99923   0.03902  -0.00403   0.94121;
 0.00079   0.08250   0.99659  -0.57469;
 0.03922  -0.99583   0.08241  -7.36435;
 0.00000   0.00000   0.00000   1.00000;

Writing optimal reg to /home/mpib/LNDG/StateSwitch/WIP_anat/analyses/A_FreeSurfer/B_data/A_FreeSurferDirs/1257/mri/transforms/T2raw.auto.dat, type = 14 
Original Reg 
 0.99921   0.03963  -0.00289   0.85411;
-0.00039   0.08270   0.99657  -0.62521;
 0.03973  -0.99579   0.08265  -7.37046;
 0.00000   0.00000   0.00000   1.00000;

Original Reg - Optimal Reg
-0.00002   0.00060   0.00113  -0.08710;
-0.00119   0.00020  -0.00002  -0.05052;
 0.00051   0.00004   0.00024  -0.00611;
 0.00000   0.00000   0.00000   0.00000;

Computing change in lh position
LH rmsDiffMean 0.071379
Computing change in rh position
Surface-RMS-Diff-mm 0.091147 0.037834 0.171817
mri_segreg done
MinCost: 0.123894 145.265074 190.467658 26.818253 
tkregister2_cmdl --mov /home/mpib/LNDG/StateSwitch/WIP_anat/analyses/A_FreeSurfer/B_data/A_FreeSurferDirs/1257/mri/orig/T2raw.mgz --reg /home/mpib/LNDG/StateSwitch/WIP_anat/analyses/A_FreeSurfer/B_data/A_FreeSurferDirs/1257/mri/transforms/T2raw.auto.dat --noedit --ltaout /home/mpib/LNDG/StateSwitch/WIP_anat/analyses/A_FreeSurfer/B_data/A_FreeSurferDirs/1257/mri/transforms/T2raw.auto.lta
tkregister_tcl /opt/freesurfer/6.0.0/tktools/tkregister2.tcl
INFO: no target volume specified, assuming FreeSurfer orig volume.
target  volume orig
movable volume /home/mpib/LNDG/StateSwitch/WIP_anat/analyses/A_FreeSurfer/B_data/A_FreeSurferDirs/1257/mri/orig/T2raw.mgz
reg file       /home/mpib/LNDG/StateSwitch/WIP_anat/analyses/A_FreeSurfer/B_data/A_FreeSurferDirs/1257/mri/transforms/T2raw.auto.dat
LoadVol        0
ZeroCRAS       0
$Id: tkregister2.c,v 1.132.2.1 2016/08/02 21:17:29 greve Exp $
Diagnostic Level -1
---- Input registration matrix --------
 0.99923   0.03902  -0.00403   0.94121;
 0.00079   0.08250   0.99659  -0.57469;
 0.03922  -0.99583   0.08241  -7.36435;
 0.00000   0.00000   0.00000   1.00000;
float2int = 0
---------------------------------------
INFO: loading target /home/mpib/LNDG/StateSwitch/WIP_anat/analyses/A_FreeSurfer/B_data/A_FreeSurferDirs/1257/mri/orig.mgz
Ttarg: --------------------
-1.00000   0.00000   0.00000   128.00000;
 0.00000   0.00000   1.00000  -128.00000;
 0.00000  -1.00000   0.00000   128.00000;
 0.00000   0.00000   0.00000   1.00000;
INFO: loading movable /home/mpib/LNDG/StateSwitch/WIP_anat/analyses/A_FreeSurfer/B_data/A_FreeSurferDirs/1257/mri/orig/T2raw.mgz
Tmov: --------------------
-1.00000   0.00000   0.00000   88.00000;
 0.00000   0.00000   0.50000  -128.00000;
 0.00000  -0.50000   0.00000   128.00000;
 0.00000   0.00000   0.00000   1.00000;
mkheaderreg = 0, float2int = 0
---- Input registration matrix --------
 0.99923   0.03902  -0.00403   0.94121;
 0.00079   0.08250   0.99659  -0.57469;
 0.03922  -0.99583   0.08241  -7.36435;
 0.00000   0.00000   0.00000   1.00000;
Determinant 1
subject = 1257
RegMat ---------------------------
 0.99923   0.03902  -0.00403   0.94121;
 0.00079   0.08250   0.99659  -0.57469;
 0.03922  -0.99583   0.08241  -7.36435;
 0.00000   0.00000   0.00000   1.00000;
Cleaning up
 
Started at Tue Apr 10 19:25:32 CEST 2018 
Ended   at Tue Apr 10 19:28:58 CEST 2018
BBR-Run-Time-Sec 206
 
bbregister Done
To check results, run:
tkregisterfv --mov /home/mpib/LNDG/StateSwitch/WIP_anat/analyses/A_FreeSurfer/B_data/A_FreeSurferDirs/1257/mri/orig/T2raw.mgz --reg /home/mpib/LNDG/StateSwitch/WIP_anat/analyses/A_FreeSurfer/B_data/A_FreeSurferDirs/1257/mri/transforms/T2raw.auto.lta --surfs 
