# AZS
# compute_vox2vox talsrcimg talsrcimg_to_711-2C_as_mni_average_305_t4 /opt/freesurfer/6.0.0/average/711-2C_as_mni_average_305
# $Id: compute_vox2vox.c,v 1.3 2010/02/27 01:41:53 nicks Exp $
  1.033653  0.035546 -0.074042   -1.0562
 -0.080603  0.802588 -0.314288   52.6546
  0.063896  0.183405  0.927644  -11.3065
  0.000000  0.000000  0.000000    1.0000
