1 Left_Cerebral_Exterior 1.46 0.0  0
2 Left_Cerebral_White_Matter 1.00 0.0 104
3 Left_Cerebral_Cortex 1.29 0.0 75
4 Left_Lateral_Ventricle 1.28 0.0 24
5 Left_Inf_Lat_Vent 1.26 0.0 40
7 Left_Cerebellum_White_Matter 1.09 0.0 91
8 Left_Cerebellum_Cortex 1.26 0.0 70
9 Left_Thalamus 1.29 0.0 103
10 Left_Thalamus_Proper 1.05 0.0 93
11 Left_Caudate 1.10 0.0 75
12 Left_Putamen 1.12 0.0 93
13 Left_Pallidum 1.04 0.0 100
14 Third_Ventricle 1.05 0.0 27
15 Fourth_Ventricle 1.64 0.0 23
16 Brain_Stem 1.00 0.0 78
17 Left_Hippocampus 1.26 0.0 71
18 Left_Amygdala 1.26 0.0 72
24 CSF 1.46 0.0 54
26 Left_Accumbens_area 1.10 0.0 68
28 Left_VentralDC 1.04 0.0 89
40 Right_Cerebral_Exterior 1.46 0.0  0
41 Right_Cerebral_White_Matter 1.00 0.0 102
42 Right_Cerebral_Cortex 1.41 0.0 82
43 Right_Lateral_Ventricle 1.94 0.0 25
44 Right_Inf_Lat_Vent 1.28 0.0 29
46 Right_Cerebellum_White_Matter 1.07 0.0 90
47 Right_Cerebellum_Cortex 1.25 0.0 68
48 Right_Thalamus 1.29 0.0  0
49 Right_Thalamus_Proper 1.10 0.0 89
50 Right_Caudate 1.19 0.0 79
51 Right_Putamen 1.10 0.0 87
52 Right_Pallidum 1.04 0.0 100
53 Right_Hippocampus 1.28 0.0 71
54 Right_Amygdala 1.25 0.0 71
58 Right_Accumbens_area 1.19 0.0 77
60 Right_VentralDC 1.03 0.0 87
72 Fifth_Ventricle 1.46 0.0 46
75  1.46 0.0  0
76  1.46 0.0  0
77 WM_hypointensities 1.00 0.0 76
78 Left_WM_hypointensities 1.00 0.0  0
79 Right_WM_hypointensities 1.00 0.0  0
80 non_WM_hypointensities 1.00 0.0 43
81 Left_non_WM_hypointensities 1.00 0.0  0
82 Right_non_WM_hypointensities 1.00 0.0  0
186  1.00 0.0  0
187  1.00 0.0  0
