2157
1.000000
0.500000
0.100000
9.989793300628662e-01 -1.464401371777058e-02 -4.273269325494766e-02 3.476634263992310e+00 
3.109737485647202e-02 -4.631984233856201e-01 8.857087492942810e-01 -8.068284034729004e+00 
-3.276405483484268e-02 -8.861335515975952e-01 -4.622702598571777e-01 -3.496158361434937e+00 
0 0 0 1
round
