use new gutter utility

2 jobs for bs5 in 3 minutes and 11 seconds (queued for 5 seconds)
latest
Name Stage Failure
failed
test Test
-- Docs: https://docs.pytest.org/en/stable/warnings.html
=========================== short test summary info ============================
FAILED tests/recruitment/fields/test_age_field.py::test_error_if_age_out_of_limits[-1-False]
FAILED tests/recruitment/fields/test_age_field.py::test_error_if_age_out_of_limits[1001-False]
FAILED tests/studies/views/test_filter_views.py::test_update_200 - KeyError: ...
FAILED tests/studies/views/test_filter_views.py::test_update_with_filter_200
====== 4 failed, 409 passed, 107 xfailed, 6 warnings in 77.48s (0:01:17) =======
Cleaning up file based variables
ERROR: Job failed: exit code 1