%!PS-Adobe-3.0 EPSF-3.0
%%Creator: (MATLAB, The Mathworks, Inc. Version 9.8.0.1323502 \(R2020a\). Operating System: Mac OS X)
%%Title: /Users/ddg/Volumes/tardis_mpib.localized/stateswitch/stsw_fmri_task/decoding/figures/G_decode/G6D_winOption_VC_loadeffects_groupavg_samescale.eps
%%CreationDate: 2024-05-06T17:05:22
%%Pages: (atend)
%%BoundingBox:    60     0   696   211
%%LanguageLevel: 3
%%EndComments
%%BeginProlog
%%BeginResource: procset (Apache XML Graphics Std ProcSet) 1.2 0
%%Version: 1.2 0
%%Copyright: (Copyright 2001-2003,2010 The Apache Software Foundation. License terms: http://www.apache.org/licenses/LICENSE-2.0)
/bd{bind def}bind def
/ld{load def}bd
/GR/grestore ld
/GS/gsave ld
/RM/rmoveto ld
/C/curveto ld
/t/show ld
/L/lineto ld
/ML/setmiterlimit ld
/CT/concat ld
/f/fill ld
/N/newpath ld
/S/stroke ld
/CC/setcmykcolor ld
/A/ashow ld
/cp/closepath ld
/RC/setrgbcolor ld
/LJ/setlinejoin ld
/GC/setgray ld
/LW/setlinewidth ld
/M/moveto ld
/re {4 2 roll M
1 index 0 rlineto
0 exch rlineto
neg 0 rlineto
cp } bd
/_ctm matrix def
/_tm matrix def
/BT { _ctm currentmatrix pop matrix _tm copy pop 0 0 moveto } bd
/ET { _ctm setmatrix } bd
/iTm { _ctm setmatrix _tm concat } bd
/Tm { _tm astore pop iTm 0 0 moveto } bd
/ux 0.0 def
/uy 0.0 def
/F {
  /Tp exch def
  /Tf exch def
  Tf findfont Tp scalefont setfont
  /cf Tf def  /cs Tp def
} bd
/ULS {currentpoint /uy exch def /ux exch def} bd
/ULE {
  /Tcx currentpoint pop def
  gsave
  newpath
  cf findfont cs scalefont dup
  /FontMatrix get 0 get /Ts exch def /FontInfo get dup
  /UnderlinePosition get Ts mul /To exch def
  /UnderlineThickness get Ts mul /Tt exch def
  ux uy To add moveto  Tcx uy To add lineto
  Tt setlinewidth stroke
  grestore
} bd
/OLE {
  /Tcx currentpoint pop def
  gsave
  newpath
  cf findfont cs scalefont dup
  /FontMatrix get 0 get /Ts exch def /FontInfo get dup
  /UnderlinePosition get Ts mul /To exch def
  /UnderlineThickness get Ts mul /Tt exch def
  ux uy To add cs add moveto Tcx uy To add cs add lineto
  Tt setlinewidth stroke
  grestore
} bd
/SOE {
  /Tcx currentpoint pop def
  gsave
  newpath
  cf findfont cs scalefont dup
  /FontMatrix get 0 get /Ts exch def /FontInfo get dup
  /UnderlinePosition get Ts mul /To exch def
  /UnderlineThickness get Ts mul /Tt exch def
  ux uy To add cs 10 mul 26 idiv add moveto Tcx uy To add cs 10 mul 26 idiv add lineto
  Tt setlinewidth stroke
  grestore
} bd
/QT {
/Y22 exch store
/X22 exch store
/Y21 exch store
/X21 exch store
currentpoint
/Y21 load 2 mul add 3 div exch
/X21 load 2 mul add 3 div exch
/X21 load 2 mul /X22 load add 3 div
/Y21 load 2 mul /Y22 load add 3 div
/X22 load /Y22 load curveto
} bd
/SSPD {
dup length /d exch dict def
{
/v exch def
/k exch def
currentpagedevice k known {
/cpdv currentpagedevice k get def
v cpdv ne {
/upd false def
/nullv v type /nulltype eq def
/nullcpdv cpdv type /nulltype eq def
nullv nullcpdv or
{
/upd true def
} {
/sametype v type cpdv type eq def
sametype {
v type /arraytype eq {
/vlen v length def
/cpdvlen cpdv length def
vlen cpdvlen eq {
0 1 vlen 1 sub {
/i exch def
/obj v i get def
/cpdobj cpdv i get def
obj cpdobj ne {
/upd true def
exit
} if
} for
} {
/upd true def
} ifelse
} {
v type /dicttype eq {
v {
/dv exch def
/dk exch def
/cpddv cpdv dk get def
dv cpddv ne {
/upd true def
exit
} if
} forall
} {
/upd true def
} ifelse
} ifelse
} if
} ifelse
upd true eq {
d k v put
} if
} if
} if
} forall
d length 0 gt {
d setpagedevice
} if
} bd
/RE { % /NewFontName [NewEncodingArray] /FontName RE -
  findfont dup length dict begin
  {
    1 index /FID ne
    {def} {pop pop} ifelse
  } forall
  /Encoding exch def
  /FontName 1 index def
  currentdict definefont pop
  end
} bind def
%%EndResource
%%BeginResource: procset (Apache XML Graphics EPS ProcSet) 1.0 0
%%Version: 1.0 0
%%Copyright: (Copyright 2002-2003 The Apache Software Foundation. License terms: http://www.apache.org/licenses/LICENSE-2.0)
/BeginEPSF { %def
/b4_Inc_state save def         % Save state for cleanup
/dict_count countdictstack def % Count objects on dict stack
/op_count count 1 sub def      % Count objects on operand stack
userdict begin                 % Push userdict on dict stack
/showpage { } def              % Redefine showpage, { } = null proc
0 setgray 0 setlinecap         % Prepare graphics state
1 setlinewidth 0 setlinejoin
10 setmiterlimit [ ] 0 setdash newpath
/languagelevel where           % If level not equal to 1 then
{pop languagelevel             % set strokeadjust and
1 ne                           % overprint to their defaults.
{false setstrokeadjust false setoverprint
} if
} if
} bd
/EndEPSF { %def
count op_count sub {pop} repeat            % Clean up stacks
countdictstack dict_count sub {end} repeat
b4_Inc_state restore
} bd
%%EndResource
%FOPBeginFontDict
%%IncludeResource: font Courier-Oblique
%%IncludeResource: font Courier-BoldOblique
%%IncludeResource: font Courier-Bold
%%IncludeResource: font ZapfDingbats
%%IncludeResource: font Symbol
%%IncludeResource: font Helvetica
%%IncludeResource: font Helvetica-Oblique
%%IncludeResource: font Helvetica-Bold
%%IncludeResource: font Helvetica-BoldOblique
%%IncludeResource: font Times-Roman
%%IncludeResource: font Times-Italic
%%IncludeResource: font Times-Bold
%%IncludeResource: font Times-BoldItalic
%%IncludeResource: font Courier
%FOPEndFontDict
%%BeginResource: encoding WinAnsiEncoding
/WinAnsiEncoding [
/.notdef /.notdef /.notdef /.notdef /.notdef
/.notdef /.notdef /.notdef /.notdef /.notdef
/.notdef /.notdef /.notdef /.notdef /.notdef
/.notdef /.notdef /.notdef /.notdef /.notdef
/.notdef /.notdef /.notdef /.notdef /.notdef
/.notdef /.notdef /.notdef /.notdef /.notdef
/.notdef /.notdef /space /exclam /quotedbl
/numbersign /dollar /percent /ampersand /quotesingle
/parenleft /parenright /asterisk /plus /comma
/hyphen /period /slash /zero /one
/two /three /four /five /six
/seven /eight /nine /colon /semicolon
/less /equal /greater /question /at
/A /B /C /D /E
/F /G /H /I /J
/K /L /M /N /O
/P /Q /R /S /T
/U /V /W /X /Y
/Z /bracketleft /backslash /bracketright /asciicircum
/underscore /quoteleft /a /b /c
/d /e /f /g /h
/i /j /k /l /m
/n /o /p /q /r
/s /t /u /v /w
/x /y /z /braceleft /bar
/braceright /asciitilde /bullet /Euro /bullet
/quotesinglbase /florin /quotedblbase /ellipsis /dagger
/daggerdbl /circumflex /perthousand /Scaron /guilsinglleft
/OE /bullet /Zcaron /bullet /bullet
/quoteleft /quoteright /quotedblleft /quotedblright /bullet
/endash /emdash /asciitilde /trademark /scaron
/guilsinglright /oe /bullet /zcaron /Ydieresis
/space /exclamdown /cent /sterling /currency
/yen /brokenbar /section /dieresis /copyright
/ordfeminine /guillemotleft /logicalnot /sfthyphen /registered
/macron /degree /plusminus /twosuperior /threesuperior
/acute /mu /paragraph /middot /cedilla
/onesuperior /ordmasculine /guillemotright /onequarter /onehalf
/threequarters /questiondown /Agrave /Aacute /Acircumflex
/Atilde /Adieresis /Aring /AE /Ccedilla
/Egrave /Eacute /Ecircumflex /Edieresis /Igrave
/Iacute /Icircumflex /Idieresis /Eth /Ntilde
/Ograve /Oacute /Ocircumflex /Otilde /Odieresis
/multiply /Oslash /Ugrave /Uacute /Ucircumflex
/Udieresis /Yacute /Thorn /germandbls /agrave
/aacute /acircumflex /atilde /adieresis /aring
/ae /ccedilla /egrave /eacute /ecircumflex
/edieresis /igrave /iacute /icircumflex /idieresis
/eth /ntilde /ograve /oacute /ocircumflex
/otilde /odieresis /divide /oslash /ugrave
/uacute /ucircumflex /udieresis /yacute /thorn
/ydieresis
] def
%%EndResource
%FOPBeginFontReencode
/Courier-Oblique findfont
dup length dict begin
  {1 index /FID ne {def} {pop pop} ifelse} forall
  /Encoding WinAnsiEncoding def
  currentdict
end
/Courier-Oblique exch definefont pop
/Courier-BoldOblique findfont
dup length dict begin
  {1 index /FID ne {def} {pop pop} ifelse} forall
  /Encoding WinAnsiEncoding def
  currentdict
end
/Courier-BoldOblique exch definefont pop
/Courier-Bold findfont
dup length dict begin
  {1 index /FID ne {def} {pop pop} ifelse} forall
  /Encoding WinAnsiEncoding def
  currentdict
end
/Courier-Bold exch definefont pop
/Helvetica findfont
dup length dict begin
  {1 index /FID ne {def} {pop pop} ifelse} forall
  /Encoding WinAnsiEncoding def
  currentdict
end
/Helvetica exch definefont pop
/Helvetica-Oblique findfont
dup length dict begin
  {1 index /FID ne {def} {pop pop} ifelse} forall
  /Encoding WinAnsiEncoding def
  currentdict
end
/Helvetica-Oblique exch definefont pop
/Helvetica-Bold findfont
dup length dict begin
  {1 index /FID ne {def} {pop pop} ifelse} forall
  /Encoding WinAnsiEncoding def
  currentdict
end
/Helvetica-Bold exch definefont pop
/Helvetica-BoldOblique findfont
dup length dict begin
  {1 index /FID ne {def} {pop pop} ifelse} forall
  /Encoding WinAnsiEncoding def
  currentdict
end
/Helvetica-BoldOblique exch definefont pop
/Times-Roman findfont
dup length dict begin
  {1 index /FID ne {def} {pop pop} ifelse} forall
  /Encoding WinAnsiEncoding def
  currentdict
end
/Times-Roman exch definefont pop
/Times-Italic findfont
dup length dict begin
  {1 index /FID ne {def} {pop pop} ifelse} forall
  /Encoding WinAnsiEncoding def
  currentdict
end
/Times-Italic exch definefont pop
/Times-Bold findfont
dup length dict begin
  {1 index /FID ne {def} {pop pop} ifelse} forall
  /Encoding WinAnsiEncoding def
  currentdict
end
/Times-Bold exch definefont pop
/Times-BoldItalic findfont
dup length dict begin
  {1 index /FID ne {def} {pop pop} ifelse} forall
  /Encoding WinAnsiEncoding def
  currentdict
end
/Times-BoldItalic exch definefont pop
/Courier findfont
dup length dict begin
  {1 index /FID ne {def} {pop pop} ifelse} forall
  /Encoding WinAnsiEncoding def
  currentdict
end
/Courier exch definefont pop
%FOPEndFontReencode
%%EndProlog
%%Page: 1 1
%%PageBoundingBox: 0 0 768 216
%%BeginPageSetup
[1 0 0 -1 0 216] CT
%%EndPageSetup
GS
1 GC
N
0 0 768 216 re
f
GR
GS
1 GC
N
0 0 768 216 re
f
GR
GS
1 GC
N
100 174 M
263.5 174 L
263.5 22 L
100 22 L
cp
f
GR
GS
0.149 GC
2 setlinecap
1 LJ
0.5 LW
N
100 174 M
263.5 174 L
S
GR
GS
0.149 GC
2 setlinecap
1 LJ
0.5 LW
N
120.438 174 M
120.438 172.365 L
S
GR
GS
0.149 GC
2 setlinecap
1 LJ
0.5 LW
N
161.313 174 M
161.313 172.365 L
S
GR
GS
0.149 GC
2 setlinecap
1 LJ
0.5 LW
N
202.188 174 M
202.188 172.365 L
S
GR
GS
0.149 GC
2 setlinecap
1 LJ
0.5 LW
N
243.063 174 M
243.063 172.365 L
S
GR
GS
[1 0 0 1 120.4375 178.99991] CT
0.149 GC
/Helvetica 15 F
GS
[1 0 0 1 0 0] CT
-4.5 15 moveto 
1 -1 scale
(1) t 
GR
GR
GS
[1 0 0 1 161.3125 178.99991] CT
0.149 GC
/Helvetica 15 F
GS
[1 0 0 1 0 0] CT
-4.5 15 moveto 
1 -1 scale
(2) t 
GR
GR
GS
[1 0 0 1 202.1875 178.99991] CT
0.149 GC
/Helvetica 15 F
GS
[1 0 0 1 0 0] CT
-4.5 15 moveto 
1 -1 scale
(3) t 
GR
GR
GS
[1 0 0 1 243.0625 178.99991] CT
0.149 GC
/Helvetica 15 F
GS
[1 0 0 1 0 0] CT
-4.5 15 moveto 
1 -1 scale
(4) t 
GR
GR
GS
[1 0 0 1 181.75008 197.99991] CT
0.149 GC
/Helvetica 15 F
GS
[1 0 0 1 0 0] CT
-28 15 moveto 
1 -1 scale
(Target #) t 
GR
GR
GS
0.149 GC
2 setlinecap
1 LJ
0.5 LW
N
100 174 M
100 22 L
S
GR
GS
0.149 GC
2 setlinecap
1 LJ
0.5 LW
N
100 174 M
101.635 174 L
S
GR
GS
0.149 GC
2 setlinecap
1 LJ
0.5 LW
N
100 22 M
101.635 22 L
S
GR
GS
[1 0 0 1 95 174] CT
0.149 GC
/Helvetica 15 F
GS
[1 0 0 1 0 0] CT
-17 5.5 moveto 
1 -1 scale
(50) t 
GR
GR
GS
[1 0 0 1 95 22] CT
0.149 GC
/Helvetica 15 F
GS
[1 0 0 1 0 0] CT
-17 5.5 moveto 
1 -1 scale
(52) t 
GR
GR
GS
[0 -1 1 0 75 98] CT
0.149 GC
/Helvetica 15 F
GS
[1 0 0 1 0 0] CT
-78.5 -4 moveto 
1 -1 scale
(Decoding accuracy \(%\)) t 
GR
GR
GS
[1 0 0 1 181.75017 20.12511] CT
/Helvetica-Bold 15 F
GS
[1 0 0 1 0 0] CT
-26 -4 moveto 
1 -1 scale
(Probed) t 
GR
GR
GS
1 LJ
2 LW
N
120.438 55.819 M
120.438 67.525 L
S
GR
GS
1 LJ
2 LW
N
161.313 87.26 M
161.313 98.922 L
S
GR
GS
1 LJ
2 LW
N
202.188 94.382 M
202.188 105.19 L
S
GR
GS
1 LJ
2 LW
N
243.063 99.054 M
243.063 109.492 L
S
GR
GS
1 LJ
2 LW
N
120.438 55.819 M
120.438 44.114 L
S
GR
GS
1 LJ
2 LW
N
161.313 87.26 M
161.313 75.598 L
S
GR
GS
1 LJ
2 LW
N
202.188 94.382 M
202.188 83.574 L
S
GR
GS
1 LJ
2 LW
N
243.063 99.054 M
243.063 88.615 L
S
GR
GS
1 LJ
2 LW
N
120.438 55.819 M
161.313 87.26 L
202.188 94.382 L
243.063 99.054 L
S
GR
GS
[1 0 0 1 120.4375 67.52509] CT
N
-3 0 M
3 0 L
f
GR
GS
[1 0 0 1 120.4375 67.52509] CT
10.0 ML
2 LW
N
-3 0 M
3 0 L
S
GR
GS
[1 0 0 1 161.3125 98.92223] CT
N
/f1394637256{-3 0 M
3 0 L}def
f1394637256
f
GR
GS
[1 0 0 1 161.3125 98.92223] CT
10.0 ML
2 LW
N
-3 0 M
3 0 L
S
GR
GS
[1 0 0 1 202.1875 105.18994] CT
N
f1394637256
f
GR
GS
[1 0 0 1 202.1875 105.18994] CT
10.0 ML
2 LW
N
-3 0 M
3 0 L
S
GR
GS
[1 0 0 1 243.0625 109.49173] CT
N
f1394637256
f
GR
GS
[1 0 0 1 243.0625 109.49173] CT
10.0 ML
2 LW
N
-3 0 M
3 0 L
S
GR
GS
[1 0 0 1 120.4375 44.11371] CT
N
f1394637256
f
GR
GS
[1 0 0 1 120.4375 44.11371] CT
10.0 ML
2 LW
N
-3 0 M
3 0 L
S
GR
GS
[1 0 0 1 161.3125 75.5984] CT
N
f1394637256
f
GR
GS
[1 0 0 1 161.3125 75.5984] CT
10.0 ML
2 LW
N
-3 0 M
3 0 L
S
GR
GS
[1 0 0 1 202.1875 83.57431] CT
N
f1394637256
f
GR
GS
[1 0 0 1 202.1875 83.57431] CT
10.0 ML
2 LW
N
-3 0 M
3 0 L
S
GR
GS
[1 0 0 1 243.0625 88.6151] CT
N
f1394637256
f
GR
GS
[1 0 0 1 243.0625 88.6151] CT
10.0 ML
2 LW
N
-3 0 M
3 0 L
S
GR
GS
1 GC
N
/f576061938{315.5 174 M
479.5 174 L
479.5 22 L
315.5 22 L
cp}def
f576061938
f
GR
GS
0.149 GC
2 setlinecap
1 LJ
0.5 LW
N
315.5 174 M
479.5 174 L
S
GR
GS
0.149 GC
2 setlinecap
1 LJ
0.5 LW
N
336 174 M
336 172.36 L
S
GR
GS
0.149 GC
2 setlinecap
1 LJ
0.5 LW
N
377 174 M
377 172.36 L
S
GR
GS
0.149 GC
2 setlinecap
1 LJ
0.5 LW
N
418 174 M
418 172.36 L
S
GR
GS
0.149 GC
2 setlinecap
1 LJ
0.5 LW
N
459 174 M
459 172.36 L
S
GR
GS
[1 0 0 1 336 178.99991] CT
0.149 GC
/Helvetica 15 F
GS
[1 0 0 1 0 0] CT
-4.5 15 moveto 
1 -1 scale
(1) t 
GR
GR
GS
[1 0 0 1 377 178.99991] CT
0.149 GC
/Helvetica 15 F
GS
[1 0 0 1 0 0] CT
-4.5 15 moveto 
1 -1 scale
(2) t 
GR
GR
GS
[1 0 0 1 418 178.99991] CT
0.149 GC
/Helvetica 15 F
GS
[1 0 0 1 0 0] CT
-4.5 15 moveto 
1 -1 scale
(3) t 
GR
GR
GS
[1 0 0 1 459 178.99991] CT
0.149 GC
/Helvetica 15 F
GS
[1 0 0 1 0 0] CT
-4.5 15 moveto 
1 -1 scale
(4) t 
GR
GR
GS
0.149 GC
2 setlinecap
1 LJ
0.5 LW
N
315.5 174 M
315.5 22 L
S
GR
GS
[1 0 0 1 397.50037 20.12511] CT
/Helvetica-Bold 15 F
GS
[1 0 0 1 0 0] CT
-36 -4 moveto 
1 -1 scale
(Unprobed) t 
GR
GR
GS
1 LJ
2 LW
N
336 152.375 M
336 158.739 L
S
GR
GS
1 LJ
2 LW
N
377 126.628 M
377 133.855 L
S
GR
GS
1 LJ
2 LW
N
418 138.632 M
418 145.29 L
S
GR
GS
1 LJ
2 LW
N
459 128.93 M
459 135.033 L
S
GR
GS
1 LJ
2 LW
N
336 152.375 M
336 146.011 L
S
GR
GS
1 LJ
2 LW
N
377 126.628 M
377 119.401 L
S
GR
GS
1 LJ
2 LW
N
418 138.632 M
418 131.974 L
S
GR
GS
1 LJ
2 LW
N
459 128.93 M
459 122.827 L
S
GR
GS
1 LJ
2 LW
N
336 152.375 M
377 126.628 L
418 138.632 L
459 128.93 L
S
GR
GS
[1 0 0 1 336 158.73935] CT
N
f1394637256
f
GR
GS
[1 0 0 1 336 158.73935] CT
10.0 ML
2 LW
N
-3 0 M
3 0 L
S
GR
GS
[1 0 0 1 377 133.85519] CT
N
f1394637256
f
GR
GS
[1 0 0 1 377 133.85519] CT
10.0 ML
2 LW
N
-3 0 M
3 0 L
S
GR
GS
[1 0 0 1 418 145.28952] CT
N
f1394637256
f
GR
GS
[1 0 0 1 418 145.28952] CT
10.0 ML
2 LW
N
-3 0 M
3 0 L
S
GR
GS
[1 0 0 1 459 135.03284] CT
N
f1394637256
f
GR
GS
[1 0 0 1 459 135.03284] CT
10.0 ML
2 LW
N
-3 0 M
3 0 L
S
GR
GS
[1 0 0 1 336 146.01054] CT
N
f1394637256
f
GR
GS
[1 0 0 1 336 146.01054] CT
10.0 ML
2 LW
N
-3 0 M
3 0 L
S
GR
GS
[1 0 0 1 377 119.40109] CT
N
f1394637256
f
GR
GS
[1 0 0 1 377 119.40109] CT
10.0 ML
2 LW
N
-3 0 M
3 0 L
S
GR
GS
[1 0 0 1 418 131.97421] CT
N
f1394637256
f
GR
GS
[1 0 0 1 418 131.97421] CT
10.0 ML
2 LW
N
-3 0 M
3 0 L
S
GR
GS
[1 0 0 1 459 122.82704] CT
N
f1394637256
f
GR
GS
[1 0 0 1 459 122.82704] CT
10.0 ML
2 LW
N
-3 0 M
3 0 L
S
GR
GS
1 GC
N
/f1518103080{531 174 M
695 174 L
695 22 L
531 22 L
cp}def
f1518103080
f
GR
GS
0.149 GC
2 setlinecap
1 LJ
0.5 LW
N
531 174 M
695 174 L
S
GR
GS
0.149 GC
2 setlinecap
1 LJ
0.5 LW
N
580.2 174 M
580.2 172.36 L
S
GR
GS
0.149 GC
2 setlinecap
1 LJ
0.5 LW
N
645.8 174 M
645.8 172.36 L
S
GR
GS
[1 0 0 1 580.20001 178.99991] CT
0.149 GC
/Helvetica 15 F
GS
[1 0 0 1 0 0] CT
-10 15 moveto 
1 -1 scale
(YA) t 
GR
GR
GS
[1 0 0 1 645.79999 178.99991] CT
0.149 GC
/Helvetica 15 F
GS
[1 0 0 1 0 0] CT
-11 15 moveto 
1 -1 scale
(OA) t 
GR
GR
GS
[1 0 0 1 613.00006 197.99991] CT
0.149 GC
/Helvetica 15 F
GS
[1 0 0 1 0 0] CT
-36.5 15 moveto 
1 -1 scale
(Age Group) t 
GR
GR
GS
0.149 GC
2 setlinecap
1 LJ
0.5 LW
N
531 174 M
531 22 L
S
GR
GS
1 LJ
3 LW
N
580.2 106.442 M
580.2 115.479 L
S
GR
GS
1 LJ
3 LW
N
645.8 137.572 M
645.8 144.027 L
S
GR
GS
1 LJ
3 LW
N
580.2 106.442 M
580.2 97.404 L
S
GR
GS
1 LJ
3 LW
N
645.8 137.572 M
645.8 131.117 L
S
GR
GS
1 LJ
3 LW
N
580.2 106.442 M
645.8 137.572 L
S
GR
GS
[1 0 0 1 580.20001 115.47939] CT
N
f1394637256
f
GR
GS
[1 0 0 1 580.20001 115.47939] CT
10.0 ML
3 LW
N
-3 0 M
3 0 L
S
GR
GS
[1 0 0 1 645.79999 144.02722] CT
N
f1394637256
f
GR
GS
[1 0 0 1 645.79999 144.02722] CT
10.0 ML
3 LW
N
-3 0 M
3 0 L
S
GR
GS
[1 0 0 1 580.20001 97.40364] CT
N
f1394637256
f
GR
GS
[1 0 0 1 580.20001 97.40364] CT
10.0 ML
3 LW
N
-3 0 M
3 0 L
S
GR
GS
[1 0 0 1 645.79999 131.11693] CT
N
f1394637256
f
GR
GS
[1 0 0 1 645.79999 131.11693] CT
10.0 ML
3 LW
N
-3 0 M
3 0 L
S
GR
%%Trailer
%%Pages: 1
%%EOF
