%!PS-Adobe-3.0 EPSF-3.0
%%Creator: (MATLAB, The Mathworks, Inc. Version 9.8.0.1323502 \(R2020a\). Operating System: Mac OS X)
%%Title: /Users/kosciessa/Desktop/tardis/LNDG/stateswitch/stsw_fmri_task/decoding/figures/G_decode/G6D_winOption_VC_loadeffects_groupavg.eps
%%CreationDate: 2022-03-01T09:18:30
%%Pages: (atend)
%%BoundingBox:    47     0   696   211
%%LanguageLevel: 3
%%EndComments
%%BeginProlog
%%BeginResource: procset (Apache XML Graphics Std ProcSet) 1.2 0
%%Version: 1.2 0
%%Copyright: (Copyright 2001-2003,2010 The Apache Software Foundation. License terms: http://www.apache.org/licenses/LICENSE-2.0)
/bd{bind def}bind def
/ld{load def}bd
/GR/grestore ld
/GS/gsave ld
/RM/rmoveto ld
/C/curveto ld
/t/show ld
/L/lineto ld
/ML/setmiterlimit ld
/CT/concat ld
/f/fill ld
/N/newpath ld
/S/stroke ld
/CC/setcmykcolor ld
/A/ashow ld
/cp/closepath ld
/RC/setrgbcolor ld
/LJ/setlinejoin ld
/GC/setgray ld
/LW/setlinewidth ld
/M/moveto ld
/re {4 2 roll M
1 index 0 rlineto
0 exch rlineto
neg 0 rlineto
cp } bd
/_ctm matrix def
/_tm matrix def
/BT { _ctm currentmatrix pop matrix _tm copy pop 0 0 moveto } bd
/ET { _ctm setmatrix } bd
/iTm { _ctm setmatrix _tm concat } bd
/Tm { _tm astore pop iTm 0 0 moveto } bd
/ux 0.0 def
/uy 0.0 def
/F {
  /Tp exch def
  /Tf exch def
  Tf findfont Tp scalefont setfont
  /cf Tf def  /cs Tp def
} bd
/ULS {currentpoint /uy exch def /ux exch def} bd
/ULE {
  /Tcx currentpoint pop def
  gsave
  newpath
  cf findfont cs scalefont dup
  /FontMatrix get 0 get /Ts exch def /FontInfo get dup
  /UnderlinePosition get Ts mul /To exch def
  /UnderlineThickness get Ts mul /Tt exch def
  ux uy To add moveto  Tcx uy To add lineto
  Tt setlinewidth stroke
  grestore
} bd
/OLE {
  /Tcx currentpoint pop def
  gsave
  newpath
  cf findfont cs scalefont dup
  /FontMatrix get 0 get /Ts exch def /FontInfo get dup
  /UnderlinePosition get Ts mul /To exch def
  /UnderlineThickness get Ts mul /Tt exch def
  ux uy To add cs add moveto Tcx uy To add cs add lineto
  Tt setlinewidth stroke
  grestore
} bd
/SOE {
  /Tcx currentpoint pop def
  gsave
  newpath
  cf findfont cs scalefont dup
  /FontMatrix get 0 get /Ts exch def /FontInfo get dup
  /UnderlinePosition get Ts mul /To exch def
  /UnderlineThickness get Ts mul /Tt exch def
  ux uy To add cs 10 mul 26 idiv add moveto Tcx uy To add cs 10 mul 26 idiv add lineto
  Tt setlinewidth stroke
  grestore
} bd
/QT {
/Y22 exch store
/X22 exch store
/Y21 exch store
/X21 exch store
currentpoint
/Y21 load 2 mul add 3 div exch
/X21 load 2 mul add 3 div exch
/X21 load 2 mul /X22 load add 3 div
/Y21 load 2 mul /Y22 load add 3 div
/X22 load /Y22 load curveto
} bd
/SSPD {
dup length /d exch dict def
{
/v exch def
/k exch def
currentpagedevice k known {
/cpdv currentpagedevice k get def
v cpdv ne {
/upd false def
/nullv v type /nulltype eq def
/nullcpdv cpdv type /nulltype eq def
nullv nullcpdv or
{
/upd true def
} {
/sametype v type cpdv type eq def
sametype {
v type /arraytype eq {
/vlen v length def
/cpdvlen cpdv length def
vlen cpdvlen eq {
0 1 vlen 1 sub {
/i exch def
/obj v i get def
/cpdobj cpdv i get def
obj cpdobj ne {
/upd true def
exit
} if
} for
} {
/upd true def
} ifelse
} {
v type /dicttype eq {
v {
/dv exch def
/dk exch def
/cpddv cpdv dk get def
dv cpddv ne {
/upd true def
exit
} if
} forall
} {
/upd true def
} ifelse
} ifelse
} if
} ifelse
upd true eq {
d k v put
} if
} if
} if
} forall
d length 0 gt {
d setpagedevice
} if
} bd
/RE { % /NewFontName [NewEncodingArray] /FontName RE -
  findfont dup length dict begin
  {
    1 index /FID ne
    {def} {pop pop} ifelse
  } forall
  /Encoding exch def
  /FontName 1 index def
  currentdict definefont pop
  end
} bind def
%%EndResource
%%BeginResource: procset (Apache XML Graphics EPS ProcSet) 1.0 0
%%Version: 1.0 0
%%Copyright: (Copyright 2002-2003 The Apache Software Foundation. License terms: http://www.apache.org/licenses/LICENSE-2.0)
/BeginEPSF { %def
/b4_Inc_state save def         % Save state for cleanup
/dict_count countdictstack def % Count objects on dict stack
/op_count count 1 sub def      % Count objects on operand stack
userdict begin                 % Push userdict on dict stack
/showpage { } def              % Redefine showpage, { } = null proc
0 setgray 0 setlinecap         % Prepare graphics state
1 setlinewidth 0 setlinejoin
10 setmiterlimit [ ] 0 setdash newpath
/languagelevel where           % If level not equal to 1 then
{pop languagelevel             % set strokeadjust and
1 ne                           % overprint to their defaults.
{false setstrokeadjust false setoverprint
} if
} if
} bd
/EndEPSF { %def
count op_count sub {pop} repeat            % Clean up stacks
countdictstack dict_count sub {end} repeat
b4_Inc_state restore
} bd
%%EndResource
%FOPBeginFontDict
%%IncludeResource: font Courier-Oblique
%%IncludeResource: font Courier-BoldOblique
%%IncludeResource: font Courier-Bold
%%IncludeResource: font ZapfDingbats
%%IncludeResource: font Symbol
%%IncludeResource: font Helvetica
%%IncludeResource: font Helvetica-Oblique
%%IncludeResource: font Helvetica-Bold
%%IncludeResource: font Helvetica-BoldOblique
%%IncludeResource: font Times-Roman
%%IncludeResource: font Times-Italic
%%IncludeResource: font Times-Bold
%%IncludeResource: font Times-BoldItalic
%%IncludeResource: font Courier
%FOPEndFontDict
%%BeginResource: encoding WinAnsiEncoding
/WinAnsiEncoding [
/.notdef /.notdef /.notdef /.notdef /.notdef
/.notdef /.notdef /.notdef /.notdef /.notdef
/.notdef /.notdef /.notdef /.notdef /.notdef
/.notdef /.notdef /.notdef /.notdef /.notdef
/.notdef /.notdef /.notdef /.notdef /.notdef
/.notdef /.notdef /.notdef /.notdef /.notdef
/.notdef /.notdef /space /exclam /quotedbl
/numbersign /dollar /percent /ampersand /quotesingle
/parenleft /parenright /asterisk /plus /comma
/hyphen /period /slash /zero /one
/two /three /four /five /six
/seven /eight /nine /colon /semicolon
/less /equal /greater /question /at
/A /B /C /D /E
/F /G /H /I /J
/K /L /M /N /O
/P /Q /R /S /T
/U /V /W /X /Y
/Z /bracketleft /backslash /bracketright /asciicircum
/underscore /quoteleft /a /b /c
/d /e /f /g /h
/i /j /k /l /m
/n /o /p /q /r
/s /t /u /v /w
/x /y /z /braceleft /bar
/braceright /asciitilde /bullet /Euro /bullet
/quotesinglbase /florin /quotedblbase /ellipsis /dagger
/daggerdbl /circumflex /perthousand /Scaron /guilsinglleft
/OE /bullet /Zcaron /bullet /bullet
/quoteleft /quoteright /quotedblleft /quotedblright /bullet
/endash /emdash /asciitilde /trademark /scaron
/guilsinglright /oe /bullet /zcaron /Ydieresis
/space /exclamdown /cent /sterling /currency
/yen /brokenbar /section /dieresis /copyright
/ordfeminine /guillemotleft /logicalnot /sfthyphen /registered
/macron /degree /plusminus /twosuperior /threesuperior
/acute /mu /paragraph /middot /cedilla
/onesuperior /ordmasculine /guillemotright /onequarter /onehalf
/threequarters /questiondown /Agrave /Aacute /Acircumflex
/Atilde /Adieresis /Aring /AE /Ccedilla
/Egrave /Eacute /Ecircumflex /Edieresis /Igrave
/Iacute /Icircumflex /Idieresis /Eth /Ntilde
/Ograve /Oacute /Ocircumflex /Otilde /Odieresis
/multiply /Oslash /Ugrave /Uacute /Ucircumflex
/Udieresis /Yacute /Thorn /germandbls /agrave
/aacute /acircumflex /atilde /adieresis /aring
/ae /ccedilla /egrave /eacute /ecircumflex
/edieresis /igrave /iacute /icircumflex /idieresis
/eth /ntilde /ograve /oacute /ocircumflex
/otilde /odieresis /divide /oslash /ugrave
/uacute /ucircumflex /udieresis /yacute /thorn
/ydieresis
] def
%%EndResource
%FOPBeginFontReencode
/Courier-Oblique findfont
dup length dict begin
  {1 index /FID ne {def} {pop pop} ifelse} forall
  /Encoding WinAnsiEncoding def
  currentdict
end
/Courier-Oblique exch definefont pop
/Courier-BoldOblique findfont
dup length dict begin
  {1 index /FID ne {def} {pop pop} ifelse} forall
  /Encoding WinAnsiEncoding def
  currentdict
end
/Courier-BoldOblique exch definefont pop
/Courier-Bold findfont
dup length dict begin
  {1 index /FID ne {def} {pop pop} ifelse} forall
  /Encoding WinAnsiEncoding def
  currentdict
end
/Courier-Bold exch definefont pop
/Helvetica findfont
dup length dict begin
  {1 index /FID ne {def} {pop pop} ifelse} forall
  /Encoding WinAnsiEncoding def
  currentdict
end
/Helvetica exch definefont pop
/Helvetica-Oblique findfont
dup length dict begin
  {1 index /FID ne {def} {pop pop} ifelse} forall
  /Encoding WinAnsiEncoding def
  currentdict
end
/Helvetica-Oblique exch definefont pop
/Helvetica-Bold findfont
dup length dict begin
  {1 index /FID ne {def} {pop pop} ifelse} forall
  /Encoding WinAnsiEncoding def
  currentdict
end
/Helvetica-Bold exch definefont pop
/Helvetica-BoldOblique findfont
dup length dict begin
  {1 index /FID ne {def} {pop pop} ifelse} forall
  /Encoding WinAnsiEncoding def
  currentdict
end
/Helvetica-BoldOblique exch definefont pop
/Times-Roman findfont
dup length dict begin
  {1 index /FID ne {def} {pop pop} ifelse} forall
  /Encoding WinAnsiEncoding def
  currentdict
end
/Times-Roman exch definefont pop
/Times-Italic findfont
dup length dict begin
  {1 index /FID ne {def} {pop pop} ifelse} forall
  /Encoding WinAnsiEncoding def
  currentdict
end
/Times-Italic exch definefont pop
/Times-Bold findfont
dup length dict begin
  {1 index /FID ne {def} {pop pop} ifelse} forall
  /Encoding WinAnsiEncoding def
  currentdict
end
/Times-Bold exch definefont pop
/Times-BoldItalic findfont
dup length dict begin
  {1 index /FID ne {def} {pop pop} ifelse} forall
  /Encoding WinAnsiEncoding def
  currentdict
end
/Times-BoldItalic exch definefont pop
/Courier findfont
dup length dict begin
  {1 index /FID ne {def} {pop pop} ifelse} forall
  /Encoding WinAnsiEncoding def
  currentdict
end
/Courier exch definefont pop
%FOPEndFontReencode
%%EndProlog
%%Page: 1 1
%%PageBoundingBox: 0 0 768 216
%%BeginPageSetup
[1 0 0 -1 0 216] CT
%%EndPageSetup
GS
1 GC
N
0 0 768 216 re
f
GR
GS
1 GC
N
0 0 768 216 re
f
GR
GS
1 GC
N
100 174 M
263.5 174 L
263.5 22.5 L
100 22.5 L
cp
f
GR
GS
0.149 GC
2 setlinecap
1 LJ
0.5 LW
N
100 174 M
263.5 174 L
S
GR
GS
0.149 GC
2 setlinecap
1 LJ
0.5 LW
N
120.438 174 M
120.438 172.365 L
S
GR
GS
0.149 GC
2 setlinecap
1 LJ
0.5 LW
N
161.313 174 M
161.313 172.365 L
S
GR
GS
0.149 GC
2 setlinecap
1 LJ
0.5 LW
N
202.188 174 M
202.188 172.365 L
S
GR
GS
0.149 GC
2 setlinecap
1 LJ
0.5 LW
N
243.063 174 M
243.063 172.365 L
S
GR
GS
[1 0 0 1 120.4375 179.00006] CT
0.149 GC
/Helvetica 15 F
GS
[1 0 0 1 0 0] CT
-4.5 15 moveto 
1 -1 scale
(1) t 
GR
GR
GS
[1 0 0 1 161.3125 179.00006] CT
0.149 GC
/Helvetica 15 F
GS
[1 0 0 1 0 0] CT
-4.5 15 moveto 
1 -1 scale
(2) t 
GR
GR
GS
[1 0 0 1 202.1875 179.00006] CT
0.149 GC
/Helvetica 15 F
GS
[1 0 0 1 0 0] CT
-4.5 15 moveto 
1 -1 scale
(3) t 
GR
GR
GS
[1 0 0 1 243.0625 179.00006] CT
0.149 GC
/Helvetica 15 F
GS
[1 0 0 1 0 0] CT
-4.5 15 moveto 
1 -1 scale
(4) t 
GR
GR
GS
0.149 GC
2 setlinecap
1 LJ
0.5 LW
N
100 174 M
100 22.5 L
S
GR
GS
0.149 GC
2 setlinecap
1 LJ
0.5 LW
N
100 152.357 M
101.635 152.357 L
S
GR
GS
0.149 GC
2 setlinecap
1 LJ
0.5 LW
N
100 109.072 M
101.635 109.072 L
S
GR
GS
0.149 GC
2 setlinecap
1 LJ
0.5 LW
N
100 65.786 M
101.635 65.786 L
S
GR
GS
0.149 GC
2 setlinecap
1 LJ
0.5 LW
N
100 22.5 M
101.635 22.5 L
S
GR
GS
[1 0 0 1 95 152.35681] CT
0.149 GC
/Helvetica 15 F
GS
[1 0 0 1 0 0] CT
-30 5.5 moveto 
1 -1 scale
(50.4) t 
GR
GR
GS
[1 0 0 1 95 109.07176] CT
0.149 GC
/Helvetica 15 F
GS
[1 0 0 1 0 0] CT
-30 5.5 moveto 
1 -1 scale
(50.6) t 
GR
GR
GS
[1 0 0 1 95 65.78588] CT
0.149 GC
/Helvetica 15 F
GS
[1 0 0 1 0 0] CT
-30 5.5 moveto 
1 -1 scale
(50.8) t 
GR
GR
GS
[1 0 0 1 95 22.5] CT
0.149 GC
/Helvetica 15 F
GS
[1 0 0 1 0 0] CT
-17 5.5 moveto 
1 -1 scale
(51) t 
GR
GR
GS
[0 -1 1 0 62.5 98.24967] CT
0.149 GC
/Helvetica 15 F
GS
[1 0 0 1 0 0] CT
-78.5 -4 moveto 
1 -1 scale
(Decoding accuracy \(%\)) t 
GR
GR
GS
[1 0 0 1 181.75017 20.62504] CT
/Helvetica-Bold 15 F
GS
[1 0 0 1 0 0] CT
-8.5 -4 moveto 
1 -1 scale
(all) t 
GR
GR
GS
1 LJ
2 LW
N
120.438 112.149 M
120.438 127.941 L
S
GR
GS
1 LJ
2 LW
N
161.313 85.201 M
161.313 102.615 L
S
GR
GS
1 LJ
2 LW
N
202.188 112.967 M
202.188 128.512 L
S
GR
GS
1 LJ
2 LW
N
243.063 94.486 M
243.063 109.456 L
S
GR
GS
1 LJ
2 LW
N
120.438 112.149 M
120.438 96.356 L
S
GR
GS
1 LJ
2 LW
N
161.313 85.201 M
161.313 67.786 L
S
GR
GS
1 LJ
2 LW
N
202.188 112.967 M
202.188 97.422 L
S
GR
GS
1 LJ
2 LW
N
243.063 94.486 M
243.063 79.515 L
S
GR
GS
1 LJ
2 LW
N
120.438 112.149 M
161.313 85.201 L
202.188 112.967 L
243.063 94.486 L
S
GR
GS
[1 0 0 1 120.4375 127.94106] CT
N
-3 0 M
3 0 L
f
GR
GS
[1 0 0 1 120.4375 127.94106] CT
10.0 ML
2 LW
N
-3 0 M
3 0 L
S
GR
GS
[1 0 0 1 161.3125 102.61467] CT
N
/f1394637256{-3 0 M
3 0 L}def
f1394637256
f
GR
GS
[1 0 0 1 161.3125 102.61467] CT
10.0 ML
2 LW
N
-3 0 M
3 0 L
S
GR
GS
[1 0 0 1 202.1875 128.51157] CT
N
f1394637256
f
GR
GS
[1 0 0 1 202.1875 128.51157] CT
10.0 ML
2 LW
N
-3 0 M
3 0 L
S
GR
GS
[1 0 0 1 243.0625 109.45567] CT
N
f1394637256
f
GR
GS
[1 0 0 1 243.0625 109.45567] CT
10.0 ML
2 LW
N
-3 0 M
3 0 L
S
GR
GS
[1 0 0 1 120.4375 96.35572] CT
N
f1394637256
f
GR
GS
[1 0 0 1 120.4375 96.35572] CT
10.0 ML
2 LW
N
-3 0 M
3 0 L
S
GR
GS
[1 0 0 1 161.3125 67.78633] CT
N
f1394637256
f
GR
GS
[1 0 0 1 161.3125 67.78633] CT
10.0 ML
2 LW
N
-3 0 M
3 0 L
S
GR
GS
[1 0 0 1 202.1875 97.42159] CT
N
f1394637256
f
GR
GS
[1 0 0 1 202.1875 97.42159] CT
10.0 ML
2 LW
N
-3 0 M
3 0 L
S
GR
GS
[1 0 0 1 243.0625 79.51494] CT
N
f1394637256
f
GR
GS
[1 0 0 1 243.0625 79.51494] CT
10.0 ML
2 LW
N
-3 0 M
3 0 L
S
GR
GS
1 GC
N
/f-1478639854{315.5 174 M
479.5 174 L
479.5 22.5 L
315.5 22.5 L
cp}def
f-1478639854
f
GR
GS
0.149 GC
2 setlinecap
1 LJ
0.5 LW
N
315.5 174 M
479.5 174 L
S
GR
GS
0.149 GC
2 setlinecap
1 LJ
0.5 LW
N
336 174 M
336 172.36 L
S
GR
GS
0.149 GC
2 setlinecap
1 LJ
0.5 LW
N
377 174 M
377 172.36 L
S
GR
GS
0.149 GC
2 setlinecap
1 LJ
0.5 LW
N
418 174 M
418 172.36 L
S
GR
GS
0.149 GC
2 setlinecap
1 LJ
0.5 LW
N
459 174 M
459 172.36 L
S
GR
GS
[1 0 0 1 336 178.99983] CT
0.149 GC
/Helvetica 15 F
GS
[1 0 0 1 0 0] CT
-4.5 15 moveto 
1 -1 scale
(1) t 
GR
GR
GS
[1 0 0 1 377 178.99983] CT
0.149 GC
/Helvetica 15 F
GS
[1 0 0 1 0 0] CT
-4.5 15 moveto 
1 -1 scale
(2) t 
GR
GR
GS
[1 0 0 1 418 178.99983] CT
0.149 GC
/Helvetica 15 F
GS
[1 0 0 1 0 0] CT
-4.5 15 moveto 
1 -1 scale
(3) t 
GR
GR
GS
[1 0 0 1 459 178.99983] CT
0.149 GC
/Helvetica 15 F
GS
[1 0 0 1 0 0] CT
-4.5 15 moveto 
1 -1 scale
(4) t 
GR
GR
GS
[1 0 0 1 397.50009 198.00014] CT
0.149 GC
/Helvetica 15 F
GS
[1 0 0 1 0 0] CT
-28 15 moveto 
1 -1 scale
(Target #) t 
GR
GR
GS
0.149 GC
2 setlinecap
1 LJ
0.5 LW
N
315.5 174 M
315.5 22.5 L
S
GR
GS
0.149 GC
2 setlinecap
1 LJ
0.5 LW
N
315.5 174 M
317.14 174 L
S
GR
GS
0.149 GC
2 setlinecap
1 LJ
0.5 LW
N
315.5 123.5 M
317.14 123.5 L
S
GR
GS
0.149 GC
2 setlinecap
1 LJ
0.5 LW
N
315.5 73 M
317.14 73 L
S
GR
GS
0.149 GC
2 setlinecap
1 LJ
0.5 LW
N
315.5 22.5 M
317.14 22.5 L
S
GR
GS
[1 0 0 1 310.5 174] CT
0.149 GC
/Helvetica 15 F
GS
[1 0 0 1 0 0] CT
-30 5.5 moveto 
1 -1 scale
(50.5) t 
GR
GR
GS
[1 0 0 1 310.5 123.5] CT
0.149 GC
/Helvetica 15 F
GS
[1 0 0 1 0 0] CT
-17 5.5 moveto 
1 -1 scale
(51) t 
GR
GR
GS
[1 0 0 1 310.5 73] CT
0.149 GC
/Helvetica 15 F
GS
[1 0 0 1 0 0] CT
-30 5.5 moveto 
1 -1 scale
(51.5) t 
GR
GR
GS
[1 0 0 1 310.5 22.5] CT
0.149 GC
/Helvetica 15 F
GS
[1 0 0 1 0 0] CT
-17 5.5 moveto 
1 -1 scale
(52) t 
GR
GR
GS
[1 0 0 1 397.50037 20.62482] CT
/Helvetica-Bold 15 F
GS
[1 0 0 1 0 0] CT
-26 -4 moveto 
1 -1 scale
(Probed) t 
GR
GR
GS
1 LJ
2 LW
N
336 77.657 M
336 92.925 L
S
GR
GS
1 LJ
2 LW
N
377 117.84 M
377 132.736 L
S
GR
GS
1 LJ
2 LW
N
418 129.108 M
418 143.343 L
S
GR
GS
1 LJ
2 LW
N
459 132.653 M
459 146.504 L
S
GR
GS
1 LJ
2 LW
N
336 77.657 M
336 62.39 L
S
GR
GS
1 LJ
2 LW
N
377 117.84 M
377 102.945 L
S
GR
GS
1 LJ
2 LW
N
418 129.108 M
418 114.872 L
S
GR
GS
1 LJ
2 LW
N
459 132.653 M
459 118.802 L
S
GR
GS
1 LJ
2 LW
N
336 77.657 M
377 117.84 L
418 129.108 L
459 132.653 L
S
GR
GS
[1 0 0 1 336 92.9246] CT
N
f1394637256
f
GR
GS
[1 0 0 1 336 92.9246] CT
10.0 ML
2 LW
N
-3 0 M
3 0 L
S
GR
GS
[1 0 0 1 377 132.73566] CT
N
f1394637256
f
GR
GS
[1 0 0 1 377 132.73566] CT
10.0 ML
2 LW
N
-3 0 M
3 0 L
S
GR
GS
[1 0 0 1 418 143.34331] CT
N
f1394637256
f
GR
GS
[1 0 0 1 418 143.34331] CT
10.0 ML
2 LW
N
-3 0 M
3 0 L
S
GR
GS
[1 0 0 1 459 146.50378] CT
N
f1394637256
f
GR
GS
[1 0 0 1 459 146.50378] CT
10.0 ML
2 LW
N
-3 0 M
3 0 L
S
GR
GS
[1 0 0 1 336 62.39004] CT
N
f1394637256
f
GR
GS
[1 0 0 1 336 62.39004] CT
10.0 ML
2 LW
N
-3 0 M
3 0 L
S
GR
GS
[1 0 0 1 377 102.94469] CT
N
f1394637256
f
GR
GS
[1 0 0 1 377 102.94469] CT
10.0 ML
2 LW
N
-3 0 M
3 0 L
S
GR
GS
[1 0 0 1 418 114.87194] CT
N
f1394637256
f
GR
GS
[1 0 0 1 418 114.87194] CT
10.0 ML
2 LW
N
-3 0 M
3 0 L
S
GR
GS
[1 0 0 1 459 118.80223] CT
N
f1394637256
f
GR
GS
[1 0 0 1 459 118.80223] CT
10.0 ML
2 LW
N
-3 0 M
3 0 L
S
GR
GS
1 GC
N
/f-443049144{531 174 M
695 174 L
695 22.5 L
531 22.5 L
cp}def
f-443049144
f
GR
GS
0.149 GC
2 setlinecap
1 LJ
0.5 LW
N
531 174 M
695 174 L
S
GR
GS
0.149 GC
2 setlinecap
1 LJ
0.5 LW
N
551.5 174 M
551.5 172.36 L
S
GR
GS
0.149 GC
2 setlinecap
1 LJ
0.5 LW
N
592.5 174 M
592.5 172.36 L
S
GR
GS
0.149 GC
2 setlinecap
1 LJ
0.5 LW
N
633.5 174 M
633.5 172.36 L
S
GR
GS
0.149 GC
2 setlinecap
1 LJ
0.5 LW
N
674.5 174 M
674.5 172.36 L
S
GR
GS
[1 0 0 1 551.5 179.00021] CT
0.149 GC
/Helvetica 15 F
GS
[1 0 0 1 0 0] CT
-4.5 15 moveto 
1 -1 scale
(1) t 
GR
GR
GS
[1 0 0 1 592.5 179.00021] CT
0.149 GC
/Helvetica 15 F
GS
[1 0 0 1 0 0] CT
-4.5 15 moveto 
1 -1 scale
(2) t 
GR
GR
GS
[1 0 0 1 633.5 179.00021] CT
0.149 GC
/Helvetica 15 F
GS
[1 0 0 1 0 0] CT
-4.5 15 moveto 
1 -1 scale
(3) t 
GR
GR
GS
[1 0 0 1 674.5 179.00021] CT
0.149 GC
/Helvetica 15 F
GS
[1 0 0 1 0 0] CT
-4.5 15 moveto 
1 -1 scale
(4) t 
GR
GR
GS
0.149 GC
2 setlinecap
1 LJ
0.5 LW
N
531 174 M
531 22.5 L
S
GR
GS
0.149 GC
2 setlinecap
1 LJ
0.5 LW
N
531 174 M
532.64 174 L
S
GR
GS
0.149 GC
2 setlinecap
1 LJ
0.5 LW
N
531 98.25 M
532.64 98.25 L
S
GR
GS
0.149 GC
2 setlinecap
1 LJ
0.5 LW
N
531 22.5 M
532.64 22.5 L
S
GR
GS
[1 0 0 1 526 174] CT
0.149 GC
/Helvetica 15 F
GS
[1 0 0 1 0 0] CT
-17 5.5 moveto 
1 -1 scale
(50) t 
GR
GR
GS
[1 0 0 1 526 98.25] CT
0.149 GC
/Helvetica 15 F
GS
[1 0 0 1 0 0] CT
-30 5.5 moveto 
1 -1 scale
(50.5) t 
GR
GR
GS
[1 0 0 1 526 22.5] CT
0.149 GC
/Helvetica 15 F
GS
[1 0 0 1 0 0] CT
-17 5.5 moveto 
1 -1 scale
(51) t 
GR
GR
GS
[1 0 0 1 613.00061 20.62521] CT
/Helvetica-Bold 15 F
GS
[1 0 0 1 0 0] CT
-36 -4 moveto 
1 -1 scale
(Unprobed) t 
GR
GR
GS
1 LJ
2 LW
N
551.5 129.093 M
551.5 141.174 L
S
GR
GS
1 LJ
2 LW
N
592.5 83.85 M
592.5 97.883 L
S
GR
GS
1 LJ
2 LW
N
633.5 104.132 M
633.5 117.223 L
S
GR
GS
1 LJ
2 LW
N
674.5 85.11 M
674.5 96.61 L
S
GR
GS
1 LJ
2 LW
N
551.5 129.093 M
551.5 117.013 L
S
GR
GS
1 LJ
2 LW
N
592.5 83.85 M
592.5 69.818 L
S
GR
GS
1 LJ
2 LW
N
633.5 104.132 M
633.5 91.041 L
S
GR
GS
1 LJ
2 LW
N
674.5 85.11 M
674.5 73.61 L
S
GR
GS
1 LJ
2 LW
N
551.5 129.093 M
592.5 83.85 L
633.5 104.132 L
674.5 85.11 L
S
GR
GS
[1 0 0 1 551.5 141.17377] CT
N
f1394637256
f
GR
GS
[1 0 0 1 551.5 141.17377] CT
10.0 ML
2 LW
N
-3 0 M
3 0 L
S
GR
GS
[1 0 0 1 592.5 97.88302] CT
N
f1394637256
f
GR
GS
[1 0 0 1 592.5 97.88302] CT
10.0 ML
2 LW
N
-3 0 M
3 0 L
S
GR
GS
[1 0 0 1 633.5 117.22276] CT
N
f1394637256
f
GR
GS
[1 0 0 1 633.5 117.22276] CT
10.0 ML
2 LW
N
-3 0 M
3 0 L
S
GR
GS
[1 0 0 1 674.5 96.61042] CT
N
f1394637256
f
GR
GS
[1 0 0 1 674.5 96.61042] CT
10.0 ML
2 LW
N
-3 0 M
3 0 L
S
GR
GS
[1 0 0 1 551.5 117.01297] CT
N
f1394637256
f
GR
GS
[1 0 0 1 551.5 117.01297] CT
10.0 ML
2 LW
N
-3 0 M
3 0 L
S
GR
GS
[1 0 0 1 592.5 69.81774] CT
N
f1394637256
f
GR
GS
[1 0 0 1 592.5 69.81774] CT
10.0 ML
2 LW
N
-3 0 M
3 0 L
S
GR
GS
[1 0 0 1 633.5 91.04094] CT
N
f1394637256
f
GR
GS
[1 0 0 1 633.5 91.04094] CT
10.0 ML
2 LW
N
-3 0 M
3 0 L
S
GR
GS
[1 0 0 1 674.5 73.60952] CT
N
f1394637256
f
GR
GS
[1 0 0 1 674.5 73.60952] CT
10.0 ML
2 LW
N
-3 0 M
3 0 L
S
GR
%%Trailer
%%Pages: 1
%%EOF
