%!PS-Adobe-3.0 EPSF-3.0
%%Creator: (MATLAB, The Mathworks, Inc. Version 9.8.0.1323502 \(R2020a\). Operating System: Mac OS X)
%%Title: /Users/kosciessa/Desktop/mntTardisLNDG/LNDG/stateswitch/stsw_fmri_task/decoding/figures/G_decode/G6D_winOption_VC_byFeature_acrossGroups.eps
%%CreationDate: 2022-03-03T18:11:26
%%Pages: (atend)
%%BoundingBox:    86     3   928   209
%%LanguageLevel: 3
%%EndComments
%%BeginProlog
%%BeginResource: procset (Apache XML Graphics Std ProcSet) 1.2 0
%%Version: 1.2 0
%%Copyright: (Copyright 2001-2003,2010 The Apache Software Foundation. License terms: http://www.apache.org/licenses/LICENSE-2.0)
/bd{bind def}bind def
/ld{load def}bd
/GR/grestore ld
/GS/gsave ld
/RM/rmoveto ld
/C/curveto ld
/t/show ld
/L/lineto ld
/ML/setmiterlimit ld
/CT/concat ld
/f/fill ld
/N/newpath ld
/S/stroke ld
/CC/setcmykcolor ld
/A/ashow ld
/cp/closepath ld
/RC/setrgbcolor ld
/LJ/setlinejoin ld
/GC/setgray ld
/LW/setlinewidth ld
/M/moveto ld
/re {4 2 roll M
1 index 0 rlineto
0 exch rlineto
neg 0 rlineto
cp } bd
/_ctm matrix def
/_tm matrix def
/BT { _ctm currentmatrix pop matrix _tm copy pop 0 0 moveto } bd
/ET { _ctm setmatrix } bd
/iTm { _ctm setmatrix _tm concat } bd
/Tm { _tm astore pop iTm 0 0 moveto } bd
/ux 0.0 def
/uy 0.0 def
/F {
  /Tp exch def
  /Tf exch def
  Tf findfont Tp scalefont setfont
  /cf Tf def  /cs Tp def
} bd
/ULS {currentpoint /uy exch def /ux exch def} bd
/ULE {
  /Tcx currentpoint pop def
  gsave
  newpath
  cf findfont cs scalefont dup
  /FontMatrix get 0 get /Ts exch def /FontInfo get dup
  /UnderlinePosition get Ts mul /To exch def
  /UnderlineThickness get Ts mul /Tt exch def
  ux uy To add moveto  Tcx uy To add lineto
  Tt setlinewidth stroke
  grestore
} bd
/OLE {
  /Tcx currentpoint pop def
  gsave
  newpath
  cf findfont cs scalefont dup
  /FontMatrix get 0 get /Ts exch def /FontInfo get dup
  /UnderlinePosition get Ts mul /To exch def
  /UnderlineThickness get Ts mul /Tt exch def
  ux uy To add cs add moveto Tcx uy To add cs add lineto
  Tt setlinewidth stroke
  grestore
} bd
/SOE {
  /Tcx currentpoint pop def
  gsave
  newpath
  cf findfont cs scalefont dup
  /FontMatrix get 0 get /Ts exch def /FontInfo get dup
  /UnderlinePosition get Ts mul /To exch def
  /UnderlineThickness get Ts mul /Tt exch def
  ux uy To add cs 10 mul 26 idiv add moveto Tcx uy To add cs 10 mul 26 idiv add lineto
  Tt setlinewidth stroke
  grestore
} bd
/QT {
/Y22 exch store
/X22 exch store
/Y21 exch store
/X21 exch store
currentpoint
/Y21 load 2 mul add 3 div exch
/X21 load 2 mul add 3 div exch
/X21 load 2 mul /X22 load add 3 div
/Y21 load 2 mul /Y22 load add 3 div
/X22 load /Y22 load curveto
} bd
/SSPD {
dup length /d exch dict def
{
/v exch def
/k exch def
currentpagedevice k known {
/cpdv currentpagedevice k get def
v cpdv ne {
/upd false def
/nullv v type /nulltype eq def
/nullcpdv cpdv type /nulltype eq def
nullv nullcpdv or
{
/upd true def
} {
/sametype v type cpdv type eq def
sametype {
v type /arraytype eq {
/vlen v length def
/cpdvlen cpdv length def
vlen cpdvlen eq {
0 1 vlen 1 sub {
/i exch def
/obj v i get def
/cpdobj cpdv i get def
obj cpdobj ne {
/upd true def
exit
} if
} for
} {
/upd true def
} ifelse
} {
v type /dicttype eq {
v {
/dv exch def
/dk exch def
/cpddv cpdv dk get def
dv cpddv ne {
/upd true def
exit
} if
} forall
} {
/upd true def
} ifelse
} ifelse
} if
} ifelse
upd true eq {
d k v put
} if
} if
} if
} forall
d length 0 gt {
d setpagedevice
} if
} bd
/RE { % /NewFontName [NewEncodingArray] /FontName RE -
  findfont dup length dict begin
  {
    1 index /FID ne
    {def} {pop pop} ifelse
  } forall
  /Encoding exch def
  /FontName 1 index def
  currentdict definefont pop
  end
} bind def
%%EndResource
%%BeginResource: procset (Apache XML Graphics EPS ProcSet) 1.0 0
%%Version: 1.0 0
%%Copyright: (Copyright 2002-2003 The Apache Software Foundation. License terms: http://www.apache.org/licenses/LICENSE-2.0)
/BeginEPSF { %def
/b4_Inc_state save def         % Save state for cleanup
/dict_count countdictstack def % Count objects on dict stack
/op_count count 1 sub def      % Count objects on operand stack
userdict begin                 % Push userdict on dict stack
/showpage { } def              % Redefine showpage, { } = null proc
0 setgray 0 setlinecap         % Prepare graphics state
1 setlinewidth 0 setlinejoin
10 setmiterlimit [ ] 0 setdash newpath
/languagelevel where           % If level not equal to 1 then
{pop languagelevel             % set strokeadjust and
1 ne                           % overprint to their defaults.
{false setstrokeadjust false setoverprint
} if
} if
} bd
/EndEPSF { %def
count op_count sub {pop} repeat            % Clean up stacks
countdictstack dict_count sub {end} repeat
b4_Inc_state restore
} bd
%%EndResource
%FOPBeginFontDict
%%IncludeResource: font Courier-Oblique
%%IncludeResource: font Courier-BoldOblique
%%IncludeResource: font Courier-Bold
%%IncludeResource: font ZapfDingbats
%%IncludeResource: font Symbol
%%IncludeResource: font Helvetica
%%IncludeResource: font Helvetica-Oblique
%%IncludeResource: font Helvetica-Bold
%%IncludeResource: font Helvetica-BoldOblique
%%IncludeResource: font Times-Roman
%%IncludeResource: font Times-Italic
%%IncludeResource: font Times-Bold
%%IncludeResource: font Times-BoldItalic
%%IncludeResource: font Courier
%FOPEndFontDict
%%BeginResource: encoding WinAnsiEncoding
/WinAnsiEncoding [
/.notdef /.notdef /.notdef /.notdef /.notdef
/.notdef /.notdef /.notdef /.notdef /.notdef
/.notdef /.notdef /.notdef /.notdef /.notdef
/.notdef /.notdef /.notdef /.notdef /.notdef
/.notdef /.notdef /.notdef /.notdef /.notdef
/.notdef /.notdef /.notdef /.notdef /.notdef
/.notdef /.notdef /space /exclam /quotedbl
/numbersign /dollar /percent /ampersand /quotesingle
/parenleft /parenright /asterisk /plus /comma
/hyphen /period /slash /zero /one
/two /three /four /five /six
/seven /eight /nine /colon /semicolon
/less /equal /greater /question /at
/A /B /C /D /E
/F /G /H /I /J
/K /L /M /N /O
/P /Q /R /S /T
/U /V /W /X /Y
/Z /bracketleft /backslash /bracketright /asciicircum
/underscore /quoteleft /a /b /c
/d /e /f /g /h
/i /j /k /l /m
/n /o /p /q /r
/s /t /u /v /w
/x /y /z /braceleft /bar
/braceright /asciitilde /bullet /Euro /bullet
/quotesinglbase /florin /quotedblbase /ellipsis /dagger
/daggerdbl /circumflex /perthousand /Scaron /guilsinglleft
/OE /bullet /Zcaron /bullet /bullet
/quoteleft /quoteright /quotedblleft /quotedblright /bullet
/endash /emdash /asciitilde /trademark /scaron
/guilsinglright /oe /bullet /zcaron /Ydieresis
/space /exclamdown /cent /sterling /currency
/yen /brokenbar /section /dieresis /copyright
/ordfeminine /guillemotleft /logicalnot /sfthyphen /registered
/macron /degree /plusminus /twosuperior /threesuperior
/acute /mu /paragraph /middot /cedilla
/onesuperior /ordmasculine /guillemotright /onequarter /onehalf
/threequarters /questiondown /Agrave /Aacute /Acircumflex
/Atilde /Adieresis /Aring /AE /Ccedilla
/Egrave /Eacute /Ecircumflex /Edieresis /Igrave
/Iacute /Icircumflex /Idieresis /Eth /Ntilde
/Ograve /Oacute /Ocircumflex /Otilde /Odieresis
/multiply /Oslash /Ugrave /Uacute /Ucircumflex
/Udieresis /Yacute /Thorn /germandbls /agrave
/aacute /acircumflex /atilde /adieresis /aring
/ae /ccedilla /egrave /eacute /ecircumflex
/edieresis /igrave /iacute /icircumflex /idieresis
/eth /ntilde /ograve /oacute /ocircumflex
/otilde /odieresis /divide /oslash /ugrave
/uacute /ucircumflex /udieresis /yacute /thorn
/ydieresis
] def
%%EndResource
%FOPBeginFontReencode
/Courier-Oblique findfont
dup length dict begin
  {1 index /FID ne {def} {pop pop} ifelse} forall
  /Encoding WinAnsiEncoding def
  currentdict
end
/Courier-Oblique exch definefont pop
/Courier-BoldOblique findfont
dup length dict begin
  {1 index /FID ne {def} {pop pop} ifelse} forall
  /Encoding WinAnsiEncoding def
  currentdict
end
/Courier-BoldOblique exch definefont pop
/Courier-Bold findfont
dup length dict begin
  {1 index /FID ne {def} {pop pop} ifelse} forall
  /Encoding WinAnsiEncoding def
  currentdict
end
/Courier-Bold exch definefont pop
/Helvetica findfont
dup length dict begin
  {1 index /FID ne {def} {pop pop} ifelse} forall
  /Encoding WinAnsiEncoding def
  currentdict
end
/Helvetica exch definefont pop
/Helvetica-Oblique findfont
dup length dict begin
  {1 index /FID ne {def} {pop pop} ifelse} forall
  /Encoding WinAnsiEncoding def
  currentdict
end
/Helvetica-Oblique exch definefont pop
/Helvetica-Bold findfont
dup length dict begin
  {1 index /FID ne {def} {pop pop} ifelse} forall
  /Encoding WinAnsiEncoding def
  currentdict
end
/Helvetica-Bold exch definefont pop
/Helvetica-BoldOblique findfont
dup length dict begin
  {1 index /FID ne {def} {pop pop} ifelse} forall
  /Encoding WinAnsiEncoding def
  currentdict
end
/Helvetica-BoldOblique exch definefont pop
/Times-Roman findfont
dup length dict begin
  {1 index /FID ne {def} {pop pop} ifelse} forall
  /Encoding WinAnsiEncoding def
  currentdict
end
/Times-Roman exch definefont pop
/Times-Italic findfont
dup length dict begin
  {1 index /FID ne {def} {pop pop} ifelse} forall
  /Encoding WinAnsiEncoding def
  currentdict
end
/Times-Italic exch definefont pop
/Times-Bold findfont
dup length dict begin
  {1 index /FID ne {def} {pop pop} ifelse} forall
  /Encoding WinAnsiEncoding def
  currentdict
end
/Times-Bold exch definefont pop
/Times-BoldItalic findfont
dup length dict begin
  {1 index /FID ne {def} {pop pop} ifelse} forall
  /Encoding WinAnsiEncoding def
  currentdict
end
/Times-BoldItalic exch definefont pop
/Courier findfont
dup length dict begin
  {1 index /FID ne {def} {pop pop} ifelse} forall
  /Encoding WinAnsiEncoding def
  currentdict
end
/Courier exch definefont pop
%FOPEndFontReencode
%%EndProlog
%%Page: 1 1
%%PageBoundingBox: 0 0 1024 216
%%BeginPageSetup
[1 0 0 -1 0 216] CT
%%EndPageSetup
GS
1 GC
N
0 0 1024 216 re
f
GR
GS
1 GC
N
0 0 1024 216 re
f
GR
GS
1 GC
N
133 189 M
293.5 189 L
293.5 26.5 L
133 26.5 L
cp
f
GR
GS
0.149 GC
2 setlinecap
1 LJ
0.5 LW
N
133 189 M
293.5 189 L
S
GR
GS
0.149 GC
2 setlinecap
1 LJ
0.5 LW
N
133 189 M
133 187.375 L
S
GR
GS
0.149 GC
2 setlinecap
1 LJ
0.5 LW
N
195.209 189 M
195.209 187.375 L
S
GR
GS
0.149 GC
2 setlinecap
1 LJ
0.5 LW
N
257.419 189 M
257.419 187.375 L
S
GR
GS
[1 0 0 1 133 194.59996] CT
0.149 GC
/Helvetica 18 F
GS
[1 0 0 1 0 0] CT
-5.5 18 moveto 
1 -1 scale
(0) t 
GR
GR
GS
[1 0 0 1 195.2093 194.59996] CT
0.149 GC
/Helvetica 18 F
GS
[1 0 0 1 0 0] CT
-5.5 18 moveto 
1 -1 scale
(5) t 
GR
GR
GS
[1 0 0 1 257.41861 194.59996] CT
0.149 GC
/Helvetica 18 F
GS
[1 0 0 1 0 0] CT
-10.5 18 moveto 
1 -1 scale
(10) t 
GR
GR
GS
0.149 GC
2 setlinecap
1 LJ
0.5 LW
N
133 189 M
133 26.5 L
S
GR
GS
0.149 GC
2 setlinecap
1 LJ
0.5 LW
N
133 174.227 M
134.625 174.227 L
S
GR
GS
0.149 GC
2 setlinecap
1 LJ
0.5 LW
N
133 144.682 M
134.625 144.682 L
S
GR
GS
0.149 GC
2 setlinecap
1 LJ
0.5 LW
N
133 115.136 M
134.625 115.136 L
S
GR
GS
0.149 GC
2 setlinecap
1 LJ
0.5 LW
N
133 85.591 M
134.625 85.591 L
S
GR
GS
0.149 GC
2 setlinecap
1 LJ
0.5 LW
N
133 56.045 M
134.625 56.045 L
S
GR
GS
0.149 GC
2 setlinecap
1 LJ
0.5 LW
N
133 26.5 M
134.625 26.5 L
S
GR
GS
[1 0 0 1 127.4 174.22728] CT
0.149 GC
/Helvetica 18 F
GS
[1 0 0 1 0 0] CT
-21 7 moveto 
1 -1 scale
(49) t 
GR
GR
GS
[1 0 0 1 127.4 144.68182] CT
0.149 GC
/Helvetica 18 F
GS
[1 0 0 1 0 0] CT
-21 7 moveto 
1 -1 scale
(50) t 
GR
GR
GS
[1 0 0 1 127.4 115.13636] CT
0.149 GC
/Helvetica 18 F
GS
[1 0 0 1 0 0] CT
-21 7 moveto 
1 -1 scale
(51) t 
GR
GR
GS
[1 0 0 1 127.4 85.59091] CT
0.149 GC
/Helvetica 18 F
GS
[1 0 0 1 0 0] CT
-21 7 moveto 
1 -1 scale
(52) t 
GR
GR
GS
[1 0 0 1 127.4 56.04546] CT
0.149 GC
/Helvetica 18 F
GS
[1 0 0 1 0 0] CT
-21 7 moveto 
1 -1 scale
(53) t 
GR
GR
GS
[1 0 0 1 127.4 26.5] CT
0.149 GC
/Helvetica 18 F
GS
[1 0 0 1 0 0] CT
-21 7 moveto 
1 -1 scale
(54) t 
GR
GR
GS
[0 -1 1 0 103.9 107.74989] CT
0.149 GC
/Helvetica 18 F
GS
[1 0 0 1 0 0] CT
-94.5 -4 moveto 
1 -1 scale
(Decoding accuracy \(%\)) t 
GR
GR
GS
[1 0 0 1 213.2502 24.25003] CT
/Helvetica-Bold 18 F
GS
[1 0 0 1 0 0] CT
-22 -4 moveto 
1 -1 scale
(color) t 
GR
GR
GS
1 GC
N
163.171 189.019 M
195.209 189.019 L
195.209 26.481 L
166.593 26.481 L
133 26.481 L
133 189.019 L
cp
f
GR
GS
0.902 GC
N
213.312 189.019 M
232.535 189.019 L
232.535 26.481 L
215.365 26.481 L
195.209 26.481 L
195.209 189.019 L
cp
f
GR
GS
1 GC
N
262.103 189.019 M
293.5 189.019 L
293.5 26.481 L
265.456 26.481 L
232.535 26.481 L
232.535 189.019 L
cp
f
GR
GS
[8 8] 0 setdash
2 LJ
2 LW
N
133 144.682 M
293.5 144.682 L
S
GR
GS
1 0 0 RC
1 LJ
2 LW
N
189.175 159.455 M
197.2 159.455 L
205.225 159.455 L
213.25 159.455 L
221.275 159.455 L
229.3 159.455 L
237.325 159.455 L
245.35 159.455 L
253.375 159.455 L
261.4 159.455 L
269.425 159.455 L
S
GR
GS
1 LJ
2 LW
N
149.05 174.227 M
157.075 174.227 L
S
GR
GS
0.948 0.749 0.781 RC
N
149.05 150.96 M
141.025 142.24 L
133 134.68 L
133 153.871 L
141.025 160.588 L
149.05 170.522 L
157.075 156.251 L
165.1 162.958 L
173.125 152.613 L
181.15 144.885 L
189.175 126.675 L
197.2 122.673 L
205.225 100.39 L
213.25 95.717 L
221.275 89.941 L
229.3 92.288 L
237.325 93.058 L
245.35 90.833 L
253.375 105.026 L
261.4 110.665 L
269.425 130.823 L
277.45 137.039 L
285.475 136.639 L
293.5 140.159 L
293.5 122.496 L
285.475 119.136 L
277.45 120.172 L
269.425 112.722 L
261.4 91.751 L
253.375 83.505 L
245.35 70.683 L
237.325 72.143 L
229.3 70.64 L
221.275 69.369 L
213.25 75.539 L
205.225 79.388 L
197.2 101.937 L
189.175 107.334 L
181.15 126.578 L
173.125 135.141 L
165.1 143.935 L
157.075 137.441 L
cp
f
GR
GS
0.906 0.549 0.608 RC
1 LJ
0.5 LW
N
133 153.871 M
141.025 160.588 L
149.05 170.522 L
157.075 156.251 L
165.1 162.958 L
173.125 152.613 L
181.15 144.885 L
189.175 126.675 L
197.2 122.673 L
205.225 100.39 L
213.25 95.717 L
221.275 89.941 L
229.3 92.288 L
237.325 93.058 L
245.35 90.833 L
253.375 105.026 L
261.4 110.665 L
269.425 130.823 L
277.45 137.039 L
285.475 136.639 L
293.5 140.159 L
S
GR
GS
0.906 0.549 0.608 RC
1 LJ
0.5 LW
N
133 134.68 M
141.025 142.24 L
149.05 150.96 L
157.075 137.441 L
165.1 143.935 L
173.125 135.141 L
181.15 126.578 L
189.175 107.334 L
197.2 101.937 L
205.225 79.388 L
213.25 75.539 L
221.275 69.369 L
229.3 70.64 L
237.325 72.143 L
245.35 70.683 L
253.375 83.505 L
261.4 91.751 L
269.425 112.722 L
277.45 120.172 L
285.475 119.136 L
293.5 122.496 L
S
GR
GS
0.792 0 0.125 RC
1 LJ
2 LW
N
133 144.276 M
141.025 151.414 L
149.05 160.741 L
157.075 146.846 L
165.1 153.447 L
173.125 143.877 L
181.15 135.731 L
189.175 117.004 L
197.2 112.305 L
205.225 89.889 L
213.25 85.628 L
221.275 79.655 L
229.3 81.464 L
237.325 82.601 L
245.35 80.758 L
253.375 94.265 L
261.4 101.208 L
269.425 121.773 L
277.45 128.606 L
285.475 127.887 L
293.5 131.328 L
S
GR
GS
0.849 GC
N
181.15 114.899 M
173.125 124.792 L
165.1 119.324 L
157.075 108.758 L
149.05 117.959 L
141.025 127.652 L
133 127.221 L
133 145.393 L
141.025 145.469 L
149.05 135.005 L
157.075 124.705 L
165.1 138.63 L
173.125 144.613 L
181.15 133.306 L
189.175 147.155 L
197.2 145.142 L
205.225 144.51 L
213.25 145.817 L
221.275 147.635 L
229.3 135.724 L
237.325 138.258 L
245.35 137.587 L
253.375 140.518 L
261.4 148.815 L
269.425 142.522 L
277.45 146.229 L
285.475 148.184 L
293.5 155.91 L
293.5 137.211 L
285.475 129.893 L
277.45 125.491 L
269.425 122.388 L
261.4 129.687 L
253.375 119.256 L
245.35 117.59 L
237.325 118.767 L
229.3 114.866 L
221.275 127.243 L
213.25 124.77 L
205.225 121.53 L
197.2 121.912 L
189.175 126.696 L
cp
f
GR
GS
0.729 GC
1 LJ
0.5 LW
N
133 145.393 M
141.025 145.469 L
149.05 135.005 L
157.075 124.705 L
165.1 138.63 L
173.125 144.613 L
181.15 133.306 L
189.175 147.155 L
197.2 145.142 L
205.225 144.51 L
213.25 145.817 L
221.275 147.635 L
229.3 135.724 L
237.325 138.258 L
245.35 137.587 L
253.375 140.518 L
261.4 148.815 L
269.425 142.522 L
277.45 146.229 L
285.475 148.184 L
293.5 155.91 L
S
GR
GS
0.729 GC
1 LJ
0.5 LW
N
133 127.221 M
141.025 127.652 L
149.05 117.959 L
157.075 108.758 L
165.1 119.324 L
173.125 124.792 L
181.15 114.899 L
189.175 126.696 L
197.2 121.912 L
205.225 121.53 L
213.25 124.77 L
221.275 127.243 L
229.3 114.866 L
237.325 118.767 L
245.35 117.59 L
253.375 119.256 L
261.4 129.687 L
269.425 122.388 L
277.45 125.491 L
285.475 129.893 L
293.5 137.211 L
S
GR
GS
0.4 GC
[10 6] 0 setdash
2 LJ
N
133 136.307 M
141.025 136.561 L
149.05 126.482 L
157.075 116.731 L
165.1 128.977 L
173.125 134.702 L
181.15 124.102 L
189.175 136.926 L
197.2 133.527 L
205.225 133.02 L
213.25 135.293 L
221.275 137.439 L
229.3 125.295 L
237.325 128.513 L
245.35 127.588 L
253.375 129.887 L
261.4 139.251 L
269.425 132.455 L
277.45 135.86 L
285.475 139.038 L
293.5 146.56 L
S
GR
GS
1 GC
N
/f-1153439084{163.171 189.019 M
195.209 189.019 L
195.209 26.481 L
166.593 26.481 L
133 26.481 L
133 189.019 L
cp}def
f-1153439084
f
GR
GS
0.902 GC
N
/f-1461176741{213.312 189.019 M
232.535 189.019 L
232.535 26.481 L
215.365 26.481 L
195.209 26.481 L
195.209 189.019 L
cp}def
f-1461176741
f
GR
GS
1 GC
N
/f2034933641{262.103 189.019 M
293.5 189.019 L
293.5 26.481 L
265.456 26.481 L
232.535 26.481 L
232.535 189.019 L
cp}def
f2034933641
f
GR
GS
[8 8] 0 setdash
2 LJ
2 LW
N
133 144.682 M
293.5 144.682 L
S
GR
GS
1 0 0 RC
1 LJ
2 LW
N
189.175 159.455 M
197.2 159.455 L
205.225 159.455 L
213.25 159.455 L
221.275 159.455 L
229.3 159.455 L
237.325 159.455 L
245.35 159.455 L
253.375 159.455 L
261.4 159.455 L
269.425 159.455 L
S
GR
GS
1 LJ
2 LW
N
149.05 174.227 M
157.075 174.227 L
S
GR
GS
0.948 0.749 0.781 RC
N
/f949868844{149.05 150.96 M
141.025 142.24 L
133 134.68 L
133 153.871 L
141.025 160.588 L
149.05 170.522 L
157.075 156.251 L
165.1 162.958 L
173.125 152.613 L
181.15 144.885 L
189.175 126.675 L
197.2 122.673 L
205.225 100.39 L
213.25 95.717 L
221.275 89.941 L
229.3 92.288 L
237.325 93.058 L
245.35 90.833 L
253.375 105.026 L
261.4 110.665 L
269.425 130.823 L
277.45 137.039 L
285.475 136.639 L
293.5 140.159 L
293.5 122.496 L
285.475 119.136 L
277.45 120.172 L
269.425 112.722 L
261.4 91.751 L
253.375 83.505 L
245.35 70.683 L
237.325 72.143 L
229.3 70.64 L
221.275 69.369 L
213.25 75.539 L
205.225 79.388 L
197.2 101.937 L
189.175 107.334 L
181.15 126.578 L
173.125 135.141 L
165.1 143.935 L
157.075 137.441 L
cp}def
f949868844
f
GR
GS
0.906 0.549 0.608 RC
1 LJ
0.5 LW
N
133 153.871 M
141.025 160.588 L
149.05 170.522 L
157.075 156.251 L
165.1 162.958 L
173.125 152.613 L
181.15 144.885 L
189.175 126.675 L
197.2 122.673 L
205.225 100.39 L
213.25 95.717 L
221.275 89.941 L
229.3 92.288 L
237.325 93.058 L
245.35 90.833 L
253.375 105.026 L
261.4 110.665 L
269.425 130.823 L
277.45 137.039 L
285.475 136.639 L
293.5 140.159 L
S
GR
GS
0.906 0.549 0.608 RC
1 LJ
0.5 LW
N
133 134.68 M
141.025 142.24 L
149.05 150.96 L
157.075 137.441 L
165.1 143.935 L
173.125 135.141 L
181.15 126.578 L
189.175 107.334 L
197.2 101.937 L
205.225 79.388 L
213.25 75.539 L
221.275 69.369 L
229.3 70.64 L
237.325 72.143 L
245.35 70.683 L
253.375 83.505 L
261.4 91.751 L
269.425 112.722 L
277.45 120.172 L
285.475 119.136 L
293.5 122.496 L
S
GR
GS
0.792 0 0.125 RC
1 LJ
2 LW
N
133 144.276 M
141.025 151.414 L
149.05 160.741 L
157.075 146.846 L
165.1 153.447 L
173.125 143.877 L
181.15 135.731 L
189.175 117.004 L
197.2 112.305 L
205.225 89.889 L
213.25 85.628 L
221.275 79.655 L
229.3 81.464 L
237.325 82.601 L
245.35 80.758 L
253.375 94.265 L
261.4 101.208 L
269.425 121.773 L
277.45 128.606 L
285.475 127.887 L
293.5 131.328 L
S
GR
GS
0.849 GC
N
/f-925590680{181.15 114.899 M
173.125 124.792 L
165.1 119.324 L
157.075 108.758 L
149.05 117.959 L
141.025 127.652 L
133 127.221 L
133 145.393 L
141.025 145.469 L
149.05 135.005 L
157.075 124.705 L
165.1 138.63 L
173.125 144.613 L
181.15 133.306 L
189.175 147.155 L
197.2 145.142 L
205.225 144.51 L
213.25 145.817 L
221.275 147.635 L
229.3 135.724 L
237.325 138.258 L
245.35 137.587 L
253.375 140.518 L
261.4 148.815 L
269.425 142.522 L
277.45 146.229 L
285.475 148.184 L
293.5 155.91 L
293.5 137.211 L
285.475 129.893 L
277.45 125.491 L
269.425 122.388 L
261.4 129.687 L
253.375 119.256 L
245.35 117.59 L
237.325 118.767 L
229.3 114.866 L
221.275 127.243 L
213.25 124.77 L
205.225 121.53 L
197.2 121.912 L
189.175 126.696 L
cp}def
f-925590680
f
GR
GS
0.729 GC
1 LJ
0.5 LW
N
133 145.393 M
141.025 145.469 L
149.05 135.005 L
157.075 124.705 L
165.1 138.63 L
173.125 144.613 L
181.15 133.306 L
189.175 147.155 L
197.2 145.142 L
205.225 144.51 L
213.25 145.817 L
221.275 147.635 L
229.3 135.724 L
237.325 138.258 L
245.35 137.587 L
253.375 140.518 L
261.4 148.815 L
269.425 142.522 L
277.45 146.229 L
285.475 148.184 L
293.5 155.91 L
S
GR
GS
0.729 GC
1 LJ
0.5 LW
N
133 127.221 M
141.025 127.652 L
149.05 117.959 L
157.075 108.758 L
165.1 119.324 L
173.125 124.792 L
181.15 114.899 L
189.175 126.696 L
197.2 121.912 L
205.225 121.53 L
213.25 124.77 L
221.275 127.243 L
229.3 114.866 L
237.325 118.767 L
245.35 117.59 L
253.375 119.256 L
261.4 129.687 L
269.425 122.388 L
277.45 125.491 L
285.475 129.893 L
293.5 137.211 L
S
GR
GS
0.4 GC
[10 6] 0 setdash
2 LJ
N
133 136.307 M
141.025 136.561 L
149.05 126.482 L
157.075 116.731 L
165.1 128.977 L
173.125 134.702 L
181.15 124.102 L
189.175 136.926 L
197.2 133.527 L
205.225 133.02 L
213.25 135.293 L
221.275 137.439 L
229.3 125.295 L
237.325 128.513 L
245.35 127.588 L
253.375 129.887 L
261.4 139.251 L
269.425 132.455 L
277.45 135.86 L
285.475 139.038 L
293.5 146.56 L
S
GR
GS
1 GC
N
f-1153439084
f
GR
GS
0.902 GC
N
f-1461176741
f
GR
GS
1 GC
N
f2034933641
f
GR
GS
[8 8] 0 setdash
2 LJ
2 LW
N
133 144.682 M
293.5 144.682 L
S
GR
GS
1 0 0 RC
1 LJ
2 LW
N
189.175 159.455 M
197.2 159.455 L
205.225 159.455 L
213.25 159.455 L
221.275 159.455 L
229.3 159.455 L
237.325 159.455 L
245.35 159.455 L
253.375 159.455 L
261.4 159.455 L
269.425 159.455 L
S
GR
GS
1 LJ
2 LW
N
149.05 174.227 M
157.075 174.227 L
S
GR
GS
0.948 0.749 0.781 RC
N
f949868844
f
GR
GS
0.906 0.549 0.608 RC
1 LJ
0.5 LW
N
133 153.871 M
141.025 160.588 L
149.05 170.522 L
157.075 156.251 L
165.1 162.958 L
173.125 152.613 L
181.15 144.885 L
189.175 126.675 L
197.2 122.673 L
205.225 100.39 L
213.25 95.717 L
221.275 89.941 L
229.3 92.288 L
237.325 93.058 L
245.35 90.833 L
253.375 105.026 L
261.4 110.665 L
269.425 130.823 L
277.45 137.039 L
285.475 136.639 L
293.5 140.159 L
S
GR
GS
0.906 0.549 0.608 RC
1 LJ
0.5 LW
N
133 134.68 M
141.025 142.24 L
149.05 150.96 L
157.075 137.441 L
165.1 143.935 L
173.125 135.141 L
181.15 126.578 L
189.175 107.334 L
197.2 101.937 L
205.225 79.388 L
213.25 75.539 L
221.275 69.369 L
229.3 70.64 L
237.325 72.143 L
245.35 70.683 L
253.375 83.505 L
261.4 91.751 L
269.425 112.722 L
277.45 120.172 L
285.475 119.136 L
293.5 122.496 L
S
GR
GS
0.792 0 0.125 RC
1 LJ
2 LW
N
133 144.276 M
141.025 151.414 L
149.05 160.741 L
157.075 146.846 L
165.1 153.447 L
173.125 143.877 L
181.15 135.731 L
189.175 117.004 L
197.2 112.305 L
205.225 89.889 L
213.25 85.628 L
221.275 79.655 L
229.3 81.464 L
237.325 82.601 L
245.35 80.758 L
253.375 94.265 L
261.4 101.208 L
269.425 121.773 L
277.45 128.606 L
285.475 127.887 L
293.5 131.328 L
S
GR
GS
0.849 GC
N
f-925590680
f
GR
GS
0.729 GC
1 LJ
0.5 LW
N
133 145.393 M
141.025 145.469 L
149.05 135.005 L
157.075 124.705 L
165.1 138.63 L
173.125 144.613 L
181.15 133.306 L
189.175 147.155 L
197.2 145.142 L
205.225 144.51 L
213.25 145.817 L
221.275 147.635 L
229.3 135.724 L
237.325 138.258 L
245.35 137.587 L
253.375 140.518 L
261.4 148.815 L
269.425 142.522 L
277.45 146.229 L
285.475 148.184 L
293.5 155.91 L
S
GR
GS
0.729 GC
1 LJ
0.5 LW
N
133 127.221 M
141.025 127.652 L
149.05 117.959 L
157.075 108.758 L
165.1 119.324 L
173.125 124.792 L
181.15 114.899 L
189.175 126.696 L
197.2 121.912 L
205.225 121.53 L
213.25 124.77 L
221.275 127.243 L
229.3 114.866 L
237.325 118.767 L
245.35 117.59 L
253.375 119.256 L
261.4 129.687 L
269.425 122.388 L
277.45 125.491 L
285.475 129.893 L
293.5 137.211 L
S
GR
GS
0.4 GC
[10 6] 0 setdash
2 LJ
N
133 136.307 M
141.025 136.561 L
149.05 126.482 L
157.075 116.731 L
165.1 128.977 L
173.125 134.702 L
181.15 124.102 L
189.175 136.926 L
197.2 133.527 L
205.225 133.02 L
213.25 135.293 L
221.275 137.439 L
229.3 125.295 L
237.325 128.513 L
245.35 127.588 L
253.375 129.887 L
261.4 139.251 L
269.425 132.455 L
277.45 135.86 L
285.475 139.038 L
293.5 146.56 L
S
GR
GS
1 GC
N
/f702609444{344 189 M
504.5 189 L
504.5 26.5 L
344 26.5 L
cp}def
f702609444
f
GR
GS
0.149 GC
2 setlinecap
1 LJ
0.5 LW
N
344 189 M
504.5 189 L
S
GR
GS
0.149 GC
2 setlinecap
1 LJ
0.5 LW
N
344 189 M
344 187.375 L
S
GR
GS
0.149 GC
2 setlinecap
1 LJ
0.5 LW
N
406.209 189 M
406.209 187.375 L
S
GR
GS
0.149 GC
2 setlinecap
1 LJ
0.5 LW
N
468.419 189 M
468.419 187.375 L
S
GR
GS
[1 0 0 1 344 194.59996] CT
0.149 GC
/Helvetica 18 F
GS
[1 0 0 1 0 0] CT
-5.5 18 moveto 
1 -1 scale
(0) t 
GR
GR
GS
[1 0 0 1 406.20929 194.59996] CT
0.149 GC
/Helvetica 18 F
GS
[1 0 0 1 0 0] CT
-5.5 18 moveto 
1 -1 scale
(5) t 
GR
GR
GS
[1 0 0 1 468.41861 194.59996] CT
0.149 GC
/Helvetica 18 F
GS
[1 0 0 1 0 0] CT
-10.5 18 moveto 
1 -1 scale
(10) t 
GR
GR
GS
0.149 GC
2 setlinecap
1 LJ
0.5 LW
N
344 189 M
344 26.5 L
S
GR
GS
0.149 GC
2 setlinecap
1 LJ
0.5 LW
N
344 174.227 M
345.625 174.227 L
S
GR
GS
0.149 GC
2 setlinecap
1 LJ
0.5 LW
N
344 144.682 M
345.625 144.682 L
S
GR
GS
0.149 GC
2 setlinecap
1 LJ
0.5 LW
N
344 115.136 M
345.625 115.136 L
S
GR
GS
0.149 GC
2 setlinecap
1 LJ
0.5 LW
N
344 85.591 M
345.625 85.591 L
S
GR
GS
0.149 GC
2 setlinecap
1 LJ
0.5 LW
N
344 56.045 M
345.625 56.045 L
S
GR
GS
0.149 GC
2 setlinecap
1 LJ
0.5 LW
N
344 26.5 M
345.625 26.5 L
S
GR
GS
[1 0 0 1 338.39999 174.22728] CT
0.149 GC
/Helvetica 18 F
GS
[1 0 0 1 0 0] CT
-21 7 moveto 
1 -1 scale
(49) t 
GR
GR
GS
[1 0 0 1 338.39999 144.68182] CT
0.149 GC
/Helvetica 18 F
GS
[1 0 0 1 0 0] CT
-21 7 moveto 
1 -1 scale
(50) t 
GR
GR
GS
[1 0 0 1 338.39999 115.13636] CT
0.149 GC
/Helvetica 18 F
GS
[1 0 0 1 0 0] CT
-21 7 moveto 
1 -1 scale
(51) t 
GR
GR
GS
[1 0 0 1 338.39999 85.59091] CT
0.149 GC
/Helvetica 18 F
GS
[1 0 0 1 0 0] CT
-21 7 moveto 
1 -1 scale
(52) t 
GR
GR
GS
[1 0 0 1 338.39999 56.04546] CT
0.149 GC
/Helvetica 18 F
GS
[1 0 0 1 0 0] CT
-21 7 moveto 
1 -1 scale
(53) t 
GR
GR
GS
[1 0 0 1 338.39999 26.5] CT
0.149 GC
/Helvetica 18 F
GS
[1 0 0 1 0 0] CT
-21 7 moveto 
1 -1 scale
(54) t 
GR
GR
GS
[1 0 0 1 424.2504 24.25003] CT
/Helvetica-Bold 18 F
GS
[1 0 0 1 0 0] CT
-30 -4 moveto 
1 -1 scale
(motion) t 
GR
GR
GS
1 GC
N
/f1974370862{374.171 189.019 M
406.209 189.019 L
406.209 26.481 L
377.593 26.481 L
344 26.481 L
344 189.019 L
cp}def
f1974370862
f
GR
GS
0.902 GC
N
/f-385291713{424.312 189.019 M
443.535 189.019 L
443.535 26.481 L
426.365 26.481 L
406.209 26.481 L
406.209 189.019 L
cp}def
f-385291713
f
GR
GS
1 GC
N
/f-338566429{473.103 189.019 M
504.5 189.019 L
504.5 26.481 L
476.456 26.481 L
443.535 26.481 L
443.535 189.019 L
cp}def
f-338566429
f
GR
GS
[8 8] 0 setdash
2 LJ
2 LW
N
344 144.682 M
504.5 144.682 L
S
GR
GS
1 0 0 RC
1 LJ
2 LW
N
416.225 159.455 M
424.25 159.455 L
432.275 159.455 L
440.3 159.455 L
448.325 159.455 L
456.35 159.455 L
464.375 159.455 L
472.4 159.455 L
S
GR
GS
1 LJ
2 LW
N
400.175 174.227 M
408.2 174.227 L
416.225 174.227 L
424.25 174.227 L
432.275 174.227 L
440.3 174.227 L
448.325 174.227 L
456.35 174.227 L
S
GR
GS
0.948 0.749 0.781 RC
N
/f863681335{352.025 159.028 M
360.05 159.317 L
368.075 141.636 L
376.1 147.462 L
384.125 149.968 L
392.15 132.401 L
400.175 131.605 L
408.2 138.394 L
416.225 119.189 L
424.25 112.253 L
432.275 105.633 L
440.3 107.784 L
448.325 109.635 L
456.35 102.943 L
464.375 104.395 L
472.4 120.965 L
480.425 136.962 L
488.45 140.123 L
496.475 142.234 L
504.5 148.317 L
504.5 130.345 L
496.475 124.006 L
488.45 123.104 L
480.425 116.711 L
472.4 101.443 L
464.375 83.068 L
456.35 80.77 L
448.325 85.934 L
440.3 86.371 L
432.275 81.865 L
424.25 86.76 L
416.225 95.21 L
408.2 117.249 L
400.175 113.304 L
392.15 112.622 L
384.125 132.626 L
376.1 128.887 L
368.075 122.631 L
360.05 141.426 L
352.025 141.849 L
344 132.576 L
344 149.86 L
cp}def
f863681335
f
GR
GS
0.906 0.549 0.608 RC
1 LJ
0.5 LW
N
344 149.86 M
352.025 159.028 L
360.05 159.317 L
368.075 141.636 L
376.1 147.462 L
384.125 149.968 L
392.15 132.401 L
400.175 131.605 L
408.2 138.394 L
416.225 119.189 L
424.25 112.253 L
432.275 105.633 L
440.3 107.784 L
448.325 109.635 L
456.35 102.943 L
464.375 104.395 L
472.4 120.965 L
480.425 136.962 L
488.45 140.123 L
496.475 142.234 L
504.5 148.317 L
S
GR
GS
0.906 0.549 0.608 RC
1 LJ
0.5 LW
N
344 132.576 M
352.025 141.849 L
360.05 141.426 L
368.075 122.631 L
376.1 128.887 L
384.125 132.626 L
392.15 112.622 L
400.175 113.304 L
408.2 117.249 L
416.225 95.21 L
424.25 86.76 L
432.275 81.865 L
440.3 86.371 L
448.325 85.934 L
456.35 80.77 L
464.375 83.068 L
472.4 101.443 L
480.425 116.711 L
488.45 123.104 L
496.475 124.006 L
504.5 130.345 L
S
GR
GS
0.792 0 0.125 RC
1 LJ
2 LW
N
344 141.218 M
352.025 150.438 L
360.05 150.372 L
368.075 132.133 L
376.1 138.174 L
384.125 141.297 L
392.15 122.511 L
400.175 122.455 L
408.2 127.821 L
416.225 107.199 L
424.25 99.507 L
432.275 93.749 L
440.3 97.078 L
448.325 97.784 L
456.35 91.856 L
464.375 93.731 L
472.4 111.204 L
480.425 126.837 L
488.45 131.614 L
496.475 133.12 L
504.5 139.331 L
S
GR
GS
0.849 GC
N
/f114644115{376.1 125.012 M
368.075 131.317 L
360.05 134.901 L
352.025 134.149 L
344 143.311 L
344 160.858 L
352.025 152.651 L
360.05 152.238 L
368.075 149.291 L
376.1 141.99 L
384.125 147.714 L
392.15 147.982 L
400.175 123.065 L
408.2 130.228 L
416.225 134.687 L
424.25 131.913 L
432.275 123.877 L
440.3 129.779 L
448.325 120.295 L
456.35 131.074 L
464.375 137.833 L
472.4 155.687 L
480.425 145.499 L
488.45 134.16 L
496.475 146.735 L
504.5 161.476 L
504.5 142.662 L
496.475 128.478 L
488.45 116.785 L
480.425 130.393 L
472.4 135.144 L
464.375 119.688 L
456.35 111.564 L
448.325 102.413 L
440.3 111.266 L
432.275 101.868 L
424.25 112.897 L
416.225 116.591 L
408.2 110.868 L
400.175 102.374 L
392.15 128.504 L
384.125 130.135 L
cp}def
f114644115
f
GR
GS
0.729 GC
1 LJ
0.5 LW
N
344 160.858 M
352.025 152.651 L
360.05 152.238 L
368.075 149.291 L
376.1 141.99 L
384.125 147.714 L
392.15 147.982 L
400.175 123.065 L
408.2 130.228 L
416.225 134.687 L
424.25 131.913 L
432.275 123.877 L
440.3 129.779 L
448.325 120.295 L
456.35 131.074 L
464.375 137.833 L
472.4 155.687 L
480.425 145.499 L
488.45 134.16 L
496.475 146.735 L
504.5 161.476 L
S
GR
GS
0.729 GC
1 LJ
0.5 LW
N
344 143.311 M
352.025 134.149 L
360.05 134.901 L
368.075 131.317 L
376.1 125.012 L
384.125 130.135 L
392.15 128.504 L
400.175 102.374 L
408.2 110.868 L
416.225 116.591 L
424.25 112.897 L
432.275 101.868 L
440.3 111.266 L
448.325 102.413 L
456.35 111.564 L
464.375 119.688 L
472.4 135.144 L
480.425 130.393 L
488.45 116.785 L
496.475 128.478 L
504.5 142.662 L
S
GR
GS
0.4 GC
[10 6] 0 setdash
2 LJ
N
344 152.085 M
352.025 143.4 L
360.05 143.57 L
368.075 140.304 L
376.1 133.501 L
384.125 138.925 L
392.15 138.243 L
400.175 112.719 L
408.2 120.548 L
416.225 125.639 L
424.25 122.405 L
432.275 112.873 L
440.3 120.523 L
448.325 111.354 L
456.35 121.319 L
464.375 128.761 L
472.4 145.415 L
480.425 137.946 L
488.45 125.472 L
496.475 137.607 L
504.5 152.069 L
S
GR
GS
1 GC
N
f1974370862
f
GR
GS
0.902 GC
N
f-385291713
f
GR
GS
1 GC
N
f-338566429
f
GR
GS
[8 8] 0 setdash
2 LJ
2 LW
N
344 144.682 M
504.5 144.682 L
S
GR
GS
1 0 0 RC
1 LJ
2 LW
N
416.225 159.455 M
424.25 159.455 L
432.275 159.455 L
440.3 159.455 L
448.325 159.455 L
456.35 159.455 L
464.375 159.455 L
472.4 159.455 L
S
GR
GS
1 LJ
2 LW
N
400.175 174.227 M
408.2 174.227 L
416.225 174.227 L
424.25 174.227 L
432.275 174.227 L
440.3 174.227 L
448.325 174.227 L
456.35 174.227 L
S
GR
GS
0.948 0.749 0.781 RC
N
f863681335
f
GR
GS
0.906 0.549 0.608 RC
1 LJ
0.5 LW
N
344 149.86 M
352.025 159.028 L
360.05 159.317 L
368.075 141.636 L
376.1 147.462 L
384.125 149.968 L
392.15 132.401 L
400.175 131.605 L
408.2 138.394 L
416.225 119.189 L
424.25 112.253 L
432.275 105.633 L
440.3 107.784 L
448.325 109.635 L
456.35 102.943 L
464.375 104.395 L
472.4 120.965 L
480.425 136.962 L
488.45 140.123 L
496.475 142.234 L
504.5 148.317 L
S
GR
GS
0.906 0.549 0.608 RC
1 LJ
0.5 LW
N
344 132.576 M
352.025 141.849 L
360.05 141.426 L
368.075 122.631 L
376.1 128.887 L
384.125 132.626 L
392.15 112.622 L
400.175 113.304 L
408.2 117.249 L
416.225 95.21 L
424.25 86.76 L
432.275 81.865 L
440.3 86.371 L
448.325 85.934 L
456.35 80.77 L
464.375 83.068 L
472.4 101.443 L
480.425 116.711 L
488.45 123.104 L
496.475 124.006 L
504.5 130.345 L
S
GR
GS
0.792 0 0.125 RC
1 LJ
2 LW
N
344 141.218 M
352.025 150.438 L
360.05 150.372 L
368.075 132.133 L
376.1 138.174 L
384.125 141.297 L
392.15 122.511 L
400.175 122.455 L
408.2 127.821 L
416.225 107.199 L
424.25 99.507 L
432.275 93.749 L
440.3 97.078 L
448.325 97.784 L
456.35 91.856 L
464.375 93.731 L
472.4 111.204 L
480.425 126.837 L
488.45 131.614 L
496.475 133.12 L
504.5 139.331 L
S
GR
GS
0.849 GC
N
f114644115
f
GR
GS
0.729 GC
1 LJ
0.5 LW
N
344 160.858 M
352.025 152.651 L
360.05 152.238 L
368.075 149.291 L
376.1 141.99 L
384.125 147.714 L
392.15 147.982 L
400.175 123.065 L
408.2 130.228 L
416.225 134.687 L
424.25 131.913 L
432.275 123.877 L
440.3 129.779 L
448.325 120.295 L
456.35 131.074 L
464.375 137.833 L
472.4 155.687 L
480.425 145.499 L
488.45 134.16 L
496.475 146.735 L
504.5 161.476 L
S
GR
GS
0.729 GC
1 LJ
0.5 LW
N
344 143.311 M
352.025 134.149 L
360.05 134.901 L
368.075 131.317 L
376.1 125.012 L
384.125 130.135 L
392.15 128.504 L
400.175 102.374 L
408.2 110.868 L
416.225 116.591 L
424.25 112.897 L
432.275 101.868 L
440.3 111.266 L
448.325 102.413 L
456.35 111.564 L
464.375 119.688 L
472.4 135.144 L
480.425 130.393 L
488.45 116.785 L
496.475 128.478 L
504.5 142.662 L
S
GR
GS
0.4 GC
[10 6] 0 setdash
2 LJ
N
344 152.085 M
352.025 143.4 L
360.05 143.57 L
368.075 140.304 L
376.1 133.501 L
384.125 138.925 L
392.15 138.243 L
400.175 112.719 L
408.2 120.548 L
416.225 125.639 L
424.25 122.405 L
432.275 112.873 L
440.3 120.523 L
448.325 111.354 L
456.35 121.319 L
464.375 128.761 L
472.4 145.415 L
480.425 137.946 L
488.45 125.472 L
496.475 137.607 L
504.5 152.069 L
S
GR
GS
1 GC
N
f1974370862
f
GR
GS
0.902 GC
N
f-385291713
f
GR
GS
1 GC
N
f-338566429
f
GR
GS
[8 8] 0 setdash
2 LJ
2 LW
N
344 144.682 M
504.5 144.682 L
S
GR
GS
1 0 0 RC
1 LJ
2 LW
N
416.225 159.455 M
424.25 159.455 L
432.275 159.455 L
440.3 159.455 L
448.325 159.455 L
456.35 159.455 L
464.375 159.455 L
472.4 159.455 L
S
GR
GS
1 LJ
2 LW
N
400.175 174.227 M
408.2 174.227 L
416.225 174.227 L
424.25 174.227 L
432.275 174.227 L
440.3 174.227 L
448.325 174.227 L
456.35 174.227 L
S
GR
GS
0.948 0.749 0.781 RC
N
f863681335
f
GR
GS
0.906 0.549 0.608 RC
1 LJ
0.5 LW
N
344 149.86 M
352.025 159.028 L
360.05 159.317 L
368.075 141.636 L
376.1 147.462 L
384.125 149.968 L
392.15 132.401 L
400.175 131.605 L
408.2 138.394 L
416.225 119.189 L
424.25 112.253 L
432.275 105.633 L
440.3 107.784 L
448.325 109.635 L
456.35 102.943 L
464.375 104.395 L
472.4 120.965 L
480.425 136.962 L
488.45 140.123 L
496.475 142.234 L
504.5 148.317 L
S
GR
GS
0.906 0.549 0.608 RC
1 LJ
0.5 LW
N
344 132.576 M
352.025 141.849 L
360.05 141.426 L
368.075 122.631 L
376.1 128.887 L
384.125 132.626 L
392.15 112.622 L
400.175 113.304 L
408.2 117.249 L
416.225 95.21 L
424.25 86.76 L
432.275 81.865 L
440.3 86.371 L
448.325 85.934 L
456.35 80.77 L
464.375 83.068 L
472.4 101.443 L
480.425 116.711 L
488.45 123.104 L
496.475 124.006 L
504.5 130.345 L
S
GR
GS
0.792 0 0.125 RC
1 LJ
2 LW
N
344 141.218 M
352.025 150.438 L
360.05 150.372 L
368.075 132.133 L
376.1 138.174 L
384.125 141.297 L
392.15 122.511 L
400.175 122.455 L
408.2 127.821 L
416.225 107.199 L
424.25 99.507 L
432.275 93.749 L
440.3 97.078 L
448.325 97.784 L
456.35 91.856 L
464.375 93.731 L
472.4 111.204 L
480.425 126.837 L
488.45 131.614 L
496.475 133.12 L
504.5 139.331 L
S
GR
GS
0.849 GC
N
f114644115
f
GR
GS
0.729 GC
1 LJ
0.5 LW
N
344 160.858 M
352.025 152.651 L
360.05 152.238 L
368.075 149.291 L
376.1 141.99 L
384.125 147.714 L
392.15 147.982 L
400.175 123.065 L
408.2 130.228 L
416.225 134.687 L
424.25 131.913 L
432.275 123.877 L
440.3 129.779 L
448.325 120.295 L
456.35 131.074 L
464.375 137.833 L
472.4 155.687 L
480.425 145.499 L
488.45 134.16 L
496.475 146.735 L
504.5 161.476 L
S
GR
GS
0.729 GC
1 LJ
0.5 LW
N
344 143.311 M
352.025 134.149 L
360.05 134.901 L
368.075 131.317 L
376.1 125.012 L
384.125 130.135 L
392.15 128.504 L
400.175 102.374 L
408.2 110.868 L
416.225 116.591 L
424.25 112.897 L
432.275 101.868 L
440.3 111.266 L
448.325 102.413 L
456.35 111.564 L
464.375 119.688 L
472.4 135.144 L
480.425 130.393 L
488.45 116.785 L
496.475 128.478 L
504.5 142.662 L
S
GR
GS
0.4 GC
[10 6] 0 setdash
2 LJ
N
344 152.085 M
352.025 143.4 L
360.05 143.57 L
368.075 140.304 L
376.1 133.501 L
384.125 138.925 L
392.15 138.243 L
400.175 112.719 L
408.2 120.548 L
416.225 125.639 L
424.25 122.405 L
432.275 112.873 L
440.3 120.523 L
448.325 111.354 L
456.35 121.319 L
464.375 128.761 L
472.4 145.415 L
480.425 137.946 L
488.45 125.472 L
496.475 137.607 L
504.5 152.069 L
S
GR
GS
1 GC
N
/f343219232{555 189 M
715.5 189 L
715.5 26.5 L
555 26.5 L
cp}def
f343219232
f
GR
GS
0.149 GC
2 setlinecap
1 LJ
0.5 LW
N
555 189 M
715.5 189 L
S
GR
GS
0.149 GC
2 setlinecap
1 LJ
0.5 LW
N
555 189 M
555 187.375 L
S
GR
GS
0.149 GC
2 setlinecap
1 LJ
0.5 LW
N
617.209 189 M
617.209 187.375 L
S
GR
GS
0.149 GC
2 setlinecap
1 LJ
0.5 LW
N
679.419 189 M
679.419 187.375 L
S
GR
GS
[1 0 0 1 555 194.59996] CT
0.149 GC
/Helvetica 18 F
GS
[1 0 0 1 0 0] CT
-5.5 18 moveto 
1 -1 scale
(0) t 
GR
GR
GS
[1 0 0 1 617.20929 194.59996] CT
0.149 GC
/Helvetica 18 F
GS
[1 0 0 1 0 0] CT
-5.5 18 moveto 
1 -1 scale
(5) t 
GR
GR
GS
[1 0 0 1 679.41858 194.59996] CT
0.149 GC
/Helvetica 18 F
GS
[1 0 0 1 0 0] CT
-10.5 18 moveto 
1 -1 scale
(10) t 
GR
GR
GS
0.149 GC
2 setlinecap
1 LJ
0.5 LW
N
555 189 M
555 26.5 L
S
GR
GS
0.149 GC
2 setlinecap
1 LJ
0.5 LW
N
555 174.227 M
556.625 174.227 L
S
GR
GS
0.149 GC
2 setlinecap
1 LJ
0.5 LW
N
555 144.682 M
556.625 144.682 L
S
GR
GS
0.149 GC
2 setlinecap
1 LJ
0.5 LW
N
555 115.136 M
556.625 115.136 L
S
GR
GS
0.149 GC
2 setlinecap
1 LJ
0.5 LW
N
555 85.591 M
556.625 85.591 L
S
GR
GS
0.149 GC
2 setlinecap
1 LJ
0.5 LW
N
555 56.045 M
556.625 56.045 L
S
GR
GS
0.149 GC
2 setlinecap
1 LJ
0.5 LW
N
555 26.5 M
556.625 26.5 L
S
GR
GS
[1 0 0 1 549.40002 174.22728] CT
0.149 GC
/Helvetica 18 F
GS
[1 0 0 1 0 0] CT
-21 7 moveto 
1 -1 scale
(49) t 
GR
GR
GS
[1 0 0 1 549.40002 144.68182] CT
0.149 GC
/Helvetica 18 F
GS
[1 0 0 1 0 0] CT
-21 7 moveto 
1 -1 scale
(50) t 
GR
GR
GS
[1 0 0 1 549.40002 115.13636] CT
0.149 GC
/Helvetica 18 F
GS
[1 0 0 1 0 0] CT
-21 7 moveto 
1 -1 scale
(51) t 
GR
GR
GS
[1 0 0 1 549.40002 85.59091] CT
0.149 GC
/Helvetica 18 F
GS
[1 0 0 1 0 0] CT
-21 7 moveto 
1 -1 scale
(52) t 
GR
GR
GS
[1 0 0 1 549.40002 56.04546] CT
0.149 GC
/Helvetica 18 F
GS
[1 0 0 1 0 0] CT
-21 7 moveto 
1 -1 scale
(53) t 
GR
GR
GS
[1 0 0 1 549.40002 26.5] CT
0.149 GC
/Helvetica 18 F
GS
[1 0 0 1 0 0] CT
-21 7 moveto 
1 -1 scale
(54) t 
GR
GR
GS
[1 0 0 1 635.25061 24.25003] CT
/Helvetica-Bold 18 F
GS
[1 0 0 1 0 0] CT
-17 -4 moveto 
1 -1 scale
(size) t 
GR
GR
GS
1 GC
N
/f-771320206{585.171 189.019 M
617.209 189.019 L
617.209 26.481 L
588.593 26.481 L
555 26.481 L
555 189.019 L
cp}def
f-771320206
f
GR
GS
0.902 GC
N
/f-1056966269{635.312 189.019 M
654.535 189.019 L
654.535 26.481 L
637.365 26.481 L
617.209 26.481 L
617.209 189.019 L
cp}def
f-1056966269
f
GR
GS
1 GC
N
/f-1587497817{684.103 189.019 M
715.5 189.019 L
715.5 26.481 L
687.456 26.481 L
654.535 26.481 L
654.535 189.019 L
cp}def
f-1587497817
f
GR
GS
[8 8] 0 setdash
2 LJ
2 LW
N
555 144.682 M
715.5 144.682 L
S
GR
GS
1 0 0 RC
1 LJ
2 LW
N
627.225 159.455 M
635.25 159.455 L
643.275 159.455 L
651.3 159.455 L
659.325 159.455 L
667.35 159.455 L
675.375 159.455 L
683.4 159.455 L
S
GR
GS
1 LJ
2 LW
N
683.4 174.227 M
691.425 174.227 L
699.45 174.227 L
S
GR
GS
0.948 0.749 0.781 RC
N
/f462672578{579.075 136.32 M
571.05 142.277 L
563.025 131.616 L
555 129.034 L
555 145.952 L
563.025 149.776 L
571.05 157.091 L
579.075 154.098 L
587.1 170.573 L
595.125 164.25 L
603.15 141.845 L
611.175 128.242 L
619.2 137.996 L
627.225 128.589 L
635.25 127.372 L
643.275 123.368 L
651.3 122.129 L
659.325 112.287 L
667.35 113.432 L
675.375 127.555 L
683.4 128.505 L
691.425 142.416 L
699.45 154.057 L
707.475 148.077 L
715.5 170.024 L
715.5 153.951 L
707.475 128.885 L
699.45 136.747 L
691.425 126.028 L
683.4 110.085 L
675.375 109.793 L
667.35 92.549 L
659.325 91.578 L
651.3 101.338 L
643.275 106.525 L
635.25 108.329 L
627.225 110.431 L
619.2 117.808 L
611.175 110.285 L
603.15 124.229 L
595.125 147.34 L
587.1 154.504 L
cp}def
f462672578
f
GR
GS
0.906 0.549 0.608 RC
1 LJ
0.5 LW
N
555 145.952 M
563.025 149.776 L
571.05 157.091 L
579.075 154.098 L
587.1 170.573 L
595.125 164.25 L
603.15 141.845 L
611.175 128.242 L
619.2 137.996 L
627.225 128.589 L
635.25 127.372 L
643.275 123.368 L
651.3 122.129 L
659.325 112.287 L
667.35 113.432 L
675.375 127.555 L
683.4 128.505 L
691.425 142.416 L
699.45 154.057 L
707.475 148.077 L
715.5 170.024 L
S
GR
GS
0.906 0.549 0.608 RC
1 LJ
0.5 LW
N
555 129.034 M
563.025 131.616 L
571.05 142.277 L
579.075 136.32 L
587.1 154.504 L
595.125 147.34 L
603.15 124.229 L
611.175 110.285 L
619.2 117.808 L
627.225 110.431 L
635.25 108.329 L
643.275 106.525 L
651.3 101.338 L
659.325 91.578 L
667.35 92.549 L
675.375 109.793 L
683.4 110.085 L
691.425 126.028 L
699.45 136.747 L
707.475 128.885 L
715.5 153.951 L
S
GR
GS
0.792 0 0.125 RC
1 LJ
2 LW
N
555 137.493 M
563.025 140.696 L
571.05 149.684 L
579.075 145.209 L
587.1 162.538 L
595.125 155.795 L
603.15 133.037 L
611.175 119.263 L
619.2 127.902 L
627.225 119.51 L
635.25 117.851 L
643.275 114.946 L
651.3 111.734 L
659.325 101.932 L
667.35 102.99 L
675.375 118.674 L
683.4 119.295 L
691.425 134.222 L
699.45 145.402 L
707.475 138.481 L
715.5 161.987 L
S
GR
GS
0.849 GC
N
/f249055524{587.1 158.092 M
595.125 148.721 L
603.15 140.274 L
611.175 131.548 L
619.2 137.473 L
627.225 158.843 L
635.25 135.851 L
643.275 129.765 L
651.3 131.91 L
659.325 143.339 L
667.35 135.391 L
675.375 135.768 L
683.4 131.873 L
691.425 128.076 L
699.45 131.331 L
707.475 145.621 L
715.5 136.772 L
715.5 122.307 L
707.475 128.575 L
699.45 114.712 L
691.425 111.542 L
683.4 115.032 L
675.375 117.378 L
667.35 115.386 L
659.325 125.296 L
651.3 114.697 L
643.275 112.366 L
635.25 116.85 L
627.225 140.815 L
619.2 119.781 L
611.175 111.614 L
603.15 123.284 L
595.125 131.266 L
587.1 139.613 L
579.075 123.926 L
571.05 131.427 L
563.025 131.916 L
555 148.733 L
555 168.043 L
563.025 151.178 L
571.05 148.234 L
579.075 140.02 L
cp}def
f249055524
f
GR
GS
0.729 GC
1 LJ
0.5 LW
N
555 168.043 M
563.025 151.178 L
571.05 148.234 L
579.075 140.02 L
587.1 158.092 L
595.125 148.721 L
603.15 140.274 L
611.175 131.548 L
619.2 137.473 L
627.225 158.843 L
635.25 135.851 L
643.275 129.765 L
651.3 131.91 L
659.325 143.339 L
667.35 135.391 L
675.375 135.768 L
683.4 131.873 L
691.425 128.076 L
699.45 131.331 L
707.475 145.621 L
715.5 136.772 L
S
GR
GS
0.729 GC
1 LJ
0.5 LW
N
555 148.733 M
563.025 131.916 L
571.05 131.427 L
579.075 123.926 L
587.1 139.613 L
595.125 131.266 L
603.15 123.284 L
611.175 111.614 L
619.2 119.781 L
627.225 140.815 L
635.25 116.85 L
643.275 112.366 L
651.3 114.697 L
659.325 125.296 L
667.35 115.386 L
675.375 117.378 L
683.4 115.032 L
691.425 111.542 L
699.45 114.712 L
707.475 128.575 L
715.5 122.307 L
S
GR
GS
0.4 GC
[10 6] 0 setdash
2 LJ
N
555 158.388 M
563.025 141.547 L
571.05 139.83 L
579.075 131.973 L
587.1 148.853 L
595.125 139.994 L
603.15 131.779 L
611.175 121.581 L
619.2 128.627 L
627.225 149.829 L
635.25 126.35 L
643.275 121.066 L
651.3 123.304 L
659.325 134.317 L
667.35 125.389 L
675.375 126.573 L
683.4 123.453 L
691.425 119.809 L
699.45 123.021 L
707.475 137.098 L
715.5 129.54 L
S
GR
GS
1 GC
N
f-771320206
f
GR
GS
0.902 GC
N
f-1056966269
f
GR
GS
1 GC
N
f-1587497817
f
GR
GS
[8 8] 0 setdash
2 LJ
2 LW
N
555 144.682 M
715.5 144.682 L
S
GR
GS
1 0 0 RC
1 LJ
2 LW
N
627.225 159.455 M
635.25 159.455 L
643.275 159.455 L
651.3 159.455 L
659.325 159.455 L
667.35 159.455 L
675.375 159.455 L
683.4 159.455 L
S
GR
GS
1 LJ
2 LW
N
683.4 174.227 M
691.425 174.227 L
699.45 174.227 L
S
GR
GS
0.948 0.749 0.781 RC
N
f462672578
f
GR
GS
0.906 0.549 0.608 RC
1 LJ
0.5 LW
N
555 145.952 M
563.025 149.776 L
571.05 157.091 L
579.075 154.098 L
587.1 170.573 L
595.125 164.25 L
603.15 141.845 L
611.175 128.242 L
619.2 137.996 L
627.225 128.589 L
635.25 127.372 L
643.275 123.368 L
651.3 122.129 L
659.325 112.287 L
667.35 113.432 L
675.375 127.555 L
683.4 128.505 L
691.425 142.416 L
699.45 154.057 L
707.475 148.077 L
715.5 170.024 L
S
GR
GS
0.906 0.549 0.608 RC
1 LJ
0.5 LW
N
555 129.034 M
563.025 131.616 L
571.05 142.277 L
579.075 136.32 L
587.1 154.504 L
595.125 147.34 L
603.15 124.229 L
611.175 110.285 L
619.2 117.808 L
627.225 110.431 L
635.25 108.329 L
643.275 106.525 L
651.3 101.338 L
659.325 91.578 L
667.35 92.549 L
675.375 109.793 L
683.4 110.085 L
691.425 126.028 L
699.45 136.747 L
707.475 128.885 L
715.5 153.951 L
S
GR
GS
0.792 0 0.125 RC
1 LJ
2 LW
N
555 137.493 M
563.025 140.696 L
571.05 149.684 L
579.075 145.209 L
587.1 162.538 L
595.125 155.795 L
603.15 133.037 L
611.175 119.263 L
619.2 127.902 L
627.225 119.51 L
635.25 117.851 L
643.275 114.946 L
651.3 111.734 L
659.325 101.932 L
667.35 102.99 L
675.375 118.674 L
683.4 119.295 L
691.425 134.222 L
699.45 145.402 L
707.475 138.481 L
715.5 161.987 L
S
GR
GS
0.849 GC
N
f249055524
f
GR
GS
0.729 GC
1 LJ
0.5 LW
N
555 168.043 M
563.025 151.178 L
571.05 148.234 L
579.075 140.02 L
587.1 158.092 L
595.125 148.721 L
603.15 140.274 L
611.175 131.548 L
619.2 137.473 L
627.225 158.843 L
635.25 135.851 L
643.275 129.765 L
651.3 131.91 L
659.325 143.339 L
667.35 135.391 L
675.375 135.768 L
683.4 131.873 L
691.425 128.076 L
699.45 131.331 L
707.475 145.621 L
715.5 136.772 L
S
GR
GS
0.729 GC
1 LJ
0.5 LW
N
555 148.733 M
563.025 131.916 L
571.05 131.427 L
579.075 123.926 L
587.1 139.613 L
595.125 131.266 L
603.15 123.284 L
611.175 111.614 L
619.2 119.781 L
627.225 140.815 L
635.25 116.85 L
643.275 112.366 L
651.3 114.697 L
659.325 125.296 L
667.35 115.386 L
675.375 117.378 L
683.4 115.032 L
691.425 111.542 L
699.45 114.712 L
707.475 128.575 L
715.5 122.307 L
S
GR
GS
0.4 GC
[10 6] 0 setdash
2 LJ
N
555 158.388 M
563.025 141.547 L
571.05 139.83 L
579.075 131.973 L
587.1 148.853 L
595.125 139.994 L
603.15 131.779 L
611.175 121.581 L
619.2 128.627 L
627.225 149.829 L
635.25 126.35 L
643.275 121.066 L
651.3 123.304 L
659.325 134.317 L
667.35 125.389 L
675.375 126.573 L
683.4 123.453 L
691.425 119.809 L
699.45 123.021 L
707.475 137.098 L
715.5 129.54 L
S
GR
GS
1 GC
N
f-771320206
f
GR
GS
0.902 GC
N
f-1056966269
f
GR
GS
1 GC
N
f-1587497817
f
GR
GS
[8 8] 0 setdash
2 LJ
2 LW
N
555 144.682 M
715.5 144.682 L
S
GR
GS
1 0 0 RC
1 LJ
2 LW
N
627.225 159.455 M
635.25 159.455 L
643.275 159.455 L
651.3 159.455 L
659.325 159.455 L
667.35 159.455 L
675.375 159.455 L
683.4 159.455 L
S
GR
GS
1 LJ
2 LW
N
683.4 174.227 M
691.425 174.227 L
699.45 174.227 L
S
GR
GS
0.948 0.749 0.781 RC
N
f462672578
f
GR
GS
0.906 0.549 0.608 RC
1 LJ
0.5 LW
N
555 145.952 M
563.025 149.776 L
571.05 157.091 L
579.075 154.098 L
587.1 170.573 L
595.125 164.25 L
603.15 141.845 L
611.175 128.242 L
619.2 137.996 L
627.225 128.589 L
635.25 127.372 L
643.275 123.368 L
651.3 122.129 L
659.325 112.287 L
667.35 113.432 L
675.375 127.555 L
683.4 128.505 L
691.425 142.416 L
699.45 154.057 L
707.475 148.077 L
715.5 170.024 L
S
GR
GS
0.906 0.549 0.608 RC
1 LJ
0.5 LW
N
555 129.034 M
563.025 131.616 L
571.05 142.277 L
579.075 136.32 L
587.1 154.504 L
595.125 147.34 L
603.15 124.229 L
611.175 110.285 L
619.2 117.808 L
627.225 110.431 L
635.25 108.329 L
643.275 106.525 L
651.3 101.338 L
659.325 91.578 L
667.35 92.549 L
675.375 109.793 L
683.4 110.085 L
691.425 126.028 L
699.45 136.747 L
707.475 128.885 L
715.5 153.951 L
S
GR
GS
0.792 0 0.125 RC
1 LJ
2 LW
N
555 137.493 M
563.025 140.696 L
571.05 149.684 L
579.075 145.209 L
587.1 162.538 L
595.125 155.795 L
603.15 133.037 L
611.175 119.263 L
619.2 127.902 L
627.225 119.51 L
635.25 117.851 L
643.275 114.946 L
651.3 111.734 L
659.325 101.932 L
667.35 102.99 L
675.375 118.674 L
683.4 119.295 L
691.425 134.222 L
699.45 145.402 L
707.475 138.481 L
715.5 161.987 L
S
GR
GS
0.849 GC
N
f249055524
f
GR
GS
0.729 GC
1 LJ
0.5 LW
N
555 168.043 M
563.025 151.178 L
571.05 148.234 L
579.075 140.02 L
587.1 158.092 L
595.125 148.721 L
603.15 140.274 L
611.175 131.548 L
619.2 137.473 L
627.225 158.843 L
635.25 135.851 L
643.275 129.765 L
651.3 131.91 L
659.325 143.339 L
667.35 135.391 L
675.375 135.768 L
683.4 131.873 L
691.425 128.076 L
699.45 131.331 L
707.475 145.621 L
715.5 136.772 L
S
GR
GS
0.729 GC
1 LJ
0.5 LW
N
555 148.733 M
563.025 131.916 L
571.05 131.427 L
579.075 123.926 L
587.1 139.613 L
595.125 131.266 L
603.15 123.284 L
611.175 111.614 L
619.2 119.781 L
627.225 140.815 L
635.25 116.85 L
643.275 112.366 L
651.3 114.697 L
659.325 125.296 L
667.35 115.386 L
675.375 117.378 L
683.4 115.032 L
691.425 111.542 L
699.45 114.712 L
707.475 128.575 L
715.5 122.307 L
S
GR
GS
0.4 GC
[10 6] 0 setdash
2 LJ
N
555 158.388 M
563.025 141.547 L
571.05 139.83 L
579.075 131.973 L
587.1 148.853 L
595.125 139.994 L
603.15 131.779 L
611.175 121.581 L
619.2 128.627 L
627.225 149.829 L
635.25 126.35 L
643.275 121.066 L
651.3 123.304 L
659.325 134.317 L
667.35 125.389 L
675.375 126.573 L
683.4 123.453 L
691.425 119.809 L
699.45 123.021 L
707.475 137.098 L
715.5 129.54 L
S
GR
GS
1 GC
N
/f-161203396{766.5 189 M
926.5 189 L
926.5 26.5 L
766.5 26.5 L
cp}def
f-161203396
f
GR
GS
0.149 GC
2 setlinecap
1 LJ
0.5 LW
N
766.5 189 M
926.5 189 L
S
GR
GS
0.149 GC
2 setlinecap
1 LJ
0.5 LW
N
766.5 189 M
766.5 187.375 L
S
GR
GS
0.149 GC
2 setlinecap
1 LJ
0.5 LW
N
828.516 189 M
828.516 187.375 L
S
GR
GS
0.149 GC
2 setlinecap
1 LJ
0.5 LW
N
890.531 189 M
890.531 187.375 L
S
GR
GS
[1 0 0 1 766.5 194.59996] CT
0.149 GC
/Helvetica 18 F
GS
[1 0 0 1 0 0] CT
-5.5 18 moveto 
1 -1 scale
(0) t 
GR
GR
GS
[1 0 0 1 828.5155 194.59996] CT
0.149 GC
/Helvetica 18 F
GS
[1 0 0 1 0 0] CT
-5.5 18 moveto 
1 -1 scale
(5) t 
GR
GR
GS
[1 0 0 1 890.53101 194.59996] CT
0.149 GC
/Helvetica 18 F
GS
[1 0 0 1 0 0] CT
-10.5 18 moveto 
1 -1 scale
(10) t 
GR
GR
GS
0.149 GC
2 setlinecap
1 LJ
0.5 LW
N
766.5 189 M
766.5 26.5 L
S
GR
GS
0.149 GC
2 setlinecap
1 LJ
0.5 LW
N
766.5 174.227 M
768.125 174.227 L
S
GR
GS
0.149 GC
2 setlinecap
1 LJ
0.5 LW
N
766.5 144.682 M
768.125 144.682 L
S
GR
GS
0.149 GC
2 setlinecap
1 LJ
0.5 LW
N
766.5 115.136 M
768.125 115.136 L
S
GR
GS
0.149 GC
2 setlinecap
1 LJ
0.5 LW
N
766.5 85.591 M
768.125 85.591 L
S
GR
GS
0.149 GC
2 setlinecap
1 LJ
0.5 LW
N
766.5 56.045 M
768.125 56.045 L
S
GR
GS
0.149 GC
2 setlinecap
1 LJ
0.5 LW
N
766.5 26.5 M
768.125 26.5 L
S
GR
GS
[1 0 0 1 760.90002 174.22728] CT
0.149 GC
/Helvetica 18 F
GS
[1 0 0 1 0 0] CT
-21 7 moveto 
1 -1 scale
(49) t 
GR
GR
GS
[1 0 0 1 760.90002 144.68182] CT
0.149 GC
/Helvetica 18 F
GS
[1 0 0 1 0 0] CT
-21 7 moveto 
1 -1 scale
(50) t 
GR
GR
GS
[1 0 0 1 760.90002 115.13636] CT
0.149 GC
/Helvetica 18 F
GS
[1 0 0 1 0 0] CT
-21 7 moveto 
1 -1 scale
(51) t 
GR
GR
GS
[1 0 0 1 760.90002 85.59091] CT
0.149 GC
/Helvetica 18 F
GS
[1 0 0 1 0 0] CT
-21 7 moveto 
1 -1 scale
(52) t 
GR
GR
GS
[1 0 0 1 760.90002 56.04546] CT
0.149 GC
/Helvetica 18 F
GS
[1 0 0 1 0 0] CT
-21 7 moveto 
1 -1 scale
(53) t 
GR
GR
GS
[1 0 0 1 760.90002 26.5] CT
0.149 GC
/Helvetica 18 F
GS
[1 0 0 1 0 0] CT
-21 7 moveto 
1 -1 scale
(54) t 
GR
GR
GS
[1 0 0 1 846.50079 24.25003] CT
/Helvetica-Bold 18 F
GS
[1 0 0 1 0 0] CT
-44.5 -4 moveto 
1 -1 scale
(luminance) t 
GR
GR
GS
0.948 0.749 0.781 RC
N
/f-283101700{830.5 145.179 M
838.5 163.156 L
846.5 155.086 L
854.5 134.637 L
862.5 138.48 L
870.5 132.051 L
878.5 140.943 L
886.5 135.394 L
894.5 149.162 L
902.5 147.041 L
910.5 156.314 L
918.5 142.253 L
926.5 130.846 L
926.5 115.949 L
918.5 125.381 L
910.5 136.407 L
902.5 126.431 L
894.5 129.769 L
886.5 115.419 L
878.5 122.623 L
870.5 112.799 L
862.5 118.63 L
854.5 116.649 L
846.5 138.011 L
838.5 146.319 L
830.5 125.786 L
822.5 137.986 L
814.5 129.046 L
806.5 115.406 L
798.5 129.7 L
790.5 130.445 L
782.5 127.602 L
774.5 141.767 L
766.5 145.389 L
766.5 162.704 L
774.5 162.933 L
782.5 145.038 L
790.5 150.067 L
798.5 149.28 L
806.5 135.121 L
814.5 145.775 L
822.5 156.828 L
cp}def
f-283101700
f
GR
GS
0.906 0.549 0.608 RC
1 LJ
0.5 LW
N
766.5 162.704 M
774.5 162.933 L
782.5 145.038 L
790.5 150.067 L
798.5 149.28 L
806.5 135.121 L
814.5 145.775 L
822.5 156.828 L
830.5 145.179 L
838.5 163.156 L
846.5 155.086 L
854.5 134.637 L
862.5 138.48 L
870.5 132.051 L
878.5 140.943 L
886.5 135.394 L
894.5 149.162 L
902.5 147.041 L
910.5 156.314 L
918.5 142.253 L
926.5 130.846 L
S
GR
GS
0.906 0.549 0.608 RC
1 LJ
0.5 LW
N
766.5 145.389 M
774.5 141.767 L
782.5 127.602 L
790.5 130.445 L
798.5 129.7 L
806.5 115.406 L
814.5 129.046 L
822.5 137.986 L
830.5 125.786 L
838.5 146.319 L
846.5 138.011 L
854.5 116.649 L
862.5 118.63 L
870.5 112.799 L
878.5 122.623 L
886.5 115.419 L
894.5 129.769 L
902.5 126.431 L
910.5 136.407 L
918.5 125.381 L
926.5 115.949 L
S
GR
GS
0.849 GC
N
/f629341419{822.5 166.964 M
830.5 161.873 L
838.5 154.81 L
846.5 160.563 L
854.5 166.952 L
862.5 154.496 L
870.5 176.931 L
878.5 153.435 L
886.5 151.12 L
894.5 149.695 L
902.5 144.558 L
910.5 143.09 L
918.5 128.589 L
926.5 136.311 L
926.5 117.268 L
918.5 110.14 L
910.5 127.404 L
902.5 126.708 L
894.5 130.707 L
886.5 132.991 L
878.5 135.979 L
870.5 161.576 L
862.5 137.95 L
854.5 147.331 L
846.5 141.755 L
838.5 136.508 L
830.5 142.131 L
822.5 146.683 L
814.5 143.609 L
806.5 134.791 L
798.5 141.337 L
790.5 136.205 L
782.5 138.651 L
774.5 113.57 L
766.5 133.907 L
766.5 151.104 L
774.5 132.107 L
782.5 155.112 L
790.5 151.848 L
798.5 159.16 L
806.5 153.024 L
814.5 162.303 L
cp}def
f629341419
f
GR
GS
0.729 GC
1 LJ
0.5 LW
N
766.5 151.104 M
774.5 132.107 L
782.5 155.112 L
790.5 151.848 L
798.5 159.16 L
806.5 153.024 L
814.5 162.303 L
822.5 166.964 L
830.5 161.873 L
838.5 154.81 L
846.5 160.563 L
854.5 166.952 L
862.5 154.496 L
870.5 176.931 L
878.5 153.435 L
886.5 151.12 L
894.5 149.695 L
902.5 144.558 L
910.5 143.09 L
918.5 128.589 L
926.5 136.311 L
S
GR
GS
0.729 GC
1 LJ
0.5 LW
N
766.5 133.907 M
774.5 113.57 L
782.5 138.651 L
790.5 136.205 L
798.5 141.337 L
806.5 134.791 L
814.5 143.609 L
822.5 146.683 L
830.5 142.131 L
838.5 136.508 L
846.5 141.755 L
854.5 147.331 L
862.5 137.95 L
870.5 161.576 L
878.5 135.979 L
886.5 132.991 L
894.5 130.707 L
902.5 126.708 L
910.5 127.404 L
918.5 110.14 L
926.5 117.268 L
S
GR
GS
0.948 0.749 0.781 RC
N
f-283101700
f
GR
GS
0.906 0.549 0.608 RC
1 LJ
0.5 LW
N
766.5 162.704 M
774.5 162.933 L
782.5 145.038 L
790.5 150.067 L
798.5 149.28 L
806.5 135.121 L
814.5 145.775 L
822.5 156.828 L
830.5 145.179 L
838.5 163.156 L
846.5 155.086 L
854.5 134.637 L
862.5 138.48 L
870.5 132.051 L
878.5 140.943 L
886.5 135.394 L
894.5 149.162 L
902.5 147.041 L
910.5 156.314 L
918.5 142.253 L
926.5 130.846 L
S
GR
GS
0.906 0.549 0.608 RC
1 LJ
0.5 LW
N
766.5 145.389 M
774.5 141.767 L
782.5 127.602 L
790.5 130.445 L
798.5 129.7 L
806.5 115.406 L
814.5 129.046 L
822.5 137.986 L
830.5 125.786 L
838.5 146.319 L
846.5 138.011 L
854.5 116.649 L
862.5 118.63 L
870.5 112.799 L
878.5 122.623 L
886.5 115.419 L
894.5 129.769 L
902.5 126.431 L
910.5 136.407 L
918.5 125.381 L
926.5 115.949 L
S
GR
GS
0.849 GC
N
f629341419
f
GR
GS
0.729 GC
1 LJ
0.5 LW
N
766.5 151.104 M
774.5 132.107 L
782.5 155.112 L
790.5 151.848 L
798.5 159.16 L
806.5 153.024 L
814.5 162.303 L
822.5 166.964 L
830.5 161.873 L
838.5 154.81 L
846.5 160.563 L
854.5 166.952 L
862.5 154.496 L
870.5 176.931 L
878.5 153.435 L
886.5 151.12 L
894.5 149.695 L
902.5 144.558 L
910.5 143.09 L
918.5 128.589 L
926.5 136.311 L
S
GR
GS
0.729 GC
1 LJ
0.5 LW
N
766.5 133.907 M
774.5 113.57 L
782.5 138.651 L
790.5 136.205 L
798.5 141.337 L
806.5 134.791 L
814.5 143.609 L
822.5 146.683 L
830.5 142.131 L
838.5 136.508 L
846.5 141.755 L
854.5 147.331 L
862.5 137.95 L
870.5 161.576 L
878.5 135.979 L
886.5 132.991 L
894.5 130.707 L
902.5 126.708 L
910.5 127.404 L
918.5 110.14 L
926.5 117.268 L
S
GR
GS
1 GC
N
/f-39843245{796.577 189.019 M
828.516 189.019 L
828.516 26.481 L
799.989 26.481 L
766.5 26.481 L
766.5 189.019 L
cp}def
f-39843245
f
GR
GS
0.902 GC
N
/f1504324189{846.562 189.019 M
865.725 189.019 L
865.725 26.481 L
848.609 26.481 L
828.516 26.481 L
828.516 189.019 L
cp}def
f1504324189
f
GR
GS
1 GC
N
/f216306729{895.2 189.019 M
926.5 189.019 L
926.5 26.481 L
898.544 26.481 L
865.725 26.481 L
865.725 189.019 L
cp}def
f216306729
f
GR
GS
[8 8] 0 setdash
2 LJ
2 LW
N
766.5 144.682 M
926.5 144.682 L
S
GR
GS
0.948 0.749 0.781 RC
N
f-283101700
f
GR
GS
0.906 0.549 0.608 RC
1 LJ
0.5 LW
N
766.5 162.704 M
774.5 162.933 L
782.5 145.038 L
790.5 150.067 L
798.5 149.28 L
806.5 135.121 L
814.5 145.775 L
822.5 156.828 L
830.5 145.179 L
838.5 163.156 L
846.5 155.086 L
854.5 134.637 L
862.5 138.48 L
870.5 132.051 L
878.5 140.943 L
886.5 135.394 L
894.5 149.162 L
902.5 147.041 L
910.5 156.314 L
918.5 142.253 L
926.5 130.846 L
S
GR
GS
0.906 0.549 0.608 RC
1 LJ
0.5 LW
N
766.5 145.389 M
774.5 141.767 L
782.5 127.602 L
790.5 130.445 L
798.5 129.7 L
806.5 115.406 L
814.5 129.046 L
822.5 137.986 L
830.5 125.786 L
838.5 146.319 L
846.5 138.011 L
854.5 116.649 L
862.5 118.63 L
870.5 112.799 L
878.5 122.623 L
886.5 115.419 L
894.5 129.769 L
902.5 126.431 L
910.5 136.407 L
918.5 125.381 L
926.5 115.949 L
S
GR
GS
0.792 0 0.125 RC
1 LJ
2 LW
N
766.5 154.047 M
774.5 152.35 L
782.5 136.32 L
790.5 140.256 L
798.5 139.49 L
806.5 125.264 L
814.5 137.411 L
822.5 147.407 L
830.5 135.483 L
838.5 154.737 L
846.5 146.549 L
854.5 125.643 L
862.5 128.555 L
870.5 122.425 L
878.5 131.783 L
886.5 125.406 L
894.5 139.466 L
902.5 136.736 L
910.5 146.36 L
918.5 133.817 L
926.5 123.398 L
S
GR
GS
0.849 GC
N
f629341419
f
GR
GS
0.729 GC
1 LJ
0.5 LW
N
766.5 151.104 M
774.5 132.107 L
782.5 155.112 L
790.5 151.848 L
798.5 159.16 L
806.5 153.024 L
814.5 162.303 L
822.5 166.964 L
830.5 161.873 L
838.5 154.81 L
846.5 160.563 L
854.5 166.952 L
862.5 154.496 L
870.5 176.931 L
878.5 153.435 L
886.5 151.12 L
894.5 149.695 L
902.5 144.558 L
910.5 143.09 L
918.5 128.589 L
926.5 136.311 L
S
GR
GS
0.729 GC
1 LJ
0.5 LW
N
766.5 133.907 M
774.5 113.57 L
782.5 138.651 L
790.5 136.205 L
798.5 141.337 L
806.5 134.791 L
814.5 143.609 L
822.5 146.683 L
830.5 142.131 L
838.5 136.508 L
846.5 141.755 L
854.5 147.331 L
862.5 137.95 L
870.5 161.576 L
878.5 135.979 L
886.5 132.991 L
894.5 130.707 L
902.5 126.708 L
910.5 127.404 L
918.5 110.14 L
926.5 117.268 L
S
GR
GS
0.4 GC
[10 6] 0 setdash
2 LJ
N
766.5 142.505 M
774.5 122.838 L
782.5 146.881 L
790.5 144.027 L
798.5 150.248 L
806.5 143.907 L
814.5 152.956 L
822.5 156.824 L
830.5 152.002 L
838.5 145.659 L
846.5 151.159 L
854.5 157.141 L
862.5 146.223 L
870.5 169.253 L
878.5 144.707 L
886.5 142.055 L
894.5 140.201 L
902.5 135.633 L
910.5 135.247 L
918.5 119.365 L
926.5 126.789 L
S
GR
%%Trailer
%%Pages: 1
%%EOF
