%!PS-Adobe-3.0 EPSF-3.0
%%Creator: (MATLAB, The Mathworks, Inc. Version 9.8.0.1323502 \(R2020a\). Operating System: Mac OS X)
%%Title: /Users/kosciessa/Desktop/tardis/LNDG/stateswitch/stsw_fmri_task/decoding/figures/G_decode/G6D_winOption_VC_loadeffects.eps
%%CreationDate: 2022-03-01T09:18:28
%%Pages: (atend)
%%BoundingBox:    24     0   464   211
%%LanguageLevel: 3
%%EndComments
%%BeginProlog
%%BeginResource: procset (Apache XML Graphics Std ProcSet) 1.2 0
%%Version: 1.2 0
%%Copyright: (Copyright 2001-2003,2010 The Apache Software Foundation. License terms: http://www.apache.org/licenses/LICENSE-2.0)
/bd{bind def}bind def
/ld{load def}bd
/GR/grestore ld
/GS/gsave ld
/RM/rmoveto ld
/C/curveto ld
/t/show ld
/L/lineto ld
/ML/setmiterlimit ld
/CT/concat ld
/f/fill ld
/N/newpath ld
/S/stroke ld
/CC/setcmykcolor ld
/A/ashow ld
/cp/closepath ld
/RC/setrgbcolor ld
/LJ/setlinejoin ld
/GC/setgray ld
/LW/setlinewidth ld
/M/moveto ld
/re {4 2 roll M
1 index 0 rlineto
0 exch rlineto
neg 0 rlineto
cp } bd
/_ctm matrix def
/_tm matrix def
/BT { _ctm currentmatrix pop matrix _tm copy pop 0 0 moveto } bd
/ET { _ctm setmatrix } bd
/iTm { _ctm setmatrix _tm concat } bd
/Tm { _tm astore pop iTm 0 0 moveto } bd
/ux 0.0 def
/uy 0.0 def
/F {
  /Tp exch def
  /Tf exch def
  Tf findfont Tp scalefont setfont
  /cf Tf def  /cs Tp def
} bd
/ULS {currentpoint /uy exch def /ux exch def} bd
/ULE {
  /Tcx currentpoint pop def
  gsave
  newpath
  cf findfont cs scalefont dup
  /FontMatrix get 0 get /Ts exch def /FontInfo get dup
  /UnderlinePosition get Ts mul /To exch def
  /UnderlineThickness get Ts mul /Tt exch def
  ux uy To add moveto  Tcx uy To add lineto
  Tt setlinewidth stroke
  grestore
} bd
/OLE {
  /Tcx currentpoint pop def
  gsave
  newpath
  cf findfont cs scalefont dup
  /FontMatrix get 0 get /Ts exch def /FontInfo get dup
  /UnderlinePosition get Ts mul /To exch def
  /UnderlineThickness get Ts mul /Tt exch def
  ux uy To add cs add moveto Tcx uy To add cs add lineto
  Tt setlinewidth stroke
  grestore
} bd
/SOE {
  /Tcx currentpoint pop def
  gsave
  newpath
  cf findfont cs scalefont dup
  /FontMatrix get 0 get /Ts exch def /FontInfo get dup
  /UnderlinePosition get Ts mul /To exch def
  /UnderlineThickness get Ts mul /Tt exch def
  ux uy To add cs 10 mul 26 idiv add moveto Tcx uy To add cs 10 mul 26 idiv add lineto
  Tt setlinewidth stroke
  grestore
} bd
/QT {
/Y22 exch store
/X22 exch store
/Y21 exch store
/X21 exch store
currentpoint
/Y21 load 2 mul add 3 div exch
/X21 load 2 mul add 3 div exch
/X21 load 2 mul /X22 load add 3 div
/Y21 load 2 mul /Y22 load add 3 div
/X22 load /Y22 load curveto
} bd
/SSPD {
dup length /d exch dict def
{
/v exch def
/k exch def
currentpagedevice k known {
/cpdv currentpagedevice k get def
v cpdv ne {
/upd false def
/nullv v type /nulltype eq def
/nullcpdv cpdv type /nulltype eq def
nullv nullcpdv or
{
/upd true def
} {
/sametype v type cpdv type eq def
sametype {
v type /arraytype eq {
/vlen v length def
/cpdvlen cpdv length def
vlen cpdvlen eq {
0 1 vlen 1 sub {
/i exch def
/obj v i get def
/cpdobj cpdv i get def
obj cpdobj ne {
/upd true def
exit
} if
} for
} {
/upd true def
} ifelse
} {
v type /dicttype eq {
v {
/dv exch def
/dk exch def
/cpddv cpdv dk get def
dv cpddv ne {
/upd true def
exit
} if
} forall
} {
/upd true def
} ifelse
} ifelse
} if
} ifelse
upd true eq {
d k v put
} if
} if
} if
} forall
d length 0 gt {
d setpagedevice
} if
} bd
/RE { % /NewFontName [NewEncodingArray] /FontName RE -
  findfont dup length dict begin
  {
    1 index /FID ne
    {def} {pop pop} ifelse
  } forall
  /Encoding exch def
  /FontName 1 index def
  currentdict definefont pop
  end
} bind def
%%EndResource
%%BeginResource: procset (Apache XML Graphics EPS ProcSet) 1.0 0
%%Version: 1.0 0
%%Copyright: (Copyright 2002-2003 The Apache Software Foundation. License terms: http://www.apache.org/licenses/LICENSE-2.0)
/BeginEPSF { %def
/b4_Inc_state save def         % Save state for cleanup
/dict_count countdictstack def % Count objects on dict stack
/op_count count 1 sub def      % Count objects on operand stack
userdict begin                 % Push userdict on dict stack
/showpage { } def              % Redefine showpage, { } = null proc
0 setgray 0 setlinecap         % Prepare graphics state
1 setlinewidth 0 setlinejoin
10 setmiterlimit [ ] 0 setdash newpath
/languagelevel where           % If level not equal to 1 then
{pop languagelevel             % set strokeadjust and
1 ne                           % overprint to their defaults.
{false setstrokeadjust false setoverprint
} if
} if
} bd
/EndEPSF { %def
count op_count sub {pop} repeat            % Clean up stacks
countdictstack dict_count sub {end} repeat
b4_Inc_state restore
} bd
%%EndResource
%FOPBeginFontDict
%%IncludeResource: font Courier-Oblique
%%IncludeResource: font Courier-BoldOblique
%%IncludeResource: font Courier-Bold
%%IncludeResource: font ZapfDingbats
%%IncludeResource: font Symbol
%%IncludeResource: font Helvetica
%%IncludeResource: font Helvetica-Oblique
%%IncludeResource: font Helvetica-Bold
%%IncludeResource: font Helvetica-BoldOblique
%%IncludeResource: font Times-Roman
%%IncludeResource: font Times-Italic
%%IncludeResource: font Times-Bold
%%IncludeResource: font Times-BoldItalic
%%IncludeResource: font Courier
%FOPEndFontDict
%%BeginResource: encoding WinAnsiEncoding
/WinAnsiEncoding [
/.notdef /.notdef /.notdef /.notdef /.notdef
/.notdef /.notdef /.notdef /.notdef /.notdef
/.notdef /.notdef /.notdef /.notdef /.notdef
/.notdef /.notdef /.notdef /.notdef /.notdef
/.notdef /.notdef /.notdef /.notdef /.notdef
/.notdef /.notdef /.notdef /.notdef /.notdef
/.notdef /.notdef /space /exclam /quotedbl
/numbersign /dollar /percent /ampersand /quotesingle
/parenleft /parenright /asterisk /plus /comma
/hyphen /period /slash /zero /one
/two /three /four /five /six
/seven /eight /nine /colon /semicolon
/less /equal /greater /question /at
/A /B /C /D /E
/F /G /H /I /J
/K /L /M /N /O
/P /Q /R /S /T
/U /V /W /X /Y
/Z /bracketleft /backslash /bracketright /asciicircum
/underscore /quoteleft /a /b /c
/d /e /f /g /h
/i /j /k /l /m
/n /o /p /q /r
/s /t /u /v /w
/x /y /z /braceleft /bar
/braceright /asciitilde /bullet /Euro /bullet
/quotesinglbase /florin /quotedblbase /ellipsis /dagger
/daggerdbl /circumflex /perthousand /Scaron /guilsinglleft
/OE /bullet /Zcaron /bullet /bullet
/quoteleft /quoteright /quotedblleft /quotedblright /bullet
/endash /emdash /asciitilde /trademark /scaron
/guilsinglright /oe /bullet /zcaron /Ydieresis
/space /exclamdown /cent /sterling /currency
/yen /brokenbar /section /dieresis /copyright
/ordfeminine /guillemotleft /logicalnot /sfthyphen /registered
/macron /degree /plusminus /twosuperior /threesuperior
/acute /mu /paragraph /middot /cedilla
/onesuperior /ordmasculine /guillemotright /onequarter /onehalf
/threequarters /questiondown /Agrave /Aacute /Acircumflex
/Atilde /Adieresis /Aring /AE /Ccedilla
/Egrave /Eacute /Ecircumflex /Edieresis /Igrave
/Iacute /Icircumflex /Idieresis /Eth /Ntilde
/Ograve /Oacute /Ocircumflex /Otilde /Odieresis
/multiply /Oslash /Ugrave /Uacute /Ucircumflex
/Udieresis /Yacute /Thorn /germandbls /agrave
/aacute /acircumflex /atilde /adieresis /aring
/ae /ccedilla /egrave /eacute /ecircumflex
/edieresis /igrave /iacute /icircumflex /idieresis
/eth /ntilde /ograve /oacute /ocircumflex
/otilde /odieresis /divide /oslash /ugrave
/uacute /ucircumflex /udieresis /yacute /thorn
/ydieresis
] def
%%EndResource
%FOPBeginFontReencode
/Courier-Oblique findfont
dup length dict begin
  {1 index /FID ne {def} {pop pop} ifelse} forall
  /Encoding WinAnsiEncoding def
  currentdict
end
/Courier-Oblique exch definefont pop
/Courier-BoldOblique findfont
dup length dict begin
  {1 index /FID ne {def} {pop pop} ifelse} forall
  /Encoding WinAnsiEncoding def
  currentdict
end
/Courier-BoldOblique exch definefont pop
/Courier-Bold findfont
dup length dict begin
  {1 index /FID ne {def} {pop pop} ifelse} forall
  /Encoding WinAnsiEncoding def
  currentdict
end
/Courier-Bold exch definefont pop
/Helvetica findfont
dup length dict begin
  {1 index /FID ne {def} {pop pop} ifelse} forall
  /Encoding WinAnsiEncoding def
  currentdict
end
/Helvetica exch definefont pop
/Helvetica-Oblique findfont
dup length dict begin
  {1 index /FID ne {def} {pop pop} ifelse} forall
  /Encoding WinAnsiEncoding def
  currentdict
end
/Helvetica-Oblique exch definefont pop
/Helvetica-Bold findfont
dup length dict begin
  {1 index /FID ne {def} {pop pop} ifelse} forall
  /Encoding WinAnsiEncoding def
  currentdict
end
/Helvetica-Bold exch definefont pop
/Helvetica-BoldOblique findfont
dup length dict begin
  {1 index /FID ne {def} {pop pop} ifelse} forall
  /Encoding WinAnsiEncoding def
  currentdict
end
/Helvetica-BoldOblique exch definefont pop
/Times-Roman findfont
dup length dict begin
  {1 index /FID ne {def} {pop pop} ifelse} forall
  /Encoding WinAnsiEncoding def
  currentdict
end
/Times-Roman exch definefont pop
/Times-Italic findfont
dup length dict begin
  {1 index /FID ne {def} {pop pop} ifelse} forall
  /Encoding WinAnsiEncoding def
  currentdict
end
/Times-Italic exch definefont pop
/Times-Bold findfont
dup length dict begin
  {1 index /FID ne {def} {pop pop} ifelse} forall
  /Encoding WinAnsiEncoding def
  currentdict
end
/Times-Bold exch definefont pop
/Times-BoldItalic findfont
dup length dict begin
  {1 index /FID ne {def} {pop pop} ifelse} forall
  /Encoding WinAnsiEncoding def
  currentdict
end
/Times-BoldItalic exch definefont pop
/Courier findfont
dup length dict begin
  {1 index /FID ne {def} {pop pop} ifelse} forall
  /Encoding WinAnsiEncoding def
  currentdict
end
/Courier exch definefont pop
%FOPEndFontReencode
%%EndProlog
%%Page: 1 1
%%PageBoundingBox: 0 0 512 216
%%BeginPageSetup
[1 0 0 -1 0 216] CT
%%EndPageSetup
GS
1 GC
N
0 0 512 216 re
f
GR
GS
1 GC
N
0 0 512 216 re
f
GR
GS
1 GC
N
77 174 M
238 174 L
238 22.5 L
77 22.5 L
cp
f
GR
GS
0.149 GC
2 setlinecap
1 LJ
0.5 LW
N
77 174 M
238 174 L
S
GR
GS
0.149 GC
2 setlinecap
1 LJ
0.5 LW
N
97.125 174 M
97.125 172.39 L
S
GR
GS
0.149 GC
2 setlinecap
1 LJ
0.5 LW
N
137.375 174 M
137.375 172.39 L
S
GR
GS
0.149 GC
2 setlinecap
1 LJ
0.5 LW
N
177.625 174 M
177.625 172.39 L
S
GR
GS
0.149 GC
2 setlinecap
1 LJ
0.5 LW
N
217.875 174 M
217.875 172.39 L
S
GR
GS
[1 0 0 1 97.125 178.99998] CT
0.149 GC
/Helvetica 15 F
GS
[1 0 0 1 0 0] CT
-4.5 15 moveto 
1 -1 scale
(1) t 
GR
GR
GS
[1 0 0 1 137.375 178.99998] CT
0.149 GC
/Helvetica 15 F
GS
[1 0 0 1 0 0] CT
-4.5 15 moveto 
1 -1 scale
(2) t 
GR
GR
GS
[1 0 0 1 177.625 178.99998] CT
0.149 GC
/Helvetica 15 F
GS
[1 0 0 1 0 0] CT
-4.5 15 moveto 
1 -1 scale
(3) t 
GR
GR
GS
[1 0 0 1 217.875 178.99998] CT
0.149 GC
/Helvetica 15 F
GS
[1 0 0 1 0 0] CT
-4.5 15 moveto 
1 -1 scale
(4) t 
GR
GR
GS
[1 0 0 1 157.50008 197.99991] CT
0.149 GC
/Helvetica 15 F
GS
[1 0 0 1 0 0] CT
-28 15 moveto 
1 -1 scale
(Target #) t 
GR
GR
GS
0.149 GC
2 setlinecap
1 LJ
0.5 LW
N
77 174 M
77 22.5 L
S
GR
GS
0.149 GC
2 setlinecap
1 LJ
0.5 LW
N
77 174 M
78.61 174 L
S
GR
GS
0.149 GC
2 setlinecap
1 LJ
0.5 LW
N
77 143.7 M
78.61 143.7 L
S
GR
GS
0.149 GC
2 setlinecap
1 LJ
0.5 LW
N
77 113.4 M
78.61 113.4 L
S
GR
GS
0.149 GC
2 setlinecap
1 LJ
0.5 LW
N
77 83.1 M
78.61 83.1 L
S
GR
GS
0.149 GC
2 setlinecap
1 LJ
0.5 LW
N
77 52.8 M
78.61 52.8 L
S
GR
GS
0.149 GC
2 setlinecap
1 LJ
0.5 LW
N
77 22.5 M
78.61 22.5 L
S
GR
GS
[1 0 0 1 72 174] CT
0.149 GC
/Helvetica 15 F
GS
[1 0 0 1 0 0] CT
-17 5.5 moveto 
1 -1 scale
(50) t 
GR
GR
GS
[1 0 0 1 72 143.7] CT
0.149 GC
/Helvetica 15 F
GS
[1 0 0 1 0 0] CT
-30 5.5 moveto 
1 -1 scale
(50.5) t 
GR
GR
GS
[1 0 0 1 72 113.4] CT
0.149 GC
/Helvetica 15 F
GS
[1 0 0 1 0 0] CT
-17 5.5 moveto 
1 -1 scale
(51) t 
GR
GR
GS
[1 0 0 1 72 83.1] CT
0.149 GC
/Helvetica 15 F
GS
[1 0 0 1 0 0] CT
-30 5.5 moveto 
1 -1 scale
(51.5) t 
GR
GR
GS
[1 0 0 1 72 52.8] CT
0.149 GC
/Helvetica 15 F
GS
[1 0 0 1 0 0] CT
-17 5.5 moveto 
1 -1 scale
(52) t 
GR
GR
GS
[1 0 0 1 72 22.5] CT
0.149 GC
/Helvetica 15 F
GS
[1 0 0 1 0 0] CT
-30 5.5 moveto 
1 -1 scale
(52.5) t 
GR
GR
GS
[0 -1 1 0 39.5 98.25] CT
0.149 GC
/Helvetica 15 F
GS
[1 0 0 1 0 0] CT
-78.5 -4 moveto 
1 -1 scale
(Decoding accuracy \(%\)) t 
GR
GR
GS
[1 0 0 1 157.50015 20.62498] CT
/Helvetica-Bold 15 F
GS
[1 0 0 1 0 0] CT
-26 -4 moveto 
1 -1 scale
(Probed) t 
GR
GR
GS
0.792 0 0.125 RC
1 LJ
2 LW
N
97.125 52.183 M
97.125 67.242 L
S
GR
GS
0.792 0 0.125 RC
1 LJ
2 LW
N
137.375 93.306 M
137.375 104.65 L
S
GR
GS
0.792 0 0.125 RC
1 LJ
2 LW
N
177.625 86.27 M
177.625 101.782 L
S
GR
GS
0.792 0 0.125 RC
1 LJ
2 LW
N
217.875 82.179 M
217.875 96.52 L
S
GR
GS
0.792 0 0.125 RC
1 LJ
2 LW
N
97.125 52.183 M
97.125 37.123 L
S
GR
GS
0.792 0 0.125 RC
1 LJ
2 LW
N
137.375 93.306 M
137.375 81.961 L
S
GR
GS
0.792 0 0.125 RC
1 LJ
2 LW
N
177.625 86.27 M
177.625 70.758 L
S
GR
GS
0.792 0 0.125 RC
1 LJ
2 LW
N
217.875 82.179 M
217.875 67.838 L
S
GR
GS
0.792 0 0.125 RC
1 LJ
2 LW
N
97.125 52.183 M
137.375 93.306 L
177.625 86.27 L
217.875 82.179 L
S
GR
GS
[1 0 0 1 97.125 67.24216] CT
0.792 0 0.125 RC
N
-3 0 M
3 0 L
f
GR
GS
[1 0 0 1 97.125 67.24216] CT
0.792 0 0.125 RC
10.0 ML
2 LW
N
-3 0 M
3 0 L
S
GR
GS
[1 0 0 1 137.375 104.65019] CT
0.792 0 0.125 RC
N
/f1394637256{-3 0 M
3 0 L}def
f1394637256
f
GR
GS
[1 0 0 1 137.375 104.65019] CT
0.792 0 0.125 RC
10.0 ML
2 LW
N
-3 0 M
3 0 L
S
GR
GS
[1 0 0 1 177.625 101.78182] CT
0.792 0 0.125 RC
N
f1394637256
f
GR
GS
[1 0 0 1 177.625 101.78182] CT
0.792 0 0.125 RC
10.0 ML
2 LW
N
-3 0 M
3 0 L
S
GR
GS
[1 0 0 1 217.875 96.52015] CT
0.792 0 0.125 RC
N
f1394637256
f
GR
GS
[1 0 0 1 217.875 96.52015] CT
0.792 0 0.125 RC
10.0 ML
2 LW
N
-3 0 M
3 0 L
S
GR
GS
[1 0 0 1 97.125 37.12316] CT
0.792 0 0.125 RC
N
f1394637256
f
GR
GS
[1 0 0 1 97.125 37.12316] CT
0.792 0 0.125 RC
10.0 ML
2 LW
N
-3 0 M
3 0 L
S
GR
GS
[1 0 0 1 137.375 81.96125] CT
0.792 0 0.125 RC
N
f1394637256
f
GR
GS
[1 0 0 1 137.375 81.96125] CT
0.792 0 0.125 RC
10.0 ML
2 LW
N
-3 0 M
3 0 L
S
GR
GS
[1 0 0 1 177.625 70.75826] CT
0.792 0 0.125 RC
N
f1394637256
f
GR
GS
[1 0 0 1 177.625 70.75826] CT
0.792 0 0.125 RC
10.0 ML
2 LW
N
-3 0 M
3 0 L
S
GR
GS
[1 0 0 1 217.875 67.83811] CT
0.792 0 0.125 RC
N
f1394637256
f
GR
GS
[1 0 0 1 217.875 67.83811] CT
0.792 0 0.125 RC
10.0 ML
2 LW
N
-3 0 M
3 0 L
S
GR
GS
0.957 0.647 0.51 RC
1 LJ
2 LW
N
97.125 113.657 M
97.125 124.823 L
S
GR
GS
0.957 0.647 0.51 RC
1 LJ
2 LW
N
137.375 123.756 M
137.375 136.93 L
S
GR
GS
0.957 0.647 0.51 RC
1 LJ
2 LW
N
177.625 141.878 M
177.625 150.787 L
S
GR
GS
0.957 0.647 0.51 RC
1 LJ
2 LW
N
217.875 149.126 M
217.875 158.538 L
S
GR
GS
0.957 0.647 0.51 RC
1 LJ
2 LW
N
97.125 113.657 M
97.125 102.491 L
S
GR
GS
0.957 0.647 0.51 RC
1 LJ
2 LW
N
137.375 123.756 M
137.375 110.581 L
S
GR
GS
0.957 0.647 0.51 RC
1 LJ
2 LW
N
177.625 141.878 M
177.625 132.969 L
S
GR
GS
0.957 0.647 0.51 RC
1 LJ
2 LW
N
217.875 149.126 M
217.875 139.713 L
S
GR
GS
0.957 0.647 0.51 RC
1 LJ
2 LW
N
97.125 113.657 M
137.375 123.756 L
177.625 141.878 L
217.875 149.126 L
S
GR
GS
[1 0 0 1 97.125 124.82284] CT
0.957 0.647 0.51 RC
N
f1394637256
f
GR
GS
[1 0 0 1 97.125 124.82284] CT
0.957 0.647 0.51 RC
10.0 ML
2 LW
N
-3 0 M
3 0 L
S
GR
GS
[1 0 0 1 137.375 136.9304] CT
0.957 0.647 0.51 RC
N
f1394637256
f
GR
GS
[1 0 0 1 137.375 136.9304] CT
0.957 0.647 0.51 RC
10.0 ML
2 LW
N
-3 0 M
3 0 L
S
GR
GS
[1 0 0 1 177.625 150.78677] CT
0.957 0.647 0.51 RC
N
f1394637256
f
GR
GS
[1 0 0 1 177.625 150.78677] CT
0.957 0.647 0.51 RC
10.0 ML
2 LW
N
-3 0 M
3 0 L
S
GR
GS
[1 0 0 1 217.875 158.53838] CT
0.957 0.647 0.51 RC
N
f1394637256
f
GR
GS
[1 0 0 1 217.875 158.53838] CT
0.957 0.647 0.51 RC
10.0 ML
2 LW
N
-3 0 M
3 0 L
S
GR
GS
[1 0 0 1 97.125 102.49129] CT
0.957 0.647 0.51 RC
N
f1394637256
f
GR
GS
[1 0 0 1 97.125 102.49129] CT
0.957 0.647 0.51 RC
10.0 ML
2 LW
N
-3 0 M
3 0 L
S
GR
GS
[1 0 0 1 137.375 110.58087] CT
0.957 0.647 0.51 RC
N
f1394637256
f
GR
GS
[1 0 0 1 137.375 110.58087] CT
0.957 0.647 0.51 RC
10.0 ML
2 LW
N
-3 0 M
3 0 L
S
GR
GS
[1 0 0 1 177.625 132.9686] CT
0.957 0.647 0.51 RC
N
f1394637256
f
GR
GS
[1 0 0 1 177.625 132.9686] CT
0.957 0.647 0.51 RC
10.0 ML
2 LW
N
-3 0 M
3 0 L
S
GR
GS
[1 0 0 1 217.875 139.71277] CT
0.957 0.647 0.51 RC
N
f1394637256
f
GR
GS
[1 0 0 1 217.875 139.71277] CT
0.957 0.647 0.51 RC
10.0 ML
2 LW
N
-3 0 M
3 0 L
S
GR
GS
1 GC
N
/f-1936381092{302.5 174 M
463.5 174 L
463.5 22.5 L
302.5 22.5 L
cp}def
f-1936381092
f
GR
GS
0.149 GC
2 setlinecap
1 LJ
0.5 LW
N
302.5 174 M
463.5 174 L
S
GR
GS
0.149 GC
2 setlinecap
1 LJ
0.5 LW
N
322.625 174 M
322.625 172.39 L
S
GR
GS
0.149 GC
2 setlinecap
1 LJ
0.5 LW
N
362.875 174 M
362.875 172.39 L
S
GR
GS
0.149 GC
2 setlinecap
1 LJ
0.5 LW
N
403.125 174 M
403.125 172.39 L
S
GR
GS
0.149 GC
2 setlinecap
1 LJ
0.5 LW
N
443.375 174 M
443.375 172.39 L
S
GR
GS
[1 0 0 1 322.625 179.00021] CT
0.149 GC
/Helvetica 15 F
GS
[1 0 0 1 0 0] CT
-4.5 15 moveto 
1 -1 scale
(1) t 
GR
GR
GS
[1 0 0 1 362.875 179.00021] CT
0.149 GC
/Helvetica 15 F
GS
[1 0 0 1 0 0] CT
-4.5 15 moveto 
1 -1 scale
(2) t 
GR
GR
GS
[1 0 0 1 403.125 179.00021] CT
0.149 GC
/Helvetica 15 F
GS
[1 0 0 1 0 0] CT
-4.5 15 moveto 
1 -1 scale
(3) t 
GR
GR
GS
[1 0 0 1 443.375 179.00021] CT
0.149 GC
/Helvetica 15 F
GS
[1 0 0 1 0 0] CT
-4.5 15 moveto 
1 -1 scale
(4) t 
GR
GR
GS
[1 0 0 1 383.00009 198.00014] CT
0.149 GC
/Helvetica 15 F
GS
[1 0 0 1 0 0] CT
-28 15 moveto 
1 -1 scale
(Target #) t 
GR
GR
GS
0.149 GC
2 setlinecap
1 LJ
0.5 LW
N
302.5 174 M
302.5 22.5 L
S
GR
GS
0.149 GC
2 setlinecap
1 LJ
0.5 LW
N
302.5 174 M
304.11 174 L
S
GR
GS
0.149 GC
2 setlinecap
1 LJ
0.5 LW
N
302.5 98.25 M
304.11 98.25 L
S
GR
GS
0.149 GC
2 setlinecap
1 LJ
0.5 LW
N
302.5 22.5 M
304.11 22.5 L
S
GR
GS
[1 0 0 1 297.5 174] CT
0.149 GC
/Helvetica 15 F
GS
[1 0 0 1 0 0] CT
-17 5.5 moveto 
1 -1 scale
(50) t 
GR
GR
GS
[1 0 0 1 297.5 98.25] CT
0.149 GC
/Helvetica 15 F
GS
[1 0 0 1 0 0] CT
-30 5.5 moveto 
1 -1 scale
(50.5) t 
GR
GR
GS
[1 0 0 1 297.5 22.5] CT
0.149 GC
/Helvetica 15 F
GS
[1 0 0 1 0 0] CT
-17 5.5 moveto 
1 -1 scale
(51) t 
GR
GR
GS
[0 -1 1 0 265 98.25] CT
0.149 GC
/Helvetica 15 F
GS
[1 0 0 1 0 0] CT
-78.5 -4 moveto 
1 -1 scale
(Decoding accuracy \(%\)) t 
GR
GR
GS
[1 0 0 1 383.00037 20.62521] CT
/Helvetica-Bold 15 F
GS
[1 0 0 1 0 0] CT
-36 -4 moveto 
1 -1 scale
(Unprobed) t 
GR
GR
GS
0.792 0 0.125 RC
1 LJ
2 LW
N
322.625 100.923 M
322.625 121.249 L
S
GR
GS
0.792 0 0.125 RC
1 LJ
2 LW
N
362.875 77.496 M
362.875 99.308 L
S
GR
GS
0.792 0 0.125 RC
1 LJ
2 LW
N
403.125 78.924 M
403.125 99.479 L
S
GR
GS
0.792 0 0.125 RC
1 LJ
2 LW
N
443.375 66.622 M
443.375 85.18 L
S
GR
GS
0.792 0 0.125 RC
1 LJ
2 LW
N
322.625 100.923 M
322.625 80.598 L
S
GR
GS
0.792 0 0.125 RC
1 LJ
2 LW
N
362.875 77.496 M
362.875 55.683 L
S
GR
GS
0.792 0 0.125 RC
1 LJ
2 LW
N
403.125 78.924 M
403.125 58.369 L
S
GR
GS
0.792 0 0.125 RC
1 LJ
2 LW
N
443.375 66.622 M
443.375 48.065 L
S
GR
GS
0.792 0 0.125 RC
1 LJ
2 LW
N
322.625 100.923 M
362.875 77.496 L
403.125 78.924 L
443.375 66.622 L
S
GR
GS
[1 0 0 1 322.625 121.24917] CT
0.792 0 0.125 RC
N
f1394637256
f
GR
GS
[1 0 0 1 322.625 121.24917] CT
0.792 0 0.125 RC
10.0 ML
2 LW
N
-3 0 M
3 0 L
S
GR
GS
[1 0 0 1 362.875 99.30818] CT
0.792 0 0.125 RC
N
f1394637256
f
GR
GS
[1 0 0 1 362.875 99.30818] CT
0.792 0 0.125 RC
10.0 ML
2 LW
N
-3 0 M
3 0 L
S
GR
GS
[1 0 0 1 403.125 99.47867] CT
0.792 0 0.125 RC
N
f1394637256
f
GR
GS
[1 0 0 1 403.125 99.47867] CT
0.792 0 0.125 RC
10.0 ML
2 LW
N
-3 0 M
3 0 L
S
GR
GS
[1 0 0 1 443.375 85.18019] CT
0.792 0 0.125 RC
N
f1394637256
f
GR
GS
[1 0 0 1 443.375 85.18019] CT
0.792 0 0.125 RC
10.0 ML
2 LW
N
-3 0 M
3 0 L
S
GR
GS
[1 0 0 1 322.625 80.59781] CT
0.792 0 0.125 RC
N
f1394637256
f
GR
GS
[1 0 0 1 322.625 80.59781] CT
0.792 0 0.125 RC
10.0 ML
2 LW
N
-3 0 M
3 0 L
S
GR
GS
[1 0 0 1 362.875 55.68339] CT
0.792 0 0.125 RC
N
f1394637256
f
GR
GS
[1 0 0 1 362.875 55.68339] CT
0.792 0 0.125 RC
10.0 ML
2 LW
N
-3 0 M
3 0 L
S
GR
GS
[1 0 0 1 403.125 58.36902] CT
0.792 0 0.125 RC
N
f1394637256
f
GR
GS
[1 0 0 1 403.125 58.36902] CT
0.792 0 0.125 RC
10.0 ML
2 LW
N
-3 0 M
3 0 L
S
GR
GS
[1 0 0 1 443.375 48.06459] CT
0.792 0 0.125 RC
N
f1394637256
f
GR
GS
[1 0 0 1 443.375 48.06459] CT
0.792 0 0.125 RC
10.0 ML
2 LW
N
-3 0 M
3 0 L
S
GR
GS
0.957 0.647 0.51 RC
1 LJ
2 LW
N
322.625 152.292 M
322.625 166.537 L
S
GR
GS
0.957 0.647 0.51 RC
1 LJ
2 LW
N
362.875 89.084 M
362.875 107.167 L
S
GR
GS
0.957 0.647 0.51 RC
1 LJ
2 LW
N
403.125 124.891 M
403.125 141.696 L
S
GR
GS
0.957 0.647 0.51 RC
1 LJ
2 LW
N
443.375 100.335 M
443.375 114.694 L
S
GR
GS
0.957 0.647 0.51 RC
1 LJ
2 LW
N
322.625 152.292 M
322.625 138.047 L
S
GR
GS
0.957 0.647 0.51 RC
1 LJ
2 LW
N
362.875 89.084 M
362.875 71 L
S
GR
GS
0.957 0.647 0.51 RC
1 LJ
2 LW
N
403.125 124.891 M
403.125 108.087 L
S
GR
GS
0.957 0.647 0.51 RC
1 LJ
2 LW
N
443.375 100.335 M
443.375 85.976 L
S
GR
GS
0.957 0.647 0.51 RC
1 LJ
2 LW
N
322.625 152.292 M
362.875 89.084 L
403.125 124.891 L
443.375 100.335 L
S
GR
GS
[1 0 0 1 322.625 166.53665] CT
0.957 0.647 0.51 RC
N
f1394637256
f
GR
GS
[1 0 0 1 322.625 166.53665] CT
0.957 0.647 0.51 RC
10.0 ML
2 LW
N
-3 0 M
3 0 L
S
GR
GS
[1 0 0 1 362.875 107.16683] CT
0.957 0.647 0.51 RC
N
f1394637256
f
GR
GS
[1 0 0 1 362.875 107.16683] CT
0.957 0.647 0.51 RC
10.0 ML
2 LW
N
-3 0 M
3 0 L
S
GR
GS
[1 0 0 1 403.125 141.69563] CT
0.957 0.647 0.51 RC
N
f1394637256
f
GR
GS
[1 0 0 1 403.125 141.69563] CT
0.957 0.647 0.51 RC
10.0 ML
2 LW
N
-3 0 M
3 0 L
S
GR
GS
[1 0 0 1 443.375 114.69432] CT
0.957 0.647 0.51 RC
N
f1394637256
f
GR
GS
[1 0 0 1 443.375 114.69432] CT
0.957 0.647 0.51 RC
10.0 ML
2 LW
N
-3 0 M
3 0 L
S
GR
GS
[1 0 0 1 322.625 138.04718] CT
0.957 0.647 0.51 RC
N
f1394637256
f
GR
GS
[1 0 0 1 322.625 138.04718] CT
0.957 0.647 0.51 RC
10.0 ML
2 LW
N
-3 0 M
3 0 L
S
GR
GS
[1 0 0 1 362.875 71.00018] CT
0.957 0.647 0.51 RC
N
f1394637256
f
GR
GS
[1 0 0 1 362.875 71.00018] CT
0.957 0.647 0.51 RC
10.0 ML
2 LW
N
-3 0 M
3 0 L
S
GR
GS
[1 0 0 1 403.125 108.08689] CT
0.957 0.647 0.51 RC
N
f1394637256
f
GR
GS
[1 0 0 1 403.125 108.08689] CT
0.957 0.647 0.51 RC
10.0 ML
2 LW
N
-3 0 M
3 0 L
S
GR
GS
[1 0 0 1 443.375 85.976] CT
0.957 0.647 0.51 RC
N
f1394637256
f
GR
GS
[1 0 0 1 443.375 85.976] CT
0.957 0.647 0.51 RC
10.0 ML
2 LW
N
-3 0 M
3 0 L
S
GR
%%Trailer
%%Pages: 1
%%EOF
