%!PS-Adobe-3.0 EPSF-3.0
%%Creator: (MATLAB, The Mathworks, Inc. Version 9.8.0.1323502 \(R2020a\). Operating System: Mac OS X)
%%Title: /Users/ddg/Volumes/tardis_mpib.localized/stateswitch/stsw_fmri_task/decoding/figures/G_decode/G6D_agediff_individual.eps
%%CreationDate: 2024-05-06T16:37:35
%%Pages: (atend)
%%BoundingBox:     4     0   180   276
%%LanguageLevel: 3
%%EndComments
%%BeginProlog
%%BeginResource: procset (Apache XML Graphics Std ProcSet) 1.2 0
%%Version: 1.2 0
%%Copyright: (Copyright 2001-2003,2010 The Apache Software Foundation. License terms: http://www.apache.org/licenses/LICENSE-2.0)
/bd{bind def}bind def
/ld{load def}bd
/GR/grestore ld
/GS/gsave ld
/RM/rmoveto ld
/C/curveto ld
/t/show ld
/L/lineto ld
/ML/setmiterlimit ld
/CT/concat ld
/f/fill ld
/N/newpath ld
/S/stroke ld
/CC/setcmykcolor ld
/A/ashow ld
/cp/closepath ld
/RC/setrgbcolor ld
/LJ/setlinejoin ld
/GC/setgray ld
/LW/setlinewidth ld
/M/moveto ld
/re {4 2 roll M
1 index 0 rlineto
0 exch rlineto
neg 0 rlineto
cp } bd
/_ctm matrix def
/_tm matrix def
/BT { _ctm currentmatrix pop matrix _tm copy pop 0 0 moveto } bd
/ET { _ctm setmatrix } bd
/iTm { _ctm setmatrix _tm concat } bd
/Tm { _tm astore pop iTm 0 0 moveto } bd
/ux 0.0 def
/uy 0.0 def
/F {
  /Tp exch def
  /Tf exch def
  Tf findfont Tp scalefont setfont
  /cf Tf def  /cs Tp def
} bd
/ULS {currentpoint /uy exch def /ux exch def} bd
/ULE {
  /Tcx currentpoint pop def
  gsave
  newpath
  cf findfont cs scalefont dup
  /FontMatrix get 0 get /Ts exch def /FontInfo get dup
  /UnderlinePosition get Ts mul /To exch def
  /UnderlineThickness get Ts mul /Tt exch def
  ux uy To add moveto  Tcx uy To add lineto
  Tt setlinewidth stroke
  grestore
} bd
/OLE {
  /Tcx currentpoint pop def
  gsave
  newpath
  cf findfont cs scalefont dup
  /FontMatrix get 0 get /Ts exch def /FontInfo get dup
  /UnderlinePosition get Ts mul /To exch def
  /UnderlineThickness get Ts mul /Tt exch def
  ux uy To add cs add moveto Tcx uy To add cs add lineto
  Tt setlinewidth stroke
  grestore
} bd
/SOE {
  /Tcx currentpoint pop def
  gsave
  newpath
  cf findfont cs scalefont dup
  /FontMatrix get 0 get /Ts exch def /FontInfo get dup
  /UnderlinePosition get Ts mul /To exch def
  /UnderlineThickness get Ts mul /Tt exch def
  ux uy To add cs 10 mul 26 idiv add moveto Tcx uy To add cs 10 mul 26 idiv add lineto
  Tt setlinewidth stroke
  grestore
} bd
/QT {
/Y22 exch store
/X22 exch store
/Y21 exch store
/X21 exch store
currentpoint
/Y21 load 2 mul add 3 div exch
/X21 load 2 mul add 3 div exch
/X21 load 2 mul /X22 load add 3 div
/Y21 load 2 mul /Y22 load add 3 div
/X22 load /Y22 load curveto
} bd
/SSPD {
dup length /d exch dict def
{
/v exch def
/k exch def
currentpagedevice k known {
/cpdv currentpagedevice k get def
v cpdv ne {
/upd false def
/nullv v type /nulltype eq def
/nullcpdv cpdv type /nulltype eq def
nullv nullcpdv or
{
/upd true def
} {
/sametype v type cpdv type eq def
sametype {
v type /arraytype eq {
/vlen v length def
/cpdvlen cpdv length def
vlen cpdvlen eq {
0 1 vlen 1 sub {
/i exch def
/obj v i get def
/cpdobj cpdv i get def
obj cpdobj ne {
/upd true def
exit
} if
} for
} {
/upd true def
} ifelse
} {
v type /dicttype eq {
v {
/dv exch def
/dk exch def
/cpddv cpdv dk get def
dv cpddv ne {
/upd true def
exit
} if
} forall
} {
/upd true def
} ifelse
} ifelse
} if
} ifelse
upd true eq {
d k v put
} if
} if
} if
} forall
d length 0 gt {
d setpagedevice
} if
} bd
/RE { % /NewFontName [NewEncodingArray] /FontName RE -
  findfont dup length dict begin
  {
    1 index /FID ne
    {def} {pop pop} ifelse
  } forall
  /Encoding exch def
  /FontName 1 index def
  currentdict definefont pop
  end
} bind def
%%EndResource
%%BeginResource: procset (Apache XML Graphics EPS ProcSet) 1.0 0
%%Version: 1.0 0
%%Copyright: (Copyright 2002-2003 The Apache Software Foundation. License terms: http://www.apache.org/licenses/LICENSE-2.0)
/BeginEPSF { %def
/b4_Inc_state save def         % Save state for cleanup
/dict_count countdictstack def % Count objects on dict stack
/op_count count 1 sub def      % Count objects on operand stack
userdict begin                 % Push userdict on dict stack
/showpage { } def              % Redefine showpage, { } = null proc
0 setgray 0 setlinecap         % Prepare graphics state
1 setlinewidth 0 setlinejoin
10 setmiterlimit [ ] 0 setdash newpath
/languagelevel where           % If level not equal to 1 then
{pop languagelevel             % set strokeadjust and
1 ne                           % overprint to their defaults.
{false setstrokeadjust false setoverprint
} if
} if
} bd
/EndEPSF { %def
count op_count sub {pop} repeat            % Clean up stacks
countdictstack dict_count sub {end} repeat
b4_Inc_state restore
} bd
%%EndResource
%FOPBeginFontDict
%%IncludeResource: font Courier-Oblique
%%IncludeResource: font Courier-BoldOblique
%%IncludeResource: font Courier-Bold
%%IncludeResource: font ZapfDingbats
%%IncludeResource: font Symbol
%%IncludeResource: font Helvetica
%%IncludeResource: font Helvetica-Oblique
%%IncludeResource: font Helvetica-Bold
%%IncludeResource: font Helvetica-BoldOblique
%%IncludeResource: font Times-Roman
%%IncludeResource: font Times-Italic
%%IncludeResource: font Times-Bold
%%IncludeResource: font Times-BoldItalic
%%IncludeResource: font Courier
%FOPEndFontDict
%%BeginResource: encoding WinAnsiEncoding
/WinAnsiEncoding [
/.notdef /.notdef /.notdef /.notdef /.notdef
/.notdef /.notdef /.notdef /.notdef /.notdef
/.notdef /.notdef /.notdef /.notdef /.notdef
/.notdef /.notdef /.notdef /.notdef /.notdef
/.notdef /.notdef /.notdef /.notdef /.notdef
/.notdef /.notdef /.notdef /.notdef /.notdef
/.notdef /.notdef /space /exclam /quotedbl
/numbersign /dollar /percent /ampersand /quotesingle
/parenleft /parenright /asterisk /plus /comma
/hyphen /period /slash /zero /one
/two /three /four /five /six
/seven /eight /nine /colon /semicolon
/less /equal /greater /question /at
/A /B /C /D /E
/F /G /H /I /J
/K /L /M /N /O
/P /Q /R /S /T
/U /V /W /X /Y
/Z /bracketleft /backslash /bracketright /asciicircum
/underscore /quoteleft /a /b /c
/d /e /f /g /h
/i /j /k /l /m
/n /o /p /q /r
/s /t /u /v /w
/x /y /z /braceleft /bar
/braceright /asciitilde /bullet /Euro /bullet
/quotesinglbase /florin /quotedblbase /ellipsis /dagger
/daggerdbl /circumflex /perthousand /Scaron /guilsinglleft
/OE /bullet /Zcaron /bullet /bullet
/quoteleft /quoteright /quotedblleft /quotedblright /bullet
/endash /emdash /asciitilde /trademark /scaron
/guilsinglright /oe /bullet /zcaron /Ydieresis
/space /exclamdown /cent /sterling /currency
/yen /brokenbar /section /dieresis /copyright
/ordfeminine /guillemotleft /logicalnot /sfthyphen /registered
/macron /degree /plusminus /twosuperior /threesuperior
/acute /mu /paragraph /middot /cedilla
/onesuperior /ordmasculine /guillemotright /onequarter /onehalf
/threequarters /questiondown /Agrave /Aacute /Acircumflex
/Atilde /Adieresis /Aring /AE /Ccedilla
/Egrave /Eacute /Ecircumflex /Edieresis /Igrave
/Iacute /Icircumflex /Idieresis /Eth /Ntilde
/Ograve /Oacute /Ocircumflex /Otilde /Odieresis
/multiply /Oslash /Ugrave /Uacute /Ucircumflex
/Udieresis /Yacute /Thorn /germandbls /agrave
/aacute /acircumflex /atilde /adieresis /aring
/ae /ccedilla /egrave /eacute /ecircumflex
/edieresis /igrave /iacute /icircumflex /idieresis
/eth /ntilde /ograve /oacute /ocircumflex
/otilde /odieresis /divide /oslash /ugrave
/uacute /ucircumflex /udieresis /yacute /thorn
/ydieresis
] def
%%EndResource
%FOPBeginFontReencode
/Courier-Oblique findfont
dup length dict begin
  {1 index /FID ne {def} {pop pop} ifelse} forall
  /Encoding WinAnsiEncoding def
  currentdict
end
/Courier-Oblique exch definefont pop
/Courier-BoldOblique findfont
dup length dict begin
  {1 index /FID ne {def} {pop pop} ifelse} forall
  /Encoding WinAnsiEncoding def
  currentdict
end
/Courier-BoldOblique exch definefont pop
/Courier-Bold findfont
dup length dict begin
  {1 index /FID ne {def} {pop pop} ifelse} forall
  /Encoding WinAnsiEncoding def
  currentdict
end
/Courier-Bold exch definefont pop
/Helvetica findfont
dup length dict begin
  {1 index /FID ne {def} {pop pop} ifelse} forall
  /Encoding WinAnsiEncoding def
  currentdict
end
/Helvetica exch definefont pop
/Helvetica-Oblique findfont
dup length dict begin
  {1 index /FID ne {def} {pop pop} ifelse} forall
  /Encoding WinAnsiEncoding def
  currentdict
end
/Helvetica-Oblique exch definefont pop
/Helvetica-Bold findfont
dup length dict begin
  {1 index /FID ne {def} {pop pop} ifelse} forall
  /Encoding WinAnsiEncoding def
  currentdict
end
/Helvetica-Bold exch definefont pop
/Helvetica-BoldOblique findfont
dup length dict begin
  {1 index /FID ne {def} {pop pop} ifelse} forall
  /Encoding WinAnsiEncoding def
  currentdict
end
/Helvetica-BoldOblique exch definefont pop
/Times-Roman findfont
dup length dict begin
  {1 index /FID ne {def} {pop pop} ifelse} forall
  /Encoding WinAnsiEncoding def
  currentdict
end
/Times-Roman exch definefont pop
/Times-Italic findfont
dup length dict begin
  {1 index /FID ne {def} {pop pop} ifelse} forall
  /Encoding WinAnsiEncoding def
  currentdict
end
/Times-Italic exch definefont pop
/Times-Bold findfont
dup length dict begin
  {1 index /FID ne {def} {pop pop} ifelse} forall
  /Encoding WinAnsiEncoding def
  currentdict
end
/Times-Bold exch definefont pop
/Times-BoldItalic findfont
dup length dict begin
  {1 index /FID ne {def} {pop pop} ifelse} forall
  /Encoding WinAnsiEncoding def
  currentdict
end
/Times-BoldItalic exch definefont pop
/Courier findfont
dup length dict begin
  {1 index /FID ne {def} {pop pop} ifelse} forall
  /Encoding WinAnsiEncoding def
  currentdict
end
/Courier exch definefont pop
%FOPEndFontReencode
%%EndProlog
%%Page: 1 1
%%PageBoundingBox: 0 0 198 283
%%BeginPageSetup
[1 0 0 -1 0 283] CT
%%EndPageSetup
GS
[1.00215 0 0 1 0 0] CT
1 GC
N
0 0 198 283 re
f
GR
GS
[1.00215 0 0 1 0 0] CT
1 GC
N
0 0 198 283 re
f
GR
GS
[1.00215 0 0 1 0 0] CT
1 GC
N
55.5 228 M
179 228 L
179 29 L
55.5 29 L
cp
f
GR
GS
[1.00215 0 0 1 0 0] CT
0.149 GC
2 setlinecap
1 LJ
0.5 LW
N
55.5 228 M
179 228 L
S
GR
GS
[1.00215 0 0 1 0 0] CT
0.149 GC
2 setlinecap
1 LJ
0.5 LW
N
55.5 29 M
179 29 L
S
GR
GS
[1.00215 0 0 1 0 0] CT
0.149 GC
2 setlinecap
1 LJ
0.5 LW
N
92.55 228 M
92.55 226.01 L
S
GR
GS
[1.00215 0 0 1 0 0] CT
0.149 GC
2 setlinecap
1 LJ
0.5 LW
N
141.95 228 M
141.95 226.01 L
S
GR
GS
[1.00215 0 0 1 0 0] CT
0.149 GC
2 setlinecap
1 LJ
0.5 LW
N
92.55 29 M
92.55 30.99 L
S
GR
GS
[1.00215 0 0 1 0 0] CT
0.149 GC
2 setlinecap
1 LJ
0.5 LW
N
141.95 29 M
141.95 30.99 L
S
GR
GS
[1.00215 0 0 1 92.74875 233.99997] CT
0.149 GC
/Helvetica 20 F
GS
[1 0 0 1 0 0] CT
-13 20 moveto 
1 -1 scale
(YA) t 
GR
GR
GS
[1.00215 0 0 1 142.25483 233.99997] CT
0.149 GC
/Helvetica 20 F
GS
[1 0 0 1 0 0] CT
-14.5 20 moveto 
1 -1 scale
(OA) t 
GR
GR
GS
[1.00215 0 0 1 117.50185 259.00006] CT
0.149 GC
/Helvetica 20 F
GS
[1 0 0 1 0 0] CT
-49 20 moveto 
1 -1 scale
(Age Group) t 
GR
GR
GS
[1.00215 0 0 1 0 0] CT
0.149 GC
2 setlinecap
1 LJ
0.5 LW
N
55.5 228 M
55.5 29 L
S
GR
GS
[1.00215 0 0 1 0 0] CT
0.149 GC
2 setlinecap
1 LJ
0.5 LW
N
179 228 M
179 29 L
S
GR
GS
[1.00215 0 0 1 0 0] CT
0.149 GC
2 setlinecap
1 LJ
0.5 LW
N
55.5 228 M
57.49 228 L
S
GR
GS
[1.00215 0 0 1 0 0] CT
0.149 GC
2 setlinecap
1 LJ
0.5 LW
N
55.5 188.2 M
57.49 188.2 L
S
GR
GS
[1.00215 0 0 1 0 0] CT
0.149 GC
2 setlinecap
1 LJ
0.5 LW
N
55.5 148.4 M
57.49 148.4 L
S
GR
GS
[1.00215 0 0 1 0 0] CT
0.149 GC
2 setlinecap
1 LJ
0.5 LW
N
55.5 108.6 M
57.49 108.6 L
S
GR
GS
[1.00215 0 0 1 0 0] CT
0.149 GC
2 setlinecap
1 LJ
0.5 LW
N
55.5 68.8 M
57.49 68.8 L
S
GR
GS
[1.00215 0 0 1 0 0] CT
0.149 GC
2 setlinecap
1 LJ
0.5 LW
N
55.5 29 M
57.49 29 L
S
GR
GS
[1.00215 0 0 1 0 0] CT
0.149 GC
2 setlinecap
1 LJ
0.5 LW
N
179 228 M
177.01 228 L
S
GR
GS
[1.00215 0 0 1 0 0] CT
0.149 GC
2 setlinecap
1 LJ
0.5 LW
N
179 188.2 M
177.01 188.2 L
S
GR
GS
[1.00215 0 0 1 0 0] CT
0.149 GC
2 setlinecap
1 LJ
0.5 LW
N
179 148.4 M
177.01 148.4 L
S
GR
GS
[1.00215 0 0 1 0 0] CT
0.149 GC
2 setlinecap
1 LJ
0.5 LW
N
179 108.6 M
177.01 108.6 L
S
GR
GS
[1.00215 0 0 1 0 0] CT
0.149 GC
2 setlinecap
1 LJ
0.5 LW
N
179 68.8 M
177.01 68.8 L
S
GR
GS
[1.00215 0 0 1 0 0] CT
0.149 GC
2 setlinecap
1 LJ
0.5 LW
N
179 29 M
177.01 29 L
S
GR
GS
[1.00215 0 0 1 49.6063 228] CT
0.149 GC
/Helvetica 20 F
GS
[1 0 0 1 0 0] CT
-23 7.5 moveto 
1 -1 scale
(49) t 
GR
GR
GS
[1.00215 0 0 1 49.6063 188.2] CT
0.149 GC
/Helvetica 20 F
GS
[1 0 0 1 0 0] CT
-23 7.5 moveto 
1 -1 scale
(50) t 
GR
GR
GS
[1.00215 0 0 1 49.6063 148.39999] CT
0.149 GC
/Helvetica 20 F
GS
[1 0 0 1 0 0] CT
-23 7.5 moveto 
1 -1 scale
(51) t 
GR
GR
GS
[1.00215 0 0 1 49.6063 108.6] CT
0.149 GC
/Helvetica 20 F
GS
[1 0 0 1 0 0] CT
-23 7.5 moveto 
1 -1 scale
(52) t 
GR
GR
GS
[1.00215 0 0 1 49.6063 68.8] CT
0.149 GC
/Helvetica 20 F
GS
[1 0 0 1 0 0] CT
-23 7.5 moveto 
1 -1 scale
(53) t 
GR
GR
GS
[1.00215 0 0 1 49.6063 29] CT
0.149 GC
/Helvetica 20 F
GS
[1 0 0 1 0 0] CT
-23 7.5 moveto 
1 -1 scale
(54) t 
GR
GR
GS
[0 -1 1.00215 0 24.05154 128.49985] CT
0.149 GC
/Helvetica 20 F
GS
[1 0 0 1 0 0] CT
-104.5 -5 moveto 
1 -1 scale
(Decoding accuracy \(%\)) t 
GR
GR
GS
[1.00215 0 0 1 117.50191 26.50005] CT
/Helvetica-Bold 20 F
GS
[1 0 0 1 0 0] CT
-43 -5 moveto 
1 -1 scale
(p = 0.006) t 
GR
GR
GS
[1.00215 0 0 1 0 0] CT
0.149 GC
1 LJ
0.5 LW
N
55.5 228 M
179 228 L
S
GR
GS
[1.00215 0 0 1 0 0] CT
1 0.6 0.6 RC
N
112.31 228 M
112.31 154.192 L
72.79 154.192 L
72.79 228 L
cp
f
GR
GS
[1.00215 0 0 1 0 0] CT
0.702 GC
N
112.31 228 M
112.31 188.2 L
72.79 188.2 L
72.79 228 L
cp
f
GR
GS
[1.00215 0 0 1 84.77907 162.46992] CT
0.302 GC
N
2.236 0 M
2.236 -1.235 1.235 -2.236 0 -2.236 C
-1.235 -2.236 -2.236 -1.235 -2.236 0 C
-2.236 1.235 -1.235 2.236 0 2.236 C
1.235 2.236 2.236 1.235 2.236 0 C
cp
f
GR
GS
[1.00215 0 0 1 88.36248 163.313] CT
0.302 GC
N
/f-1586420743{2.236 0 M
2.236 -1.235 1.235 -2.236 0 -2.236 C
-1.235 -2.236 -2.236 -1.235 -2.236 0 C
-2.236 1.235 -1.235 2.236 0 2.236 C
1.235 2.236 2.236 1.235 2.236 0 C
cp}def
f-1586420743
f
GR
GS
[1.00215 0 0 1 93.67712 133.58568] CT
0.302 GC
N
f-1586420743
f
GR
GS
[1.00215 0 0 1 101.8085 192.05681] CT
0.302 GC
N
f-1586420743
f
GR
GS
[1.00215 0 0 1 101.95468 187.91306] CT
0.302 GC
N
f-1586420743
f
GR
GS
[1.00215 0 0 1 85.96865 132.892] CT
0.302 GC
N
f-1586420743
f
GR
GS
[1.00215 0 0 1 102.06763 140.84186] CT
0.302 GC
N
f-1586420743
f
GR
GS
[1.00215 0 0 1 101.80177 121.50983] CT
0.302 GC
N
f-1586420743
f
GR
GS
[1.00215 0 0 1 92.45915 149.26707] CT
0.302 GC
N
f-1586420743
f
GR
GS
[1.00215 0 0 1 98.69504 171.02071] CT
0.302 GC
N
f-1586420743
f
GR
GS
[1.00215 0 0 1 85.65722 106.42648] CT
0.302 GC
N
f-1586420743
f
GR
GS
[1.00215 0 0 1 91.19943 132.80226] CT
0.302 GC
N
f-1586420743
f
GR
GS
[1.00215 0 0 1 100.98132 183.67941] CT
0.302 GC
N
f-1586420743
f
GR
GS
[1.00215 0 0 1 98.53516 149.04587] CT
0.302 GC
N
f-1586420743
f
GR
GS
[1.00215 0 0 1 101.84782 207.36153] CT
0.302 GC
N
f-1586420743
f
GR
GS
[1.00215 0 0 1 95.83279 173.09857] CT
0.302 GC
N
f-1586420743
f
GR
GS
[1.00215 0 0 1 83.55471 142.98257] CT
0.302 GC
N
f-1586420743
f
GR
GS
[1.00215 0 0 1 99.66236 150.92044] CT
0.302 GC
N
f-1586420743
f
GR
GS
[1.00215 0 0 1 101.34288 170.9908] CT
0.302 GC
N
f-1586420743
f
GR
GS
[1.00215 0 0 1 96.28814 150.1431] CT
0.302 GC
N
f-1586420743
f
GR
GS
[1.00215 0 0 1 97.85263 191.6144] CT
0.302 GC
N
f-1586420743
f
GR
GS
[1.00215 0 0 1 97.56336 169.15508] CT
0.302 GC
N
f-1586420743
f
GR
GS
[1.00215 0 0 1 90.61459 143.70602] CT
0.302 GC
N
f-1586420743
f
GR
GS
[1.00215 0 0 1 95.82759 169.35533] CT
0.302 GC
N
f-1586420743
f
GR
GS
[1.00215 0 0 1 86.23745 59.08017] CT
0.302 GC
N
f-1586420743
f
GR
GS
[1.00215 0 0 1 96.82896 182.02315] CT
0.302 GC
N
f-1586420743
f
GR
GS
[1.00215 0 0 1 83.4779 134.53033] CT
0.302 GC
N
f-1586420743
f
GR
GS
[1.00215 0 0 1 88.33128 118.92972] CT
0.302 GC
N
f-1586420743
f
GR
GS
[1.00215 0 0 1 83.76184 147.09644] CT
0.302 GC
N
f-1586420743
f
GR
GS
[1.00215 0 0 1 84.77098 193.94035] CT
0.302 GC
N
f-1586420743
f
GR
GS
[1.00215 0 0 1 99.154 177.12285] CT
0.302 GC
N
f-1586420743
f
GR
GS
[1.00215 0 0 1 96.60683 146.61514] CT
0.302 GC
N
f-1586420743
f
GR
GS
[1.00215 0 0 1 89.12687 140.29468] CT
0.302 GC
N
f-1586420743
f
GR
GS
[1.00215 0 0 1 101.66424 178.22601] CT
0.302 GC
N
f-1586420743
f
GR
GS
[1.00215 0 0 1 83.52965 164.92159] CT
0.302 GC
N
f-1586420743
f
GR
GS
[1.00215 0 0 1 91.53573 138.04037] CT
0.302 GC
N
f-1586420743
f
GR
GS
[1.00215 0 0 1 90.40332 168.41068] CT
0.302 GC
N
f-1586420743
f
GR
GS
[1.00215 0 0 1 98.00663 164.91551] CT
0.302 GC
N
f-1586420743
f
GR
GS
[1.00215 0 0 1 98.59443 181.83473] CT
0.302 GC
N
f-1586420743
f
GR
GS
[1.00215 0 0 1 86.54806 180.3757] CT
0.302 GC
N
f-1586420743
f
GR
GS
[1.00215 0 0 1 92.54606 120.33197] CT
0.302 GC
N
f-1586420743
f
GR
GS
[1.00215 0 0 1 91.67123 83.21077] CT
0.302 GC
N
f-1586420743
f
GR
GS
[1.00215 0 0 1 0 0] CT
1 0.6 0.6 RC
N
/f222279438{161.71 228 M
161.71 170.022 L
122.19 170.022 L
122.19 228 L
cp}def
f222279438
f
GR
GS
[1.00215 0 0 1 0 0] CT
0.702 GC
N
/f-1099706578{161.71 228 M
161.71 188.2 L
122.19 188.2 L
122.19 228 L
cp}def
f-1099706578
f
GR
GS
[1.00215 0 0 1 145.15218 182.40878] CT
0.302 GC
N
f-1586420743
f
GR
GS
[1.00215 0 0 1 146.40077 192.38567] CT
0.302 GC
N
f-1586420743
f
GR
GS
[1.00215 0 0 1 147.29825 167.26257] CT
0.302 GC
N
f-1586420743
f
GR
GS
[1.00215 0 0 1 137.81959 194.02415] CT
0.302 GC
N
f-1586420743
f
GR
GS
[1.00215 0 0 1 145.81339 153.28238] CT
0.302 GC
N
f-1586420743
f
GR
GS
[1.00215 0 0 1 145.32616 202.6138] CT
0.302 GC
N
f-1586420743
f
GR
GS
[1.00215 0 0 1 135.57372 120.41259] CT
0.302 GC
N
f-1586420743
f
GR
GS
[1.00215 0 0 1 134.71005 168.80527] CT
0.302 GC
N
f-1586420743
f
GR
GS
[1.00215 0 0 1 142.22244 208.18973] CT
0.302 GC
N
f-1586420743
f
GR
GS
[1.00215 0 0 1 151.35887 152.88171] CT
0.302 GC
N
f-1586420743
f
GR
GS
[1.00215 0 0 1 139.09408 137.13443] CT
0.302 GC
N
f-1586420743
f
GR
GS
[1.00215 0 0 1 143.94336 211.95984] CT
0.302 GC
N
f-1586420743
f
GR
GS
[1.00215 0 0 1 136.78564 185.24913] CT
0.302 GC
N
f-1586420743
f
GR
GS
[1.00215 0 0 1 147.23054 148.31331] CT
0.302 GC
N
f-1586420743
f
GR
GS
[1.00215 0 0 1 137.40513 156.17935] CT
0.302 GC
N
f-1586420743
f
GR
GS
[1.00215 0 0 1 142.37279 178.25304] CT
0.302 GC
N
f-1586420743
f
GR
GS
[1.00215 0 0 1 146.19704 184.22659] CT
0.302 GC
N
f-1586420743
f
GR
GS
[1.00215 0 0 1 149.99568 115.27316] CT
0.302 GC
N
f-1586420743
f
GR
GS
[1.00215 0 0 1 151.34993 180.62682] CT
0.302 GC
N
f-1586420743
f
GR
GS
[1.00215 0 0 1 143.18982 178.39059] CT
0.302 GC
N
f-1586420743
f
GR
GS
[1.00215 0 0 1 135.09872 153.33917] CT
0.302 GC
N
f-1586420743
f
GR
GS
[1.00215 0 0 1 135.31 197.05869] CT
0.302 GC
N
f-1586420743
f
GR
GS
[1.00215 0 0 1 137.45292 181.45807] CT
0.302 GC
N
f-1586420743
f
GR
GS
[1.00215 0 0 1 149.00186 153.05206] CT
0.302 GC
N
f-1586420743
f
GR
GS
[1.00215 0 0 1 137.38903 136.59334] CT
0.302 GC
N
f-1586420743
f
GR
GS
[1.00215 0 0 1 148.47843 119.19586] CT
0.302 GC
N
f-1586420743
f
GR
GS
[1.00215 0 0 1 137.176 163.60011] CT
0.302 GC
N
f-1586420743
f
GR
GS
[1.00215 0 0 1 150.7553 183.81105] CT
0.302 GC
N
f-1586420743
f
GR
GS
[1.00215 0 0 1 139.28414 169.66628] CT
0.302 GC
N
f-1586420743
f
GR
GS
[1.00215 0 0 1 136.24669 191.6024] CT
0.302 GC
N
f-1586420743
f
GR
GS
[1.00215 0 0 1 137.32569 194.41283] CT
0.302 GC
N
f-1586420743
f
GR
GS
[1.00215 0 0 1 144.5528 163.19351] CT
0.302 GC
N
f-1586420743
f
GR
GS
[1.00215 0 0 1 141.72588 184.77377] CT
0.302 GC
N
f-1586420743
f
GR
GS
[1.00215 0 0 1 139.31734 118.72034] CT
0.302 GC
N
f-1586420743
f
GR
GS
[1.00215 0 0 1 148.80604 173.39464] CT
0.302 GC
N
f-1586420743
f
GR
GS
[1.00215 0 0 1 143.94326 166.91566] CT
0.302 GC
N
f-1586420743
f
GR
GS
[1.00215 0 0 1 143.23949 171.54694] CT
0.302 GC
N
f-1586420743
f
GR
GS
[1.00215 0 0 1 150.51629 144.7764] CT
0.302 GC
N
f-1586420743
f
GR
GS
[1.00215 0 0 1 138.01393 198.95726] CT
0.302 GC
N
f-1586420743
f
GR
GS
[1.00215 0 0 1 147.34802 194.91811] CT
0.302 GC
N
f-1586420743
f
GR
GS
[1.00215 0 0 1 147.27929 193.23482] CT
0.302 GC
N
f-1586420743
f
GR
GS
[1.00215 0 0 1 139.88738 178.2919] CT
0.302 GC
N
f-1586420743
f
GR
GS
[1.00215 0 0 1 143.59787 173.97461] CT
0.302 GC
N
f-1586420743
f
GR
GS
[1.00215 0 0 1 133.85571 191.32729] CT
0.302 GC
N
f-1586420743
f
GR
GS
[1.00215 0 0 1 133.42195 197.00494] CT
0.302 GC
N
f-1586420743
f
GR
GS
[1.00215 0 0 1 142.86471 157.05539] CT
0.302 GC
N
f-1586420743
f
GR
GS
[1.00215 0 0 1 147.78302 147.86482] CT
0.302 GC
N
f-1586420743
f
GR
GS
[1.00215 0 0 1 150.8493 160.51457] CT
0.302 GC
N
f-1586420743
f
GR
GS
[1.00215 0 0 1 134.92608 156.70558] CT
0.302 GC
N
f-1586420743
f
GR
GS
[1.00215 0 0 1 143.61771 165.39392] CT
0.302 GC
N
f-1586420743
f
GR
GS
[1.00215 0 0 1 141.64869 170.86827] CT
0.302 GC
N
f-1586420743
f
GR
GS
[1.00215 0 0 1 0 0] CT
1 LJ
3 LW
N
92.55 154.192 M
92.55 158.78 L
S
GR
GS
[1.00215 0 0 1 0 0] CT
1 LJ
3 LW
N
141.95 170.022 M
141.95 173.312 L
S
GR
GS
[1.00215 0 0 1 0 0] CT
1 LJ
3 LW
N
92.55 154.192 M
92.55 149.603 L
S
GR
GS
[1.00215 0 0 1 0 0] CT
1 LJ
3 LW
N
141.95 170.022 M
141.95 166.731 L
S
GR
GS
[1.00215 0 0 1 0 0] CT
1 LJ
3 LW
N
92.55 154.192 M
141.95 170.022 L
S
GR
GS
[1.00215 0 0 1 92.74875 158.77997] CT
N
/f1394637256{-3 0 M
3 0 L}def
f1394637256
f
GR
GS
[1.00215 0 0 1 92.74875 158.77997] CT
10.0 ML
3 LW
N
-3 0 M
3 0 L
S
GR
GS
[1.00215 0 0 1 142.25483 173.31219] CT
N
f1394637256
f
GR
GS
[1.00215 0 0 1 142.25483 173.31219] CT
10.0 ML
3 LW
N
-3 0 M
3 0 L
S
GR
GS
[1.00215 0 0 1 92.74875 149.60336] CT
N
f1394637256
f
GR
GS
[1.00215 0 0 1 92.74875 149.60336] CT
10.0 ML
3 LW
N
-3 0 M
3 0 L
S
GR
GS
[1.00215 0 0 1 142.25483 166.73074] CT
N
f1394637256
f
GR
GS
[1.00215 0 0 1 142.25483 166.73074] CT
10.0 ML
3 LW
N
-3 0 M
3 0 L
S
GR
%%Trailer
%%Pages: 1
%%EOF
