%!PS-Adobe-3.0 EPSF-3.0
%%Creator: (MATLAB, The Mathworks, Inc. Version 9.8.0.1323502 \(R2020a\). Operating System: Mac OS X)
%%Title: /Users/kosciessa/Desktop/mntTardisLNDG/LNDG/stateswitch/stsw_fmri_task/decoding/figures/G_decode/G6D_winOption_VC_byFeature.eps
%%CreationDate: 2022-03-03T18:04:54
%%Pages: (atend)
%%BoundingBox:   120     0  1163   419
%%LanguageLevel: 3
%%EndComments
%%BeginProlog
%%BeginResource: procset (Apache XML Graphics Std ProcSet) 1.2 0
%%Version: 1.2 0
%%Copyright: (Copyright 2001-2003,2010 The Apache Software Foundation. License terms: http://www.apache.org/licenses/LICENSE-2.0)
/bd{bind def}bind def
/ld{load def}bd
/GR/grestore ld
/GS/gsave ld
/RM/rmoveto ld
/C/curveto ld
/t/show ld
/L/lineto ld
/ML/setmiterlimit ld
/CT/concat ld
/f/fill ld
/N/newpath ld
/S/stroke ld
/CC/setcmykcolor ld
/A/ashow ld
/cp/closepath ld
/RC/setrgbcolor ld
/LJ/setlinejoin ld
/GC/setgray ld
/LW/setlinewidth ld
/M/moveto ld
/re {4 2 roll M
1 index 0 rlineto
0 exch rlineto
neg 0 rlineto
cp } bd
/_ctm matrix def
/_tm matrix def
/BT { _ctm currentmatrix pop matrix _tm copy pop 0 0 moveto } bd
/ET { _ctm setmatrix } bd
/iTm { _ctm setmatrix _tm concat } bd
/Tm { _tm astore pop iTm 0 0 moveto } bd
/ux 0.0 def
/uy 0.0 def
/F {
  /Tp exch def
  /Tf exch def
  Tf findfont Tp scalefont setfont
  /cf Tf def  /cs Tp def
} bd
/ULS {currentpoint /uy exch def /ux exch def} bd
/ULE {
  /Tcx currentpoint pop def
  gsave
  newpath
  cf findfont cs scalefont dup
  /FontMatrix get 0 get /Ts exch def /FontInfo get dup
  /UnderlinePosition get Ts mul /To exch def
  /UnderlineThickness get Ts mul /Tt exch def
  ux uy To add moveto  Tcx uy To add lineto
  Tt setlinewidth stroke
  grestore
} bd
/OLE {
  /Tcx currentpoint pop def
  gsave
  newpath
  cf findfont cs scalefont dup
  /FontMatrix get 0 get /Ts exch def /FontInfo get dup
  /UnderlinePosition get Ts mul /To exch def
  /UnderlineThickness get Ts mul /Tt exch def
  ux uy To add cs add moveto Tcx uy To add cs add lineto
  Tt setlinewidth stroke
  grestore
} bd
/SOE {
  /Tcx currentpoint pop def
  gsave
  newpath
  cf findfont cs scalefont dup
  /FontMatrix get 0 get /Ts exch def /FontInfo get dup
  /UnderlinePosition get Ts mul /To exch def
  /UnderlineThickness get Ts mul /Tt exch def
  ux uy To add cs 10 mul 26 idiv add moveto Tcx uy To add cs 10 mul 26 idiv add lineto
  Tt setlinewidth stroke
  grestore
} bd
/QT {
/Y22 exch store
/X22 exch store
/Y21 exch store
/X21 exch store
currentpoint
/Y21 load 2 mul add 3 div exch
/X21 load 2 mul add 3 div exch
/X21 load 2 mul /X22 load add 3 div
/Y21 load 2 mul /Y22 load add 3 div
/X22 load /Y22 load curveto
} bd
/SSPD {
dup length /d exch dict def
{
/v exch def
/k exch def
currentpagedevice k known {
/cpdv currentpagedevice k get def
v cpdv ne {
/upd false def
/nullv v type /nulltype eq def
/nullcpdv cpdv type /nulltype eq def
nullv nullcpdv or
{
/upd true def
} {
/sametype v type cpdv type eq def
sametype {
v type /arraytype eq {
/vlen v length def
/cpdvlen cpdv length def
vlen cpdvlen eq {
0 1 vlen 1 sub {
/i exch def
/obj v i get def
/cpdobj cpdv i get def
obj cpdobj ne {
/upd true def
exit
} if
} for
} {
/upd true def
} ifelse
} {
v type /dicttype eq {
v {
/dv exch def
/dk exch def
/cpddv cpdv dk get def
dv cpddv ne {
/upd true def
exit
} if
} forall
} {
/upd true def
} ifelse
} ifelse
} if
} ifelse
upd true eq {
d k v put
} if
} if
} if
} forall
d length 0 gt {
d setpagedevice
} if
} bd
/RE { % /NewFontName [NewEncodingArray] /FontName RE -
  findfont dup length dict begin
  {
    1 index /FID ne
    {def} {pop pop} ifelse
  } forall
  /Encoding exch def
  /FontName 1 index def
  currentdict definefont pop
  end
} bind def
%%EndResource
%%BeginResource: procset (Apache XML Graphics EPS ProcSet) 1.0 0
%%Version: 1.0 0
%%Copyright: (Copyright 2002-2003 The Apache Software Foundation. License terms: http://www.apache.org/licenses/LICENSE-2.0)
/BeginEPSF { %def
/b4_Inc_state save def         % Save state for cleanup
/dict_count countdictstack def % Count objects on dict stack
/op_count count 1 sub def      % Count objects on operand stack
userdict begin                 % Push userdict on dict stack
/showpage { } def              % Redefine showpage, { } = null proc
0 setgray 0 setlinecap         % Prepare graphics state
1 setlinewidth 0 setlinejoin
10 setmiterlimit [ ] 0 setdash newpath
/languagelevel where           % If level not equal to 1 then
{pop languagelevel             % set strokeadjust and
1 ne                           % overprint to their defaults.
{false setstrokeadjust false setoverprint
} if
} if
} bd
/EndEPSF { %def
count op_count sub {pop} repeat            % Clean up stacks
countdictstack dict_count sub {end} repeat
b4_Inc_state restore
} bd
%%EndResource
%FOPBeginFontDict
%%IncludeResource: font Courier-Oblique
%%IncludeResource: font Courier-BoldOblique
%%IncludeResource: font Courier-Bold
%%IncludeResource: font ZapfDingbats
%%IncludeResource: font Symbol
%%IncludeResource: font Helvetica
%%IncludeResource: font Helvetica-Oblique
%%IncludeResource: font Helvetica-Bold
%%IncludeResource: font Helvetica-BoldOblique
%%IncludeResource: font Times-Roman
%%IncludeResource: font Times-Italic
%%IncludeResource: font Times-Bold
%%IncludeResource: font Times-BoldItalic
%%IncludeResource: font Courier
%FOPEndFontDict
%%BeginResource: encoding WinAnsiEncoding
/WinAnsiEncoding [
/.notdef /.notdef /.notdef /.notdef /.notdef
/.notdef /.notdef /.notdef /.notdef /.notdef
/.notdef /.notdef /.notdef /.notdef /.notdef
/.notdef /.notdef /.notdef /.notdef /.notdef
/.notdef /.notdef /.notdef /.notdef /.notdef
/.notdef /.notdef /.notdef /.notdef /.notdef
/.notdef /.notdef /space /exclam /quotedbl
/numbersign /dollar /percent /ampersand /quotesingle
/parenleft /parenright /asterisk /plus /comma
/hyphen /period /slash /zero /one
/two /three /four /five /six
/seven /eight /nine /colon /semicolon
/less /equal /greater /question /at
/A /B /C /D /E
/F /G /H /I /J
/K /L /M /N /O
/P /Q /R /S /T
/U /V /W /X /Y
/Z /bracketleft /backslash /bracketright /asciicircum
/underscore /quoteleft /a /b /c
/d /e /f /g /h
/i /j /k /l /m
/n /o /p /q /r
/s /t /u /v /w
/x /y /z /braceleft /bar
/braceright /asciitilde /bullet /Euro /bullet
/quotesinglbase /florin /quotedblbase /ellipsis /dagger
/daggerdbl /circumflex /perthousand /Scaron /guilsinglleft
/OE /bullet /Zcaron /bullet /bullet
/quoteleft /quoteright /quotedblleft /quotedblright /bullet
/endash /emdash /asciitilde /trademark /scaron
/guilsinglright /oe /bullet /zcaron /Ydieresis
/space /exclamdown /cent /sterling /currency
/yen /brokenbar /section /dieresis /copyright
/ordfeminine /guillemotleft /logicalnot /sfthyphen /registered
/macron /degree /plusminus /twosuperior /threesuperior
/acute /mu /paragraph /middot /cedilla
/onesuperior /ordmasculine /guillemotright /onequarter /onehalf
/threequarters /questiondown /Agrave /Aacute /Acircumflex
/Atilde /Adieresis /Aring /AE /Ccedilla
/Egrave /Eacute /Ecircumflex /Edieresis /Igrave
/Iacute /Icircumflex /Idieresis /Eth /Ntilde
/Ograve /Oacute /Ocircumflex /Otilde /Odieresis
/multiply /Oslash /Ugrave /Uacute /Ucircumflex
/Udieresis /Yacute /Thorn /germandbls /agrave
/aacute /acircumflex /atilde /adieresis /aring
/ae /ccedilla /egrave /eacute /ecircumflex
/edieresis /igrave /iacute /icircumflex /idieresis
/eth /ntilde /ograve /oacute /ocircumflex
/otilde /odieresis /divide /oslash /ugrave
/uacute /ucircumflex /udieresis /yacute /thorn
/ydieresis
] def
%%EndResource
%FOPBeginFontReencode
/Courier-Oblique findfont
dup length dict begin
  {1 index /FID ne {def} {pop pop} ifelse} forall
  /Encoding WinAnsiEncoding def
  currentdict
end
/Courier-Oblique exch definefont pop
/Courier-BoldOblique findfont
dup length dict begin
  {1 index /FID ne {def} {pop pop} ifelse} forall
  /Encoding WinAnsiEncoding def
  currentdict
end
/Courier-BoldOblique exch definefont pop
/Courier-Bold findfont
dup length dict begin
  {1 index /FID ne {def} {pop pop} ifelse} forall
  /Encoding WinAnsiEncoding def
  currentdict
end
/Courier-Bold exch definefont pop
/Helvetica findfont
dup length dict begin
  {1 index /FID ne {def} {pop pop} ifelse} forall
  /Encoding WinAnsiEncoding def
  currentdict
end
/Helvetica exch definefont pop
/Helvetica-Oblique findfont
dup length dict begin
  {1 index /FID ne {def} {pop pop} ifelse} forall
  /Encoding WinAnsiEncoding def
  currentdict
end
/Helvetica-Oblique exch definefont pop
/Helvetica-Bold findfont
dup length dict begin
  {1 index /FID ne {def} {pop pop} ifelse} forall
  /Encoding WinAnsiEncoding def
  currentdict
end
/Helvetica-Bold exch definefont pop
/Helvetica-BoldOblique findfont
dup length dict begin
  {1 index /FID ne {def} {pop pop} ifelse} forall
  /Encoding WinAnsiEncoding def
  currentdict
end
/Helvetica-BoldOblique exch definefont pop
/Times-Roman findfont
dup length dict begin
  {1 index /FID ne {def} {pop pop} ifelse} forall
  /Encoding WinAnsiEncoding def
  currentdict
end
/Times-Roman exch definefont pop
/Times-Italic findfont
dup length dict begin
  {1 index /FID ne {def} {pop pop} ifelse} forall
  /Encoding WinAnsiEncoding def
  currentdict
end
/Times-Italic exch definefont pop
/Times-Bold findfont
dup length dict begin
  {1 index /FID ne {def} {pop pop} ifelse} forall
  /Encoding WinAnsiEncoding def
  currentdict
end
/Times-Bold exch definefont pop
/Times-BoldItalic findfont
dup length dict begin
  {1 index /FID ne {def} {pop pop} ifelse} forall
  /Encoding WinAnsiEncoding def
  currentdict
end
/Times-BoldItalic exch definefont pop
/Courier findfont
dup length dict begin
  {1 index /FID ne {def} {pop pop} ifelse} forall
  /Encoding WinAnsiEncoding def
  currentdict
end
/Courier exch definefont pop
%FOPEndFontReencode
%%EndProlog
%%Page: 1 1
%%PageBoundingBox: 0 0 1280 432
%%BeginPageSetup
[1 0 0 -1 0 432] CT
%%EndPageSetup
GS
1 GC
N
0 0 1280 432 re
f
GR
GS
1 GC
N
0 0 1280 432 re
f
GR
GS
1 GC
N
166.5 177.5 M
367 177.5 L
367 32.5 L
166.5 32.5 L
cp
f
GR
GS
0.149 GC
2 setlinecap
1 LJ
0.5 LW
N
166.5 177.5 M
367 177.5 L
S
GR
GS
0.149 GC
2 setlinecap
1 LJ
0.5 LW
N
166.5 177.5 M
166.5 175.495 L
S
GR
GS
0.149 GC
2 setlinecap
1 LJ
0.5 LW
N
244.213 177.5 M
244.213 175.495 L
S
GR
GS
0.149 GC
2 setlinecap
1 LJ
0.5 LW
N
321.926 177.5 M
321.926 175.495 L
S
GR
GS
[1 0 0 1 166.5 183.09998] CT
0.149 GC
/Helvetica 18 F
GS
[1 0 0 1 0 0] CT
-5.5 18 moveto 
1 -1 scale
(0) t 
GR
GR
GS
[1 0 0 1 244.21318 183.09998] CT
0.149 GC
/Helvetica 18 F
GS
[1 0 0 1 0 0] CT
-5.5 18 moveto 
1 -1 scale
(5) t 
GR
GR
GS
[1 0 0 1 321.92636 183.09998] CT
0.149 GC
/Helvetica 18 F
GS
[1 0 0 1 0 0] CT
-10.5 18 moveto 
1 -1 scale
(10) t 
GR
GR
GS
0.149 GC
2 setlinecap
1 LJ
0.5 LW
N
166.5 177.5 M
166.5 32.5 L
S
GR
GS
0.149 GC
2 setlinecap
1 LJ
0.5 LW
N
166.5 177.5 M
168.505 177.5 L
S
GR
GS
0.149 GC
2 setlinecap
1 LJ
0.5 LW
N
166.5 136.071 M
168.505 136.071 L
S
GR
GS
0.149 GC
2 setlinecap
1 LJ
0.5 LW
N
166.5 94.643 M
168.505 94.643 L
S
GR
GS
0.149 GC
2 setlinecap
1 LJ
0.5 LW
N
166.5 53.214 M
168.505 53.214 L
S
GR
GS
[1 0 0 1 160.89999 177.5] CT
0.149 GC
/Helvetica 18 F
GS
[1 0 0 1 0 0] CT
-21 7 moveto 
1 -1 scale
(48) t 
GR
GR
GS
[1 0 0 1 160.89999 136.07143] CT
0.149 GC
/Helvetica 18 F
GS
[1 0 0 1 0 0] CT
-21 7 moveto 
1 -1 scale
(50) t 
GR
GR
GS
[1 0 0 1 160.89999 94.64286] CT
0.149 GC
/Helvetica 18 F
GS
[1 0 0 1 0 0] CT
-21 7 moveto 
1 -1 scale
(52) t 
GR
GR
GS
[1 0 0 1 160.89999 53.21429] CT
0.149 GC
/Helvetica 18 F
GS
[1 0 0 1 0 0] CT
-21 7 moveto 
1 -1 scale
(54) t 
GR
GR
GS
[0 -1 1 0 137.39999 104.99992] CT
0.149 GC
/Helvetica 18 F
GS
[1 0 0 1 0 0] CT
-94.5 -4 moveto 
1 -1 scale
(Decoding accuracy \(%\)) t 
GR
GR
GS
[1 0 0 1 266.75024 30.25002] CT
/Helvetica-Bold 18 F
GS
[1 0 0 1 0 0] CT
-22 -4 moveto 
1 -1 scale
(color) t 
GR
GR
GS
1 GC
N
203.802 177.517 M
244.213 177.517 L
244.213 32.483 L
209.243 32.483 L
166.5 32.483 L
166.5 177.517 L
cp
f
GR
GS
0.902 GC
N
266.594 177.517 M
290.841 177.517 L
290.841 32.483 L
269.859 32.483 L
244.213 32.483 L
244.213 177.517 L
cp
f
GR
GS
1 GC
N
327.397 177.517 M
367 177.517 L
367 32.483 L
332.729 32.483 L
290.841 32.483 L
290.841 177.517 L
cp
f
GR
GS
[8 8] 0 setdash
2 LJ
2 LW
N
166.5 136.071 M
367 136.071 L
S
GR
GS
1 0 0 RC
1 LJ
2 LW
N
236.675 146.429 M
246.7 146.429 L
256.725 146.429 L
266.75 146.429 L
276.775 146.429 L
286.8 146.429 L
296.825 146.429 L
306.85 146.429 L
316.875 146.429 L
326.9 146.429 L
S
GR
GS
0.948 0.749 0.781 RC
N
186.55 151.273 M
196.575 142.357 L
206.6 155.723 L
216.625 147.577 L
226.65 134.878 L
236.675 118.549 L
246.7 120.575 L
256.725 99.626 L
266.75 96.08 L
276.775 97.939 L
286.8 106.804 L
296.825 97.144 L
306.85 100.01 L
316.875 114.096 L
326.9 121.695 L
336.925 130.004 L
346.95 127.415 L
356.975 132.576 L
367 134.539 L
367 115.131 L
356.975 114.363 L
346.95 108.745 L
336.925 112.492 L
326.9 103.882 L
316.875 92.938 L
306.85 79.584 L
296.825 75.574 L
286.8 85.055 L
276.775 74.657 L
266.75 70.996 L
256.725 75.292 L
246.7 93.937 L
236.675 96.306 L
226.65 115.271 L
216.625 128.982 L
206.6 136.752 L
196.575 122.838 L
186.55 132.056 L
176.525 125.564 L
166.5 127.074 L
166.5 148.606 L
176.525 147.475 L
cp
f
GR
GS
0.906 0.549 0.608 RC
1 LJ
0.5 LW
N
166.5 148.606 M
176.525 147.475 L
186.55 151.273 L
196.575 142.357 L
206.6 155.723 L
216.625 147.577 L
226.65 134.878 L
236.675 118.549 L
246.7 120.575 L
256.725 99.626 L
266.75 96.08 L
276.775 97.939 L
286.8 106.804 L
296.825 97.144 L
306.85 100.01 L
316.875 114.096 L
326.9 121.695 L
336.925 130.004 L
346.95 127.415 L
356.975 132.576 L
367 134.539 L
S
GR
GS
0.906 0.549 0.608 RC
1 LJ
0.5 LW
N
166.5 127.074 M
176.525 125.564 L
186.55 132.056 L
196.575 122.838 L
206.6 136.752 L
216.625 128.982 L
226.65 115.271 L
236.675 96.306 L
246.7 93.937 L
256.725 75.292 L
266.75 70.996 L
276.775 74.657 L
286.8 85.055 L
296.825 75.574 L
306.85 79.584 L
316.875 92.938 L
326.9 103.882 L
336.925 112.492 L
346.95 108.745 L
356.975 114.363 L
367 115.131 L
S
GR
GS
0.792 0 0.125 RC
1 LJ
2 LW
N
166.5 137.84 M
176.525 136.52 L
186.55 141.664 L
196.575 132.597 L
206.6 146.238 L
216.625 138.28 L
226.65 125.075 L
236.675 107.427 L
246.7 107.256 L
256.725 87.459 L
266.75 83.538 L
276.775 86.298 L
286.8 95.93 L
296.825 86.359 L
306.85 89.797 L
316.875 103.517 L
326.9 112.788 L
336.925 121.248 L
346.95 118.08 L
356.975 123.47 L
367 124.835 L
S
GR
GS
0.849 GC
N
246.7 116.131 M
236.675 118.86 L
226.65 102.08 L
216.625 126.165 L
206.6 109.002 L
196.575 107.796 L
186.55 109.947 L
176.525 118.856 L
166.5 128.685 L
166.5 145.468 L
176.525 137.169 L
186.55 127.357 L
196.575 126.086 L
206.6 128.08 L
216.625 148.328 L
226.65 121.787 L
236.675 138.716 L
246.7 136.582 L
256.725 132.485 L
266.75 136.427 L
276.775 134.288 L
286.8 137.955 L
296.825 134.739 L
306.85 125.123 L
316.875 138.696 L
326.9 133.445 L
336.925 125.016 L
346.95 141.525 L
356.975 145.951 L
367 139.83 L
367 121.493 L
356.975 128.034 L
346.95 118.771 L
336.925 100.728 L
326.9 113.64 L
316.875 113.808 L
306.85 106.091 L
296.825 114.658 L
286.8 115.99 L
276.775 112.294 L
266.75 116.742 L
256.725 109.71 L
cp
f
GR
GS
0.729 GC
1 LJ
0.5 LW
N
166.5 145.468 M
176.525 137.169 L
186.55 127.357 L
196.575 126.086 L
206.6 128.08 L
216.625 148.328 L
226.65 121.787 L
236.675 138.716 L
246.7 136.582 L
256.725 132.485 L
266.75 136.427 L
276.775 134.288 L
286.8 137.955 L
296.825 134.739 L
306.85 125.123 L
316.875 138.696 L
326.9 133.445 L
336.925 125.016 L
346.95 141.525 L
356.975 145.951 L
367 139.83 L
S
GR
GS
0.729 GC
1 LJ
0.5 LW
N
166.5 128.685 M
176.525 118.856 L
186.55 109.947 L
196.575 107.796 L
206.6 109.002 L
216.625 126.165 L
226.65 102.08 L
236.675 118.86 L
246.7 116.131 L
256.725 109.71 L
266.75 116.742 L
276.775 112.294 L
286.8 115.99 L
296.825 114.658 L
306.85 106.091 L
316.875 113.808 L
326.9 113.64 L
336.925 100.728 L
346.95 118.771 L
356.975 128.034 L
367 121.493 L
S
GR
GS
0.4 GC
[10 6] 0 setdash
2 LJ
N
166.5 137.077 M
176.525 128.012 L
186.55 118.652 L
196.575 116.941 L
206.6 118.541 L
216.625 137.246 L
226.65 111.934 L
236.675 128.788 L
246.7 126.356 L
256.725 121.097 L
266.75 126.584 L
276.775 123.291 L
286.8 126.973 L
296.825 124.699 L
306.85 115.607 L
316.875 126.252 L
326.9 123.543 L
336.925 112.872 L
346.95 130.148 L
356.975 136.993 L
367 130.662 L
S
GR
GS
1 GC
N
430 177.5 M
630.5 177.5 L
630.5 32.5 L
430 32.5 L
cp
f
GR
GS
0.149 GC
2 setlinecap
1 LJ
0.5 LW
N
430 177.5 M
630.5 177.5 L
S
GR
GS
0.149 GC
2 setlinecap
1 LJ
0.5 LW
N
430 177.5 M
430 175.495 L
S
GR
GS
0.149 GC
2 setlinecap
1 LJ
0.5 LW
N
507.713 177.5 M
507.713 175.495 L
S
GR
GS
0.149 GC
2 setlinecap
1 LJ
0.5 LW
N
585.426 177.5 M
585.426 175.495 L
S
GR
GS
[1 0 0 1 430 183.09998] CT
0.149 GC
/Helvetica 18 F
GS
[1 0 0 1 0 0] CT
-5.5 18 moveto 
1 -1 scale
(0) t 
GR
GR
GS
[1 0 0 1 507.71317 183.09998] CT
0.149 GC
/Helvetica 18 F
GS
[1 0 0 1 0 0] CT
-5.5 18 moveto 
1 -1 scale
(5) t 
GR
GR
GS
[1 0 0 1 585.42633 183.09998] CT
0.149 GC
/Helvetica 18 F
GS
[1 0 0 1 0 0] CT
-10.5 18 moveto 
1 -1 scale
(10) t 
GR
GR
GS
0.149 GC
2 setlinecap
1 LJ
0.5 LW
N
430 177.5 M
430 32.5 L
S
GR
GS
0.149 GC
2 setlinecap
1 LJ
0.5 LW
N
430 177.5 M
432.005 177.5 L
S
GR
GS
0.149 GC
2 setlinecap
1 LJ
0.5 LW
N
430 136.071 M
432.005 136.071 L
S
GR
GS
0.149 GC
2 setlinecap
1 LJ
0.5 LW
N
430 94.643 M
432.005 94.643 L
S
GR
GS
0.149 GC
2 setlinecap
1 LJ
0.5 LW
N
430 53.214 M
432.005 53.214 L
S
GR
GS
[1 0 0 1 424.39999 177.5] CT
0.149 GC
/Helvetica 18 F
GS
[1 0 0 1 0 0] CT
-21 7 moveto 
1 -1 scale
(48) t 
GR
GR
GS
[1 0 0 1 424.39999 136.07143] CT
0.149 GC
/Helvetica 18 F
GS
[1 0 0 1 0 0] CT
-21 7 moveto 
1 -1 scale
(50) t 
GR
GR
GS
[1 0 0 1 424.39999 94.64286] CT
0.149 GC
/Helvetica 18 F
GS
[1 0 0 1 0 0] CT
-21 7 moveto 
1 -1 scale
(52) t 
GR
GR
GS
[1 0 0 1 424.39999 53.21429] CT
0.149 GC
/Helvetica 18 F
GS
[1 0 0 1 0 0] CT
-21 7 moveto 
1 -1 scale
(54) t 
GR
GR
GS
[0 -1 1 0 400.89999 104.99992] CT
0.149 GC
/Helvetica 18 F
GS
[1 0 0 1 0 0] CT
-94.5 -4 moveto 
1 -1 scale
(Decoding accuracy \(%\)) t 
GR
GR
GS
[1 0 0 1 530.25049 30.25002] CT
/Helvetica-Bold 18 F
GS
[1 0 0 1 0 0] CT
-30 -4 moveto 
1 -1 scale
(motion) t 
GR
GR
GS
1 GC
N
467.302 177.517 M
507.713 177.517 L
507.713 32.483 L
472.743 32.483 L
430 32.483 L
430 177.517 L
cp
f
GR
GS
0.902 GC
N
530.094 177.517 M
554.341 177.517 L
554.341 32.483 L
533.359 32.483 L
507.713 32.483 L
507.713 177.517 L
cp
f
GR
GS
1 GC
N
590.897 177.517 M
630.5 177.517 L
630.5 32.483 L
596.229 32.483 L
554.341 32.483 L
554.341 177.517 L
cp
f
GR
GS
[8 8] 0 setdash
2 LJ
2 LW
N
430 136.071 M
630.5 136.071 L
S
GR
GS
1 0 0 RC
1 LJ
2 LW
N
520.225 146.429 M
530.25 146.429 L
540.275 146.429 L
550.3 146.429 L
560.325 146.429 L
570.35 146.429 L
580.375 146.429 L
590.4 146.429 L
S
GR
GS
1 LJ
2 LW
N
500.175 156.786 M
510.2 156.786 L
520.225 156.786 L
530.25 156.786 L
540.275 156.786 L
550.3 156.786 L
560.325 156.786 L
570.35 156.786 L
S
GR
GS
0.948 0.749 0.781 RC
N
450.05 113.432 M
440.025 133.517 L
430 119.685 L
430 138.117 L
440.025 147.745 L
450.05 130.205 L
460.075 135.745 L
470.1 139.424 L
480.125 142.967 L
490.15 122.33 L
500.175 119.788 L
510.2 126.814 L
520.225 105.898 L
530.25 99.71 L
540.275 82.593 L
550.3 90.325 L
560.325 104.343 L
570.35 95.849 L
580.375 102.572 L
590.4 115.369 L
600.425 130.723 L
610.45 134.036 L
620.475 137.213 L
630.5 135.423 L
630.5 119.593 L
620.475 120.677 L
610.45 118.927 L
600.425 109.402 L
590.4 94.412 L
580.375 80.676 L
570.35 72.085 L
560.325 79.602 L
550.3 68.916 L
540.275 58.729 L
530.25 72.118 L
520.225 81.053 L
510.2 106.008 L
500.175 100.714 L
490.15 101.514 L
480.125 126.265 L
470.1 119.95 L
460.075 115.206 L
cp
f
GR
GS
0.906 0.549 0.608 RC
1 LJ
0.5 LW
N
430 138.117 M
440.025 147.745 L
450.05 130.205 L
460.075 135.745 L
470.1 139.424 L
480.125 142.967 L
490.15 122.33 L
500.175 119.788 L
510.2 126.814 L
520.225 105.898 L
530.25 99.71 L
540.275 82.593 L
550.3 90.325 L
560.325 104.343 L
570.35 95.849 L
580.375 102.572 L
590.4 115.369 L
600.425 130.723 L
610.45 134.036 L
620.475 137.213 L
630.5 135.423 L
S
GR
GS
0.906 0.549 0.608 RC
1 LJ
0.5 LW
N
430 119.685 M
440.025 133.517 L
450.05 113.432 L
460.075 115.206 L
470.1 119.95 L
480.125 126.265 L
490.15 101.514 L
500.175 100.714 L
510.2 106.008 L
520.225 81.053 L
530.25 72.118 L
540.275 58.729 L
550.3 68.916 L
560.325 79.602 L
570.35 72.085 L
580.375 80.676 L
590.4 94.412 L
600.425 109.402 L
610.45 118.927 L
620.475 120.677 L
630.5 119.593 L
S
GR
GS
0.792 0 0.125 RC
1 LJ
2 LW
N
430 128.901 M
440.025 140.631 L
450.05 121.819 L
460.075 125.475 L
470.1 129.687 L
480.125 134.616 L
490.15 111.922 L
500.175 110.251 L
510.2 116.411 L
520.225 93.475 L
530.25 85.914 L
540.275 70.661 L
550.3 79.62 L
560.325 91.973 L
570.35 83.967 L
580.375 91.624 L
590.4 104.891 L
600.425 120.062 L
610.45 126.482 L
620.475 128.945 L
630.5 127.508 L
S
GR
GS
0.849 GC
N
480.125 136.449 M
490.15 126.006 L
500.175 109.774 L
510.2 106.841 L
520.225 122.911 L
530.25 107.497 L
540.275 102.792 L
550.3 111.318 L
560.325 117.404 L
570.35 121.332 L
580.375 144 L
590.4 148.571 L
600.425 135.953 L
610.45 138.154 L
620.475 146.71 L
630.5 156.801 L
630.5 139.499 L
620.475 127.769 L
610.45 121.156 L
600.425 122.479 L
590.4 128.562 L
580.375 123.037 L
570.35 101.042 L
560.325 97.692 L
550.3 91.777 L
540.275 77.404 L
530.25 86.919 L
520.225 103.094 L
510.2 84.517 L
500.175 84.023 L
490.15 104.948 L
480.125 116.857 L
470.1 116.162 L
460.075 118.747 L
450.05 117.295 L
440.025 127.31 L
430 131.341 L
430 152.597 L
440.025 149.155 L
450.05 138.884 L
460.075 140.192 L
470.1 136.219 L
cp
f
GR
GS
0.729 GC
1 LJ
0.5 LW
N
430 152.597 M
440.025 149.155 L
450.05 138.884 L
460.075 140.192 L
470.1 136.219 L
480.125 136.449 L
490.15 126.006 L
500.175 109.774 L
510.2 106.841 L
520.225 122.911 L
530.25 107.497 L
540.275 102.792 L
550.3 111.318 L
560.325 117.404 L
570.35 121.332 L
580.375 144 L
590.4 148.571 L
600.425 135.953 L
610.45 138.154 L
620.475 146.71 L
630.5 156.801 L
S
GR
GS
0.729 GC
1 LJ
0.5 LW
N
430 131.341 M
440.025 127.31 L
450.05 117.295 L
460.075 118.747 L
470.1 116.162 L
480.125 116.857 L
490.15 104.948 L
500.175 84.023 L
510.2 84.517 L
520.225 103.094 L
530.25 86.919 L
540.275 77.404 L
550.3 91.777 L
560.325 97.692 L
570.35 101.042 L
580.375 123.037 L
590.4 128.562 L
600.425 122.479 L
610.45 121.156 L
620.475 127.769 L
630.5 139.499 L
S
GR
GS
0.4 GC
[10 6] 0 setdash
2 LJ
N
430 141.969 M
440.025 138.233 L
450.05 128.09 L
460.075 129.47 L
470.1 126.19 L
480.125 126.653 L
490.15 115.477 L
500.175 96.898 L
510.2 95.679 L
520.225 113.002 L
530.25 97.208 L
540.275 90.098 L
550.3 101.548 L
560.325 107.548 L
570.35 111.187 L
580.375 133.518 L
590.4 138.567 L
600.425 129.216 L
610.45 129.655 L
620.475 137.239 L
630.5 148.15 L
S
GR
GS
1 GC
N
694 177.5 M
894.5 177.5 L
894.5 32.5 L
694 32.5 L
cp
f
GR
GS
0.149 GC
2 setlinecap
1 LJ
0.5 LW
N
694 177.5 M
894.5 177.5 L
S
GR
GS
0.149 GC
2 setlinecap
1 LJ
0.5 LW
N
694 177.5 M
694 175.495 L
S
GR
GS
0.149 GC
2 setlinecap
1 LJ
0.5 LW
N
771.713 177.5 M
771.713 175.495 L
S
GR
GS
0.149 GC
2 setlinecap
1 LJ
0.5 LW
N
849.426 177.5 M
849.426 175.495 L
S
GR
GS
[1 0 0 1 694 183.09998] CT
0.149 GC
/Helvetica 18 F
GS
[1 0 0 1 0 0] CT
-5.5 18 moveto 
1 -1 scale
(0) t 
GR
GR
GS
[1 0 0 1 771.7132 183.09998] CT
0.149 GC
/Helvetica 18 F
GS
[1 0 0 1 0 0] CT
-5.5 18 moveto 
1 -1 scale
(5) t 
GR
GR
GS
[1 0 0 1 849.42633 183.09998] CT
0.149 GC
/Helvetica 18 F
GS
[1 0 0 1 0 0] CT
-10.5 18 moveto 
1 -1 scale
(10) t 
GR
GR
GS
0.149 GC
2 setlinecap
1 LJ
0.5 LW
N
694 177.5 M
694 32.5 L
S
GR
GS
0.149 GC
2 setlinecap
1 LJ
0.5 LW
N
694 177.5 M
696.005 177.5 L
S
GR
GS
0.149 GC
2 setlinecap
1 LJ
0.5 LW
N
694 136.071 M
696.005 136.071 L
S
GR
GS
0.149 GC
2 setlinecap
1 LJ
0.5 LW
N
694 94.643 M
696.005 94.643 L
S
GR
GS
0.149 GC
2 setlinecap
1 LJ
0.5 LW
N
694 53.214 M
696.005 53.214 L
S
GR
GS
[1 0 0 1 688.40002 177.5] CT
0.149 GC
/Helvetica 18 F
GS
[1 0 0 1 0 0] CT
-21 7 moveto 
1 -1 scale
(48) t 
GR
GR
GS
[1 0 0 1 688.40002 136.07143] CT
0.149 GC
/Helvetica 18 F
GS
[1 0 0 1 0 0] CT
-21 7 moveto 
1 -1 scale
(50) t 
GR
GR
GS
[1 0 0 1 688.40002 94.64286] CT
0.149 GC
/Helvetica 18 F
GS
[1 0 0 1 0 0] CT
-21 7 moveto 
1 -1 scale
(52) t 
GR
GR
GS
[1 0 0 1 688.40002 53.21429] CT
0.149 GC
/Helvetica 18 F
GS
[1 0 0 1 0 0] CT
-21 7 moveto 
1 -1 scale
(54) t 
GR
GR
GS
[0 -1 1 0 664.90002 104.99992] CT
0.149 GC
/Helvetica 18 F
GS
[1 0 0 1 0 0] CT
-94.5 -4 moveto 
1 -1 scale
(Decoding accuracy \(%\)) t 
GR
GR
GS
[1 0 0 1 794.25073 30.25002] CT
/Helvetica-Bold 18 F
GS
[1 0 0 1 0 0] CT
-17 -4 moveto 
1 -1 scale
(size) t 
GR
GR
GS
1 GC
N
731.302 177.517 M
771.713 177.517 L
771.713 32.483 L
736.743 32.483 L
694 32.483 L
694 177.517 L
cp
f
GR
GS
0.902 GC
N
794.094 177.517 M
818.341 177.517 L
818.341 32.483 L
797.359 32.483 L
771.713 32.483 L
771.713 177.517 L
cp
f
GR
GS
1 GC
N
854.897 177.517 M
894.5 177.517 L
894.5 32.483 L
860.229 32.483 L
818.341 32.483 L
818.341 177.517 L
cp
f
GR
GS
[8 8] 0 setdash
2 LJ
2 LW
N
694 136.071 M
894.5 136.071 L
S
GR
GS
1 0 0 RC
1 LJ
2 LW
N
804.275 146.429 M
814.3 146.429 L
824.325 146.429 L
834.35 146.429 L
844.375 146.429 L
S
GR
GS
0.948 0.749 0.781 RC
N
744.125 133.858 M
734.1 127.502 L
724.075 129.443 L
714.05 126.446 L
704.025 120.113 L
694 108.039 L
694 126.645 L
704.025 139.805 L
714.05 143.531 L
724.075 146.301 L
734.1 143.757 L
744.125 148.757 L
754.15 140.439 L
764.175 131.388 L
774.2 124.788 L
784.225 117.912 L
794.25 138.523 L
804.275 126.937 L
814.3 119.341 L
824.325 114.389 L
834.35 104.802 L
844.375 123.391 L
854.4 127.653 L
864.425 128.744 L
874.45 142.175 L
884.475 149.63 L
894.5 156.041 L
894.5 138.654 L
884.475 132.08 L
874.45 125.014 L
864.425 112.14 L
854.4 109.415 L
844.375 106.743 L
834.35 86.774 L
824.325 94.523 L
814.3 100.865 L
804.275 109.813 L
794.25 116.775 L
784.225 99.252 L
774.2 102.557 L
764.175 116.024 L
754.15 123.627 L
cp
f
GR
GS
0.906 0.549 0.608 RC
1 LJ
0.5 LW
N
694 126.645 M
704.025 139.805 L
714.05 143.531 L
724.075 146.301 L
734.1 143.757 L
744.125 148.757 L
754.15 140.439 L
764.175 131.388 L
774.2 124.788 L
784.225 117.912 L
794.25 138.523 L
804.275 126.937 L
814.3 119.341 L
824.325 114.389 L
834.35 104.802 L
844.375 123.391 L
854.4 127.653 L
864.425 128.744 L
874.45 142.175 L
884.475 149.63 L
894.5 156.041 L
S
GR
GS
0.906 0.549 0.608 RC
1 LJ
0.5 LW
N
694 108.039 M
704.025 120.113 L
714.05 126.446 L
724.075 129.443 L
734.1 127.502 L
744.125 133.858 L
754.15 123.627 L
764.175 116.024 L
774.2 102.557 L
784.225 99.252 L
794.25 116.775 L
804.275 109.813 L
814.3 100.865 L
824.325 94.523 L
834.35 86.774 L
844.375 106.743 L
854.4 109.415 L
864.425 112.14 L
874.45 125.014 L
884.475 132.08 L
894.5 138.654 L
S
GR
GS
0.792 0 0.125 RC
1 LJ
2 LW
N
694 117.342 M
704.025 129.959 L
714.05 134.989 L
724.075 137.872 L
734.1 135.63 L
744.125 141.308 L
754.15 132.033 L
764.175 123.706 L
774.2 113.673 L
784.225 108.582 L
794.25 127.649 L
804.275 118.375 L
814.3 110.103 L
824.325 104.456 L
834.35 95.788 L
844.375 115.067 L
854.4 118.534 L
864.425 120.442 L
874.45 133.595 L
884.475 140.855 L
894.5 147.348 L
S
GR
GS
0.849 GC
N
734.1 155.799 M
744.125 144.593 L
754.15 139.016 L
764.175 131.116 L
774.2 136.801 L
784.225 150.356 L
794.25 132.036 L
804.275 138.045 L
814.3 126.772 L
824.325 141.801 L
834.35 127.328 L
844.375 136.808 L
854.4 142.164 L
864.425 131.493 L
874.45 133.171 L
884.475 130.322 L
894.5 130.756 L
894.5 116.943 L
884.475 111.629 L
874.45 116.881 L
864.425 116.788 L
854.4 124.731 L
844.375 114.966 L
834.35 105.188 L
824.325 121.824 L
814.3 107.508 L
804.275 120.658 L
794.25 114.43 L
784.225 130.366 L
774.2 118.744 L
764.175 109.274 L
754.15 123.341 L
744.125 126.595 L
734.1 139.301 L
724.075 119.859 L
714.05 125.419 L
704.025 140.28 L
694 145.911 L
694 167.841 L
704.025 161.157 L
714.05 143.097 L
724.075 134.07 L
cp
f
GR
GS
0.729 GC
1 LJ
0.5 LW
N
694 167.841 M
704.025 161.157 L
714.05 143.097 L
724.075 134.07 L
734.1 155.799 L
744.125 144.593 L
754.15 139.016 L
764.175 131.116 L
774.2 136.801 L
784.225 150.356 L
794.25 132.036 L
804.275 138.045 L
814.3 126.772 L
824.325 141.801 L
834.35 127.328 L
844.375 136.808 L
854.4 142.164 L
864.425 131.493 L
874.45 133.171 L
884.475 130.322 L
894.5 130.756 L
S
GR
GS
0.729 GC
1 LJ
0.5 LW
N
694 145.911 M
704.025 140.28 L
714.05 125.419 L
724.075 119.859 L
734.1 139.301 L
744.125 126.595 L
754.15 123.341 L
764.175 109.274 L
774.2 118.744 L
784.225 130.366 L
794.25 114.43 L
804.275 120.658 L
814.3 107.508 L
824.325 121.824 L
834.35 105.188 L
844.375 114.966 L
854.4 124.731 L
864.425 116.788 L
874.45 116.881 L
884.475 111.629 L
894.5 116.943 L
S
GR
GS
0.4 GC
[10 6] 0 setdash
2 LJ
N
694 156.877 M
704.025 150.718 L
714.05 134.258 L
724.075 126.964 L
734.1 147.55 L
744.125 135.594 L
754.15 131.179 L
764.175 120.195 L
774.2 127.773 L
784.225 140.361 L
794.25 123.233 L
804.275 129.352 L
814.3 117.14 L
824.325 131.812 L
834.35 116.258 L
844.375 125.887 L
854.4 133.448 L
864.425 124.14 L
874.45 125.026 L
884.475 120.976 L
894.5 123.849 L
S
GR
GS
1 GC
N
958 177.5 M
1158.5 177.5 L
1158.5 32.5 L
958 32.5 L
cp
f
GR
GS
0.149 GC
2 setlinecap
1 LJ
0.5 LW
N
958 177.5 M
1158.5 177.5 L
S
GR
GS
0.149 GC
2 setlinecap
1 LJ
0.5 LW
N
958 177.5 M
958 175.495 L
S
GR
GS
0.149 GC
2 setlinecap
1 LJ
0.5 LW
N
1035.713 177.5 M
1035.713 175.495 L
S
GR
GS
0.149 GC
2 setlinecap
1 LJ
0.5 LW
N
1113.426 177.5 M
1113.426 175.495 L
S
GR
GS
[1 0 0 1 958 183.09998] CT
0.149 GC
/Helvetica 18 F
GS
[1 0 0 1 0 0] CT
-5.5 18 moveto 
1 -1 scale
(0) t 
GR
GR
GS
[1 0 0 1 1035.71313 183.09998] CT
0.149 GC
/Helvetica 18 F
GS
[1 0 0 1 0 0] CT
-5.5 18 moveto 
1 -1 scale
(5) t 
GR
GR
GS
[1 0 0 1 1113.42639 183.09998] CT
0.149 GC
/Helvetica 18 F
GS
[1 0 0 1 0 0] CT
-10.5 18 moveto 
1 -1 scale
(10) t 
GR
GR
GS
0.149 GC
2 setlinecap
1 LJ
0.5 LW
N
958 177.5 M
958 32.5 L
S
GR
GS
0.149 GC
2 setlinecap
1 LJ
0.5 LW
N
958 177.5 M
960.005 177.5 L
S
GR
GS
0.149 GC
2 setlinecap
1 LJ
0.5 LW
N
958 136.071 M
960.005 136.071 L
S
GR
GS
0.149 GC
2 setlinecap
1 LJ
0.5 LW
N
958 94.643 M
960.005 94.643 L
S
GR
GS
0.149 GC
2 setlinecap
1 LJ
0.5 LW
N
958 53.214 M
960.005 53.214 L
S
GR
GS
[1 0 0 1 952.40002 177.5] CT
0.149 GC
/Helvetica 18 F
GS
[1 0 0 1 0 0] CT
-21 7 moveto 
1 -1 scale
(48) t 
GR
GR
GS
[1 0 0 1 952.40002 136.07143] CT
0.149 GC
/Helvetica 18 F
GS
[1 0 0 1 0 0] CT
-21 7 moveto 
1 -1 scale
(50) t 
GR
GR
GS
[1 0 0 1 952.40002 94.64286] CT
0.149 GC
/Helvetica 18 F
GS
[1 0 0 1 0 0] CT
-21 7 moveto 
1 -1 scale
(52) t 
GR
GR
GS
[1 0 0 1 952.40002 53.21429] CT
0.149 GC
/Helvetica 18 F
GS
[1 0 0 1 0 0] CT
-21 7 moveto 
1 -1 scale
(54) t 
GR
GR
GS
[0 -1 1 0 928.90002 104.99992] CT
0.149 GC
/Helvetica 18 F
GS
[1 0 0 1 0 0] CT
-94.5 -4 moveto 
1 -1 scale
(Decoding accuracy \(%\)) t 
GR
GR
GS
[1 0 0 1 1058.25098 30.25002] CT
/Helvetica-Bold 18 F
GS
[1 0 0 1 0 0] CT
-44.5 -4 moveto 
1 -1 scale
(luminance) t 
GR
GR
GS
1 GC
N
995.302 177.517 M
1035.713 177.517 L
1035.713 32.483 L
1000.743 32.483 L
958 32.483 L
958 177.517 L
cp
f
GR
GS
0.902 GC
N
1058.094 177.517 M
1082.341 177.517 L
1082.341 32.483 L
1061.359 32.483 L
1035.713 32.483 L
1035.713 177.517 L
cp
f
GR
GS
1 GC
N
1118.897 177.517 M
1158.5 177.517 L
1158.5 32.483 L
1124.229 32.483 L
1082.341 32.483 L
1082.341 177.517 L
cp
f
GR
GS
[8 8] 0 setdash
2 LJ
2 LW
N
958 136.071 M
1158.5 136.071 L
S
GR
GS
0.948 0.749 0.781 RC
N
978.05 136.718 M
988.075 139.396 L
998.1 129.45 L
1008.125 117.828 L
1018.15 129.814 L
1028.175 128.792 L
1038.2 132.699 L
1048.225 147.169 L
1058.25 143.484 L
1068.275 135.402 L
1078.3 138.424 L
1088.325 118.801 L
1098.35 128.828 L
1108.375 117.067 L
1118.4 135.909 L
1128.425 123.723 L
1138.45 132 L
1148.475 124.933 L
1158.5 127.765 L
1158.5 112.355 L
1148.475 106.96 L
1138.45 109.326 L
1128.425 102.967 L
1118.4 114.97 L
1108.375 96.323 L
1098.35 107.209 L
1088.325 99.644 L
1078.3 115.924 L
1068.275 113.929 L
1058.25 125.281 L
1048.225 130.004 L
1038.2 107.617 L
1028.175 110.171 L
1018.15 110.95 L
1008.125 96.961 L
998.1 107.493 L
988.075 115.073 L
978.05 118.999 L
968.025 122.643 L
958 122.219 L
958 140.334 L
968.025 142.176 L
cp
f
GR
GS
0.906 0.549 0.608 RC
1 LJ
0.5 LW
N
958 140.334 M
968.025 142.176 L
978.05 136.718 L
988.075 139.396 L
998.1 129.45 L
1008.125 117.828 L
1018.15 129.814 L
1028.175 128.792 L
1038.2 132.699 L
1048.225 147.169 L
1058.25 143.484 L
1068.275 135.402 L
1078.3 138.424 L
1088.325 118.801 L
1098.35 128.828 L
1108.375 117.067 L
1118.4 135.909 L
1128.425 123.723 L
1138.45 132 L
1148.475 124.933 L
1158.5 127.765 L
S
GR
GS
0.906 0.549 0.608 RC
1 LJ
0.5 LW
N
958 122.219 M
968.025 122.643 L
978.05 118.999 L
988.075 115.073 L
998.1 107.493 L
1008.125 96.961 L
1018.15 110.95 L
1028.175 110.171 L
1038.2 107.617 L
1048.225 130.004 L
1058.25 125.281 L
1068.275 113.929 L
1078.3 115.924 L
1088.325 99.644 L
1098.35 107.209 L
1108.375 96.323 L
1118.4 114.97 L
1128.425 102.967 L
1138.45 109.326 L
1148.475 106.96 L
1158.5 112.355 L
S
GR
GS
0.792 0 0.125 RC
1 LJ
2 LW
N
958 131.277 M
968.025 132.41 L
978.05 127.859 L
988.075 127.235 L
998.1 118.472 L
1008.125 107.395 L
1018.15 120.382 L
1028.175 119.481 L
1038.2 120.158 L
1048.225 138.587 L
1058.25 134.382 L
1068.275 124.666 L
1078.3 127.174 L
1088.325 109.222 L
1098.35 118.018 L
1108.375 106.695 L
1118.4 125.439 L
1128.425 113.345 L
1138.45 120.663 L
1148.475 115.947 L
1158.5 120.06 L
S
GR
GS
0.849 GC
N
1048.225 125.311 M
1038.2 139.285 L
1028.175 126.514 L
1018.15 143.463 L
1008.125 129.642 L
998.1 130.23 L
988.075 130.271 L
978.05 131.47 L
968.025 113.632 L
958 122.889 L
958 142.086 L
968.025 133.622 L
978.05 151.136 L
988.075 144.242 L
998.1 149.28 L
1008.125 148.337 L
1018.15 160.922 L
1028.175 149.462 L
1038.2 157.354 L
1048.225 144.338 L
1058.25 146.31 L
1068.275 153.443 L
1078.3 149.576 L
1088.325 168.843 L
1098.35 152.913 L
1108.375 151.797 L
1118.4 147.561 L
1128.425 143.245 L
1138.45 135.322 L
1148.475 137.883 L
1158.5 140.942 L
1158.5 123.162 L
1148.475 116.899 L
1138.45 119.104 L
1128.425 123.579 L
1118.4 129.884 L
1108.375 134.867 L
1098.35 134.265 L
1088.325 155.215 L
1078.3 133.109 L
1068.275 136.52 L
1058.25 127.806 L
cp
f
GR
GS
0.729 GC
1 LJ
0.5 LW
N
958 142.086 M
968.025 133.622 L
978.05 151.136 L
988.075 144.242 L
998.1 149.28 L
1008.125 148.337 L
1018.15 160.922 L
1028.175 149.462 L
1038.2 157.354 L
1048.225 144.338 L
1058.25 146.31 L
1068.275 153.443 L
1078.3 149.576 L
1088.325 168.843 L
1098.35 152.913 L
1108.375 151.797 L
1118.4 147.561 L
1128.425 143.245 L
1138.45 135.322 L
1148.475 137.883 L
1158.5 140.942 L
S
GR
GS
0.729 GC
1 LJ
0.5 LW
N
958 122.889 M
968.025 113.632 L
978.05 131.47 L
988.075 130.271 L
998.1 130.23 L
1008.125 129.642 L
1018.15 143.463 L
1028.175 126.514 L
1038.2 139.285 L
1048.225 125.311 L
1058.25 127.806 L
1068.275 136.52 L
1078.3 133.109 L
1088.325 155.215 L
1098.35 134.265 L
1108.375 134.867 L
1118.4 129.884 L
1128.425 123.579 L
1138.45 119.104 L
1148.475 116.899 L
1158.5 123.162 L
S
GR
GS
0.4 GC
[10 6] 0 setdash
2 LJ
N
958 132.487 M
968.025 123.627 L
978.05 141.303 L
988.075 137.256 L
998.1 139.755 L
1008.125 138.99 L
1018.15 152.193 L
1028.175 137.988 L
1038.2 148.319 L
1048.225 134.825 L
1058.25 137.058 L
1068.275 144.982 L
1078.3 141.342 L
1088.325 162.029 L
1098.35 143.589 L
1108.375 143.332 L
1118.4 138.722 L
1128.425 133.412 L
1138.45 127.213 L
1148.475 127.391 L
1158.5 132.052 L
S
GR
GS
1 GC
N
166.5 382.5 M
367 382.5 L
367 237 L
166.5 237 L
cp
f
GR
GS
0.149 GC
2 setlinecap
1 LJ
0.5 LW
N
166.5 382.5 M
367 382.5 L
S
GR
GS
0.149 GC
2 setlinecap
1 LJ
0.5 LW
N
166.5 382.5 M
166.5 380.495 L
S
GR
GS
0.149 GC
2 setlinecap
1 LJ
0.5 LW
N
244.213 382.5 M
244.213 380.495 L
S
GR
GS
0.149 GC
2 setlinecap
1 LJ
0.5 LW
N
321.926 382.5 M
321.926 380.495 L
S
GR
GS
[1 0 0 1 166.5 388.10001] CT
0.149 GC
/Helvetica 18 F
GS
[1 0 0 1 0 0] CT
-5.5 18 moveto 
1 -1 scale
(0) t 
GR
GR
GS
[1 0 0 1 244.21318 388.10001] CT
0.149 GC
/Helvetica 18 F
GS
[1 0 0 1 0 0] CT
-5.5 18 moveto 
1 -1 scale
(5) t 
GR
GR
GS
[1 0 0 1 321.92636 388.10001] CT
0.149 GC
/Helvetica 18 F
GS
[1 0 0 1 0 0] CT
-10.5 18 moveto 
1 -1 scale
(10) t 
GR
GR
GS
[1 0 0 1 266.75009 410.60001] CT
0.149 GC
/Helvetica 18 F
GS
[1 0 0 1 0 0] CT
-104 18 moveto 
1 -1 scale
(Time \(TR\) from stim onset) t 
GR
GR
GS
0.149 GC
2 setlinecap
1 LJ
0.5 LW
N
166.5 382.5 M
166.5 237 L
S
GR
GS
0.149 GC
2 setlinecap
1 LJ
0.5 LW
N
166.5 382.5 M
168.505 382.5 L
S
GR
GS
0.149 GC
2 setlinecap
1 LJ
0.5 LW
N
166.5 340.929 M
168.505 340.929 L
S
GR
GS
0.149 GC
2 setlinecap
1 LJ
0.5 LW
N
166.5 299.357 M
168.505 299.357 L
S
GR
GS
0.149 GC
2 setlinecap
1 LJ
0.5 LW
N
166.5 257.786 M
168.505 257.786 L
S
GR
GS
[1 0 0 1 160.89999 382.5] CT
0.149 GC
/Helvetica 18 F
GS
[1 0 0 1 0 0] CT
-21 7 moveto 
1 -1 scale
(48) t 
GR
GR
GS
[1 0 0 1 160.89999 340.92856] CT
0.149 GC
/Helvetica 18 F
GS
[1 0 0 1 0 0] CT
-21 7 moveto 
1 -1 scale
(50) t 
GR
GR
GS
[1 0 0 1 160.89999 299.35715] CT
0.149 GC
/Helvetica 18 F
GS
[1 0 0 1 0 0] CT
-21 7 moveto 
1 -1 scale
(52) t 
GR
GR
GS
[1 0 0 1 160.89999 257.78571] CT
0.149 GC
/Helvetica 18 F
GS
[1 0 0 1 0 0] CT
-21 7 moveto 
1 -1 scale
(54) t 
GR
GR
GS
[0 -1 1 0 137.39999 309.74991] CT
0.149 GC
/Helvetica 18 F
GS
[1 0 0 1 0 0] CT
-94.5 -4 moveto 
1 -1 scale
(Decoding accuracy \(%\)) t 
GR
GR
GS
1 GC
N
203.802 382.517 M
244.213 382.517 L
244.213 236.983 L
209.243 236.983 L
166.5 236.983 L
166.5 382.517 L
cp
f
GR
GS
0.902 GC
N
266.594 382.517 M
290.841 382.517 L
290.841 236.983 L
269.859 236.983 L
244.213 236.983 L
244.213 382.517 L
cp
f
GR
GS
1 GC
N
327.397 382.517 M
367 382.517 L
367 236.983 L
332.729 236.983 L
290.841 236.983 L
290.841 382.517 L
cp
f
GR
GS
[8 8] 0 setdash
2 LJ
2 LW
N
166.5 340.929 M
367 340.929 L
S
GR
GS
1 0 0 RC
1 LJ
2 LW
N
246.7 351.321 M
256.725 351.321 L
266.75 351.321 L
276.775 351.321 L
286.8 351.321 L
296.825 351.321 L
306.85 351.321 L
316.875 351.321 L
326.9 351.321 L
S
GR
GS
0.948 0.749 0.781 RC
N
186.55 347.241 M
176.525 341.711 L
166.5 330.445 L
166.5 347.447 L
176.525 356.679 L
186.55 366.577 L
196.575 355.508 L
206.6 353.098 L
216.625 346.215 L
226.65 346.995 L
236.675 337.272 L
246.7 330.598 L
256.725 319.601 L
266.75 316.093 L
276.775 307.641 L
286.8 303.561 L
296.825 312.337 L
306.85 306.948 L
316.875 313.824 L
326.9 313.962 L
336.925 332.867 L
346.95 342.669 L
356.975 338.128 L
367 341.079 L
367 325.085 L
356.975 321.466 L
346.95 327.675 L
336.925 314.71 L
326.9 294.832 L
316.875 292.48 L
306.85 287.375 L
296.825 292.396 L
286.8 282.438 L
276.775 289.634 L
266.75 301.069 L
256.725 302.016 L
246.7 315.812 L
236.675 320.913 L
226.65 330.072 L
216.625 329.926 L
206.6 334.446 L
196.575 337.643 L
cp
f
GR
GS
0.906 0.549 0.608 RC
1 LJ
0.5 LW
N
166.5 347.447 M
176.525 356.679 L
186.55 366.577 L
196.575 355.508 L
206.6 353.098 L
216.625 346.215 L
226.65 346.995 L
236.675 337.272 L
246.7 330.598 L
256.725 319.601 L
266.75 316.093 L
276.775 307.641 L
286.8 303.561 L
296.825 312.337 L
306.85 306.948 L
316.875 313.824 L
326.9 313.962 L
336.925 332.867 L
346.95 342.669 L
356.975 338.128 L
367 341.079 L
S
GR
GS
0.906 0.549 0.608 RC
1 LJ
0.5 LW
N
166.5 330.445 M
176.525 341.711 L
186.55 347.241 L
196.575 337.643 L
206.6 334.446 L
216.625 329.926 L
226.65 330.072 L
236.675 320.913 L
246.7 315.812 L
256.725 302.016 L
266.75 301.069 L
276.775 289.634 L
286.8 282.438 L
296.825 292.396 L
306.85 287.375 L
316.875 292.48 L
326.9 294.832 L
336.925 314.71 L
346.95 327.675 L
356.975 321.466 L
367 325.085 L
S
GR
GS
0.792 0 0.125 RC
1 LJ
2 LW
N
166.5 338.946 M
176.525 349.195 L
186.55 356.909 L
196.575 346.576 L
206.6 343.772 L
216.625 338.071 L
226.65 338.534 L
236.675 329.092 L
246.7 323.205 L
256.725 310.808 L
266.75 308.581 L
276.775 298.638 L
286.8 293 L
296.825 302.367 L
306.85 297.162 L
316.875 303.152 L
326.9 304.397 L
336.925 323.789 L
346.95 335.172 L
356.975 329.797 L
367 333.082 L
S
GR
GS
0.849 GC
N
246.7 322.378 M
236.675 326.76 L
226.65 326.089 L
216.625 318.448 L
206.6 325.783 L
196.575 313.987 L
186.55 323.779 L
176.525 328.615 L
166.5 320.06 L
166.5 338.648 L
176.525 345.725 L
186.55 340.171 L
196.575 327.774 L
206.6 344.753 L
216.625 335.862 L
226.65 342.86 L
236.675 347.235 L
246.7 346.915 L
256.725 349.627 L
266.75 347.488 L
276.775 351.512 L
286.8 333.376 L
296.825 338.935 L
306.85 345.938 L
316.875 339.021 L
326.9 353.333 L
336.925 352.143 L
346.95 343.917 L
356.975 341.991 L
367 357.034 L
367 338.584 L
356.975 323.864 L
346.95 325.096 L
336.925 336.685 L
326.9 335.297 L
316.875 321.105 L
306.85 325.883 L
296.825 320.231 L
286.8 313.776 L
276.775 332.883 L
266.75 325.96 L
256.725 327.057 L
cp
f
GR
GS
0.729 GC
1 LJ
0.5 LW
N
166.5 338.648 M
176.525 345.725 L
186.55 340.171 L
196.575 327.774 L
206.6 344.753 L
216.625 335.862 L
226.65 342.86 L
236.675 347.235 L
246.7 346.915 L
256.725 349.627 L
266.75 347.488 L
276.775 351.512 L
286.8 333.376 L
296.825 338.935 L
306.85 345.938 L
316.875 339.021 L
326.9 353.333 L
336.925 352.143 L
346.95 343.917 L
356.975 341.991 L
367 357.034 L
S
GR
GS
0.729 GC
1 LJ
0.5 LW
N
166.5 320.06 M
176.525 328.615 L
186.55 323.779 L
196.575 313.987 L
206.6 325.783 L
216.625 318.448 L
226.65 326.089 L
236.675 326.76 L
246.7 322.378 L
256.725 327.057 L
266.75 325.96 L
276.775 332.883 L
286.8 313.776 L
296.825 320.231 L
306.85 325.883 L
316.875 321.105 L
326.9 335.297 L
336.925 336.685 L
346.95 325.096 L
356.975 323.864 L
367 338.584 L
S
GR
GS
0.4 GC
[10 6] 0 setdash
2 LJ
N
166.5 329.354 M
176.525 337.17 L
186.55 331.975 L
196.575 320.88 L
206.6 335.268 L
216.625 327.155 L
226.65 334.474 L
236.675 336.997 L
246.7 334.647 L
256.725 338.342 L
266.75 336.724 L
276.775 342.198 L
286.8 323.576 L
296.825 329.583 L
306.85 335.91 L
316.875 330.063 L
326.9 344.315 L
336.925 344.414 L
346.95 334.507 L
356.975 332.927 L
367 347.809 L
S
GR
GS
1 GC
N
430 382.5 M
630.5 382.5 L
630.5 237 L
430 237 L
cp
f
GR
GS
0.149 GC
2 setlinecap
1 LJ
0.5 LW
N
430 382.5 M
630.5 382.5 L
S
GR
GS
0.149 GC
2 setlinecap
1 LJ
0.5 LW
N
430 382.5 M
430 380.495 L
S
GR
GS
0.149 GC
2 setlinecap
1 LJ
0.5 LW
N
507.713 382.5 M
507.713 380.495 L
S
GR
GS
0.149 GC
2 setlinecap
1 LJ
0.5 LW
N
585.426 382.5 M
585.426 380.495 L
S
GR
GS
[1 0 0 1 430 388.10001] CT
0.149 GC
/Helvetica 18 F
GS
[1 0 0 1 0 0] CT
-5.5 18 moveto 
1 -1 scale
(0) t 
GR
GR
GS
[1 0 0 1 507.71317 388.10001] CT
0.149 GC
/Helvetica 18 F
GS
[1 0 0 1 0 0] CT
-5.5 18 moveto 
1 -1 scale
(5) t 
GR
GR
GS
[1 0 0 1 585.42633 388.10001] CT
0.149 GC
/Helvetica 18 F
GS
[1 0 0 1 0 0] CT
-10.5 18 moveto 
1 -1 scale
(10) t 
GR
GR
GS
[1 0 0 1 530.25012 410.60001] CT
0.149 GC
/Helvetica 18 F
GS
[1 0 0 1 0 0] CT
-104 18 moveto 
1 -1 scale
(Time \(TR\) from stim onset) t 
GR
GR
GS
0.149 GC
2 setlinecap
1 LJ
0.5 LW
N
430 382.5 M
430 237 L
S
GR
GS
0.149 GC
2 setlinecap
1 LJ
0.5 LW
N
430 382.5 M
432.005 382.5 L
S
GR
GS
0.149 GC
2 setlinecap
1 LJ
0.5 LW
N
430 340.929 M
432.005 340.929 L
S
GR
GS
0.149 GC
2 setlinecap
1 LJ
0.5 LW
N
430 299.357 M
432.005 299.357 L
S
GR
GS
0.149 GC
2 setlinecap
1 LJ
0.5 LW
N
430 257.786 M
432.005 257.786 L
S
GR
GS
[1 0 0 1 424.39999 382.5] CT
0.149 GC
/Helvetica 18 F
GS
[1 0 0 1 0 0] CT
-21 7 moveto 
1 -1 scale
(48) t 
GR
GR
GS
[1 0 0 1 424.39999 340.92856] CT
0.149 GC
/Helvetica 18 F
GS
[1 0 0 1 0 0] CT
-21 7 moveto 
1 -1 scale
(50) t 
GR
GR
GS
[1 0 0 1 424.39999 299.35715] CT
0.149 GC
/Helvetica 18 F
GS
[1 0 0 1 0 0] CT
-21 7 moveto 
1 -1 scale
(52) t 
GR
GR
GS
[1 0 0 1 424.39999 257.78571] CT
0.149 GC
/Helvetica 18 F
GS
[1 0 0 1 0 0] CT
-21 7 moveto 
1 -1 scale
(54) t 
GR
GR
GS
[0 -1 1 0 400.89999 309.74991] CT
0.149 GC
/Helvetica 18 F
GS
[1 0 0 1 0 0] CT
-94.5 -4 moveto 
1 -1 scale
(Decoding accuracy \(%\)) t 
GR
GR
GS
1 GC
N
467.302 382.517 M
507.713 382.517 L
507.713 236.983 L
472.743 236.983 L
430 236.983 L
430 382.517 L
cp
f
GR
GS
0.902 GC
N
530.094 382.517 M
554.341 382.517 L
554.341 236.983 L
533.359 236.983 L
507.713 236.983 L
507.713 382.517 L
cp
f
GR
GS
1 GC
N
590.897 382.517 M
630.5 382.517 L
630.5 236.983 L
596.229 236.983 L
554.341 236.983 L
554.341 382.517 L
cp
f
GR
GS
[8 8] 0 setdash
2 LJ
2 LW
N
430 340.929 M
630.5 340.929 L
S
GR
GS
1 0 0 RC
1 LJ
2 LW
N
560.325 351.321 M
570.35 351.321 L
580.375 351.321 L
S
GR
GS
0.948 0.749 0.781 RC
N
520.225 316.939 M
510.2 325.141 L
500.175 325.231 L
490.15 323.234 L
480.125 329.066 L
470.1 329.075 L
460.075 324.841 L
450.05 351.415 L
440.025 335.226 L
430 334.395 L
430 350.426 L
440.025 353.865 L
450.05 368.597 L
460.075 342.333 L
470.1 346.638 L
480.125 346.512 L
490.15 341.651 L
500.175 342.271 L
510.2 345.949 L
520.225 339.148 L
530.25 335.704 L
540.275 340.083 L
550.3 336.235 L
560.325 328.293 L
570.35 326.175 L
580.375 322.445 L
590.4 332.695 L
600.425 340.792 L
610.45 341.044 L
620.475 341.473 L
630.5 350.597 L
630.5 331.685 L
620.475 322.498 L
610.45 323.133 L
600.425 321.738 L
590.4 314.8 L
580.375 302.145 L
570.35 306.26 L
560.325 306.12 L
550.3 316.78 L
540.275 319.198 L
530.25 313.14 L
cp
f
GR
GS
0.906 0.549 0.608 RC
1 LJ
0.5 LW
N
430 350.426 M
440.025 353.865 L
450.05 368.597 L
460.075 342.333 L
470.1 346.638 L
480.125 346.512 L
490.15 341.651 L
500.175 342.271 L
510.2 345.949 L
520.225 339.148 L
530.25 335.704 L
540.275 340.083 L
550.3 336.235 L
560.325 328.293 L
570.35 326.175 L
580.375 322.445 L
590.4 332.695 L
600.425 340.792 L
610.45 341.044 L
620.475 341.473 L
630.5 350.597 L
S
GR
GS
0.906 0.549 0.608 RC
1 LJ
0.5 LW
N
430 334.395 M
440.025 335.226 L
450.05 351.415 L
460.075 324.841 L
470.1 329.075 L
480.125 329.066 L
490.15 323.234 L
500.175 325.231 L
510.2 325.141 L
520.225 316.939 L
530.25 313.14 L
540.275 319.198 L
550.3 316.78 L
560.325 306.12 L
570.35 306.26 L
580.375 302.145 L
590.4 314.8 L
600.425 321.738 L
610.45 323.133 L
620.475 322.498 L
630.5 331.685 L
S
GR
GS
0.792 0 0.125 RC
1 LJ
2 LW
N
430 342.41 M
440.025 344.546 L
450.05 360.006 L
460.075 333.587 L
470.1 337.856 L
480.125 337.789 L
490.15 332.442 L
500.175 333.751 L
510.2 335.545 L
520.225 328.043 L
530.25 324.422 L
540.275 329.64 L
550.3 326.507 L
560.325 317.207 L
570.35 316.217 L
580.375 312.295 L
590.4 323.747 L
600.425 331.265 L
610.45 332.088 L
620.475 331.986 L
630.5 341.141 L
S
GR
GS
0.849 GC
N
450.05 352.622 M
460.075 348.118 L
470.1 341.807 L
480.125 349.121 L
490.15 358.215 L
500.175 339.686 L
510.2 350.613 L
520.225 343.618 L
530.25 352.241 L
540.275 346.636 L
550.3 346.629 L
560.325 329.772 L
570.35 340.696 L
580.375 330.245 L
590.4 350.063 L
600.425 345.875 L
610.45 330.155 L
620.475 339.534 L
630.5 350.074 L
630.5 330.775 L
620.475 322.239 L
610.45 313.02 L
600.425 330.03 L
590.4 329.552 L
580.375 314.982 L
570.35 322.346 L
560.325 313.715 L
550.3 330.3 L
540.275 329.589 L
530.25 336.689 L
520.225 327.507 L
510.2 336.081 L
500.175 324.906 L
490.15 341.159 L
480.125 333.532 L
470.1 327.693 L
460.075 333.416 L
450.05 339.574 L
440.025 329.81 L
430 338.514 L
430 352.59 L
440.025 345.187 L
cp
f
GR
GS
0.729 GC
1 LJ
0.5 LW
N
430 352.59 M
440.025 345.187 L
450.05 352.622 L
460.075 348.118 L
470.1 341.807 L
480.125 349.121 L
490.15 358.215 L
500.175 339.686 L
510.2 350.613 L
520.225 343.618 L
530.25 352.241 L
540.275 346.636 L
550.3 346.629 L
560.325 329.772 L
570.35 340.696 L
580.375 330.245 L
590.4 350.063 L
600.425 345.875 L
610.45 330.155 L
620.475 339.534 L
630.5 350.074 L
S
GR
GS
0.729 GC
1 LJ
0.5 LW
N
430 338.514 M
440.025 329.81 L
450.05 339.574 L
460.075 333.416 L
470.1 327.693 L
480.125 333.532 L
490.15 341.159 L
500.175 324.906 L
510.2 336.081 L
520.225 327.507 L
530.25 336.689 L
540.275 329.589 L
550.3 330.3 L
560.325 313.715 L
570.35 322.346 L
580.375 314.982 L
590.4 329.552 L
600.425 330.03 L
610.45 313.02 L
620.475 322.239 L
630.5 330.775 L
S
GR
GS
0.4 GC
[10 6] 0 setdash
2 LJ
N
430 345.552 M
440.025 337.498 L
450.05 346.098 L
460.075 340.767 L
470.1 334.75 L
480.125 341.326 L
490.15 349.687 L
500.175 332.296 L
510.2 343.347 L
520.225 335.562 L
530.25 344.465 L
540.275 338.112 L
550.3 338.465 L
560.325 321.743 L
570.35 331.521 L
580.375 322.614 L
590.4 339.808 L
600.425 337.953 L
610.45 321.588 L
620.475 330.887 L
630.5 340.425 L
S
GR
GS
1 GC
N
694 382.5 M
894.5 382.5 L
894.5 237 L
694 237 L
cp
f
GR
GS
0.149 GC
2 setlinecap
1 LJ
0.5 LW
N
694 382.5 M
894.5 382.5 L
S
GR
GS
0.149 GC
2 setlinecap
1 LJ
0.5 LW
N
694 382.5 M
694 380.495 L
S
GR
GS
0.149 GC
2 setlinecap
1 LJ
0.5 LW
N
771.713 382.5 M
771.713 380.495 L
S
GR
GS
0.149 GC
2 setlinecap
1 LJ
0.5 LW
N
849.426 382.5 M
849.426 380.495 L
S
GR
GS
[1 0 0 1 694 388.10001] CT
0.149 GC
/Helvetica 18 F
GS
[1 0 0 1 0 0] CT
-5.5 18 moveto 
1 -1 scale
(0) t 
GR
GR
GS
[1 0 0 1 771.7132 388.10001] CT
0.149 GC
/Helvetica 18 F
GS
[1 0 0 1 0 0] CT
-5.5 18 moveto 
1 -1 scale
(5) t 
GR
GR
GS
[1 0 0 1 849.42633 388.10001] CT
0.149 GC
/Helvetica 18 F
GS
[1 0 0 1 0 0] CT
-10.5 18 moveto 
1 -1 scale
(10) t 
GR
GR
GS
[1 0 0 1 794.25012 410.60001] CT
0.149 GC
/Helvetica 18 F
GS
[1 0 0 1 0 0] CT
-104 18 moveto 
1 -1 scale
(Time \(TR\) from stim onset) t 
GR
GR
GS
0.149 GC
2 setlinecap
1 LJ
0.5 LW
N
694 382.5 M
694 237 L
S
GR
GS
0.149 GC
2 setlinecap
1 LJ
0.5 LW
N
694 382.5 M
696.005 382.5 L
S
GR
GS
0.149 GC
2 setlinecap
1 LJ
0.5 LW
N
694 340.929 M
696.005 340.929 L
S
GR
GS
0.149 GC
2 setlinecap
1 LJ
0.5 LW
N
694 299.357 M
696.005 299.357 L
S
GR
GS
0.149 GC
2 setlinecap
1 LJ
0.5 LW
N
694 257.786 M
696.005 257.786 L
S
GR
GS
[1 0 0 1 688.40002 382.5] CT
0.149 GC
/Helvetica 18 F
GS
[1 0 0 1 0 0] CT
-21 7 moveto 
1 -1 scale
(48) t 
GR
GR
GS
[1 0 0 1 688.40002 340.92856] CT
0.149 GC
/Helvetica 18 F
GS
[1 0 0 1 0 0] CT
-21 7 moveto 
1 -1 scale
(50) t 
GR
GR
GS
[1 0 0 1 688.40002 299.35715] CT
0.149 GC
/Helvetica 18 F
GS
[1 0 0 1 0 0] CT
-21 7 moveto 
1 -1 scale
(52) t 
GR
GR
GS
[1 0 0 1 688.40002 257.78571] CT
0.149 GC
/Helvetica 18 F
GS
[1 0 0 1 0 0] CT
-21 7 moveto 
1 -1 scale
(54) t 
GR
GR
GS
[0 -1 1 0 664.90002 309.74991] CT
0.149 GC
/Helvetica 18 F
GS
[1 0 0 1 0 0] CT
-94.5 -4 moveto 
1 -1 scale
(Decoding accuracy \(%\)) t 
GR
GR
GS
1 GC
N
731.302 382.517 M
771.713 382.517 L
771.713 236.983 L
736.743 236.983 L
694 236.983 L
694 382.517 L
cp
f
GR
GS
0.902 GC
N
794.094 382.517 M
818.341 382.517 L
818.341 236.983 L
797.359 236.983 L
771.713 236.983 L
771.713 382.517 L
cp
f
GR
GS
1 GC
N
854.897 382.517 M
894.5 382.517 L
894.5 236.983 L
860.229 236.983 L
818.341 236.983 L
818.341 382.517 L
cp
f
GR
GS
[8 8] 0 setdash
2 LJ
2 LW
N
694 340.929 M
894.5 340.929 L
S
GR
GS
1 0 0 RC
1 LJ
2 LW
N
794.25 351.321 M
804.275 351.321 L
S
GR
GS
1 LJ
2 LW
N
854.4 361.714 M
864.425 361.714 L
874.45 361.714 L
S
GR
GS
0.948 0.749 0.781 RC
N
784.225 322.789 M
774.2 328.97 L
764.175 308.973 L
754.15 320.443 L
744.125 341.939 L
734.1 356.708 L
724.075 331.092 L
714.05 341.93 L
704.025 332.55 L
694 339.896 L
694 354.472 L
704.025 349.183 L
714.05 354.552 L
724.075 349.143 L
734.1 371.695 L
744.125 359.778 L
754.15 338.211 L
764.175 328.103 L
774.2 346.854 L
784.225 339.917 L
794.25 321.546 L
804.275 325.552 L
814.3 331.043 L
824.325 322.652 L
834.35 331.702 L
844.375 333.991 L
854.4 331.953 L
864.425 348.262 L
874.45 352.428 L
884.475 338.843 L
894.5 361.205 L
894.5 346.418 L
884.475 319.198 L
874.45 335.371 L
864.425 332.59 L
854.4 313.752 L
844.375 315.852 L
834.35 309.763 L
824.325 301.771 L
814.3 309.196 L
804.275 309.258 L
794.25 305.389 L
cp
f
GR
GS
0.906 0.549 0.608 RC
1 LJ
0.5 LW
N
694 354.472 M
704.025 349.183 L
714.05 354.552 L
724.075 349.143 L
734.1 371.695 L
744.125 359.778 L
754.15 338.211 L
764.175 328.103 L
774.2 346.854 L
784.225 339.917 L
794.25 321.546 L
804.275 325.552 L
814.3 331.043 L
824.325 322.652 L
834.35 331.702 L
844.375 333.991 L
854.4 331.953 L
864.425 348.262 L
874.45 352.428 L
884.475 338.843 L
894.5 361.205 L
S
GR
GS
0.906 0.549 0.608 RC
1 LJ
0.5 LW
N
694 339.896 M
704.025 332.55 L
714.05 341.93 L
724.075 331.092 L
734.1 356.708 L
744.125 341.939 L
754.15 320.443 L
764.175 308.973 L
774.2 328.97 L
784.225 322.789 L
794.25 305.389 L
804.275 309.258 L
814.3 309.196 L
824.325 301.771 L
834.35 309.763 L
844.375 315.852 L
854.4 313.752 L
864.425 332.59 L
874.45 335.371 L
884.475 319.198 L
894.5 346.418 L
S
GR
GS
0.792 0 0.125 RC
1 LJ
2 LW
N
694 347.184 M
704.025 340.866 L
714.05 348.241 L
724.075 340.117 L
734.1 364.202 L
744.125 350.858 L
754.15 329.327 L
764.175 318.538 L
774.2 337.912 L
784.225 331.353 L
794.25 313.467 L
804.275 317.405 L
814.3 320.12 L
824.325 312.212 L
834.35 320.732 L
844.375 324.921 L
854.4 322.852 L
864.425 340.426 L
874.45 343.899 L
884.475 329.021 L
894.5 353.811 L
S
GR
GS
0.849 GC
N
744.125 343.664 M
754.15 337.154 L
764.175 333.47 L
774.2 335.726 L
784.225 352.08 L
794.25 337.8 L
804.275 324.555 L
814.3 336.769 L
824.325 339.247 L
834.35 341.483 L
844.375 333.697 L
854.4 323.63 L
864.425 327.52 L
874.45 330.504 L
884.475 351.229 L
894.5 338.914 L
894.5 324.292 L
884.475 336.119 L
874.45 314.033 L
864.425 310.238 L
854.4 308.094 L
844.375 318.53 L
834.35 323.618 L
824.325 323.056 L
814.3 321.526 L
804.275 307.814 L
794.25 318.242 L
784.225 335.894 L
774.2 318.654 L
764.175 315.354 L
754.15 319.683 L
744.125 326.954 L
734.1 327.208 L
724.075 323.66 L
714.05 328.279 L
704.025 316.447 L
694 333.097 L
694 349.542 L
704.025 333.159 L
714.05 344.128 L
724.075 340.641 L
734.1 346.379 L
cp
f
GR
GS
0.729 GC
1 LJ
0.5 LW
N
694 349.542 M
704.025 333.159 L
714.05 344.128 L
724.075 340.641 L
734.1 346.379 L
744.125 343.664 L
754.15 337.154 L
764.175 333.47 L
774.2 335.726 L
784.225 352.08 L
794.25 337.8 L
804.275 324.555 L
814.3 336.769 L
824.325 339.247 L
834.35 341.483 L
844.375 333.697 L
854.4 323.63 L
864.425 327.52 L
874.45 330.504 L
884.475 351.229 L
894.5 338.914 L
S
GR
GS
0.729 GC
1 LJ
0.5 LW
N
694 333.097 M
704.025 316.447 L
714.05 328.279 L
724.075 323.66 L
734.1 327.208 L
744.125 326.954 L
754.15 319.683 L
764.175 315.354 L
774.2 318.654 L
784.225 335.894 L
794.25 318.242 L
804.275 307.814 L
814.3 321.526 L
824.325 323.056 L
834.35 323.618 L
844.375 318.53 L
854.4 308.094 L
864.425 310.238 L
874.45 314.033 L
884.475 336.119 L
894.5 324.292 L
S
GR
GS
0.4 GC
[10 6] 0 setdash
2 LJ
N
694 341.319 M
704.025 324.803 L
714.05 336.203 L
724.075 332.15 L
734.1 336.794 L
744.125 335.309 L
754.15 328.419 L
764.175 324.412 L
774.2 327.19 L
784.225 343.987 L
794.25 328.021 L
804.275 316.185 L
814.3 329.147 L
824.325 331.151 L
834.35 332.551 L
844.375 326.113 L
854.4 315.862 L
864.425 318.879 L
874.45 322.268 L
884.475 343.674 L
894.5 331.603 L
S
GR
GS
1 GC
N
958 382.5 M
1158.5 382.5 L
1158.5 237 L
958 237 L
cp
f
GR
GS
0.149 GC
2 setlinecap
1 LJ
0.5 LW
N
958 382.5 M
1158.5 382.5 L
S
GR
GS
0.149 GC
2 setlinecap
1 LJ
0.5 LW
N
958 382.5 M
958 380.495 L
S
GR
GS
0.149 GC
2 setlinecap
1 LJ
0.5 LW
N
1035.713 382.5 M
1035.713 380.495 L
S
GR
GS
0.149 GC
2 setlinecap
1 LJ
0.5 LW
N
1113.426 382.5 M
1113.426 380.495 L
S
GR
GS
[1 0 0 1 958 388.10001] CT
0.149 GC
/Helvetica 18 F
GS
[1 0 0 1 0 0] CT
-5.5 18 moveto 
1 -1 scale
(0) t 
GR
GR
GS
[1 0 0 1 1035.71313 388.10001] CT
0.149 GC
/Helvetica 18 F
GS
[1 0 0 1 0 0] CT
-5.5 18 moveto 
1 -1 scale
(5) t 
GR
GR
GS
[1 0 0 1 1113.42639 388.10001] CT
0.149 GC
/Helvetica 18 F
GS
[1 0 0 1 0 0] CT
-10.5 18 moveto 
1 -1 scale
(10) t 
GR
GR
GS
[1 0 0 1 1058.25012 410.60001] CT
0.149 GC
/Helvetica 18 F
GS
[1 0 0 1 0 0] CT
-104 18 moveto 
1 -1 scale
(Time \(TR\) from stim onset) t 
GR
GR
GS
0.149 GC
2 setlinecap
1 LJ
0.5 LW
N
958 382.5 M
958 237 L
S
GR
GS
0.149 GC
2 setlinecap
1 LJ
0.5 LW
N
958 382.5 M
960.005 382.5 L
S
GR
GS
0.149 GC
2 setlinecap
1 LJ
0.5 LW
N
958 340.929 M
960.005 340.929 L
S
GR
GS
0.149 GC
2 setlinecap
1 LJ
0.5 LW
N
958 299.357 M
960.005 299.357 L
S
GR
GS
0.149 GC
2 setlinecap
1 LJ
0.5 LW
N
958 257.786 M
960.005 257.786 L
S
GR
GS
[1 0 0 1 952.40002 382.5] CT
0.149 GC
/Helvetica 18 F
GS
[1 0 0 1 0 0] CT
-21 7 moveto 
1 -1 scale
(48) t 
GR
GR
GS
[1 0 0 1 952.40002 340.92856] CT
0.149 GC
/Helvetica 18 F
GS
[1 0 0 1 0 0] CT
-21 7 moveto 
1 -1 scale
(50) t 
GR
GR
GS
[1 0 0 1 952.40002 299.35715] CT
0.149 GC
/Helvetica 18 F
GS
[1 0 0 1 0 0] CT
-21 7 moveto 
1 -1 scale
(52) t 
GR
GR
GS
[1 0 0 1 952.40002 257.78571] CT
0.149 GC
/Helvetica 18 F
GS
[1 0 0 1 0 0] CT
-21 7 moveto 
1 -1 scale
(54) t 
GR
GR
GS
[0 -1 1 0 928.90002 309.74991] CT
0.149 GC
/Helvetica 18 F
GS
[1 0 0 1 0 0] CT
-94.5 -4 moveto 
1 -1 scale
(Decoding accuracy \(%\)) t 
GR
GR
GS
1 GC
N
995.302 382.517 M
1035.713 382.517 L
1035.713 236.983 L
1000.743 236.983 L
958 236.983 L
958 382.517 L
cp
f
GR
GS
0.902 GC
N
1058.094 382.517 M
1082.341 382.517 L
1082.341 236.983 L
1061.359 236.983 L
1035.713 236.983 L
1035.713 382.517 L
cp
f
GR
GS
1 GC
N
1118.897 382.517 M
1158.5 382.517 L
1158.5 236.983 L
1124.229 236.983 L
1082.341 236.983 L
1082.341 382.517 L
cp
f
GR
GS
[8 8] 0 setdash
2 LJ
2 LW
N
958 340.929 M
1158.5 340.929 L
S
GR
GS
1 LJ
2 LW
N
1148.475 361.714 M
1158.5 361.714 L
S
GR
GS
0.948 0.749 0.781 RC
N
998.1 357.157 M
1008.125 348.596 L
1018.15 351.712 L
1028.175 366.894 L
1038.2 348.962 L
1048.225 359.857 L
1058.25 352.665 L
1068.275 333.298 L
1078.3 336.282 L
1088.325 343.841 L
1098.35 346.775 L
1108.375 349.599 L
1118.4 351.88 L
1128.425 359.133 L
1138.45 364.007 L
1148.475 351.194 L
1158.5 333.978 L
1158.5 319.731 L
1148.475 336.048 L
1138.45 347.622 L
1128.425 339.898 L
1118.4 334.165 L
1108.375 331.352 L
1098.35 331.824 L
1088.325 325.284 L
1078.3 318.902 L
1068.275 318.56 L
1058.25 336.774 L
1048.225 343.643 L
1038.2 335.593 L
1028.175 349.375 L
1018.15 337.419 L
1008.125 330.834 L
998.1 340.466 L
988.075 335.041 L
978.05 328.544 L
968.025 342.985 L
958 348.936 L
958 364.874 L
968.025 364.598 L
978.05 345.433 L
988.075 350.065 L
cp
f
GR
GS
0.906 0.549 0.608 RC
1 LJ
0.5 LW
N
958 364.874 M
968.025 364.598 L
978.05 345.433 L
988.075 350.065 L
998.1 357.157 L
1008.125 348.596 L
1018.15 351.712 L
1028.175 366.894 L
1038.2 348.962 L
1048.225 359.857 L
1058.25 352.665 L
1068.275 333.298 L
1078.3 336.282 L
1088.325 343.841 L
1098.35 346.775 L
1108.375 349.599 L
1118.4 351.88 L
1128.425 359.133 L
1138.45 364.007 L
1148.475 351.194 L
1158.5 333.978 L
S
GR
GS
0.906 0.549 0.608 RC
1 LJ
0.5 LW
N
958 348.936 M
968.025 342.985 L
978.05 328.544 L
988.075 335.041 L
998.1 340.466 L
1008.125 330.834 L
1018.15 337.419 L
1028.175 349.375 L
1038.2 335.593 L
1048.225 343.643 L
1058.25 336.774 L
1068.275 318.56 L
1078.3 318.902 L
1088.325 325.284 L
1098.35 331.824 L
1108.375 331.352 L
1118.4 334.165 L
1128.425 339.898 L
1138.45 347.622 L
1148.475 336.048 L
1158.5 319.731 L
S
GR
GS
0.792 0 0.125 RC
1 LJ
2 LW
N
958 356.905 M
968.025 353.792 L
978.05 336.988 L
988.075 342.553 L
998.1 348.812 L
1008.125 339.715 L
1018.15 344.566 L
1028.175 358.134 L
1038.2 342.278 L
1048.225 351.75 L
1058.25 344.719 L
1068.275 325.929 L
1078.3 327.592 L
1088.325 334.563 L
1098.35 339.299 L
1108.375 340.476 L
1118.4 343.023 L
1128.425 349.516 L
1138.45 355.815 L
1148.475 343.621 L
1158.5 326.855 L
S
GR
GS
0.849 GC
N
1028.175 363.755 M
1038.2 350.353 L
1048.225 351.925 L
1058.25 357.735 L
1068.275 360.014 L
1078.3 346.663 L
1088.325 358.94 L
1098.35 342.769 L
1108.375 340.715 L
1118.4 342.686 L
1128.425 339.56 L
1138.45 343.641 L
1148.475 323.525 L
1158.5 330.944 L
1158.5 311.648 L
1148.475 307.721 L
1138.45 328.65 L
1128.425 323.476 L
1118.4 323.294 L
1108.375 322.403 L
1098.35 326.728 L
1088.325 343.06 L
1078.3 330.437 L
1068.275 339.085 L
1058.25 339.111 L
1048.225 334.5 L
1038.2 330.044 L
1028.175 346.088 L
1018.15 328.809 L
1008.125 328.762 L
998.1 336.735 L
988.075 330.907 L
978.05 332.714 L
968.025 314.65 L
958 333.441 L
958 348.756 L
968.025 331.729 L
978.05 346.14 L
988.075 347.311 L
998.1 353.316 L
1008.125 346.285 L
1018.15 347.634 L
cp
f
GR
GS
0.729 GC
1 LJ
0.5 LW
N
958 348.756 M
968.025 331.729 L
978.05 346.14 L
988.075 347.311 L
998.1 353.316 L
1008.125 346.285 L
1018.15 347.634 L
1028.175 363.755 L
1038.2 350.353 L
1048.225 351.925 L
1058.25 357.735 L
1068.275 360.014 L
1078.3 346.663 L
1088.325 358.94 L
1098.35 342.769 L
1108.375 340.715 L
1118.4 342.686 L
1128.425 339.56 L
1138.45 343.641 L
1148.475 323.525 L
1158.5 330.944 L
S
GR
GS
0.729 GC
1 LJ
0.5 LW
N
958 333.441 M
968.025 314.65 L
978.05 332.714 L
988.075 330.907 L
998.1 336.735 L
1008.125 328.762 L
1018.15 328.809 L
1028.175 346.088 L
1038.2 330.044 L
1048.225 334.5 L
1058.25 339.111 L
1068.275 339.085 L
1078.3 330.437 L
1088.325 343.06 L
1098.35 326.728 L
1108.375 322.403 L
1118.4 323.294 L
1128.425 323.476 L
1138.45 328.65 L
1148.475 307.721 L
1158.5 311.648 L
S
GR
GS
0.4 GC
[10 6] 0 setdash
2 LJ
N
958 341.098 M
968.025 323.19 L
978.05 339.427 L
988.075 339.109 L
998.1 345.025 L
1008.125 337.524 L
1018.15 338.221 L
1028.175 354.922 L
1038.2 340.198 L
1048.225 343.213 L
1058.25 348.423 L
1068.275 349.55 L
1078.3 338.55 L
1088.325 351 L
1098.35 334.749 L
1108.375 331.559 L
1118.4 332.99 L
1128.425 331.518 L
1138.45 336.145 L
1148.475 315.623 L
1158.5 321.296 L
S
GR
%%Trailer
%%Pages: 1
%%EOF
