30,-0.016901,0.48521,0.49822,-0.70803,0.42609,-0.97742,0.38048,-0.26845,5.0567,0.019607,3.2852,0.00054089,3.5738,4.6754,0.58319,6.1392,0.0058581,0.7081,2.672,1.795,1.07,0.62793,0.072197,0.076481,0.11288,0.086714,0.12716,0.13313,0.39143,0.22472,0.021564,0.017748,0.14834,0.010815,0.054849,0.12006,0.59809,0.46552,0.32787,0.46552,0.75643,1.5049,0.39287,1.0355,0.53521,67,63.119,2397,97687,6.639,48.086,64719,26379,5697,0.90738,0.93011,0.17282,0.12824,0.091908,0.49549,31493,15666,0.0016803,0.00075365,0,0.063604,0,0.056954,0.03581,0.043987,0.048546,0.053629,0.43297,0.71133,0.49882,0.22131,0.35328,0.2694,0.26019,0.38529,0.18445,0.25965,0.39034,0.18308,26.682,7.2737,12646,34348,33505,0.2534,0.24142,0.12512,0.63349,0.66244,0.16393,0.77878,0.8083,0.14278,0.83074,0.85097,0.1219,0.86071,0.87287,0.10799,0.015541,0.016307,0.13966,0.052682,0.047391,0.020169,0.035048,0.037624,0.14796,0.074704,0.069844,0.040348,0.060192,0.066522,0.1504,0.094533,0.09215,0.072284,0.0035992,0.0028128,0.074749,0.01568,0.0077332,-0.040137,0.0072859,0.0060516,0.068737,0.018491,0.0098042,-0.04082,0.012346,0.010884,0.067748,0.022565,0.014581,-0.036166,0.0092481,0.011053,0.16243,0.044028,0.044126,0.063132,0.021812,0.02644,0.18802,0.067916,0.068384,0.091525,0.037992,0.047207,0.19867,0.088921,0.091219,0.13047,0.002694,0.0024413,0.43479,0.056206,0.054955,-0.018396,0.007673,0.0069947,0.39317,0.069988,0.071562,-0.023698,0.014224,0.013144,0.36032,0.082702,0.086743,-0.02519,0.44242,74,74,40,1054,3,3,3,0.645
30,-0.048689,1.0054,0.98958,-0.097367,0.88578,-0.1289,0.32387,0.77884,3.4733,0.17469,3.2531,0.00010311,3.917,2.9141,1.8033,3.6017,0.0034367,0.09738,7.9792,5.1608,2.8427,1.6996,0.027199,0.02537,0.047061,0.051622,0.099211,0.11165,0.63789,0.074189,1.9587,2.246,1.3903,0.0035397,0.025745,0.051616,5.75,0.12675,0.28188,0.28188,0.46894,0.47378,0.17879,2.7001,3.6157,78,50.372,2120,61690,7.5079,61.882,57240,12933,10071,0.90604,0.9285,0.077666,0.067025,0.0054969,0.066441,26780,14538,0.0013104,0.0004892,2,0.31654,0,0.0596,0.12488,0.49477,0.14975,0.59014,0.852,1.1484,0.312,0.24965,0.3246,0.25598,0.31625,0.34149,0.16308,0.31535,0.28739,0.17959,22.543,6.9115,40835,2.2846e+05,2.2815e+05,0.16579,0.14361,0.084271,0.36226,0.33043,0.096499,0.47661,0.48582,0.089947,0.56824,0.6058,0.085833,0.6589,0.69617,0.085095,0.005551,0.0046701,0.051348,0.012376,0.011316,-0.015364,0.012156,0.0097873,0.052825,0.017255,0.015794,-0.025267,0.021551,0.016705,0.055432,0.023321,0.020862,-0.03781,0.0025555,0.0024169,0.054633,0.0092686,0.0047641,-0.0033318,0.0050618,0.0045556,0.049157,0.010187,0.0044315,-0.0081391,0.0088894,0.0074631,0.050213,0.013228,0.0059505,-0.017183,0.0014498,0.0012151,0.026212,0.00083833,0.0045607,-0.0079181,0.0033399,0.0026487,0.029636,0.0024809,0.0072775,-0.014414,0.0063617,0.0047925,0.034244,0.0053492,0.010209,-0.022823,0.0015457,0.0010381,0.25679,0.031382,0.026634,-0.019367,0.0039572,0.0027096,0.20873,0.034512,0.032567,-0.023835,0.007054,0.0049332,0.18394,0.038762,0.038365,-0.028777,0.54303,74,74,40,1054,3,3,3,0.645
30,-0.0035895,0.96805,0.96258,-0.19105,0.96258,-0.19095,-0.00055152,1.1282,9.4651,0.026075,3.2038,0.0029989,9.4822,7.4536,1.6153,11.441,0.010917,0.19115,5.3034,3.4917,2.4147,1.6899,0.042819,0.039558,0.064885,0.064855,0.071172,0.079977,0.63673,0.071921,0.14216,0.42593,0.30103,0.084744,0.0024016,0.09706,1.1252,0.46346,0.54758,0.54758,0.67645,0.87546,0.31109,2.1155,3.0719,62,81.435,3793,2.3114e+05,7.5437,58.58,1.0241e+05,7533,6723,0.90582,0.92647,0.19246,0.14423,0.095493,0.50181,22871,14425,0.0017563,0.00066784,0,0.094305,0,0.057755,0.0084981,0.11209,0.017481,0.16804,0.00036751,0.36113,0.51046,0.25784,0.35192,0.223,0.32699,0.36555,0.092167,0.34476,0.36449,0.078866,19.866,6.0211,12685,39024,37945,0.30866,0.30654,0.17614,0.72557,0.76881,0.21699,0.87999,0.90431,0.18645,0.92132,0.93864,0.15624,0.93827,0.95157,0.13604,0.0024488,0.0020351,0.025431,-0.00040782,0.0065069,-0.023673,0.0047911,0.0039315,0.023375,-0.0016844,0.0081389,-0.033651,0.0085902,0.0071974,0.024806,-0.0011022,0.011279,-0.040887,0.00019259,0.00013847,0.0046224,-0.0061315,-0.0077023,-0.016212,0.00071123,0.00056251,0.0077545,-0.007002,-0.0094679,-0.018203,0.0021412,0.0019542,0.013579,-0.006005,-0.0081239,-0.013309,0.0022541,0.0018948,0.045754,0.0056884,0.013041,-0.021613,0.0042696,0.003527,0.042534,0.0061816,0.016617,-0.030146,0.006628,0.0054362,0.040055,0.0064349,0.018555,-0.037305,2.1201e-06,1.7593e-06,0.00039544,-0.0033067,0.010552,-0.0085084,8.4568e-05,6.3111e-05,0.0050079,-0.0037679,0.015676,-0.01894,0.00044472,0.00032634,0.013019,-0.0030561,0.021376,-0.02253,0.56189,74,74,40,1054,3,3,3,0.645
30,-0.0017662,0.51011,0.51052,-0.69929,0.50405,-0.77797,0.11252,0.23705,5.4525,-0.0061583,3.2176,0.0018779,5.1323,6.6191,0.60008,10.425,0.0099475,0.69956,2.648,1.5529,1.024,0.73154,0.057702,0.093247,0.11656,0.11866,0.10329,0.084207,0.42633,0.12664,0.10501,0.0078728,1.2348e-06,0.0029203,0.03143,0.04579,0.31967,0.44484,0.34286,0.44484,1.5218,1.5805,0.43558,1.0459,0.51179,57,84.386,2431,1.6754e+05,5.1028,27.436,65637,53919,3132,0.90785,0.93336,0.12993,0.089883,0.077023,0.44412,27143,17651,0.0016459,0.00069065,0,0.063848,0,0.061011,0.042709,0.054011,0.064818,0.078017,0.071651,0.64303,0.46909,0.22561,0.36036,0.26095,0.26737,0.39125,0.17289,0.2767,0.40341,0.16133,19.917,7.0455,7080.8,18561,16925,0.24675,0.23886,0.14407,0.68633,0.71533,0.21001,0.86091,0.88205,0.18663,0.93138,0.9436,0.16161,0.96823,0.97495,0.14364,0.0059954,0.0057916,0.063707,0.015251,0.017586,-0.011416,0.013621,0.013534,0.067994,0.022551,0.027581,-0.0029959,0.024828,0.025125,0.073357,0.031653,0.039517,0.0071437,0.00064275,0.00053354,0.015784,-0.0031263,-0.0039363,-0.018739,0.0015383,0.0013123,0.01716,-0.0036588,-0.0049411,-0.023551,0.0034674,0.0030481,0.022499,-0.0020907,-0.0025466,-0.029057,0.0038846,0.0037286,0.080678,0.015599,0.018224,-0.011228,0.0095999,0.0096404,0.09785,0.026843,0.031083,0.0016921,0.01826,0.018948,0.11291,0.040035,0.044684,0.019558,0.0014681,0.0015294,0.28017,0.031832,0.03693,0.0074197,0.0035272,0.0035457,0.21371,0.032517,0.043338,0.0012271,0.0061555,0.0059863,0.18438,0.03554,0.05172,-0.0080286,0.52533,74,74,40,1054,3,3,3,0.645
30,-0.0042156,0.55807,0.56009,-0.66286,0.5473,-0.76301,0.15109,1.2196,8.256,0.095635,3.1558,0.004156,5.0674,6.1684,0.6736,9.9872,0.0095298,0.66287,2.9279,1.6535,1.1297,0.80682,0.071559,0.064234,0.11278,0.12326,0.093426,0.084592,0.45014,0.26459,0.0013996,0.006005,0.00727,0.015317,0.011818,0.0096677,0.31606,0.60629,0.2915,0.60629,0.94292,1.2435,0.43524,1.1773,0.64833,64,83.219,1675,87840,4.0776,19.063,45225,32400,31239,0.90824,0.93453,0.18287,0.12641,0.14142,0.51472,24281,16061,0.0013109,0.00062931,0,0.04719,0,0.060601,0.031763,0.10481,0.047925,0.16542,0.93836,1.1404,0.26423,0.22383,0.35089,0.25194,0.25833,0.38018,0.14574,0.26182,0.37288,0.13227,20.024,6.8025,5759,15391,13862,0.27945,0.28846,0.16973,0.63607,0.66746,0.20246,0.81771,0.83899,0.1844,0.89667,0.90772,0.16184,0.92689,0.93331,0.14304,0.0034719,0.0031797,0.038376,0.0041902,0.010675,-0.020878,0.0081539,0.0073626,0.042339,0.0076869,0.016124,-0.032843,0.015088,0.013623,0.04637,0.012242,0.023197,-0.042888,0.00011506,8.7932e-05,0.0029393,-0.0068721,-0.0061516,-0.017935,0.0005233,0.00041433,0.0060725,-0.0080244,-0.0084936,-0.022766,0.0017876,0.001528,0.012066,-0.0072847,-0.0078357,-0.027642,0.0027209,0.0025609,0.058783,0.0087498,0.013802,-0.012492,0.0061148,0.0056784,0.064834,0.013656,0.021705,-0.020636,0.010924,0.010108,0.07026,0.019278,0.02976,-0.027595,0.00063595,0.00053091,0.12625,0.012107,0.024728,-0.019451,0.0016156,0.0013533,0.10183,0.012597,0.029625,-0.024579,0.0029134,0.0024363,0.090777,0.013887,0.036128,-0.031398,0.56504,74,74,40,1054,3,3,3,0.645
30,-0.0059218,0.68678,0.68534,-0.56036,0.67145,-0.64013,0.14235,-0.15079,5.0452,0.0092207,3.2976,0.00040542,5.3035,5.6567,0.87736,8.1234,0.0077513,0.56067,3.6372,2.3557,1.4444,0.92105,0.046476,0.074138,0.088396,0.083049,0.11203,0.1124,0.48351,0.065734,0.03567,0.11793,0.10855,0.00874,0.036813,6.0446e-06,0.37344,0.49611,0.37213,0.49611,0.77384,1.1196,0.39809,1.3407,0.89757,59,100.53,5553,5.1961e+05,7.4736,56.91,1.4993e+05,4239,1350,0.90344,0.92461,0.14929,0.11273,0.060325,0.35537,36404,19551,0.0012696,0.00060034,0,0.14519,0,0.062075,0.033459,0.074581,0.04853,0.10422,0.36571,0.8314,0.17992,0.20137,0.36976,0.29887,0.20544,0.39965,0.28274,0.19838,0.41608,0.28541,20.174,8.0695,19228,67259,66580,0.17972,0.17145,0.11999,0.45093,0.47027,0.15778,0.61646,0.64786,0.15282,0.73337,0.76708,0.14551,0.82412,0.84721,0.1398,0.0083383,0.0083844,0.10132,0.027428,0.025595,0.0013918,0.017884,0.018507,0.10208,0.036708,0.037205,0.011637,0.03065,0.032303,0.10355,0.046504,0.049678,0.022796,0.00047455,0.00039972,0.013326,-0.0045819,-0.003627,-0.011136,0.0015867,0.0013884,0.02024,-0.0037055,-0.0033824,-0.014573,0.0043445,0.0039382,0.032235,0.00058389,0.00024574,-0.017099,0.0063056,0.0064089,0.14975,0.032374,0.028672,0.0034231,0.011955,0.012451,0.13934,0.038509,0.037088,0.010881,0.018702,0.019725,0.13223,0.044261,0.044343,0.017423,0.0015582,0.0015757,0.34003,0.036425,0.037833,0.0015697,0.0046837,0.004934,0.3245,0.047919,0.054669,0.0097338,0.0088112,0.0095983,0.3018,0.057331,0.071278,0.020397,0.61913,74,74,40,1054,3,3,3,0.645
30,-0.0077118,0.83007,0.82978,-0.41162,0.81838,-0.36336,-0.11723,-0.86939,6.978,-0.061749,3.2395,0.0022544,8.1807,7.5379,1.1756,11.447,0.010923,0.41163,3.3029,2.2227,1.6735,1.2821,0.058245,0.062659,0.10515,0.078539,0.064268,0.064684,0.56646,0.1935,0.0074816,0.0038865,0.10307,0.24156,0.1177,0.035013,0.70221,0.20788,0.16571,0.20788,0.47244,0.65907,0.20544,1.6569,1.3701,37,219.62,6754,1.2424e+06,5.6437,33.463,1.8236e+05,27837,3861,0.9003,0.91706,0.21626,0.16814,0.11465,0.48254,33067,16714,0.0020293,0.00086686,0,0.12547,0,0.049222,0.028874,0.19999,0.036638,0.24536,0.33927,0.81898,0.55432,0.26208,0.33718,0.20057,0.30174,0.34478,0.10749,0.32888,0.33046,0.085197,18.783,5.4155,17883,89471,88941,0.31239,0.31944,0.26929,0.68109,0.7274,0.3077,0.8505,0.88009,0.27222,0.92411,0.94248,0.23674,0.95833,0.96932,0.2099,0.0059959,0.0062137,0.094065,0.018657,0.020382,0.007326,0.013227,0.013129,0.09748,0.026259,0.027858,-0.0019666,0.022856,0.02192,0.099703,0.03385,0.035705,-0.013679,0.00084709,0.00084355,0.030713,-0.0021151,-0.00058735,-0.00037559,0.0026519,0.0025808,0.043678,0.0011674,0.001391,-0.0035203,0.0058838,0.0056865,0.056367,0.0063247,0.0058864,-0.0061012,0.0039658,0.0039503,0.1216,0.01968,0.019026,-0.00066822,0.0093053,0.0094514,0.14003,0.031442,0.030664,0.0035488,0.016168,0.016247,0.1476,0.041594,0.040003,0.0013664,0.001183,0.0014199,0.33333,0.03057,0.03718,0.020122,0.0031657,0.0035086,0.28319,0.035109,0.043463,0.014736,0.005747,0.0060514,0.25416,0.040093,0.051082,0.0089009,0.73509,74,74,40,1054,3,3,3,0.645
30,-0.12603,0.9168,0.98623,0.11327,0.63916,0.18046,0.59323,0.038042,1.9579,0.043617,3.3522,0.0018003,2.9944,2.006,2.224,2.2876,0.0021829,-0.11329,5.6113,4.4109,3.4309,2.6624,0.043114,0.041464,0.052434,0.034119,0.041563,0.048153,0.73915,0.0010049,0.62231,3.391,9.7336,4.4903,2.0338,0.028536,20.301,0.098334,0.12264,0.12264,0.22817,0.3109,0.16495,3.3833,5.7317,49,138.51,6094,7.5625e+05,6.7207,46.435,1.6454e+05,13068,2241,0.89757,0.91415,0.25053,0.19996,0.099528,0.56296,38211,20554,0.0011518,0.0004828,0,0.087378,0,0.063505,0.0039318,0.01415,0.0064768,0.017662,0.56054,0.023214,0.74751,0.26047,0.34861,0.24387,0.29488,0.37286,0.18167,0.32702,0.35522,0.15839,17.292,6.5844,16388,79289,78243,0.13545,0.13607,0.099763,0.30212,0.3013,0.11662,0.43958,0.43397,0.12021,0.55734,0.56064,0.12199,0.66198,0.67227,0.12388,0.0073165,0.0093047,0.09807,0.023768,0.029859,0.059757,0.017051,0.021109,0.10737,0.03604,0.043786,0.071264,0.030361,0.035997,0.11316,0.048267,0.056275,0.070658,0.0046752,0.0066628,0.14483,0.027555,0.031389,0.0711,0.0098908,0.01398,0.13919,0.034879,0.038774,0.091723,0.017047,0.023199,0.13953,0.043642,0.046881,0.10157,0.0015932,0.0013844,0.041739,0.0019906,0.0041585,-0.013992,0.0039671,0.0034862,0.051008,0.0057335,0.0087796,-0.017614,0.0072834,0.0064716,0.05681,0.0094686,0.013129,-0.020468,0.0010481,0.0012575,0.25232,0.024522,0.03554,0.021111,0.0034306,0.003798,0.26221,0.035507,0.047935,0.015302,0.0067242,0.0068248,0.25408,0.044399,0.056976,0.0027065,0.69315,74,74,40,1054,3,3,3,0.645
30,-0.11244,0.786,0.94749,0.22717,0.37617,0.40358,0.77652,-0.36058,1.8135,-0.19796,3.2299,0.0025248,3.0863,1.9692,2.4519,2.2576,0.0021542,-0.22718,9.024,7.1561,5.8031,4.7458,0.029234,0.026432,0.032094,0.023152,0.024708,0.027409,0.83697,0.28882,4.2756,15.905,28.174,19.503,12.154,0.051917,80.353,0.029127,0.060447,0.060447,0.14874,0.16441,0.10705,3.28,5.3774,46,184.76,8180,1.4491e+06,6.5561,43.996,2.2086e+05,3105,1971,0.89297,0.9025,0.24718,0.20345,0.093038,0.49784,34354,19265,0.0013555,0.00057081,0,0.081216,0,0.05612,0.020756,0.02605,0.025712,0.028083,0.085263,0.42261,0.4989,0.25488,0.34474,0.23393,0.27287,0.3618,0.192,0.29755,0.34496,0.1702,13.9,6.3162,17662,1.2493e+05,1.2436e+05,0.17156,0.17936,0.15325,0.34423,0.34951,0.16114,0.47327,0.48516,0.15696,0.57965,0.59348,0.15387,0.67919,0.69284,0.15414,0.0073804,0.0076969,0.11997,0.026626,0.02608,0.0083356,0.017328,0.017849,0.13232,0.040786,0.038944,0.0079926,0.030968,0.031693,0.13998,0.05488,0.052037,0.0079,0.0040259,0.0046677,0.15125,0.024927,0.021395,0.021109,0.0082783,0.0094915,0.14128,0.030232,0.025526,0.025967,0.014376,0.01627,0.14271,0.038242,0.032606,0.029983,0.0019555,0.0016064,0.06213,0.0049257,0.0070122,-0.018755,0.0049605,0.0042819,0.07735,0.011119,0.01317,-0.019682,0.0094049,0.0085193,0.088965,0.018085,0.019754,-0.01756,0.0013991,0.0014228,0.40846,0.037602,0.03874,0.0018924,0.0044718,0.0044512,0.4145,0.05294,0.053734,-0.00066011,0.0083986,0.008319,0.38486,0.063194,0.066131,-0.0016488,0.9094,74,74,40,1054,3,3,3,0.645
30,-0.0085917,0.8992,0.89323,-0.32546,0.89315,-0.3284,0.0090476,0.14701,5.5033,0.0019859,3.2322,0.0019063,7.0476,6.0661,1.3472,9.3445,0.0089165,0.32555,4.1467,2.7054,2.0126,1.4939,0.054433,0.050624,0.085343,0.075941,0.062368,0.069371,0.60192,0.16451,0.0094516,0.066935,0.11206,0.27332,0.06423,0.063707,0.75422,0.11844,0.26124,0.26124,0.58124,0.93347,0.29268,1.9031,1.8079,63,83.968,3780,2.2704e+05,7.5204,58.632,1.0206e+05,9801,7506,0.90319,0.92394,0.12104,0.093494,0.042914,0.3599,26893,14216,0.0016481,0.00071719,1,0.16927,0,0.07151,0.063856,0.097063,0.079983,0.13323,0.23513,0.84267,0.6657,0.26236,0.33644,0.2092,0.31959,0.3389,0.090493,0.34665,0.33145,0.073631,20.333,5.6483,21608,77466,76774,0.31059,0.32016,0.18729,0.71985,0.76437,0.22749,0.88742,0.91465,0.19869,0.9424,0.95515,0.16888,0.96514,0.97172,0.14788,0.0038998,0.0032016,0.042797,0.0060959,0.010146,-0.031135,0.0094552,0.0078177,0.048746,0.011293,0.016627,-0.04004,0.017471,0.014472,0.053311,0.017086,0.023854,-0.051522,8.53e-05,5.6657e-05,0.0021634,-0.0070537,-0.0055628,-0.020525,0.00070527,0.00049792,0.0081256,-0.0072285,-0.0055926,-0.028872,0.0027622,0.0021611,0.018511,-0.0042803,-0.0027227,-0.033098,0.0026611,0.0020998,0.057079,0.00835,0.011583,-0.03177,0.0069366,0.0056794,0.073022,0.016833,0.019864,-0.036438,0.013084,0.010876,0.083556,0.025537,0.02797,-0.043977,0.0011534,0.0010452,0.22733,0.024687,0.028609,-0.0092704,0.002769,0.0024112,0.17327,0.024926,0.032748,-0.015773,0.0043285,0.0036893,0.13391,0.023569,0.037079,-0.020553,0.57545,74,74,40,1054,3,3,3,0.645
30,-0.0023521,0.36312,0.35943,-0.80014,0.3594,-0.80748,0.0091668,0.25096,3.5835,0.045433,3.3013,0.00014595,2.8016,4.4294,0.39928,5.9578,0.005685,0.80016,1.6208,1.0595,0.7593,0.57808,0.086457,0.10389,0.17995,0.10588,0.084369,0.066462,0.373,0.27102,0.088398,0.051456,0.054407,0.19885,0.44574,0.30226,1.4121,0.2953,0.30149,0.30149,0.64838,0.71113,0.26683,0.83404,0.34468,25,185.28,4072,6.5509e+05,4.6447,22.729,1.0994e+05,8937,2862,0.90399,0.93071,0.29382,0.20931,0.16614,0.87954,40163,26067,0.00087642,0.00044569,0,0.059974,0,0.069575,0.0065702,0.0083992,0.0010643,0.0053876,0.40093,0.71301,0.70234,0.19167,0.38581,0.32413,0.14564,0.48035,0.35908,0.14006,0.49276,0.35561,58.528,8.7514,14214,31807,30635,0.016509,0.012512,0.0082889,0.16961,0.1563,0.044629,0.40448,0.40382,0.075401,0.60043,0.61542,0.089587,0.74744,0.76828,0.095349,0.00041433,0.00033062,0.0037858,-0.0086977,7.5763e-05,-0.025819,0.0012611,0.00099714,0.0054131,-0.010552,0.003586,-0.035448,0.0025741,0.0020375,0.0065397,-0.012268,0.0084623,-0.047034,0,0,0,-0.0069606,-0.0078885,0,1.943e-07,1.5745e-07,1.8639e-06,-0.0092832,-0.010138,-0.011751,4.2253e-05,3.3486e-05,0.00023576,-0.011461,-0.01013,-0.021622,0,0,0,-0.0072673,0.0014299,0,6.9452e-06,4.9577e-06,6.0873e-05,-0.009449,0.0032576,-0.020296,9.097e-05,6.5633e-05,0.00048369,-0.01141,0.0050285,-0.023705,0.00041433,0.00033062,0.067992,0.0060581,0.022414,-0.025819,0.0012553,0.00099302,0.065404,0.0079064,0.03225,-0.035234,0.0024725,0.0019613,0.063686,0.0098342,0.042707,-0.045048,0.36084,74,74,40,1054,3,3,3,0.645
30,-0.0025858,0.45268,0.45472,-0.73814,0.44356,-0.85376,0.15664,-0.70525,6.2795,-0.12303,3.206,0.0020552,3.9796,5.497,0.5231,7.8729,0.0075123,0.73818,2.2982,1.4007,0.9298,0.64762,0.074955,0.094863,0.12896,0.11407,0.10229,0.089309,0.39555,0.23712,0.10517,1.7325e-06,0.0055441,0.011199,0.020143,0.11818,0.49735,0.46327,0.23487,0.46327,1.7214,1.9591,0.58316,0.96973,0.46509,71,26.704,840,10859,6.7317,51.443,22680,6561,4806,0.91088,0.94201,0.1004,0.065798,0.066766,0.60365,17058,11639,0.00088277,0.0004992,0,0.048919,0,0.066425,0.0040562,0.0084671,0.010539,0.032637,0.26303,0.10075,0.094075,0.21894,0.35227,0.27582,0.25263,0.38149,0.16007,0.24497,0.38704,0.16019,22.846,7.4471,6841,10679,8881.8,0.19528,0.1919,0.053089,0.58367,0.59191,0.083157,0.77967,0.78985,0.078699,0.87586,0.88664,0.07076,0.92486,0.9327,0.063884,0.0066497,0.0067237,0.032899,0.012287,0.016497,0.0054874,0.014648,0.014181,0.034045,0.017185,0.024759,-0.020289,0.024692,0.023283,0.033969,0.021254,0.032795,-0.044572,0.00058778,0.00053118,0.0067208,-0.0023721,-0.0065895,-0.014296,0.001841,0.001801,0.0095623,-0.0016289,-0.007768,-0.0056786,0.004396,0.0044007,0.013281,0.00047389,-0.0063334,0.00040059,0.0046418,0.0045967,0.044887,0.013663,0.019904,-0.0045104,0.011984,0.011645,0.056877,0.024421,0.033194,-0.016845,0.020971,0.019986,0.060374,0.032408,0.043315,-0.033753,0.0014201,0.0015958,0.12618,0.020781,0.033648,0.028408,0.0032486,0.0036267,0.091647,0.020034,0.041845,0.034665,0.0056125,0.0060745,0.078276,0.021585,0.05143,0.031117,0.41983,74,74,40,1054,3,3,3,0.645
30,-0.0036134,0.6072,0.60544,-0.62768,0.60062,-0.68368,0.089215,-0.042939,9.7084,0.028669,3.2181,0.0030632,5.901,6.8355,0.74387,10.129,0.0096653,0.6277,2.9436,1.814,1.1928,0.86103,0.071355,0.071154,0.1003,0.10326,0.10212,0.082478,0.46934,0.25425,0.020819,0.034851,0.011017,0.00032762,0.019952,0.0030286,0.34424,0.44691,0.23127,0.44691,0.83671,1.5852,0.35481,1.2029,0.72144,39,106.38,2764,2.1212e+05,5.1957,29.657,74628,25758,4833,0.90707,0.93453,0.29779,0.20409,0.19213,0.8565,42755,25547,0.00091941,0.00040447,0,0.052671,0,0.058787,0.017326,0.016855,0.024686,0.0068555,0.046657,0.20579,0.061016,0.21267,0.37148,0.30131,0.21284,0.43736,0.29435,0.21203,0.44778,0.2895,32.733,8.1353,10275,20128,18473,0.088597,0.083547,0.041938,0.28226,0.27212,0.070021,0.50782,0.49673,0.08925,0.6921,0.68718,0.097358,0.81009,0.81231,0.09743,0.00066367,0.0005757,0.0057172,-0.0074507,0.0036438,-0.027231,0.0025036,0.0021466,0.010132,-0.0071735,0.0082556,-0.044662,0.005723,0.0048599,0.013708,-0.0061975,0.013592,-0.061581,0.00012772,0.00011176,0.0025428,-0.0059698,-0.004898,-0.01134,0.00047809,0.00041292,0.0043239,-0.0072298,-0.0065256,-0.018048,0.0012567,0.0010725,0.0066109,-0.0078434,-0.0061222,-0.029541,0.00019321,0.00015835,0.0032532,-0.0060041,0.003134,-0.034326,0.0010009,0.00082526,0.0082711,-0.0057208,0.007428,-0.040816,0.0026343,0.002184,0.013205,-0.004489,0.011873,-0.049729,0.00034274,0.00030558,0.053027,0.0043355,0.024532,-0.014248,0.0011997,0.0010605,0.058932,0.0071448,0.033428,-0.024285,0.002505,0.0021828,0.060832,0.0097397,0.041465,-0.034038,0.4308,74,74,40,1054,3,3,3,0.645
30,-0.0019946,0.50877,0.50839,-0.7008,0.50583,-0.75057,0.071017,1.3463,8.054,0.088121,3.1907,0.0025938,3.9937,5.1633,0.59712,7.6103,0.0072617,0.70105,2.4358,1.5036,1.0835,0.75371,0.07339,0.090291,0.12046,0.10943,0.081311,0.09114,0.43397,0.25043,0.07893,0.0034799,0.012704,0.13474,0.012201,0.050189,0.54268,0.361,0.19333,0.361,0.39468,1.2888,0.28104,1.051,0.5473,55,62.255,2877,1.4968e+05,7.096,51.88,77679,6102,5373,0.90876,0.93304,0.13912,0.10363,0.060943,0.46157,24989,11851,0.001359,0.00046733,0,0.053481,0,0.050662,0.0065289,0.0036514,0.015214,0.021691,0.85287,0.6856,0.13766,0.24901,0.33713,0.23539,0.32373,0.3142,0.092029,0.36139,0.31496,0.072372,15.365,6.3556,14818,37331,36375,0.34534,0.33832,0.14664,0.71671,0.75387,0.15949,0.87056,0.90075,0.13725,0.93377,0.9513,0.11783,0.96537,0.9752,0.10415,0.001153,0.00082616,0.0089099,-0.0052124,0.0035458,-0.027198,0.0026571,0.0019355,0.0096457,-0.0064279,0.0057024,-0.03877,0.0054251,0.0041283,0.011657,-0.0063739,0.0096674,-0.04699,0.00013788,9.3193e-05,0.0024623,-0.0055886,-0.0049943,-0.013463,0.00053145,0.0004079,0.0043115,-0.0066518,-0.0063437,-0.017226,0.0017639,0.0015288,0.0083236,-0.0061251,-0.0050855,-0.017973,0.0010064,0.00072746,0.0152,-0.0015092,0.0051181,-0.024336,0.002111,0.0015181,0.015648,-0.0017695,0.0075273,-0.034581,0.0036034,0.002562,0.016203,-0.0018739,0.0097718,-0.042928,8.7348e-06,5.5044e-06,0.0012122,-0.0027077,0.01645,-0.012151,6.7153e-05,4.2318e-05,0.0029589,-0.0033951,0.022666,-0.012151,0.00020647,0.0001308,0.0044976,-0.0039964,0.028747,-0.015086,0.56691,74,74,40,1054,3,3,3,0.645
30,-0.0024794,0.40193,0.40682,-0.76993,0.39114,-0.61879,-0.1963,-2.0019,10.988,-0.17203,3.0288,0.0082173,4.4459,6.5612,0.45828,9.8094,0.0093602,0.77048,1.6597,1.1258,0.8746,0.7,0.10501,0.11268,0.14698,0.096146,0.064175,0.055782,0.41922,0.37948,0.13634,0.0052545,0.11579,0.75847,0.89401,0.12456,2.4139,0.26539,0.25832,0.26539,0.50338,1.0355,0.34604,0.89593,0.36948,48,58.646,1536,61808,5.0552,28.376,41472,22761,4563,0.90812,0.93714,0.24034,0.17676,0.12454,0.83407,44814,22436,0.00069737,0.00039808,0,0.076224,0,0.087376,0.0058544,0.0061046,0.0023816,0.026601,0.52003,1.3235,0.9538,0.2977,0.33318,0.2573,0.50263,0.31297,0.13326,0.59762,0.26574,0.10052,50.648,6.947,20360,41475,40415,0.046464,0.032405,0.01569,0.14553,0.11547,0.025754,0.26651,0.22506,0.033414,0.37522,0.31716,0.037653,0.47896,0.40219,0.041093,0.0010575,0.00069451,0.006499,-0.0049576,0.0067376,-0.04051,0.0024207,0.0016134,0.0069882,-0.0062116,0.010381,-0.05125,0.0041177,0.0027764,0.007036,-0.0076671,0.014399,-0.05982,0.00039266,0.00025343,0.0055768,-0.0036565,-0.0015705,-0.02334,0.00066927,0.00043656,0.0043179,-0.0054881,-0.0039983,-0.025361,0.00084028,0.00055069,0.0031533,-0.0075496,-0.0048696,-0.026082,0.00046481,0.00030817,0.0055829,-0.0038152,0.0041801,-0.024835,0.00091782,0.00060793,0.0054104,-0.0050591,0.0072086,-0.029583,0.0014012,0.00092849,0.0050105,-0.0064663,0.0097381,-0.035309,0.00020008,0.00013291,0.022082,0.0010618,0.025505,-0.029889,0.0008473,0.00057763,0.02969,0.0032032,0.035878,-0.036622,0.0020334,0.0014045,0.035226,0.0057879,0.04577,-0.04442,0.3647,74,74,40,1054,3,3,3,0.645
30,-0.0044156,0.61183,0.60924,-0.62464,0.60817,-0.59842,-0.041976,-1.1735,16.811,0.00012675,3.1012,0.0085909,9.0179,10.409,0.74911,16.376,0.015626,0.62492,2.5527,1.6988,1.2295,0.92463,0.081753,0.073251,0.1135,0.090659,0.079411,0.072327,0.48909,0.32616,0.025872,0.0028524,0.061413,0.098142,0.091977,0.00017954,0.6066,0.45279,0.36189,0.45279,0.69107,0.72248,0.37211,1.203,0.70953,65,69.215,4120,2.5969e+05,7.8542,62.797,1.1124e+05,3834,2808,0.90841,0.93601,0.3155,0.22167,0.23521,0.77679,34794,18299,0.0011925,0.0005873,0,0.041322,0,0.045143,0.0037014,0.015139,0.00011697,0.0066423,1.2012,1.6329,0.46566,0.21097,0.37294,0.27171,0.22705,0.44895,0.18248,0.22716,0.46415,0.17578,17.75,7.3361,8605.2,19764,18046,0.21029,0.19782,0.10894,0.59619,0.612,0.16187,0.77676,0.78717,0.14941,0.85943,0.86178,0.13231,0.90381,0.90184,0.11897,0.0077875,0.0079352,0.073421,0.021787,0.025595,0.0076158,0.017956,0.018494,0.079527,0.032406,0.038551,0.016037,0.031389,0.032482,0.082286,0.04222,0.051735,0.023261,0.0012858,0.0012136,0.028016,0.0011944,0.004715,-0.0097043,0.003501,0.0034101,0.034653,0.0042057,0.0062871,-0.0063286,0.0071245,0.0070824,0.041017,0.0083692,0.010417,-0.0019334,0.0050314,0.0051716,0.092716,0.021182,0.020336,0.008609,0.010749,0.011133,0.097212,0.029419,0.030754,0.014367,0.017865,0.018421,0.098013,0.036581,0.039668,0.015321,0.0014703,0.0015499,0.24896,0.029988,0.041688,0.012565,0.0046754,0.0049669,0.25135,0.041978,0.059214,0.018448,0.0094975,0.010132,0.25242,0.054688,0.077418,0.025584,0.51341,74,74,40,1054,3,3,3,0.645
30,-0.0031178,0.4203,0.4177,-0.76283,0.41415,-0.69253,-0.09215,0.19096,3.6611,0.059155,3.3064,0.00011705,5.7886,8.401,0.47387,12.451,0.011881,0.76284,1.762,1.1645,0.87674,0.68506,0.081238,0.088177,0.18538,0.10109,0.071644,0.061304,0.41117,0.25383,0.042316,0.067902,0.072832,0.44104,0.5611,0.14655,1.5856,0.36626,0.17185,0.36626,1.0468,1.7902,0.46384,0.91618,0.41563,47,123.17,5322,5.9782e+05,6.6147,44.845,1.4369e+05,4752,4104,0.90364,0.92817,0.34669,0.25645,0.22853,0.8069,67081,33247,0.00080367,0.00044058,0,0.060546,0,0.050756,0.0087424,0.006112,0.0059618,0.015067,0.86831,0.277,0.79092,0.17081,0.37133,0.348,0.12756,0.41788,0.39916,0.10884,0.42718,0.42233,41.773,9.396,17288,53296,52255,0.074712,0.056311,0.04924,0.25692,0.22766,0.088742,0.44498,0.44108,0.10889,0.62315,0.63765,0.12205,0.76658,0.78559,0.12837,0.0026868,0.0022454,0.032227,0.00067981,0.0074629,-0.033992,0.0071093,0.0058424,0.040058,0.0049633,0.013382,-0.051187,0.014042,0.011371,0.046832,0.010523,0.020171,-0.071307,0.00055445,0.0005176,0.015369,-0.00397,-0.002743,-0.006392,0.001486,0.0013167,0.018712,-0.0041246,-0.0033851,-0.01482,0.0028339,0.0024442,0.020756,-0.0042516,-0.0029251,-0.022747,0.001945,0.0015772,0.045598,0.0041403,0.0070885,-0.03446,0.0050883,0.0042016,0.058543,0.010023,0.013724,-0.041606,0.0094231,0.0077566,0.065769,0.015504,0.019567,-0.052631,0.00018736,0.00015062,0.04036,0.0011699,0.022,-0.017514,0.0010547,0.00083521,0.07213,0.0068383,0.030869,-0.029606,0.0031417,0.0024969,0.10622,0.016127,0.041657,-0.041875,0.481,74,74,40,1054,3,3,3,0.645
30,-0.003345,0.15569,0.16014,-0.91636,0.14413,-1.206,0.31613,0.04419,2.5585,0.0021745,3.3679,0.0001685,2.7056,6.6183,0.16681,8.7618,0.0083605,0.9165,1.0114,0.60919,0.46113,0.33645,0.13289,0.11551,0.23845,0.12682,0.064262,0.065156,0.25691,0.36264,0.052082,0.074818,0.10344,1.9008,1.3377,3.3501,7.1816,0.09441,0.091843,0.09441,0.42943,1.521,0.289,0.5196,0.13362,42,135.12,2635,2.1847e+05,4.3218,21.764,71145,40446,17307,0.89551,0.91699,0.43119,0.35385,0.22497,0.90092,75161,38704,0.001043,0.00051627,0,0.098433,0,0.06749,0.0027393,0.020405,0.0033013,0.021355,0.18939,0.8212,0.3791,0.17634,0.43927,0.30883,0.14718,0.53691,0.30909,0.14632,0.55957,0.29016,66.533,8.3383,22433,93630,93002,0.016001,0.010484,0.0099664,0.22481,0.19945,0.073383,0.52994,0.51397,0.12255,0.76267,0.77143,0.14117,0.90542,0.92254,0.14329,3.0994e-05,1.7235e-05,0.00035132,-0.011466,-0.0037067,-0.017421,0.00024659,0.00013778,0.0013131,-0.014667,-0.0032417,-0.025027,0.00096052,0.00055505,0.0030274,-0.01707,-0.0016776,-0.036986,0,0,0,-0.0077751,-0.0067445,0,0,0,0,-0.01037,-0.0091995,0,4.3034e-07,2.3754e-07,2.9787e-06,-0.012932,-0.010351,-0.010851,1.2883e-05,6.91e-06,0.00028543,-0.0080372,-0.0015548,-0.015459,0.00014917,8.117e-05,0.001622,-0.0099867,-0.00068193,-0.023053,0.00066277,0.00037185,0.0043717,-0.011041,0.00029182,-0.033554,1.811e-05,1.0325e-05,0.0036869,-0.0030623,0.0097112,-0.011301,0.00010015,5.819e-05,0.006473,-0.0037714,0.013431,-0.013178,0.00033229,0.00020306,0.010618,-0.0039831,0.018107,-0.019224,0.37446,74,74,40,1054,3,3,3,0.645
30,-0.0027881,0.45109,0.44917,-0.74189,0.44337,-0.82616,0.11358,1.6826,9.9308,0.11254,3.1755,0.0036747,4.694,6.5301,0.51572,10.116,0.0096526,0.7419,2.2425,1.4955,0.97765,0.67807,0.080119,0.097686,0.12633,0.092893,0.10557,0.090829,0.40657,0.27178,0.10339,0.0010053,0.11051,0.0044069,0.013869,0.098473,0.60343,0.32002,0.27702,0.32002,1.3107,1.3381,0.44394,0.96075,0.41616,34,204.09,6497,1.2322e+06,5.5624,31.972,1.7542e+05,4509,3105,0.90628,0.92921,0.29009,0.20802,0.22462,0.64314,31107,16933,0.0014436,0.00071496,0,0.051919,0,0.048146,0.015323,0.013607,0.011494,0.0028685,0.47439,0.71448,0.17741,0.22822,0.36367,0.24526,0.27141,0.38957,0.14951,0.27781,0.40178,0.13812,16.525,6.6221,10109,32131,30498,0.27367,0.26893,0.20249,0.65191,0.67409,0.25278,0.82635,0.84686,0.22701,0.91331,0.92572,0.20082,0.94972,0.95781,0.17854,0.0081886,0.0093378,0.11026,0.028176,0.031682,0.051301,0.018608,0.021579,0.1177,0.040957,0.047731,0.077925,0.032858,0.038724,0.12302,0.054073,0.065059,0.11079,0.00065419,0.00070848,0.020358,-0.003444,-0.0038237,0.0096944,0.0018427,0.0018492,0.026049,-0.0027092,-0.0035431,0.00057357,0.0039868,0.0038987,0.032781,-0.00059873,-0.00043149,-0.0050351,0.006056,0.0064363,0.15938,0.032437,0.032119,0.019987,0.014313,0.016297,0.18487,0.050898,0.053738,0.059857,0.025674,0.030811,0.20117,0.069377,0.075942,0.1099,0.0014784,0.0021931,0.35751,0.036245,0.057891,0.0828,0.0039225,0.0052205,0.30116,0.041455,0.064256,0.076256,0.0072048,0.0089015,0.27348,0.048178,0.073513,0.068106,0.63193,74,74,40,1054,3,3,3,0.645
30,-0.0022374,0.61012,0.61139,-0.62292,0.60319,-0.55078,-0.11581,-0.95548,6.0945,-0.052924,3.2488,0.0011141,5.5748,6.4168,0.75333,9.1981,0.0087768,0.62296,2.3914,1.5132,1.1622,0.85706,0.055135,0.071023,0.14679,0.10624,0.066593,0.078363,0.47586,0.11015,0.012245,0.028845,0.0044407,0.34135,0.058645,0.0039461,0.55962,0.18913,0.47291,0.47291,0.45404,0.50615,0.24674,1.2024,0.68937,31,74.903,1892,1.1361e+05,5.2043,28.4,51084,4185,2727,0.91052,0.94114,0.16333,0.10643,0.091708,0.8222,33914,19405,0.00062175,0.00034126,0,0.051527,0,0.06645,0.012128,0.011555,0.0010342,0.035195,0.20041,0.52281,0.31984,0.18612,0.39326,0.31217,0.15493,0.55146,0.28169,0.15375,0.55916,0.27694,35.927,8.4287,11036,16447,14310,0.033225,0.028662,0.0090784,0.18274,0.17236,0.026167,0.4099,0.39257,0.041584,0.56121,0.53836,0.045571,0.65258,0.63283,0.045305,0.002406,0.0023507,0.011964,-0.00040861,0.0081996,-0.011164,0.0085696,0.0084017,0.020019,0.0058908,0.019766,-0.012822,0.017781,0.017417,0.024585,0.011838,0.031575,-0.017041,0,0,0,-0.0051073,-0.0086345,0,0,0,0,-0.006812,-0.0099892,0,7.54e-06,6.181e-06,2.2896e-05,-0.0084803,-0.0091512,-0.0247,0.00053726,0.00049818,0.0052218,-0.0031297,0.0065976,-0.013151,0.0014648,0.0013125,0.0069871,-0.0031093,0.012769,-0.02531,0.0025802,0.0022624,0.007466,-0.0035004,0.018139,-0.035303,0.0018687,0.0018525,0.16689,0.028145,0.048631,-0.0040813,0.0071088,0.0070925,0.20156,0.04775,0.071283,-0.0013978,0.015273,0.015213,0.21409,0.066019,0.092872,-0.003072,0.37589,74,74,40,1054,3,3,3,0.645
30,-0.0052749,0.4571,0.45742,-0.73631,0.4411,-0.59724,-0.18887,-0.38365,6.0557,-0.0092842,3.2852,0.00048179,7.2719,10.009,0.52688,15.042,0.014353,0.73631,1.7834,1.2183,0.93159,0.73471,0.068449,0.10376,0.17164,0.093726,0.068523,0.060169,0.43373,0.18033,0.12496,0.045126,0.12439,0.56331,0.61401,0.086767,1.7389,0.13199,0.21254,0.21254,0.92031,0.94756,0.33823,0.98489,0.4851,29,118.52,3304,3.7336e+05,5.0996,27.017,89208,1566,999,0.90925,0.93925,0.28012,0.19028,0.18361,0.9203,30944,21773,0.00074882,0.00039596,0,0.068705,0,0.089219,0.0031166,0.029071,0.012266,0.026454,2.3853,2.7562,0.62048,0.18927,0.2837,0.42393,0.14604,0.14896,0.69384,0.13676,0.15281,0.70166,47.462,11.446,10956,19569,17022,0.02257,0.017962,0.0083876,0.065321,0.053606,0.012722,0.11391,0.09547,0.015718,0.1803,0.15322,0.019911,0.33484,0.29574,0.031616,0.00032169,0.00029485,0.0021756,-0.0077847,-0.0069122,-0.012573,0.0014172,0.0013012,0.0045025,-0.0087096,-0.0051436,-0.019268,0.0039912,0.0036228,0.0075055,-0.0082523,-0.00091502,-0.031859,0,0,0,-0.00597,-0.010386,0,1.5276e-06,1.1592e-06,1.0847e-05,-0.0079577,-0.013353,-0.015945,4.5883e-05,3.467e-05,0.00018949,-0.0098212,-0.014262,-0.020097,1.7404e-05,1.3351e-05,0.00023006,-0.0061496,-0.004529,-0.030694,0.00028895,0.00022556,0.0018746,-0.0072397,-0.0034034,-0.040047,0.0014307,0.0011394,0.0056305,-0.0067214,-0.00070554,-0.050054,0.00030429,0.0002815,0.036959,0.0030998,0.016898,-0.010693,0.0011278,0.0010754,0.043492,0.0057126,0.024252,-0.0090181,0.0025383,0.0024683,0.048393,0.0087879,0.032611,-0.0070029,0.36098,74,74,40,1054,3,3,3,0.645
30,-0.056315,0.9375,0.95188,0.2173,0.77855,0.31002,0.42672,-0.10502,2.6611,-0.030077,3.3596,8.4788e-05,4.5866,2.9382,2.4323,3.5895,0.0034251,-0.2173,8.2966,5.7477,4.123,3.0092,0.021734,0.031179,0.045962,0.041027,0.047459,0.054756,0.75788,0.47296,1.0617,2.7663,3.5052,1.6226,0.57035,0.10419,10.103,0.076751,0.091243,0.091243,0.20831,0.24725,0.10729,3.3346,5.4355,76,60.947,3129,1.3428e+05,7.8715,65.468,84483,21141,3645,0.90319,0.92127,0.21837,0.17596,0.08201,0.56798,27661,15044,0.0010572,0.0004831,0,0.1172,0,0.086515,0.057146,0.096026,0.070666,0.12598,0.52886,0.6306,0.067315,0.24144,0.3399,0.25559,0.2893,0.34675,0.17905,0.29213,0.33409,0.1732,16.39,6.901,13508,55553,55093,0.16753,0.1576,0.096112,0.34073,0.32579,0.10245,0.47128,0.45348,0.10039,0.58858,0.57129,0.10035,0.69281,0.68676,0.10099,0.0077685,0.0071424,0.08111,0.022875,0.017621,-0.01594,0.016429,0.015485,0.080582,0.029992,0.026011,-0.014778,0.027247,0.026339,0.079103,0.036206,0.034676,-0.010651,0.0057251,0.0055403,0.13815,0.031338,0.018913,-0.0052416,0.011228,0.01134,0.12307,0.036152,0.022943,0.0020812,0.017986,0.018857,0.11467,0.041165,0.029034,0.012343,0.00065685,0.00042263,0.013404,-0.0038519,-0.0011106,-0.021784,0.0016033,0.0010751,0.016058,-0.0040072,0.00035048,-0.027744,0.0034967,0.0025625,0.021245,-0.0024906,0.0026323,-0.033336,0.0013866,0.0011795,0.26001,0.029608,0.033778,-0.01488,0.0035988,0.0030706,0.21425,0.032974,0.04089,-0.017861,0.0057971,0.0049394,0.17062,0.032818,0.045853,-0.021157,0.61365,74,74,40,1054,3,3,3,0.645
30,-0.0040639,0.53037,0.52567,-0.68835,0.52421,-0.72461,0.052671,-0.0050301,3.3407,0.0045515,3.3359,9.7868e-06,3.4755,4.4006,0.62257,5.6067,0.0053499,0.6884,2.087,1.4593,1.1298,0.77535,0.048457,0.10179,0.16984,0.083143,0.063284,0.094266,0.43923,0.049808,0.14218,0.068173,0.19509,0.49816,0.0023683,0.031034,0.98681,0.17364,0.21346,0.21346,0.2659,0.28771,0.17039,1.0759,0.5737,43,75.116,2998,2.0613e+05,6.3054,40.85,80946,2376,1917,0.90682,0.93298,0.30816,0.23921,0.15688,0.84551,28009,14458,0.0018125,0.00063243,0,0.05816,0,0.058424,0.011947,0.060114,0.011474,0.078756,0.49606,0.22071,0.42294,0.23257,0.36684,0.24564,0.28097,0.41988,0.12,0.27883,0.42474,0.094443,30.512,6.6322,25058,65711,64833,0.22788,0.24114,0.092757,0.60073,0.65224,0.12815,0.76848,0.82161,0.11614,0.84315,0.88289,0.10199,0.87733,0.90995,0.090736,0.015751,0.021752,0.11668,0.048503,0.057728,0.12987,0.034962,0.048368,0.12167,0.067491,0.082049,0.17806,0.063336,0.086928,0.13046,0.09093,0.10903,0.229,0.010635,0.017474,0.18207,0.054204,0.062727,0.17256,0.021822,0.036798,0.16971,0.066823,0.079668,0.24456,0.038183,0.063866,0.17272,0.085002,0.10168,0.31396,0.0027695,0.0023814,0.040099,0.0073729,0.012554,-0.022565,0.0078783,0.0072535,0.055982,0.01679,0.024517,-0.018324,0.016686,0.016119,0.071928,0.029515,0.037639,-0.010824,0.0023463,0.0018966,0.31215,0.043989,0.043607,-0.029284,0.0065231,0.0056063,0.27553,0.053324,0.056157,-0.028934,0.012194,0.01097,0.25464,0.063517,0.069082,-0.0262,0.43163,74,74,40,1054,3,3,3,0.645
30,-0.0024214,0.73029,0.73438,-0.51471,0.72068,-0.58501,0.13658,1.6253,11.901,0.032678,3.2284,0.0027786,6.7353,6.8339,0.96953,10.93,0.01043,0.51474,4.5275,2.5442,1.6152,1.0506,0.044562,0.050045,0.082225,0.10174,0.10072,0.1058,0.5149,0.050407,0.02692,0.14609,0.0026641,8.8451e-06,0.021188,0.0059725,0.25325,0.35756,0.29357,0.35756,0.59844,0.62272,0.32718,1.4656,1.0698,47,38.17,1359,38702,6.5105,43.917,36693,3105,2241,0.90934,0.93876,0.17948,0.14161,0.048288,0.78708,40126,16457,0.00072475,0.0004074,2,0.33783,2,0.21006,0.17303,0.50913,0.27559,0.81892,0.24272,0.1646,0.34975,0.19587,0.3635,0.32744,0.20579,0.41287,0.31487,0.14912,0.41053,0.39293,29.548,8.841,13233,29743,28876,0.061355,0.036712,0.01421,0.2565,0.1654,0.031132,0.44014,0.32294,0.037847,0.5948,0.48706,0.040937,0.70814,0.62609,0.04167,0.0045857,0.0028912,0.019328,0.0056371,0.0090964,-0.04926,0.0080457,0.0050719,0.01593,0.0045193,0.011902,-0.06025,0.011535,0.0073647,0.013518,0.0030145,0.015767,-0.0683,0.00012524,7.2828e-05,0.0012199,-0.0041627,-0.0036058,-0.020716,0.0006716,0.00039159,0.0029718,-0.0045277,-0.0053491,-0.027291,0.0016405,0.00097712,0.0042223,-0.0047348,-0.0056602,-0.032884,0.0032648,0.0020604,0.026896,0.0074063,0.0099025,-0.039056,0.0049333,0.0030187,0.019945,0.0055077,0.013077,-0.047657,0.0064374,0.0038732,0.015788,0.0037236,0.015871,-0.054215,0.0011957,0.00075799,0.090507,0.015799,0.022719,-0.032738,0.0031112,0.0020534,0.074771,0.017568,0.030627,-0.037373,0.005251,0.0035831,0.062388,0.018376,0.039335,-0.042431,0.38711,74,74,40,1054,3,3,3,0.645
30,-0.0030409,0.57691,0.57183,-0.65393,0.57047,-0.68585,0.048809,0.9637,6.4046,0.10448,3.2084,0.0015756,5.2767,6.3445,0.69041,9.4241,0.0089925,0.65428,2.6957,1.7856,1.2306,0.83018,0.073321,0.079892,0.11001,0.089292,0.09022,0.099082,0.45818,0.25086,0.041334,0.014898,0.10842,0.041719,0.00033423,0.013358,0.47093,0.10374,0.37314,0.37314,0.65502,1.261,0.38214,1.1487,0.65997,87,34.172,1130,21859,6.0691,41.106,30510,21006,7128,0.91026,0.93852,0.034389,0.023235,0.0057576,0.17685,17462,11493,0.00099823,0.00045543,0,0.060253,0,0.057116,0.0021789,0.044844,0.0011754,0.0827,0.3101,0.50229,0.27171,0.23251,0.32581,0.25361,0.29455,0.30092,0.10833,0.30272,0.29453,0.10059,11.448,6.8473,8756.6,18208,16725,0.39013,0.4009,0.16311,0.71088,0.72007,0.15576,0.82417,0.82273,0.12794,0.89285,0.89416,0.11094,0.9358,0.94169,0.099411,0.0090034,0.01049,0.068506,0.024052,0.026052,0.063312,0.016521,0.018786,0.059053,0.025722,0.03156,0.06468,0.024582,0.027445,0.052008,0.026261,0.036679,0.064474,0.00019923,0.00017146,0.0035035,-0.0051911,-0.0066803,-0.0071366,0.00054207,0.00049564,0.0043302,-0.0065624,-0.0080107,-0.0089811,0.0020526,0.0020226,0.0095373,-0.0053458,-0.005748,-0.0034263,0.0083765,0.0099607,0.12457,0.036006,0.035339,0.069655,0.014936,0.017442,0.10901,0.039997,0.04316,0.074368,0.02108,0.02432,0.093337,0.040595,0.047617,0.076916,0.00042765,0.0003576,0.05844,0.0057868,0.024526,-0.01816,0.0012479,0.0010297,0.054141,0.0071341,0.030573,-0.025339,0.0023307,0.0019093,0.049992,0.0081476,0.037027,-0.032614,0.59625,74,74,40,1054,3,3,3,0.645
30,-0.0058464,0.46678,0.45675,-0.73676,0.45443,-0.78932,0.071341,0.10037,3.391,0.0096481,3.3265,7.7152e-06,4.643,6.3983,0.52558,8.6832,0.0082855,0.73691,2.2373,1.6166,1.0758,0.69616,0.095934,0.081246,0.12158,0.074358,0.10102,0.10941,0.41646,0.35869,0.021958,0.0055202,0.46201,0.024415,0.001402,0.098905,0.97291,0.17704,0.20189,0.20189,0.3911,0.46587,0.27587,0.976,0.47686,29,194.38,4751,7.8305e+05,4.9344,25.83,1.2828e+05,19629,2079,0.90824,0.93452,0.47518,0.3493,0.34445,0.9523,43669,27852,0.0010761,0.00049943,0,0.056032,0,0.063172,0.004112,0.010416,0.0071141,0.005805,0.2913,1.2862,0.52337,0.19635,0.39292,0.31817,0.18431,0.48891,0.30158,0.18778,0.50323,0.28864,66.393,8.5907,16452,39857,38431,0.041835,0.035542,0.024571,0.25689,0.26969,0.079071,0.48017,0.51743,0.10471,0.65306,0.69562,0.11398,0.78108,0.81502,0.11656,0.0022179,0.001947,0.023707,-0.0014367,0.0051574,-0.029966,0.0069526,0.0060517,0.034911,0.0042456,0.01169,-0.042494,0.013493,0.011648,0.040101,0.0088046,0.017964,-0.056756,7.5528e-05,5.1536e-05,0.0018658,-0.0070257,-0.0040268,-0.012902,0.00022824,0.00016178,0.0025612,-0.0091132,-0.0062695,-0.017911,0.00063552,0.00046829,0.0041481,-0.010633,-0.0068963,-0.028537,0.00028207,0.00019762,0.0058929,-0.006168,0.0013083,-0.021857,0.00072657,0.00051634,0.0074496,-0.0074526,0.0034695,-0.03011,0.0014261,0.0010356,0.0088704,-0.0085062,0.0048369,-0.037679,0.0018603,0.0016978,0.35712,0.041369,0.036954,-0.020388,0.0059978,0.0053736,0.36555,0.058767,0.05209,-0.031677,0.011431,0.010144,0.34443,0.071446,0.065838,-0.042424,0.36701,74,74,40,1054,3,3,3,0.645
30,-0.0055435,0.59374,0.59447,-0.63637,0.57915,-0.53423,-0.16051,-0.8016,7.2753,-0.028476,3.2545,0.0014722,6.1379,7.1944,0.7265,10.396,0.00992,0.63639,2.4679,1.6741,1.259,0.9128,0.098039,0.076892,0.10611,0.086487,0.069408,0.080951,0.48211,0.3733,0.026181,0.046412,0.15734,0.39771,0.065345,0.011279,1.0776,0.233,0.14482,0.233,0.59237,0.97964,0.28672,1.1738,0.63253,72,41.181,1971,54226,7.9129,65.516,53217,6858,5346,0.91236,0.94211,0.2452,0.16089,0.20039,0.72814,26811,16562,0.00092892,0.00049015,0,0.060423,0,0.070197,0.0085162,0.011157,0.02204,0.055125,0.050463,0.38409,0.0093776,0.22937,0.36508,0.26123,0.30046,0.42482,0.12218,0.30731,0.42497,0.11375,23.842,7.0532,9552.1,18158,16701,0.20768,0.20239,0.084369,0.49866,0.50422,0.10617,0.68885,0.70081,0.10391,0.81006,0.82183,0.097798,0.88657,0.89651,0.091513,0.0022512,0.0019627,0.016644,-0.0010677,0.0082616,-0.035268,0.005707,0.0051178,0.019822,0.00067402,0.014233,-0.039608,0.010953,0.010092,0.022516,0.0030333,0.02199,-0.039343,0.0010388,0.00089293,0.01775,-0.00034742,0.0032132,-0.022114,0.0019893,0.0017622,0.015441,-0.0014871,0.0016758,-0.02392,0.0034885,0.0031444,0.01575,-0.0016839,0.0024838,-0.02725,0.00080062,0.00071228,0.01157,-0.0025076,0.0030167,-0.022324,0.0023441,0.0021164,0.016625,-0.00098202,0.0079883,-0.024736,0.0046424,0.0043155,0.019973,0.00065494,0.013692,-0.023,0.00041173,0.0003575,0.054671,0.0053853,0.02162,-0.019277,0.0013811,0.0012467,0.058225,0.0081984,0.031248,-0.019463,0.0029331,0.0027366,0.06113,0.011414,0.041961,-0.017789,0.46794,74,74,40,1054,3,3,3,0.645
30,-0.0038983,0.43263,0.42935,-0.75514,0.42554,-0.68396,-0.09426,0.13017,3.9442,0.0055174,3.3386,5.4813e-06,5.4768,7.8237,0.48912,11.61,0.011078,0.75519,1.9772,1.2095,0.93431,0.73227,0.079733,0.11258,0.13439,0.11831,0.065284,0.061133,0.42857,0.23138,0.12982,0.0015675,0.012436,0.68291,0.65194,0.13127,1.8413,0.10295,0.19918,0.19918,0.27169,0.42027,0.17335,0.93182,0.41814,39,87.59,2538,1.637e+05,5.8238,35.575,68526,7884,5562,0.90607,0.93204,0.28264,0.22653,0.11068,0.81147,73040,23426,0.00087486,0.00045297,0,0.079197,0,0.071141,0.0023833,0.0137,0.001358,0.014003,0.29374,0.12725,0.067827,0.17869,0.38393,0.32946,0.14379,0.46078,0.35546,0.12802,0.45026,0.39623,51.958,8.8955,31394,91035,90423,0.052036,0.033838,0.020426,0.23253,0.19759,0.047836,0.46631,0.44277,0.067964,0.67547,0.66556,0.078795,0.81297,0.8224,0.081083,0.0029007,0.0030221,0.020722,0.0012923,0.0060381,0.0066193,0.0093233,0.010579,0.031288,0.0087703,0.015919,0.029996,0.019785,0.02379,0.039299,0.017528,0.028392,0.060615,0.00050923,0.00036216,0.0084075,-0.0032969,-0.0032718,-0.01899,0.0018212,0.0014973,0.013659,-0.0020297,-0.0022349,-0.018426,0.0045618,0.0043656,0.0199,0.00097786,0.0016114,-0.0063975,0.00012339,6.8973e-05,0.0017228,-0.0058012,-0.00091801,-0.011864,0.00021749,0.00012158,0.0014904,-0.0076696,-0.00032981,-0.011872,0.00026719,0.00015114,0.0011107,-0.0096483,0.00020719,-0.012429,0.0022681,0.0025909,0.291,0.041652,0.047939,0.021074,0.0074391,0.0090463,0.30303,0.060238,0.07239,0.042716,0.015201,0.01941,0.30611,0.078954,0.098551,0.07146,0.37036,74,74,40,1054,3,3,3,0.645
30,-0.001054,0.31074,0.30974,-0.83064,0.30971,-0.83797,0.0088185,0.33084,3.4556,0.045123,3.3289,4.8283e-05,2.5145,4.3188,0.33835,5.798,0.0055324,0.83066,1.5167,1.0294,0.77479,0.58017,0.10999,0.12978,0.14868,0.096808,0.071745,0.07042,0.37257,0.37354,0.18309,0.0017466,0.17065,0.56866,0.38412,0.36189,2.0437,0.15878,0.12202,0.15878,0.88031,1.1822,0.3635,0.75821,0.28667,38,173.13,2257,2.4203e+05,3.1131,11.698,60939,41499,40986,0.8982,0.92006,0.39988,0.3185,0.23231,0.80131,67188,34630,0.0013118,0.00058077,0,0.064932,0,0.05284,0.00344,0.0042706,0.00024115,0.0094864,0.67208,1.489,0.5004,0.18366,0.4345,0.29785,0.16835,0.53263,0.2799,0.16039,0.5476,0.27955,53.26,8.042,22720,93951,92704,0.030857,0.020436,0.022301,0.27758,0.27372,0.10514,0.58179,0.60636,0.15611,0.78755,0.80645,0.16914,0.8864,0.89747,0.16277,0.00050077,0.00033876,0.0065864,-0.010064,-0.0025179,-0.030768,0.0020847,0.00147,0.012881,-0.010201,-0.00038865,-0.038945,0.0051882,0.0038433,0.018974,-0.0089083,0.0032161,-0.048419,0,0,0,-0.0083952,-0.0066382,0,3.8751e-06,2.4369e-06,5.3509e-05,-0.011179,-0.0091735,-0.015307,9.1523e-05,5.8945e-05,0.00073508,-0.013658,-0.0099888,-0.019335,5.7391e-05,3.6924e-05,0.0014754,-0.0083783,-0.0028086,-0.015755,0.00039561,0.0002644,0.0049913,-0.0097207,-0.0020351,-0.025686,0.0016065,0.0011716,0.012295,-0.0088862,-0.00051637,-0.033385,0.00044338,0.00030184,0.10473,0.0080847,0.020781,-0.027762,0.001708,0.0012181,0.12809,0.014868,0.031547,-0.032818,0.003642,0.002714,0.13503,0.020692,0.041712,-0.03769,0.42886,74,74,40,1054,3,3,3,0.645
30,-0.0033089,0.76877,0.76465,-0.48438,0.76073,-0.51907,0.071628,-0.22602,5.5273,0.047531,3.2524,0.0010445,5.7313,5.6412,1.0302,8.0167,0.0076495,0.48438,3.9538,2.427,1.5753,1.0158,0.050686,0.058851,0.085514,0.090699,0.09733,0.10871,0.50821,0.11199,0.000142,0.088743,0.023563,8.9696e-05,0.038173,0.0080056,0.27071,0.12161,0.2437,0.2437,0.77324,1.0365,0.36945,1.4943,1.1004,36,84.222,2491,1.7047e+05,5.6519,33.291,67257,6507,2862,0.91121,0.94019,0.32082,0.22173,0.22577,0.89131,39497,23078,0.00069222,0.00035773,0,0.066202,0,0.091292,0.0076909,0.016855,0.011791,0.0113,0.31945,0.74124,0.63723,0.24729,0.34214,0.30045,0.39101,0.33343,0.24101,0.4281,0.32041,0.2226,44.915,8.1121,11980,21614,20228,0.02809,0.022462,0.0098678,0.13989,0.12402,0.025754,0.30646,0.28746,0.039972,0.45871,0.44503,0.047887,0.56966,0.55557,0.050846,0.0013537,0.001167,0.0086547,-0.004049,-0.00123,-0.029937,0.0044645,0.003857,0.013408,-0.0020068,0.0037049,-0.041974,0.0085731,0.0073677,0.01524,-0.00088698,0.0086731,-0.053178,0,0,0,-0.0058017,-0.0080953,0,0,0,0,-0.0077381,-0.011704,0,3.1066e-06,2.3278e-06,1.2128e-05,-0.0096435,-0.01392,-0.014282,0.00044556,0.00034153,0.0055676,-0.0039823,-0.0021881,-0.023946,0.0009902,0.00076273,0.0060725,-0.0049461,0.00016157,-0.03019,0.0016748,0.0012978,0.0062306,-0.0059891,0.0021763,-0.036261,0.00090818,0.00082548,0.10428,0.014191,0.030426,-0.018445,0.0034744,0.0030942,0.12665,0.024654,0.044332,-0.030694,0.0068952,0.0060676,0.12426,0.031276,0.05695,-0.040987,0.37432,74,74,40,1054,3,3,3,0.645
