30,-0.1244,0.89156,0.89237,0.32677,0.69848,0.47909,0.46614,0.36197,2.5263,0.14211,3.2903,0.00035495,3.876,2.3783,2.6509,2.6948,0.0025714,-0.32678,5.7207,4.3223,3.5859,3.0499,0.029984,0.041492,0.06202,0.039795,0.030714,0.029377,0.76662,0.21808,0.67509,1.93,6.2312,10.871,9.1205,0.041453,29.088,0.037239,0.15074,0.15074,0.37307,0.43451,0.20678,3.2179,5.1696,69,63.362,2071,71023,6.3682,46.811,55917,16254,13635,0.91528,0.9301,0.062752,0.050478,0.087159,0.42663,26419,16428,0.0010391,0.00043354,1,0.15574,0,0.065537,0.047205,0.29855,0.063875,0.39268,1.1126,2.1138,0.93227,0.22781,0.31338,0.23963,0.28469,0.33555,0.15414,0.27391,0.30074,0.13919,17.949,6.4699,42799,1.6438e+05,1.6403e+05,0.16445,0.16377,0.081627,0.35564,0.37624,0.092194,0.50332,0.54198,0.092352,0.60993,0.64681,0.089632,0.71216,0.73758,0.089496,0.0064702,0.0068015,0.067804,0.017371,0.018132,0.0080103,0.01621,0.01688,0.080334,0.029845,0.029376,0.0089945,0.030348,0.031225,0.089394,0.043227,0.040987,0.0081551,0.0047228,0.005215,0.12475,0.026302,0.023598,0.013049,0.010244,0.01117,0.12405,0.034772,0.029688,0.014965,0.017808,0.019006,0.12584,0.044234,0.03689,0.014092,0.00041149,0.00029802,0.0078961,-0.00551,-0.0040314,-0.013688,0.0014602,0.001074,0.013746,-0.0048743,-0.0028067,-0.018903,0.0032734,0.002462,0.018756,-0.0035654,-0.0012877,-0.023614,0.0013359,0.0012885,0.24495,0.028228,0.035405,-0.003141,0.0045675,0.0046776,0.26801,0.042803,0.050429,0.0029708,0.0095319,0.0099392,0.27611,0.057382,0.065159,0.0068927,0.56271,74,74,40,1054,3,3,3,0.645
30,-0.072203,0.9494,0.87165,-0.35711,0.75618,-0.48708,0.36396,-0.40155,2.8164,-0.24847,3.292,0.00013046,3.6923,3.2551,1.2842,4.2176,0.0040244,0.35717,4.8158,3.6767,2.7929,2.0483,0.050853,0.051968,0.052275,0.042736,0.050839,0.065705,0.68562,0.073657,0.064592,1.9833,3.3053,1.4728,0.27807,0.053004,7.2308,0.4602,0.66777,0.66777,0.49473,0.62951,0.20482,1.7798,1.5611,81,45.58,993,26231,4.372,21.927,26811,20412,19035,0.91567,0.93489,0.14696,0.10759,0.073943,0.46351,24634,14214,0.0018318,0.00061443,0,0.088427,0,0.063394,0.0095421,0.12058,0.021719,0.19312,1.1244,2.4176,1.3815,0.22036,0.28441,0.22384,0.27385,0.22456,0.11804,0.27278,0.19588,0.095261,17.037,6.0437,11491,28074,26696,0.30246,0.30704,0.13203,0.71045,0.76031,0.16196,0.84201,0.8756,0.13587,0.89766,0.91792,0.11601,0.93045,0.94274,0.10283,0.0050373,0.0040228,0.046422,0.010404,0.013245,-0.043282,0.0092157,0.0074663,0.040164,0.010076,0.016682,-0.050845,0.014579,0.01203,0.037765,0.010759,0.020823,-0.058347,0.00073537,0.00053451,0.017083,-0.0016724,0.0043116,-0.022532,0.0014925,0.0011072,0.015894,-0.002676,0.0049574,-0.02884,0.002961,0.0023101,0.018401,-0.002159,0.007192,-0.035933,0.0040658,0.0033246,0.068611,0.014688,0.009778,-0.036371,0.0078104,0.0064645,0.06466,0.017478,0.013012,-0.042809,0.012182,0.01021,0.061385,0.019791,0.015931,-0.048824,0.00023606,0.00016369,0.038063,0.0020724,0.017387,-0.022833,0.00088047,0.00061459,0.045435,0.0042316,0.023056,-0.030041,0.0018952,0.0013582,0.048276,0.0061836,0.028507,-0.036569,0.5307,74,74,40,1054,3,3,3,0.645
30,-0.004583,0.22686,0.21905,-0.8836,0.21882,-0.91197,0.032108,2.5092,19.842,0.0027746,2.9792,0.012134,4.7887,9.9203,0.23257,14.904,0.014221,0.8836,1.1532,0.79231,0.59147,0.45572,0.14509,0.1357,0.17021,0.095855,0.072178,0.060068,0.32091,0.45242,0.15328,0.0020295,0.34601,0.86444,1.2478,1.146,4.212,0.46935,0.25157,0.46935,1.3235,2.4535,0.4577,0.63287,0.059529,71,69.014,2809,1.2717e+05,6.746,50.323,75843,28431,15336,0.91631,0.93618,0.21231,0.14968,0.15851,0.5636,32369,18262,0.0014951,0.00059423,0,0.043449,0,0.048406,0.0049203,0.0054111,0.0086666,0.020123,1.4121,2.8996,1.5715,0.23121,0.32253,0.22092,0.29027,0.32496,0.11911,0.29949,0.32993,0.1149,20.94,5.9647,10944,27391,25908,0.2602,0.26114,0.13662,0.6638,0.69523,0.18203,0.8609,0.87995,0.1671,0.94846,0.95715,0.14744,0.98265,0.98596,0.13063,0.0024653,0.0022109,0.027329,-0.00012372,0.0069722,-0.022916,0.0069236,0.0063015,0.036297,0.0046408,0.012844,-0.028927,0.014133,0.013032,0.044039,0.010905,0.020687,-0.033472,0.00011354,8.9145e-05,0.0031726,-0.0063474,-0.00088847,-0.023341,0.00075066,0.00060784,0.0096159,-0.0062256,-0.00070105,-0.028218,0.0024133,0.0020247,0.01804,-0.004141,0.0023961,-0.034145,0.0014549,0.0013688,0.029534,0.00055869,0.0037684,-0.0093379,0.0037028,0.0035152,0.036874,0.0035405,0.0071898,-0.011671,0.0075324,0.0071411,0.045655,0.008486,0.011786,-0.016033,0.00089679,0.00075305,0.17394,0.018364,0.025377,-0.024223,0.0026835,0.0023523,0.16657,0.023923,0.035395,-0.024516,0.004998,0.004542,0.15315,0.028034,0.04471,-0.022793,0.53227,74,74,40,1054,3,3,3,0.645
30,-0.048835,0.84532,0.77364,-0.475,0.73106,-0.58644,0.23461,-0.34526,3.9481,-0.076332,3.2968,6.6729e-05,4.4262,4.3175,1.049,5.4284,0.0051797,0.47501,3.5191,2.6776,2.0545,1.5147,0.070673,0.070845,0.069113,0.051328,0.056225,0.071241,0.61057,0.22451,0.012071,0.70075,1.7306,0.87874,0.15385,0.02308,3.7236,0.31948,0.37507,0.37507,0.64083,0.75946,0.30191,1.5093,1.0543,73,72.493,3971,2.1451e+05,8.2544,69.751,1.0722e+05,5238,4806,0.91225,0.92976,0.24388,0.18104,0.14985,0.63234,31689,18763,0.0027001,0.00093296,0,0.091022,0,0.064872,0.031402,0.12334,0.041709,0.17916,1.044,3.9492,2.8981,0.24838,0.27968,0.2014,0.30523,0.22138,0.085252,0.33622,0.19531,0.066537,19.441,5.4378,12172,36405,35212,0.31736,0.31193,0.17696,0.75887,0.80582,0.22099,0.89048,0.91444,0.18355,0.94384,0.95689,0.15582,0.97449,0.98102,0.13757,0.0032666,0.0025358,0.038456,0.0035879,0.0095951,-0.040761,0.0064976,0.004919,0.036175,0.0035527,0.012336,-0.057486,0.010759,0.0080146,0.035603,0.0040398,0.015791,-0.075753,0.000361,0.00028738,0.010712,-0.0046961,0.005043,-0.01649,0.0013325,0.0010391,0.018126,-0.0037652,0.0066329,-0.028837,0.0035488,0.0027619,0.028173,-0.00049202,0.01053,-0.044033,0.0025924,0.0020165,0.055883,0.0075812,0.0048819,-0.036635,0.0047819,0.0036699,0.05057,0.0078989,0.0059786,-0.044837,0.006497,0.0048863,0.041819,0.0057045,0.0052807,-0.0526,0.00031322,0.00023194,0.064517,0.0042876,0.015126,-0.02303,0.0012027,0.0008824,0.079278,0.0083502,0.022753,-0.033202,0.0025113,0.0018175,0.081718,0.011361,0.029755,-0.042797,0.50839,74,74,40,1054,3,3,3,0.645
30,-0.063585,0.70893,0.70129,-0.54593,0.51471,-0.82753,0.5158,0.52476,3.4153,0.15201,3.3213,1.0326e-05,3.1396,3.2934,0.90703,4.1165,0.003928,0.546,3.6072,2.6223,1.8372,1.3063,0.078209,0.047882,0.077019,0.060073,0.077743,0.082581,0.57649,0.24035,0.23175,0.65631,1.3301,0.30169,0.091746,0.00026073,2.8522,0.72782,0.40439,0.72782,0.61082,1.085,0.31325,1.3829,0.94429,69,44.159,743,19435,3.7497,16.53,20061,17685,15120,0.91794,0.94235,0.18831,0.12964,0.13308,0.61819,26824,17309,0.001121,0.00051338,0,0.047318,0,0.051319,0.026025,0.00093265,0.071073,0.013143,1.7465,2.6868,0.74851,0.23211,0.31373,0.2224,0.30862,0.30649,0.078166,0.31541,0.30373,0.068169,14.166,6.0048,9974.1,19406,17664,0.20884,0.19851,0.076249,0.68425,0.71089,0.13048,0.88192,0.8992,0.11903,0.94607,0.956,0.10227,0.97767,0.98202,0.090374,0.0085395,0.0095447,0.065826,0.022569,0.023048,0.047401,0.02108,0.024836,0.076846,0.036863,0.038176,0.099561,0.038937,0.04728,0.084368,0.051717,0.055249,0.15374,0.0013409,0.0013127,0.026054,0.0021189,0.0037132,-0.0034423,0.0036641,0.0039109,0.032638,0.0055374,0.0071001,0.016199,0.0082154,0.0094391,0.042704,0.012106,0.015214,0.051947,0.0050239,0.0057802,0.070912,0.018157,0.017198,0.050763,0.014322,0.017544,0.099173,0.036584,0.034143,0.10761,0.027619,0.034808,0.11641,0.054647,0.050778,0.15796,0.0021747,0.0024519,0.29331,0.041079,0.04223,0.026379,0.0051684,0.0057904,0.22308,0.041914,0.049027,0.031724,0.0085691,0.0095195,0.18258,0.04357,0.057128,0.035336,0.502,74,74,40,1054,3,3,3,0.645
30,-0.030397,0.91331,0.85181,-0.3839,0.85173,-0.38027,-0.0094508,0.33135,3.5312,0.1295,3.3055,8.2306e-05,3.8283,3.4473,1.2309,4.5419,0.0043339,0.38393,3.4677,2.4399,1.9253,1.497,0.066262,0.066094,0.086128,0.067335,0.05149,0.059044,0.60365,0.23204,0.0091879,0.137,0.39619,0.92161,0.27961,0.042438,2.0181,0.27569,0.49081,0.49081,1.3628,1.4164,0.43665,1.7172,1.4406,42,154.9,5876,8.1555e+05,6.2294,39.88,1.5865e+05,4536,3672,0.89707,0.90692,0.44952,0.3703,0.19194,0.9111,1.0997e+05,55198,0.001002,0.00048907,0,0.079147,0,0.065647,0.0046009,0.041212,0.0067615,0.045842,0.15184,0.17623,0.050602,0.22916,0.37437,0.27931,0.25361,0.40959,0.2992,0.26331,0.43727,0.27239,84.824,7.5413,24173,1.0265e+05,1.02e+05,0.016552,0.0093972,0.010236,0.18039,0.15247,0.058261,0.45448,0.46112,0.1039,0.66222,0.69689,0.12125,0.80572,0.84425,0.12615,0.00097735,0.00055702,0.012761,-0.0074119,-0.004999,-0.039546,0.0020479,0.0011855,0.012645,-0.0098486,-0.0054012,-0.049412,0.0031353,0.0018391,0.011506,-0.012921,-0.0056663,-0.055513,0.0004642,0.00027075,0.015277,-0.0041397,-0.0027917,-0.025541,0.00099209,0.00059176,0.014968,-0.0056108,-0.0037687,-0.034745,0.0016726,0.0010147,0.014726,-0.0071056,-0.0040542,-0.040712,0.00040325,0.00022867,0.0096405,-0.0062242,-0.0068751,-0.026723,0.00087045,0.00049694,0.010209,-0.0079071,-0.0085063,-0.031781,0.0012328,0.00070408,0.0088008,-0.010329,-0.010001,-0.034834,0.0001099,5.7601e-05,0.025106,-0.00086271,0.010333,-0.018583,0.00029864,0.00015934,0.021833,-0.0017041,0.013528,-0.022078,0.00053915,0.00029437,0.019457,-0.0027007,0.016248,-0.026262,0.3925,74,74,40,1054,3,3,3,0.645
30,-0.098561,0.65296,0.7835,0.4645,0.32224,0.8209,0.76728,-0.11799,2.1241,-0.056113,3.373,0.00081134,3.7798,2.2075,2.9262,2.5256,0.0024099,-0.46451,10.946,8.3462,6.9812,5.5877,0.022122,0.021076,0.031387,0.023515,0.018482,0.026767,0.85665,1.4085,9.1637,18.294,30.72,44.76,14.536,0.041195,118.92,0.062876,0.18215,0.18215,0.22854,0.2819,0.13279,3.1664,5.0157,73,97.849,6646,6.0238e+05,8.3546,70.871,1.7944e+05,4914,2538,0.9059,0.91201,0.22446,0.18357,0.086057,0.53425,26791,17213,0.0014645,0.00052049,0,0.070263,0,0.059219,0.00036642,0.017986,0.0024914,0.016338,0.60425,1.2791,0.56438,0.22524,0.30995,0.21932,0.26049,0.32191,0.17313,0.25392,0.28631,0.15242,15.662,5.9215,28328,1.5365e+05,1.5321e+05,0.18463,0.20956,0.1309,0.37673,0.41867,0.13949,0.53077,0.56594,0.13911,0.65288,0.67497,0.13704,0.74685,0.76085,0.13406,0.0077739,0.0086755,0.11636,0.027724,0.029325,0.022086,0.016281,0.018486,0.11525,0.036108,0.039732,0.033663,0.027921,0.032597,0.11747,0.04609,0.052968,0.053079,0.0052858,0.0065317,0.19943,0.036384,0.037561,0.036176,0.010581,0.013356,0.18302,0.043542,0.046141,0.051425,0.017518,0.022739,0.17682,0.05208,0.057676,0.073412,0.0017211,0.001388,0.047173,0.0025086,0.0021973,-0.016378,0.0030683,0.0023994,0.041257,0.0013072,0.0016947,-0.022268,0.0048098,0.0038325,0.039364,0.00083531,0.0019314,-0.025785,0.00076698,0.00075578,0.20087,0.017756,0.023738,-0.0012747,0.002696,0.0027842,0.22597,0.028094,0.036816,0.0038176,0.0058636,0.0062644,0.2426,0.039658,0.051609,0.01049,0.71934,74,74,40,1054,3,3,3,0.645
30,-0.10845,0.72204,0.79715,0.44954,0.45718,0.74312,0.65306,-0.3808,1.8872,-0.32872,3.2265,0.0021188,3.2288,1.8954,2.8963,2.1795,0.0020797,-0.44956,7.9496,6.299,5.4287,4.7288,0.029812,0.031288,0.037047,0.025655,0.01883,0.019295,0.83807,0.36319,2.3914,11.021,23.864,40.894,30.29,0.045232,108.87,0.051273,0.16218,0.16218,0.26838,0.36441,0.14186,3.1701,5.0249,67,99.075,4852,3.5782e+05,7.6191,60.756,1.31e+05,16551,16065,0.91031,0.91918,0.13249,0.10327,0.070999,0.3725,27592,15444,0.0011477,0.00044133,0,0.066102,0,0.067054,0.02216,0.15634,0.020937,0.19943,0.085958,0.27404,0.40722,0.22924,0.33169,0.22947,0.26822,0.35586,0.16526,0.26498,0.33654,0.15965,14.235,6.1956,10770,45206,44610,0.16552,0.17202,0.10878,0.36035,0.37664,0.12368,0.51914,0.53841,0.12612,0.64203,0.6615,0.12492,0.74644,0.76574,0.1242,0.0085554,0.011474,0.11871,0.0306,0.039119,0.082171,0.018163,0.022731,0.11918,0.040651,0.049185,0.079954,0.030666,0.036603,0.1196,0.050698,0.059495,0.076877,0.0062453,0.0095927,0.21842,0.042792,0.054727,0.1064,0.012103,0.017433,0.19405,0.049425,0.059681,0.10995,0.019146,0.026117,0.17914,0.055969,0.065296,0.11097,0.0013574,0.0009292,0.034486,-2.6835e-05,-0.00022921,-0.028925,0.002562,0.0017222,0.031933,-0.00091229,-4.9637e-05,-0.037368,0.0041004,0.0027374,0.031107,-0.0014702,-1.0862e-05,-0.046874,0.00095273,0.00095161,0.23129,0.022148,0.029037,-0.00014695,0.0035738,0.0036202,0.27766,0.037544,0.045071,0.0021821,0.0076842,0.0079046,0.29471,0.052118,0.061198,0.006032,0.69745,74,74,40,1054,3,3,3,0.645
30,-0.029169,0.89791,0.84234,-0.39606,0.83941,-0.41942,0.059003,0.18136,3.0114,0.077085,3.3378,5.0422e-06,3.4466,3.1348,1.2066,4.0254,0.003841,0.39609,3.4451,2.6272,2.0486,1.5753,0.042421,0.0836,0.095481,0.050951,0.052557,0.060563,0.61443,0.046517,0.079504,0.058157,1.2585,0.78315,0.25307,0.049006,2.5279,0.37078,0.43951,0.43951,0.34249,0.85316,0.23494,1.7043,1.4491,42,208.76,7759,1.4244e+06,6.2117,39.731,2.0949e+05,10557,7398,0.89923,0.90895,0.50461,0.41828,0.26751,0.89207,1.1368e+05,52968,0.0011882,0.00056257,0,0.087483,0,0.058022,0.0012453,0.013002,0.0017641,0.015848,1.0138,2.8107,1.1213,0.20385,0.38799,0.31994,0.19717,0.44565,0.34334,0.20217,0.45594,0.33343,105.2,8.6384,26849,1.385e+05,1.3797e+05,0.0097945,0.005658,0.0079806,0.17886,0.16636,0.076111,0.45619,0.47458,0.13741,0.69424,0.73576,0.16748,0.86863,0.90071,0.17919,0.00024087,0.00013471,0.0041436,-0.01271,-0.0059364,-0.019748,0.00067629,0.00039156,0.0055019,-0.016202,-0.0072117,-0.028143,0.0016271,0.001049,0.0078676,-0.018834,-0.0073781,-0.035917,0.00022914,0.00012859,0.0099361,-0.0069172,-0.0011649,-0.018803,0.00060159,0.00035131,0.011959,-0.0086452,-0.0022495,-0.025452,0.0013251,0.00088032,0.015371,-0.0096082,-0.0023344,-0.029588,1.1251e-05,5.8473e-06,0.0003544,-0.010122,-0.0079788,-0.009818,5.7291e-05,2.9981e-05,0.00088533,-0.013021,-0.0097156,-0.011712,0.00016774,8.8121e-05,0.0015777,-0.015738,-0.010982,-0.015875,4.774e-07,2.72e-07,0.00014369,-0.0043405,0.0042943,-0.011182,1.7551e-05,1.0339e-05,0.0016906,-0.0057387,0.0058886,-0.014406,0.00014215,8.4622e-05,0.0067592,-0.0065282,0.0084783,-0.020064,0.38409,74,74,40,1054,3,3,3,0.645
30,-0.16435,1.0787,0.98252,0.12865,0.96591,0.14538,0.13,0.18291,2.5554,0.055595,3.3639,0.00019532,3.521,2.3425,2.2551,2.6987,0.0025751,-0.12866,3.4291,2.7831,2.4572,2.2006,0.045354,0.081339,0.082158,0.039399,0.025462,0.023694,0.70259,0.00071182,0.0046648,0.61451,6.3006,16.721,16.055,0.015917,39.712,0.12351,0.1382,0.1382,0.19972,0.21793,0.11638,3.3226,5.5014,66,107.64,6168,5.7839e+05,7.8034,62.518,1.6654e+05,18198,2970,0.90857,0.92,0.24622,0.19186,0.1503,0.58431,29897,17447,0.001523,0.00055625,0,0.047162,0,0.048439,0.015207,0.01147,0.021962,0.0094315,0.86965,0.32741,0.84046,0.24028,0.30651,0.22071,0.28739,0.30162,0.14931,0.2909,0.28614,0.13096,16.938,5.9592,11564,48209,46827,0.19625,0.20564,0.13636,0.44494,0.46606,0.16146,0.61423,0.63159,0.15777,0.70375,0.71394,0.14477,0.77903,0.78528,0.13704,0.010453,0.012642,0.15334,0.041354,0.045958,0.057437,0.022102,0.026102,0.15333,0.054625,0.060212,0.065332,0.037183,0.043581,0.15332,0.067785,0.075403,0.077896,0.0059446,0.0082811,0.21981,0.041526,0.049291,0.078777,0.011737,0.015705,0.19897,0.049002,0.055852,0.086663,0.019212,0.024964,0.19005,0.057854,0.064915,0.095933,0.0031419,0.0028747,0.084396,0.012286,0.0096363,-0.012431,0.0064625,0.0057953,0.085163,0.016262,0.013358,-0.019734,0.010865,0.0097434,0.087147,0.0208,0.017753,-0.02469,0.0013665,0.0014861,0.35074,0.034438,0.044105,0.01177,0.0041906,0.004794,0.34423,0.046262,0.06067,0.024417,0.0078928,0.0094297,0.32005,0.055295,0.076221,0.041155,0.65252,74,74,40,1054,3,3,3,0.645
30,-0.00051932,0.13357,0.1329,-0.93111,0.13283,-0.95207,0.02251,2.1685,11.111,0.11322,2.9147,0.012198,3.8456,10.356,0.13763,20.104,0.019184,0.93112,0.96211,0.72781,0.52543,0.43128,0.18296,0.15017,0.14212,0.073963,0.08217,0.046149,0.32246,0.46489,0.10067,0.14053,2.1891,1.1774,5.6314,2.3034,12.007,0.22747,0.23866,0.23866,0.65001,1.1672,0.30335,0.47985,0.1011,39,117.08,2441,2.011e+05,4.3579,21.242,65907,40014,6993,0.91405,0.93038,0.086557,0.067795,0.016215,0.27899,30537,17615,0.0010801,0.00056855,0,0.060319,0,0.054293,0.00087484,0.0055405,0.00012494,0.011639,0.41364,0.43475,0.79211,0.19945,0.30279,0.22395,0.21159,0.29419,0.13804,0.20157,0.25359,0.11102,23.835,6.0468,22213,70845,70218,0.31171,0.37401,0.14044,0.64016,0.71481,0.15064,0.83365,0.87872,0.13885,0.92376,0.94739,0.12322,0.97439,0.98249,0.11115,0.00023311,0.00013416,0.0022174,-0.0093907,-0.0041389,-0.016232,0.0005516,0.00032039,0.0024814,-0.012253,-0.0043535,-0.021502,0.0010585,0.00062332,0.0028303,-0.014956,-0.0035624,-0.028847,2.4423e-06,1.3739e-06,5.856e-05,-0.0066126,-0.0033988,-0.010794,4.933e-05,2.8187e-05,0.00054224,-0.008625,-0.004185,-0.013326,0.00021189,0.00012274,0.0013592,-0.010395,-0.0036131,-0.016047,4.7208e-05,2.7005e-05,0.00082228,-0.0072539,-0.006565,-0.014517,0.00020335,0.00011719,0.0017377,-0.0090719,-0.0074935,-0.01577,0.00041963,0.00024415,0.0021825,-0.010923,-0.0082816,-0.017958,0.00018346,0.00010578,0.030534,0.0009224,0.015765,-0.016419,0.00046396,0.00026998,0.024712,0.00018543,0.018527,-0.019899,0.00082122,0.00048474,0.021593,-0.00051003,0.022028,-0.024291,0.42972,74,74,40,1054,3,3,3,0.645
30,-0.035739,0.46901,0.44065,-0.74762,0.39583,-0.98607,0.31895,0.62216,4.1037,0.064447,3.2786,0.00045103,2.3909,3.3638,0.50424,4.2586,0.0040635,0.74763,1.7491,1.3607,1.0637,0.86048,0.095753,0.12832,0.11347,0.06231,0.063471,0.055117,0.48156,0.27749,0.16926,0.11387,1.7364,1.2097,1.393,0.090351,4.9901,0.18669,0.28045,0.28045,0.54451,1.0778,0.30637,0.95105,0.44031,47,114.64,3265,2.7944e+05,5.1621,29.313,88155,45738,6048,0.91594,0.93359,0.20078,0.14303,0.14798,0.59179,29677,18108,0.0010441,0.00045627,0,0.056559,0,0.055192,0.024452,0.06839,0.041691,0.10274,1.0733,2.4539,1.0154,0.21007,0.34347,0.23683,0.22568,0.38012,0.15788,0.22552,0.39776,0.14997,14.019,6.3945,9804.1,25190,23729,0.20783,0.20407,0.11008,0.50098,0.50287,0.13859,0.66508,0.6754,0.13022,0.76892,0.78174,0.12058,0.85522,0.86821,0.11469,0.0071378,0.0068338,0.07982,0.020975,0.025281,-0.013503,0.014399,0.013643,0.07615,0.025751,0.031501,-0.021675,0.024571,0.023356,0.077234,0.032674,0.040385,-0.026064,0.0020051,0.0015905,0.056518,0.0074007,0.01423,-0.034004,0.0040656,0.0033374,0.052536,0.0084844,0.015315,-0.0394,0.0072628,0.0061697,0.054768,0.011558,0.018398,-0.043457,0.0048513,0.005022,0.099338,0.020931,0.018126,0.0092012,0.0096757,0.0098156,0.097198,0.026451,0.023537,0.004838,0.01589,0.016008,0.097156,0.032486,0.029506,0.0030884,0.00028141,0.00022126,0.055061,0.0033977,0.015228,-0.022948,0.0011915,0.00099018,0.07461,0.0080126,0.024048,-0.025359,0.003237,0.0028804,0.10006,0.016054,0.037314,-0.024124,0.59588,74,74,40,1054,3,3,3,0.645
30,-0.0056103,0.35438,0.34688,-0.80796,0.34683,-0.81737,0.011656,-0.080068,8.8549,-0.013114,3.1455,0.0041606,7.471,12.05,0.38371,18.327,0.017488,0.80796,1.6434,1.1742,0.9209,0.72629,0.12773,0.10773,0.12535,0.083948,0.062347,0.060339,0.43255,0.43044,0.088913,0.032045,0.47306,1.1463,0.87821,0.17768,3.2266,0.3395,0.23892,0.3395,1.9644,2.9143,0.64427,0.81155,0.27336,59,66.61,2426,1.0995e+05,6.344,44.395,65502,20250,13689,0.91536,0.93489,0.088485,0.066521,0.015044,0.32001,28339,14690,0.0014873,0.00061862,0,0.065962,0,0.04799,0.00067931,0.040323,0.00059225,0.067265,1.281,1.202,0.010171,0.22739,0.30274,0.20978,0.27173,0.2631,0.092823,0.2831,0.25752,0.082919,17.165,5.6639,22163,57179,56335,0.32288,0.29831,0.13307,0.7249,0.75021,0.15603,0.87455,0.89535,0.13324,0.96548,0.97462,0.11781,0.9899,0.99305,0.10329,0.0019312,0.0014328,0.016804,-0.0022296,0.0031595,-0.031126,0.0050146,0.0037887,0.020635,-0.00063626,0.0060136,-0.042062,0.0099564,0.0077,0.024351,0.0019908,0.011075,-0.051404,6.5738e-05,5.2079e-05,0.0014418,-0.0059124,-0.0012039,-0.013306,0.00059061,0.0004811,0.0059383,-0.0061244,-0.00079087,-0.017202,0.0022809,0.0019237,0.013383,-0.0040348,0.0021858,-0.022142,0.0015702,0.0011779,0.025018,0.0011015,0.0023074,-0.026126,0.003805,0.0028823,0.029741,0.0034716,0.0038525,-0.035173,0.0067627,0.0051515,0.032173,0.0055547,0.0054391,-0.042277,0.00029525,0.00020283,0.044949,0.0032852,0.011745,-0.017219,0.00070668,0.00048148,0.03443,0.0024685,0.018054,-0.020076,0.0011411,0.00077125,0.027445,0.0014464,0.025099,-0.02295,0.47995,74,74,40,1054,3,3,3,0.645
30,-0.014161,0.6782,0.65433,-0.58741,0.65356,-0.56724,-0.034341,-1.475,13.96,-0.096264,3.2553,0.0015204,7.96,8.7589,0.82432,13.959,0.013319,0.58743,2.6428,1.9055,1.464,1.111,0.086032,0.084166,0.085983,0.07142,0.063227,0.069586,0.53959,0.34741,0.065949,0.18437,0.41303,0.48138,0.16102,0.0026549,1.6558,0.32124,0.22837,0.32124,0.39949,0.98876,0.27123,1.336,0.91788,70,56.357,1911,63712,6.2808,43.719,51597,25974,5400,0.91536,0.93453,0.22646,0.16854,0.095865,0.63843,25825,16268,0.0013202,0.00062182,0,0.11665,0,0.087808,0.017453,0.16794,0.025061,0.26332,0.49301,2.2227,1.826,0.22963,0.30841,0.23033,0.27447,0.29444,0.12657,0.29818,0.29077,0.11097,23.081,6.219,16602,41579,40900,0.24423,0.24618,0.1093,0.65013,0.69297,0.15195,0.84377,0.8754,0.13959,0.91432,0.93339,0.12114,0.94185,0.95407,0.10671,0.0093686,0.0083726,0.088518,0.028476,0.022842,-0.032416,0.022267,0.020715,0.099494,0.043973,0.036697,-0.028812,0.03931,0.037916,0.1044,0.058094,0.051005,-0.018471,0.00047118,0.00041503,0.011222,-0.0034587,-0.0029176,-0.010099,0.0018643,0.0017916,0.020354,-0.0011947,0.00039263,-0.0055738,0.0050354,0.0050289,0.032082,0.0039795,0.0068761,-0.00027511,0.0060322,0.005337,0.10436,0.025693,0.01951,-0.027795,0.014001,0.01306,0.11884,0.039467,0.029984,-0.021744,0.024723,0.024306,0.12772,0.05302,0.040809,-0.0069134,0.0028653,0.0026206,0.47367,0.061069,0.05395,-0.016844,0.0081423,0.0074941,0.43077,0.075789,0.068584,-0.020379,0.014191,0.013163,0.37061,0.083789,0.080831,-0.022164,0.4605,74,74,40,1054,3,3,3,0.645
30,-0.0042965,0.23623,0.23173,-0.87638,0.22994,-0.95342,0.0879,-0.19076,4.8221,-0.020942,3.1841,0.0022893,5.2622,10.579,0.24695,16.338,0.01559,0.87641,1.2953,0.91818,0.70026,0.55963,0.1512,0.14604,0.12275,0.088031,0.068676,0.054508,0.3688,0.46561,0.17666,0.10425,0.55289,1.1715,1.8809,0.6919,5.0437,0.20543,0.18687,0.20543,0.68387,1.4078,0.37677,0.6482,0.19355,63,53.857,1362,47801,5.2161,29.2,36774,30159,6156,0.91839,0.94075,0.11378,0.078414,0.071736,0.42879,22903,15583,0.00089709,0.00046272,0,0.044329,0,0.0494,0.0049819,0.0054279,0.007862,0.02045,0.65282,0.041361,0.67889,0.21008,0.31752,0.22135,0.24556,0.2801,0.10432,0.23491,0.25033,0.089097,19.915,5.9765,13372,26032,24576,0.31751,0.37268,0.11485,0.66043,0.70647,0.12477,0.85803,0.88104,0.11473,0.947,0.95747,0.10142,0.98177,0.98579,0.089913,0.00027771,0.00021746,0.0021209,-0.0082285,-0.0010298,-0.01716,0.0014431,0.001234,0.0052119,-0.008884,0.0018012,-0.028238,0.0050894,0.0044664,0.010925,-0.0064688,0.0074131,-0.037644,0.00010936,9.3066e-05,0.0021052,-0.0052703,-0.0022197,-0.020079,0.00095425,0.00086333,0.0084212,-0.0043999,-0.00069721,-0.018233,0.0034864,0.0032101,0.017955,-0.00056057,0.0039019,-0.020046,0.00016835,0.0001244,0.0023542,-0.0058864,-0.0031495,-0.012865,0.00045119,0.00034128,0.0030954,-0.0073277,-0.0022932,-0.020121,0.0013128,0.0010232,0.0054818,-0.0076569,-0.00071884,-0.032933,0,0,0,-0.0028663,0.014718,0,4.0587e-05,3.1654e-05,0.0017356,-0.0035734,0.017608,-0.021141,0.00033901,0.00026997,0.0071565,-0.0031831,0.022485,-0.025279,0.45777,74,74,40,1054,3,3,3,0.645
30,-0.0072901,0.39414,0.38628,-0.78317,0.38008,-0.68393,-0.12672,-0.21703,3.0074,0.0026004,3.3221,9.7058e-08,2.3066,3.5014,0.43314,4.5491,0.0043408,0.78321,1.5392,0.99517,0.82013,0.6957,0.07465,0.13819,0.17437,0.10855,0.048726,0.040755,0.41475,0.18512,0.21203,0.028309,0.069752,2.5478,3.26,0.20212,6.5051,0.15507,0.24562,0.24562,0.34734,0.65737,0.18199,0.87588,0.38362,30,284.13,3502,7.9042e+05,3.1715,11.471,94554,92205,34155,0.89974,0.90825,0.43744,0.35115,0.24862,0.83073,76419,41935,0.0012531,0.00053965,0,0.082724,0,0.060913,0.0028912,0.0083278,0.0052531,0.011667,0.8154,1.7186,0.34294,0.23211,0.39904,0.25662,0.25356,0.4853,0.22884,0.27044,0.48952,0.21638,58.049,6.9287,16260,74841,73744,0.024944,0.017036,0.019431,0.22706,0.22425,0.092375,0.4863,0.50781,0.14004,0.70267,0.72772,0.16206,0.84944,0.8662,0.16753,0.00026345,0.00016026,0.0043328,-0.012291,-0.0037857,-0.023279,0.0008183,0.00050108,0.0063644,-0.015337,-0.0044739,-0.032028,0.0018099,0.0011455,0.0083669,-0.017933,-0.0043997,-0.04194,0.00018513,0.00011544,0.0076746,-0.0071482,0.0012644,-0.018538,0.00050426,0.00030919,0.0095831,-0.008973,-0.00020352,-0.023663,0.00093096,0.00055851,0.010325,-0.010945,-0.001338,-0.03059,2.496e-05,1.4333e-05,0.00075167,-0.0097865,-0.0075167,-0.015946,0.00018449,0.00011471,0.0027256,-0.012124,-0.0085437,-0.020725,0.00062804,0.00042077,0.0056474,-0.013761,-0.009253,-0.025626,5.336e-05,3.0485e-05,0.015355,-0.0026608,0.0059013,-0.010151,0.00013676,8.2572e-05,0.012595,-0.0040429,0.0087493,-0.012576,0.00030044,0.00020231,0.013658,-0.0050481,0.013249,-0.016208,0.43554,74,74,40,1054,3,3,3,0.645
30,-0.088583,0.65466,0.59612,-0.63507,0.54264,-0.44487,-0.2995,0.17946,3.1646,0.01297,3.3271,6.3503e-06,1.9523,2.2848,0.72874,2.8804,0.0027485,0.63521,1.3886,1.0534,0.92509,0.84942,0.07924,0.16894,0.15398,0.070286,0.033375,0.021857,0.47232,0.17065,0.27217,0.00073052,1.2256,9.743,21.713,0.15121,33.277,0.11101,0.12945,0.12945,1.2034,1.2596,0.34184,1.19,0.70724,59,82.864,4366,3.2051e+05,7.4591,56.765,1.1788e+05,4698,2646,0.914,0.93075,0.2838,0.21347,0.17554,0.73905,32949,19270,0.0015644,0.00056953,0,0.046289,0,0.043568,0.0094169,0.079634,0.012741,0.11356,0.67254,2.2694,2.0491,0.24292,0.30928,0.24243,0.31674,0.29616,0.1492,0.33286,0.29041,0.12714,28.094,6.5457,17784,49857,48767,0.15716,0.15306,0.078851,0.45609,0.47774,0.11951,0.66667,0.69557,0.12365,0.75259,0.78124,0.1118,0.8138,0.83993,0.10338,0.0058897,0.0063356,0.06239,0.014918,0.020338,0.020923,0.016181,0.018136,0.081062,0.029933,0.036779,0.047354,0.0322,0.036472,0.095877,0.047215,0.05515,0.069011,0.0030192,0.0031303,0.080616,0.014381,0.015971,0.0064756,0.0071368,0.0079361,0.087359,0.021531,0.023468,0.027977,0.01447,0.01652,0.10336,0.033959,0.036103,0.049504,0.0002576,0.00017225,0.0049966,-0.0064382,-0.0017262,-0.017704,0.00083002,0.00061403,0.0078984,-0.0072504,-0.0012911,-0.025342,0.0024168,0.0020376,0.013998,-0.0059737,0.00037044,-0.02526,0.0026129,0.0030331,0.48428,0.058756,0.063562,0.03564,0.0082934,0.0096405,0.49192,0.081944,0.088154,0.046458,0.015586,0.018111,0.45636,0.098176,0.10771,0.056263,0.45882,74,74,40,1054,3,3,3,0.645
30,-0.024465,0.90895,0.86393,-0.36776,0.85833,-0.39737,0.080501,-0.81736,8.9212,-0.059748,3.2689,0.0015582,10.288,9.1445,1.2632,14.115,0.013469,0.36777,4.1098,2.9722,2.1177,1.5802,0.055196,0.060811,0.073747,0.056462,0.069509,0.067311,0.61696,0.1469,0.0031308,0.26276,0.83093,0.17316,0.11852,0.058113,1.5935,0.3823,0.40248,0.40248,0.39394,0.77564,0.27153,1.9213,1.7422,64,41.688,1778,49273,7.47,58.384,48006,6210,4050,0.91899,0.94085,0.14518,0.10285,0.073269,0.53702,26499,16281,0.0011425,0.00049174,0,0.11723,0,0.09585,0.015438,0.09197,0.025468,0.1892,0.78028,2.1886,1.4951,0.22413,0.31536,0.23827,0.30415,0.30335,0.10201,0.31925,0.29886,0.091855,21.822,6.4333,15534,29819,28573,0.20857,0.20106,0.067575,0.63909,0.67406,0.10814,0.8407,0.87255,0.10069,0.91058,0.92905,0.087346,0.95154,0.96108,0.078053,0.00084177,0.00065156,0.0057581,-0.0057986,0.0028764,-0.028845,0.0027881,0.0022042,0.0090192,-0.0054482,0.0070515,-0.040692,0.006093,0.0048454,0.011715,-0.0044917,0.012756,-0.052389,0.00015017,0.00012064,0.0025892,-0.0047516,0.0020912,-0.018985,0.00084701,0.00069449,0.0066951,-0.0045308,0.0032805,-0.023496,0.0025897,0.0021321,0.011946,-0.0027905,0.0070889,-0.032381,0.00059173,0.00045315,0.0074116,-0.0035903,-0.0023622,-0.022182,0.0014309,0.0011262,0.0087924,-0.0040072,-0.0021833,-0.026303,0.0024215,0.0019118,0.0090566,-0.0047669,-0.0022148,-0.031134,9.9875e-05,7.7778e-05,0.011953,-0.00081026,0.018188,-0.015311,0.00051022,0.00038355,0.019543,0.00054303,0.02715,-0.023021,0.0010817,0.00080146,0.020453,0.00096198,0.036364,-0.027636,0.45231,74,74,40,1054,3,3,3,0.645
30,-0.0068562,0.96382,0.95583,-0.208,0.95582,-0.20741,-0.0028249,-0.24092,6.0466,0.01143,3.2288,0.0017696,8.2543,6.5554,1.5825,9.4902,0.0090556,0.208,4.5662,3.0386,2.1883,1.6814,0.043007,0.043985,0.08107,0.068914,0.066971,0.060137,0.63591,0.071624,0.05641,0.10264,0.22572,0.14486,0.14941,0.096178,0.84684,0.054712,0.13029,0.13029,0.62257,0.78981,0.22445,2.209,2.4368,18,670.39,10542,6.1139e+06,3.8212,15.754,2.8463e+05,27918,7101,0.90222,0.90985,0.64344,0.54051,0.39616,0.96625,76589,46616,0.0011885,0.00053344,1,0.17444,0,0.12808,0.02841,0.018364,0.028741,0.0248,1.5303,0.65362,0.27339,0.19632,0.35196,0.37587,0.19029,0.37343,0.42597,0.19403,0.36517,0.43409,144.25,10.149,22802,1.2183e+05,1.2082e+05,0.0068221,0.0043463,0.0072866,0.10672,0.1032,0.05953,0.28531,0.29889,0.11265,0.46479,0.4926,0.14698,0.61796,0.65308,0.16711,6.1914e-05,4.1726e-05,0.0013962,-0.01582,-0.010683,-0.016477,0.00036525,0.00025288,0.0038952,-0.019946,-0.013539,-0.022369,0.001294,0.00095261,0.0082022,-0.022715,-0.015056,-0.030241,7.2935e-07,5.4017e-07,4.1458e-05,-0.010373,-0.0070692,-0.0077425,3.6858e-05,3.0583e-05,0.00096045,-0.013586,-0.010195,-0.0077378,0.0002884,0.0002627,0.0043856,-0.015921,-0.011632,-0.0060475,1.9641e-06,1.1107e-06,8.11e-05,-0.01175,-0.0092896,-0.0083885,1.5831e-05,8.9528e-06,0.0003207,-0.015242,-0.012182,-0.0083885,4.5257e-05,2.5594e-05,0.000558,-0.018651,-0.015374,-0.0083885,5.922e-05,4.0075e-05,0.023366,-0.0029342,0.0037597,-0.015683,0.00031257,0.00021334,0.039467,-0.002052,0.0068199,-0.02029,0.00096034,0.00066432,0.05986,0.00057966,0.011025,-0.029024,0.44979,74,74,40,1054,3,3,3,0.645
30,-0.0032303,0.33388,0.32986,-0.81843,0.32912,-0.85718,0.047344,-0.085027,2.618,-0.027564,3.3694,0.00013837,4.2494,7.0485,0.36278,9.3379,0.0089102,0.81843,1.5311,0.96799,0.76085,0.6508,0.080733,0.13134,0.17332,0.11486,0.060732,0.038464,0.40055,0.18033,0.1549,0.012862,0.059556,1.4173,4.8013,0.35067,6.9769,0.19376,0.11101,0.19376,0.96582,1.2661,0.36884,0.79395,0.31257,39,230.33,8465,1.8259e+06,5.9939,36.962,2.2856e+05,5562,3186,0.90664,0.91946,0.48242,0.379,0.30816,0.86038,59666,37357,0.0013246,0.00054466,0,0.054316,0,0.054772,0.00063654,0.0059675,0.0010172,0.007615,0.52606,0.69016,0.80065,0.22801,0.38798,0.26294,0.25389,0.45537,0.24009,0.26931,0.46046,0.22924,50.17,7.0994,12901,53687,52056,0.026768,0.020053,0.022554,0.22743,0.22342,0.10008,0.47246,0.48117,0.14715,0.67024,0.67989,0.16719,0.82086,0.82268,0.1751,8.0911e-05,7.4182e-05,0.0014393,-0.013854,-0.0084534,-0.0075281,0.00061898,0.00063737,0.0052072,-0.016694,-0.0092699,0.0037317,0.0021818,0.0023469,0.010909,-0.017699,-0.0079042,0.0127,6.9994e-05,6.5354e-05,0.0031385,-0.0085139,-0.0013866,-0.005578,0.00050533,0.00054308,0.010387,-0.0093424,-0.0023988,0.0083431,0.0016003,0.0018387,0.019196,-0.0086433,-0.00081004,0.020842,2.5022e-06,1.7207e-06,8.1505e-05,-0.010367,-0.011339,-0.0087713,4.1397e-05,2.8343e-05,0.00066151,-0.013329,-0.013486,-0.012957,0.00022218,0.00015236,0.002161,-0.015817,-0.015421,-0.017607,8.4148e-06,7.1081e-06,0.002619,-0.0041703,0.0051086,-0.0041489,7.2256e-05,6.5938e-05,0.0071971,-0.005093,0.0078897,-0.0037744,0.00035931,0.00035582,0.017667,-0.0047445,0.011914,-0.00072927,0.46284,74,74,40,1054,3,3,3,0.645
30,-0.0052386,0.88429,0.87947,-0.34598,0.87562,-0.32311,-0.066087,-0.44543,6.0094,-0.053923,3.2279,0.0020994,7.0224,6.1372,1.3068,9.3649,0.008936,0.34598,3.8326,2.6477,1.8993,1.4523,0.046696,0.059791,0.096991,0.067508,0.071071,0.06314,0.5948,0.10189,0.0089011,0.015639,0.26624,0.13133,0.1384,0.056642,0.71904,0.12497,0.15694,0.15694,1.2469,1.2588,0.3784,1.7498,1.4076,20,621,8456,3.7643e+06,3.5689,14.666,2.2831e+05,73629,22248,0.91104,0.92271,0.62585,0.50004,0.42658,0.95676,64332,41327,0.0010948,0.0005014,0,0.12138,0,0.11026,0.0019124,0.0096609,0.0035808,0.020234,2.8899,2.2843,0.0008566,0.16451,0.31782,0.43491,0.13709,0.31656,0.5325,0.12244,0.29965,0.56808,142.49,11.742,15736,69413,68470,0.010731,0.0074401,0.011971,0.1014,0.088387,0.059077,0.28235,0.27273,0.11643,0.46369,0.46997,0.15314,0.62426,0.63873,0.17631,0.0003907,0.00024743,0.0092018,-0.013999,-0.005178,-0.026483,0.001023,0.00065418,0.011394,-0.017675,-0.0059909,-0.039036,0.0023362,0.0015399,0.015466,-0.020046,-0.0059337,-0.054999,0.00024742,0.00015909,0.014689,-0.0079652,-0.0036991,-0.020038,0.00050633,0.00032716,0.01378,-0.010825,-0.0064212,-0.024092,0.00083769,0.00055292,0.013304,-0.013666,-0.0084548,-0.029267,9.0007e-05,5.5349e-05,0.0038817,-0.011246,-0.0065776,-0.012022,0.00029709,0.00019093,0.0062856,-0.014008,-0.0081621,-0.023836,0.0009188,0.00061953,0.011832,-0.015393,-0.0092453,-0.03578,5.327e-05,3.2988e-05,0.021952,-0.0032173,0.011197,-0.016368,0.00021955,0.00013609,0.028954,-0.0035726,0.015318,-0.022145,0.00057969,0.00036745,0.037739,-0.0032662,0.020202,-0.031465,0.40336,74,74,40,1054,3,3,3,0.645
30,-0.035945,0.58966,0.53634,-0.68055,0.52096,-0.79581,0.16936,1.1506,7.2154,0.066561,3.2131,0.0025132,5.6321,7.0434,0.63819,9.1248,0.0087068,0.68058,2.086,1.6574,1.288,0.99959,0.094305,0.11091,0.086791,0.054743,0.063628,0.066035,0.52359,0.30663,0.11911,0.38209,2.16,0.89462,0.44867,0.015541,4.3267,0.12752,0.41041,0.41041,0.62978,0.73729,0.35716,1.0991,0.50251,54,77.759,3846,2.7217e+05,7.1228,51.83,1.0384e+05,3483,2781,0.91793,0.9374,0.173,0.12279,0.1146,0.55453,24490,15217,0.0010448,0.00043652,0,0.094135,0,0.079372,0.051087,0.0064613,0.09299,0.021896,0.39501,0.48166,0.25368,0.22235,0.32285,0.24473,0.28379,0.3272,0.1513,0.29995,0.33259,0.14016,13.52,6.6076,9685.9,21522,20198,0.23171,0.23341,0.097241,0.53762,0.55049,0.11784,0.72323,0.73431,0.1122,0.84518,0.85522,0.10502,0.92146,0.92897,0.097907,0.0079603,0.0070524,0.070532,0.021911,0.026282,-0.038246,0.016935,0.015274,0.070963,0.029203,0.035032,-0.042961,0.028647,0.026291,0.071346,0.036524,0.044283,-0.045009,0.0017525,0.0014394,0.03914,0.0049354,0.012914,-0.028891,0.0041877,0.0035251,0.042876,0.0080115,0.016796,-0.036108,0.0081383,0.0069984,0.048626,0.012776,0.022175,-0.042175,0.0051523,0.004698,0.083592,0.020178,0.016634,-0.022884,0.010023,0.0092941,0.079775,0.024655,0.021143,-0.023709,0.015695,0.01485,0.076037,0.028335,0.025058,-0.021156,0.0010555,0.0009149,0.16364,0.019817,0.031149,-0.021538,0.0032942,0.002923,0.16344,0.027146,0.041199,-0.02328,0.0062087,0.0056244,0.15206,0.032378,0.051922,-0.024137,0.55789,74,74,40,1054,3,3,3,0.645
30,-0.010507,0.90477,0.90703,-0.3035,0.88276,-0.25385,-0.16358,2.1354,11.452,0.11062,3.0818,0.0075137,6.689,5.6647,1.3917,9.6208,0.0091801,0.3035,3.666,2.4125,1.8514,1.404,0.052005,0.065208,0.087425,0.079697,0.058368,0.066084,0.59121,0.0821,0.0017258,0.17212,0.2328,0.67734,0.22511,0.019239,1.4104,0.10617,0.31167,0.31167,0.3659,0.37588,0.20152,1.9389,1.877,53,58.377,2301,1.002e+05,6.8092,48.431,62127,8856,4914,0.91744,0.93899,0.091341,0.067747,0.024949,0.42561,26161,14062,0.0011592,0.00052725,0,0.086895,0,0.098447,0.00033439,0.035029,0.0076541,0.061841,0.3116,0.65593,0.53412,0.21715,0.30927,0.22612,0.25902,0.30166,0.14978,0.2677,0.27952,0.12514,22.334,6.1053,24168,52984,52000,0.26296,0.30039,0.086659,0.61148,0.67025,0.10524,0.80811,0.84578,0.098445,0.93419,0.95024,0.091147,0.97447,0.98132,0.081304,5.1103e-05,3.5698e-05,0.00035556,-0.0086499,-0.0024883,-0.018049,0.00036442,0.00025792,0.0011991,-0.01086,-0.0015327,-0.021323,0.0013177,0.00093725,0.002577,-0.012326,0.00065822,-0.03056,2.2969e-05,1.5218e-05,0.00040282,-0.0055197,-0.0032697,-0.012906,0.00019267,0.00013115,0.001549,-0.0068524,-0.0025017,-0.016202,0.00075452,0.00052577,0.00354,-0.0074813,-0.00047698,-0.024,2.6533e-05,1.9302e-05,0.00033803,-0.0062809,-0.0037193,-0.011957,0.0001408,0.00010388,0.00087999,-0.0079215,-0.0041467,-0.011813,0.00041199,0.00029875,0.0015673,-0.0093282,-0.0041785,-0.015883,1.6014e-06,1.1775e-06,0.00019495,-0.0027028,0.012668,-0.0083468,3.0955e-05,2.2886e-05,0.0012059,-0.003489,0.015058,-0.0091066,0.00015117,0.00011273,0.0029072,-0.0040487,0.018284,-0.010441,0.43338,74,74,40,1054,3,3,3,0.645
30,-0.042163,0.68456,0.62345,-0.61315,0.61885,-0.56044,-0.085969,-0.2161,4.8276,0.0066627,3.3105,0.00022988,2.9357,3.3366,0.77264,4.1496,0.0039595,0.61325,1.9367,1.4483,1.1743,0.983,0.06892,0.12606,0.13716,0.068783,0.052127,0.044935,0.50202,0.15969,0.1995,6.1131e-05,0.74409,1.7075,1.9852,0.017744,4.8137,0.19506,0.25251,0.25251,1.4272,1.5438,0.38706,1.2363,0.7547,56,32.357,295,5035.4,2.4424,7.9165,7965,7479,6912,0.92086,0.94734,0.094806,0.05951,0.061676,0.58595,21730,15253,0.0006604,0.00033153,0,0.038595,0,0.057754,0.0017138,0.029791,0.017077,0.086807,0.29013,0.13945,0.0034787,0.20547,0.34391,0.27422,0.24717,0.41559,0.2084,0.24763,0.41807,0.20601,27.803,7.4039,6590.6,9153.2,5878.7,0.11511,0.11172,0.024722,0.30614,0.30384,0.034341,0.46971,0.46883,0.037294,0.65024,0.65434,0.041349,0.76252,0.76672,0.041464,0.0048055,0.0045876,0.021791,0.0065939,0.014174,-0.030437,0.013694,0.013497,0.029367,0.015004,0.024478,-0.013992,0.029117,0.029333,0.037113,0.026604,0.038057,0.0099797,0.0018286,0.0016754,0.020901,0.0038613,0.01297,-0.034692,0.0052665,0.0050711,0.027596,0.0087284,0.016563,-0.022387,0.011676,0.011682,0.035704,0.016331,0.023436,0.00043594,0.0010892,0.0010438,0.0090442,-0.0010306,-0.0011191,-0.010483,0.0021387,0.0020572,0.0087122,-0.0015398,0.0009544,-0.013347,0.0045059,0.0043335,0.011172,-9.651e-05,0.0043962,-0.020087,0.0018877,0.0018683,0.14977,0.026949,0.037774,-0.00535,0.0063978,0.0064594,0.16245,0.040353,0.054656,0.0065265,0.013258,0.013598,0.16618,0.053636,0.072963,0.022639,0.40006,74,74,40,1054,3,3,3,0.645
30,-0.0095749,0.35688,0.34286,-0.81044,0.34236,-0.84137,0.038169,-0.57488,6.2992,0.0079461,3.2279,0.002186,6.0876,9.8894,0.37821,14.003,0.013361,0.81066,1.5591,1.1687,0.9328,0.74986,0.12412,0.13957,0.11673,0.071534,0.057236,0.055006,0.4358,0.40908,0.19587,0.085604,1.0572,1.7432,1.3492,0.18807,5.0282,0.28926,0.16416,0.28926,0.51656,1.2553,0.2816,0.83637,0.29068,44,154.16,2434,2.5772e+05,3.8403,16.585,65718,60966,27189,0.91469,0.93585,0.19484,0.13705,0.13681,0.55479,40966,22765,0.0013947,0.00062169,0,0.043177,0,0.046202,0.0015968,0.017157,0.0070299,0.02632,1.5573,2.5069,0.82393,0.22654,0.33179,0.21565,0.26539,0.36309,0.11673,0.28661,0.35285,0.09997,23.165,5.8225,11010,31886,30652,0.18916,0.17627,0.12075,0.54736,0.56505,0.18249,0.77144,0.78898,0.18204,0.88273,0.89225,0.16683,0.93817,0.94286,0.15163,0.0040143,0.0038355,0.054103,0.0075648,0.010347,-0.011651,0.010638,0.01075,0.067801,0.016669,0.020976,0.0041404,0.021772,0.022857,0.08248,0.029563,0.035114,0.026255,0.001344,0.0012778,0.04566,0.0028477,0.0056266,-0.0073593,0.003695,0.0039433,0.057545,0.0075275,0.011068,0.015991,0.008246,0.0093457,0.074942,0.016235,0.020667,0.045169,0.0015105,0.0013598,0.037278,0.00098504,0.00088401,-0.01755,0.0046595,0.0044552,0.056413,0.0079537,0.0076358,-0.011684,0.0099497,0.009957,0.073318,0.017016,0.015883,0.00026141,0.0011597,0.0011979,0.27347,0.027391,0.033541,0.0049671,0.0032142,0.0032214,0.24256,0.032732,0.042228,0.00048158,0.0062296,0.0061831,0.23208,0.040329,0.053308,-0.0020235,0.51542,74,74,40,1054,3,3,3,0.645
30,-0.0027914,0.9646,0.95997,-0.19777,0.95994,-0.19902,0.0063131,-0.36044,7.3098,0.021953,3.2083,0.002629,6.9806,5.5084,1.6029,8.1981,0.0078226,0.19777,5.1091,3.3203,2.3924,1.7355,0.034028,0.046896,0.079181,0.068067,0.063581,0.071096,0.63715,0.011284,0.027704,0.092286,0.20282,0.20433,0.029176,0.10297,0.67058,0.08632,0.13146,0.13146,0.86657,0.97721,0.2901,2.236,2.4954,26,424.96,5693,1.854e+06,3.2168,11.778,1.5371e+05,1.1605e+05,21951,0.90591,0.9158,0.59441,0.48863,0.37057,0.93511,81822,44854,0.0010736,0.00051732,2,0.15311,0,0.1146,0.0067639,0.015834,0.0011263,0.01848,1.8374,0.82245,0.45934,0.1768,0.3482,0.39455,0.15965,0.36714,0.46036,0.15296,0.3609,0.47743,128.15,10.653,19071,98145,97377,0.0077755,0.0051811,0.0079806,0.1026,0.093977,0.054999,0.26724,0.26251,0.10139,0.43915,0.44848,0.13345,0.60117,0.62356,0.15622,0.00018322,0.00011074,0.0039704,-0.014717,-0.011437,-0.02273,0.000799,0.00053856,0.008188,-0.017803,-0.012678,-0.030578,0.0022411,0.0016531,0.013651,-0.01946,-0.012439,-0.035978,5.5994e-05,3.6566e-05,0.0030585,-0.0095887,-0.0081682,-0.0093526,0.00025459,0.0002013,0.0063749,-0.011937,-0.010316,-0.011284,0.00077795,0.00069654,0.011368,-0.013349,-0.01103,-0.0086486,2.2828e-05,1.3306e-05,0.00090579,-0.011329,-0.010236,-0.015534,0.00014884,8.8747e-05,0.0028973,-0.014205,-0.012444,-0.017844,0.00045457,0.00027903,0.0053857,-0.016606,-0.01401,-0.022644,0.0001044,6.087e-05,0.039583,-0.0013138,0.0072216,-0.018593,0.00039569,0.00024857,0.048011,-0.00074993,0.011459,-0.023558,0.0010149,0.00068113,0.060793,0.0010973,0.016265,-0.03059,0.46228,74,74,40,1054,3,3,3,0.645
30,-0.012078,0.48849,0.48335,-0.71847,0.46218,-0.86881,0.20926,0.16509,5.088,0.0057501,3.2799,0.00065519,6.841,9.1144,0.56228,12.813,0.012227,0.71856,2.1332,1.4654,1.1422,0.86888,0.088393,0.092886,0.12275,0.088384,0.062547,0.069788,0.47525,0.29981,0.074205,0.010348,0.18759,0.80545,0.27801,0.031231,1.6867,0.25501,0.21614,0.25501,1.1425,1.4964,0.41059,1.0149,0.51629,63,70.571,1189,48671,3.7038,16.203,32103,24705,22491,0.91796,0.94027,0.10435,0.071475,0.066441,0.4365,30170,19279,0.0011408,0.00058252,0,0.058133,0,0.065924,0.0064217,0.018578,0.0079172,0.02612,1.4891,2.7472,1.1871,0.20088,0.354,0.27197,0.21477,0.42463,0.23895,0.19974,0.44386,0.2493,43.227,7.3433,11874,27358,25534,0.14091,0.14592,0.064712,0.42048,0.44351,0.10085,0.69154,0.71881,0.1174,0.86362,0.88206,0.11742,0.94201,0.95261,0.10952,0.00028027,0.00020538,0.0027174,-0.009285,0.00015483,-0.021014,0.00092389,0.00070961,0.0042362,-0.011397,0.0014001,-0.031018,0.0023391,0.0018731,0.0063748,-0.012626,0.0030819,-0.038945,3.0906e-05,2.4762e-05,0.00075531,-0.0064849,0.00063401,-0.016205,0.00032467,0.00027157,0.0036375,-0.007572,-0.00021124,-0.019841,0.0011087,0.00095216,0.0072488,-0.0077955,3.4068e-05,-0.020715,0.00024936,0.00018062,0.0044271,-0.0061983,-0.0041188,-0.020072,0.00070317,0.00051452,0.0061244,-0.0073804,-0.0031325,-0.029016,0.0015393,0.0011488,0.0081601,-0.0080465,-0.0020708,-0.038703,0,0,0,-0.0032381,0.015504,0,2.0195e-06,1.4556e-06,0.00010964,-0.0044217,0.018829,-0.013003,4.5625e-05,3.3294e-05,0.0012228,-0.0054705,0.022761,-0.018053,0.40359,74,74,40,1054,3,3,3,0.645
30,-0.00068629,0.26813,0.26834,-0.85522,0.26638,-0.7822,-0.085382,0.267,3.5616,0.067476,3.2859,0.00019323,2.2097,4.1059,0.28908,5.2684,0.0050176,0.85531,1.2538,0.9137,0.73491,0.61604,0.11821,0.14095,0.15849,0.08255,0.056371,0.044384,0.39905,0.36382,0.17707,4.282e-07,0.64948,1.9538,3.3201,0.43374,6.898,0.2642,0.20007,0.2642,0.88075,1.538,0.43006,0.69834,0.24141,43,62.186,1344,64453,4.3814,20.65,36288,28350,2619,0.91958,0.94363,0.22884,0.15812,0.1427,0.86776,32444,17548,0.00093351,0.00040164,0,0.048234,0,0.064407,0.0033012,0.017076,0.011006,0.035505,0.93517,1.2093,0.59197,0.22175,0.33047,0.27131,0.31834,0.35008,0.19414,0.32912,0.34425,0.1991,39.587,7.3254,12895,21623,20028,0.086595,0.074797,0.024375,0.32789,0.32775,0.048204,0.52173,0.53698,0.054289,0.66163,0.6812,0.05514,0.77689,0.79247,0.055366,0.00016938,0.00013307,0.0010066,-0.0075974,-0.0018809,-0.028803,0.0009112,0.0007223,0.002561,-0.0089067,0.00062538,-0.032145,0.0022418,0.0017898,0.003745,-0.009985,0.0036043,-0.037813,0,0,0,-0.0052159,-0.003944,0,0,0,0,-0.0069453,-0.0057531,0,1.65e-07,1.1543e-07,6.6124e-07,-0.008676,-0.0060988,-0.016809,6.2151e-05,5.0696e-05,0.00067634,-0.0056428,-0.0039163,-0.017181,0.00044455,0.00035944,0.0023733,-0.0064686,-0.0023201,-0.021837,0.0012647,0.0010194,0.0041094,-0.0068399,-0.0008532,-0.027422,0.00010723,8.2374e-05,0.01115,-0.00062411,0.019024,-0.023219,0.00046665,0.00036285,0.015529,0.00016687,0.024948,-0.023575,0.00097697,0.00077026,0.016049,0.00037404,0.030713,-0.026011,0.35272,74,74,40,1054,3,3,3,0.645
30,-0.001943,0.39577,0.39429,-0.77803,0.39331,-0.81686,0.049904,-3.5615,24.456,-0.064517,2.9772,0.014787,8.0851,12.129,0.44351,21.917,0.020913,0.77803,1.7519,1.184,0.88252,0.69351,0.080758,0.11663,0.15757,0.095749,0.074291,0.060071,0.41493,0.26244,0.17118,0.027992,0.099718,0.3137,0.56057,0.10524,1.5408,0.16961,0.33407,0.33407,0.63572,1.0645,0.31043,0.90286,0.39971,37,107.81,1889,1.4218e+05,4.0011,17.65,51003,38124,5319,0.91646,0.93515,0.042232,0.031698,0.020653,0.10597,28191,17894,0.0010078,0.00049539,0,0.067485,0,0.057464,0.00096271,0.0092625,0.00079374,0.011229,0.84053,0.52297,0.20792,0.19898,0.31002,0.22706,0.21084,0.30763,0.14085,0.19027,0.26849,0.11481,31.593,6.1307,29232,73702,72955,0.28645,0.35262,0.11502,0.5863,0.65383,0.12296,0.79715,0.84258,0.11833,0.91596,0.93893,0.10889,0.95982,0.97131,0.097578,3.8694e-05,2.5732e-05,0.00032804,-0.0096153,-0.0036863,-0.013925,0.00026766,0.00018471,0.0010731,-0.012247,-0.0024679,-0.018762,0.00097639,0.00068809,0.0023267,-0.014249,-0.00045429,-0.026913,3.8694e-05,2.5732e-05,0.00082687,-0.0060053,-0.0020188,-0.013925,0.00026766,0.00018471,0.0026221,-0.0072894,-0.0012621,-0.018762,0.00097639,0.00068809,0.0055818,-0.0076502,0.0009736,-0.026913,0,0,0,-0.0070847,-0.0068958,0,0,0,0,-0.0092293,-0.0083616,0,0,0,0,-0.011342,-0.0094618,0,0,0,0,-0.0030232,0.014932,0,0,0,0,-0.0041471,0.018946,0,0,0,0,-0.0053796,0.022722,0,0.41638,74,74,40,1054,3,3,3,0.645
30,-0.0052351,0.6606,0.65219,-0.58923,0.65219,-0.5882,-0.0017389,0.067792,5.8945,0.0060862,3.2423,0.0019203,4.5424,5.0092,0.82075,6.8784,0.0065634,0.58923,2.7829,1.9162,1.374,1.0228,0.078176,0.072714,0.10874,0.079071,0.078816,0.073615,0.50887,0.29651,0.024221,0.0060422,0.15765,0.1,0.064813,0.0015891,0.65082,0.14553,0.1765,0.1765,0.36095,0.62453,0.20488,1.2692,0.76308,23,267.7,5368,1.2413e+06,4.4177,20.694,1.4494e+05,11178,8505,0.91467,0.93327,0.41124,0.30295,0.2953,0.88446,49545,26813,0.00093144,0.00042656,0,0.044881,0,0.050555,0.0011014,0.0058881,0.0066582,0.010737,0.17375,0.10413,0.25034,0.26194,0.3389,0.27142,0.3599,0.37115,0.22596,0.39096,0.36174,0.21133,51.571,7.3284,15614,39262,37902,0.021116,0.016348,0.011884,0.18557,0.17935,0.054546,0.44667,0.46454,0.092929,0.63533,0.66455,0.10586,0.74461,0.77279,0.1061,0.0013943,0.0013675,0.016568,-0.0051176,-0.0062683,-0.0038013,0.0043885,0.0042839,0.02466,-0.0025689,-0.0035766,-0.0061603,0.0086537,0.0083828,0.028903,-0.00046077,7.6067e-05,-0.010235,0,0,0,-0.0074314,-0.0082025,0,0,0,0,-0.0098952,-0.010711,0,6.0867e-07,4.3538e-07,4.8771e-06,-0.01236,-0.011676,-0.010243,2.455e-07,1.6926e-07,5.3415e-06,-0.0084225,-0.010588,-0.011173,1.7657e-05,1.2243e-05,0.00018848,-0.010904,-0.01352,-0.012693,9.0064e-05,6.2858e-05,0.00058512,-0.01322,-0.016166,-0.014253,0.0013941,0.0013674,0.28983,0.031579,0.036767,-0.0037905,0.0043708,0.0042717,0.29081,0.043482,0.050684,-0.0058431,0.0085631,0.0083195,0.28125,0.05434,0.064367,-0.0092236,0.38504,74,74,40,1054,3,3,3,0.645
