30,-0.079818,0.71249,0.75484,-0.49441,0.45129,-0.80794,0.63414,0.33377,2.9411,0.047629,3.3233,1.2689e-05,2.9674,2.9495,1.0102,3.7528,0.0035809,0.49441,7.3757,4.9618,2.3154,0.89373,0.021952,0.03366,0.057525,0.048685,0.13484,0.22804,0.47529,0.69479,1.1124,1.8418,2.6083,0.010887,0.2768,0.030768,6.5757,0.084644,0.23321,0.23321,1.4057,1.4216,0.40887,1.48,1.0887,72,51.681,1287,40435,4.9831,28.17,34749,28593,9828,0.9121,0.93202,0.081465,0.068186,0.0077751,0.20571,20787,11927,0.0010622,0.00043924,2,0.27263,0,0.064449,0.10525,0.41362,0.13255,0.53501,0.4991,0.93981,0.49387,0.24961,0.30666,0.22907,0.30985,0.29705,0.14625,0.28958,0.25812,0.12963,18.961,6.185,51678,2.1535e+05,2.1503e+05,0.20698,0.18845,0.091649,0.44887,0.44509,0.10434,0.59946,0.62886,0.098543,0.70337,0.73556,0.092259,0.78186,0.80747,0.087606,0.010197,0.0073769,0.0897,0.030757,0.021622,-0.040366,0.023756,0.018086,0.098264,0.045901,0.032796,-0.049166,0.04408,0.035213,0.10803,0.064288,0.04576,-0.054226,0.0020932,0.0015013,0.043747,0.0064975,0.0074268,-0.021029,0.0059759,0.0045738,0.056828,0.013935,0.010758,-0.025792,0.012549,0.010119,0.069342,0.023674,0.016197,-0.028241,0.0069498,0.0049963,0.11697,0.03057,0.016258,-0.03294,0.015235,0.011535,0.12571,0.043501,0.025145,-0.038886,0.027209,0.021732,0.13637,0.059005,0.035332,-0.041556,0.0011542,0.00087934,0.17987,0.021839,0.026335,-0.014789,0.0035839,0.0026658,0.17757,0.02986,0.035606,-0.021284,0.0072059,0.0052622,0.17696,0.038529,0.044131,-0.029751,0.56334,74,74,40,1054,3,3,3,0.645
30,-0.067474,0.44313,0.57238,-0.65351,0.14771,-1.2164,0.86135,-0.10606,1.7549,-0.080128,3.3018,0.0027014,2.0751,2.4918,0.6922,2.8973,0.0027646,0.65355,6.6129,4.0227,1.3838,0.39866,0.025863,0.033454,0.053459,0.069189,0.22511,0.3018,0.29113,0.93333,2.8013,4.9814,1.9287,0.098544,0.29557,2.2141,13.253,0.087105,0.13422,0.13422,0.25939,0.34187,0.1496,1.1483,0.65766,56,145.98,7776,1.0759e+06,7.2773,53.979,2.0995e+05,3645,1296,0.90073,0.90844,0.16679,0.13498,0.091931,0.40364,26278,16192,0.001065,0.00047751,0,0.097073,0,0.058428,0.030342,0.065839,0.037203,0.078597,0.3693,0.66934,0.42497,0.27738,0.32179,0.21678,0.31845,0.32289,0.16674,0.32854,0.31274,0.15133,12.831,5.8529,19227,1.1625e+05,1.1581e+05,0.18064,0.17572,0.14507,0.36128,0.35603,0.1523,0.50216,0.49189,0.14972,0.60991,0.6069,0.14509,0.70444,0.71372,0.14315,0.010224,0.01167,0.16311,0.041953,0.042071,0.032086,0.02167,0.023992,0.16257,0.055324,0.055077,0.032403,0.036716,0.039378,0.1632,0.069034,0.067447,0.027558,0.0047052,0.0059529,0.17836,0.031106,0.033848,0.040352,0.0097372,0.011927,0.16794,0.03845,0.039936,0.044915,0.016267,0.019492,0.16302,0.046175,0.046794,0.049091,0.0032588,0.0031735,0.099475,0.014344,0.012316,-0.0032518,0.0067346,0.0062902,0.10079,0.019101,0.017036,-0.010916,0.011804,0.010668,0.1073,0.026012,0.022695,-0.020719,0.0022597,0.0025435,0.63871,0.062103,0.061377,0.016844,0.0064776,0.0070876,0.58208,0.078019,0.077257,0.016489,0.011704,0.012375,0.52127,0.089728,0.08883,0.012229,0.85696,74,74,40,1054,3,3,3,0.645
30,-0.058024,0.44282,0.55792,-0.66449,0.18632,-1.2068,0.81611,-0.16982,2.1131,-0.044976,3.3308,0.0015681,2.8578,3.4877,0.67013,3.9888,0.0038061,0.66458,5.2118,3.3012,1.3064,0.38456,0.044624,0.042256,0.054005,0.073225,0.20591,0.29558,0.2844,0.015941,1.1397,4.7724,1.4398,0.080788,0.29677,2.1671,9.9125,0.067961,0.060136,0.067961,0.43236,0.75181,0.22095,1.1273,0.63235,61,99.639,5427,4.8002e+05,7.5986,58.832,1.4653e+05,3564,3456,0.90791,0.92298,0.19419,0.1506,0.10634,0.51339,24220,14207,0.0011077,0.00044822,0,0.081392,0,0.061072,0.0016246,0.045701,0.0014724,0.073854,0.15507,0.039597,0.14764,0.27214,0.31532,0.22225,0.32601,0.30931,0.15934,0.33921,0.28981,0.14257,15.231,6.0007,14293,54110,53415,0.19069,0.20065,0.11909,0.40041,0.40829,0.13127,0.53749,0.53304,0.12462,0.63064,0.62446,0.11667,0.71309,0.713,0.1127,0.012117,0.013206,0.15034,0.04587,0.044641,0.026007,0.026755,0.029392,0.1561,0.063688,0.062262,0.039007,0.046085,0.050747,0.1593,0.081095,0.079924,0.050359,0.0046188,0.004717,0.13616,0.026658,0.022108,0.0036385,0.0093182,0.010015,0.12498,0.031844,0.02777,0.016844,0.015431,0.017169,0.12027,0.037771,0.03495,0.031575,0.0060126,0.0070941,0.14273,0.030411,0.031869,0.035683,0.012626,0.014975,0.14694,0.041121,0.043495,0.049379,0.021479,0.025332,0.15184,0.052709,0.055447,0.059581,0.001486,0.0013951,0.32664,0.034599,0.037822,-0.0086471,0.0051042,0.0046824,0.3567,0.052891,0.053537,-0.015573,0.010097,0.009114,0.34974,0.067051,0.066915,-0.023014,0.67764,74,74,40,1054,3,3,3,0.645
30,-0.0019811,0.16652,0.16479,-0.91381,0.16248,-1.0221,0.11848,-1.3406,9.9321,-0.032021,3.2276,0.0028663,4.9539,11.927,0.17218,20.528,0.019588,0.91383,1.0136,0.64287,0.49701,0.39281,0.13327,0.15107,0.1933,0.11629,0.061541,0.05186,0.29267,0.37713,0.1787,0.0083959,0.17089,2.0964,2.7058,2.0934,7.6306,0.49144,0.3023,0.49144,0.63009,1.1481,0.26599,0.52925,0.13919,40,78.7,1977,97845,5.5777,33.844,53379,8613,8208,0.91178,0.93564,0.27529,0.19803,0.14789,0.85544,58707,23587,0.00079524,0.00040365,0,0.069608,0,0.081517,0.011579,0.0040317,0.012713,0.0024361,0.40297,1.9656,1.9117,0.2501,0.36904,0.27313,0.31114,0.45782,0.20782,0.31439,0.47437,0.19299,42.784,7.3745,15769,32114,30846,0.017536,0.01324,0.0067685,0.23389,0.21444,0.04739,0.51493,0.51251,0.073789,0.70308,0.71249,0.080391,0.80284,0.81037,0.078417,0.00070805,0.00076901,0.0054295,-0.0067331,-0.00080561,0.014285,0.0028075,0.0031389,0.010123,-0.0058928,0.004735,0.027582,0.0064995,0.0072849,0.013885,-0.0043057,0.011562,0.038643,2.4946e-09,1.7437e-09,4.5449e-08,-0.0061849,-0.0045839,-0.014119,2.6125e-06,1.8262e-06,2.1657e-05,-0.0082587,-0.0050365,-0.014119,5.4194e-05,3.8519e-05,0.00026105,-0.010186,-0.0040659,-0.017849,0,0,0,-0.0066399,-0.0030441,0,1.2195e-05,9.1764e-06,8.772e-05,-0.0086119,-0.0013935,-0.017516,0.00015816,0.00011634,0.00069102,-0.010258,0.00052593,-0.024999,0.00070805,0.000769,0.096193,0.011388,0.023529,0.014285,0.0027927,0.0031279,0.12062,0.020819,0.037117,0.027901,0.0062871,0.00713,0.13459,0.030687,0.051221,0.041638,0.38082,74,74,40,1054,3,3,3,0.645
30,-0.040751,0.4042,0.43815,-0.74929,0.2753,-1.2061,0.60966,0.89294,7.4226,0.10562,3.2851,0.00040003,3.2351,4.5666,0.50091,5.4472,0.0051977,0.7493,2.146,1.4647,1.101,0.48314,0.089275,0.090173,0.12338,0.089803,0.071774,0.20267,0.33293,0.26125,0.019271,0.056212,0.33284,0.70079,0.17538,0.74828,2.294,0.28975,0.27187,0.28975,1.1294,1.6076,0.46448,0.93757,0.38405,68,57.25,1893,63165,6.1906,43.242,51111,23382,6129,0.91228,0.9351,0.08097,0.058555,0.025033,0.28431,27394,15606,0.0013908,0.00058862,0,0.087423,0,0.06601,0.020982,0.11617,0.024569,0.17103,0.41213,1.9525,1.5494,0.24045,0.33524,0.23757,0.27448,0.33655,0.15901,0.26091,0.35626,0.15965,27.447,6.4144,14929,37812,36692,0.22562,0.21827,0.10473,0.57064,0.5843,0.13905,0.73084,0.75824,0.12595,0.81103,0.83531,0.11152,0.87074,0.88513,0.10228,0.014855,0.019633,0.13699,0.050609,0.055549,0.12881,0.032629,0.042844,0.14149,0.069682,0.077417,0.16585,0.055108,0.072245,0.14158,0.086576,0.098262,0.2046,0.00191,0.0023249,0.041849,0.0054793,0.0096252,0.036619,0.0053866,0.0065137,0.053701,0.011972,0.016075,0.047277,0.010048,0.012222,0.058205,0.017158,0.022265,0.06044,0.0096101,0.011907,0.16956,0.046099,0.043633,0.076834,0.021435,0.028413,0.18542,0.066572,0.068113,0.13946,0.037054,0.051453,0.19469,0.086548,0.093369,0.20902,0.0033352,0.0054013,0.54491,0.070574,0.092749,0.1341,0.0090557,0.013794,0.47036,0.083933,0.10941,0.15087,0.016584,0.023983,0.42693,0.098168,0.12696,0.16207,0.47094,74,74,40,1054,3,3,3,0.645
30,-0.013508,0.47486,0.4544,-0.73836,0.4532,-0.77618,0.051228,-0.43791,5.7018,-0.033929,3.2701,0.0010178,6.9538,9.6091,0.52271,14.647,0.013976,0.73839,2.2511,1.6302,1.2679,0.83966,0.12062,0.087144,0.090596,0.073575,0.061543,0.10402,0.4625,0.43564,0.032825,0.30842,0.60937,0.91793,0.0013107,0.056367,2.3619,0.50048,0.31523,0.50048,0.545,0.71056,0.30674,0.96633,0.44985,85,41.859,2819,92818,8.9615,81.864,76113,3861,3321,0.91472,0.93559,0.021082,0.015518,0.046074,0.12795,24131,12715,0.0014743,0.00057279,0,0.073445,0,0.057027,0.018181,0.069965,0.038489,0.12857,0.38136,2.442,2.3746,0.26424,0.30158,0.22407,0.33682,0.27082,0.093336,0.3652,0.25292,0.073633,15.147,6.0498,12372,31558,30490,0.30073,0.30251,0.12878,0.71529,0.76832,0.1608,0.87313,0.90498,0.13882,0.91115,0.934,0.11559,0.9434,0.95844,0.10223,0.0019123,0.0015054,0.01627,-0.0023613,0.0057319,-0.027224,0.0042027,0.0033648,0.016813,-0.0027944,0.0098103,-0.034244,0.0080706,0.0066144,0.019129,-0.0017082,0.015595,-0.04143,0.00019376,0.00017906,0.0039167,-0.0053267,-0.0019903,-0.0050135,0.00076831,0.00069695,0.0070663,-0.0058361,-0.0020181,-0.0082369,0.0022163,0.002076,0.011845,-0.0048547,0.00022382,-0.0088929,0.0015779,0.0012277,0.025684,0.0014115,0.0051601,-0.024581,0.0029567,0.0023209,0.023596,0.00094762,0.008063,-0.029116,0.0046248,0.0036264,0.022419,0.00054774,0.011358,-0.034648,0.00014065,9.8623e-05,0.021199,-2.4724e-05,0.017213,-0.019268,0.000673,0.00048196,0.032249,0.0021229,0.024282,-0.025166,0.0017072,0.0012533,0.040548,0.0048488,0.031636,-0.030171,0.51503,74,74,40,1054,3,3,3,0.645
30,-0.012824,0.619,0.62555,-0.61144,0.58576,-0.45723,-0.2522,-2.3628,28.444,-0.056534,3.1513,0.0063704,16.531,18.744,0.7763,50.48,0.048168,0.61146,2.5242,1.8484,1.4679,1.1477,0.096424,0.083766,0.098422,0.067802,0.054513,0.060855,0.53822,0.38515,0.054638,0.074359,0.51255,0.94435,0.361,0.0016522,2.3337,0.3815,0.37544,0.3815,0.74619,1.4453,0.40004,1.3319,0.87787,70,78.257,3138,1.5051e+05,7.2089,56.316,84726,24192,6939,0.90882,0.92963,0.16156,0.12042,0.085369,0.47213,29860,15290,0.0017015,0.00065087,0,0.10182,0,0.070159,0.063357,0.05961,0.087257,0.081879,0.34373,1.0862,1.8517,0.27813,0.32058,0.21402,0.34627,0.31946,0.11833,0.37542,0.3211,0.10094,15.28,5.7786,12614,39567,38728,0.24088,0.22736,0.14132,0.6556,0.70409,0.2019,0.8299,0.86173,0.18075,0.89507,0.91389,0.15555,0.94138,0.95078,0.13975,0.0026751,0.0021192,0.031178,0.00075228,0.0049438,-0.031653,0.0058009,0.0046872,0.031792,0.0013187,0.0082826,-0.038633,0.010337,0.0085414,0.033566,0.0027946,0.012911,-0.045302,0.00040535,0.00029842,0.011225,-0.0047264,-0.0038507,-0.017032,0.0010877,0.00084483,0.013704,-0.0054506,-0.0035929,-0.020684,0.0025962,0.0021381,0.019007,-0.00449,-0.0012235,-0.025898,0.0018452,0.0015014,0.041145,0.0033334,0.0050537,-0.023038,0.0039377,0.0032268,0.04305,0.0050404,0.0082945,-0.030074,0.0069051,0.0057058,0.045854,0.0074614,0.012499,-0.036726,0.0004246,0.00031941,0.087675,0.007048,0.019786,-0.018548,0.0012237,0.00093895,0.080328,0.008549,0.02303,-0.022975,0.002259,0.0017537,0.073501,0.0095933,0.026428,-0.027363,0.591,74,74,40,1054,3,3,3,0.645
30,-0.0011613,0.28879,0.28669,-0.84442,0.28668,-0.8475,0.0036544,2.3492,18.393,0.048969,3.1649,0.0051608,8.0652,14.455,0.3107,36.465,0.034795,0.84449,1.623,1.0662,0.77389,0.57232,0.1284,0.09874,0.14112,0.10489,0.081425,0.073788,0.37163,0.42103,0.056911,0.0049255,0.12842,0.37676,0.36585,0.4563,1.8102,0.35064,0.47937,0.47937,0.97135,0.99354,0.36211,0.76135,0.27963,62,106.29,6108,5.9901e+05,7.666,59.851,1.6492e+05,5373,3132,0.91062,0.93065,0.077787,0.05582,0.045168,0.22568,19392,12561,0.0011091,0.00051208,0,0.046503,0,0.044756,0.020492,0.038264,0.027232,0.049403,0.15187,0.066133,0.28864,0.26601,0.32499,0.20842,0.3171,0.31751,0.11332,0.33112,0.31819,0.10481,8.5921,5.6272,11833,38871,37464,0.30309,0.30789,0.20379,0.6527,0.67718,0.23037,0.81486,0.83744,0.2034,0.8958,0.9116,0.17842,0.93538,0.94538,0.15915,0.0039636,0.0040056,0.052944,0.0071995,0.01521,0.0022922,0.0092687,0.0093094,0.058218,0.01213,0.021939,0.0013494,0.017185,0.017057,0.063952,0.018562,0.029811,-0.0029628,0.00063922,0.00049202,0.020287,-0.0032523,0.0013296,-0.022838,0.0019559,0.0015557,0.028243,-0.0017417,0.0018502,-0.031103,0.0042366,0.0035156,0.035549,0.00081344,0.0042354,-0.035164,0.003183,0.0033995,0.081346,0.01257,0.015482,0.0132,0.007116,0.0076896,0.089162,0.019057,0.022942,0.021178,0.01244,0.013382,0.094678,0.025761,0.030045,0.025013,0.00014139,0.00011405,0.033459,-1.1383e-05,0.015825,-0.015416,0.00068058,0.00056612,0.051203,0.0027662,0.022627,-0.017713,0.0018029,0.001558,0.067229,0.0068381,0.030387,-0.019291,0.82139,74,74,40,1054,3,3,3,0.645
30,-0.0099933,0.18032,0.19586,-0.89663,0.14321,-1.3615,0.51849,0.11957,2.8584,-0.018297,3.3573,0.0001954,3.3104,7.2837,0.20618,9.7487,0.0093022,0.89679,1.4305,0.6385,0.45809,0.34819,0.090954,0.12134,0.18971,0.20207,0.076724,0.056805,0.2624,0.1788,0.048168,0.00020798,0.024301,1.0758,2.3357,3.5213,7.1842,0.034717,0.1602,0.1602,0.75137,0.77655,0.29536,0.58184,0.1687,50,162.3,7317,1.064e+06,6.8345,47.814,1.9756e+05,7830,3807,0.90387,0.92222,0.38757,0.3007,0.23381,0.76204,66749,37414,0.0011727,0.00053288,0,0.089069,0,0.074801,0.0023524,0.022293,0.0026735,0.025963,0.57442,0.10466,0.29432,0.2613,0.39579,0.25562,0.28406,0.46305,0.23147,0.30211,0.46921,0.21275,52.187,6.9017,13767,58725,57716,0.023775,0.017007,0.019391,0.23349,0.22334,0.099966,0.49893,0.5036,0.15107,0.71156,0.72983,0.17192,0.85589,0.87791,0.17665,1.9899e-05,1.1984e-05,0.00032242,-0.01367,-0.0048347,-0.017947,0.00023927,0.00014714,0.0018231,-0.017434,-0.0046944,-0.02887,0.0010934,0.00068764,0.0049359,-0.019911,-0.0031247,-0.042523,1.198e-05,7.0986e-06,0.00046121,-0.0089875,-0.0044427,-0.012486,0.00010386,6.259e-05,0.0018192,-0.011609,-0.0062774,-0.016832,0.00043027,0.00026892,0.0043794,-0.013544,-0.0071289,-0.026184,3.7447e-06,2.3963e-06,0.00011609,-0.0097314,-0.0063198,-0.01462,9.3178e-05,5.9322e-05,0.0014162,-0.012273,-0.0064765,-0.021962,0.00048153,0.00030997,0.0044455,-0.01393,-0.0057859,-0.027628,4.1738e-06,2.4894e-06,0.0011982,-0.0040687,0.014356,-0.0092511,4.2239e-05,2.5223e-05,0.0038548,-0.0052659,0.018582,-0.012662,0.00019913,0.00011922,0.0090076,-0.0058678,0.023748,-0.020887,0.46766,74,74,40,1054,3,3,3,0.645
30,-0.016231,0.14012,0.16796,-0.91207,0.076542,-1.585,0.73776,0.10172,2.2882,0.04063,3.3724,0.00081661,1.9755,4.7091,0.17566,5.6753,0.0054154,0.91208,1.1796,0.44028,0.33408,0.26454,0.096405,0.12054,0.22522,0.24274,0.056971,0.042488,0.21562,0.069988,9.4835e-05,0.0020408,0.0072184,7.0388,12.143,12.768,32.028,0.16629,0.19651,0.19651,0.36206,1.0071,0.22818,0.53404,0.14226,45,107.24,4089,3.6776e+05,6.423,42.51,1.104e+05,6426,4212,0.9061,0.92159,0.36162,0.30188,0.13567,0.81453,82564,28340,0.0010805,0.00049962,0,0.073668,0,0.045889,0.00016645,0.00025035,0.0013059,6.854e-05,0.87783,0.38341,1.0703,0.21803,0.36844,0.31397,0.22165,0.42293,0.3168,0.20702,0.41487,0.34299,51.865,8.4771,30187,1.2872e+05,1.282e+05,0.019135,0.011705,0.0098783,0.21598,0.18874,0.05853,0.4759,0.4911,0.091209,0.7151,0.76226,0.10936,0.8719,0.91163,0.1139,0.0028209,0.0025299,0.028931,0.0013358,0.0044876,-0.013319,0.0076423,0.0078408,0.036855,0.0062006,0.012445,0.0048799,0.0153,0.017104,0.043715,0.01246,0.022722,0.029344,0.0023723,0.0022383,0.057805,0.0089232,0.0089759,-0.0063424,0.0055009,0.0063561,0.060988,0.013113,0.015421,0.023629,0.010026,0.013301,0.064588,0.018051,0.024274,0.063572,6.485e-05,3.2964e-05,0.0012725,-0.007324,-0.0047627,-0.019923,0.00043167,0.00022872,0.0041527,-0.0084206,-0.0044691,-0.026274,0.0013596,0.00075875,0.0079451,-0.0085386,-0.0034503,-0.036352,0.00038381,0.00025865,0.069738,0.0056476,0.012267,-0.023101,0.0017098,0.001256,0.098763,0.013009,0.021536,-0.02641,0.0039147,0.003044,0.11208,0.019926,0.030869,-0.029107,0.41152,74,74,40,1054,3,3,3,0.645
30,-0.0020517,0.10353,0.10626,-0.94533,0.095612,-1.2445,0.3165,0.63631,4.1541,0.061506,3.2377,0.0010183,3.2943,9.9579,0.10924,14.718,0.014044,0.94533,0.79783,0.53736,0.40371,0.29478,0.15976,0.17862,0.21231,0.095413,0.062704,0.060682,0.23051,0.4166,0.19491,0.01091,0.75746,2.7516,2.2384,5.8911,12.261,0.23375,0.11822,0.23375,1.1083,1.5577,0.4214,0.41739,0.087023,29,132,3060,3.2127e+05,4.9218,25.774,82620,11637,6075,0.90922,0.9318,0.34861,0.2842,0.13218,0.91689,54919,20385,0.0016539,0.00051826,0,0.12055,0,0.08561,0.01095,0.030788,0.013252,0.031438,0.38214,0.30627,0.40566,0.2531,0.35765,0.25353,0.30077,0.39891,0.20469,0.30873,0.40278,0.1905,64.717,6.8454,32210,1.0256e+05,1.0196e+05,0.10383,0.099082,0.041709,0.34586,0.35925,0.072934,0.54827,0.593,0.081768,0.70993,0.75894,0.084483,0.81762,0.85695,0.083115,0.0030257,0.0020485,0.024148,0.0019549,0.0077866,-0.045257,0.0079989,0.0054332,0.030018,0.0062996,0.012681,-0.065339,0.016127,0.011105,0.035856,0.012402,0.019233,-0.08524,0.00074473,0.00051154,0.014121,-0.0018667,0.0059897,-0.017681,0.001511,0.0011007,0.013036,-0.0029522,0.0060274,-0.022845,0.0037509,0.0029672,0.018804,-0.00065532,0.008536,-0.030093,0.00022309,0.00013245,0.0034063,-0.0056254,-0.0028619,-0.026716,0.0011159,0.00066613,0.0083538,-0.0051508,-0.00035578,-0.036646,0.0029085,0.0017781,0.013226,-0.0036962,0.0027038,-0.047324,0.0020579,0.0014045,0.29098,0.039331,0.032756,-0.039627,0.0055245,0.0037531,0.24833,0.045983,0.041029,-0.053704,0.0098838,0.0066032,0.2202,0.052228,0.049506,-0.067816,0.37752,74,74,40,1054,3,3,3,0.645
30,-0.0085947,0.121,0.13472,-0.93013,0.086759,-1.4851,0.59667,-0.085136,2.8365,-0.047829,3.3603,6.7963e-05,2.0832,5.5745,0.13939,7.0418,0.0067193,0.93023,0.9157,0.41711,0.33015,0.25214,0.12024,0.16561,0.21322,0.19247,0.048344,0.049085,0.21103,0.22765,0.13487,0.00015658,0.0016828,7.9809,5.7441,9.72,23.809,0.17965,0.12855,0.17965,0.1868,0.40426,0.13293,0.474,0.11076,28,185,4295,6.5298e+05,4.8605,25.063,1.1596e+05,14499,8640,0.90738,0.92718,0.33323,0.26175,0.17221,0.79084,54592,25760,0.0012559,0.00056021,0,0.079001,0,0.058325,2.9064e-05,0.0054139,0.0033239,0.005985,0.3846,2.0309,1.347,0.23149,0.37892,0.27334,0.25324,0.45912,0.23264,0.25164,0.4624,0.24161,38.986,7.3803,19178,64155,63404,0.048521,0.036007,0.026708,0.30874,0.31514,0.089211,0.57561,0.61078,0.11763,0.76321,0.79518,0.12445,0.88036,0.90159,0.12262,0.00051067,0.00034902,0.0055844,-0.0089577,0.00075454,-0.025177,0.002189,0.0016167,0.011256,-0.0087906,0.0036127,-0.038239,0.0061377,0.0047543,0.018699,-0.0059052,0.0087029,-0.048095,0.00025002,0.00018735,0.0064961,-0.0056633,-0.0013924,-0.016605,0.0011823,0.00094415,0.013976,-0.0048712,-0.00090026,-0.021989,0.0033669,0.0028025,0.023128,-0.0019591,0.0018417,-0.02659,0.00026065,0.00016168,0.0054533,-0.0063822,0.00066349,-0.019044,0.0010049,0.00067118,0.010308,-0.0064823,0.0027704,-0.032223,0.0026611,0.0018769,0.016581,-0.0050589,0.0054644,-0.040262,0,0,0,-0.0034204,0.006216,0,1.7808e-06,1.3913e-06,0.00010968,-0.004727,0.0097716,-0.0084679,0.00010966,7.4879e-05,0.0033477,-0.0053988,0.013882,-0.023195,0.43015,74,74,40,1054,3,3,3,0.645
30,-0.0015199,0.28956,0.29143,-0.8416,0.28362,-0.97942,0.16375,-0.40416,4.846,-0.02167,3.3249,0.00023612,6.7835,12.049,0.31634,20.854,0.019899,0.84167,1.6946,1.0215,0.77002,0.5765,0.089422,0.13491,0.13856,0.12519,0.071198,0.070255,0.37046,0.24698,0.1816,0.0084941,0.02526,0.73391,0.49506,0.48938,2.1807,0.32441,0.21136,0.32441,0.52263,1.2796,0.27511,0.72854,0.24833,58,76.207,4045,2.8012e+05,7.4005,55.851,1.0922e+05,3807,1404,0.91138,0.93425,0.2991,0.22223,0.18368,0.80887,32274,18441,0.0018557,0.00064269,0,0.062889,0,0.058983,0.0012484,0.028009,0.0033009,0.04787,0.58711,0.26439,1.336,0.27462,0.35508,0.23299,0.37291,0.39736,0.11273,0.40257,0.39408,0.091579,28.95,6.2908,16327,42030,40876,0.13426,0.12069,0.063295,0.54734,0.565,0.13545,0.77183,0.79133,0.13508,0.87524,0.88861,0.12223,0.9383,0.94901,0.11193,0.0042481,0.0038822,0.039785,0.0071734,0.014876,-0.020891,0.012284,0.011623,0.054099,0.017868,0.026422,-0.019061,0.025701,0.024684,0.067058,0.031586,0.040962,-0.019158,0.0024545,0.002306,0.054617,0.0090501,0.012764,-0.010485,0.0062928,0.0062772,0.063711,0.015637,0.018408,-0.00061149,0.012728,0.013064,0.074882,0.024959,0.026624,0.0088553,0.00066017,0.00049166,0.011829,-0.003657,0.0013432,-0.024011,0.002277,0.0017631,0.020003,-0.001436,0.0049709,-0.036211,0.0057855,0.004603,0.030872,0.003677,0.011029,-0.04879,0.0011334,0.0010846,0.18807,0.022089,0.030945,-0.0063827,0.0037177,0.003585,0.19611,0.032148,0.043634,-0.0069538,0.007254,0.0070654,0.18965,0.040087,0.055491,-0.0064142,0.44814,74,74,40,1054,3,3,3,0.645
30,-0.0013265,0.16959,0.16964,-0.91115,0.16618,-1.0412,0.14278,-0.58239,6.9579,-0.0070253,3.2443,0.0013843,4.1437,9.8355,0.17716,15.764,0.015042,0.91132,1.0677,0.68703,0.50902,0.4001,0.12784,0.16275,0.18894,0.11,0.070478,0.051962,0.28803,0.38844,0.22653,0.01278,0.20636,1.149,2.4295,2.0241,6.4367,0.35766,0.27695,0.35766,0.38392,0.83586,0.19151,0.53596,0.13201,43,134.14,4984,5.7663e+05,6.1801,39.735,1.3457e+05,17037,3132,0.90913,0.92996,0.30233,0.21961,0.20868,0.7316,53413,31650,0.0011227,0.00051738,0,0.064881,0,0.064553,0.0030243,0.0078674,0.00065724,0.0034036,0.16304,0.89152,1.3264,0.23597,0.39096,0.26504,0.26936,0.47764,0.22348,0.27336,0.49673,0.20758,55.44,7.1561,10745,31423,30236,0.028369,0.020852,0.017927,0.23781,0.22979,0.078888,0.47055,0.47194,0.11039,0.63323,0.63129,0.11854,0.74801,0.74014,0.11962,0.00052343,0.00037631,0.0065714,-0.0095567,-0.0045218,-0.026724,0.0013516,0.00098666,0.0079792,-0.011945,-0.0038521,-0.036082,0.0026692,0.0019761,0.0093359,-0.013975,-0.0025043,-0.046126,0.00028393,0.00021171,0.0084692,-0.0058255,-0.0060452,-0.015831,0.00063749,0.00048189,0.008652,-0.0077258,-0.0070374,-0.021509,0.0012575,0.00095139,0.0099167,-0.0091157,-0.007033,-0.029727,0.00013398,9.0193e-05,0.0032181,-0.0076774,-0.0038985,-0.017467,0.00033502,0.00022902,0.0039454,-0.0097462,-0.0055039,-0.02039,0.00058105,0.00040104,0.0041564,-0.011894,-0.0069933,-0.023834,0.00010552,7.44e-05,0.023471,-0.00093974,0.011922,-0.017301,0.00037911,0.00027576,0.026807,-0.00076496,0.017764,-0.02151,0.00083071,0.00062369,0.029114,-0.00050815,0.023542,-0.02602,0.38983,74,74,40,1054,3,3,3,0.645
30,-0.060327,0.4764,0.58195,-0.64614,0.21828,-1.1569,0.79051,0.11806,2.4805,0.016246,3.363,0.00026264,3.4538,4.1035,0.70704,4.9741,0.0047463,0.64614,6.2177,3.8581,1.3914,0.47419,0.031859,0.039219,0.059339,0.067929,0.21433,0.26262,0.3247,0.19859,1.1448,2.6379,1.3614,0.12972,0.27879,0.9904,6.7416,0.13225,0.099979,0.13225,0.519,1.2568,0.31208,1.1804,0.64854,72,68.736,4159,2.3988e+05,8.1842,68.602,1.1229e+05,10827,2943,0.90914,0.92568,0.072685,0.056547,0.018546,0.20586,18073,11387,0.0010387,0.00046647,0,0.10371,0,0.063068,0.075026,0.098164,0.097024,0.1286,0.04939,0.22291,0.22055,0.2558,0.31805,0.21469,0.31071,0.30395,0.13274,0.30151,0.2967,0.11886,12.571,5.7967,9590.4,34395,33864,0.24534,0.24941,0.13592,0.48869,0.50487,0.14212,0.6315,0.6501,0.12989,0.72973,0.74855,0.11976,0.80139,0.82217,0.11235,0.0068559,0.005667,0.075458,0.019501,0.018671,-0.034328,0.016091,0.014089,0.083276,0.030054,0.029319,-0.035574,0.0309,0.028922,0.094748,0.045007,0.044918,-0.024363,0.0022251,0.0018609,0.058187,0.0082172,0.0081496,-0.019138,0.0054087,0.0047793,0.064354,0.013203,0.011302,-0.019243,0.010383,0.0096189,0.071783,0.019828,0.016945,-0.015899,0.0039901,0.003343,0.084023,0.016286,0.013301,-0.024698,0.0095163,0.0083549,0.098247,0.026574,0.022448,-0.026638,0.018217,0.017279,0.11424,0.040085,0.035626,-0.014884,0.0006407,0.00046302,0.12493,0.012073,0.019704,-0.024428,0.0023405,0.0017298,0.14509,0.020222,0.029446,-0.031329,0.0050981,0.0038722,0.15664,0.028773,0.040202,-0.037744,0.67229,74,74,40,1054,3,3,3,0.645
30,-0.0014313,0.1185,0.12011,-0.93796,0.11413,-1.1472,0.2231,0.43609,3.6466,0.070167,3.2642,0.00027059,3.6012,10.219,0.12394,14.833,0.014154,0.93797,0.87776,0.56006,0.43363,0.30917,0.1538,0.17237,0.19809,0.11038,0.057528,0.06749,0.24034,0.41623,0.19799,0.0036645,0.35434,3.3183,1.378,4.8837,10.552,0.092219,0.076029,0.092219,0.64681,1.4263,0.34621,0.44502,0.094151,41,202.54,4736,7.8058e+05,4.4214,21.212,1.2787e+05,88101,2808,0.8984,0.91352,0.43574,0.34258,0.25788,0.8245,63388,37057,0.0013859,0.00060413,0,0.046409,0,0.05431,0.0017398,0.0093325,0.0024405,0.011653,0.26974,0.53811,0.58575,0.24333,0.37304,0.27827,0.26208,0.41363,0.26625,0.27055,0.41818,0.26777,63.133,7.5134,13832,58350,57368,0.064113,0.051946,0.052044,0.28146,0.27381,0.11994,0.49792,0.51774,0.15006,0.65352,0.68234,0.15715,0.77375,0.79914,0.15894,0.0017605,0.0012112,0.028391,-0.0041141,-0.00017407,-0.047949,0.0049407,0.0034337,0.037467,-0.0013707,0.0030382,-0.064929,0.0097308,0.0069282,0.043719,0.001786,0.0070455,-0.080255,0.00081259,0.00055348,0.031135,-0.0020999,-0.0019773,-0.030834,0.0020245,0.0013966,0.035296,-0.0015624,-0.0014617,-0.040615,0.0038768,0.0027549,0.039274,-0.00046486,5.4535e-05,-0.050425,0.00017829,0.00012038,0.005501,-0.0084135,-0.0047978,-0.015955,0.00049524,0.00032938,0.0074917,-0.010339,-0.0054611,-0.022132,0.0010306,0.00067029,0.0094697,-0.011953,-0.005842,-0.032676,0.00076959,0.00053736,0.21988,0.018512,0.024945,-0.033606,0.0024433,0.0017215,0.22193,0.025979,0.033097,-0.046025,0.0050466,0.0036427,0.2272,0.034632,0.042218,-0.05651,0.41819,74,74,40,1054,3,3,3,0.645
30,-0.0011248,0.25218,0.25079,-0.86543,0.25013,-0.82106,-0.051268,-0.93191,4.9029,-0.10184,3.2486,0.00089748,3.1537,6.0767,0.26883,8.4631,0.0080754,0.86546,1.2733,0.82614,0.65341,0.5161,0.10774,0.14764,0.17622,0.10931,0.058055,0.055583,0.34545,0.33262,0.21467,0.014398,0.10798,1.7512,1.3981,0.74312,4.562,0.042335,0.19486,0.19486,0.73946,0.92903,0.34862,0.67112,0.17108,37,77.405,2120,1.2053e+05,5.6198,33.348,57240,5778,5643,0.91271,0.935,0.022163,0.018717,0.046219,0.0080878,40904,14792,0.001193,0.00050319,1,0.16654,0,0.084397,0.0022609,0.065689,0.0049224,0.088245,0.86444,0.74046,0.094389,0.23942,0.31388,0.23936,0.26943,0.29437,0.16705,0.26167,0.28257,0.1536,25.788,6.4628,65237,2.3633e+05,2.3609e+05,0.2384,0.25366,0.075185,0.57657,0.61649,0.095453,0.7616,0.79058,0.089171,0.87384,0.89969,0.081638,0.94809,0.96444,0.075663,0.00069384,0.00040693,0.0043472,-0.0061231,0.0013508,-0.026358,0.0029091,0.001749,0.0085707,-0.005104,0.0038356,-0.036684,0.0070544,0.0043218,0.012314,-0.003029,0.0067162,-0.046929,0.00032337,0.00019684,0.0048137,-0.0038741,3.0701e-05,-0.020368,0.0015404,0.00095395,0.010433,-0.0025155,0.0010727,-0.026878,0.0038459,0.0024281,0.015136,-0.00035813,0.0029904,-0.03318,0.00036807,0.00020882,0.0044121,-0.0043119,-0.0018334,-0.017797,0.0013151,0.00076695,0.0077288,-0.0039734,-0.0016555,-0.023967,0.0029428,0.0017551,0.010505,-0.0031932,-0.0013259,-0.030519,2.3994e-06,1.2681e-06,0.00026633,-0.00253,0.014467,-0.01143,5.36e-05,2.8147e-05,0.0018915,-0.0031418,0.018616,-0.01248,0.00026574,0.00013849,0.0046479,-0.0032599,0.022405,-0.015177,0.40293,74,74,40,1054,3,3,3,0.645
30,-0.0038973,0.11886,0.12297,-0.93643,0.10579,-1.2864,0.37376,0.5208,3.4203,0.097653,3.2731,0.0001584,3.6506,10.234,0.127,14.95,0.014265,0.93644,0.76419,0.47354,0.36619,0.27873,0.095074,0.17266,0.28656,0.11504,0.054869,0.051511,0.22428,0.18592,0.22256,0.14559,0.24056,3.4227,3.2066,5.3672,12.791,0.15034,0.12071,0.15034,0.58426,0.62996,0.18594,0.45447,0.10275,34,175.88,2481,2.5879e+05,3.5313,14.86,66987,44253,23004,0.90135,0.91874,0.38193,0.30653,0.19887,0.81733,66626,33333,0.0014082,0.0005543,0,0.050087,0,0.048555,0.0027119,0.0088929,0.0016901,0.015525,0.78377,1.8683,0.934,0.23585,0.40126,0.26157,0.25007,0.48153,0.23101,0.24782,0.50054,0.22388,47.74,7.0624,19761,76849,76186,0.03381,0.023015,0.020763,0.28627,0.281,0.092284,0.56941,0.59477,0.12982,0.75931,0.79421,0.13813,0.87727,0.90393,0.13633,4.6691e-05,3.2449e-05,0.00056963,-0.011674,-0.0039909,-0.014562,0.00045881,0.00031725,0.0026321,-0.014402,-0.0030272,-0.02832,0.0021644,0.0015137,0.0073567,-0.014865,-0.00028491,-0.046317,7.7701e-06,4.752e-06,0.00022523,-0.0077893,-0.0031768,-0.010672,0.00010159,6.0433e-05,0.0013399,-0.010031,-0.0037348,-0.019134,0.00048482,0.00028341,0.0037155,-0.011513,-0.0034127,-0.029856,3.8573e-05,2.7492e-05,0.00090037,-0.0081768,-0.0040404,-0.011836,0.00031534,0.00023123,0.0036087,-0.009684,-0.0035198,-0.018864,0.0013646,0.0010278,0.0094859,-0.0093211,-0.0018887,-0.029155,3.4784e-07,2.0523e-07,7.5185e-05,-0.0036098,0.0054844,-0.012357,4.2502e-05,2.6011e-05,0.0029205,-0.0045426,0.0092859,-0.024093,0.00032687,0.00021054,0.011133,-0.004142,0.014553,-0.027301,0.42941,74,74,40,1054,3,3,3,0.645
30,-0.0043836,0.84632,0.85394,-0.38111,0.82884,-0.31578,-0.17144,0.33447,4.4632,0.11559,3.2366,0.00056713,6.7856,6.0964,1.2365,8.5732,0.0081806,0.38113,3.5563,2.2824,1.6324,1.2944,0.054393,0.05374,0.094983,0.086965,0.076798,0.057133,0.57599,0.15715,0.0031085,0.030515,0.047699,0.064984,0.27167,0.042478,0.6176,0.3554,0.39393,0.39393,0.7907,1.8689,0.41407,1.7273,1.4858,39,153.87,4635,5.5561e+05,5.7421,34.823,1.2514e+05,21249,6561,0.90655,0.92177,0.20973,0.16749,0.062241,0.48442,53358,19843,0.0022188,0.0008778,0,0.096252,0,0.05913,0.0056399,0.029051,0.0033647,0.031044,0.26097,0.68085,0.21133,0.25819,0.31627,0.19975,0.2964,0.28463,0.10694,0.32004,0.28925,0.091535,36.977,5.3931,29973,1.2549e+05,1.2496e+05,0.29237,0.28325,0.17955,0.6832,0.71514,0.22024,0.88591,0.91571,0.20198,0.96738,0.97841,0.17598,0.99077,0.99382,0.15396,0.0037673,0.0028603,0.045962,0.0059411,0.0095359,-0.035852,0.0089967,0.0070238,0.051613,0.010774,0.014125,-0.044563,0.016645,0.013223,0.056575,0.016542,0.020193,-0.053969,0.0027511,0.0021855,0.079744,0.012568,0.0098513,-0.025144,0.0059576,0.0049425,0.078573,0.0164,0.012523,-0.027283,0.01017,0.0086899,0.077939,0.020211,0.016221,-0.029197,0.00086668,0.00057753,0.02023,-0.0028643,0.0024157,-0.030274,0.0029572,0.0020251,0.033842,0.0011423,0.0054316,-0.040315,0.0063834,0.0044669,0.044373,0.0060425,0.0092175,-0.050185,0.00014958,9.7282e-05,0.032332,0.0001983,0.0079128,-0.015719,0.00066381,0.00043753,0.045614,0.0024509,0.012831,-0.023396,0.0018171,0.0012068,0.061888,0.0066282,0.018927,-0.033598,0.45464,74,74,40,1054,3,3,3,0.645
30,-0.00041809,0.21993,0.21985,-0.88314,0.21871,-0.94685,0.072143,0.82982,5.3545,0.11366,3.2603,0.00091788,5.527,11.431,0.23333,21.154,0.020185,0.88321,1.3273,0.81629,0.63989,0.501,0.13013,0.13933,0.15587,0.12182,0.059676,0.056856,0.33632,0.40115,0.17041,0.00015889,0.041964,1.6635,1.4822,0.89812,4.6575,0.29676,0.18082,0.29676,0.3449,0.40709,0.1911,0.62215,0.19062,51,55.784,1025,29922,4.1579,21.179,27675,16092,10962,0.91515,0.94157,0.24375,0.17195,0.15503,0.83285,36259,17779,0.00091999,0.00039358,0,0.054538,0,0.068131,0.00506,0.0097103,0.0031627,0.022248,0.47792,2.6066,2.074,0.23739,0.37739,0.27061,0.28699,0.4936,0.1941,0.27415,0.51027,0.19521,38.727,7.3065,14144,27047,25555,0.036151,0.031932,0.011891,0.30701,0.32009,0.053008,0.58565,0.62788,0.071513,0.75918,0.80113,0.07397,0.84483,0.87661,0.070316,0.00091529,0.00072383,0.0059808,-0.0054936,0.0062463,-0.02229,0.0018168,0.0014031,0.0055824,-0.0075542,0.0091868,-0.032599,0.0030465,0.0023054,0.005546,-0.0094099,0.013721,-0.044138,0.00089055,0.00070668,0.013826,-0.00089984,0.004276,-0.021425,0.0016226,0.0012684,0.011462,-0.0023002,0.0040628,-0.028456,0.0024337,0.0018761,0.0099893,-0.0037266,0.0048048,-0.035532,0,0,0,-0.0061205,0.000527,0,0,0,0,-0.0079746,0.0024329,0,3.2433e-06,2.2715e-06,1.2075e-05,-0.0097998,0.0043113,-0.018415,2.4742e-05,1.715e-05,0.0028643,-0.0021704,0.016867,-0.020635,0.00019418,0.0001347,0.0071467,-0.0020599,0.026156,-0.023931,0.0006096,0.00042702,0.01112,-0.0015248,0.037395,-0.0304,0.39248,74,74,40,1054,3,3,3,0.645
30,-0.0031593,0.10647,0.10708,-0.94489,0.099373,-1.1984,0.26824,0.97062,6.1055,0.09274,3.1742,0.0029977,2.4401,7.3472,0.11009,10.235,0.0097666,0.9449,0.73953,0.43371,0.34347,0.26927,0.13091,0.21455,0.22102,0.12504,0.047775,0.044369,0.21633,0.33803,0.31917,0.0222,0.16873,6.2177,5.5957,6.8195,19.481,0.062471,0.07615,0.07615,0.31491,0.61955,0.18894,0.41883,0.084203,33,212.33,4014,6.2309e+05,4.0818,18.675,1.0838e+05,62748,6264,0.8956,0.90909,0.39291,0.32888,0.17842,0.78898,71745,39692,0.0014528,0.00064372,0,0.10139,0,0.069143,0.0018509,0.029451,0.0046744,0.036356,0.15107,0.62021,0.40199,0.24555,0.40804,0.25512,0.26573,0.47805,0.21801,0.27654,0.48921,0.20611,59.203,6.8882,28351,1.5585e+05,1.555e+05,0.029085,0.0219,0.020123,0.23929,0.23925,0.086906,0.4721,0.48048,0.12126,0.63313,0.63304,0.12976,0.71973,0.71036,0.126,0.0015555,0.0016637,0.02138,-0.0048183,0.002119,0.0078196,0.0052462,0.0060531,0.033907,-0.00030373,0.0094867,0.025202,0.011337,0.013474,0.043412,0.0053489,0.01851,0.040867,0.00051462,0.00028603,0.016806,-0.0042842,-0.004077,-0.024763,0.001451,0.00086892,0.02156,-0.0041911,-0.0044142,-0.032338,0.0030656,0.0019763,0.026468,-0.0032539,-0.003559,-0.038845,7.358e-06,3.8959e-06,0.00019349,-0.0089094,-0.0020869,-0.0096977,6.8626e-05,3.7409e-05,0.00088477,-0.011375,-0.0023769,-0.012397,0.00025819,0.00014671,0.002022,-0.013516,-0.0020278,-0.016231,0.0010335,0.0013738,0.25168,0.024201,0.033742,0.032977,0.0037265,0.0051468,0.28849,0.039272,0.05378,0.05371,0.0080134,0.011351,0.30747,0.054676,0.07475,0.076141,0.40335,74,74,40,1054,3,3,3,0.645
30,-0.04337,0.51711,0.57191,-0.65387,0.34362,-1.067,0.63179,0.25389,2.6023,0.065099,3.3593,0.00039887,3.4321,4.1236,0.6914,5.0676,0.0048355,0.65394,4.5375,2.7726,1.1604,0.51045,0.038644,0.050463,0.085548,0.085095,0.19924,0.20062,0.34039,0.0095963,0.2035,0.42914,0.36218,0.1395,0.1988,0.55374,1.8965,0.094997,0.082453,0.094997,0.41028,0.83819,0.22415,1.1566,0.65041,58,86.931,2735,1.6099e+05,5.6659,35.417,73845,38799,10557,0.91009,0.92484,0.12902,0.099572,0.054167,0.39426,20359,12436,0.0010868,0.00049042,0,0.069983,0,0.05642,0.011162,0.0059938,0.01454,0.014305,0.35345,0.56326,0.22813,0.27232,0.32349,0.21179,0.33604,0.31023,0.12608,0.34614,0.31705,0.11001,14.489,5.7182,14371,49970,48709,0.21807,0.21335,0.12055,0.44821,0.45147,0.13007,0.58388,0.59805,0.11983,0.67687,0.69339,0.11085,0.75099,0.76569,0.10506,0.0094762,0.0097814,0.10407,0.031231,0.032266,0.0084845,0.020852,0.021764,0.10769,0.043321,0.046055,0.01542,0.036404,0.038557,0.11138,0.056265,0.061,0.026654,0.0045161,0.0049219,0.11784,0.024313,0.023059,0.015586,0.0092023,0.0099584,0.10926,0.029409,0.027839,0.01885,0.015638,0.016973,0.10789,0.036114,0.034698,0.024669,0.0033106,0.0033908,0.069565,0.012139,0.014412,0.0037787,0.0077057,0.008227,0.079384,0.019516,0.023527,0.014625,0.01449,0.016004,0.090671,0.029231,0.034559,0.030139,0.0016495,0.0014687,0.32095,0.036444,0.037294,-0.014847,0.0045926,0.0042188,0.28409,0.044214,0.048903,-0.013842,0.0080757,0.0075466,0.2476,0.049127,0.058281,-0.013504,0.64138,74,74,40,1054,3,3,3,0.645
30,-0.0035059,0.14384,0.15045,-0.92163,0.12914,-1.2685,0.37632,-0.22785,3.2057,-0.047522,3.3435,1.0402e-06,1.6001,4.0424,0.15639,5.1417,0.0049062,0.92172,0.98849,0.57815,0.44355,0.31353,0.086214,0.20373,0.20622,0.13253,0.059885,0.069497,0.24193,0.14893,0.31614,0.020768,0.07403,2.3572,1.0011,4.0132,7.9314,0.071925,0.15894,0.15894,0.25719,0.32,0.16231,0.5029,0.12661,35,234.34,5942,1.0141e+06,5.3849,30.883,1.6043e+05,24732,16875,0.89381,0.90381,0.44195,0.36903,0.21805,0.80076,87443,44682,0.0019424,0.00073084,0,0.060741,0,0.056433,0.004558,0.003374,0.004164,0.0021782,0.81927,1.3633,0.20301,0.25248,0.40887,0.23878,0.26637,0.46772,0.21456,0.28005,0.48509,0.19782,60.169,6.4471,24940,1.4722e+05,1.468e+05,0.051693,0.038144,0.041892,0.3123,0.32584,0.13286,0.58871,0.63789,0.17712,0.77167,0.81346,0.18525,0.87686,0.90384,0.17982,0.0012476,0.00085395,0.020085,-0.0069141,-0.0001276,-0.037326,0.0046339,0.0031804,0.035081,-0.0024141,0.0038359,-0.052429,0.010273,0.0070365,0.046076,0.0031413,0.0086718,-0.069396,0.00031007,0.00017375,0.01186,-0.0064035,-0.001876,-0.027047,0.0012708,0.00074422,0.022117,-0.0054892,-0.0012023,-0.037676,0.0030373,0.0018184,0.030717,-0.0036393,0.00019162,-0.048017,7.3705e-05,4.1679e-05,0.0022703,-0.0091808,-0.0037629,-0.018617,0.00050071,0.00029772,0.0075616,-0.010304,-0.0035922,-0.027565,0.0017313,0.0010911,0.015881,-0.0094661,-0.0023432,-0.037827,0.00086379,0.00063852,0.24638,0.021271,0.020731,-0.02472,0.0028883,0.0021513,0.26191,0.03174,0.03049,-0.032249,0.0056407,0.0041963,0.25352,0.039559,0.039048,-0.04045,0.41811,74,74,40,1054,3,3,3,0.645
30,-0.0021484,0.29704,0.29515,-0.83939,0.29181,-0.92869,0.10639,0.073201,4.7888,0.0026151,3.3089,0.0002938,6.2182,10.968,0.3208,15.908,0.015179,0.83944,1.6398,1.0356,0.78498,0.53147,0.11816,0.12104,0.12044,0.1159,0.071114,0.095603,0.35775,0.37988,0.13588,0.056595,0.044551,0.72666,0.05782,0.55085,1.9522,0.13195,0.19399,0.19399,0.49717,0.5392,0.30226,0.73603,0.26867,45,97.067,2664,1.8243e+05,5.2498,30.526,71928,31806,6588,0.91314,0.93453,0.21199,0.15275,0.13272,0.61704,32192,16247,0.0015007,0.00066826,0,0.071389,0,0.064127,0.012006,0.023308,0.019801,0.024881,0.95893,1.1948,0.064989,0.26471,0.32733,0.23771,0.33696,0.34065,0.13389,0.34168,0.33371,0.14653,22.752,6.4182,12929,31378,30219,0.18927,0.17256,0.089088,0.63836,0.66444,0.15773,0.84065,0.86371,0.1469,0.9178,0.93272,0.12797,0.94812,0.95729,0.11293,0.0089716,0.0090748,0.083892,0.026673,0.029763,0.0040952,0.022222,0.023204,0.097712,0.043413,0.047375,0.02221,0.040719,0.043,0.10608,0.059973,0.065056,0.036063,0.0042002,0.0042529,0.093316,0.020342,0.018027,0.0029163,0.0094124,0.0098408,0.095146,0.027907,0.025126,0.014552,0.017074,0.018203,0.10029,0.037354,0.034028,0.02734,0.0032235,0.0032374,0.05767,0.01069,0.014493,0.00087023,0.0075154,0.007888,0.065919,0.01729,0.023034,0.013965,0.013709,0.01453,0.073041,0.024832,0.03205,0.021751,0.0015479,0.0015845,0.25643,0.031295,0.040784,0.0046839,0.0053885,0.0055451,0.2838,0.048526,0.059949,0.0076066,0.010423,0.010636,0.27208,0.060031,0.074599,0.0066072,0.46573,74,74,40,1054,3,3,3,0.645
30,-0.044603,0.63824,0.6576,-0.58462,0.48467,-0.88441,0.5128,-0.024745,3.0829,0.066949,3.3466,9.6584e-05,4.8377,5.3052,0.82994,6.6204,0.0063172,0.58463,4.0556,2.7832,1.9821,0.80984,0.05977,0.059658,0.072973,0.066972,0.07149,0.21866,0.45048,0.10757,0.029222,0.73369,0.89323,0.44618,0.2619,0.060178,2.532,0.25082,0.43118,0.43118,1.9627,2.1909,0.46544,1.2892,0.82969,72,50.181,2613,95909,7.9593,65.963,70551,10314,6507,0.91398,0.9374,0.18804,0.13664,0.11448,0.63506,24099,14236,0.0014853,0.0005807,0,0.07017,0,0.06208,0.0017788,0.0018542,0.0058474,0.0010554,0.19576,0.2868,0.68421,0.24243,0.31344,0.23754,0.30099,0.30345,0.11094,0.30823,0.28087,0.094806,15.97,6.4135,16078,36862,35960,0.28911,0.28818,0.11799,0.69431,0.75014,0.14875,0.8355,0.86775,0.12659,0.9043,0.92181,0.10933,0.93994,0.9502,0.097072,0.014339,0.014438,0.11626,0.045405,0.040714,0.0026025,0.032494,0.033472,0.12389,0.064923,0.05981,0.015051,0.055649,0.057961,0.1257,0.082013,0.077928,0.02586,0.0047525,0.0055355,0.091552,0.022236,0.021957,0.036618,0.011691,0.013668,0.10247,0.034283,0.032352,0.051517,0.02152,0.024809,0.1096,0.046537,0.043572,0.059202,0.0081326,0.0076442,0.12616,0.035477,0.027306,-0.016506,0.017528,0.017021,0.13331,0.049348,0.039755,-0.010377,0.029648,0.029459,0.13696,0.062652,0.052161,-0.0028345,0.0014539,0.001258,0.20885,0.027151,0.035331,-0.019462,0.0041069,0.0035367,0.18755,0.033416,0.047153,-0.025196,0.0073404,0.0063212,0.16615,0.037745,0.057023,-0.031173,0.4817,74,74,40,1054,3,3,3,0.645
30,-0.024016,0.43169,0.45601,-0.73726,0.34227,-1.1055,0.49943,-0.87901,6.4924,-0.07345,3.321,0.00025731,5.7894,7.9833,0.52491,10.744,0.010252,0.73729,2.467,1.5872,0.92821,0.49262,0.064423,0.083248,0.12342,0.10047,0.13532,0.15504,0.33808,0.14569,0.019429,0.0091282,0.082316,0.011332,0.088093,0.45727,0.81326,0.17844,0.29052,0.29052,0.71433,1.1721,0.31471,0.97506,0.47497,80,45.587,1659,52136,6.1607,40.229,44793,33615,4158,0.91516,0.93999,0.13096,0.087723,0.091993,0.52025,21177,14421,0.00085784,0.00043392,0,0.053461,0,0.056793,0.00075285,0.031206,0.0050272,0.016905,0.59947,0.40052,0.14006,0.27916,0.31393,0.25344,0.42247,0.29908,0.14341,0.436,0.29662,0.12835,18.572,6.8429,7669.7,16421,14255,0.14362,0.1479,0.064301,0.37038,0.37893,0.08705,0.51645,0.52174,0.085843,0.60245,0.60327,0.079904,0.67314,0.67634,0.076264,0.0066138,0.007262,0.058828,0.016509,0.022185,0.042334,0.017104,0.018881,0.071541,0.029487,0.037492,0.063067,0.032743,0.03596,0.08114,0.04375,0.05388,0.077836,0.0037408,0.0039775,0.079055,0.01693,0.016324,0.019359,0.0084659,0.0090061,0.081404,0.023569,0.021526,0.026066,0.015113,0.016255,0.084441,0.030949,0.028459,0.039105,0.0013969,0.001444,0.023772,0.00045646,0.0045263,0.0065183,0.0039159,0.004104,0.032673,0.0043117,0.010993,0.014499,0.008675,0.0091328,0.043965,0.011102,0.019534,0.022172,0.0014762,0.0018404,0.23263,0.02895,0.045439,0.062306,0.0047874,0.0058329,0.23984,0.041548,0.062661,0.07204,0.0092129,0.01081,0.22876,0.05108,0.076988,0.072219,0.53892,74,74,40,1054,3,3,3,0.645
30,-0.001814,0.56198,0.55905,-0.66364,0.55876,-0.64845,-0.022889,-4.2112,40.463,-0.042151,3.0698,0.01181,13.226,16.118,0.67204,34.118,0.032555,0.66365,2.7319,1.6208,1.1458,0.84078,0.070303,0.070461,0.1208,0.11461,0.085199,0.077891,0.46074,0.23285,0.016264,0.0003381,2.8469e-05,0.071338,0.059887,0.010831,0.39154,0.1785,0.37232,0.37232,0.53781,0.5896,0.24547,1.1244,0.60848,77,23.792,358,3005.8,3.6068,19.1,9666,6588,3510,0.91809,0.94779,0.11836,0.073706,0.10651,0.96118,20949,15038,0.00092405,0.00054121,0,0.045471,0,0.055191,0.024681,0.0083485,0.069234,0.038558,1.9429,1.7703,0.05144,0.23499,0.33113,0.27873,0.32115,0.3922,0.1635,0.3251,0.39714,0.15952,30.04,7.5258,4629.4,7269.8,4787.6,0.15385,0.14897,0.040794,0.52052,0.53313,0.072454,0.70507,0.71978,0.069408,0.79131,0.8003,0.062156,0.86582,0.87018,0.058095,0.0072241,0.0066305,0.038055,0.014528,0.024644,-0.049708,0.012263,0.011234,0.030375,0.013289,0.028641,-0.060208,0.016633,0.015183,0.024411,0.010756,0.031899,-0.069705,0.0027289,0.0025602,0.034155,0.0080782,0.014793,-0.022945,0.0048532,0.0045428,0.027638,0.0074345,0.013815,-0.029161,0.0073132,0.006798,0.0242,0.0070688,0.013653,-0.03882,0.0036408,0.0033265,0.036694,0.009725,0.012402,-0.038687,0.0067589,0.0061468,0.033398,0.010891,0.016913,-0.049449,0.0096914,0.0087715,0.029088,0.01053,0.020145,-0.058573,0.00085436,0.0007437,0.079736,0.011842,0.032626,-0.035762,0.002403,0.0021397,0.071296,0.014346,0.042726,-0.039348,0.0041726,0.003772,0.061361,0.015404,0.052213,-0.040626,0.40382,74,74,40,1054,3,3,3,0.645
30,-0.0020096,0.54196,0.54427,-0.6747,0.53456,-0.5846,-0.13354,5.1118,57.015,0.10099,3.0163,0.01507,9.5243,11.804,0.64983,26.591,0.025373,0.67475,2.176,1.433,1.1063,0.81869,0.075881,0.090151,0.14353,0.096901,0.064242,0.07566,0.45364,0.27509,0.092081,0.022858,0.033623,0.38242,0.074755,0.014947,0.89577,0.30831,0.53781,0.53781,0.65359,0.66749,0.337,1.0934,0.53007,71,37.775,431,8349.5,2.5738,8.9279,11637,9477,9234,0.91777,0.94332,0.11243,0.073776,0.094191,0.45478,18835,13190,0.00096774,0.00049045,0,0.055772,0,0.067051,0.021455,0.093063,0.043917,0.19888,0.33888,1.768,1.4918,0.22841,0.33734,0.27784,0.27343,0.36906,0.20638,0.27483,0.37357,0.202,24.169,7.5017,6844.1,12183,10723,0.1657,0.17025,0.055154,0.48145,0.4964,0.084122,0.71558,0.73629,0.088424,0.82468,0.83861,0.081312,0.87826,0.88603,0.073973,0.00051721,0.00040009,0.00342,-0.0069044,-0.0024936,-0.024776,0.00078954,0.00061234,0.002455,-0.0098141,-0.0013692,-0.02634,0.0012216,0.00097091,0.0022504,-0.01236,0.0010136,-0.032939,0.00030426,0.00023611,0.0047802,-0.0040853,-0.0022462,-0.020017,0.00060489,0.00046946,0.0043239,-0.0056718,-0.0025638,-0.024872,0.00096663,0.00076377,0.0040151,-0.0072616,-0.0016067,-0.029466,0.00019173,0.00014801,0.0024257,-0.0052585,-0.0046331,-0.022326,0.00050293,0.00038955,0.0031195,-0.0065164,-0.004152,-0.024241,0.00082209,0.00064813,0.0030973,-0.008027,-0.0037394,-0.02636,2.1214e-05,1.5968e-05,0.0024853,-0.0022493,0.012713,-0.016226,0.00014783,0.00011177,0.0055056,-0.0024538,0.01955,-0.019786,0.0004388,0.00033427,0.0081001,-0.0024362,0.026493,-0.026208,0.45018,74,74,40,1054,3,3,3,0.645
30,-0.067017,0.85177,0.85809,-0.37562,0.65591,-0.55795,0.48541,-0.17708,2.4555,-0.080081,3.3584,0.00032554,2.8149,2.5179,1.2474,3.0059,0.0028682,0.37565,6.7395,4.5151,2.6178,1.1888,0.03,0.04335,0.05204,0.052341,0.095511,0.18124,0.54552,0.057127,0.23868,1.9028,1.6169,0.021083,0.20522,0.0024318,4.0443,0.11534,0.18762,0.18762,0.52306,0.73778,0.20892,1.7302,1.4405,72,73.375,2401,1.1283e+05,5.8855,37.824,64827,42390,10044,0.91143,0.92496,0.066472,0.05096,0.019562,0.20186,18512,11723,0.0010725,0.00050929,0,0.058961,0,0.046774,0.0030721,0.036545,0.0022667,0.034562,0.1674,0.42494,0.43555,0.25807,0.30516,0.22549,0.29758,0.29145,0.14565,0.30949,0.27552,0.12863,12.521,6.0881,14884,51527,50712,0.25306,0.25502,0.14351,0.49258,0.51399,0.14664,0.62065,0.65668,0.13067,0.71323,0.74329,0.11981,0.78194,0.80701,0.11221,0.01083,0.011441,0.12201,0.037794,0.035852,0.016297,0.024887,0.026004,0.13184,0.055312,0.05213,0.017826,0.043697,0.045827,0.13715,0.07219,0.069233,0.024343,0.0055002,0.0067462,0.14723,0.031643,0.031284,0.044459,0.011548,0.01425,0.14064,0.039958,0.03917,0.060921,0.019408,0.024036,0.13735,0.048442,0.047857,0.076819,0.0035127,0.0031982,0.075717,0.013543,0.01161,-0.01479,0.0084778,0.0076644,0.089592,0.02281,0.019347,-0.022583,0.015865,0.014697,0.10184,0.033659,0.02932,-0.022138,0.0018169,0.0014969,0.36264,0.041025,0.039481,-0.026704,0.005709,0.0047502,0.36226,0.056859,0.054966,-0.033501,0.010745,0.009159,0.33795,0.068292,0.06917,-0.036716,0.68396,74,74,40,1054,3,3,3,0.645
30,-0.013125,0.63356,0.64138,-0.59834,0.59183,-0.76465,0.27795,-1.8227,20.367,-0.075209,3.0861,0.0093131,8.4184,9.3893,0.80235,14.299,0.013644,0.5984,3.1596,1.9566,1.3882,0.89405,0.0494,0.070054,0.11275,0.098877,0.081372,0.11042,0.47713,0.075718,0.014079,0.0020384,0.015243,0.079537,0.025244,0.00088539,0.21275,0.28757,0.47554,0.47554,0.38501,0.40308,0.25483,1.2719,0.80923,65,27.231,714,12512,5.245,29.768,19278,15849,3159,0.91575,0.94298,0.18366,0.12568,0.12213,0.71203,25202,12807,0.00080365,0.00039856,0,0.1424,1,0.1515,0.10032,0.19642,0.21288,0.43349,0.56165,1.5605,1.1147,0.23953,0.33492,0.26828,0.32015,0.35094,0.19559,0.29337,0.37486,0.21417,17.522,7.2436,5267.8,8495.4,7292.9,0.13541,0.12208,0.035397,0.38663,0.34685,0.053056,0.51819,0.46887,0.05029,0.64591,0.59979,0.050018,0.76067,0.72657,0.050318,0.00040489,0.0002994,0.0021027,-0.0064516,0.0051097,-0.026726,0.0013931,0.0010333,0.0034021,-0.0075309,0.0098026,-0.043535,0.0036413,0.0027505,0.0052684,-0.0075404,0.015215,-0.059481,0.0003305,0.00024586,0.004078,-0.003488,0.0024396,-0.022258,0.001059,0.00079202,0.0059455,-0.003692,0.0030947,-0.03559,0.0026292,0.00201,0.008577,-0.0029026,0.0049031,-0.047705,6.5553e-06,4.6522e-06,6.5134e-05,-0.0054199,-0.0013939,-0.016619,8.4729e-05,6.0556e-05,0.00041275,-0.0068727,0.00072836,-0.018902,0.00042612,0.00031196,0.0012609,-0.0078846,0.0029642,-0.025886,6.7832e-05,4.8886e-05,0.0062411,-0.0012206,0.024696,-0.017974,0.00024955,0.0001809,0.0072994,-0.0014303,0.032584,-0.021224,0.00059314,0.00043421,0.0085992,-0.0014339,0.039832,-0.026169,0.45143,74,74,40,1054,3,3,3,0.645
