30,-0.059292,0.96701,0.94286,-0.23716,0.8076,-0.32698,0.37876,0.81907,3.5524,0.21726,3.2187,8.164e-06,3.9089,3.1635,1.5239,4.0764,0.0038897,0.2372,7.3775,5.1967,4.0422,2.0761,0.029549,0.029205,0.055911,0.042233,0.037148,0.12744,0.67852,0.038847,1.1691,1.28,2.7202,3.4493,0.064899,0.076388,8.7988,0.051188,0.12746,0.12746,0.18188,0.28688,0.12033,2.0988,2.1786,102,42.069,2911,83440,9.6425,95.818,78597,8370,4779,0.91589,0.9302,0.11668,0.10822,0.01647,0.088355,23620,12574,0.0011832,0.00040355,2,0.41984,0,0.060032,0.1038,0.7161,0.11354,0.78283,1.2692,3.0509,1.8388,0.20957,0.28435,0.24113,0.24296,0.31149,0.16097,0.2559,0.22901,0.18308,22.457,6.5104,1.0595e+05,1.1351e+06,1.135e+06,0.1553,0.11691,0.080333,0.38799,0.29588,0.1045,0.52506,0.45609,0.09941,0.6329,0.64481,0.095134,0.71985,0.77089,0.092016,0.013046,0.011372,0.13421,0.045926,0.025767,-0.012093,0.025533,0.020974,0.12488,0.054877,0.031182,-0.021162,0.039415,0.030647,0.11559,0.061274,0.035605,-0.031449,0.0076261,0.0053373,0.15681,0.040008,0.014002,-0.022135,0.015861,0.010919,0.15078,0.050163,0.0187,-0.02958,0.025632,0.017493,0.1432,0.058514,0.023464,-0.036458,0.0049086,0.005752,0.114,0.02414,0.020663,0.0095491,0.0085744,0.0094128,0.099469,0.025906,0.02249,0.0063055,0.011657,0.011842,0.084528,0.024985,0.022222,0.0011555,0.00051136,0.00028236,0.092728,0.0087602,0.01025,-0.012165,0.001744,0.00097917,0.10144,0.013466,0.014908,-0.015817,0.0036394,0.0021285,0.10323,0.017924,0.019834,-0.018694,0.63165,74,74,40,1054,3,3,3,0.645
30,-0.079325,0.60652,0.78352,-0.46448,0.24173,-0.85071,0.83155,-0.23177,1.792,-0.12451,3.2723,0.0023478,2.1889,2.1141,1.07,2.3721,0.0022635,0.46449,8.7716,6.045,3.9911,1.4289,0.02893,0.023959,0.032924,0.040336,0.059488,0.21524,0.59912,0.33027,5.4971,13.7,7.1339,1.758,0.18212,0.006905,28.608,0.10372,0.21348,0.21348,0.2903,0.29111,0.11702,1.5416,1.1882,79,87.582,5896,4.3792e+05,8.6735,76.489,1.5919e+05,6129,4131,0.9086,0.91356,0.14751,0.11853,0.060627,0.37821,25010,15328,0.0010528,0.00046769,0,0.086433,0,0.053558,0.034067,0.027038,0.038756,0.026904,0.38973,0.5827,0.30102,0.21145,0.32797,0.22492,0.24057,0.3367,0.18377,0.25294,0.32243,0.16428,12.132,6.0727,14921,73755,73050,0.14157,0.1381,0.10387,0.33645,0.34115,0.12854,0.48564,0.49795,0.13042,0.60474,0.62539,0.12894,0.70924,0.74128,0.1286,0.010712,0.011803,0.15631,0.042823,0.048303,0.025443,0.023151,0.026247,0.16062,0.057997,0.067095,0.04398,0.039065,0.044432,0.1625,0.072544,0.084517,0.05576,0.0071338,0.0088837,0.20806,0.044213,0.047228,0.050114,0.015804,0.020221,0.21311,0.059818,0.066569,0.076478,0.02737,0.034851,0.21689,0.075872,0.085084,0.093096,0.0026711,0.0022602,0.087997,0.011881,0.016128,-0.017776,0.0050067,0.0043354,0.082387,0.0136,0.019346,-0.019336,0.0076783,0.0067975,0.078979,0.015229,0.021934,-0.019768,0.0009071,0.00065884,0.23332,0.021737,0.024327,-0.025955,0.002714,0.002035,0.22392,0.028155,0.032783,-0.030071,0.0053344,0.0040283,0.21462,0.034793,0.041286,-0.037317,0.79276,74,74,40,1054,3,3,3,0.645
30,-0.011486,0.11473,0.13901,-0.92782,0.063769,-1.6104,0.7357,0.01575,3.3483,-0.0013131,3.3228,7.7919e-05,1.4945,3.9338,0.14405,4.8885,0.0046646,0.9279,0.86491,0.36689,0.28761,0.22101,0.10557,0.13702,0.28739,0.198,0.045651,0.042934,0.18344,0.17664,0.04995,0.073564,8.5251e-05,8.594,7.9336,13.45,30.277,0.11265,0.10829,0.11265,0.48852,0.99023,0.26874,0.48148,0.11201,48,133.79,5324,5.8835e+05,6.6018,45.03,1.4375e+05,13959,6264,0.90553,0.91738,0.38857,0.32719,0.1645,0.80526,51913,23948,0.00239,0.00074274,0,0.048815,0,0.038744,0.0091676,0.03976,0.0084271,0.045496,0.13475,1.8,2.1012,0.21637,0.28949,0.19938,0.25834,0.27536,0.1273,0.25427,0.25111,0.090964,30.64,5.3834,31446,1.549e+05,1.5444e+05,0.14958,0.16881,0.09902,0.50892,0.58047,0.17543,0.72478,0.78866,0.17562,0.80407,0.85541,0.15468,0.84696,0.89003,0.13856,0.017683,0.02439,0.23281,0.075091,0.087541,0.10958,0.040769,0.059294,0.25519,0.10917,0.13312,0.17891,0.072871,0.10997,0.2735,0.14559,0.18354,0.25698,0.010943,0.018194,0.28795,0.069072,0.091108,0.14666,0.025162,0.044987,0.30613,0.097251,0.13895,0.24249,0.04592,0.085042,0.32832,0.13058,0.19382,0.33881,0.0037458,0.0033596,0.11134,0.01902,0.019369,-0.014534,0.0091416,0.0086255,0.13572,0.032042,0.030697,-0.010323,0.016548,0.016486,0.15357,0.045501,0.043428,-0.00086616,0.0029945,0.0028362,0.69493,0.076849,0.060064,-0.007379,0.0085316,0.008214,0.63508,0.095084,0.076584,-0.0067986,0.015806,0.015383,0.57379,0.11104,0.092129,-0.0060701,0.47114,74,74,40,1054,3,3,3,0.645
30,-0.076662,0.65257,0.80957,-0.4355,0.31773,-0.77495,0.77944,0.24042,1.9452,0.056807,3.3111,0.0014961,2.2576,2.1239,1.1277,2.3437,0.0022364,0.43555,9.9466,6.6474,4.4853,1.6012,0.02473,0.021486,0.036228,0.039797,0.052048,0.20411,0.6216,0.62553,6.2282,10.076,6.5378,2.2281,0.17744,6.141e-05,25.873,0.054259,0.098367,0.098367,0.1139,0.46503,0.10302,1.6047,1.2864,92,56.022,4081,1.8147e+05,9.2409,87.455,1.1019e+05,12825,2727,0.9135,0.92391,0.044035,0.034812,0.0018595,0.13634,20918,11872,0.00082755,0.00035301,0,0.094056,0,0.064891,0.040541,0.18586,0.05112,0.23104,0.76011,1.9126,1.1973,0.21183,0.32516,0.2251,0.25681,0.33425,0.1682,0.26272,0.32303,0.1522,11.348,6.0778,24640,94016,93572,0.13468,0.13405,0.080608,0.34099,0.33909,0.10627,0.48791,0.49681,0.10689,0.60024,0.6117,0.1044,0.6835,0.69703,0.10109,0.011013,0.012009,0.13109,0.039955,0.047423,0.022421,0.023566,0.025215,0.13336,0.053409,0.062036,0.022614,0.038784,0.040836,0.13161,0.064687,0.075298,0.020819,0.0061925,0.0066498,0.14733,0.033423,0.033229,0.014099,0.013981,0.015077,0.15379,0.046341,0.046426,0.019809,0.024106,0.026073,0.15583,0.058493,0.060177,0.02545,0.003699,0.0044009,0.099407,0.017736,0.027199,0.025938,0.0073632,0.008291,0.098836,0.0226,0.03217,0.021858,0.01122,0.011829,0.094144,0.025482,0.03448,0.011024,0.0011212,0.00095803,0.23525,0.02504,0.031108,-0.012184,0.0026831,0.0022125,0.18057,0.024996,0.036155,-0.019192,0.0047889,0.0039563,0.15717,0.027454,0.042867,-0.024284,0.73583,74,74,40,1054,3,3,3,0.645
30,-0.007946,0.10034,0.11345,-0.94151,0.070013,-1.5241,0.61878,-0.37761,3.0166,-0.063282,3.3173,1.5628e-07,2.279,6.6608,0.11684,8.4123,0.008027,0.94152,0.70688,0.34863,0.27461,0.2245,0.1433,0.14168,0.28908,0.16006,0.044288,0.033025,0.18856,0.32994,0.054796,0.068753,0.055852,9.9888,15.874,12.972,39.344,0.17076,0.11847,0.17076,1.1502,1.2657,0.32099,0.43284,0.094027,39,176.46,4750,6.1281e+05,5.3254,31.014,1.2825e+05,37584,13257,0.90352,0.91247,0.41714,0.34178,0.21288,0.83177,73977,38985,0.0010747,0.00054526,0,0.074856,0,0.063662,0.0040629,0.0028049,0.0022067,0.0033077,0.7375,0.066913,0.050469,0.19052,0.39922,0.26614,0.20486,0.47084,0.2507,0.20468,0.48698,0.25246,48.555,7.1857,23527,1.0573e+05,1.0496e+05,0.027757,0.018692,0.019969,0.24675,0.22748,0.092435,0.51311,0.52422,0.13512,0.72371,0.74811,0.1513,0.8644,0.8878,0.15368,0.0012497,0.00072036,0.017881,-0.0064894,0.0078958,-0.047332,0.0042581,0.0025825,0.028966,-0.0032522,0.013087,-0.068287,0.0098156,0.0062003,0.040037,0.0024309,0.0192,-0.08784,0.00051496,0.00029834,0.014727,-0.0054993,0.00040009,-0.030683,0.0018937,0.0011587,0.025039,-0.0037001,0.0029537,-0.046443,0.0046653,0.0030018,0.03625,0.00016709,0.0070992,-0.059941,0.00038102,0.00021385,0.012308,-0.0054921,0.0083434,-0.027257,0.001209,0.00069323,0.019507,-0.0048992,0.011389,-0.038378,0.0026067,0.0015194,0.02629,-0.0034678,0.01377,-0.049272,0.00035373,0.00020817,0.089212,0.0059509,0.010333,-0.023643,0.0011682,0.00073789,0.094506,0.0088978,0.014678,-0.032661,0.0026747,0.001757,0.10552,0.013742,0.020071,-0.043023,0.44619,74,74,40,1054,3,3,3,0.645
30,-0.002729,0.20398,0.20719,-0.89029,0.1936,-1.1183,0.25614,0.80471,10.978,0.10433,3.0923,0.0072014,5.5331,11.808,0.21915,22.767,0.021724,0.89032,1.2846,0.80821,0.5611,0.39802,0.13327,0.13414,0.15879,0.11769,0.089329,0.076253,0.29053,0.42793,0.16172,7.1045e-06,0.063067,0.26643,0.34649,1.4738,2.7394,0.22816,0.2311,0.2311,0.5164,0.62199,0.26303,0.61075,0.18521,29,248.24,6483,1.4365e+06,5.0843,26.915,1.7504e+05,5886,4914,0.91057,0.91985,0.055609,0.045841,0.082025,0.03565,44193,21975,0.001666,0.0006349,0,0.10009,0,0.049316,0.013844,0.0019792,0.01464,0.0053965,0.71712,0.49026,0.26321,0.19619,0.30233,0.20647,0.207,0.28117,0.14427,0.22064,0.27873,0.1162,28.011,5.5747,39727,2.1307e+05,2.1266e+05,0.26065,0.29406,0.18155,0.59232,0.66186,0.21482,0.79511,0.85486,0.20271,0.89282,0.93229,0.18071,0.93135,0.95771,0.16031,0.0019769,0.0013102,0.027385,-0.0026877,0.0066059,-0.029892,0.0047908,0.003119,0.031552,-0.0015162,0.011041,-0.042857,0.0090292,0.0059384,0.035657,0.00055608,0.016121,-0.0545,0.00011441,7.5053e-05,0.0031676,-0.0083396,-0.0039023,-0.013458,0.00070218,0.00047698,0.0089887,-0.008938,-0.0019311,-0.021256,0.0022792,0.0016042,0.017146,-0.0075798,0.0018147,-0.028982,0.0016919,0.0011418,0.052914,0.004311,0.010321,-0.025662,0.003619,0.0023843,0.056533,0.0066404,0.013224,-0.03483,0.0059939,0.0039161,0.058528,0.0087678,0.015644,-0.042978,0.00017058,9.33e-05,0.041653,0.00078592,0.012185,-0.017909,0.00064887,0.00035583,0.05082,0.0024818,0.016345,-0.022524,0.001283,0.00071081,0.049004,0.0028628,0.019674,-0.026296,0.5296,74,74,40,1054,3,3,3,0.645
30,-0.035939,0.73192,0.72289,-0.52576,0.62999,-0.71424,0.35848,0.62347,8.6232,-0.011873,3.2645,0.00090402,8.3831,8.6045,0.9474,11.377,0.010856,0.52581,3.2407,2.2331,1.5952,1.1422,0.049058,0.069432,0.097206,0.075422,0.078023,0.083638,0.54722,0.071539,0.0084463,0.070661,0.26554,0.1248,0.020783,0.005346,0.56711,0.46872,0.29219,0.46872,0.75611,1.3811,0.34903,1.4067,0.96297,63,75.714,2891,1.4112e+05,6.8522,51.04,78057,18954,13824,0.91675,0.93224,0.25488,0.19327,0.14089,0.68224,27036,18171,0.0021319,0.00065711,0,0.098351,0,0.078947,0.072611,0.16219,0.10448,0.23303,0.36259,0.097512,0.37886,0.20634,0.28088,0.21212,0.24382,0.22001,0.10347,0.24275,0.18325,0.0831,12.485,5.7272,14401,39552,38622,0.23362,0.23007,0.11954,0.64662,0.7117,0.17228,0.76799,0.81075,0.14383,0.84927,0.87839,0.12628,0.90852,0.92614,0.11488,0.0085055,0.0072778,0.086556,0.025996,0.030333,-0.03819,0.017446,0.015345,0.084406,0.03279,0.041924,-0.041845,0.029692,0.026937,0.086138,0.041588,0.055429,-0.040765,0.0014557,0.0014078,0.029609,0.0012605,0.002395,-0.0039854,0.0040893,0.0039773,0.038455,0.0052256,0.0099527,-0.0052361,0.0096597,0.0094468,0.053383,0.013968,0.021899,-0.0062379,0.0063045,0.0053314,0.14484,0.032828,0.034407,-0.035961,0.012948,0.011164,0.14859,0.043501,0.045091,-0.040461,0.020002,0.017608,0.14348,0.05044,0.053227,-0.040941,0.00074528,0.00053861,0.13368,0.014231,0.02766,-0.027048,0.0020757,0.0015766,0.11943,0.016806,0.033624,-0.029923,0.0037649,0.0029737,0.10564,0.018644,0.039268,-0.032515,0.52073,74,74,40,1054,3,3,3,0.645
30,-0.010186,0.099615,0.11386,-0.9413,0.062708,-1.5722,0.67025,0.18447,3.2371,-0.011111,3.3392,3.2399e-07,1.0079,2.9401,0.11729,3.5757,0.003412,0.9413,0.6864,0.31116,0.26036,0.21614,0.12701,0.18683,0.27077,0.17319,0.031374,0.029441,0.18138,0.20332,0.14254,0.018843,0.074281,30.013,27.266,18.577,76.296,0.063354,0.067711,0.067711,0.71676,0.77514,0.30093,0.43363,0.089093,40,101.3,3338,2.7512e+05,6.0202,37.502,90126,6237,3105,0.91534,0.93035,0.24928,0.21427,0.03078,0.64791,78997,22257,0.00098084,0.00041822,0,0.11172,0,0.059202,0.0056677,0.018304,0.0053041,0.019785,2.5003,2.5698,0.6019,0.17347,0.36502,0.31068,0.17117,0.43737,0.29901,0.15878,0.44044,0.34461,49.771,8.3883,51497,2.2641e+05,2.2601e+05,0.03432,0.021178,0.014656,0.24732,0.23644,0.054994,0.48863,0.52368,0.076376,0.67739,0.73987,0.084061,0.8003,0.85905,0.084456,0.0060314,0.0042122,0.051226,0.013925,0.015557,-0.042796,0.016726,0.013274,0.067539,0.028125,0.029634,-0.042363,0.033564,0.029725,0.081262,0.044933,0.048164,-0.031105,0.001802,0.001254,0.030589,0.00312,0.0043783,-0.027107,0.0060364,0.0049057,0.047376,0.011498,0.012134,-0.024634,0.013314,0.012283,0.061408,0.021956,0.023703,-0.013534,0.0019221,0.0010873,0.036855,0.0046786,0.0077285,-0.035819,0.0054856,0.0032237,0.052537,0.012064,0.013423,-0.047926,0.010855,0.0066506,0.064988,0.02041,0.019484,-0.058592,0.0023073,0.0018709,0.34541,0.046572,0.039315,-0.017799,0.0067981,0.0060801,0.32643,0.05964,0.055806,-0.013631,0.01327,0.013094,0.31075,0.07356,0.07541,-0.0022121,0.38905,74,74,40,1054,3,3,3,0.645
30,-0.028957,0.85104,0.79523,-0.45168,0.79342,-0.47321,0.047678,0.61672,3.7275,0.10354,3.2943,9.9256e-05,4.3574,4.1595,1.0954,5.4707,0.0052201,0.45173,3.2996,2.3267,1.8468,1.3784,0.064151,0.060424,0.098605,0.068849,0.051294,0.070034,0.58664,0.22684,9.9325e-06,0.045623,0.34291,0.90301,0.097661,0.031158,1.6472,0.25551,0.31013,0.31013,0.63524,0.77309,0.28132,1.5745,1.2052,35,163.43,5381,8.2149e+05,5.6515,32.971,1.4529e+05,2997,2808,0.90605,0.91873,0.4111,0.34368,0.15222,0.89191,1.1299e+05,42322,0.00096159,0.00047823,0,0.073122,0,0.057171,0.0045977,0.029821,0.0025824,0.034274,1.2161,0.91749,0.52071,0.24665,0.34142,0.21636,0.32913,0.35627,0.11999,0.35099,0.37053,0.10067,60.67,5.8418,30968,1.3076e+05,1.3015e+05,0.02374,0.013404,0.013465,0.21415,0.16156,0.063245,0.51437,0.48083,0.10679,0.72432,0.74014,0.11938,0.85013,0.87953,0.11916,0.00019108,9.8611e-05,0.0021555,-0.010576,0.0021417,-0.025566,0.00066722,0.00035131,0.0035783,-0.013073,0.0041064,-0.03174,0.0015627,0.00085357,0.0050253,-0.015163,0.006857,-0.041394,3.4223e-05,1.7612e-05,0.00077159,-0.0080284,-0.00069302,-0.016677,0.00021353,0.00011399,0.0022258,-0.0099934,-0.00018113,-0.022303,0.00078395,0.00044527,0.0048024,-0.011182,0.0022337,-0.032985,6.4414e-05,3.3864e-05,0.0016404,-0.006967,0.0015628,-0.018531,0.00022473,0.00011768,0.0028587,-0.0085418,0.0026747,-0.019989,0.00046585,0.00024236,0.0037041,-0.0099898,0.0030524,-0.022712,9.2446e-05,4.7135e-05,0.018381,-0.0012371,0.0084471,-0.014795,0.00022896,0.00011965,0.014602,-0.002326,0.01154,-0.015375,0.00031344,0.0001662,0.0097488,-0.0040984,0.014152,-0.015376,0.42833,74,74,40,1054,3,3,3,0.645
30,-0.0025899,0.15283,0.15482,-0.91926,0.14295,-1.1738,0.27686,-0.33765,3.1323,-0.064623,3.3094,2.1946e-06,2.6351,6.5546,0.16132,8.6538,0.0082574,0.91926,0.9962,0.63441,0.50012,0.3916,0.1574,0.15641,0.16754,0.11525,0.056923,0.054024,0.29246,0.42301,0.15684,0.0081915,0.24589,3.3771,3.0185,2.6144,9.844,0.33358,0.20482,0.33358,0.61038,0.66247,0.22582,0.51078,0.12991,30,231.13,5956,1.1739e+06,5.1282,27.538,1.6081e+05,13338,8748,0.90907,0.92107,0.4499,0.35567,0.27346,0.91437,78288,40386,0.0011017,0.00047912,0,0.054586,0,0.043461,0.0042383,0.0051402,0.002457,0.00013618,1.1713,1.9802,0.29022,0.19927,0.38229,0.24687,0.22991,0.45701,0.18135,0.23614,0.47028,0.1704,56.229,6.6654,18333,62794,61899,0.040912,0.029459,0.027938,0.24722,0.23902,0.087904,0.50664,0.52607,0.12663,0.72019,0.75011,0.14291,0.86412,0.88731,0.14582,0.00096571,0.00060672,0.013116,-0.0077444,0.0026098,-0.034274,0.0022904,0.0014894,0.014789,-0.0093147,0.0062411,-0.05055,0.005423,0.0036664,0.020996,-0.0077754,0.012099,-0.071687,0.00095051,0.00059664,0.025802,-0.0021974,-0.00041822,-0.033796,0.0019879,0.0012895,0.024949,-0.0031869,0.0019195,-0.044796,0.0038832,0.0026594,0.02864,-0.0023498,0.0059538,-0.054703,2.6334e-06,1.5858e-06,8.0744e-05,-0.0081205,0.0020363,-0.021418,8.9934e-05,5.4721e-05,0.0013773,-0.010035,0.0030582,-0.029661,0.0006461,0.0004004,0.0061852,-0.010353,0.0045176,-0.04128,1.2568e-05,8.4882e-06,0.0030086,-0.0035485,0.0081895,-0.014529,0.00021256,0.00014521,0.016322,-0.0027556,0.012929,-0.0258,0.00089736,0.00060873,0.033602,-8.7486e-05,0.019366,-0.035249,0.39975,74,74,40,1054,3,3,3,0.645
30,-0.0054468,0.31644,0.32381,-0.82212,0.29565,-1.0645,0.29488,4.9356,56.391,0.11666,2.9548,0.015813,9.4073,15.765,0.35539,31.222,0.029792,0.82213,1.8028,1.0855,0.7457,0.51969,0.096046,0.096403,0.14938,0.12557,0.095509,0.087174,0.34992,0.32299,0.05882,0.0046689,0.0016179,0.077104,0.073891,0.42575,0.96485,0.28952,0.2116,0.28952,0.51598,0.75264,0.30053,0.81626,0.3285,48,56.208,2003,83052,6.5085,44.194,54081,5859,3888,0.92122,0.93971,0.056138,0.04252,0.022347,0.24129,25677,14620,0.00087197,0.00038477,0,0.10994,0,0.074216,0.017645,0.036709,0.022592,0.031556,0.50623,0.047693,0.60877,0.19565,0.29461,0.20858,0.23241,0.23418,0.068894,0.21176,0.20221,0.053523,17.241,5.6315,27153,57935,57224,0.2262,0.2573,0.070074,0.61147,0.67242,0.098636,0.83383,0.86944,0.094548,0.9524,0.96673,0.085738,0.98936,0.99313,0.075741,0.0074436,0.0057685,0.045862,0.016562,0.026004,-0.046116,0.015323,0.011968,0.044885,0.020958,0.036088,-0.057676,0.024799,0.019717,0.043557,0.024657,0.047483,-0.065388,0.0019074,0.0014649,0.023488,0.0031588,0.010356,-0.026501,0.005262,0.0042479,0.029959,0.0074893,0.016481,-0.032809,0.010757,0.0090635,0.035994,0.013165,0.024863,-0.035378,0.0049421,0.0038997,0.068744,0.018748,0.021805,-0.03379,0.0089971,0.0070147,0.06251,0.02127,0.028803,-0.042615,0.013065,0.010083,0.056742,0.022579,0.035127,-0.051048,0.00059416,0.00040394,0.064526,0.008256,0.021054,-0.022867,0.0016797,0.0011282,0.058513,0.0098545,0.028906,-0.029971,0.0029448,0.0019663,0.050025,0.010288,0.037185,-0.036387,0.4432,74,74,40,1054,3,3,3,0.645
30,-0.040304,0.83477,0.80731,-0.43809,0.73151,-0.57233,0.3064,0.26452,3.4129,0.070437,3.31,3.8657e-05,3.8419,3.6225,1.1227,4.4871,0.0042816,0.43811,3.8791,2.6838,2.0873,1.5709,0.045856,0.060002,0.092418,0.067063,0.052886,0.065614,0.61616,0.043371,7.3346e-05,0.099649,0.52627,1.0388,0.21849,0.034434,1.9611,0.071118,0.51529,0.51529,0.55833,0.77805,0.32457,1.5967,1.2698,41,202.49,8075,1.5846e+06,6.1657,39.019,2.1802e+05,1431,918,0.90282,0.91355,0.40691,0.31471,0.21426,0.85176,63821,41985,0.00069163,0.00040447,0,0.086012,0,0.078965,0.00065933,0.015423,0.0039174,0.0068959,1.0626,1.8537,1.2037,0.26526,0.32904,0.22082,0.3415,0.35141,0.14802,0.38641,0.3433,0.12132,47.698,5.962,13592,49471,48558,0.025182,0.018124,0.020244,0.18505,0.15361,0.077459,0.45408,0.45112,0.13361,0.67856,0.7077,0.15851,0.83694,0.8646,0.16626,0.00087714,0.00059617,0.014024,-0.0089136,0.0028441,-0.034357,0.0021779,0.0015027,0.016555,-0.010521,0.0054918,-0.051583,0.0044466,0.0031001,0.020266,-0.010916,0.009471,-0.066558,0.00015206,9.9451e-05,0.0048591,-0.0086873,-0.0035205,-0.029172,0.00081919,0.00055073,0.012103,-0.0090682,-0.0020927,-0.043421,0.0024212,0.0016688,0.021022,-0.0076691,0.0014628,-0.055964,0.00067296,0.00046607,0.024291,-0.0034882,0.0050104,-0.026423,0.0011792,0.00084479,0.02126,-0.0053426,0.0057149,-0.030505,0.0017568,0.0012736,0.019799,-0.0069656,0.0060696,-0.034358,5.2112e-05,3.0647e-05,0.014686,-0.0026838,0.010085,-0.018059,0.00022489,0.00013583,0.020329,-0.0028389,0.013747,-0.023499,0.00047973,0.00029568,0.021147,-0.0035382,0.017496,-0.027751,0.47851,74,74,40,1054,3,3,3,0.645
30,-0.010183,0.18506,0.18991,-0.89995,0.1574,-1.2723,0.41379,0.12719,3.063,-0.020586,3.3457,2.4745e-06,1.8402,4.117,0.19941,5.2734,0.0050319,0.90018,1.1627,0.56545,0.4491,0.37442,0.09527,0.12371,0.23254,0.17998,0.052324,0.038255,0.27792,0.17675,0.053719,0.040443,0.00010896,4.4158,8.069,3.1719,15.928,0.13802,0.13976,0.13976,0.7891,1.0245,0.24815,0.57139,0.16265,54,122.37,5942,6.4901e+05,7.1303,51.902,1.6043e+05,3375,2943,0.90866,0.92026,0.39299,0.31159,0.21635,0.82962,87178,34493,0.00087701,0.00048991,0,0.083957,0,0.056043,0.0045633,0.026717,0.0042736,0.029276,1.2493,0.075107,0.57952,0.1772,0.38563,0.28966,0.18352,0.46739,0.28832,0.17525,0.46671,0.31555,66.955,7.8208,24480,90500,89880,0.029575,0.020472,0.02006,0.18852,0.15723,0.066584,0.39257,0.35842,0.097465,0.56381,0.53742,0.11113,0.69142,0.6705,0.1159,0.0036168,0.002636,0.048791,0.0055653,0.015792,-0.056648,0.010706,0.0080896,0.068664,0.016926,0.027103,-0.071287,0.022291,0.017562,0.085725,0.031061,0.041432,-0.082939,0.0012131,0.00084618,0.032708,-0.00029415,0.0062123,-0.037182,0.0036729,0.0025947,0.045786,0.0042156,0.011748,-0.050567,0.0077772,0.0057275,0.056975,0.010124,0.019103,-0.060709,0.00068424,0.00043993,0.020839,-0.0031113,0.0079901,-0.025251,0.0013692,0.00088554,0.020828,-0.0040008,0.0098902,-0.032541,0.0026324,0.0017214,0.025031,-0.0032726,0.012286,-0.046406,0.0017194,0.0013499,0.40886,0.043034,0.032686,-0.035231,0.0057674,0.0046829,0.43989,0.063382,0.049296,-0.04139,0.012324,0.010426,0.45838,0.086162,0.06972,-0.044499,0.41401,74,74,40,1054,3,3,3,0.645
30,-0.03074,0.43421,0.46065,-0.73411,0.3406,-1.1089,0.51051,3.3737,37.3,0.080936,3.1576,0.0060278,5.1783,7.0983,0.5312,9.3674,0.0089384,0.73414,2.2864,1.3569,0.91587,0.62991,0.068624,0.0798,0.14998,0.12101,0.098501,0.092348,0.38973,0.19909,0.024538,0.01401,0.0018532,0.028822,0.018502,0.17043,0.45724,0.33932,0.35619,0.35619,0.5304,1.0956,0.3108,0.99049,0.43699,52,67.038,2674,1.3641e+05,6.8042,48.158,72198,5913,5697,0.91812,0.93629,0.24776,0.18781,0.12029,0.74311,33739,15534,0.0017928,0.00062878,0,0.051673,0,0.049001,0.012249,0.0026214,0.014455,0.011424,0.9632,0.0036484,1.192,0.21549,0.28912,0.22644,0.26435,0.24651,0.11047,0.3033,0.22603,0.090336,23.343,6.1138,19175,47733,47020,0.24328,0.24472,0.10369,0.70772,0.76351,0.15706,0.83817,0.87602,0.13076,0.88029,0.90747,0.10903,0.91145,0.93356,0.096,0.032918,0.035862,0.27904,0.12001,0.10728,0.046273,0.065611,0.072876,0.26442,0.148,0.13638,0.073935,0.10275,0.1159,0.24829,0.17026,0.1627,0.10349,0.0092339,0.0083108,0.15644,0.045373,0.034535,-0.027243,0.019277,0.018212,0.151,0.057231,0.047865,-0.01993,0.03225,0.03171,0.14846,0.069677,0.063645,-0.0074777,0.020851,0.02463,0.39903,0.11362,0.10684,0.074155,0.041627,0.050033,0.3979,0.14554,0.13683,0.10488,0.064163,0.078082,0.38338,0.16928,0.16006,0.13408,0.0028334,0.0029212,0.42335,0.05783,0.054783,0.0057163,0.0082575,0.008481,0.39575,0.073265,0.070451,0.006745,0.015453,0.016029,0.36117,0.086466,0.086368,0.011517,0.43464,74,74,40,1054,3,3,3,0.645
30,-0.0061051,0.14774,0.1501,-0.92182,0.13245,-1.2379,0.3429,-0.057658,2.7658,-0.0037467,3.3497,7.1825e-05,1.9351,4.8945,0.15601,6.249,0.0059628,0.92191,0.91372,0.50957,0.40195,0.33213,0.11415,0.1669,0.23648,0.14136,0.051385,0.037781,0.25194,0.27787,0.18483,0.052096,0.048542,4.5282,8.0959,4.0553,17.243,0.090488,0.08931,0.090488,0.38322,0.98816,0.24405,0.50185,0.12128,30,245.47,6386,1.3518e+06,5.1305,27.55,1.7242e+05,15660,5481,0.90635,0.91691,0.4426,0.36263,0.24246,0.87562,81603,37666,0.0014489,0.00057086,0,0.064406,0,0.053703,0.00091203,0.02315,0.0029533,0.024051,0.13224,0.80261,0.023204,0.20391,0.37427,0.24633,0.22769,0.43026,0.19343,0.23646,0.43661,0.17932,59.9,6.651,18574,78850,77998,0.045847,0.036318,0.03261,0.29182,0.29363,0.10808,0.55918,0.58041,0.14558,0.74334,0.77165,0.15364,0.86452,0.88421,0.15196,0.0020962,0.0014545,0.029653,-0.0021044,0.0079515,-0.03754,0.0058577,0.0042471,0.039396,0.0018726,0.014806,-0.051536,0.01246,0.0093107,0.050245,0.0086508,0.023924,-0.064656,9.7324e-05,6.5055e-05,0.0027517,-0.008557,-0.0025924,-0.023679,0.000896,0.00061629,0.011713,-0.0081641,-0.00020419,-0.035938,0.0033129,0.0023914,0.02545,-0.004271,0.0051638,-0.04385,0.0016679,0.0011294,0.053267,0.0041783,0.0095221,-0.033728,0.0039292,0.0027913,0.062678,0.0082036,0.013901,-0.04166,0.0070163,0.0051616,0.069962,0.01258,0.018257,-0.047522,0.00033097,0.00026008,0.082526,0.0052794,0.017545,-0.012847,0.0012736,0.0010159,0.10186,0.010131,0.025076,-0.019219,0.0031195,0.002514,0.12167,0.017102,0.034293,-0.026416,0.38465,74,74,40,1054,3,3,3,0.645
30,-0.0013384,0.23054,0.22933,-0.87775,0.22933,-0.87384,-0.0044579,-1.447,8.0053,-0.069873,3.1787,0.0033301,4.7841,9.6724,0.24418,18.339,0.017499,0.87779,1.381,0.99837,0.7382,0.56318,0.15061,0.11704,0.14418,0.08155,0.075954,0.065322,0.36535,0.46169,0.076673,0.020095,0.82786,0.79279,0.97367,0.75306,3.9058,0.31562,0.29897,0.31562,0.32437,1.2561,0.24994,0.63548,0.19913,39,120.36,4133,4.3617e+05,5.9309,36.44,1.1159e+05,10152,1431,0.91886,0.9338,0.25589,0.19127,0.15255,0.71358,40559,17704,0.0013022,0.00049506,0,0.087048,0,0.076656,0.0031409,0.011103,0.00044634,0.016053,1.9001,2.4062,0.4727,0.19214,0.34609,0.24912,0.22458,0.38656,0.15851,0.2258,0.40628,0.15486,35.381,6.7263,20589,52624,51584,0.14927,0.14528,0.07099,0.46321,0.46693,0.11471,0.68182,0.68921,0.11869,0.79777,0.81221,0.11025,0.86556,0.88407,0.10173,0.0026901,0.0018234,0.025445,0.00076834,0.017835,-0.058395,0.0072071,0.0049843,0.03241,0.0050226,0.026339,-0.084407,0.014706,0.010435,0.039654,0.011337,0.036475,-0.10426,0.0015196,0.0010558,0.028728,0.0015982,0.0086535,-0.037205,0.0032497,0.0022887,0.028404,0.0019654,0.012041,-0.050018,0.0059355,0.0043057,0.030488,0.0035225,0.016673,-0.060973,0.00085677,0.00055894,0.018296,-0.0015415,0.012362,-0.039968,0.0026956,0.0018422,0.028751,0.0018488,0.017082,-0.054551,0.0056078,0.0039487,0.037388,0.0060635,0.022028,-0.064144,0.00031374,0.00020868,0.052307,0.0038993,0.01826,-0.03315,0.0012618,0.00085341,0.067478,0.0081171,0.027175,-0.044251,0.0031631,0.0021806,0.082492,0.014174,0.03816,-0.055017,0.42571,74,74,40,1054,3,3,3,0.645
30,-0.0084262,0.28095,0.27668,-0.85033,0.26173,-1.048,0.23243,1.8106,12.429,0.15777,3.2077,0.0023424,4.8631,8.8842,0.29906,12.088,0.011535,0.85033,1.5206,0.99539,0.7673,0.57914,0.12703,0.11395,0.1497,0.10547,0.065328,0.068096,0.37042,0.40792,0.090074,0.0018172,0.14888,1.1623,0.62878,0.55921,2.9989,0.35164,0.32311,0.35164,0.55153,0.57888,0.23368,0.71618,0.25421,53,64.981,1986,82200,5.927,38.817,53622,19791,6102,0.91853,0.94025,0.11272,0.081452,0.060446,0.50907,35164,15758,0.0011565,0.00048418,0,0.050981,0,0.045006,0.021135,0.030867,0.026991,0.03558,0.19542,0.36213,0.7287,0.20297,0.30748,0.21214,0.26889,0.2682,0.080827,0.26196,0.23033,0.067372,17.968,5.7277,21861,47476,46592,0.15086,0.14001,0.060181,0.54397,0.57572,0.11299,0.74374,0.77837,0.1086,0.82778,0.85124,0.095959,0.88266,0.89713,0.087014,0.0044438,0.0036337,0.035256,0.0073925,0.023278,-0.042893,0.013876,0.011901,0.052341,0.020405,0.039582,-0.051037,0.030306,0.026876,0.068543,0.03769,0.059545,-0.054477,0.001442,0.0011285,0.022866,0.0010343,0.0094919,-0.027934,0.0049226,0.0041908,0.03609,0.0073841,0.017631,-0.033598,0.012453,0.011259,0.053655,0.019107,0.030296,-0.03124,0.0017985,0.001406,0.032213,0.0038306,0.015659,-0.030337,0.0045214,0.0035967,0.040451,0.0082094,0.023265,-0.038026,0.0083527,0.0067672,0.046712,0.012954,0.030778,-0.04421,0.0012033,0.0010993,0.16828,0.022045,0.032419,-0.013337,0.0046572,0.0043001,0.20891,0.038196,0.049149,-0.016628,0.010435,0.0096302,0.22827,0.054753,0.066869,-0.021469,0.45852,74,74,40,1054,3,3,3,0.645
30,-0.003756,0.18856,0.18557,-0.90236,0.17942,-1.0667,0.1821,-1.0626,6.9858,-0.078843,3.2647,0.0010721,2.0676,4.677,0.19506,5.9624,0.0056893,0.90237,1.1258,0.66789,0.50776,0.40703,0.12455,0.13956,0.19481,0.13195,0.065056,0.04851,0.29555,0.34569,0.14427,0.018692,0.054388,1.6414,3.284,1.928,7.4165,0.11495,0.1515,0.1515,0.33706,0.97736,0.18164,0.56371,0.1474,45,122.8,2358,2.0679e+05,3.8801,17.089,63666,46035,32859,0.92054,0.93961,0.38477,0.27673,0.27832,0.8491,41512,25155,0.00080937,0.00038314,0,0.056587,0,0.06935,0.0045609,0.0015361,0.0037084,0.0099464,0.53829,2.7261,1.7695,0.1818,0.40387,0.26067,0.20186,0.52508,0.19319,0.20385,0.53521,0.1913,49.482,7.038,18934,45753,44161,0.019814,0.017733,0.011725,0.17322,0.17606,0.053372,0.35805,0.36942,0.07755,0.50743,0.52563,0.087255,0.63854,0.65681,0.093374,0.00056557,0.00041865,0.006656,-0.0090606,0.0087524,-0.025851,0.0018258,0.0013695,0.010216,-0.009999,0.013531,-0.042814,0.0049168,0.0037779,0.016495,-0.0083063,0.021083,-0.061731,0.00039838,0.00029526,0.0093706,-0.0057554,0.0030277,-0.019279,0.00099769,0.00075511,0.01085,-0.0070079,0.0050745,-0.028206,0.0025278,0.0019739,0.016155,-0.0062259,0.0090929,-0.041487,9.0014e-05,6.6807e-05,0.0023916,-0.0069464,0.0066425,-0.015573,0.0004215,0.00031289,0.0055937,-0.0078702,0.0079625,-0.022005,0.0010912,0.000822,0.0090525,-0.0081433,0.010245,-0.028822,7.7175e-05,5.6582e-05,0.016009,-0.0016527,0.011418,-0.016872,0.0004066,0.00030146,0.027054,-0.00040649,0.018196,-0.026675,0.0012977,0.000982,0.042109,0.0027352,0.027064,-0.036034,0.39737,74,74,40,1054,3,3,3,0.645
30,-0.032909,0.82719,0.80738,-0.43801,0.73826,-0.56616,0.29259,0.28402,9.9374,-0.020116,3.2875,0.00066192,6.8472,6.4556,1.1229,8.7684,0.0083668,0.43802,3.8927,2.6239,1.904,1.398,0.043688,0.067379,0.087215,0.072107,0.068936,0.073218,0.58746,0.045165,0.013834,0.116,0.29142,0.21623,0.059477,0.033977,0.77609,0.31274,0.68919,0.68919,0.53145,0.63535,0.26299,1.6177,1.286,74,57.689,2758,1.0593e+05,7.8255,64.761,74466,15417,6642,0.91782,0.93314,0.1064,0.081509,0.010894,0.36824,30911,14437,0.0016642,0.00052063,0,0.13679,0,0.087333,0.046333,0.072885,0.075869,0.10971,0.89557,1.0088,0.23464,0.19494,0.27407,0.21229,0.24148,0.19876,0.099379,0.21429,0.16623,0.077797,15.97,5.7318,22173,65083,64454,0.22379,0.21797,0.10891,0.62676,0.68355,0.15883,0.79145,0.83534,0.14098,0.86486,0.89732,0.12231,0.90853,0.92947,0.10927,0.0062103,0.0058669,0.06011,0.015644,0.025208,-0.011223,0.014053,0.01419,0.064671,0.023054,0.037229,0.0026586,0.025214,0.027051,0.069572,0.031849,0.052196,0.025387,0.0045761,0.0046926,0.088528,0.020217,0.019814,0.0046554,0.011251,0.012228,0.10063,0.031574,0.032574,0.021809,0.02101,0.024161,0.11043,0.04424,0.049006,0.048105,0.0015257,0.0011078,0.033338,0.0025601,0.012936,-0.02484,0.0027163,0.0019409,0.029647,0.0019524,0.015137,-0.030733,0.0040855,0.0028698,0.027874,0.0015851,0.01685,-0.038978,0.00010856,6.6544e-05,0.018522,-0.00077297,0.014091,-0.012746,0.00031197,0.00019328,0.017073,-0.0013171,0.019602,-0.015328,0.00058822,0.00036716,0.015698,-0.0020403,0.025808,-0.019407,0.54681,74,74,40,1054,3,3,3,0.645
30,-0.0065364,0.11244,0.12455,-0.93559,0.085718,-1.458,0.55839,-0.009225,3.2596,-0.026434,3.333,1.3726e-06,1.3251,3.6961,0.12829,4.6444,0.0044317,0.93578,0.85049,0.43723,0.3429,0.26399,0.14102,0.17214,0.2172,0.15878,0.049943,0.047507,0.21342,0.31827,0.15036,0.0040811,0.036397,6.3734,5.8499,8.7253,21.458,0.16116,0.11172,0.16116,0.8939,1.3891,0.34811,0.45439,0.096044,54,89.685,2089,1.3303e+05,4.358,21.34,56403,38664,29133,0.91606,0.9333,0.35924,0.27024,0.21828,0.87817,50272,22574,0.0011058,0.0004404,0,0.068011,0,0.070678,0.0049095,0.0041906,0.00050477,0.00068219,0.87784,0.03361,0.22133,0.19933,0.36274,0.25926,0.24355,0.42816,0.20367,0.25963,0.42078,0.20107,42.114,7.0001,17644,44752,43547,0.051985,0.044123,0.026747,0.27702,0.27439,0.074215,0.47873,0.49091,0.090156,0.63076,0.65268,0.094309,0.75859,0.78434,0.096453,0.0065538,0.0051844,0.067064,0.017589,0.025558,-0.060223,0.014921,0.011717,0.07259,0.026063,0.036231,-0.084297,0.026279,0.020513,0.076659,0.034896,0.04686,-0.10808,0.00082178,0.00060459,0.016807,-0.0027052,0.0045859,-0.036831,0.0029755,0.0022616,0.028136,0.0010029,0.0092383,-0.04849,0.0067571,0.005266,0.037549,0.0059484,0.015463,-0.05912,0.0049799,0.0040474,0.11505,0.024527,0.024993,-0.045049,0.0099582,0.0079766,0.11491,0.031463,0.031938,-0.060715,0.015767,0.012398,0.11373,0.037561,0.037457,-0.078201,0.00075207,0.0005324,0.13565,0.014432,0.028527,-0.031214,0.0022133,0.0016418,0.12805,0.018275,0.037109,-0.041734,0.0046634,0.0035185,0.13157,0.024579,0.046335,-0.053011,0.4113,74,74,40,1054,3,3,3,0.645
30,-0.0026078,0.10136,0.10618,-0.94537,0.090181,-1.3124,0.38821,-0.19081,4.1913,-0.021499,3.2575,0.00095424,1.1756,3.5549,0.10916,4.5137,0.004307,0.94537,0.78965,0.47073,0.38377,0.3003,0.16488,0.17346,0.19376,0.12849,0.045311,0.049193,0.2449,0.40511,0.16925,0.0038197,0.25176,9.1756,5.3835,6.197,21.586,0.30962,0.215,0.30962,0.54145,1.2117,0.23068,0.41886,0.085017,43,63.837,730,25359,2.7476,9.8651,19710,14985,11907,0.92069,0.94191,0.22772,0.1674,0.11308,0.85085,32354,16948,0.00062775,0.00030445,0,0.064937,0,0.058997,0.0042049,0.017445,0.0022034,0.011913,1.0004,1.7512,0.18116,0.18441,0.36894,0.28347,0.21475,0.47375,0.25103,0.2184,0.47282,0.25907,32.446,7.6538,23887,45406,44675,0.028319,0.023367,0.0087936,0.2354,0.22076,0.038062,0.47699,0.46502,0.054214,0.64808,0.64571,0.058481,0.77611,0.78976,0.059556,0.0008846,0.00064297,0.0054631,-0.0054453,0.013237,-0.02373,0.0025336,0.0018271,0.0074392,-0.0057141,0.018986,-0.038897,0.0061336,0.0044752,0.010799,-0.0040977,0.027145,-0.056895,0.00025305,0.00017939,0.0031235,-0.0048427,0.003198,-0.023363,0.0013438,0.00096201,0.0076688,-0.0040228,0.0072786,-0.034983,0.0040527,0.0029761,0.013592,-0.0012058,0.013788,-0.048211,0.00063155,0.00046357,0.0088056,-0.0023436,0.012789,-0.017342,0.0011778,0.00085686,0.0082024,-0.0032832,0.015029,-0.022064,0.0019637,0.0014195,0.0085482,-0.0037832,0.016839,-0.029081,0,0,0,-0.0026,0.012247,0,1.2052e-05,8.1872e-06,0.00042081,-0.0034406,0.018565,-0.015713,0.00011724,7.9578e-05,0.0019963,-0.0040054,0.027108,-0.016803,0.39721,74,74,40,1054,3,3,3,0.645
30,-0.0035155,0.23441,0.23695,-0.8734,0.22101,-1.0999,0.25932,0.46268,4.9659,0.031848,3.2917,0.00059885,4.7082,9.3533,0.2529,12.987,0.012393,0.87342,1.4178,0.83807,0.60911,0.45252,0.10349,0.14127,0.15857,0.13273,0.078767,0.068173,0.317,0.30112,0.18447,0.00029774,0.016976,0.55382,0.6317,1.1264,2.8148,0.22006,0.14358,0.22006,0.2032,0.68012,0.1682,0.64959,0.21198,34,231.29,5639,9.3062e+05,5.3639,30.492,1.5225e+05,16119,12717,0.91628,0.93064,0.38475,0.2875,0.27255,0.78621,48782,24879,0.0020816,0.0007975,0,0.066366,0,0.046914,0.011582,0.028251,0.010885,0.035373,0.47208,0.15973,0.72754,0.23667,0.30958,0.2038,0.30159,0.29489,0.10218,0.33362,0.29221,0.089673,25.079,5.5026,16174,53805,52953,0.19436,0.18355,0.15142,0.59871,0.64106,0.24287,0.82163,0.85427,0.23429,0.92146,0.93946,0.20861,0.96367,0.97307,0.18553,0.0057667,0.0047905,0.089351,0.017555,0.024644,-0.043999,0.013189,0.011317,0.097158,0.026497,0.036432,-0.050856,0.024247,0.02148,0.1071,0.03821,0.05094,-0.052737,0.0011741,0.00094295,0.036359,-0.0006185,0.0035141,-0.031832,0.0043887,0.0037318,0.062837,0.0079039,0.012818,-0.0364,0.010708,0.009588,0.090101,0.020961,0.026499,-0.035025,0.0041964,0.0035428,0.14679,0.024234,0.027913,-0.032568,0.0080595,0.0070446,0.14082,0.029413,0.035007,-0.032911,0.012593,0.011313,0.13753,0.034437,0.040951,-0.032038,0.00039628,0.00030477,0.10823,0.0074495,0.016698,-0.020987,0.0013614,0.0011063,0.11926,0.011745,0.024922,-0.023629,0.0028519,0.0024069,0.12183,0.015759,0.033359,-0.024724,0.51705,74,74,40,1054,3,3,3,0.645
30,-0.018396,0.42496,0.41858,-0.76225,0.37803,-0.99948,0.31123,-0.65825,5.4712,-0.034405,3.2769,0.00084372,3.6729,5.3247,0.47491,6.8455,0.0065319,0.7623,1.904,1.2736,0.98374,0.70978,0.071578,0.10897,0.15927,0.096138,0.064711,0.081332,0.41799,0.17289,0.12507,0.015562,0.14825,0.7278,0.12261,0.13907,1.4512,0.23718,0.38168,0.38168,0.69808,0.77501,0.3109,0.91641,0.40303,49,66.816,2170,1.0076e+05,6.0556,39.868,58590,14715,9855,0.92092,0.94261,0.11548,0.077441,0.067828,0.52665,40145,21513,0.00063533,0.00033697,0,0.057162,0,0.064207,0.016122,0.03389,0.024849,0.026141,0.28677,0.29387,0.12932,0.19826,0.34429,0.2528,0.26641,0.39219,0.16172,0.27166,0.40207,0.15706,27.793,6.8255,11838,21616,19730,0.08529,0.075281,0.03261,0.30091,0.28666,0.059907,0.56157,0.56858,0.078589,0.7252,0.74409,0.080574,0.85002,0.86415,0.080313,0.0049869,0.0044804,0.037921,0.0092618,0.022045,-0.03952,0.011491,0.01043,0.041543,0.014434,0.032683,-0.047856,0.020013,0.018359,0.043381,0.019237,0.045223,-0.052629,0.0037966,0.0034303,0.057701,0.013678,0.018277,-0.033874,0.0088643,0.0080583,0.062287,0.02011,0.02675,-0.041135,0.01497,0.013784,0.06182,0.024702,0.036079,-0.043017,0.0011181,0.00097867,0.019196,4.4317e-05,0.010187,-0.020293,0.0022319,0.0019794,0.019138,3.359e-05,0.013363,-0.02499,0.0038691,0.0034418,0.020738,0.00082946,0.01698,-0.030855,7.2164e-05,7.145e-05,0.0096724,-0.0014233,0.012935,-0.0010594,0.00047754,0.00045851,0.02053,0.00030423,0.021334,-0.0062594,0.0014818,0.0013787,0.031067,0.0032223,0.03182,-0.014076,0.43147,74,74,40,1054,3,3,3,0.645
30,-0.0060024,0.28284,0.27329,-0.85232,0.2709,-0.932,0.093491,0.59008,4.3869,0.065769,3.2696,0.00059749,3.1978,5.8871,0.2945,7.9112,0.0075488,0.85257,1.4127,1.0199,0.8363,0.60005,0.13517,0.12611,0.13635,0.082928,0.050921,0.082722,0.3858,0.4072,0.1198,0.032355,0.68273,3.2092,0.29909,0.55224,5.3026,0.18136,0.20862,0.20862,0.43047,0.96556,0.23585,0.70491,0.24939,79,40.835,1238,28862,5.4433,34.575,33426,19737,13338,0.92241,0.94682,0.20309,0.13318,0.16087,0.66526,28310,17105,0.00077424,0.0004025,0,0.057684,0,0.069338,0.0066857,0.0048208,0.00014514,0.04165,1.472,2.3631,0.51363,0.18003,0.36386,0.26697,0.19923,0.47839,0.19406,0.19924,0.49074,0.19133,27.127,7.2083,8760.2,16400,13754,0.068663,0.063649,0.027938,0.3262,0.32204,0.069112,0.56326,0.56518,0.083887,0.72445,0.72655,0.085658,0.83498,0.84275,0.083958,0.0049715,0.0046648,0.040231,0.0095014,0.021836,-0.024472,0.011399,0.01078,0.043855,0.014678,0.030808,-0.028687,0.019507,0.018591,0.045001,0.018963,0.040469,-0.030141,0.0041231,0.0039061,0.066687,0.015932,0.018562,-0.019017,0.0091287,0.0087267,0.068265,0.021651,0.026407,-0.020575,0.014819,0.014327,0.065121,0.025125,0.034511,-0.018295,0.0007297,0.00064854,0.013331,-0.0021376,0.0099302,-0.019647,0.002484,0.0023026,0.022668,0.00094398,0.015247,-0.020089,0.0054449,0.0051838,0.031059,0.0051544,0.020546,-0.017483,0.00011876,0.00011016,0.01694,-0.00049134,0.01168,-0.0096666,0.00066707,0.00059899,0.03052,0.0020494,0.01755,-0.018135,0.0017133,0.0015127,0.038227,0.0046702,0.024062,-0.025713,0.44614,74,74,40,1054,3,3,3,0.645
30,-0.056835,1.0556,0.99298,-0.077985,0.93558,-0.096734,0.24043,0.13747,2.4299,0.093275,3.3573,0.0002655,3.5571,2.6183,1.8421,3.2355,0.0030873,0.07799,8.7592,6.4045,4.655,2.3825,0.027263,0.026218,0.033587,0.033145,0.042499,0.12084,0.71644,0.064189,1.6044,5.9124,5.492,1.9235,0.061728,0.11148,15.17,0.078672,0.091332,0.091332,0.12743,0.13621,0.076772,2.6719,3.4429,86,52.151,3513,1.4237e+05,9.0351,83.086,94851,4347,3618,0.91603,0.92835,0.057633,0.045447,0.0018595,0.16315,20583,12229,0.00083765,0.00040707,0,0.11751,0,0.061129,0.049218,0.0060733,0.061572,0.012212,0.3419,0.61756,0.31883,0.20213,0.31497,0.24718,0.23598,0.33194,0.18948,0.25101,0.31076,0.17667,13.915,6.674,35416,1.2361e+05,1.2315e+05,0.12853,0.12461,0.067601,0.33577,0.32242,0.091958,0.46674,0.4645,0.089854,0.57698,0.59292,0.088187,0.6691,0.68831,0.086968,0.0097142,0.0090924,0.10162,0.031679,0.034618,-0.014081,0.019991,0.019156,0.099424,0.040211,0.04583,-0.011836,0.032523,0.031207,0.096985,0.047892,0.056731,-0.01406,0.0043634,0.0040142,0.091229,0.019691,0.018639,-0.012505,0.010278,0.0099557,0.099353,0.029113,0.028634,-0.0066801,0.018544,0.018276,0.10534,0.039113,0.04029,-0.0038757,0.0044161,0.0043621,0.10429,0.021191,0.025668,-0.00173,0.0078544,0.0075884,0.09265,0.023167,0.02931,-0.0055749,0.010636,0.0099698,0.078427,0.022027,0.030094,-0.011587,0.0009347,0.00071602,0.17234,0.018967,0.022238,-0.020045,0.0027581,0.0022122,0.16312,0.024172,0.030274,-0.022589,0.0052293,0.0042718,0.15082,0.028605,0.03754,-0.025946,0.61506,74,74,40,1054,3,3,3,0.645
30,-0.049781,0.99974,0.97403,-0.15826,0.90843,-0.19933,0.25952,0.74284,2.8087,0.24113,3.2201,1.1227e-05,3.531,2.7202,1.6818,3.4616,0.0033031,0.15826,9.7419,5.9793,4.4178,2.2613,0.015985,0.021208,0.049956,0.050516,0.041568,0.12285,0.69792,1.2339,3.4652,1.671,1.3645,2.1434,0.061638,0.097461,10.037,0.10267,0.061867,0.10267,0.24794,0.29998,0.11753,2.3778,2.8088,92,44.283,2292,59385,8.5872,78.797,61884,12285,6939,0.91897,0.9351,0.029602,0.021655,0.018034,0.13563,20132,13645,0.0009588,0.00043552,0,0.071459,0,0.053862,0.0047165,0.019143,0.0079923,0.0095838,0.72353,0.67917,0.068755,0.19374,0.30835,0.24385,0.23191,0.28371,0.1614,0.23789,0.26814,0.14829,17.525,6.5841,24512,62567,61659,0.15354,0.14706,0.075204,0.41406,0.41241,0.1056,0.56873,0.57214,0.10196,0.67159,0.67616,0.095587,0.75295,0.75601,0.091133,0.0092667,0.0084669,0.090267,0.028645,0.034828,-0.025275,0.020903,0.019005,0.096807,0.041169,0.048405,-0.036055,0.036889,0.033626,0.10244,0.054668,0.063854,-0.044194,0.0060898,0.0059982,0.11856,0.029524,0.026043,-0.0036033,0.013942,0.0133,0.1255,0.041659,0.036892,-0.01492,0.024772,0.023233,0.13104,0.054571,0.049575,-0.025273,0.0021033,0.0016313,0.046254,0.0061379,0.01755,-0.031403,0.0048063,0.0038431,0.052795,0.010247,0.023071,-0.037886,0.0083438,0.0069306,0.057291,0.014361,0.028254,-0.03943,0.0010736,0.0008374,0.18434,0.021491,0.025709,-0.024976,0.0029417,0.0024259,0.16201,0.025152,0.034412,-0.026258,0.0055475,0.0047624,0.14899,0.029609,0.044638,-0.027189,0.54609,74,74,40,1054,3,3,3,0.645
30,-0.0022937,0.26321,0.26036,-0.85988,0.25949,-0.90955,0.057771,-0.29602,6.4828,-0.0072414,3.2619,0.0014649,3.9706,7.5116,0.27889,11.073,0.010566,0.86035,1.5247,0.96615,0.74338,0.58297,0.13705,0.12981,0.12272,0.11374,0.065689,0.058751,0.37224,0.44256,0.16222,0.069793,0.076988,1.1503,1.1688,0.52328,3.5939,0.28778,0.20066,0.28778,0.44757,2.961,0.44744,0.69295,0.22576,49,143.22,4785,5.1918e+05,5.8209,36.85,1.292e+05,47709,3510,0.91535,0.93276,0.16179,0.1152,0.11638,0.47312,31592,18696,0.0015339,0.0007367,0,0.043425,0,0.046996,0.016345,0.021959,0.018795,0.015551,0.030233,1.0325,1.1311,0.20243,0.30116,0.20158,0.24309,0.27242,0.086268,0.24711,0.25879,0.07477,16.332,5.4426,6213,18793,16871,0.23799,0.22601,0.16653,0.6836,0.71944,0.24907,0.89056,0.91174,0.22809,0.96047,0.97031,0.1953,0.97932,0.98466,0.16934,0.0064443,0.0058636,0.089682,0.020053,0.0298,-0.029411,0.015347,0.014269,0.10154,0.031888,0.043654,-0.031135,0.027547,0.02614,0.10929,0.043854,0.059571,-0.028524,0.0011332,0.00098682,0.031519,-0.00088522,0.0038865,-0.020502,0.0036257,0.0032497,0.046626,0.0040737,0.011029,-0.025266,0.0083598,0.0077574,0.063179,0.012184,0.021967,-0.02398,0.0050818,0.0046952,0.15966,0.029495,0.03606,-0.021457,0.011303,0.010684,0.17737,0.043274,0.049334,-0.020124,0.018564,0.017877,0.1821,0.054089,0.060399,-0.016275,0.00022934,0.00018158,0.056257,0.0024169,0.012949,-0.016213,0.00080924,0.00067548,0.063673,0.0044278,0.019033,-0.018677,0.0017556,0.0014875,0.067362,0.0064947,0.027104,-0.023134,0.57281,74,74,40,1054,3,3,3,0.645
30,-0.00055232,0.554,0.55313,-0.66809,0.55309,-0.67321,0.0076537,1.671,8.5825,0.16252,3.1357,0.002477,6.292,7.719,0.66317,13.418,0.012803,0.6681,2.8045,1.5339,1.1984,0.84533,0.078777,0.073475,0.099431,0.13379,0.061135,0.088359,0.46503,0.26173,0.0078641,0.093949,0.0074127,0.6617,0.026479,0.028014,1.0871,0.21605,0.22128,0.22128,0.42256,0.61499,0.2779,1.1586,0.66499,45,63.378,2010,90016,6.1225,39.787,54270,9423,4050,0.92065,0.9388,0.066048,0.049837,0.0032617,0.2507,28925,15585,0.00093616,0.00039855,0,0.12204,0,0.073537,0.0016749,0.085358,0.0057849,0.12979,0.35335,0.2588,0.053212,0.19371,0.32598,0.23073,0.20612,0.33494,0.13875,0.23819,0.31141,0.11707,22.93,6.2296,40068,87366,86890,0.17445,0.18936,0.05954,0.49678,0.56091,0.088286,0.71229,0.76633,0.088983,0.87708,0.90341,0.086989,0.95545,0.96581,0.080585,0.0005587,0.00038762,0.0037924,-0.0068615,0.0073899,-0.019437,0.0021141,0.0015475,0.0068227,-0.006914,0.012477,-0.02997,0.0057033,0.0044015,0.011036,-0.0049956,0.020238,-0.037911,0.00021213,0.00014723,0.0028779,-0.0052888,0.0017686,-0.017531,0.0010577,0.0007664,0.0066343,-0.0051033,0.0059523,-0.023765,0.0030987,0.0023224,0.011422,-0.003413,0.012332,-0.031593,0.00022521,0.00015149,0.0034512,-0.0045471,0.0062773,-0.0098361,0.00041475,0.00027669,0.0031746,-0.0059613,0.0069866,-0.012782,0.0006654,0.00044135,0.0031838,-0.0072071,0.0078758,-0.015987,0.00012136,8.8894e-05,0.014521,-0.00039931,0.01012,-0.011713,0.00064171,0.00050445,0.024628,0.0016616,0.016691,-0.014346,0.0019392,0.0016378,0.036293,0.0054691,0.025356,-0.015346,0.42737,74,74,40,1054,3,3,3,0.645
30,-0.0029331,0.37444,0.37189,-0.79231,0.36784,-0.87492,0.10426,0.50421,5.63,0.029243,3.2574,0.0012451,4.4377,6.8829,0.4149,10.117,0.0096536,0.79234,1.6874,1.088,0.81828,0.65498,0.079647,0.11197,0.16993,0.10861,0.072244,0.05518,0.40242,0.24025,0.13717,0.041589,0.038393,0.42778,0.92692,0.16639,1.9785,0.13336,0.39427,0.39427,0.53114,0.96858,0.24667,0.8492,0.35815,53,93.151,2744,1.639e+05,5.7525,36.405,74088,32616,4671,0.91719,0.93679,0.29553,0.21102,0.18982,0.80216,45363,25477,0.00079511,0.00043142,0,0.07693,0,0.083015,0.033201,0.12837,0.051645,0.1974,0.81687,0.51585,0.061514,0.18122,0.37154,0.27787,0.1926,0.4571,0.26502,0.18265,0.47129,0.27793,43.826,7.5026,10942,25326,23758,0.033171,0.026263,0.017496,0.21327,0.19626,0.058571,0.42688,0.41668,0.082411,0.62556,0.61688,0.095879,0.75269,0.74361,0.098105,0.0030236,0.0027097,0.031717,0.0022782,0.018101,-0.02859,0.0092007,0.0087327,0.045885,0.01075,0.029992,-0.02102,0.01971,0.019601,0.05894,0.022067,0.045717,-0.0030467,0.00021842,0.00015617,0.0045794,-0.006566,0.00017939,-0.02163,0.00069471,0.00051702,0.0067341,-0.0077728,0.0025944,-0.029564,0.0016895,0.0013166,0.0096243,-0.0082256,0.0069104,-0.038345,0.0023091,0.0021527,0.054684,0.0076968,0.020652,-0.015601,0.0066607,0.0066823,0.078788,0.018283,0.031474,0.0011066,0.013812,0.014675,0.10213,0.031952,0.044952,0.028168,0.00049613,0.00040088,0.091734,0.0084831,0.020785,-0.029883,0.0019106,0.0015865,0.11331,0.015343,0.031709,-0.035022,0.0044228,0.0037812,0.12792,0.023299,0.044707,-0.038545,0.40769,74,74,40,1054,3,3,3,0.645
30,-0.013313,0.3945,0.38503,-0.78396,0.36469,-0.96416,0.22985,0.58898,5.2749,0.041846,3.2975,0.00064519,4.4479,6.7637,0.43164,9.0966,0.00868,0.78397,1.9921,1.2503,0.96484,0.70825,0.10385,0.098438,0.12468,0.11137,0.065267,0.077281,0.41912,0.33537,0.054941,0.023633,0.047323,0.90448,0.21801,0.18569,1.7695,0.28159,0.30439,0.30439,0.30107,0.95077,0.20669,0.87853,0.3728,65,91,3358,1.9819e+05,6.4672,46.301,90666,34371,14013,0.91853,0.9356,0.16715,0.11815,0.1234,0.49065,26795,16422,0.00096508,0.00049155,0,0.047915,0,0.048358,0.011596,0.032022,0.010766,0.0333,0.79375,0.5384,0.66699,0.19991,0.31254,0.21121,0.22866,0.29119,0.10149,0.23474,0.28777,0.088629,9.9581,5.7026,5875.5,15908,14721,0.25015,0.25127,0.15352,0.61,0.63878,0.19493,0.80791,0.83611,0.18149,0.90493,0.92365,0.16139,0.94687,0.95757,0.1436,0.0079875,0.0072894,0.097495,0.026081,0.034984,-0.031229,0.017513,0.016605,0.10163,0.036205,0.049609,-0.023871,0.02953,0.02911,0.10275,0.045311,0.064721,-0.00807,0.0013618,0.0011189,0.033223,0.00074036,0.0068185,-0.028554,0.0036609,0.0030573,0.041292,0.0039534,0.012006,-0.037285,0.0077152,0.0066105,0.05114,0.009426,0.020379,-0.044343,0.0052214,0.0049329,0.14388,0.028531,0.033276,-0.015843,0.011505,0.011503,0.15835,0.041339,0.047447,-5.1992e-05,0.019312,0.020324,0.16616,0.053065,0.060937,0.023921,0.0014042,0.0012376,0.30212,0.0327,0.040495,-0.019042,0.0032522,0.0028249,0.22443,0.031754,0.047025,-0.025389,0.0049633,0.0043198,0.16703,0.029062,0.052027,-0.028539,0.68619,74,74,40,1054,3,3,3,0.645
