30,-0.0010488,0.5855,0.58495,-0.64381,0.5831,-0.60755,-0.056331,-1.2208,7.4458,-0.13367,3.1083,0.004783,5.5094,6.5256,0.71145,11.499,0.010972,0.64389,2.3322,1.4824,1.1449,0.84118,0.090116,0.0829,0.11955,0.10384,0.064072,0.077729,0.46179,0.31362,0.031736,0.013751,0.043168,0.73416,0.13658,0.036772,1.3098,0.38574,0.30545,0.38574,1.1941,1.2288,0.40225,1.1738,0.67597,20,306.75,4614,1.1037e+06,3.7145,15.542,1.2458e+05,34911,3618,0.90161,0.92902,0.34662,0.25808,0.23552,0.74864,41700,24753,0.0013639,0.00068723,0,0.095383,0,0.069084,0.0069646,0.031144,0.012872,0.048145,1.12,0.4123,0.60043,0.26556,0.31742,0.22126,0.29376,0.32208,0.15388,0.30812,0.31194,0.13857,34.441,5.9741,15549,47500,46794,0.21939,0.22604,0.14016,0.55843,0.59741,0.1874,0.76925,0.80378,0.18285,0.89326,0.91395,0.17008,0.95674,0.9661,0.15615,0.00077904,0.00055912,0.0089245,-0.0081813,-0.0067454,-0.034821,0.0023764,0.0017257,0.012954,-0.0086136,-0.0054754,-0.043255,0.00457,0.0033531,0.014884,-0.0093874,-0.0041961,-0.053016,3.6254e-06,2.7933e-06,8.7064e-05,-0.008233,-0.016987,-0.010155,7.4777e-05,5.7713e-05,0.00083344,-0.010574,-0.021743,-0.013006,0.00047914,0.00037968,0.0031309,-0.012092,-0.024727,-0.020581,0.0004704,0.00032672,0.011523,-0.0047629,0.0021269,-0.02851,0.0013001,0.00091029,0.015829,-0.0046611,0.0060238,-0.033898,0.0022285,0.0015626,0.016756,-0.0052905,0.0090228,-0.039861,0.00030502,0.00022961,0.063184,0.0041151,0.018115,-0.019782,0.0010083,0.00076228,0.066211,0.0061795,0.022687,-0.025559,0.0019627,0.0014793,0.063711,0.00746,0.026783,-0.032185,0.42895,74,74,40,1054,3,3,3,0.645
30,-0.00034917,0.18434,0.18411,-0.90317,0.18357,-0.95182,0.053866,-2.8063,26.557,-0.026083,2.5163,0.025454,4.593,10.456,0.19259,24.613,0.023463,0.90357,1.0524,0.73153,0.55438,0.44233,0.13696,0.16392,0.16926,0.093309,0.068013,0.051646,0.3169,0.42328,0.23667,0.0015498,0.44478,1.2927,2.2786,1.3247,6.0022,0.23043,0.16657,0.23043,0.8014,1.0252,0.378,0.59972,0.59208,60,18.483,585,6212.8,6.2714,43.7,15795,5805,1701,0.90893,0.94117,0.028903,0.020989,0.026892,0.10692,20467,11209,0.00063633,0.00032208,2,0.16211,1,0.15449,0.064131,0.26462,0.12569,0.52949,1.7686,1.3349,0.086258,0.23732,0.31364,0.25402,0.21761,0.26024,0.25692,0.19071,0.29393,0.30525,19.336,6.8586,19762,32820,32042,0.27076,0.21236,0.048608,0.47841,0.39498,0.045113,0.63123,0.54726,0.042161,0.76578,0.70468,0.040972,0.866,0.83258,0.039718,0.015712,0.014233,0.050578,0.031658,0.01751,-0.030314,0.036698,0.033558,0.056211,0.047051,0.028993,-0.036397,0.06216,0.0587,0.056888,0.058944,0.040595,-0.029144,4.6643e-06,3.2295e-06,3.1476e-05,-0.0043139,-0.016889,-0.012854,5.5334e-05,3.8289e-05,0.0001733,-0.0055877,-0.021609,-0.012985,0.00033808,0.00023529,0.00062079,-0.0065642,-0.024525,-0.020582,0.014761,0.013579,0.1016,0.046571,0.03362,-0.024892,0.034255,0.031861,0.1172,0.070141,0.050532,-0.028524,0.057624,0.055542,0.12175,0.089043,0.066755,-0.018127,0.00094644,0.0006507,0.055092,0.010631,0.029691,-0.034404,0.0032908,0.002296,0.060724,0.016415,0.039936,-0.042704,0.0063813,0.0044682,0.058207,0.020239,0.049198,-0.050811,0.44827,74,74,40,1054,3,3,3,0.645
30,-0.010569,0.61153,0.59557,-0.6355,0.59521,-0.65114,0.024611,-0.23488,9.22,-0.1207,3.2301,0.0015976,8.9673,10.499,0.72815,19.447,0.018557,0.63555,3.6263,1.7383,1.3744,0.95698,0.03848,0.059193,0.11211,0.15024,0.056435,0.09056,0.49299,0.0055952,0.046067,0.068888,0.01384,1.3204,0.049619,0.030144,1.5346,0.34992,0.24694,0.34992,1.1311,1.5549,0.48616,1.1831,0.64121,28,241.79,6334,1.4213e+06,4.9988,26.005,1.7102e+05,2916,2430,0.89264,0.91232,0.34854,0.28229,0.20338,2.6236,90229,39721,0.0011931,0.00060103,0,0.11822,0,0.068476,0.00041191,0.035912,0.0014336,0.047295,0.045875,0.75189,0.23921,0.23089,0.33646,0.2582,0.22937,0.34781,0.2469,0.2224,0.36031,0.26197,45.494,6.9714,24692,1.19e+05,1.1841e+05,0.19068,0.16267,0.13618,0.42923,0.38273,0.16103,0.60682,0.5894,0.16125,0.74322,0.75729,0.1582,0.84718,0.87194,0.15458,4.5159e-05,2.4958e-05,0.00057835,-0.012234,-0.010019,-0.010632,0.00016227,9.6979e-05,0.00098881,-0.015843,-0.011397,-0.013117,0.0006306,0.00047282,0.002296,-0.018767,-0.012028,-0.018913,3.9095e-08,2.4297e-08,1.0496e-06,-0.0087462,-0.014865,-0.010992,2.6424e-05,2.1767e-05,0.00032925,-0.011412,-0.019206,-0.012765,0.00039043,0.00033981,0.0028522,-0.013091,-0.021962,-0.013078,0,0,0,-0.0083073,-0.001813,0,1.7422e-07,9.4155e-08,2.3714e-06,-0.01072,-0.0013879,-0.010102,1.0309e-05,5.5717e-06,8.6655e-05,-0.01303,-0.0013371,-0.010106,4.512e-05,2.4934e-05,0.010449,-0.0025753,0.0074015,-0.010625,0.00013567,7.5118e-05,0.0099597,-0.0036274,0.010581,-0.012197,0.00022985,0.00012744,0.0083412,-0.0050305,0.013646,-0.01388,0.45842,74,74,40,1054,3,3,3,0.645
30,-0.0023582,0.46222,0.46041,-0.73427,0.45988,-0.75915,0.033888,-1.2364,21.368,-0.0092312,2.5137,0.025372,8.1486,11.175,0.5307,28.072,0.026786,0.73436,1.8733,1.2917,0.92208,0.70536,0.078609,0.11089,0.146,0.09003,0.085518,0.067388,0.42157,0.26841,0.17695,0.013009,0.11893,0.088595,0.24943,0.063166,0.97848,0.24811,0.22326,0.24811,0.72656,0.8891,0.32801,1.1001,0.042917,56,38.036,1170,34822,5.2336,29.367,31590,21897,2187,0.90565,0.93491,0.11801,0.094003,0.015987,0.44247,19553,10448,0.00089163,0.00034502,2,0.21199,0,0.089403,0.065556,0.36887,0.091656,0.54173,1.5781,1.1815,0.036723,0.24939,0.31281,0.23351,0.29306,0.27684,0.15706,0.26988,0.29563,0.1744,16.48,6.3047,32366,82296,81727,0.31999,0.30177,0.092147,0.59165,0.58874,0.089495,0.73007,0.76004,0.07822,0.85399,0.88769,0.073293,0.92544,0.94783,0.068084,0.02082,0.026184,0.10751,0.05581,0.043937,0.070546,0.044674,0.059427,0.10976,0.074956,0.065544,0.11648,0.072492,0.10177,0.10642,0.089391,0.086088,0.17397,0,0,0,-0.0054985,-0.014708,0,1.7944e-05,1.1377e-05,9.0148e-05,-0.0071977,-0.018885,-0.02095,0.00039396,0.00026133,0.0011604,-0.0082226,-0.021636,-0.026254,0.019806,0.025272,0.21869,0.081131,0.068454,0.073295,0.042214,0.057448,0.23167,0.11132,0.10119,0.12336,0.067882,0.098097,0.23006,0.13465,0.13198,0.18448,0.0010134,0.00091226,0.094625,0.014622,0.032564,-0.0080612,0.0035248,0.0033312,0.10433,0.022558,0.044372,-0.006026,0.0072458,0.0073916,0.10602,0.029753,0.056915,0.0028724,0.54643,74,74,40,1054,3,3,3,0.645
30,-0.0054647,0.51991,0.52788,-0.68674,0.49924,-0.52678,-0.23293,-0.2619,8.2253,0.050082,3.057,0.0074593,3.8557,4.8713,0.62531,8.9337,0.0085245,0.68695,1.9218,1.3114,1.0435,0.82003,0.10752,0.10228,0.1254,0.091364,0.057311,0.060736,0.45539,0.38885,0.087582,0.01654,0.19124,1.2849,0.63751,0.069915,2.6765,0.37114,0.26527,0.37114,0.63184,0.76056,0.32514,1.0535,0.44792,41,104.56,3101,2.4629e+05,5.5854,33.652,83727,23517,2268,0.90276,0.92864,0.18723,0.13851,0.093268,0.53343,33747,18805,0.0012912,0.00056438,0,0.069626,0,0.068289,0.01368,0.048853,0.015061,0.076527,0.32276,0.99972,1.4675,0.26472,0.31405,0.22504,0.31118,0.27908,0.16173,0.32328,0.28966,0.15066,21.737,6.0761,17617,46219,45497,0.29728,0.29128,0.14453,0.57636,0.60423,0.14719,0.7246,0.7545,0.13107,0.86076,0.88567,0.12472,0.93805,0.95191,0.11651,8.2747e-05,5.8823e-05,0.00072138,-0.0098896,-0.009159,-0.014341,0.00039825,0.00029002,0.001652,-0.012413,-0.0097165,-0.01955,0.0013734,0.0010837,0.003404,-0.014036,-0.0092024,-0.027435,5.7432e-08,5.2767e-08,1.0496e-06,-0.0071773,-0.016704,-0.0035255,3.1581e-05,2.8638e-05,0.00026787,-0.0093468,-0.021536,-0.0088923,0.00054693,0.000499,0.0027197,-0.010333,-0.024228,-0.013405,2.4125e-05,1.702e-05,0.00044973,-0.0066799,0.00091839,-0.01188,0.00013591,9.4715e-05,0.0012592,-0.0083016,0.0026391,-0.013896,0.00035496,0.00024484,0.002031,-0.0097458,0.0040978,-0.017066,5.8564e-05,4.1751e-05,0.0092321,-0.001819,0.0084641,-0.010795,0.00023077,0.00016667,0.011532,-0.002067,0.012674,-0.013738,0.00047154,0.00033984,0.011648,-0.0026481,0.016154,-0.01739,0.4521,74,74,40,1054,3,3,3,0.645
30,-0.079813,1.0332,0.99833,0.026782,0.94263,0.033108,0.23622,0.93746,5.2617,0.21696,3.1672,0.0009449,5.3616,3.7411,2.05,4.7607,0.0045384,-0.026803,4.8106,3.3317,2.7641,2.3615,0.038662,0.054287,0.072091,0.05926,0.035108,0.03209,0.7085,0.0145,0.0080986,0.3855,0.69444,3.4093,3.1873,0.10899,7.8081,0.033035,0.12004,0.12004,0.49558,0.55719,0.23405,4.7108,10.339,67,51.075,2590,99526,7.8443,63.314,69930,6615,3267,0.90272,0.92842,0.10562,0.093104,0.15797,1.3843,31907,16011,0.0011659,0.00042234,2,0.28463,0,0.071165,0.046909,0.40442,0.056814,0.47866,1.5514,2.3803,1.1007,0.26197,0.30052,0.2311,0.29433,0.33786,0.16766,0.29621,0.27028,0.16798,29.858,6.2397,63888,3.9183e+05,3.916e+05,0.13312,0.10546,0.057455,0.28512,0.26954,0.064641,0.43505,0.47232,0.069862,0.56564,0.63059,0.07276,0.67895,0.73172,0.074864,0.0037528,0.0027002,0.029044,0.0044736,-0.0011334,-0.020359,0.0070139,0.0049373,0.025829,0.0038221,-0.0012721,-0.025804,0.010246,0.007149,0.022545,0.0021396,-0.0013709,-0.030697,2.699e-06,1.7008e-06,4.3789e-05,-0.0067392,-0.011296,-0.0051626,7.2194e-05,4.4689e-05,0.00054361,-0.008658,-0.014512,-0.0083092,0.00050254,0.00030785,0.0022185,-0.0098325,-0.016547,-0.014722,0.0028276,0.0020786,0.046794,0.0087282,0.0051837,-0.015651,0.0043174,0.003122,0.035513,0.0065526,0.0051603,-0.017621,0.0050652,0.0036405,0.025729,0.0030058,0.0042872,-0.01847,0.00092245,0.00061987,0.12909,0.016087,0.015939,-0.015336,0.0026244,0.0017706,0.11643,0.019603,0.020427,-0.019623,0.0046785,0.0032007,0.1026,0.021753,0.024657,-0.023007,0.50378,74,74,40,1054,3,3,3,0.645
30,-0.013173,0.86145,0.84969,-0.38665,0.8474,-0.36655,-0.05199,-5.8157,108.17,-0.085074,3.0164,0.012364,17.561,15.848,1.2255,36.048,0.034397,0.38666,3.3343,2.2917,1.7977,1.4238,0.034021,0.082248,0.10859,0.073634,0.054053,0.055555,0.5919,0.0031766,0.099333,0.00014989,0.14943,0.5551,0.29032,0.054975,1.1525,0.21816,0.46237,0.46237,0.80107,0.83212,0.35594,1.6291,1.137,49,131.86,5905,7.0623e+05,6.7714,46.909,1.5944e+05,3996,2781,0.89172,0.91424,0.39324,0.30925,0.20571,0.8004,96766,50022,0.0008188,0.00045839,0,0.10382,0,0.066998,0.0060447,0.012912,0.0049759,0.02141,0.61789,2.1875,1.4358,0.22031,0.34822,0.29105,0.20816,0.36463,0.31555,0.19829,0.38447,0.33537,58.484,7.8583,21029,85673,85032,0.11649,0.083854,0.083996,0.29046,0.23045,0.11001,0.49421,0.45769,0.13259,0.66929,0.65729,0.14383,0.80204,0.79723,0.14775,0.0022532,0.0015505,0.029133,-0.0015055,-0.0013572,-0.049481,0.0055809,0.0038925,0.034335,0.0006037,0.0012507,-0.064901,0.01011,0.0071029,0.037164,0.0024783,0.0038868,-0.080793,6.5738e-07,4.7312e-07,1.7818e-05,-0.0087851,-0.015881,-0.0075611,3.0595e-05,2.1125e-05,0.00038488,-0.011451,-0.020412,-0.01573,0.0003586,0.00024854,0.0026448,-0.013258,-0.02327,-0.032012,0.0020131,0.0013967,0.055657,0.0056821,0.0090429,-0.045288,0.0048496,0.0034177,0.066643,0.010907,0.015026,-0.058642,0.0085809,0.0060919,0.07282,0.01574,0.020299,-0.072077,0.00023942,0.00015331,0.055977,0.0026216,0.016954,-0.024312,0.00086826,0.00056861,0.064353,0.0049374,0.021689,-0.031975,0.0017377,0.0011502,0.063663,0.006253,0.026109,-0.03923,0.48812,74,74,40,1054,3,3,3,0.645
30,-0.0023528,0.50195,0.50233,-0.70512,0.49609,-0.62651,-0.11148,2.2031,15.683,0.13621,3.1357,0.0059238,8.5041,11.076,0.58842,17.693,0.016883,0.70539,2.0311,1.3406,1.0139,0.78914,0.07022,0.10621,0.14513,0.098533,0.070188,0.063149,0.44658,0.20302,0.15544,0.012,0.056335,0.3624,0.36555,0.037287,1.192,0.46521,0.38269,0.46521,1.1063,1.1944,0.40203,1.0979,0.60943,37,154.27,5051,6.8569e+05,5.7857,34.656,1.3638e+05,8289,6264,0.89973,0.92599,0.42048,0.30945,0.2631,0.92016,48023,32463,0.00068414,0.00038907,0,0.088214,0,0.089373,0.00015224,0.061781,0.007624,0.091415,0.68286,0.43985,0.87024,0.27244,0.34634,0.25293,0.32727,0.3999,0.20962,0.3364,0.40888,0.20143,46.76,6.8291,14812,38243,37121,0.055899,0.04516,0.034195,0.23871,0.21042,0.076702,0.51381,0.50393,0.11694,0.71108,0.71722,0.12964,0.82987,0.84098,0.12969,0.0021446,0.0017769,0.023524,-0.0018707,-0.0045138,-0.036449,0.0050245,0.0041881,0.026225,-0.0010042,-0.0020172,-0.047053,0.0086674,0.0071896,0.027029,-0.00070691,0.00080133,-0.059797,4.0471e-07,2.706e-07,9.3062e-06,-0.0080724,-0.017595,-0.01382,2.2941e-05,1.5386e-05,0.00024483,-0.01055,-0.02263,-0.019053,0.00015633,0.0001069,0.00097816,-0.012776,-0.026114,-0.026056,0.0014719,0.0012468,0.034523,0.0017546,0.0040222,-0.025084,0.0031,0.0026893,0.036141,0.0028344,0.0074381,-0.028678,0.0053737,0.0046523,0.038687,0.0045472,0.010962,-0.037019,0.00067228,0.0005298,0.13335,0.013071,0.025336,-0.031044,0.0019774,0.0015357,0.12434,0.016474,0.034243,-0.041828,0.0034327,0.0026349,0.10669,0.017423,0.041907,-0.051617,0.45561,74,74,40,1054,3,3,3,0.645
30,-0.0029038,0.288,0.28632,-0.84463,0.28027,-0.72183,-0.14539,-2.4319,38.286,-0.01383,2.6018,0.02807,6.4806,11.701,0.30616,25.185,0.024032,0.84645,1.3852,0.86672,0.71402,0.6008,0.12041,0.15561,0.12852,0.1194,0.048931,0.042311,0.38482,0.40911,0.2469,0.041042,0.032715,2.6913,3.2613,0.38612,7.0685,0.20668,0.18157,0.20668,0.77462,1.2166,0.4051,0.73234,0.38431,60,17.2,640,6724.8,7.1295,53.754,17280,2025,1701,0.90735,0.94041,0.092366,0.067846,0.015736,0.54045,19622,11190,0.00062942,0.00030306,2,0.16556,1,0.15244,0.055226,0.25691,0.10692,0.5334,1.7098,1.4599,0.14928,0.25241,0.30809,0.26266,0.25887,0.30044,0.26441,0.22849,0.29809,0.33532,20.925,7.0918,23278,39071,38347,0.17406,0.14042,0.031213,0.43237,0.37336,0.040727,0.6031,0.53951,0.040238,0.71397,0.6584,0.038157,0.801,0.75034,0.036696,0.0046774,0.0033116,0.015041,0.0050915,0.0040981,-0.048872,0.010914,0.0078253,0.016698,0.0083053,0.0091506,-0.06249,0.019668,0.014611,0.01798,0.011814,0.015362,-0.072664,3.3566e-07,2.4512e-07,2.2626e-06,-0.0043269,-0.01671,-0.010876,4.306e-05,3.2762e-05,0.00013471,-0.0056111,-0.021424,-0.014361,0.00043339,0.00031129,0.00079491,-0.0064099,-0.024072,-0.024213,0.0041345,0.0029557,0.028428,0.010078,0.01335,-0.043297,0.0090408,0.0065772,0.030897,0.014597,0.019905,-0.053753,0.016248,0.012323,0.03429,0.020451,0.027397,-0.062332,0.00054259,0.00035571,0.031549,0.0052933,0.033406,-0.029119,0.0018694,0.0012436,0.034458,0.0082067,0.04252,-0.03331,0.003403,0.0022741,0.031006,0.009229,0.051053,-0.03724,0.43363,74,74,40,1054,3,3,3,0.645
30,-0.0040522,0.46507,0.46318,-0.73238,0.45778,-0.81143,0.10793,-1.3013,35.463,0.0042664,2.4294,0.03493,8.3299,11.387,0.53414,31.427,0.029988,0.7326,2.1503,1.2246,0.92749,0.69587,0.054685,0.099984,0.15301,0.13399,0.070273,0.071872,0.41619,0.094611,0.1224,0.031811,0.013149,0.33834,0.17293,0.070404,0.84364,0.1633,0.24434,0.24434,0.5451,0.68489,0.27861,1.0867,0.042208,43,52.163,1779,72457,6.2339,40.247,48033,3240,2727,0.9054,0.93458,0.11807,0.098026,0.0048154,0.37083,34504,12174,0.0010102,0.0004029,2,0.2773,0,0.14261,0.096786,0.46062,0.12913,0.61912,2.2796,2.5699,0.98185,0.22841,0.29972,0.29051,0.23664,0.27585,0.26926,0.17536,0.25589,0.40768,28.114,7.8438,39898,1.268e+05,1.2626e+05,0.24497,0.17768,0.070179,0.47224,0.35326,0.071063,0.62387,0.48483,0.066497,0.73699,0.59928,0.062924,0.84108,0.71438,0.061557,0.0070058,0.0046964,0.035989,0.01355,0.0043837,-0.0474,0.016937,0.011492,0.0414,0.021985,0.010247,-0.063849,0.031953,0.022243,0.046666,0.032223,0.017416,-0.07894,0,0,0,-0.005484,-0.013495,0,1.9569e-05,1.4735e-05,9.7806e-05,-0.0071743,-0.017396,-0.0068791,0.00024287,0.00016701,0.00071166,-0.0085034,-0.020024,-0.014856,0.006046,0.004066,0.066411,0.021082,0.013087,-0.043113,0.014496,0.0099272,0.079145,0.033712,0.021067,-0.058001,0.027749,0.019594,0.093557,0.050054,0.030927,-0.071436,0.00095985,0.00063047,0.089161,0.013687,0.024002,-0.019951,0.002423,0.0015502,0.071349,0.014445,0.030987,-0.026104,0.0040294,0.0025203,0.058651,0.014625,0.036923,-0.031931,0.48612,74,74,40,1054,3,3,3,0.645
30,-0.0034251,0.31433,0.31047,-0.8302,0.31041,-0.84132,0.013393,-1.6925,16.757,-0.043797,2.9859,0.012879,5.5142,9.4646,0.3388,14.887,0.014205,0.8304,1.3838,1.0542,0.78849,0.62894,0.096114,0.1492,0.16522,0.068353,0.073431,0.055613,0.39207,0.30494,0.24202,0.015777,0.96762,0.52569,1.1438,0.28193,3.4817,0.31667,0.33258,0.33258,0.72863,1.3054,0.38167,0.75509,0.22487,57,85.105,2855,1.8566e+05,5.5671,33.606,77085,44658,3861,0.90466,0.9336,0.27177,0.18835,0.20761,0.70573,29114,18918,0.0014645,0.00058669,0,0.051957,0,0.050838,0.0099674,0.0063283,0.012987,0.0054371,0.69141,0.61132,1.1891,0.29791,0.30592,0.20361,0.406,0.28014,0.094086,0.4334,0.27082,0.081355,16.512,5.4975,7511.9,18583,16770,0.25154,0.25533,0.14165,0.66584,0.7024,0.19695,0.85755,0.87946,0.17967,0.94069,0.95185,0.15787,0.97158,0.97741,0.13977,0.00031967,0.00026629,0.0032279,-0.0096435,-0.0073777,-0.017024,0.0010462,0.00088611,0.0050268,-0.011644,-0.007241,-0.021433,0.0027715,0.0023832,0.0079561,-0.012362,-0.0055574,-0.0338,7.5707e-06,6.3599e-06,0.00016025,-0.0076907,-0.018175,-0.0089797,9.6462e-05,7.971e-05,0.00094766,-0.009826,-0.023208,-0.014135,0.00065974,0.00056535,0.0037999,-0.010822,-0.025939,-0.023212,6.0055e-07,5.4408e-07,1.2967e-05,-0.0073464,0.0029335,-0.0054828,7.1116e-05,6.0328e-05,0.00076321,-0.0092056,0.0047735,-0.018866,0.00063856,0.00054526,0.0042319,-0.0096676,0.0070611,-0.02588,0.0003115,0.00025938,0.056876,0.0040096,0.01597,-0.016635,0.00087866,0.00074607,0.050858,0.0044542,0.022309,-0.018024,0.0014737,0.001273,0.042166,0.0037624,0.027969,-0.019792,0.56076,74,74,40,1054,3,3,3,0.645
30,-0.011523,0.83954,0.84721,-0.38985,0.8058,-0.30366,-0.22108,1.3449,9.6676,0.092512,3.1455,0.0047948,7.5183,6.8034,1.2189,10.677,0.010188,0.3899,3.2733,2.2785,1.7323,1.3638,0.0758,0.063434,0.089481,0.071494,0.061403,0.05744,0.58095,0.29719,0.0088479,0.084332,0.28834,0.42451,0.35023,0.032297,1.4857,0.33883,0.29435,0.33883,0.36988,0.58282,0.28972,1.727,1.3774,32,267.97,8282,2.1321e+06,5.3852,30.012,2.2361e+05,3483,2349,0.89414,0.91775,0.40882,0.30848,0.24737,0.80158,58313,36036,0.0010084,0.00055219,0,0.066005,0,0.055921,0.0053292,0.027705,0.0086841,0.028673,0.57921,0.019281,0.38498,0.23133,0.33957,0.2946,0.23257,0.36031,0.31404,0.21885,0.36396,0.3421,49.092,7.9542,15671,63382,62448,0.10077,0.07843,0.091352,0.26393,0.22434,0.12568,0.43673,0.39958,0.14731,0.60877,0.58018,0.16448,0.76162,0.74492,0.17639,0.0034395,0.0035499,0.055913,0.0048332,0.0032116,0.007572,0.0088715,0.0090205,0.06862,0.011982,0.0097871,0.0054694,0.016645,0.016643,0.076926,0.019358,0.017099,-6.6665e-05,8.2209e-06,5.8468e-06,0.00028015,-0.0098328,-0.016949,-0.017549,0.00012558,9.0334e-05,0.0019862,-0.012425,-0.021628,-0.021348,0.00066044,0.00049052,0.0061239,-0.013841,-0.024444,-0.030359,0.0019677,0.0021953,0.068398,0.0060433,0.010024,0.019184,0.0045518,0.0048959,0.078641,0.010784,0.01505,0.017205,0.0082353,0.0084507,0.087864,0.016417,0.020258,0.0075857,0.0014636,0.0013487,0.43021,0.039919,0.042229,-0.013837,0.004385,0.0041698,0.40861,0.051964,0.056446,-0.011548,0.0084525,0.0082269,0.38934,0.063761,0.071447,-0.0080519,0.52582,74,74,40,1054,3,3,3,0.645
30,-0.0010743,0.26301,0.26307,-0.8583,0.25998,-0.95133,0.10839,-0.89181,7.6844,-0.035328,3.1098,0.0057946,3.6577,6.868,0.2831,10.828,0.010332,0.85831,1.3722,0.83743,0.64618,0.47961,0.11006,0.11576,0.18481,0.12501,0.064423,0.069677,0.33026,0.35535,0.11499,0.036394,0.021581,1.0563,0.48645,0.78132,2.8524,0.34592,0.3089,0.34592,1.0232,1.3727,0.37632,0.70656,0.19756,57,90.333,4238,3.1409e+05,7.2427,53.952,1.1443e+05,8721,7182,0.90345,0.93333,0.32575,0.22875,0.23034,0.81113,53118,29054,0.0012385,0.00050857,0,0.06808,0,0.066235,0.0025652,0.014281,0.00077558,0.022773,0.78883,0.37384,0.76077,0.26331,0.34097,0.23813,0.3087,0.37102,0.18645,0.31987,0.38064,0.18084,38.072,6.4294,12207,30694,29463,0.1386,0.12277,0.080915,0.40967,0.40442,0.12563,0.63681,0.64153,0.13832,0.80436,0.8144,0.13995,0.9181,0.92582,0.13693,0.0021883,0.002042,0.022907,-0.0016348,-0.0029349,-0.014172,0.0047574,0.0044006,0.023697,-0.0017109,-0.00098369,-0.020551,0.0076976,0.0070311,0.022909,-0.0026479,0.0012535,-0.028285,0,0,0,-0.0078833,-0.018125,0,3.591e-06,2.5706e-06,3.6574e-05,-0.010376,-0.023295,-0.016674,8.0275e-05,6.1318e-05,0.00047934,-0.012692,-0.026883,-0.021876,0.0021883,0.002042,0.048982,0.006191,0.010028,-0.014172,0.0047543,0.0043983,0.052896,0.0094001,0.015817,-0.020504,0.0075831,0.0069411,0.052101,0.011106,0.020447,-0.027258,0,0,0,-0.0034062,0.012871,0,1.8438e-06,1.4023e-06,0.00011064,-0.0046756,0.018061,-0.011835,6.8745e-05,5.3582e-05,0.0020391,-0.0056178,0.023863,-0.023458,0.4407,74,74,40,1054,3,3,3,0.645
30,-0.00072287,0.14386,0.14309,-0.92562,0.14238,-0.99083,0.07045,-2.0599,17.779,-0.020069,2.6044,0.025025,5.5651,14.432,0.1484,24.36,0.023244,0.92572,0.98845,0.66363,0.49226,0.39625,0.18357,0.1743,0.13782,0.099613,0.070033,0.046748,0.28791,0.53054,0.24346,0.066957,0.43888,1.3423,3.7803,2.2777,8.6801,0.27684,0.45008,0.45008,1.3979,1.49,0.60055,0.46027,0.66542,60,25.783,832,11873,6.6406,48.578,22464,4239,3969,0.90676,0.93898,0.040768,0.028163,0.012202,0.21037,17132,11326,0.00066539,0.00035521,0,0.12733,0,0.14936,0.042701,0.20718,0.084384,0.46157,1.1415,2.2262,1.6445,0.25396,0.31212,0.23733,0.2814,0.29026,0.17593,0.26245,0.28364,0.2103,16.423,6.4078,11210,18408,17254,0.22303,0.21128,0.05507,0.51973,0.48144,0.067408,0.69646,0.65102,0.063982,0.80596,0.76811,0.05931,0.88728,0.87248,0.05597,0.0031462,0.0025532,0.01393,0.0016538,0.0013142,-0.033458,0.0060617,0.0049301,0.01277,0.0011979,0.0047157,-0.04206,0.0099309,0.0083295,0.012501,0.0012006,0.0084415,-0.046271,5.0151e-06,5.1682e-06,4.6548e-05,-0.0050657,-0.017885,0.0026499,0.00018098,0.00018741,0.00077959,-0.0062434,-0.022728,0.0034107,0.00083399,0.00087319,0.0021063,-0.0067895,-0.025423,0.0056921,0.0026806,0.0022005,0.025379,0.0059805,0.011413,-0.028364,0.0045926,0.0037586,0.021611,0.0056469,0.015706,-0.034367,0.0067782,0.0056612,0.019697,0.0055989,0.019126,-0.037538,0.00046052,0.00034753,0.03687,0.0049477,0.029963,-0.021367,0.0012881,0.00098405,0.032692,0.0057038,0.038778,-0.0263,0.0023186,0.0017952,0.029089,0.0061401,0.047582,-0.031727,0.46407,74,74,40,1054,3,3,3,0.645
30,-0.0035425,0.37675,0.37798,-0.78846,0.36554,-0.64545,-0.18138,-1.3001,15.584,0.0049793,3.0237,0.010552,8.0945,12.448,0.42202,22.577,0.021543,0.78872,1.6718,1.0975,0.79696,0.6353,0.12166,0.10862,0.13396,0.10413,0.081007,0.055897,0.39472,0.44099,0.11342,0.00098829,0.064625,0.25222,0.93658,0.20826,2.0171,0.33154,0.34565,0.34565,0.85732,0.95154,0.45382,0.88768,0.27889,65,59.769,1934,72744,5.8008,37.968,52218,25866,14418,0.90543,0.93582,0.25797,0.17689,0.2046,0.66386,29316,16181,0.0011592,0.00049263,0,0.045574,0,0.04369,0.015434,0.032884,0.016759,0.051422,0.92439,0.18961,0.86187,0.26787,0.33153,0.20535,0.3294,0.3355,0.097744,0.33608,0.34279,0.089854,14.389,5.5443,8636,19303,17617,0.24731,0.24195,0.12097,0.66186,0.68398,0.17006,0.85938,0.87679,0.1564,0.93111,0.94041,0.13574,0.96932,0.97333,0.12113,0.0042005,0.0039122,0.036845,0.0065611,0.00095553,-0.022312,0.0097806,0.0092158,0.040821,0.010986,0.006357,-0.024103,0.016629,0.015832,0.041469,0.014051,0.012322,-0.024803,1.394e-06,1.0084e-06,2.5633e-05,-0.0071919,-0.018391,-0.017011,7.0002e-05,5.25e-05,0.0005974,-0.0092375,-0.023642,-0.022666,0.00048477,0.00039562,0.0024254,-0.010528,-0.026771,-0.028204,0.0023484,0.0021782,0.044046,0.0065687,0.0083798,-0.018266,0.005942,0.0056069,0.055393,0.012935,0.016121,-0.018991,0.010817,0.010368,0.062276,0.019057,0.024319,-0.017663,0.0018507,0.001733,0.29354,0.037537,0.041547,-0.014274,0.0044315,0.0041861,0.22281,0.03824,0.049344,-0.015336,0.0068791,0.0065693,0.17097,0.036708,0.056237,-0.014439,0.56901,74,74,40,1054,3,3,3,0.645
30,-0.0018367,0.63085,0.62912,-0.60851,0.62543,-0.56192,-0.076562,-0.02068,9.5001,0.10702,3.237,0.00087915,12.393,14,0.78217,23.534,0.022456,0.60853,2.9693,1.807,1.3766,1.0386,0.080226,0.061334,0.10362,0.10526,0.065097,0.070409,0.51405,0.29448,0.0023715,0.043014,0.015532,0.45751,0.16073,7.9808e-05,0.97371,0.2473,0.19268,0.2473,0.59483,0.89977,0.35279,1.2853,0.83976,58,78.414,3814,2.4896e+05,7.3492,55.338,1.0298e+05,6831,2916,0.90352,0.93093,0.37621,0.27658,0.25495,0.8508,41934,23533,0.0014823,0.00059855,0,0.089715,0,0.058073,0.0079316,0.055065,0.0064898,0.083499,0.038236,0.66189,0.52342,0.26775,0.33138,0.23219,0.31219,0.34696,0.17089,0.31323,0.34552,0.18155,38.673,6.2692,17880,46278,45386,0.19012,0.17942,0.10219,0.53209,0.53778,0.15022,0.76161,0.77156,0.1523,0.89088,0.90106,0.1427,0.95672,0.96391,0.13137,0.0040562,0.0037167,0.039093,0.0062792,0.0029117,-0.023488,0.011724,0.011111,0.053765,0.016624,0.012425,-0.020744,0.023453,0.022821,0.064259,0.027948,0.023372,-0.01396,2.2486e-05,1.7696e-05,0.0004543,-0.0074168,-0.017331,-0.017006,0.00025317,0.00020556,0.0023739,-0.0090011,-0.02194,-0.019636,0.0013462,0.0011943,0.0074004,-0.0086727,-0.023951,-0.019766,0.0024992,0.0023075,0.051503,0.0077967,0.010266,-0.017649,0.0077064,0.0072301,0.078937,0.020355,0.020988,-0.020247,0.015448,0.01466,0.097717,0.03339,0.032033,-0.021253,0.0015345,0.0013915,0.26743,0.032104,0.041075,-0.016004,0.0044106,0.0042391,0.24367,0.039919,0.055187,-0.0093749,0.0087203,0.0088079,0.23814,0.050392,0.070949,0.0031972,0.44492,74,74,40,1054,3,3,3,0.645
30,-0.00057107,0.29472,0.2937,-0.84025,0.29368,-0.83219,-0.009594,-0.38135,4.205,-0.050218,3.2476,0.00096047,5.1907,9.1799,0.31912,14.058,0.013414,0.84028,1.6825,1.082,0.75997,0.58213,0.13759,0.10217,0.12226,0.10937,0.089392,0.064966,0.37425,0.45804,0.059425,0.056127,0.086919,0.22219,0.67372,0.45702,2.0134,0.39736,0.16578,0.39736,0.57117,0.76559,0.33429,0.75144,0.24523,46,80.283,2232,1.1548e+05,5.7426,36.048,60264,18981,5400,0.90538,0.93645,0.10268,0.069884,0.057471,0.43128,25653,16335,0.0008925,0.0004472,0,0.062813,0,0.071578,0.0080455,0.011247,0.015392,0.0028028,0.35736,0.16587,0.44226,0.23436,0.32262,0.25014,0.2403,0.32233,0.19359,0.23842,0.32377,0.19029,19.049,6.7539,10380,22534,20997,0.21961,0.22371,0.093936,0.52359,0.53482,0.11764,0.72089,0.73129,0.11472,0.84964,0.86005,0.10831,0.90541,0.91478,0.098938,0.0022879,0.0021262,0.017548,-0.0010216,-0.0036292,-0.016984,0.0065004,0.006187,0.023723,0.0026067,0.0012647,-0.016823,0.013366,0.013103,0.029145,0.0075014,0.0075716,-0.0092616,1.0282e-06,9.4893e-07,1.6532e-05,-0.0067175,-0.018239,-0.0056668,8.3651e-05,9.466e-05,0.00062423,-0.0085797,-0.023398,0.016226,0.00081026,0.00094056,0.0035449,-0.0090321,-0.025993,0.035236,0.0016888,0.0016179,0.027697,0.0026175,0.0058447,-0.0082639,0.0044335,0.0043784,0.036141,0.0069197,0.012672,-0.003518,0.0087988,0.0087929,0.044293,0.0126,0.01988,-0.00025061,0.00059808,0.00050731,0.082947,0.0093605,0.025578,-0.022797,0.0021503,0.001885,0.09454,0.015265,0.034991,-0.026155,0.0044669,0.0041019,0.097078,0.020439,0.044636,-0.022234,0.50281,74,74,40,1054,3,3,3,0.645
30,-0.0037731,0.45471,0.45966,-0.73478,0.44163,-0.8803,0.19804,-2.3237,22.606,-0.047731,3.2018,0.0033652,9.0987,12.491,0.52957,19.829,0.018921,0.73492,2.3523,1.4243,1.0012,0.70363,0.071909,0.092519,0.12701,0.11531,0.088063,0.088127,0.41706,0.21787,0.090627,0.00011464,0.0029512,0.067121,0.024513,0.07005,0.47325,0.20721,0.30014,0.30014,0.92613,0.98253,0.34298,1.0005,0.50772,46,80.609,2986,1.9296e+05,6.4242,42.821,80622,7830,5022,0.90625,0.93792,0.28463,0.19331,0.22182,0.76615,28114,19228,0.00089328,0.00047812,0,0.059248,0,0.074143,0.0028689,0.017641,0.013091,0.064666,1.0683,1.4372,0.44929,0.22906,0.35179,0.25733,0.20829,0.41427,0.25116,0.19682,0.43471,0.25276,39.441,6.9479,13086,26323,24173,0.13531,0.12522,0.058052,0.33179,0.33408,0.07477,0.57322,0.58593,0.091497,0.76784,0.78041,0.098178,0.86677,0.8767,0.095002,0.0058682,0.0055571,0.045145,0.012379,0.0054643,-0.019907,0.012485,0.011889,0.0457,0.016591,0.011864,-0.022885,0.019527,0.018449,0.042707,0.018136,0.017359,-0.030955,0,0,0,-0.0067335,-0.018623,0,8.1315e-06,6.4352e-06,6.0863e-05,-0.0088475,-0.023965,-0.013999,0.00012705,0.0001009,0.00055753,-0.010725,-0.027495,-0.023925,0.0037451,0.0032989,0.061606,0.0136,0.01376,-0.035215,0.0079268,0.0070116,0.064812,0.018894,0.022078,-0.044268,0.0126,0.011194,0.063619,0.022415,0.029097,-0.050359,0.0021232,0.0022581,0.29535,0.0407,0.046455,0.015799,0.005227,0.0055517,0.2305,0.042902,0.0567,0.019711,0.0084744,0.0088434,0.18473,0.043495,0.065916,0.016248,0.41432,74,74,40,1054,3,3,3,0.645
30,-0.11369,0.91005,0.96847,0.17496,0.65555,0.27442,0.56843,-0.088196,1.9931,-0.050281,3.3349,0.0018357,4.0077,2.6132,2.3476,2.9652,0.0028294,-0.17497,6.5632,4.7411,3.9596,3.3123,0.033738,0.036419,0.046535,0.042714,0.027938,0.030806,0.78185,0.043917,0.87692,3.9214,4.3407,10.81,6.2843,0.074539,26.352,0.1102,0.15246,0.15246,0.32062,0.32981,0.16505,3.3341,5.5463,42,163.67,6567,1.0213e+06,6.2403,39.97,1.7731e+05,3348,3267,0.89058,0.90574,0.32293,0.27028,0.10121,0.64446,43652,23750,0.00097283,0.00046515,0,0.12333,0,0.062151,0.010774,0.094492,0.012032,0.106,1.0437,1.3922,0.43929,0.25802,0.34931,0.22956,0.27171,0.37105,0.20226,0.28454,0.37487,0.17807,19.302,6.1981,15852,1.0082e+05,1.0029e+05,0.10704,0.1019,0.080119,0.23187,0.22712,0.091165,0.35418,0.34744,0.098635,0.48433,0.48098,0.10804,0.6251,0.63388,0.11953,0.0021425,0.0018588,0.028756,-0.0020862,-0.0046309,-0.011799,0.0036323,0.002954,0.023197,-0.0054429,-0.0064216,-0.020212,0.0058853,0.0044907,0.022457,-0.007169,-0.0068775,-0.033315,1.1302e-06,9.176e-07,3.18e-05,-0.008953,-0.013717,-0.0034476,2.5345e-05,2.0134e-05,0.00033097,-0.011697,-0.017709,-0.0065873,0.00031566,0.00023336,0.0024167,-0.013657,-0.020415,-0.01876,0.0020159,0.0017875,0.057855,0.0058129,0.0048794,-0.0095831,0.0030318,0.0025875,0.043248,0.0028343,0.0041266,-0.013841,0.0039813,0.0032036,0.035072,0.00027047,0.0032051,-0.020888,0.00012548,7.0386e-05,0.030454,-0.00044189,0.006941,-0.017196,0.00057935,0.00034839,0.044574,0.001583,0.01145,-0.023466,0.0016254,0.0010728,0.061816,0.0055165,0.017481,-0.029408,0.71422,74,74,40,1054,3,3,3,0.645
30,-0.0018137,0.32879,0.32976,-0.81849,0.3227,-0.93832,0.1464,0.57246,4.7117,0.065418,3.2912,0.00063098,6.9435,11.543,0.36114,17.038,0.016258,0.81912,1.7908,1.09,0.77353,0.59368,0.098056,0.10283,0.14561,0.12237,0.086947,0.064803,0.37939,0.31101,0.076583,0.00021406,0.0081683,0.18376,0.59076,0.32443,1.4949,0.25356,0.31488,0.31488,1.0715,1.2102,0.4426,0.78838,0.28336,45,86.933,1763,88731,4.4263,23.512,47601,22275,16713,0.90489,0.9368,0.35196,0.24634,0.25105,0.89096,45298,23765,0.0007451,0.0003635,0,0.048457,0,0.052676,0.001307,0.022038,0.0078659,0.051264,0.35571,1.8694,1.3095,0.23976,0.36534,0.26341,0.25229,0.45745,0.23779,0.25547,0.46937,0.22856,40.625,7.112,12052,25879,23992,0.044999,0.03768,0.020974,0.2412,0.23109,0.059054,0.52165,0.53187,0.090462,0.7219,0.74387,0.10028,0.83962,0.86108,0.09998,0.0010737,0.00095676,0.0089743,-0.0058088,-0.0027391,-0.020932,0.0036646,0.0033162,0.014573,-0.004188,0.002019,-0.027951,0.0087904,0.0080002,0.020887,-0.00039369,0.0082456,-0.037911,0,0,0,-0.0070245,-0.018274,0,2.5853e-06,1.9052e-06,2.1022e-05,-0.0092494,-0.023466,-0.026481,7.6304e-05,5.642e-05,0.00036377,-0.011319,-0.027009,-0.029197,0.00022576,0.00018371,0.0040347,-0.0054143,0.0049016,-0.022764,0.0012578,0.0010644,0.011173,-0.0041161,0.010277,-0.033232,0.0040434,0.0035675,0.02218,0.00037885,0.017013,-0.037139,0.00084798,0.00077306,0.12816,0.015135,0.034222,-0.014969,0.0025806,0.0023945,0.12363,0.019978,0.044843,-0.016627,0.0051821,0.0048278,0.12273,0.025642,0.056275,-0.020721,0.41461,74,74,40,1054,3,3,3,0.645
30,-0.0016305,0.32857,0.32706,-0.82014,0.32481,-0.88809,0.082847,-1.7091,11.404,-0.07691,3.2007,0.0029429,4.7764,7.9659,0.35884,12.788,0.012203,0.82036,1.7442,1.0024,0.728,0.57449,0.083001,0.11399,0.16342,0.13585,0.079799,0.056778,0.36716,0.25015,0.14445,0.01653,0.00028402,0.34051,0.98242,0.37335,2.1077,0.28594,0.34304,0.34304,1.0083,1.0531,0.41615,0.78853,0.32053,69,55.971,3087,1.3815e+05,7.9635,65.212,83349,7857,6156,0.90535,0.93585,0.15171,0.10343,0.12207,0.45057,23471,14334,0.0011155,0.0005008,0,0.047514,0,0.064454,0.005183,0.04592,0.0058201,0.049969,0.65886,0.16022,0.77102,0.2728,0.31324,0.21645,0.34361,0.30006,0.10282,0.35705,0.30036,0.092939,13.508,5.8443,8734.5,19490,17971,0.2826,0.28106,0.13032,0.6385,0.6707,0.15466,0.79823,0.82018,0.13695,0.87691,0.89122,0.12052,0.92197,0.93182,0.10861,0.0033322,0.0040238,0.027553,0.002994,0.0037967,0.057531,0.0082867,0.00941,0.032604,0.0070386,0.0087715,0.05275,0.016044,0.01757,0.037716,0.012586,0.015267,0.048966,2.2953e-07,1.7265e-07,3.9787e-06,-0.0069848,-0.018257,-0.017307,3.4995e-05,3.2132e-05,0.00028153,-0.0090855,-0.023429,-0.01217,0.00053764,0.00051605,0.0025358,-0.010081,-0.026381,-0.0088173,0.0026106,0.0033935,0.046158,0.0078262,0.014839,0.069334,0.0060441,0.0074546,0.053116,0.012913,0.021142,0.076195,0.011477,0.013542,0.062287,0.020255,0.028494,0.077488,0.00072135,0.00063018,0.10786,0.012354,0.031791,-0.021883,0.0022213,0.001933,0.10529,0.016524,0.041308,-0.027124,0.0041676,0.0036161,0.097646,0.019455,0.051109,-0.03379,0.57938,74,74,40,1054,3,3,3,0.645
30,-0.013479,0.6434,0.64545,-0.59493,0.62084,-0.47875,-0.19528,-0.7929,11.382,0.032755,3.193,0.0032532,10.566,11.736,0.80909,19.493,0.018601,0.59501,2.3201,1.5872,1.3159,1.0602,0.08701,0.076567,0.1151,0.088076,0.046728,0.055333,0.53118,0.33373,0.029499,0.0042651,0.11576,1.7249,0.54753,0.0010286,2.7568,0.18202,0.17156,0.18202,0.64434,1.0539,0.35268,1.3535,0.88184,28,162.32,4255,6.4016e+05,4.9945,25.977,1.1488e+05,3078,2160,0.90415,0.9328,0.3282,0.22955,0.21499,0.87049,46263,25570,0.00073438,0.00034414,0,0.066998,0,0.070482,0.0046974,0.028246,0.0099835,0.045003,0.69648,0.98321,0.0078412,0.26631,0.33119,0.27462,0.33474,0.33855,0.28012,0.34503,0.35052,0.26452,44.516,7.4147,12934,28267,26735,0.04759,0.042013,0.023559,0.1996,0.19085,0.051901,0.42189,0.44117,0.077703,0.60643,0.63936,0.089468,0.72811,0.75661,0.092082,0.0022261,0.0020302,0.019761,-0.0013497,-0.0037148,-0.027223,0.007263,0.0068192,0.030676,0.0047254,0.0032562,-0.025759,0.015216,0.014544,0.0384,0.011515,0.012134,-0.024833,3.2459e-06,3.1355e-06,6.0401e-05,-0.0072249,-0.01818,-0.0028391,0.00011464,0.00010587,0.00099009,-0.0091321,-0.022989,-0.009466,0.00081122,0.00076735,0.0041074,-0.0097295,-0.025306,-0.01105,0.00017065,0.0001339,0.0032391,-0.0059001,-0.00011917,-0.019592,0.0006596,0.00053294,0.0062227,-0.006449,0.0031283,-0.024631,0.0014421,0.0011644,0.0084014,-0.0068219,0.0070222,-0.033704,0.0020522,0.0018931,0.32941,0.042219,0.047831,-0.023501,0.0067205,0.0063632,0.34196,0.060576,0.067638,-0.021617,0.013569,0.013098,0.3413,0.078285,0.088287,-0.018134,0.40935,74,74,40,1054,3,3,3,0.645
30,-0.09996,0.83514,0.94751,0.22714,0.52844,0.3782,0.66505,-0.18355,2.0196,-0.0221,3.3345,0.0015836,3.5929,2.2924,2.4518,2.6976,0.002574,-0.22716,8.4868,5.8888,4.6518,3.8443,0.02351,0.028012,0.048063,0.040012,0.031978,0.029687,0.79874,0.57586,2.2097,3.4902,5.248,7.335,7.0642,0.083813,26.007,0.060085,0.0839,0.0839,0.31942,0.46613,0.17169,3.2761,5.3404,42,142.55,5471,7.0752e+05,6.2307,39.89,1.4772e+05,4509,3861,0.89899,0.91472,0.24804,0.199,0.12194,0.5989,34128,17849,0.0009177,0.00042574,0,0.10743,0,0.060221,0.013247,0.055514,0.015485,0.070619,0.41827,0.70038,0.35797,0.25509,0.3439,0.22535,0.25965,0.381,0.18747,0.27396,0.37911,0.16945,16.401,6.0845,15890,74083,73505,0.11515,0.1058,0.075646,0.24754,0.23563,0.085422,0.36919,0.36482,0.09024,0.48979,0.49371,0.095897,0.62218,0.63057,0.10442,0.0015673,0.0016183,0.018463,-0.0046289,-0.0039629,0.0029489,0.002717,0.0025678,0.01523,-0.0077485,-0.0050931,-0.0059703,0.0044826,0.0039532,0.015013,-0.009711,-0.005137,-0.017092,2.1862e-07,1.2537e-07,5.3988e-06,-0.0083757,-0.014799,-0.0096201,3.6043e-05,2.3009e-05,0.0004131,-0.01089,-0.019129,-0.020781,0.00041187,0.00028972,0.0027676,-0.012473,-0.021959,-0.0269,0.0015012,0.0015773,0.037815,0.0020154,0.0061465,0.0044316,0.0024071,0.0023712,0.030138,-1.1867e-05,0.0067181,-0.0014825,0.003411,0.0032333,0.026373,-0.0015757,0.0072603,-0.0061753,6.5847e-05,4.0874e-05,0.014026,-0.0019369,0.0097635,-0.011982,0.00027385,0.00017353,0.018492,-0.0019314,0.013105,-0.016141,0.00065974,0.00043008,0.022022,-0.0017454,0.016801,-0.021551,0.68825,74,74,40,1054,3,3,3,0.645
30,-0.0050283,0.56773,0.57384,-0.65239,0.54923,-0.51729,-0.20709,1.0465,19.246,-0.032392,3.1783,0.0043556,10.543,12.639,0.69446,23.767,0.022678,0.65242,2.5134,1.5971,1.1486,0.87714,0.10096,0.074094,0.1003,0.10172,0.081423,0.068171,0.47333,0.39535,0.021685,0.052414,0.019819,0.11399,0.19207,0.007858,0.80318,0.14052,0.33251,0.33251,0.6165,0.92494,0.35181,1.1758,0.69828,66,38.182,1149,26468,5.6836,35.946,31023,18765,4671,0.90618,0.93626,0.050781,0.034372,0.047493,0.16008,17070,12144,0.0011555,0.00051895,0,0.049368,0,0.048733,0.021953,0.094699,0.039225,0.19434,0.6248,0.72457,0.30292,0.26951,0.31114,0.21684,0.3538,0.28331,0.093612,0.35776,0.2729,0.083536,15.636,5.8546,5303.6,10075,8471.2,0.26569,0.26912,0.095924,0.70732,0.72076,0.13414,0.85876,0.87078,0.11535,0.92401,0.93543,0.099422,0.94576,0.95382,0.087231,0.0019896,0.001683,0.012881,-0.0019599,-0.0047036,-0.03408,0.005706,0.0049387,0.017577,0.00069121,-0.0013766,-0.043831,0.012176,0.010729,0.02241,0.0050013,0.0039769,-0.053052,1.9819e-06,1.5009e-06,2.6897e-05,-0.0061571,-0.018302,-0.015487,0.00010811,8.8393e-05,0.00068091,-0.0077946,-0.02348,-0.020259,0.00084612,0.00077097,0.0031245,-0.0082044,-0.026356,-0.017704,0.0018199,0.0015465,0.025193,0.0030419,0.0057045,-0.030893,0.0049031,0.0042879,0.033736,0.0078204,0.011107,-0.036935,0.009744,0.0086698,0.041402,0.013789,0.017625,-0.042618,0.00016775,0.00013504,0.019637,0.00049103,0.020456,-0.020011,0.00069472,0.00056242,0.025781,0.0020377,0.027636,-0.024671,0.0015891,0.001291,0.02915,0.0036053,0.035028,-0.030584,0.49896,74,74,40,1054,3,3,3,0.645
30,-0.0058805,0.4584,0.44738,-0.7431,0.44738,-0.74639,0.0044402,0.2528,4.2021,0.029754,3.3096,0.00023871,4.3287,6.0431,0.51213,8.4148,0.0080294,0.74354,1.8513,1.1584,0.85969,0.69156,0.055314,0.092631,0.19481,0.11397,0.075326,0.0541,0.41385,0.086672,0.071398,0.10512,0.012236,0.28969,0.84179,0.1006,1.5075,0.13316,0.16915,0.16915,0.56239,0.64012,0.24126,0.96179,0.44656,29,56.517,718,24745,3.2098,12.507,19386,13041,6291,0.90946,0.94475,0.21564,0.13837,0.15988,0.8497,26001,16302,0.00058072,0.0003149,0,0.04483,0,0.066285,0.00589,0.0013886,0.011291,0.042071,1.1982,2.555,1.4857,0.23467,0.35337,0.27304,0.26657,0.44635,0.23844,0.2766,0.45072,0.23067,37.601,7.372,10050,14051,12131,0.032427,0.027841,0.0067594,0.16404,0.15528,0.017962,0.35765,0.35285,0.027738,0.54077,0.5443,0.033595,0.70815,0.718,0.037711,0.00044169,0.00036545,0.0016509,-0.005502,-0.0067023,-0.031583,0.0014357,0.0011913,0.0025534,-0.0063949,-0.003909,-0.037289,0.0029554,0.002452,0.0031406,-0.0072392,-4.6967e-05,-0.047432,0,0,0,-0.0046695,-0.019406,0,0,0,0,-0.0061544,-0.02524,0,1.2057e-05,9.7684e-06,2.5706e-05,-0.0076338,-0.029698,-0.018185,0.00010885,9.6322e-05,0.00086996,-0.004032,0.0018473,-0.014847,0.00049571,0.0004349,0.0019692,-0.0045462,0.0060046,-0.018472,0.0013735,0.001185,0.0033695,-0.0045199,0.011432,-0.028408,0.00033284,0.00026912,0.022496,0.0027233,0.028443,-0.028161,0.00093999,0.00075643,0.02014,0.0030694,0.03667,-0.032369,0.0015699,0.0012572,0.016627,0.0026533,0.044503,-0.037683,0.36523,74,74,40,1054,3,3,3,0.645
30,-0.011815,0.89502,0.87989,-0.34536,0.879,-0.33436,-0.031834,-0.79648,6.4636,-0.07788,3.2471,0.0013364,7.1987,6.2885,1.3079,8.7546,0.0083536,0.34537,3.7492,2.5193,1.9609,1.4466,0.050681,0.065968,0.09105,0.073854,0.053784,0.071256,0.59341,0.14233,0.019462,0.031189,0.14988,0.61041,0.045047,0.059208,1.0575,0.18687,0.2625,0.2625,0.41165,0.4741,0.31468,1.8399,1.6986,74,46.284,2071,58887,7.9033,65.878,55917,9396,5319,0.90461,0.93293,0.18574,0.13228,0.11985,0.57385,26166,15048,0.0016478,0.00055593,0,0.10455,0,0.083029,0.0045193,0.061574,0.012535,0.12041,0.10019,0.34928,0.49728,0.27998,0.30603,0.21177,0.36245,0.27167,0.11177,0.38387,0.25702,0.097347,18.865,5.7177,11077,25019,24072,0.25023,0.24971,0.10905,0.64918,0.6902,0.1486,0.80201,0.82991,0.13003,0.86816,0.88461,0.11275,0.90192,0.9132,0.10041,0.0014094,0.001234,0.011013,-0.0043463,-0.0056245,-0.019782,0.0044045,0.0038209,0.016377,-0.0023041,-0.0024727,-0.030334,0.0091916,0.0078981,0.02042,0.00031697,0.0026219,-0.042152,2.6722e-06,2.2594e-06,4.3774e-05,-0.0067725,-0.017477,-0.010028,0.00010331,8.4583e-05,0.00078546,-0.0085948,-0.022351,-0.01411,0.00055459,0.00045271,0.002472,-0.009752,-0.025051,-0.020384,0.00086483,0.00072552,0.01445,-0.0017922,0.0036671,-0.024105,0.0033491,0.0028551,0.027815,0.0032424,0.0098622,-0.031,0.0073537,0.0062673,0.037715,0.0089659,0.016662,-0.040256,0.00054189,0.00050624,0.076569,0.0082867,0.020167,-0.0065341,0.0016286,0.0015191,0.072948,0.010691,0.028726,-0.0093876,0.0030554,0.0028473,0.067653,0.01246,0.037755,-0.011701,0.50247,74,74,40,1054,3,3,3,0.645
30,-0.0078577,0.97968,0.9696,-0.17169,0.9657,-0.16081,-0.063411,-0.61563,6.0969,-0.051878,3.2479,0.0014409,8.0847,6.2787,1.6549,8.9752,0.0085641,0.17171,4.5403,3.1104,2.2573,1.7209,0.033938,0.050514,0.090377,0.063226,0.064157,0.060937,0.63685,0.0047831,0.0032307,0.033142,0.3393,0.21274,0.14566,0.093851,0.8327,0.083018,0.1913,0.1913,0.60951,0.61101,0.32581,1.9332,1.287,63,78.111,3549,2.078e+05,7.1776,54.51,95823,22734,4968,0.90353,0.93079,0.20587,0.14801,0.1386,0.55611,29487,17698,0.0014676,0.00051555,0,0.1007,0,0.054059,0.0054366,0.15209,0.0078009,0.23938,0.27522,0.19572,0.069821,0.27413,0.30235,0.21294,0.32971,0.28204,0.11848,0.34832,0.26283,0.099991,17.15,5.7494,13033,36769,35702,0.26062,0.27842,0.15,0.60017,0.64392,0.18144,0.76045,0.79148,0.16284,0.85596,0.87877,0.14682,0.90743,0.92072,0.13342,0.00020787,0.00014152,0.0021453,-0.010239,-0.01001,-0.017545,0.00053044,0.00039423,0.0026048,-0.013176,-0.010039,-0.018123,0.0016216,0.0015657,0.0047578,-0.014806,-0.0082968,-0.0053086,6.2471e-08,4.4009e-08,1.3515e-06,-0.0078255,-0.017338,-0.012455,6.2062e-05,7.1018e-05,0.00062316,-0.010072,-0.022232,0.016689,0.00086231,0.0010336,0.0050763,-0.010365,-0.024127,0.038228,0.00017445,0.00011862,0.0038497,-0.0063504,-0.0014655,-0.017888,0.00046118,0.00031809,0.0050585,-0.0077567,0.00088656,-0.019397,0.00075926,0.00053213,0.0051429,-0.009415,0.0032258,-0.023832,3.3359e-05,2.2864e-05,0.0062254,-0.002585,0.015328,-0.012571,0.00013404,9.3205e-05,0.0079295,-0.0032627,0.019355,-0.013467,0.00023921,0.00016829,0.0069954,-0.0044386,0.023572,-0.013936,0.58769,74,74,40,1054,3,3,3,0.645
30,-0.0012363,0.58912,0.5888,-0.64082,0.58529,-0.59138,-0.077149,2.2718,26.076,0.026191,3.1237,0.007825,12.818,15.128,0.71657,27.358,0.026105,0.64118,2.5165,1.5327,1.1236,0.85803,0.065819,0.059566,0.1436,0.11283,0.077696,0.068761,0.47173,0.20058,0.0038156,0.021181,0.00055742,0.12093,0.16912,0.0075647,0.52375,0.21894,0.32446,0.32446,1.0289,1.1332,0.51342,1.1702,0.66967,69,34.13,976,17480,5.6085,37.377,26352,12744,6777,0.90782,0.93919,0.14621,0.096631,0.12275,0.46594,19330,12729,0.0010826,0.00046231,0,0.047238,0,0.053391,0.017626,0.014295,0.015966,0.028979,0.17268,0.87724,0.69658,0.27615,0.3198,0.2136,0.38573,0.28929,0.074367,0.40614,0.28193,0.065746,15.373,5.7672,7708.2,14433,12621,0.28248,0.28458,0.10308,0.70335,0.72814,0.13482,0.82512,0.84001,0.11202,0.8845,0.89429,0.096193,0.91392,0.92293,0.0852,0.0021121,0.0019346,0.01382,-0.0015483,-0.0049025,-0.023769,0.0056527,0.0052503,0.017599,0.00058041,-0.0018254,-0.027002,0.010373,0.0096137,0.019296,0.0021656,0.0026895,-0.034136,0,0,0,-0.0062007,-0.018802,0,1.3149e-05,1.1331e-05,8.3711e-05,-0.0081318,-0.024237,-0.018027,0.00026177,0.00022632,0.00097703,-0.0095719,-0.027711,-0.025862,0.00113,0.0010423,0.01581,-0.0003335,0.0025807,-0.014665,0.0027277,0.002568,0.018969,0.0010022,0.0043954,-0.014982,0.0048378,0.0045412,0.020776,0.0022198,0.0071667,-0.019157,0.00098212,0.0008923,0.1162,0.015897,0.033246,-0.020006,0.0029119,0.002671,0.10922,0.020373,0.044879,-0.023022,0.0052734,0.0048462,0.097774,0.023118,0.056558,-0.02666,0.52472,74,74,40,1054,3,3,3,0.645
30,-0.078754,1.0291,0.98073,-0.13543,0.96978,-0.14974,0.10566,0.074116,7.5483,-0.084363,3.1769,0.0030663,6.1762,4.6978,1.7252,6.1771,0.0058942,0.13559,3.957,2.7301,2.2442,1.8398,0.062307,0.052613,0.080308,0.066894,0.040479,0.044256,0.65314,0.19809,0.019843,0.18855,0.42682,2.2907,1.1744,0.06833,4.3667,0.081397,0.12772,0.12772,0.41952,0.58826,0.23707,2.6962,4.2377,55,66.236,2974,1.6015e+05,7.086,51.783,80298,6210,5886,0.905,0.93086,0.16035,0.12219,0.070475,0.52863,23714,14275,0.00082509,0.000365,0,0.11826,0,0.074434,0.055027,0.14452,0.076109,0.21923,1.1054,1.3938,0.51371,0.24751,0.32673,0.228,0.27217,0.34344,0.17262,0.26554,0.32416,0.1597,19.824,6.1561,19452,54928,54022,0.14638,0.15575,0.064314,0.29751,0.31746,0.068661,0.43688,0.45574,0.071415,0.55452,0.56825,0.072611,0.66629,0.67424,0.074788,0.0030661,0.003092,0.024156,0.0019129,0.0010135,0.0011146,0.0057712,0.0055658,0.021635,0.00091824,0.0025948,-0.0057628,0.0093381,0.008439,0.020916,0.00057399,0.0045115,-0.01979,6.2202e-08,4.6193e-08,1.0273e-06,-0.0068154,-0.015945,-0.0071195,4.9954e-05,3.8272e-05,0.0003829,-0.0088129,-0.02053,-0.016313,0.00056006,0.00044339,0.0025169,-0.0097792,-0.02334,-0.021266,0.0029342,0.0030113,0.04943,0.0093839,0.0131,0.0033639,0.0051785,0.0051815,0.043361,0.0095976,0.015981,8.7443e-05,0.0073666,0.0070586,0.038092,0.0090371,0.017634,-0.0072288,0.00013189,8.062e-05,0.018789,-0.00020289,0.014593,-0.014613,0.00054276,0.00034603,0.024512,0.00087158,0.021998,-0.022807,0.0014114,0.00093701,0.031508,0.0029512,0.02924,-0.031463,0.53314,74,74,40,1054,3,3,3,0.645
30,-0.013401,0.47483,0.45414,-0.73853,0.45349,-0.71048,-0.037976,0.73691,8.7151,0.011112,3.2705,0.00080515,8.7835,12.142,0.52229,18.789,0.017929,0.73859,1.7815,1.1107,0.82854,0.68043,0.056494,0.086308,0.20249,0.1168,0.074727,0.049274,0.41391,0.085346,0.04043,0.12253,0.0038693,0.3126,1.2211,0.10608,1.8919,0.26276,0.23843,0.26276,0.44052,0.60802,0.26307,1.0486,0.57442,34,148.56,3987,4.6395e+05,5.458,31.179,1.0765e+05,11772,4077,0.90181,0.92923,0.4291,0.32036,0.2916,0.92586,25528,17700,0.001244,0.00053731,0,0.037286,0,0.041705,0.0043117,0.014875,0.0026434,0.026852,0.7058,1.7925,1.1599,0.2884,0.29647,0.23925,0.37115,0.26425,0.18121,0.39305,0.2631,0.15677,25.392,6.4596,11343,29500,27872,0.15188,0.14953,0.082903,0.47387,0.50225,0.13586,0.63559,0.66329,0.12907,0.69787,0.71898,0.11352,0.7505,0.76444,0.10465,0.0041146,0.0046068,0.040271,0.0065762,0.0046108,0.032781,0.011069,0.012383,0.051547,0.015024,0.01403,0.044445,0.021179,0.02317,0.058931,0.023735,0.023594,0.045772,1.9275e-07,1.574e-07,3.9547e-06,-0.0076146,-0.017331,-0.0095865,5.4065e-05,4.6386e-05,0.00051483,-0.0098316,-0.022251,-0.020296,0.00093573,0.00088585,0.005224,-0.0098826,-0.024215,-0.013065,0.0010074,0.00075215,0.021083,-0.00115,0.0028512,-0.036162,0.0029489,0.0023076,0.030675,0.0020878,0.0074206,-0.042405,0.0059702,0.0048668,0.038351,0.0060273,0.01232,-0.047537,0.003107,0.0038545,0.54988,0.068889,0.078923,0.061276,0.0089914,0.010838,0.50445,0.086735,0.099319,0.070451,0.016536,0.019427,0.4586,0.10158,0.11729,0.073926,0.49492,74,74,40,1054,3,3,3,0.645
