30,-0.10311,0.94027,0.93369,0.25578,0.73589,0.37351,0.46026,0.49898,2.2826,0.30767,3.2358,0.00076922,3.4705,2.1891,2.5087,2.577,0.002459,-0.25585,6.844,5.247,4.1687,3.6247,0.040972,0.032449,0.036458,0.033248,0.034068,0.023217,0.79959,0.0011125,1.2041,7.074,7.6611,6.1914,12.817,0.097649,35.046,0.11382,0.23141,0.23141,0.32647,0.59255,0.18608,3.2582,5.3097,92,43.935,1020,17262,4.9365,33.218,27540,10233,9936,0.91455,0.93146,0.0043994,0.0037865,0.065235,0.22866,26508,16072,0.0012876,0.00045844,2,0.32913,0,0.044888,0.12642,0.52441,0.16059,0.63597,1.2015,2.7362,1.3364,0.2078,0.33843,0.23172,0.26719,0.35216,0.1384,0.27143,0.29093,0.13285,22.373,6.2564,55341,2.9816e+05,2.9789e+05,0.18757,0.17456,0.096668,0.46206,0.46048,0.12483,0.63342,0.66924,0.12068,0.73976,0.78872,0.11242,0.80388,0.84125,0.10442,0.016952,0.015058,0.17375,0.062502,0.045052,-0.017276,0.032966,0.029363,0.15986,0.07484,0.056875,-0.021422,0.050952,0.045539,0.14653,0.083654,0.067,-0.025027,0.0094424,0.0083245,0.22923,0.056654,0.039819,-0.013243,0.017,0.014755,0.18998,0.060878,0.045375,-0.017975,0.025089,0.021454,0.16285,0.063594,0.050473,-0.02317,0.0064849,0.0059699,0.12758,0.030455,0.020994,-0.0075884,0.013123,0.012421,0.1269,0.039364,0.028768,-0.0066004,0.020808,0.020076,0.12245,0.046189,0.035389,-0.005245,0.0010245,0.00076369,0.18492,0.020588,0.022159,-0.013484,0.0032769,0.0024919,0.1877,0.02906,0.030888,-0.016448,0.0064216,0.0050026,0.1829,0.036454,0.038873,-0.019351,0.57019,74,74,40,1054,3,3,3,0.645
30,-0.078203,0.84336,0.89926,0.31604,0.60759,0.49604,0.56951,-0.68041,2.4021,-0.32277,3.2054,0.00050034,3.5568,2.1913,2.6295,2.5859,0.0024674,-0.31606,9.05,6.4386,4.7503,3.9297,0.022992,0.021659,0.041896,0.035433,0.040038,0.029365,0.80862,0.43818,4.424,4.4055,6.2763,3.6049,6.3726,0.10686,25.628,0.11186,0.19823,0.19823,0.40729,0.58825,0.22537,3.2218,5.1895,80,45.288,1060,21501,5.183,32.599,28620,18684,7047,0.91567,0.93522,0.064675,0.049598,0.013514,0.26299,20034,12858,0.00086955,0.00039806,1,0.1892,0,0.07892,0.09654,0.28062,0.14589,0.42518,0.23576,1.2398,1.3145,0.18821,0.33663,0.25896,0.24611,0.32399,0.17238,0.24376,0.29352,0.16001,14.628,6.992,13983,39559,38981,0.18629,0.1851,0.082346,0.45981,0.46836,0.10654,0.60602,0.61326,0.099029,0.71277,0.71211,0.092905,0.79585,0.78963,0.088663,0.021489,0.028768,0.18891,0.075915,0.091414,0.10473,0.042184,0.053296,0.17545,0.092219,0.10912,0.10422,0.06604,0.079485,0.16289,0.10508,0.12367,0.097493,0.014482,0.022091,0.30153,0.083837,0.10571,0.12852,0.025982,0.037521,0.24903,0.090643,0.11393,0.13294,0.038616,0.052596,0.21498,0.096398,0.12076,0.12802,0.0060038,0.0058258,0.1013,0.025538,0.02573,-0.0051543,0.014095,0.013928,0.1169,0.039764,0.038301,-0.0027939,0.024412,0.024243,0.12322,0.052048,0.049178,-0.002015,0.0010037,0.0008513,0.15538,0.018582,0.025896,-0.012717,0.0030035,0.002618,0.14755,0.024267,0.036018,-0.014485,0.0056036,0.0049888,0.13689,0.028706,0.045754,-0.015611,0.56339,74,74,40,1054,3,3,3,0.645
30,-0.064024,0.86232,0.91065,0.29746,0.66335,0.45248,0.52112,0.30352,2.0693,0.14962,3.3351,0.0010557,3.1963,1.9833,2.5923,2.2835,0.0021789,-0.29748,10.498,6.4277,4.417,3.6521,0.022389,0.016161,0.044022,0.047888,0.050211,0.030501,0.78883,0.43169,8.9447,3.5491,2.1997,1.3613,5.0923,0.11701,21.696,0.091318,0.24262,0.24262,0.44047,0.50756,0.19667,3.2317,5.2197,83,55.361,1407,40544,5.0498,30.366,37989,27540,14013,0.91313,0.92851,0.18635,0.14172,0.075145,0.51854,23605,14559,0.001037,0.00049739,0,0.088014,0,0.064256,0.032915,0.023493,0.046928,0.041779,0.63985,1.0492,0.71439,0.20617,0.34768,0.22754,0.26945,0.33775,0.13432,0.27401,0.32716,0.13104,13.492,6.1435,12603,39491,38899,0.2165,0.21663,0.12311,0.49516,0.49126,0.14759,0.65047,0.64708,0.13673,0.74685,0.74392,0.12523,0.82209,0.81701,0.11782,0.01781,0.020442,0.20141,0.069646,0.079523,0.054423,0.035806,0.040834,0.19157,0.086794,0.10065,0.067307,0.057004,0.064645,0.18087,0.10065,0.11826,0.077962,0.011395,0.013851,0.30522,0.073466,0.081009,0.062864,0.022594,0.027114,0.27857,0.088388,0.098123,0.075441,0.035865,0.04275,0.25685,0.10098,0.11374,0.087096,0.0054493,0.0053985,0.11828,0.025632,0.029081,-0.0018914,0.011206,0.011106,0.11956,0.033825,0.038263,-0.0023608,0.018054,0.017987,0.11723,0.040452,0.045539,-0.0011938,0.0009656,0.0011917,0.1923,0.02021,0.033748,0.02838,0.0031403,0.0039527,0.19845,0.02909,0.047394,0.040238,0.0060136,0.0074094,0.18897,0.03551,0.057704,0.045014,0.62207,74,74,40,1054,3,3,3,0.645
30,-0.061482,0.97613,0.97498,0.15522,0.85937,0.20867,0.34436,0.56664,2.4318,0.23112,3.2765,0.00046693,3.0906,2.0323,2.3081,2.3938,0.0022841,-0.15523,7.2567,4.4514,3.1667,2.6288,0.020628,0.023012,0.066068,0.063134,0.057296,0.036036,0.73383,0.53458,2.6619,0.71482,0.65248,0.68178,2.6998,0.10393,8.0493,0.095347,0.21618,0.21618,0.57267,0.77119,0.26201,3.3685,5.6564,91,46.505,962,27849,4.383,21.993,25974,25299,20223,0.91372,0.93044,0.072202,0.054852,0.039619,0.24984,22873,13695,0.00094593,0.00044053,0,0.064714,0,0.062217,0.0061024,0.021799,0.023936,0.037082,0.61462,0.52105,1.4025,0.20607,0.34471,0.22246,0.27462,0.3207,0.11282,0.27999,0.30763,0.10207,12.518,6.0065,24809,75215,74587,0.24905,0.251,0.12604,0.52984,0.55094,0.14056,0.68348,0.70301,0.12788,0.76909,0.78003,0.11478,0.82405,0.83179,0.10511,0.027898,0.036127,0.28081,0.10883,0.12241,0.13055,0.05703,0.073448,0.27158,0.1386,0.15689,0.16741,0.09132,0.11749,0.25789,0.16246,0.18622,0.20404,0.01352,0.017523,0.32232,0.083419,0.09495,0.089011,0.026673,0.034434,0.29271,0.099983,0.11555,0.11265,0.042436,0.054881,0.2705,0.1147,0.13573,0.13758,0.011559,0.015549,0.22332,0.059719,0.068075,0.097985,0.024489,0.033006,0.23255,0.081325,0.092544,0.13018,0.040312,0.054409,0.23297,0.10001,0.1135,0.16097,0.0028189,0.003055,0.49968,0.061873,0.062165,0.014037,0.0078518,0.0087794,0.44165,0.075341,0.080006,0.026424,0.013978,0.016106,0.39096,0.085541,0.095618,0.041826,0.61249,74,74,40,1054,3,3,3,0.645
30,-0.065795,0.99931,0.98481,0.11939,0.89938,0.15455,0.29452,0.54045,2.4599,0.21661,3.2902,0.00051999,4.02,2.6854,2.2366,3.232,0.003084,-0.11939,6.5558,4.1353,3.1142,2.4813,0.026863,0.03201,0.062252,0.06319,0.048955,0.044763,0.72197,0.092324,0.89653,0.93615,0.63756,1.3492,1.236,0.095974,5.2437,0.087272,0.19757,0.19757,0.23239,0.83536,0.18217,3.4283,5.8743,79,67.937,1653,67375,4.8694,26.159,44631,32103,31941,0.91158,0.92906,0.11724,0.090274,0.04402,0.34597,28682,15671,0.0010773,0.00047407,0,0.093656,0,0.057749,0.032643,0.13727,0.047033,0.18222,1.5454,0.63219,0.964,0.20872,0.35034,0.22359,0.26831,0.35269,0.12572,0.2817,0.3357,0.11199,14.173,6.0371,31430,1.093e+05,1.087e+05,0.21706,0.21508,0.12871,0.51153,0.53355,0.15899,0.68648,0.71439,0.15048,0.77288,0.79033,0.13513,0.83109,0.84092,0.1242,0.019936,0.024618,0.23509,0.081043,0.089015,0.078843,0.040146,0.048708,0.22399,0.1013,0.11177,0.093038,0.064564,0.077956,0.21362,0.11902,0.13297,0.11094,0.011961,0.016614,0.33408,0.079175,0.094035,0.098225,0.022788,0.031197,0.29298,0.091177,0.10917,0.11793,0.035516,0.047978,0.26523,0.10206,0.1237,0.13531,0.0059862,0.0060467,0.13549,0.029582,0.028375,0.0019118,0.013297,0.013573,0.14794,0.043009,0.041058,0.0052494,0.02258,0.023636,0.15288,0.054988,0.053012,0.014623,0.0019883,0.0019568,0.41292,0.046293,0.042761,-0.002065,0.0056523,0.0056178,0.37248,0.057451,0.055844,-0.0010694,0.01057,0.010815,0.34638,0.068617,0.070338,0.0050563,0.63378,74,74,40,1054,3,3,3,0.645
30,-0.079836,0.96699,0.97062,0.16868,0.8195,0.23524,0.39458,-0.028154,2.0547,0.055302,3.3036,0.0018605,3.2972,2.1558,2.3349,2.5085,0.0023936,-0.16871,6.742,4.4589,3.2188,2.6666,0.033748,0.035067,0.054492,0.054386,0.054208,0.035936,0.73216,0.0089634,0.69408,1.7676,1.3691,1.0053,2.8967,0.08751,7.8292,0.083509,0.3244,0.3244,0.28734,0.56422,0.22132,3.3281,5.5515,97,47.598,1092,29515,4.6844,24.902,29484,25785,20088,0.91387,0.93115,0.1823,0.13638,0.10476,0.52957,22733,14193,0.00093087,0.00043219,0,0.10602,0,0.06763,0.028677,0.012748,0.042092,0.0026476,1.6019,1.3384,0.48861,0.20097,0.35296,0.22477,0.25492,0.3457,0.11835,0.26027,0.34234,0.11138,13.643,6.0688,22545,66214,65662,0.23933,0.23499,0.13385,0.51248,0.51714,0.15023,0.67203,0.67927,0.13894,0.76198,0.76823,0.12566,0.82091,0.82568,0.11571,0.018474,0.019862,0.20547,0.072045,0.077517,0.029136,0.038125,0.041519,0.20063,0.092596,0.10281,0.045198,0.062804,0.06854,0.19599,0.11184,0.12573,0.05764,0.0095193,0.010304,0.25077,0.059625,0.064596,0.02256,0.019221,0.021042,0.23309,0.073078,0.081909,0.033682,0.031996,0.03528,0.22537,0.087987,0.10022,0.045509,0.007259,0.0077371,0.15496,0.036505,0.037349,0.015677,0.014712,0.015901,0.15438,0.047279,0.04985,0.024827,0.024086,0.026139,0.15382,0.057767,0.061006,0.032417,0.0016953,0.0018205,0.33207,0.037792,0.046784,0.011537,0.0053779,0.0057577,0.33427,0.052809,0.062927,0.014539,0.010096,0.010711,0.31203,0.063313,0.076141,0.015478,0.64413,74,74,40,1054,3,3,3,0.645
30,-0.062737,0.81096,0.8841,0.33921,0.575,0.53977,0.59129,0.59981,2.1552,0.33032,3.203,0.00091545,3.2078,1.9591,2.6758,2.2981,0.0021929,-0.33921,13.708,8.4827,5.6887,4.2941,0.0090551,0.017797,0.039381,0.037536,0.044133,0.039457,0.81264,9.7486,7.1816,5.0419,4.6769,2.2056,2.308,0.12368,31.286,0.07256,0.23489,0.23489,0.46258,0.71528,0.29008,3.209,5.1513,78,77.962,1982,87768,4.9622,28.095,53514,36666,30456,0.90873,0.91954,0.17523,0.1388,0.086296,0.44634,26528,15862,0.0011157,0.00048922,0,0.071375,0,0.057672,0.037593,0.058923,0.045644,0.075407,0.80645,0.78604,0.18142,0.19949,0.33557,0.23093,0.24088,0.32658,0.16671,0.24096,0.3074,0.15226,13.632,6.235,22322,97297,96596,0.2213,0.23736,0.15147,0.46754,0.49172,0.16775,0.62151,0.63816,0.15727,0.71929,0.73368,0.14518,0.79802,0.80654,0.13767,0.021225,0.027579,0.28894,0.093735,0.10784,0.10081,0.041772,0.053404,0.26903,0.11418,0.13224,0.12106,0.065995,0.083619,0.25206,0.13147,0.15382,0.14131,0.012715,0.018297,0.40996,0.091161,0.11121,0.11361,0.024708,0.034941,0.36672,0.1074,0.13085,0.13658,0.038998,0.054692,0.33619,0.12203,0.15046,0.16072,0.0072259,0.008081,0.1888,0.04029,0.041721,0.0231,0.014557,0.016522,0.18695,0.051799,0.055316,0.034062,0.023101,0.026135,0.18055,0.060911,0.065059,0.040075,0.0012845,0.0012004,0.30793,0.03085,0.032031,-0.0068804,0.0039763,0.0037594,0.30249,0.041949,0.044677,-0.0079761,0.0076469,0.0072012,0.28926,0.051557,0.055703,-0.01069,0.69603,74,74,40,1054,3,3,3,0.645
30,-0.0057185,0.1231,0.12598,-0.93483,0.10873,-1.2807,0.37001,0.62369,3.3286,0.14829,3.3192,1.1849e-06,1.4964,4.143,0.13021,5.2939,0.0050514,0.93483,0.75026,0.3944,0.33476,0.29487,0.13988,0.16092,0.24795,0.1535,0.033735,0.024297,0.23972,0.31229,0.12996,0.027666,0.073175,18.762,32.16,6.5289,57.994,0.23306,0.26371,0.26371,1.0241,1.1563,0.4274,0.45707,0.10314,47,118.51,2460,2.4555e+05,4.4872,21.275,66420,65907,5697,0.91132,0.9284,0.22412,0.18147,0.07816,0.54737,90359,27252,0.001025,0.00049976,0,0.10692,0,0.061715,0.0077278,0.0086403,0.0077317,0.017351,0.76663,1.1828,0.18244,0.19502,0.44174,0.24805,0.23143,0.53428,0.19628,0.24017,0.54709,0.18162,44.029,6.6972,44913,1.772e+05,1.7663e+05,0.022268,0.016088,0.012852,0.2704,0.25286,0.081805,0.49563,0.49466,0.10575,0.65293,0.66945,0.11112,0.74916,0.77646,0.10898,0.0019741,0.002052,0.02266,-0.0024133,0.011336,0.0045942,0.0066973,0.0070619,0.036371,0.0040466,0.022359,0.0089878,0.014656,0.014937,0.047199,0.012113,0.033796,0.0043421,4.2791e-05,2.9779e-05,0.0011634,-0.0072527,0.006694,-0.013418,0.00049257,0.00034076,0.0061643,-0.0079017,0.0090972,-0.024127,0.0024374,0.0017468,0.017717,-0.0048182,0.013918,-0.035003,0.00028333,0.00016906,0.0062421,-0.0063504,-0.00088109,-0.015785,0.00069845,0.00042348,0.0075637,-0.0077767,0.00090609,-0.019449,0.0014198,0.00088858,0.0093575,-0.0087341,0.0026296,-0.025094,0.001648,0.0018532,0.33313,0.037239,0.041526,0.013393,0.0055162,0.0063034,0.35384,0.055177,0.062174,0.02095,0.010868,0.012341,0.34664,0.069749,0.079708,0.025271,0.41023,74,74,40,1054,3,3,3,0.645
30,-0.022592,0.24335,0.2244,-0.88056,0.19884,-1.1777,0.33747,-0.48118,2.9991,-0.13538,3.341,0.00015125,1.2827,2.6235,0.23861,3.2304,0.0030825,0.88058,1.2195,0.5498,0.45384,0.40642,0.082206,0.12274,0.23242,0.19936,0.043615,0.023749,0.29592,0.082996,0.01953,0.010637,0.002132,8.9715,32.969,3.3991,45.455,0.16084,0.14596,0.16084,0.66065,0.66265,0.28893,0.62749,0.19346,45,170.04,4837,5.6283e+05,5.633,34.702,1.306e+05,43578,8127,0.90879,0.92609,0.35327,0.26557,0.22997,0.75004,69994,37762,0.0010252,0.00041883,0,0.059804,0,0.049786,0.0024949,0.0023678,0.00086336,0.0065185,0.7193,0.49128,0.80108,0.17538,0.44028,0.27822,0.18652,0.53156,0.25941,0.19337,0.54946,0.24114,44.099,7.5118,13754,49396,48340,0.01465,0.0099674,0.011292,0.19986,0.18345,0.080747,0.46665,0.46211,0.13297,0.68104,0.68486,0.15479,0.81944,0.82575,0.15919,0.0030525,0.0024619,0.046792,0.0029386,0.016797,-0.033863,0.0058472,0.0046296,0.042406,0.0018703,0.021059,-0.046304,0.0091518,0.0071277,0.039361,0.0005864,0.024964,-0.058931,0.0027949,0.002294,0.10148,0.014462,0.02557,-0.029469,0.0051066,0.0041341,0.085347,0.014335,0.028281,-0.038943,0.0076645,0.0060946,0.074404,0.01376,0.031667,-0.04898,1.6774e-05,1.2511e-05,0.00049351,-0.0093037,-0.0036632,-0.0082778,8.0568e-05,5.8958e-05,0.0011652,-0.011891,-0.0037678,-0.0098297,0.00021605,0.00015299,0.0019015,-0.014304,-0.0041875,-0.013999,0.00024078,0.00015542,0.065,0.002837,0.016838,-0.021919,0.00066,0.00043652,0.056537,0.002687,0.022914,-0.027883,0.0012773,0.00088442,0.054407,0.0030672,0.028321,-0.033697,0.48511,74,74,40,1054,3,3,3,0.645
30,-0.0062897,0.10256,0.10068,-0.94827,0.087449,-1.2921,0.36256,-0.23609,3.1928,-0.041475,3.3257,4.4534e-05,1.0643,3.3078,0.10332,4.1507,0.0039606,0.94829,0.60561,0.34829,0.2747,0.24264,0.12635,0.20258,0.27877,0.12363,0.044536,0.021049,0.20309,0.27553,0.24137,0.081264,0.2716,8.7407,44.41,9.6779,63.699,0.16591,0.20352,0.20352,0.70662,0.71576,0.29358,0.40545,0.080408,25,350.04,4404,1.1274e+06,3.1066,11.248,1.1891e+05,85779,23895,0.89198,0.9007,0.41032,0.34838,0.16369,0.7286,1.1193e+05,47847,0.0023335,0.00076376,0,0.056012,0,0.045182,0.0031987,0.0094942,0.0029299,0.010886,0.65892,0.65399,0.48717,0.20422,0.43609,0.22586,0.22733,0.49034,0.18498,0.24107,0.50747,0.16516,52.082,6.0983,25429,1.7498e+05,1.744e+05,0.077049,0.055291,0.064812,0.35916,0.37652,0.15837,0.64346,0.69656,0.2001,0.82604,0.86624,0.20489,0.92852,0.94896,0.19685,0.0033798,0.0021454,0.056542,0.0048991,0.010682,-0.04299,0.0072219,0.0047621,0.057162,0.006746,0.016884,-0.05483,0.012945,0.0089011,0.060761,0.010338,0.023828,-0.065479,0.0020634,0.0011993,0.081761,0.0087699,0.012728,-0.037444,0.0041502,0.0023817,0.075698,0.0099018,0.015858,-0.051228,0.0071374,0.0041323,0.075616,0.012358,0.020048,-0.064351,0.00043172,0.00027002,0.013862,-0.0065953,-0.0023718,-0.020979,0.001617,0.0011489,0.025522,-0.0050042,0.00081513,-0.025322,0.0037977,0.0029192,0.036479,-0.0020159,0.0050086,-0.028684,0.00088462,0.0006761,0.26062,0.02232,0.023078,-0.015694,0.002071,0.0016674,0.19361,0.021482,0.027439,-0.016948,0.0036299,0.0030656,0.16875,0.02322,0.032548,-0.016955,0.43495,74,74,40,1054,3,3,3,0.645
30,-0.036676,0.99548,0.9696,0.17169,0.95492,0.19281,0.12305,-0.35058,2.8888,-0.057839,3.3177,1.8182e-05,3.2472,2.1205,2.3406,2.5023,0.0023877,-0.17174,6.4816,4.4964,3.2716,2.6283,0.035292,0.031617,0.05189,0.049104,0.053064,0.042218,0.73682,0.0023485,0.75814,1.3744,1.333,0.74416,1.2703,0.13275,5.6152,0.13196,0.18734,0.18734,0.22107,0.23574,0.13545,3.3433,5.5927,102,26.696,451,5889.9,3.7557,18.294,12177,11340,10692,0.91517,0.93405,0.12054,0.091313,0.044974,0.42713,21661,12490,0.00082912,0.00038721,0,0.12445,0,0.072018,0.10127,0.25028,0.12496,0.36261,0.72853,0.13674,0.77242,0.18502,0.3484,0.2606,0.23504,0.33595,0.17251,0.2315,0.33496,0.16744,14.501,7.0363,14077,38196,37458,0.20491,0.2018,0.091159,0.46843,0.46839,0.10923,0.62196,0.62044,0.10229,0.72472,0.71781,0.095071,0.79344,0.78553,0.088963,0.023461,0.027486,0.20757,0.084074,0.086586,0.064148,0.043733,0.051032,0.18306,0.096405,0.10516,0.077528,0.065654,0.076182,0.16298,0.10471,0.12037,0.088542,0.016576,0.020145,0.34737,0.097235,0.095774,0.065631,0.028454,0.033988,0.27447,0.10043,0.10267,0.070364,0.03966,0.046344,0.22222,0.099628,0.10673,0.069183,0.0055094,0.005894,0.093559,0.022928,0.025057,0.013087,0.011938,0.01341,0.099651,0.032377,0.037464,0.030725,0.020487,0.024007,0.10408,0.042002,0.050572,0.053767,0.0013752,0.0014463,0.21428,0.026683,0.036826,0.0060247,0.0040487,0.004338,0.20018,0.034301,0.05023,0.010835,0.0074954,0.0079357,0.18428,0.040383,0.061108,0.011444,0.57667,74,74,40,1054,3,3,3,0.645
30,-0.0066853,0.17477,0.1809,-0.90495,0.1517,-1.2685,0.40179,0.51134,3.467,0.131,3.2742,9.2094e-05,1.5361,3.5218,0.1899,4.4486,0.0042449,0.90496,1.0392,0.53039,0.42501,0.35595,0.099295,0.13556,0.25147,0.16433,0.048707,0.036028,0.26461,0.22012,0.12383,0.088833,0.00049484,4.7655,8.2932,3.0739,16.566,0.13759,0.16396,0.16396,0.6727,0.88322,0.26806,0.55632,0.15393,43,148.7,3661,3.4965e+05,5.1955,30.353,98847,36639,16983,0.90742,0.92263,0.27063,0.21458,0.12075,0.62488,1.2276e+05,34576,0.0010427,0.00043277,0,0.062645,0,0.046585,0.00018895,0.0058622,0.00039019,0.013573,1.2181,1.3219,0.15438,0.18909,0.44479,0.24479,0.21663,0.5383,0.18334,0.22064,0.55415,0.17631,44.154,6.6094,28156,1.1204e+05,1.1127e+05,0.024007,0.015624,0.015423,0.28108,0.26032,0.094654,0.60703,0.60517,0.14417,0.8038,0.80629,0.15227,0.89854,0.90167,0.14549,0.0027435,0.0018803,0.035053,0.001177,0.013266,-0.037687,0.0049354,0.003332,0.029834,-0.0010594,0.017795,-0.048521,0.0075803,0.0050743,0.027174,-0.0029689,0.022763,-0.060438,0.0020642,0.0014336,0.062465,0.0076304,0.018167,-0.029304,0.0028888,0.0019747,0.040241,0.0027601,0.018939,-0.033673,0.0037747,0.0025547,0.030542,-0.00058584,0.020925,-0.040012,0.00018393,0.00010749,0.0045105,-0.0073654,-0.0020221,-0.015666,0.00043973,0.00026164,0.0053005,-0.0093076,-0.0013043,-0.019082,0.00092623,0.00057435,0.0067947,-0.010782,3.9858e-05,-0.026765,0.0004954,0.00033923,0.11147,0.0092352,0.016846,-0.025143,0.0016144,0.0011011,0.11527,0.013424,0.02499,-0.031132,0.002936,0.001987,0.10424,0.015057,0.031823,-0.037836,0.46389,74,74,40,1054,3,3,3,0.645
30,-0.0049077,0.08322,0.087926,-0.95498,0.068587,-1.4029,0.46899,0.19244,3.5123,-0.00090702,3.324,6.9519e-05,1.2156,4.05,0.089919,5.0564,0.0048248,0.955,0.60013,0.32097,0.25112,0.20861,0.13929,0.18866,0.27504,0.1398,0.044736,0.029765,0.18271,0.31711,0.1979,0.065352,0.16311,8.9847,19.711,13.409,42.848,0.18771,0.28051,0.28051,0.3416,0.47612,0.16788,0.37751,0.066556,31,203.71,3092,4.3809e+05,3.6312,14.853,83484,59643,8856,0.90184,0.9173,0.35254,0.29535,0.13613,0.73484,1.0546e+05,41731,0.0015143,0.00059469,0,0.06464,0,0.047105,0.0023069,0.015817,0.0026911,0.015209,0.12186,0.84379,0.12984,0.18501,0.44312,0.25575,0.20805,0.52082,0.21828,0.20834,0.54134,0.20924,51.642,6.9052,32535,1.6894e+05,1.6836e+05,0.035609,0.023319,0.023318,0.3073,0.3173,0.10548,0.59736,0.65446,0.14461,0.79756,0.85237,0.154,0.91294,0.94431,0.15067,0.00030331,0.00016368,0.0039501,-0.01075,0.0013459,-0.027252,0.0013594,0.00076446,0.008376,-0.012007,0.0034097,-0.041433,0.0039787,0.0023772,0.014538,-0.011106,0.0068357,-0.053969,0.00023517,0.00012424,0.0072539,-0.0062706,0.0039608,-0.02272,0.0008441,0.00046783,0.011985,-0.0067872,0.005343,-0.031291,0.0021865,0.0013281,0.018033,-0.0059959,0.008515,-0.038045,3.4245e-05,2.1544e-05,0.00085599,-0.0084336,-0.0029702,-0.01009,0.00026573,0.00015982,0.0032649,-0.01014,-0.0029733,-0.018874,0.00096408,0.00057173,0.0072087,-0.010769,-0.0029019,-0.028426,3.3899e-05,1.7897e-05,0.0077746,-0.0028526,0.0053718,-0.017703,0.00027137,0.00014838,0.019749,-0.0020459,0.0088391,-0.022706,0.00096281,0.00055104,0.034843,0.00047014,0.013314,-0.029769,0.41634,74,74,40,1054,3,3,3,0.645
30,-0.011223,0.11463,0.13143,-0.93191,0.072793,-1.5544,0.66793,0.17864,2.8545,-0.0096694,3.3454,0.00031194,1.5173,4.1121,0.13589,4.963,0.0047267,0.93199,0.78271,0.35119,0.29214,0.24932,0.13966,0.12426,0.26639,0.19165,0.036182,0.028378,0.21349,0.25327,0.00012773,0.0088092,0.040926,23.168,33.046,13.75,70.267,0.24456,0.32655,0.32655,0.78425,0.82431,0.36033,0.46768,0.10549,48,78.229,2649,1.5551e+05,5.9583,38.383,71523,22329,3834,0.91498,0.93265,0.22969,0.1785,0.098824,0.66478,56937,24006,0.00081814,0.00037731,0,0.068608,0,0.050127,0.0052305,0.03751,0.002805,0.055639,1.3634,0.39993,0.45076,0.17044,0.40978,0.29695,0.18549,0.52052,0.26629,0.17904,0.48911,0.31038,37.52,8.0176,27937,77281,76601,0.020516,0.014158,0.0089048,0.20833,0.19381,0.047399,0.46637,0.46707,0.074832,0.66836,0.68993,0.085542,0.81832,0.84436,0.089519,0.0019981,0.002243,0.017248,-0.0019902,0.011539,0.015502,0.00616,0.0075308,0.025158,0.0021659,0.022701,0.044967,0.014404,0.018161,0.034887,0.010008,0.037199,0.075115,0.0015327,0.0017457,0.031336,0.0029506,0.013109,0.014685,0.0043197,0.0054153,0.040654,0.0076812,0.022533,0.042149,0.0098236,0.012598,0.053702,0.016185,0.035796,0.06665,2.0474e-06,1.2119e-06,3.3921e-05,-0.0070009,0.00019265,-0.010867,3.5023e-05,2.0731e-05,0.00028522,-0.009003,0.0018737,-0.010867,0.00012552,7.4293e-05,0.00062211,-0.010874,0.003301,-0.010912,0.00046335,0.0004961,0.070438,0.0068659,0.016202,0.0052021,0.0018053,0.0020947,0.087084,0.012771,0.027569,0.018068,0.0044553,0.005489,0.10687,0.021497,0.04152,0.037158,0.42803,74,74,40,1054,3,3,3,0.645
30,-0.0049523,0.12585,0.12378,-0.936,0.11356,-1.2049,0.28731,0.080127,3.1629,-0.041706,3.3319,6.3414e-07,1.2983,3.6273,0.12786,4.6156,0.0044042,0.93601,0.75373,0.45474,0.36334,0.30534,0.14792,0.15529,0.25212,0.12125,0.047678,0.033723,0.24202,0.39331,0.13984,0.067796,0.20581,5.9756,11.572,4.8645,23.219,0.12635,0.17298,0.17298,0.82404,1.2661,0.33775,0.45304,0.098168,51,106.8,4322,3.6331e+05,6.8353,48.147,1.1669e+05,7101,6966,0.90934,0.92731,0.33688,0.27068,0.17678,0.80255,60312,27906,0.0015013,0.00056698,0,0.08404,0,0.059685,0.0035809,0.016182,0.0034504,0.012708,0.37827,0.36748,0.66571,0.20695,0.41633,0.23422,0.24733,0.49308,0.15709,0.27907,0.48909,0.13419,53.102,6.3238,36014,1.324e+05,1.3186e+05,0.088174,0.080339,0.050858,0.36161,0.38439,0.10933,0.62518,0.6666,0.13331,0.78338,0.82028,0.13324,0.88111,0.90886,0.12809,0.011807,0.0097487,0.13544,0.04265,0.040972,-0.042735,0.025304,0.021403,0.13733,0.057349,0.056755,-0.050276,0.042785,0.037556,0.1377,0.071417,0.073125,-0.049798,0.0078342,0.0068422,0.21285,0.048518,0.043303,-0.024539,0.016027,0.014577,0.20044,0.060236,0.055506,-0.023088,0.027107,0.026051,0.19692,0.073814,0.07101,-0.012516,0.0022711,0.0016636,0.050003,0.0060294,0.0091802,-0.029084,0.0050973,0.003751,0.055165,0.0097448,0.014528,-0.038789,0.0088952,0.0065194,0.058587,0.013505,0.01915,-0.049322,0.0017021,0.001243,0.34386,0.038565,0.035014,-0.029796,0.0046292,0.0033667,0.29675,0.045507,0.044596,-0.038943,0.0080497,0.0058638,0.25659,0.050014,0.053183,-0.046998,0.40754,74,74,40,1054,3,3,3,0.645
30,-0.0041537,0.10899,0.11017,-0.94325,0.099627,-1.235,0.30929,0.91412,4.9408,0.11254,3.2062,0.0015124,1.1883,3.5264,0.11334,4.4485,0.0042447,0.94328,0.65268,0.39622,0.33205,0.28229,0.14777,0.1717,0.26054,0.1182,0.036693,0.030979,0.23413,0.34677,0.14417,0.041961,0.43332,15.402,18.25,7.1184,41.737,0.2675,0.36197,0.36197,0.75277,0.89406,0.35067,0.42538,0.080002,48,134.27,5733,6.7786e+05,6.6852,45.805,1.5479e+05,4023,3726,0.90194,0.91427,0.36477,0.30492,0.14425,0.73085,81498,36815,0.0012421,0.00060109,0,0.078957,0,0.053419,0.00038528,0.011976,0.0010095,0.0099826,0.24392,0.26304,0.12554,0.17756,0.4322,0.28079,0.19338,0.49706,0.26456,0.19055,0.50459,0.27207,58.139,7.5815,27330,1.4308e+05,1.4261e+05,0.030716,0.020223,0.021114,0.24586,0.23548,0.088591,0.49813,0.51658,0.12659,0.68376,0.70921,0.1386,0.8121,0.82882,0.1407,0.0021342,0.0014377,0.029177,-0.0018382,0.010062,-0.038405,0.0066489,0.005071,0.043006,0.0042768,0.018824,-0.043521,0.015155,0.01287,0.05813,0.01441,0.030418,-0.038599,0.001028,0.0006867,0.033287,-0.00021756,0.0083101,-0.024319,0.0030882,0.0025252,0.04603,0.0038159,0.013813,-0.023384,0.0079086,0.0074582,0.06847,0.013818,0.024922,-0.010889,0.00026917,0.00013404,0.007063,-0.0070466,0.00055966,-0.020282,0.00066564,0.00033567,0.0085854,-0.0086541,0.0023154,-0.025701,0.0012011,0.00062456,0.0094281,-0.010271,0.0031963,-0.031118,0.00083701,0.00061696,0.20152,0.018809,0.023352,-0.023743,0.0029573,0.002241,0.22593,0.029901,0.033694,-0.029689,0.0062714,0.0049015,0.23825,0.041137,0.043693,-0.034872,0.44064,74,74,40,1054,3,3,3,0.645
30,-0.0061976,0.16978,0.17376,-0.90889,0.15188,-1.2314,0.35487,-0.27234,3.1875,-0.019204,3.3392,1.6915e-07,1.5539,3.6387,0.18202,4.6366,0.0044242,0.9089,1.0171,0.51363,0.41705,0.35404,0.10385,0.13915,0.24978,0.16587,0.045291,0.033038,0.26302,0.24913,0.12286,0.085182,1.8198e-06,5.745,10.164,3.2026,19.568,0.10144,0.091191,0.10144,0.59026,0.79654,0.30908,0.54436,0.14719,40,199.43,6973,1.2072e+06,6.0353,37.623,1.8827e+05,10233,9774,0.90776,0.92433,0.33687,0.25918,0.21223,0.70764,75395,35732,0.00099831,0.00047094,0,0.084314,0,0.051738,0.0041172,0.008298,0.002241,0.0048951,0.24958,0.83294,0.70189,0.17561,0.44848,0.26383,0.19215,0.54262,0.22141,0.19215,0.56366,0.20938,42.578,7.1234,18928,76545,75158,0.022829,0.015715,0.018269,0.22014,0.21704,0.092344,0.48537,0.5194,0.14359,0.69737,0.73759,0.16456,0.82861,0.85851,0.16712,0.0018858,0.0013825,0.030013,-0.0033374,0.0101,-0.032496,0.0038742,0.0028057,0.029172,-0.0047887,0.014393,-0.044178,0.0064298,0.0046313,0.028711,-0.006201,0.018777,-0.055078,0.0013251,0.0010099,0.049949,0.0022838,0.012599,-0.022761,0.002337,0.0017769,0.040551,0.00022601,0.014786,-0.028803,0.0037033,0.0027947,0.037324,-0.00092617,0.017824,-0.036283,0.00028853,0.00019979,0.0088135,-0.0074823,-0.00072328,-0.016406,0.00063618,0.00044465,0.0095523,-0.0095036,0.00016205,-0.019805,0.0011625,0.00081214,0.010623,-0.011251,0.00071909,-0.026027,0.0002722,0.00017282,0.07629,0.003813,0.013841,-0.022693,0.00092222,0.00059947,0.08202,0.0061205,0.020676,-0.030168,0.0017076,0.0011264,0.07552,0.006694,0.026722,-0.035595,0.48714,74,74,40,1054,3,3,3,0.645
30,-0.034056,1.0167,0.99635,-0.051976,0.99522,-0.053729,0.033731,0.5153,3.2793,0.15903,3.3041,5.9763e-06,2.9951,2.1744,1.8938,2.6166,0.0024967,0.051989,4.6755,3.3882,2.5187,1.9973,0.049764,0.042,0.073417,0.052379,0.057065,0.050096,0.67528,0.10677,0.11921,0.24544,1.0568,0.48677,0.60478,0.10084,2.7206,0.15069,0.1636,0.1636,0.7618,0.79055,0.29193,2.814,4.4866,87,38.713,1359,26797,6.554,49.833,36693,16281,11340,0.91693,0.9356,0.18354,0.1373,0.11516,0.62302,25302,14977,0.0008137,0.00037355,0,0.11747,0,0.087286,0.02849,0.059687,0.070692,0.11235,0.18819,0.47451,0.056689,0.19381,0.36665,0.25026,0.25211,0.36604,0.14836,0.26214,0.35346,0.13693,17.395,6.7571,22388,55535,54725,0.17479,0.18223,0.074084,0.41217,0.42254,0.091574,0.59368,0.59781,0.093022,0.71107,0.71391,0.088871,0.79142,0.79922,0.084544,0.027837,0.037288,0.23465,0.099143,0.11529,0.15614,0.055589,0.074816,0.2217,0.12305,0.14724,0.20667,0.087636,0.11686,0.20726,0.14173,0.17211,0.24274,0.017031,0.024395,0.34003,0.097639,0.11675,0.15047,0.03193,0.044489,0.29345,0.111,0.13227,0.17197,0.048511,0.065871,0.25896,0.12128,0.14464,0.1859,0.0080557,0.0077471,0.13033,0.035906,0.031475,-0.0093047,0.016105,0.015857,0.12808,0.045756,0.042767,-0.0048295,0.025573,0.025627,0.12377,0.053892,0.052921,0.00081275,0.0027502,0.0051461,0.40826,0.055052,0.093739,0.16295,0.0087062,0.016109,0.41012,0.076742,0.12899,0.21853,0.017179,0.030468,0.4024,0.097238,0.15706,0.25614,0.53902,74,74,40,1054,3,3,3,0.645
30,-0.0062765,0.15675,0.15376,-0.91983,0.14167,-1.1778,0.28044,0.48895,3.861,0.060576,3.3018,0.0002261,1.5225,3.801,0.16013,4.8033,0.0045746,0.91986,0.93146,0.49612,0.39748,0.33755,0.13208,0.12435,0.24346,0.15623,0.048923,0.033246,0.26171,0.34921,0.062062,0.060414,0.013495,5.0263,10.905,3.5176,19.934,0.16612,0.24149,0.24149,0.58072,0.69007,0.22729,0.50908,0.12814,62,105.39,3786,2.7591e+05,6.1593,41.391,1.0222e+05,48222,6264,0.9114,0.931,0.33597,0.24529,0.22616,0.79076,44212,27698,0.00086701,0.00043775,0,0.062519,0,0.059225,0.0012655,0.013657,0.0016657,0.011083,0.63791,2.0399,1.0845,0.16983,0.4347,0.28369,0.18409,0.55076,0.22803,0.1808,0.56624,0.22343,38.105,7.6596,12445,36631,35606,0.01815,0.013538,0.01221,0.22121,0.21371,0.078004,0.48267,0.48794,0.12004,0.65721,0.66439,0.13037,0.7661,0.76623,0.12989,0.0050671,0.0044588,0.067793,0.012733,0.02771,-0.033055,0.011856,0.010797,0.075046,0.020378,0.041458,-0.034098,0.021229,0.019504,0.079687,0.028113,0.054474,-0.039394,0.0031918,0.0026892,0.10114,0.016553,0.02891,-0.030891,0.0054261,0.0045805,0.07915,0.014875,0.032883,-0.036465,0.0077591,0.00651,0.065741,0.013149,0.036474,-0.043431,0.00024749,0.00018401,0.0063555,-0.0071144,0.0014938,-0.027972,0.0013,0.00099578,0.016409,-0.0058227,0.0055626,-0.038085,0.0037661,0.0029643,0.02893,-0.001897,0.010913,-0.049083,0.0016278,0.0015856,0.38352,0.039761,0.043699,-0.0052258,0.0053168,0.0053556,0.39751,0.057367,0.06388,0.0019878,0.010196,0.010397,0.37906,0.0704,0.080842,0.0067343,0.48603,74,74,40,1054,3,3,3,0.645
30,-0.012397,0.27902,0.26045,-0.85983,0.25803,-0.94271,0.096394,-0.25063,2.962,-0.056261,3.3322,1.929e-06,1.6224,3.0631,0.28,3.75,0.0035714,0.85986,1.2713,0.68201,0.56085,0.48414,0.090614,0.12151,0.21077,0.15904,0.047587,0.034142,0.33634,0.19913,0.085211,0.045118,0.00086244,4.0806,8.3156,1.099,13.825,0.17224,0.21402,0.21402,0.57406,0.61308,0.27118,0.68479,0.23035,61,65.082,1630,70138,5.0621,27.848,44010,35370,7398,0.91479,0.93606,0.23581,0.17411,0.14212,0.71763,57857,24772,0.00079371,0.00037811,0,0.053888,0,0.056063,0.0017832,0.022476,0.0062191,0.039483,0.12981,0.99418,0.33071,0.179,0.42528,0.25372,0.20922,0.55698,0.17997,0.20715,0.57257,0.17967,32.537,6.8504,16140,39358,38234,0.025594,0.019021,0.011567,0.26914,0.25367,0.06376,0.57018,0.56463,0.095262,0.76559,0.7687,0.10203,0.87751,0.88284,0.099954,0.0040046,0.0030421,0.035994,0.0060817,0.026541,-0.048203,0.0089985,0.0068229,0.038266,0.0093863,0.037125,-0.062637,0.014521,0.010949,0.036621,0.010435,0.046573,-0.076613,0.0028707,0.002169,0.061114,0.011463,0.025673,-0.038851,0.0056852,0.0042976,0.055713,0.013126,0.032261,-0.048739,0.0089636,0.0067781,0.051021,0.014104,0.039417,-0.059146,0.00016534,0.00010784,0.0028523,-0.0062498,0.0055594,-0.02056,0.00055326,0.000369,0.0046916,-0.0073698,0.008462,-0.023996,0.001231,0.00084197,0.0063526,-0.0081999,0.011065,-0.030949,0.00096851,0.00076527,0.1533,0.018027,0.032431,-0.026716,0.003002,0.0023136,0.15079,0.024529,0.044294,-0.036353,0.0049168,0.0037138,0.1228,0.024794,0.05265,-0.0441,0.44753,74,74,40,1054,3,3,3,0.645
30,-0.0040629,0.17681,0.17514,-0.90813,0.16776,-1.0945,0.20518,-0.73325,4.4377,-0.077048,3.2819,0.00041912,1.5419,3.6006,0.18305,4.5546,0.004346,0.90836,0.97446,0.58423,0.47377,0.39764,0.10492,0.14232,0.23604,0.13061,0.049536,0.038693,0.29788,0.24433,0.13318,0.052158,0.094733,5.1192,7.4906,2.3705,15.505,0.34822,0.27682,0.34822,0.49499,1.4645,0.31448,0.54595,0.14754,46,53.783,1843,73643,6.3026,41.7,49761,7128,3996,0.91764,0.94199,0.24273,0.19078,0.093155,0.86886,56967,18352,0.0012149,0.00037582,0,0.077487,0,0.072537,0.0035257,0.026413,0.0055609,0.037535,0.75081,0.96415,0.43299,0.18986,0.39461,0.27481,0.24992,0.48179,0.20462,0.27512,0.47155,0.20331,40.854,7.4199,34399,82293,81682,0.064935,0.052506,0.018819,0.3402,0.38555,0.051682,0.60405,0.67365,0.064719,0.75673,0.81147,0.064671,0.83339,0.87827,0.060875,0.00097289,0.00055745,0.0056077,-0.0049264,0.013127,-0.03287,0.0021055,0.0012085,0.0057417,-0.0064101,0.018037,-0.039882,0.0032652,0.0018775,0.0052805,-0.0083785,0.023794,-0.046464,0.00097289,0.00055745,0.013282,-0.00041732,0.016017,-0.03287,0.0021031,0.0012072,0.013217,-0.00058759,0.019359,-0.039835,0.0032138,0.001849,0.011731,-0.001648,0.02341,-0.045754,0,0,0,-0.0057088,0.00093275,0,0,0,0,-0.0074281,0.0020526,0,0,0,0,-0.0091162,0.0033374,0,0,0,0,-0.0024699,0.01179,0,2.3782e-06,1.313e-06,7.6601e-05,-0.0034084,0.018009,-0.013809,5.1449e-05,2.8501e-05,0.00082405,-0.0041763,0.024891,-0.014776,0.39187,74,74,40,1054,3,3,3,0.645
30,-0.016467,1.0079,0.99627,-0.052742,0.97716,-0.060046,0.1385,0.21268,3.2093,0.035622,3.3079,3.8948e-05,5.26,3.8197,1.8927,4.7743,0.0045556,0.052742,7.4184,4.6289,3.1799,2.5095,0.02127,0.027486,0.067909,0.059009,0.061735,0.045813,0.71678,0.3001,1.1389,0.38166,0.62775,0.32361,0.77941,0.12768,3.6791,0.22535,0.53213,0.53213,0.47506,0.52066,0.21907,2.998,4.4543,103,20.485,815,8942,6.5244,49.926,22005,11313,8235,0.91839,0.93963,0.10017,0.073304,0.032433,0.42377,28734,12561,0.00088385,0.00033286,1,0.16601,0,0.093916,0.1214,0.060231,0.24252,0.12614,1.2861,1.8565,0.82059,0.19648,0.35884,0.23113,0.25736,0.34763,0.10345,0.27429,0.35502,0.085971,16.145,6.2405,19749,39951,39409,0.22989,0.21599,0.075278,0.56462,0.60677,0.096915,0.75946,0.79384,0.091936,0.84861,0.87134,0.081941,0.89543,0.90969,0.073901,0.018296,0.018034,0.11915,0.054195,0.059588,-0.0049558,0.035655,0.03408,0.10986,0.06514,0.074278,-0.019812,0.054942,0.051767,0.10039,0.072661,0.087361,-0.030743,0.010742,0.011398,0.16569,0.051906,0.056491,0.015717,0.019957,0.020331,0.1417,0.058005,0.065148,0.0061569,0.030621,0.030573,0.12629,0.063651,0.074099,-0.00061211,0.0064386,0.0056936,0.08048,0.023944,0.023122,-0.025201,0.01379,0.012238,0.08473,0.033217,0.032339,-0.031354,0.021196,0.018909,0.079255,0.037506,0.039104,-0.034666,0.0011159,0.00094243,0.12799,0.018025,0.03454,-0.016958,0.0033269,0.0028287,0.12108,0.023461,0.044836,-0.022503,0.0061372,0.0052787,0.11106,0.02743,0.055168,-0.025564,0.49867,74,74,40,1054,3,3,3,0.645
30,-0.0082592,0.1803,0.18248,-0.90407,0.16452,-1.1878,0.31379,-0.55565,4.1009,-0.037979,3.3325,7.4715e-05,1.644,3.7525,0.19157,4.7877,0.0045684,0.90412,1.0334,0.51949,0.42909,0.35751,0.1004,0.13432,0.23233,0.17443,0.043656,0.038691,0.27617,0.19611,0.089091,0.038932,0.00044798,7.1538,7.8216,3.1676,18.467,0.30047,0.28027,0.30047,0.43547,1.3261,0.31911,0.55892,0.15498,53,125.81,3350,2.3375e+05,5.832,38.369,90450,27081,21654,0.90984,0.92734,0.27807,0.2127,0.15998,0.65471,72070,30544,0.0014423,0.00047594,0,0.064758,0,0.053571,0.0054991,0.020719,0.0063558,0.025478,0.30399,0.34939,0.34028,0.18795,0.41099,0.28255,0.20949,0.49267,0.24947,0.22466,0.49034,0.24636,41.63,7.6289,23730,85083,84370,0.041045,0.034299,0.028275,0.28158,0.30838,0.10168,0.55557,0.60739,0.14149,0.7408,0.78085,0.15048,0.85235,0.87871,0.14799,0.0021827,0.0016107,0.029904,-0.0015963,0.015968,-0.03443,0.0052578,0.0039275,0.034081,-8.6002e-05,0.022246,-0.047307,0.010204,0.0077059,0.039223,0.0029842,0.029706,-0.060626,0.0013902,0.0010713,0.045112,0.0026239,0.018145,-0.022763,0.0028223,0.002215,0.042158,0.0025422,0.021388,-0.028258,0.0047475,0.0037601,0.04119,0.002791,0.025784,-0.033608,0.00048624,0.00033144,0.012786,-0.005573,0.0020493,-0.021432,0.0016123,0.0011426,0.02084,-0.0045314,0.0054556,-0.033045,0.0039114,0.0028479,0.030768,-0.0014467,0.0096542,-0.044238,0.00030626,0.00020802,0.073892,0.0044503,0.015333,-0.019853,0.00097313,0.00067483,0.074505,0.0062696,0.020058,-0.025785,0.001989,0.0014067,0.075722,0.00835,0.025206,-0.032297,0.46439,74,74,40,1054,3,3,3,0.645
30,-0.025744,0.90495,0.86294,-0.36911,0.86067,-0.38806,0.051345,0.11745,2.7315,0.0465,3.3457,5.8299e-05,3.1848,2.8342,1.2603,3.5623,0.0033991,0.36915,3.4728,2.4432,1.9755,1.6416,0.063747,0.057841,0.085076,0.068309,0.046643,0.043416,0.63497,0.18802,0.0027361,0.15661,0.40514,1.5611,1.3819,0.047627,3.7431,0.31131,0.23334,0.31131,0.95979,1.0334,0.34426,1.7506,1.5146,89,24.225,1184,16658,8.135,72.062,31968,7668,4374,0.92007,0.94427,0.13235,0.088416,0.097801,0.5518,20724,13574,0.00087301,0.00042642,0,0.053532,0,0.066569,0.017414,0.014591,0.034239,0.0034308,0.43223,0.63879,0.049707,0.19905,0.35351,0.25496,0.29372,0.35007,0.10949,0.30222,0.34217,0.10407,17.564,6.8839,10106,17074,15287,0.18102,0.172,0.056917,0.60292,0.62788,0.09937,0.78978,0.81245,0.091801,0.8692,0.88526,0.080588,0.91036,0.92082,0.072143,0.010689,0.010638,0.066841,0.027521,0.045073,-0.0023374,0.023127,0.023207,0.068422,0.037487,0.061966,0.0022795,0.040049,0.040089,0.070264,0.048147,0.078368,0.00084093,0.0061341,0.0060584,0.09085,0.026659,0.042475,-0.0045307,0.013334,0.013325,0.090911,0.035517,0.055725,-0.00036055,0.023702,0.023871,0.09386,0.046175,0.070184,0.0045584,0.0040924,0.0041875,0.049117,0.01274,0.017977,0.0071212,0.0089545,0.009333,0.052827,0.018414,0.026771,0.016905,0.015534,0.016026,0.055774,0.024389,0.034296,0.01614,0.00046256,0.00039229,0.050939,0.0058118,0.025077,-0.022042,0.0017442,0.0014728,0.06095,0.010349,0.035577,-0.031643,0.0035975,0.003051,0.062512,0.01384,0.045524,-0.03936,0.47026,74,74,40,1054,3,3,3,0.645
30,-0.013631,0.977,0.96964,0.17156,0.94042,0.14178,-0.17361,0.23175,3.0487,0.037286,3.3375,6.4612e-09,4.2734,2.7905,2.3409,3.4133,0.0032569,-0.17157,5.9683,4.1901,3.2827,2.5417,0.03273,0.041351,0.064846,0.049431,0.04104,0.049114,0.72149,0.000688,0.11594,0.4327,1.1906,1.7044,0.52531,0.14671,4.1163,0.23123,0.16757,0.23123,0.34276,0.73002,0.20999,3.3405,5.5679,101,12.95,413,2026,6.6143,55.758,11151,3780,2214,0.921,0.9459,0.020182,0.013283,0.02646,0.069388,19862,13190,0.00074908,0.00035391,0,0.069753,0,0.084919,0.077034,0.073538,0.18809,0.12835,0.82673,1.0031,0.34783,0.17728,0.3509,0.27596,0.23256,0.32734,0.16702,0.24512,0.3142,0.15508,15.806,7.451,6582.8,10466,9048.2,0.23467,0.24114,0.06114,0.52255,0.55777,0.071363,0.6642,0.68972,0.063972,0.78013,0.79416,0.059933,0.84672,0.85599,0.055599,0.020521,0.024958,0.10633,0.055057,0.068281,0.13301,0.04114,0.047624,0.10085,0.068481,0.085831,0.12488,0.063425,0.070989,0.092205,0.076627,0.09906,0.11213,0.014243,0.018178,0.1748,0.06293,0.068602,0.13783,0.026514,0.031902,0.14978,0.070826,0.078162,0.12516,0.038954,0.044859,0.12782,0.074387,0.08591,0.10816,0.0045998,0.0050686,0.045745,0.013688,0.024972,0.02978,0.010029,0.010861,0.049027,0.019592,0.03465,0.032566,0.016806,0.018,0.049999,0.024693,0.04146,0.034287,0.0016783,0.0017106,0.15314,0.025318,0.032266,0.004396,0.0050576,0.0052258,0.14644,0.033447,0.045201,0.00986,0.0088252,0.0091101,0.12707,0.036962,0.055678,0.011314,0.48193,74,74,40,1054,3,3,3,0.645
30,-0.012138,0.30294,0.28465,-0.84563,0.28462,-0.83752,-0.0095891,0.11267,2.8795,0.00050017,3.3457,4.1133e-05,1.8173,3.2722,0.30784,4.0896,0.0039023,0.84589,1.3261,0.70571,0.591,0.51309,0.11195,0.11763,0.18848,0.15961,0.043147,0.033039,0.34614,0.33186,0.07526,0.021104,0.0012089,5.471,8.5945,0.90386,15.399,0.090497,0.1767,0.1767,0.25756,0.41112,0.15629,0.71979,0.25732,61,91.607,3315,1.9025e+05,6.7522,49.615,89505,22464,10233,0.9143,0.93443,0.20961,0.14797,0.14,0.59045,47678,26985,0.00097181,0.00042927,0,0.043714,0,0.043472,0.0032157,0.021264,0.008057,0.02946,1.3025,0.67562,0.27167,0.18207,0.41294,0.26663,0.21218,0.49357,0.23185,0.22014,0.4986,0.23002,34.029,7.1991,11332,31380,29998,0.03874,0.029885,0.024052,0.26098,0.24548,0.084933,0.48958,0.49083,0.11237,0.67825,0.69061,0.12417,0.81931,0.82833,0.1282,0.005446,0.0047982,0.067245,0.01402,0.028541,-0.032436,0.010063,0.0091239,0.058785,0.014216,0.037139,-0.032462,0.016453,0.01539,0.056997,0.016512,0.047952,-0.028374,0.0044568,0.0040632,0.13034,0.025285,0.034378,-0.021878,0.008092,0.0076613,0.10894,0.026416,0.041607,-0.016501,0.01301,0.012838,0.10173,0.029998,0.052415,-0.0050986,0.00070048,0.00052668,0.016601,-0.0038957,0.004169,-0.024086,0.0014196,0.0010716,0.016537,-0.0050915,0.0069819,-0.031935,0.0023041,0.0017209,0.016335,-0.0063369,0.0093001,-0.041056,0.00028871,0.00020831,0.06278,0.0037671,0.018679,-0.025597,0.00096387,0.00070645,0.066508,0.0058369,0.025801,-0.032888,0.0019638,0.0014606,0.067381,0.0077303,0.03295,-0.04123,0.4846,74,74,40,1054,3,3,3,0.645
30,-0.014705,1.0134,0.9944,-0.068247,0.98517,-0.061674,-0.096322,0.15875,3.0093,0.0060031,3.3244,1.6206e-05,3.2891,2.4085,1.8613,2.9064,0.0027732,0.068261,5.5321,3.8539,2.8169,2.0586,0.039138,0.04483,0.064579,0.053212,0.056274,0.065308,0.67666,0.043489,0.028107,0.38693,0.71182,0.40133,0.069744,0.12951,1.7709,0.1983,0.18834,0.1983,0.7262,0.93372,0.28016,2.8875,4.1512,91,34.198,1259,21165,6.9312,55.399,33993,14877,6966,0.91659,0.93807,0.086644,0.061026,0.056414,0.36386,21470,13565,0.00079627,0.00038815,0,0.049626,0,0.061098,0.022947,0.018422,0.049338,0.0066666,0.58972,0.27973,1.0509,0.19818,0.35205,0.24237,0.2743,0.33369,0.11771,0.27876,0.32322,0.10291,14.813,6.5439,10954,24375,23261,0.23264,0.24541,0.099972,0.53301,0.55126,0.12006,0.68596,0.70536,0.10897,0.78359,0.79717,0.099293,0.84384,0.85071,0.091393,0.024106,0.036094,0.20602,0.08514,0.11156,0.26382,0.046407,0.066096,0.18764,0.1013,0.1319,0.28692,0.072176,0.097935,0.17307,0.1147,0.14888,0.2922,0.017636,0.02899,0.357,0.10205,0.13525,0.28601,0.032556,0.051288,0.30335,0.11414,0.15046,0.31962,0.049933,0.074868,0.27025,0.12604,0.16432,0.33331,0.0034509,0.0033742,0.056607,0.011503,0.017172,-0.0047289,0.008268,0.0081827,0.066665,0.019239,0.026049,-0.0030585,0.014918,0.014852,0.073201,0.027018,0.034774,-0.0016638,0.0030185,0.00373,0.45431,0.061145,0.066499,0.05153,0.0075284,0.0087787,0.35955,0.066262,0.074472,0.046288,0.012211,0.013713,0.28999,0.068038,0.080813,0.040166,0.55111,74,74,40,1054,3,3,3,0.645
30,-0.042395,1.0093,0.97052,-0.16899,0.92312,-0.20633,0.221,-0.20937,2.8275,-0.020591,3.3319,6.8093e-05,4.326,3.3544,1.66,4.2062,0.0040136,0.16902,5.879,4.1683,3.1947,2.3686,0.034491,0.036372,0.068683,0.048447,0.045213,0.058861,0.70793,0.0009701,0.3587,0.41311,1.4211,1.2762,0.26619,0.11155,3.8478,0.3149,0.48817,0.48817,0.70229,0.72729,0.25073,2.3509,2.7645,92,29.37,986,15867,5.8859,39.864,26622,15984,12150,0.9185,0.94009,0.059429,0.041265,0.019013,0.32748,26087,15001,0.0011254,0.00047117,0,0.090906,0,0.070712,0.020234,0.090995,0.038065,0.18942,1.2257,2.7366,1.5047,0.19879,0.34875,0.22971,0.27678,0.31575,0.087748,0.29755,0.30621,0.074671,12.99,6.2022,9190.8,18889,17970,0.25998,0.25682,0.10227,0.6273,0.6716,0.12935,0.75029,0.78042,0.10911,0.84714,0.86512,0.098265,0.90828,0.91765,0.090051,0.017601,0.018435,0.1377,0.056882,0.063803,0.021688,0.03443,0.035877,0.12744,0.06863,0.082864,0.024557,0.053139,0.05529,0.11664,0.076647,0.098884,0.028308,0.0089761,0.0098698,0.16632,0.046599,0.055866,0.032786,0.018382,0.020154,0.1568,0.058005,0.070824,0.041616,0.030218,0.033113,0.14971,0.068823,0.085217,0.050752,0.0071591,0.0072703,0.1075,0.029976,0.028684,0.0044328,0.013293,0.013426,0.098113,0.034839,0.037623,0.003522,0.019352,0.019229,0.086925,0.036667,0.04372,-0.00258,0.0014661,0.0012945,0.20199,0.026904,0.03736,-0.019132,0.0040702,0.0036769,0.17795,0.032406,0.049528,-0.020414,0.006893,0.0063807,0.14985,0.03446,0.059613,-0.018596,0.53548,74,74,40,1054,3,3,3,0.645
30,-0.019919,0.88058,0.84862,-0.38804,0.84609,-0.40923,0.054618,1.0048,7.4052,0.054739,3.297,0.00080528,6.4563,5.8337,1.2225,8.3673,0.007984,0.38809,3.5337,2.5167,1.9846,1.508,0.057663,0.060889,0.095561,0.064317,0.051115,0.064202,0.60625,0.16183,0.00030002,0.040601,0.50996,0.96862,0.18645,0.042763,1.9105,0.19054,0.41461,0.41461,0.36616,0.76064,0.26841,1.705,1.4269,28,246.89,4421,7.8896e+05,4.086,18.923,1.1937e+05,50598,7425,0.91034,0.92276,0.24933,0.19247,0.13388,0.58791,45103,21268,0.0021333,0.00088892,0,0.10446,0,0.065574,0.016014,0.061685,0.02288,0.072475,0.85183,0.072442,0.97441,0.22334,0.33582,0.19726,0.28858,0.30009,0.083593,0.30851,0.2887,0.074666,30.224,5.3261,19705,73720,73017,0.27666,0.25271,0.18746,0.70925,0.7381,0.25191,0.89974,0.92273,0.22538,0.96803,0.97698,0.19342,0.98455,0.9888,0.16814,0.011731,0.010134,0.15809,0.045968,0.046257,-0.040727,0.025241,0.022204,0.16093,0.062122,0.063054,-0.047989,0.042183,0.037203,0.15949,0.076227,0.078248,-0.058086,0.0038745,0.0030025,0.12366,0.021924,0.029007,-0.037861,0.0085114,0.0068035,0.12505,0.029636,0.038355,-0.047101,0.015157,0.012402,0.12935,0.038822,0.049178,-0.054135,0.0067652,0.0060204,0.17498,0.036962,0.029496,-0.025356,0.014612,0.013246,0.18578,0.051769,0.041284,-0.027864,0.023403,0.021339,0.18108,0.06157,0.049666,-0.031326,0.0010917,0.0011112,0.25908,0.02551,0.032247,0.0018594,0.0031126,0.0031339,0.2344,0.031516,0.041776,0.0010263,0.0063443,0.006178,0.23757,0.041386,0.052669,-0.0052237,0.46081,74,74,40,1054,3,3,3,0.645
30,-0.046387,0.84892,0.79475,-0.45221,0.76022,-0.54647,0.20844,0.17484,3.1407,0.0040254,3.34,1.6704e-06,3.4307,3.2764,1.0943,4.0532,0.0038602,0.45225,3.0739,2.3319,1.9106,1.5413,0.074759,0.064746,0.093161,0.055594,0.044177,0.05078,0.61678,0.2393,0.00028973,0.12186,1.2792,2.3057,0.90355,0.02263,4.8726,0.42928,0.25016,0.42928,0.7631,1.2336,0.34371,1.5663,1.2241,83,32.542,1682,34207,8.5224,75.852,45414,5427,4536,0.91928,0.94234,0.1322,0.08925,0.10105,0.50407,23416,14142,0.00076829,0.00040223,0,0.048158,0,0.054865,0.010127,0.011899,0.024496,0.0046453,0.40125,0.026223,0.22144,0.19076,0.3602,0.25378,0.26449,0.36025,0.14156,0.27226,0.36147,0.13297,15.726,6.8519,11352,20588,19576,0.19565,0.18936,0.069402,0.55616,0.57183,0.10341,0.76423,0.7845,0.10022,0.86775,0.88065,0.090766,0.92055,0.929,0.0823,0.0094418,0.010026,0.066609,0.024805,0.042488,0.025685,0.020517,0.02186,0.068479,0.034026,0.058447,0.036097,0.034156,0.036059,0.067606,0.041503,0.072219,0.037508,0.0068562,0.0075582,0.11456,0.032375,0.044097,0.034855,0.013884,0.01529,0.10679,0.039641,0.056674,0.045216,0.023026,0.024978,0.10287,0.047417,0.07002,0.046667,0.0013327,0.0011049,0.018045,0.000145,0.010468,-0.026583,0.0029056,0.0024648,0.019339,0.00079255,0.01448,-0.030834,0.0048657,0.0041675,0.019709,0.0011842,0.01682,-0.035573,0.001253,0.001363,0.15567,0.021415,0.035342,0.017205,0.0039199,0.0042676,0.15454,0.029467,0.048042,0.022711,0.0071921,0.0077039,0.14099,0.034323,0.057933,0.022306,0.4922,74,74,40,1054,3,3,3,0.645
