30,-0.00025262,0.14027,0.14041,-0.92707,0.13959,-0.99815,0.076671,-4.7297,42.366,-0.037256,2.6558,0.028761,8.4309,22.126,0.14492,48.342,0.04604,0.92744,0.93507,0.65772,0.50524,0.39349,0.18452,0.15263,0.15898,0.090155,0.06372,0.05555,0.29444,0.51778,0.17429,0.0092988,0.66492,2.0638,2.2527,2.0713,7.754,0.17212,0.27924,0.27924,0.4179,0.41969,0.23637,0.48918,0.17069,47,139.68,2754,3.0937e+05,4.3806,20.594,74358,72954,12042,0.91154,0.92541,0.22301,0.1704,0.12347,0.59885,46363,22319,0.0012123,0.00058524,1,0.18426,0,0.07803,0.12226,0.1927,0.16117,0.24317,1.2055,0.42065,0.48382,0.22018,0.35117,0.27525,0.27007,0.35064,0.21688,0.25357,0.36701,0.22764,22.217,7.4318,12498,43652,42384,0.17003,0.15622,0.10814,0.43573,0.4184,0.14435,0.60223,0.5861,0.14054,0.72118,0.71682,0.13412,0.80246,0.80812,0.12708,0.01433,0.016386,0.19536,0.05995,0.081335,0.048445,0.0303,0.034973,0.19678,0.079237,0.10839,0.068403,0.050449,0.059206,0.19643,0.097398,0.13501,0.095309,0.0038578,0.003704,0.10271,0.018837,0.039462,-0.0076263,0.0093506,0.0088024,0.11548,0.029334,0.05292,-0.014916,0.016857,0.015661,0.12229,0.039369,0.066172,-0.02278,0.0098742,0.01227,0.31443,0.065951,0.07436,0.066536,0.020203,0.025758,0.32342,0.087329,0.10134,0.097435,0.032613,0.043211,0.32628,0.10672,0.12767,0.13991,0.00059841,0.0004115,0.13633,0.012001,0.018377,-0.02868,0.001984,0.0014036,0.1437,0.017776,0.02816,-0.036263,0.0041918,0.0030648,0.15068,0.024459,0.039211,-0.043964,0.50839,74,74,40,1054,3,3,3,0.645
30,-0.0089057,0.38939,0.39203,-0.77949,0.37212,-0.95514,0.22534,0.24159,5.9516,0.032283,3.1488,0.0036753,4.282,6.4449,0.4406,11.203,0.01068,0.77949,1.8717,1.2579,0.93439,0.6791,0.093094,0.1009,0.14624,0.095831,0.074969,0.079562,0.4094,0.3312,0.096781,0.0067006,0.11584,0.36123,0.11922,0.1406,1.1716,0.4671,0.20916,0.4671,0.75171,1.5539,0.48166,0.87847,0.36942,34,237.06,3696,7.0362e+05,3.7107,14.942,99792,91422,9153,0.91038,0.92496,0.25881,0.19682,0.14666,0.5915,40831,21887,0.0018052,0.00089888,0,0.049931,0,0.040596,0.0011233,0.015903,5.9261e-05,0.012746,1.1735,0.26912,1.4139,0.23703,0.31785,0.21121,0.27695,0.29209,0.11823,0.29051,0.27472,0.098459,18.282,5.7028,15143,61025,60204,0.2906,0.28848,0.22741,0.72936,0.78323,0.29731,0.87076,0.90344,0.25003,0.92213,0.94236,0.21101,0.95241,0.96435,0.18559,0.012873,0.013903,0.21592,0.058618,0.078479,0.026965,0.027633,0.029259,0.22081,0.078941,0.1012,0.026036,0.046074,0.047918,0.22073,0.097198,0.12132,0.021735,0.0085124,0.010065,0.27884,0.057923,0.07817,0.047984,0.017235,0.020031,0.26189,0.070927,0.093345,0.055351,0.027931,0.031556,0.24932,0.082998,0.10644,0.053886,0.0039544,0.0035351,0.15493,0.02436,0.029447,-0.02114,0.0094236,0.0085173,0.18562,0.039592,0.044613,-0.025211,0.016739,0.015402,0.20605,0.054624,0.059199,-0.026191,0.000406,0.00030285,0.11381,0.0077296,0.01924,-0.023213,0.0015526,0.0012006,0.13837,0.014239,0.028203,-0.028172,0.0035412,0.0028482,0.15663,0.021852,0.038296,-0.031679,0.57928,74,74,40,1054,3,3,3,0.645
30,-0.011294,0.48581,0.50428,-0.70373,0.44081,-0.9534,0.35477,0.91755,5.2191,0.035079,3.2439,0.00092131,4.4704,5.8073,0.59145,9.6849,0.0092413,0.70392,2.7918,1.4467,1.0122,0.66896,0.04083,0.05752,0.15707,0.14662,0.089262,0.10335,0.40534,0.01057,0.01147,0.04077,0.039679,0.041392,0.0026056,0.069825,0.21631,0.044941,0.16191,0.16191,0.15638,0.18724,0.1118,1.0476,0.54957,120,36.925,2641,60682,9.9191,103.95,71307,16389,5886,0.91423,0.93048,0.2278,0.19599,0.10581,0.53965,25476,14544,0.0011447,0.00044892,2,0.27963,0,0.061349,0.068296,0.47252,0.083504,0.56855,0.91974,2.4644,1.642,0.22541,0.32054,0.24227,0.27903,0.32597,0.15361,0.25767,0.26989,0.16859,21.091,6.5413,52469,2.8451e+05,2.8416e+05,0.18389,0.17745,0.10302,0.41727,0.42384,0.12177,0.57312,0.61681,0.11782,0.67788,0.73708,0.11106,0.75573,0.80989,0.10543,0.022197,0.018283,0.26655,0.093098,0.064872,-0.034379,0.043952,0.035764,0.25145,0.11425,0.080396,-0.046338,0.067923,0.054904,0.23297,0.12907,0.093291,-0.056961,0.017023,0.014493,0.39923,0.10555,0.067747,-0.024643,0.031449,0.026379,0.34213,0.11769,0.076565,-0.032916,0.046553,0.03875,0.29751,0.12521,0.084042,-0.040177,0.0031643,0.0022216,0.088761,0.014982,0.017007,-0.022077,0.0067247,0.0047616,0.094832,0.021162,0.023093,-0.028474,0.01092,0.0077535,0.096239,0.026151,0.028092,-0.033713,0.002009,0.0015683,0.40318,0.045986,0.030262,-0.016842,0.0063126,0.0049762,0.40277,0.063534,0.04237,-0.021754,0.012049,0.0094468,0.38154,0.077595,0.053513,-0.027727,0.61267,74,74,40,1054,3,3,3,0.645
30,-0.0073179,0.2103,0.22585,-0.87974,0.17709,-1.2885,0.46462,0.1451,3.7533,0.026793,3.318,5.7443e-05,2.2089,4.5159,0.2388,5.8836,0.0056142,0.8804,1.3333,0.70663,0.49337,0.34101,0.072588,0.099154,0.23244,0.16408,0.087247,0.079329,0.26515,0.12914,0.041892,0.10044,0.0088746,0.31509,0.31758,2.0798,2.9928,0.10003,0.13708,0.13708,0.9382,1.4044,0.43062,0.62961,0.19615,55,64.273,2991,1.6114e+05,7.1587,52.503,80757,4104,2943,0.91576,0.93622,0.27833,0.22388,0.12194,0.82789,42261,17459,0.0017221,0.00048384,0,0.042615,0,0.053588,0.014686,0.024817,0.022954,0.034133,0.68443,2.5161,2.0872,0.22887,0.32516,0.24947,0.28706,0.31138,0.12063,0.28973,0.28396,0.086798,36.992,6.7357,31717,93109,92678,0.18673,0.2027,0.070986,0.50897,0.56834,0.10079,0.69334,0.76629,0.096714,0.78022,0.84902,0.086729,0.83239,0.89072,0.078793,0.064497,0.11078,0.52553,0.2392,0.31807,0.42841,0.12937,0.20812,0.50219,0.29897,0.37507,0.48033,0.2038,0.30925,0.47429,0.34701,0.41413,0.50938,0.04679,0.092076,0.74456,0.2495,0.36852,0.47509,0.090472,0.16762,0.66783,0.29404,0.41059,0.53958,0.14016,0.2437,0.60779,0.33095,0.43658,0.57119,0.01245,0.011514,0.23696,0.065374,0.055398,-0.019964,0.027598,0.026506,0.26407,0.094345,0.0808,-0.013602,0.045701,0.045366,0.27328,0.11846,0.10297,-0.0030744,0.0052568,0.0071849,0.71581,0.10329,0.11311,0.074719,0.015379,0.019355,0.66579,0.1326,0.13611,0.070943,0.028605,0.034161,0.6146,0.15809,0.15721,0.065916,0.39171,74,74,40,1054,3,3,3,0.645
30,-0.001533,0.56049,0.56044,-0.66259,0.55598,-0.60352,-0.089149,-0.39545,5.7296,0.056229,3.2588,0.00085551,3.3635,4.094,0.67369,5.7234,0.0054561,0.66276,2.3499,1.5047,1.1194,0.84636,0.06504,0.10482,0.11922,0.10209,0.073559,0.070718,0.46456,0.20576,0.15742,0.0018012,0.01677,0.21121,0.12691,0.0077994,0.72767,0.046431,0.089368,0.089368,0.30395,0.37036,0.19114,1.1471,0.57241,26,269.92,6897,1.8218e+06,4.7988,24.033,1.8622e+05,2295,972,0.90728,0.9187,0.48775,0.39733,0.26498,0.95057,1.092e+05,46719,0.00083747,0.00040232,1,0.15335,0,0.09529,0.0010355,0.071404,0.0011906,0.085599,1.0564,0.48491,0.22282,0.17953,0.36831,0.36337,0.16207,0.37953,0.42989,0.16168,0.39451,0.42396,116.65,9.811,29433,1.1055e+05,1.0989e+05,0.016153,0.010381,0.010679,0.11945,0.10875,0.041137,0.30786,0.32675,0.074684,0.50509,0.552,0.097646,0.67952,0.73395,0.11187,0.0011853,0.00077512,0.016796,-0.0060775,0.015291,-0.030734,0.002113,0.0014231,0.014265,-0.0091605,0.018473,-0.035422,0.0034514,0.0025346,0.013969,-0.011457,0.02223,-0.037304,0.0011853,0.00077512,0.032802,-0.00021837,0.019126,-0.030734,0.002113,0.0014231,0.027127,-0.0022535,0.021508,-0.035422,0.0034514,0.0025346,0.026028,-0.0032672,0.02466,-0.037304,0,0,0,-0.007718,0.0011341,0,0,0,0,-0.0099041,0.0025076,0,0,0,0,-0.011985,0.0037009,0,0,0,0,-0.0038101,0.0056368,0,0,0,0,-0.0052697,0.007996,0,0,0,0,-0.0068231,0.010578,0,0.36343,74,74,40,1054,3,3,3,0.645
30,-0.002298,0.11025,0.11286,-0.94182,0.10313,-1.2185,0.29372,-0.13077,2.673,-0.034109,3.3474,9.1871e-05,1.6565,4.8616,0.11588,6.3513,0.0060546,0.94199,0.87226,0.48561,0.36492,0.28959,0.15645,0.1456,0.22516,0.14107,0.060403,0.043433,0.22789,0.41623,0.11326,0.023353,0.06613,2.8924,5.5667,5.7582,14.836,0.13457,0.062397,0.13457,0.98551,1.6097,0.49363,0.43071,0.090827,50,127.82,3053,2.3537e+05,4.9452,28.174,82431,41094,24003,0.90889,0.92422,0.37878,0.29878,0.21484,0.81626,76822,34445,0.0012871,0.00056358,0,0.046464,0,0.040297,0.0041352,0.0075967,0.0027518,0.010093,0.43276,1.1364,0.39534,0.21676,0.41367,0.2502,0.2451,0.48688,0.18796,0.24145,0.50315,0.19115,48.085,6.7553,14954,56535,55461,0.05859,0.043051,0.039666,0.34411,0.34023,0.12135,0.6368,0.66773,0.15819,0.81084,0.84658,0.16052,0.90297,0.92643,0.15222,0.0066757,0.0047545,0.096873,0.022279,0.041351,-0.066887,0.014913,0.010786,0.1031,0.032102,0.054832,-0.087004,0.025722,0.018846,0.10661,0.041569,0.066894,-0.10341,0.0041002,0.0028956,0.1162,0.02124,0.035742,-0.052053,0.008155,0.0057898,0.10721,0.024916,0.042452,-0.065002,0.012828,0.0091317,0.099064,0.027447,0.04825,-0.076167,0.0022593,0.001668,0.076582,0.0095602,0.018431,-0.035688,0.0056063,0.0042837,0.095537,0.017786,0.027731,-0.046466,0.010566,0.0082299,0.11253,0.027508,0.037007,-0.055885,0.0003162,0.00019085,0.076681,0.0047307,0.019926,-0.029226,0.0012806,0.00080366,0.098738,0.0099596,0.025908,-0.039776,0.0028402,0.0018571,0.10868,0.01489,0.031806,-0.046729,0.41659,74,74,40,1054,3,3,3,0.645
30,-0.0028189,0.077083,0.079961,-0.95915,0.068588,-1.3209,0.37713,-0.0043513,2.7427,-0.012922,3.3559,0.00010196,1.208,4.2267,0.081524,5.3835,0.005132,0.9592,0.65367,0.39028,0.28882,0.23032,0.15439,0.21038,0.23589,0.11574,0.057207,0.037275,0.18913,0.36985,0.2455,0.014858,0.43864,4.4399,11.035,12.353,28.897,0.07229,0.049084,0.07229,0.88422,1.0062,0.28581,0.36082,0.062965,38,167.71,3069,3.9117e+05,4.008,17.516,82863,66555,11367,0.9075,0.92057,0.36591,0.30018,0.173,0.79993,74814,33927,0.0015898,0.00059904,0,0.082176,0,0.06282,0.00086044,0.0087961,0.0009059,0.0047497,0.58539,1.0323,0.10286,0.22442,0.41082,0.2476,0.25227,0.47641,0.18846,0.2584,0.48549,0.18838,54.663,6.6853,31907,1.385e+05,1.379e+05,0.067084,0.055662,0.042358,0.35276,0.37577,0.11602,0.64142,0.6907,0.14861,0.82192,0.86002,0.15176,0.90833,0.93094,0.14282,0.0094137,0.0064516,0.12741,0.035167,0.040638,-0.068003,0.018598,0.013204,0.11991,0.042455,0.052221,-0.080458,0.030781,0.022538,0.11899,0.051746,0.065051,-0.093158,0.0074787,0.0052571,0.19767,0.044482,0.044147,-0.058093,0.014909,0.010834,0.1828,0.053358,0.053517,-0.067803,0.024359,0.018251,0.17545,0.062957,0.063883,-0.076885,0.001904,0.0011767,0.060194,0.0065864,0.011581,-0.037567,0.0038505,0.0024559,0.061198,0.0087542,0.016977,-0.04455,0.0062703,0.0041782,0.06228,0.010988,0.022078,-0.050942,3.1007e-05,1.7752e-05,0.007013,-0.0029083,0.0093837,-0.016332,0.00031916,0.00018407,0.02295,-0.0014693,0.016204,-0.027948,0.0010878,0.0006303,0.03882,0.0013893,0.023753,-0.034268,0.4065,74,74,40,1054,3,3,3,0.645
30,-0.013829,0.22497,0.22749,-0.8788,0.19437,-1.2141,0.38157,-0.05448,2.6309,-0.0056332,3.3764,0.00038275,6.8411,13.889,0.24216,19.339,0.018436,0.8788,1.5089,0.67599,0.55209,0.46135,0.080268,0.10956,0.18712,0.2052,0.049344,0.041446,0.32706,0.081091,0.015915,0.00076656,0.013426,5.7164,6.9599,2.0284,14.816,0.1289,0.16419,0.16419,0.38124,0.39734,0.1914,0.63849,0.19973,41,150.05,4523,5.068e+05,5.8052,35.905,1.2212e+05,21492,12744,0.90593,0.9192,0.30741,0.25664,0.10945,0.67439,94467,29880,0.00097049,0.00050104,0,0.081519,0,0.050272,0.0056665,0.020185,0.010613,0.020809,0.64833,0.60358,0.26282,0.19079,0.39855,0.30788,0.1955,0.45875,0.29304,0.17375,0.44982,0.34055,48.629,8.3128,31002,1.5532e+05,1.5467e+05,0.034231,0.020398,0.021448,0.23775,0.19605,0.077599,0.47264,0.44745,0.10867,0.67516,0.69004,0.1237,0.82627,0.85564,0.12892,0.0067871,0.0062575,0.091153,0.021959,0.041245,-0.015317,0.018282,0.018281,0.11697,0.041306,0.064754,-2.0538e-05,0.036125,0.038163,0.13857,0.063798,0.090829,0.020747,0.0054312,0.0053975,0.14245,0.029822,0.043589,-0.0010749,0.013748,0.015116,0.16727,0.048125,0.066126,0.023631,0.025436,0.030094,0.1818,0.066101,0.089986,0.054804,0.0011432,0.00070272,0.035863,0.0009391,0.01154,-0.030627,0.0033744,0.0021964,0.053219,0.0064501,0.018766,-0.042781,0.0074714,0.0051582,0.07364,0.015273,0.026757,-0.05301,0.00021279,0.00015731,0.047758,0.0018465,0.014771,-0.015491,0.0011839,0.00098193,0.084478,0.0084584,0.022512,-0.015401,0.0034742,0.0030958,0.12304,0.01898,0.033968,-0.013611,0.47913,74,74,40,1054,3,3,3,0.645
30,-0.0064424,0.10557,0.11418,-0.94112,0.083851,-1.4262,0.51539,0.22505,2.5983,0.046037,3.3525,0.00030021,2.1907,6.3853,0.11748,8.2663,0.0078802,0.9412,0.77179,0.37614,0.28148,0.21949,0.12443,0.155,0.27108,0.16744,0.055391,0.040928,0.18573,0.31534,0.13321,0.080182,0.0034422,3.7351,7.0065,10.392,21.666,0.083301,0.09041,0.09041,0.96929,1.3783,0.36469,0.43332,0.092176,25,478.6,11818,5.5703e+06,4.6945,23.039,3.1909e+05,1809,1485,0.90887,0.9241,0.43917,0.3387,0.28596,0.77005,68710,39870,0.0013729,0.00064866,0,0.056045,0,0.050191,0.00021683,0.011982,0.0013447,0.018015,0.55096,1.6206,0.72229,0.21832,0.43078,0.24548,0.23975,0.4877,0.20263,0.241,0.50871,0.19531,46.363,6.628,12296,63537,62522,0.061561,0.048836,0.068025,0.29627,0.29374,0.17053,0.53975,0.56742,0.21885,0.72062,0.75709,0.23284,0.83229,0.86375,0.22901,0.0053711,0.0039016,0.12721,0.020059,0.036789,-0.062892,0.013486,0.01024,0.15217,0.035521,0.052887,-0.080909,0.026123,0.020511,0.17671,0.054951,0.071148,-0.093968,0.0037409,0.0027469,0.17303,0.024029,0.035493,-0.049377,0.0088621,0.0068982,0.19015,0.036309,0.048227,-0.059347,0.017019,0.013842,0.21451,0.053228,0.064212,-0.065473,0.001036,0.0006868,0.057317,0.00019816,0.012162,-0.034024,0.0026364,0.001824,0.073326,0.0039442,0.017601,-0.045777,0.0051423,0.0037149,0.089384,0.0092514,0.022731,-0.052562,0.00059413,0.00046783,0.23516,0.015867,0.019067,-0.020804,0.0020203,0.0015372,0.25423,0.024285,0.028169,-0.032623,0.0041188,0.0030514,0.25724,0.03192,0.036779,-0.045258,0.53847,74,74,40,1054,3,3,3,0.645
30,-0.00086849,0.24282,0.24269,-0.87011,0.24161,-0.92795,0.066474,-0.39577,3.6477,-0.056661,3.3226,2.9962e-05,3.5464,6.9549,0.25952,9.9342,0.0094792,0.87012,1.3677,0.82716,0.63507,0.48927,0.11701,0.11722,0.18007,0.12669,0.065195,0.060706,0.33311,0.36263,0.10133,0.020102,0.022808,1.2007,1.1249,0.89008,3.7225,0.19986,0.10176,0.19986,0.97425,1.209,0.44273,0.65603,0.20811,67,45.582,1896,53831,7.5973,60.638,51192,6102,4482,0.9192,0.93898,0.11537,0.084022,0.030984,0.43244,73809,19597,0.00058735,0.00030835,0,0.071169,0,0.064645,0.02067,0.048592,0.03086,0.082573,0.5658,0.079722,0.58612,0.2207,0.38719,0.25546,0.27136,0.43498,0.18316,0.28195,0.43969,0.18124,30.799,6.8975,25738,53855,52917,0.085442,0.070428,0.030602,0.29942,0.2668,0.055862,0.52769,0.51348,0.069349,0.70183,0.71706,0.073504,0.81984,0.84623,0.073117,0.0098379,0.0098546,0.075525,0.027882,0.049272,0.00046295,0.018218,0.018069,0.066628,0.030861,0.062349,-0.0028297,0.028442,0.02755,0.062364,0.034668,0.074685,-0.01325,0.00062818,0.00054813,0.009418,-0.0031181,0.021208,-0.0093959,0.001983,0.0017329,0.013791,-0.0020677,0.028757,-0.01786,0.0056147,0.0049125,0.022939,0.0027323,0.038798,-0.028394,0.0091498,0.0092635,0.16408,0.045116,0.046699,0.0032405,0.016088,0.016229,0.14504,0.050337,0.057593,0.0027822,0.022706,0.022563,0.12792,0.052692,0.064717,-0.0022741,5.9918e-05,4.2985e-05,0.0076871,-0.0016085,0.015251,-0.013393,0.00021017,0.00015114,0.0085726,-0.0020376,0.019961,-0.015279,0.00054892,0.00040225,0.011112,-0.0019438,0.025947,-0.020214,0.42283,74,74,40,1054,3,3,3,0.645
30,-0.0026818,0.41313,0.41286,-0.766,0.40672,-0.85941,0.12196,0.64717,5.6026,0.058256,3.1862,0.0025569,5.1337,7.5011,0.46751,11.726,0.011179,0.76602,2.1034,1.3769,0.99717,0.67989,0.092688,0.096635,0.12309,0.099925,0.081143,0.095937,0.41058,0.3227,0.073083,0.0084157,0.068756,0.20445,0.013435,0.12954,0.82038,0.28371,0.2311,0.28371,0.92859,1.5753,0.56483,0.90449,0.36963,38,194.74,4259,6.1339e+05,4.4273,21.759,1.1499e+05,66474,7830,0.91622,0.93514,0.11726,0.082233,0.086501,0.35977,40478,21841,0.0013306,0.00071052,0,0.046778,0,0.052218,0.0036161,0.00084988,0.010411,0.011618,0.83739,0.38707,1.1976,0.22959,0.33912,0.21941,0.2758,0.32166,0.10194,0.29171,0.31368,0.088968,15.265,5.9241,8037.6,25210,23297,0.28888,0.28403,0.20802,0.6822,0.7204,0.25589,0.83662,0.86387,0.22106,0.90591,0.92406,0.19075,0.95414,0.96443,0.17108,0.0084265,0.0077647,0.13006,0.032364,0.054259,-0.028783,0.019758,0.018565,0.14528,0.049315,0.076441,-0.030545,0.034936,0.033105,0.15401,0.06563,0.096979,-0.033062,0.0050798,0.0048351,0.15312,0.029378,0.047394,-0.014356,0.01296,0.012602,0.18121,0.048055,0.067024,-0.011524,0.02387,0.023456,0.19606,0.065731,0.085878,-0.0090967,0.0021741,0.0018978,0.078385,0.0091947,0.02041,-0.023801,0.0051036,0.0044474,0.092502,0.015789,0.029588,-0.032083,0.0089686,0.0077883,0.10159,0.022213,0.037591,-0.0412,0.0011725,0.0010319,0.30243,0.028897,0.037659,-0.018627,0.0032849,0.0028605,0.26938,0.034997,0.048322,-0.027867,0.0061508,0.0052981,0.25033,0.041605,0.058972,-0.036417,0.57515,74,74,40,1054,3,3,3,0.645
30,-0.0050332,0.085061,0.093955,-0.95182,0.064717,-1.4828,0.55784,0.18245,2.3926,0.015153,3.3708,0.00042682,0.98327,3.1705,0.095998,4.0053,0.0038218,0.95195,0.72532,0.34797,0.2592,0.19047,0.14264,0.17734,0.24079,0.16953,0.054644,0.047902,0.16717,0.34358,0.1982,0.032035,0.012045,4.7408,5.1435,15.06,25.53,0.058625,0.11688,0.11688,0.42207,0.61348,0.24699,0.39068,0.075778,34,280.79,4713,9.273e+05,3.702,15.922,1.2725e+05,82242,37827,0.89939,0.90966,0.3709,0.29459,0.18077,0.70776,81309,45607,0.0014577,0.00058303,0,0.068691,0,0.05906,1.7705e-05,0.0047243,1.2007e-05,0.00085538,0.2499,0.83415,0.22011,0.2173,0.43094,0.25405,0.23095,0.49099,0.22468,0.23663,0.50739,0.2163,55.344,6.8594,15939,84329,83362,0.045642,0.0331,0.04182,0.27698,0.26475,0.1322,0.54094,0.55223,0.18187,0.72948,0.75344,0.19545,0.85642,0.88212,0.1954,0.0043727,0.0030523,0.085877,0.012121,0.025864,-0.056837,0.0096942,0.0071248,0.090702,0.017834,0.035861,-0.066973,0.017135,0.013292,0.096117,0.024666,0.04682,-0.072274,0.0042374,0.0029753,0.16252,0.02605,0.03303,-0.054682,0.0090085,0.0066923,0.16028,0.033668,0.041571,-0.061577,0.015049,0.011835,0.15729,0.040662,0.050859,-0.063204,8.7005e-05,5.164e-05,0.0039914,-0.0083643,0.00068864,-0.023156,0.00056322,0.00036722,0.01299,-0.0084674,0.0040575,-0.030003,0.0018101,0.0013064,0.026089,-0.0062544,0.0087596,-0.03379,4.8303e-05,2.5434e-05,0.015853,-0.00298,0.011373,-0.010384,0.00012272,6.5418e-05,0.012805,-0.00453,0.013872,-0.01384,0.00028905,0.00015746,0.014969,-0.0054899,0.016527,-0.022605,0.476,74,74,40,1054,3,3,3,0.645
30,-0.0033601,0.48358,0.48529,-0.71711,0.47642,-0.81408,0.13522,1.2329,6.0892,0.14777,3.0697,0.0039803,4.3265,5.7497,0.56516,11.105,0.010596,0.71714,2.3596,1.4198,1.019,0.74693,0.07701,0.086834,0.13031,0.11617,0.082448,0.077529,0.4297,0.26992,0.071083,0.0020004,0.0007436,0.10167,0.072815,0.042137,0.56037,0.32228,0.21999,0.32228,0.94533,1.273,0.62538,1.0157,0.50129,36,212.72,5082,7.903e+05,4.8885,26.428,1.3721e+05,51246,7074,0.91173,0.92421,0.17151,0.12763,0.1069,0.41887,32361,18370,0.0015693,0.0007256,0,0.073691,0,0.055285,0.00091918,0.026827,0.00054732,0.03865,0.4146,0.38111,0.048801,0.22978,0.32918,0.2122,0.2629,0.30715,0.1101,0.2798,0.29858,0.09454,20,5.7293,14519,54663,53807,0.29553,0.29443,0.22355,0.67647,0.71375,0.26655,0.85028,0.88577,0.23601,0.9115,0.93518,0.20162,0.94329,0.95913,0.17768,0.011513,0.01131,0.18667,0.050133,0.067426,-0.0058807,0.022881,0.022363,0.17674,0.061286,0.083358,-0.0096432,0.035729,0.034575,0.16546,0.069335,0.095978,-0.016471,0.0024753,0.0018626,0.078378,0.0098266,0.030818,-0.040139,0.00534,0.0040645,0.078436,0.01297,0.037641,-0.050336,0.0089059,0.0068433,0.076844,0.015447,0.043674,-0.059862,0.0085329,0.0090655,0.32317,0.061228,0.062487,0.017792,0.016511,0.01744,0.31436,0.07614,0.078396,0.019977,0.024606,0.025837,0.29279,0.084933,0.088884,0.020633,0.00050478,0.00038184,0.13677,0.010436,0.01925,-0.026555,0.0019867,0.0015798,0.17115,0.019482,0.029213,-0.031144,0.0044884,0.003662,0.1919,0.02917,0.040501,-0.036113,0.57141,74,74,40,1054,3,3,3,0.645
30,-0.0053246,0.3206,0.33032,-0.81815,0.29788,-1.0746,0.31341,0.22062,1.9959,0.12138,3.3456,0.0014813,2.8649,4.7489,0.36324,7.0763,0.0067522,0.8182,1.8131,0.97691,0.67548,0.49047,0.062479,0.095888,0.19173,0.15162,0.091762,0.074704,0.33182,0.13764,0.075201,0.082273,0.019353,0.08908,0.20447,0.51261,1.1206,0.041009,0.075637,0.075637,0.36434,0.5113,0.18788,0.79432,0.31374,107,37.262,2167,45801,9.246,91.408,58509,11070,8235,0.91861,0.93377,0.042913,0.03147,0.0059537,0.19379,16538,11232,0.00071655,0.00035346,0,0.087018,0,0.077682,0.045589,0.16082,0.069683,0.22978,0.5227,1.1201,0.60481,0.22024,0.33685,0.26033,0.25681,0.31548,0.20453,0.25325,0.30503,0.20083,11.975,7.0288,11663,30864,29851,0.17949,0.1912,0.088127,0.37982,0.39168,0.097139,0.50265,0.50521,0.090556,0.60757,0.60392,0.087228,0.69238,0.69107,0.084648,0.021914,0.023439,0.23062,0.085754,0.09456,0.029624,0.041514,0.043606,0.20813,0.10008,0.11405,0.026962,0.063238,0.065411,0.19008,0.11113,0.12958,0.021987,0.012755,0.013974,0.26213,0.071999,0.080984,0.030477,0.023404,0.025136,0.22313,0.079287,0.091788,0.029131,0.035497,0.037324,0.1988,0.086269,0.10131,0.024279,0.0074603,0.0077805,0.18339,0.041995,0.045018,0.010724,0.014186,0.014775,0.17531,0.051142,0.057877,0.012634,0.020962,0.021723,0.16189,0.056363,0.066213,0.012806,0.0016992,0.0016843,0.29884,0.035841,0.038206,-0.0013484,0.0053136,0.0053107,0.29711,0.049258,0.053101,-0.00011799,0.010363,0.010349,0.28759,0.061546,0.067647,-0.00038142,0.65894,74,74,40,1054,3,3,3,0.645
30,-0.0045735,0.43064,0.43626,-0.75055,0.41373,-0.92111,0.22724,0.14191,2.5263,-0.0073853,3.3524,0.00031784,3.143,4.4478,0.49839,6.369,0.0060773,0.75056,2.0826,1.2336,0.85896,0.65052,0.056114,0.081285,0.17419,0.12564,0.091943,0.069223,0.40161,0.10496,0.03146,0.069517,0.0012311,0.052239,0.22558,0.10803,0.59301,0.045522,0.081399,0.081399,0.27848,0.28853,0.12486,0.94625,0.44801,99,22.96,598,6563,5.1379,31.873,16146,12366,7236,0.92099,0.94036,0.10941,0.077797,0.062084,0.42739,19534,11683,0.00072549,0.00034417,0,0.073154,0,0.081054,0.0053042,0.051765,0.022371,0.082232,0.19868,0.13309,0.43585,0.21633,0.34408,0.26079,0.26374,0.3478,0.14454,0.26456,0.33133,0.13884,15.83,7.0413,19676,39330,38585,0.17516,0.16778,0.06264,0.39799,0.39169,0.07414,0.53551,0.5441,0.070271,0.64918,0.6672,0.067888,0.74329,0.76212,0.06619,0.022776,0.02886,0.17458,0.07615,0.10136,0.12896,0.043685,0.053055,0.15953,0.090173,0.12204,0.13114,0.066783,0.078327,0.14621,0.10061,0.13849,0.12574,0.021162,0.027422,0.31679,0.10585,0.11964,0.1353,0.039008,0.048811,0.27088,0.11806,0.134,0.14285,0.057931,0.070275,0.23632,0.12641,0.14566,0.14211,0.00048455,0.00037664,0.008676,-0.002946,0.015282,-0.018588,0.0012895,0.001041,0.011607,-0.002616,0.02246,-0.022998,0.0027324,0.0022268,0.015371,-0.0013563,0.028615,-0.030175,0.0011294,0.0010614,0.14468,0.019329,0.036265,-0.0085609,0.0034127,0.003223,0.13899,0.025531,0.047419,-0.010241,0.0065383,0.0061579,0.13216,0.031187,0.058135,-0.013562,0.52837,74,74,40,1054,3,3,3,0.645
30,-0.0061057,0.13554,0.13897,-0.92785,0.12127,-1.2589,0.35682,0.080911,3.2007,0.013219,3.3341,8.5386e-09,3.7151,9.7921,0.14367,13.108,0.012496,0.92808,0.89282,0.4478,0.34165,0.28551,0.11537,0.16238,0.23854,0.16653,0.056042,0.033379,0.22776,0.29367,0.18441,0.059788,0.00056975,3.2573,10.604,5.1983,19.598,0.036029,0.073329,0.073329,0.58326,0.66071,0.32982,0.48504,0.11722,48,132.02,3096,2.2029e+05,5.3803,33.444,83592,23733,22518,0.90657,0.92088,0.33618,0.26675,0.17062,0.71638,68468,35066,0.0011621,0.00052526,0,0.081262,0,0.056488,0.00061294,0.0083602,0.0019862,0.0096318,1.1297,1.0092,0.25372,0.21467,0.43211,0.25413,0.24657,0.50826,0.19982,0.23451,0.53081,0.20153,63.3,6.8616,23931,98602,97907,0.032663,0.023835,0.022884,0.2549,0.2335,0.093025,0.50288,0.47275,0.12928,0.65954,0.61887,0.13512,0.75112,0.70492,0.13104,0.0072314,0.0057006,0.1086,0.025608,0.041637,-0.047099,0.015086,0.012398,0.10793,0.033247,0.054562,-0.051865,0.024713,0.021063,0.106,0.03986,0.066437,-0.052892,0.006139,0.0048739,0.18004,0.036901,0.046918,-0.040826,0.011784,0.0097634,0.16032,0.04199,0.056142,-0.042695,0.01798,0.015484,0.14369,0.045138,0.063596,-0.041103,0.00032435,0.00019336,0.011377,-0.0054145,0.0074963,-0.024854,0.0011161,0.0006824,0.019683,-0.0045699,0.01223,-0.036191,0.0023807,0.0014757,0.026237,-0.0032589,0.01666,-0.045063,0.00076802,0.0006334,0.19274,0.017306,0.018823,-0.017655,0.0026399,0.002222,0.21064,0.026662,0.029654,-0.022369,0.0055517,0.0048203,0.21984,0.036338,0.041262,-0.02416,0.41846,74,74,40,1054,3,3,3,0.645
30,-0.0044111,0.35599,0.36307,-0.79786,0.3378,-1.0084,0.26383,0.16624,2.468,0.16554,3.3391,0.0004468,2.6547,4.1737,0.40379,5.7492,0.0054859,0.7979,1.9363,1.0159,0.70367,0.53176,0.050731,0.10266,0.17582,0.15818,0.092469,0.067012,0.35313,0.048004,0.10856,0.05466,0.040975,0.07137,0.3278,0.33919,0.99056,0.12077,0.13168,0.13168,0.44037,0.48699,0.26848,0.8372,0.35068,107,23.196,1228,15177,8.6703,83.32,33156,6831,6021,0.92109,0.94119,0.067018,0.046206,0.043234,0.334,18723,12972,0.00065422,0.00032232,0,0.078633,0,0.081588,0.015226,0.061641,0.028639,0.079053,0.062224,0.45779,0.40566,0.22057,0.35237,0.25951,0.26931,0.36245,0.16294,0.26605,0.36308,0.1608,13.983,7.0069,6909.3,13628,11942,0.14681,0.14484,0.054743,0.36221,0.3565,0.070353,0.50542,0.48856,0.069152,0.63105,0.60873,0.068806,0.7355,0.71708,0.068291,0.024131,0.028544,0.19286,0.082956,0.10698,0.10744,0.045824,0.053892,0.17448,0.097203,0.12836,0.13037,0.069815,0.081268,0.15937,0.10811,0.14556,0.14516,0.013741,0.016473,0.21448,0.067899,0.089982,0.087319,0.026322,0.031045,0.19058,0.078552,0.10449,0.099731,0.041074,0.04742,0.1747,0.088418,0.11777,0.10415,0.0086971,0.01033,0.16237,0.043488,0.053819,0.066491,0.016984,0.020667,0.1594,0.054651,0.069986,0.097043,0.026074,0.032216,0.15293,0.063087,0.082173,0.12414,0.0016929,0.0017414,0.22612,0.031013,0.039046,0.0053575,0.0047438,0.0051946,0.20144,0.037784,0.050537,0.023954,0.0086224,0.009894,0.18172,0.043634,0.062785,0.04638,0.55679,74,74,40,1054,3,3,3,0.645
30,-0.0037219,0.23355,0.23256,-0.87591,0.22785,-1.0006,0.14231,-0.052835,3.8713,-0.020649,3.3116,0.00011622,8.2704,16.611,0.24742,26.987,0.025727,0.87614,1.4244,0.77098,0.59061,0.46402,0.10398,0.13602,0.15929,0.1556,0.06547,0.055578,0.32406,0.28383,0.1581,2.666e-07,9.9432e-05,1.313,1.752,1.1283,4.6353,0.19258,0.16001,0.19258,0.52753,1.2724,0.35876,0.64967,0.20929,42,189.38,5624,8.2941e+05,5.397,31.795,1.5185e+05,54324,2025,0.90425,0.91359,0.44341,0.36266,0.23433,0.8376,92458,41104,0.0022305,0.00052794,0,0.083845,0,0.065987,0.0083148,0.00415,0.011157,0.0083968,0.60273,0.30117,0.44486,0.21994,0.39722,0.27598,0.23465,0.44398,0.2493,0.2583,0.43796,0.23763,56.383,7.4516,23930,1.0974e+05,1.0914e+05,0.056259,0.047973,0.043076,0.28387,0.30723,0.11322,0.51383,0.55494,0.14436,0.69116,0.72373,0.15475,0.82513,0.84697,0.15732,0.0079591,0.0060349,0.13062,0.030833,0.042769,-0.056298,0.017898,0.013704,0.13993,0.044504,0.058306,-0.075051,0.031384,0.024272,0.14711,0.058717,0.073026,-0.091204,0.0066467,0.0052047,0.21303,0.042627,0.04706,-0.044604,0.013648,0.010888,0.20291,0.052915,0.058304,-0.054776,0.022376,0.017994,0.19543,0.06264,0.068487,-0.06494,0.00081217,0.00048687,0.031135,-0.0016714,0.0082379,-0.035144,0.0026258,0.0017101,0.050606,0.0031977,0.014641,-0.04704,0.0058459,0.004161,0.07041,0.010445,0.022013,-0.052734,0.0005002,0.00034331,0.13719,0.01037,0.02162,-0.025878,0.0018846,0.0012792,0.16434,0.018306,0.030314,-0.038333,0.0042183,0.002871,0.18255,0.027145,0.039126,-0.049758,0.43137,74,74,40,1054,3,3,3,0.645
30,-0.001072,0.37723,0.37773,-0.78862,0.37379,-0.70813,-0.10206,0.07896,3.4461,0.038752,3.3224,1.9804e-05,4.4003,6.7657,0.4222,9.7503,0.0093037,0.78868,1.7471,1.1574,0.88162,0.66575,0.10503,0.11862,0.13055,0.10104,0.068979,0.069937,0.40584,0.36934,0.15986,0.0052451,0.099778,0.56735,0.31297,0.17131,1.6858,0.071019,0.086899,0.086899,0.32873,0.35262,0.15095,0.87079,0.35874,40,95.55,3394,2.8446e+05,6.0341,37.615,91638,5778,3267,0.91697,0.93485,0.24396,0.18575,0.093918,0.7378,93027,29728,0.00066923,0.00036025,0,0.085637,0,0.076047,0.010196,0.039936,0.0077702,0.050512,0.22705,0.28344,0.15354,0.19695,0.37375,0.31193,0.21182,0.39742,0.32975,0.1936,0.39814,0.36315,71.121,8.422,25630,65260,64435,0.038883,0.027629,0.016243,0.19012,0.14288,0.041371,0.37229,0.30927,0.057067,0.53835,0.48701,0.065762,0.68185,0.64522,0.070927,0.00058332,0.00037524,0.0052231,-0.0072325,0.016313,-0.034377,0.0021886,0.0014853,0.0093359,-0.0070451,0.023489,-0.048554,0.0052093,0.0036748,0.013323,-0.0057749,0.031336,-0.061679,0.00022589,0.0001419,0.0039501,-0.0056836,0.0097625,-0.021999,0.00098584,0.00069315,0.007997,-0.0057387,0.014868,-0.031687,0.002807,0.0021046,0.013376,-0.0042298,0.02186,-0.041723,0.00035743,0.00023334,0.0074759,-0.0039516,0.012061,-0.026402,0.0012027,0.00079211,0.012646,-0.0031677,0.015979,-0.036733,0.0024148,0.0015776,0.015868,-0.002398,0.018518,-0.045513,0,0,0,-0.0030095,0.0069432,0,0,0,0,-0.0041624,0.010383,0,3.3866e-06,1.9496e-06,7.9963e-05,-0.005369,0.014073,-0.01422,0.36967,74,74,40,1054,3,3,3,0.645
30,-0.005554,0.30874,0.3023,-0.83511,0.30167,-0.87328,0.0457,0.68737,4.8778,0.082868,3.3181,3.1514e-05,9.3256,16.233,0.32942,25.139,0.023965,0.83513,1.4861,0.849,0.67747,0.54321,0.079098,0.10363,0.20441,0.1421,0.056698,0.053177,0.36089,0.17741,0.058785,0.067117,7.8247e-05,1.723,1.6257,0.55014,4.2022,0.17607,0.1408,0.17607,0.70722,0.82432,0.41347,0.76019,0.28825,46,161.96,6554,9.26e+05,6.5317,43.785,1.7696e+05,5886,5805,0.90384,0.9143,0.39005,0.31375,0.20137,0.78255,74774,36710,0.00096702,0.00053611,0,0.075336,0,0.0495,0.0028075,0.032076,0.00093984,0.038294,0.71691,1.628,0.70572,0.18369,0.42656,0.29369,0.17355,0.49645,0.28893,0.16046,0.51453,0.29418,52.13,7.9297,20441,91478,90883,0.032398,0.02135,0.024141,0.20884,0.1907,0.081058,0.42117,0.42256,0.11515,0.60219,0.61055,0.13121,0.74118,0.74537,0.13752,0.0066029,0.0055117,0.10546,0.023019,0.036062,-0.040066,0.016834,0.015431,0.12808,0.040265,0.057979,-0.028086,0.031994,0.031566,0.14595,0.059424,0.083,-0.0058786,0.0047781,0.0041944,0.14903,0.027569,0.035923,-0.024065,0.011267,0.011199,0.16302,0.040909,0.054287,-0.0016097,0.020292,0.022164,0.17247,0.054574,0.075356,0.03141,0.00052045,0.00036324,0.019416,-0.0040055,0.0074832,-0.027619,0.0019697,0.0014652,0.036941,-0.00026824,0.014293,-0.034494,0.0049323,0.0039483,0.057812,0.0066962,0.022701,-0.036773,0.0013044,0.00095408,0.34814,0.033178,0.03019,-0.032112,0.0038203,0.0028962,0.32418,0.042344,0.040386,-0.039246,0.0074959,0.0058874,0.31569,0.053199,0.052277,-0.045476,0.46492,74,74,40,1054,3,3,3,0.645
30,-0.003319,0.3825,0.38958,-0.78106,0.3676,-0.96658,0.23753,0.74885,2.8121,0.22728,3.2292,2.0561e-05,2.9677,4.4827,0.43745,6.4911,0.0061938,0.78106,1.9994,1.131,0.80993,0.60214,0.063616,0.10482,0.16038,0.13679,0.083822,0.072149,0.37842,0.15889,0.14311,0.032823,0.0099324,0.15223,0.19801,0.19483,0.88982,0.048987,0.076658,0.076658,0.35166,0.54342,0.20593,0.87672,0.38305,108,33.046,1767,31750,8.7267,83.147,47709,15174,5265,0.91924,0.93665,0.085291,0.060865,0.047058,0.3271,20123,13068,0.00063926,0.00034455,0,0.10484,0,0.087478,0.026264,0.048788,0.040926,0.067792,0.13899,0.46348,0.26654,0.21748,0.36107,0.25686,0.26423,0.36749,0.17296,0.2663,0.37583,0.16627,14.467,6.9351,8456.9,19623,18472,0.15598,0.15092,0.070089,0.3591,0.34102,0.08405,0.47174,0.44817,0.077779,0.5708,0.55017,0.074999,0.66048,0.64042,0.073899,0.016968,0.016677,0.16343,0.061207,0.078554,-0.0075575,0.032051,0.03129,0.14706,0.070863,0.095145,-0.013204,0.048385,0.046696,0.1331,0.077478,0.10805,-0.022894,0.01233,0.01267,0.23192,0.066275,0.077272,0.010319,0.023161,0.023406,0.20208,0.074879,0.088886,0.004968,0.034936,0.034648,0.17906,0.080951,0.098472,-0.0045637,0.0036258,0.003207,0.081571,0.016252,0.027956,-0.023671,0.0072559,0.0066237,0.082065,0.021031,0.037654,-0.023037,0.011241,0.010344,0.079451,0.024326,0.044385,-0.024876,0.001012,0.00080071,0.16288,0.019134,0.028214,-0.031676,0.0034237,0.0028682,0.1752,0.028793,0.040937,-0.03316,0.0068216,0.0058865,0.17325,0.036802,0.052688,-0.035597,0.59186,74,74,40,1054,3,3,3,0.645
30,-0.0005531,0.21398,0.21353,-0.88672,0.21302,-0.93007,0.048891,0.47583,7.8224,-0.0071347,3.2531,0.0014706,5.4665,11.532,0.22429,16.691,0.015911,0.88763,1.1948,0.74337,0.58192,0.46343,0.12978,0.13727,0.1749,0.12094,0.060014,0.052469,0.32464,0.40256,0.16288,0.0090066,0.067657,1.7567,1.8738,1.0912,5.3638,0.21386,0.075253,0.21386,1.0087,1.2677,0.43786,0.61277,0.17582,67,31.388,935,14940,6.1328,43.99,25245,8505,5076,0.92263,0.94706,0.14223,0.092262,0.10973,0.66998,22606,15382,0.00063173,0.00031771,0,0.049059,0,0.072846,0.035804,0.0023586,0.085635,0.018362,0.39036,0.37316,0.12721,0.20459,0.37017,0.27814,0.22244,0.4426,0.19545,0.22728,0.44764,0.18277,19.472,7.5097,8459,13036,10996,0.1174,0.11512,0.032397,0.37301,0.37445,0.053618,0.56618,0.57636,0.05733,0.69203,0.70648,0.055843,0.7961,0.80986,0.054704,0.023198,0.023314,0.13722,0.068134,0.089888,0.0043871,0.048768,0.050638,0.13742,0.089425,0.11908,0.045323,0.081792,0.087281,0.13818,0.11083,0.14654,0.099734,0.0094053,0.0088336,0.10864,0.038098,0.06647,-0.033844,0.019302,0.018525,0.10343,0.047444,0.082615,-0.029324,0.031644,0.030916,0.099608,0.056333,0.09813,-0.020517,0.011039,0.011527,0.15252,0.048695,0.048911,0.026092,0.022903,0.025003,0.15908,0.065451,0.069037,0.072004,0.038342,0.043478,0.16644,0.083217,0.088568,0.13223,0.0027539,0.0029527,0.27222,0.044818,0.053493,0.030413,0.008916,0.0095863,0.2802,0.063905,0.070035,0.041184,0.01752,0.01906,0.27326,0.080583,0.08631,0.059874,0.45321,74,74,40,1054,3,3,3,0.645
30,-0.0031349,0.53268,0.53314,-0.6829,0.52435,-0.59519,-0.12844,0.37401,21.536,0.010234,3.2333,0.0029934,15.934,20.008,0.63301,41.371,0.039439,0.6831,2.1941,1.5101,1.1765,0.9071,0.090678,0.07823,0.13253,0.086749,0.062104,0.066005,0.48371,0.34675,0.038907,0.0038616,0.13581,0.52067,0.2336,0.0033379,1.2829,0.24704,0.36734,0.36734,0.60277,0.88681,0.27094,1.1506,0.65435,54,95.611,2623,1.9282e+05,5.004,26.811,70821,52866,7776,0.91673,0.93701,0.066659,0.045197,0.0071082,0.4218,38230,20398,0.00092324,0.00042451,0,0.058975,0,0.071585,0.010759,0.039051,0.01496,0.085107,0.92177,0.43777,0.019641,0.21337,0.35692,0.26392,0.24312,0.37549,0.20311,0.25007,0.37524,0.19567,21.55,7.1257,8208.7,18649,16922,0.15364,0.14233,0.081666,0.4361,0.43683,0.12075,0.6495,0.65827,0.12668,0.80196,0.81247,0.12465,0.89499,0.90291,0.11846,0.016367,0.016594,0.18647,0.063965,0.086364,0.009107,0.034199,0.034848,0.18563,0.083368,0.11132,0.016333,0.056131,0.05734,0.18265,0.10077,0.13381,0.022762,0.010822,0.011513,0.2408,0.062436,0.080363,0.033517,0.021788,0.023344,0.22489,0.076163,0.097662,0.048192,0.034831,0.037291,0.21119,0.08793,0.11352,0.057711,0.0040634,0.0036326,0.10814,0.020685,0.033945,-0.035059,0.009486,0.0087213,0.12691,0.032689,0.049407,-0.037318,0.017168,0.016184,0.14355,0.046143,0.063728,-0.033584,0.0014811,0.0014489,0.282,0.032103,0.036616,-0.0047786,0.0037562,0.0035955,0.22738,0.034889,0.045379,-0.012364,0.0065443,0.0061918,0.19661,0.038234,0.055097,-0.018764,0.51475,74,74,40,1054,3,3,3,0.645
30,-0.0022318,0.46908,0.47213,-0.72624,0.46048,-0.84033,0.15711,0.38352,3.3132,0.095047,3.2693,0.00010617,3.3882,4.5774,0.54688,6.1611,0.0058733,0.72628,2.2662,1.3521,0.92997,0.69824,0.049494,0.1002,0.14972,0.12015,0.093891,0.071391,0.41516,0.054291,0.13055,0.02759,0.0004739,0.030591,0.15292,0.066122,0.46254,0.077797,0.081293,0.081293,0.68975,0.70133,0.29459,0.99469,0.47514,100,32.92,629,8024.7,3.9327,21.685,16983,9693,7506,0.92199,0.94484,0.1835,0.12069,0.15141,0.61454,24828,15902,0.00061095,0.00030691,0,0.070146,0,0.076973,0.033342,0.0095075,0.053397,0.00083232,0.45507,0.11255,0.13196,0.2102,0.35544,0.28217,0.25435,0.37691,0.20813,0.254,0.38298,0.19758,20.084,7.6187,6786.5,13027,10656,0.11245,0.10878,0.046935,0.28811,0.28671,0.06264,0.44034,0.44267,0.067439,0.60439,0.60946,0.073766,0.74221,0.7518,0.07714,0.024591,0.027062,0.22001,0.089728,0.10186,0.083781,0.045154,0.049285,0.19245,0.10127,0.12153,0.092738,0.066206,0.07231,0.16917,0.10779,0.13789,0.10884,0.020902,0.023701,0.36519,0.11304,0.11316,0.10017,0.03654,0.04129,0.29615,0.11908,0.1242,0.11606,0.05155,0.058429,0.24543,0.12045,0.1335,0.13607,0.0027848,0.0025275,0.058196,0.010607,0.024724,-0.028925,0.0060845,0.005643,0.063924,0.015721,0.035153,-0.027988,0.010131,0.0095701,0.066516,0.020179,0.043761,-0.025857,0.00090465,0.00083383,0.13525,0.016153,0.029508,-0.01747,0.0028901,0.0026862,0.13738,0.022758,0.041381,-0.019906,0.0055988,0.0052909,0.13208,0.028122,0.0538,-0.019465,0.53301,74,74,40,1054,3,3,3,0.645
30,-0.0010902,0.25007,0.25031,-0.86571,0.24756,-0.95654,0.10492,0.058481,3.0793,0.02466,3.3272,1.6653e-05,2.9091,5.613,0.2681,7.5224,0.0071711,0.86581,1.2813,0.82435,0.6459,0.47778,0.083916,0.14331,0.20695,0.1106,0.059874,0.069632,0.32572,0.22191,0.21283,0.076498,0.090919,1.4419,0.48193,0.81581,3.3418,0.1034,0.13771,0.13771,0.76481,0.94633,0.38739,0.66771,0.2141,51,137.22,5211,5.2725e+05,6.8092,47.908,1.407e+05,10395,5643,0.90975,0.92462,0.32453,0.24816,0.20611,0.69775,82515,38365,0.00091163,0.00048184,0,0.073893,0,0.052625,0.0050017,0.0093919,0.0060563,0.0070884,0.082914,0.74645,0.03075,0.21474,0.4094,0.26261,0.23433,0.4807,0.21261,0.24029,0.49448,0.20769,44.352,7.0904,19472,71551,70592,0.04282,0.030799,0.030961,0.26697,0.23693,0.10055,0.50527,0.48719,0.13406,0.667,0.66175,0.14102,0.77585,0.77652,0.13969,0.0091969,0.0074499,0.14253,0.036561,0.056081,-0.055622,0.019554,0.01591,0.14437,0.048738,0.071436,-0.072384,0.033677,0.027495,0.14907,0.062659,0.086613,-0.089131,0.0069841,0.0057884,0.21139,0.043947,0.055244,-0.04214,0.013601,0.01127,0.19096,0.051144,0.06483,-0.053842,0.02188,0.017962,0.18046,0.059119,0.074026,-0.068266,0.00206,0.001555,0.074576,0.0083063,0.021705,-0.037409,0.0052245,0.0041289,0.095083,0.016443,0.031653,-0.043566,0.010057,0.0083177,0.11438,0.026484,0.041673,-0.046438,0.0001527,0.00010663,0.039549,0.00030009,0.013679,-0.020158,0.00072853,0.00051059,0.05999,0.0034826,0.020347,-0.027584,0.0017598,0.0012309,0.071917,0.0068267,0.027201,-0.035286,0.4489,74,74,40,1054,3,3,3,0.645
30,-0.0060419,0.62411,0.63317,-0.60517,0.60045,-0.74274,0.22733,0.13364,2.5105,0.075535,3.3611,0.00016804,3.318,3.7324,0.78874,5.026,0.0047958,0.60522,3.4046,1.9611,1.233,0.9011,0.041135,0.057827,0.12726,0.1108,0.11023,0.078268,0.47449,0.031921,0.0025856,0.0097647,0.00010398,0.004837,0.032928,0.00017008,0.08231,0.059562,0.075784,0.075784,0.44496,0.69747,0.21859,1.2436,0.75727,99,18.98,382,2906.7,4.0521,22.57,10314,6426,6183,0.923,0.94509,0.13647,0.090511,0.10662,0.48407,19945,12726,0.00072002,0.00034224,0,0.048526,0,0.057299,0.022591,0.014813,0.012157,0.0068788,0.35269,0.36959,0.13374,0.21353,0.34881,0.26857,0.26749,0.34092,0.16355,0.26645,0.33294,0.1572,19.37,7.2514,8657.8,14443,13016,0.17449,0.17957,0.054384,0.42643,0.43864,0.069231,0.52865,0.54233,0.060458,0.64382,0.64795,0.058677,0.75813,0.75741,0.058838,0.029145,0.037438,0.1947,0.093173,0.11221,0.22789,0.052761,0.066121,0.16792,0.1038,0.13065,0.25028,0.076695,0.093697,0.14634,0.10972,0.14405,0.25627,0.026698,0.035329,0.34831,0.12609,0.13448,0.24448,0.04677,0.060838,0.28305,0.13356,0.14645,0.27635,0.066314,0.084425,0.23576,0.13635,0.15346,0.28968,0.0019722,0.0016528,0.030776,0.0049415,0.018653,-0.036735,0.0045357,0.0039215,0.035582,0.0083838,0.026507,-0.040182,0.0074457,0.006545,0.036504,0.010619,0.033288,-0.042808,0.00047524,0.00045611,0.053056,0.0060822,0.026567,-0.0059559,0.0016701,0.0015742,0.059281,0.0098196,0.036257,-0.01146,0.0035433,0.0033454,0.062418,0.013633,0.045669,-0.014646,0.48283,74,74,40,1054,3,3,3,0.645
30,-0.0029509,0.58989,0.59023,-0.63969,0.58102,-0.71962,0.12495,-0.22416,3.2012,-0.036855,3.3413,4.5831e-09,3.6067,4.2474,0.71969,5.6195,0.0053519,0.63977,3.0132,1.5586,1.1644,0.88274,0.039194,0.074621,0.13229,0.14223,0.071486,0.069396,0.47078,0.0087385,0.038171,0.008424,0.043608,0.22558,0.13288,0.0030637,0.46046,0.078987,0.11393,0.11393,0.67051,1.2005,0.29124,1.1884,0.6937,115,14.904,473,2564,6.6388,55.493,12771,5994,3456,0.92307,0.94707,0.10232,0.066627,0.080455,0.45009,20406,13074,0.00057024,0.00030504,0,0.062914,0,0.069816,0.025707,0.054627,0.046136,0.12344,0.11588,0.2878,0.29759,0.2088,0.35255,0.28427,0.24707,0.36383,0.20554,0.25396,0.36214,0.20084,17.579,7.6754,8419.3,13725,12273,0.14204,0.14123,0.042358,0.33584,0.32836,0.052169,0.47216,0.46205,0.051666,0.60668,0.59963,0.052904,0.75023,0.75261,0.055709,0.011605,0.011709,0.074177,0.031415,0.065704,0.0046034,0.022821,0.022365,0.069494,0.037896,0.080897,-0.012937,0.036618,0.035322,0.066851,0.044411,0.095609,-0.028137,0.0086324,0.0089303,0.10776,0.035887,0.066082,0.014691,0.01557,0.01569,0.090162,0.038309,0.074253,0.0039429,0.023175,0.022926,0.078833,0.040339,0.082831,-0.0065892,0.0025299,0.0023752,0.037774,0.0076501,0.021528,-0.01692,0.0062375,0.0057462,0.04682,0.013746,0.031715,-0.028508,0.011165,0.010292,0.052375,0.019554,0.040855,-0.034582,0.0004424,0.00040344,0.047257,0.0053613,0.024796,-0.014844,0.0018853,0.0017289,0.064027,0.011291,0.037125,-0.019113,0.0043674,0.0040068,0.073613,0.017487,0.05054,-0.024749,0.49489,74,74,40,1054,3,3,3,0.645
30,-0.0018187,0.70393,0.70258,-0.54475,0.70226,-0.55635,0.021287,0.63735,4.6759,0.060152,3.2975,0.00054365,5.0463,5.287,0.90927,7.4797,0.0071371,0.54485,3.1724,2.0289,1.4525,1.0606,0.062311,0.059616,0.11073,0.091314,0.078312,0.078271,0.51944,0.21169,0.00032147,0.00066456,0.029185,0.05656,0.021811,0.0074317,0.32766,0.23005,0.21548,0.23005,0.57125,0.57473,0.29511,1.3636,0.88919,98,41.857,1801,38622,7.57,65.919,48627,13365,12906,0.92063,0.94313,0.12899,0.086427,0.10662,0.44392,35452,19596,0.00090715,0.00040799,0,0.056842,0,0.063142,0.0031952,0.033883,0.015776,0.08102,0.62119,0.096415,0.6431,0.21764,0.34281,0.26277,0.26151,0.34119,0.17782,0.27623,0.33178,0.16443,19.925,7.0947,9331.5,20087,18527,0.19,0.18868,0.089653,0.47547,0.5035,0.11687,0.67174,0.6977,0.11631,0.80639,0.82661,0.11127,0.89121,0.904,0.10472,0.0057356,0.0057213,0.05801,0.014458,0.048667,-0.0008595,0.013211,0.013621,0.063653,0.022087,0.065578,0.014691,0.022964,0.024104,0.066338,0.02905,0.081621,0.029083,0.0027053,0.0026524,0.053436,0.0091097,0.039362,-0.0047791,0.0070819,0.0077014,0.064889,0.016678,0.052963,0.03168,0.013365,0.015087,0.071935,0.024253,0.066792,0.058938,0.001741,0.0016196,0.041132,0.0046292,0.021821,-0.014284,0.0042228,0.0039685,0.050155,0.0090698,0.031565,-0.016074,0.0076761,0.0072076,0.056976,0.013838,0.039714,-0.02081,0.0012892,0.0014494,0.2179,0.025872,0.032976,0.021303,0.0030026,0.0031685,0.16135,0.025347,0.039249,0.012168,0.0049068,0.0049623,0.13086,0.025533,0.046623,0.0029522,0.51494,74,74,40,1054,3,3,3,0.645
30,-0.0052415,0.1463,0.15329,-0.92009,0.12866,-1.289,0.40091,0.5906,3.2984,0.098363,3.2833,3.0389e-05,4.4332,11.084,0.15966,15.424,0.014704,0.92009,0.96504,0.4935,0.38048,0.2989,0.083533,0.15936,0.25151,0.16541,0.056438,0.04684,0.2369,0.14503,0.19059,0.099202,3.1588e-08,2.8788,3.7831,4.1865,11.283,0.075496,0.079933,0.079933,0.88723,0.99777,0.37484,0.50819,0.11967,49,63.122,1219,55755,4.2426,19.967,32913,30483,8019,0.91669,0.93651,0.30248,0.25855,0.088331,0.85656,67080,19518,0.0010977,0.00045672,0,0.090081,0,0.053143,0.00090238,0.017786,0.0023212,0.015583,0.80231,0.59864,0.046501,0.19767,0.39745,0.28315,0.20184,0.44711,0.24425,0.19591,0.47213,0.26346,55.849,7.6451,38980,1.5481e+05,1.5439e+05,0.097343,0.065328,0.034192,0.32626,0.32645,0.059695,0.51891,0.56551,0.06688,0.65457,0.71673,0.067232,0.75933,0.81441,0.066413,0.0095028,0.0050013,0.071545,0.026368,0.03824,-0.096408,0.02332,0.012299,0.083641,0.042335,0.051391,-0.12755,0.041179,0.021844,0.088549,0.056042,0.06407,-0.15403,0.0066551,0.0035897,0.097852,0.028604,0.036381,-0.074545,0.014951,0.0080398,0.10197,0.039641,0.044397,-0.096956,0.025159,0.013514,0.1008,0.048488,0.052373,-0.11534,0.0019249,0.00092858,0.033853,0.0049915,0.012027,-0.049949,0.0051366,0.0025572,0.045413,0.011038,0.019029,-0.064176,0.0099498,0.0051219,0.054975,0.017994,0.025723,-0.080039,0.00092272,0.00048303,0.11609,0.015143,0.023874,-0.041418,0.0032971,0.0017388,0.13189,0.024312,0.032196,-0.051476,0.0063288,0.0033492,0.12564,0.029754,0.040067,-0.060026,0.35661,74,74,40,1054,3,3,3,0.645
30,-0.0039616,0.43493,0.44187,-0.7468,0.41814,-0.91985,0.23171,-0.94325,4.5153,-0.14899,3.2141,0.00099499,3.6984,5.1949,0.50588,8.0213,0.0076539,0.74682,2.5151,1.3335,0.89738,0.60124,0.063087,0.080147,0.13606,0.14509,0.099221,0.09818,0.37821,0.14815,0.027273,0.0037672,0.028999,0.019443,0.00063289,0.16634,0.3946,0.10363,0.23204,0.23204,0.42874,0.73643,0.2364,0.95275,0.45327,39,91.231,3277,2.7269e+05,5.9802,36.852,88479,3429,2997,0.92043,0.93721,0.11406,0.088415,0.049701,0.44244,24745,15472,0.0010186,0.00046156,0,0.09397,0,0.075845,0.0061078,0.034706,0.0049439,0.042976,1.2316,1.2405,0.17958,0.19515,0.33886,0.30623,0.19058,0.31329,0.30676,0.17488,0.33342,0.31284,33.589,8.2681,25992,69959,69418,0.143,0.13945,0.053128,0.36667,0.37569,0.070961,0.52319,0.54796,0.071325,0.64928,0.68692,0.070538,0.76691,0.81021,0.07095,0.0058732,0.0038516,0.046771,0.013319,0.036211,-0.060914,0.010178,0.0066372,0.038615,0.012345,0.042584,-0.070715,0.013622,0.0088663,0.030983,0.0093196,0.046931,-0.078212,0.0022447,0.0015341,0.034909,0.0055696,0.026053,-0.03492,0.0038334,0.0026208,0.027656,0.0040145,0.028827,-0.040386,0.0054831,0.0037403,0.023237,0.0024666,0.032164,-0.047023,0.003587,0.002294,0.066724,0.014529,0.021853,-0.04921,0.0062021,0.0039353,0.058,0.015243,0.026701,-0.056671,0.007778,0.0049155,0.045457,0.012528,0.028251,-0.059887,4.1567e-05,2.3509e-05,0.0055318,-0.0020051,0.016631,-0.012029,0.00018664,0.00010685,0.007897,-0.0022825,0.020467,-0.016785,0.0005228,0.000306,0.010978,-0.0021278,0.024428,-0.023439,0.40237,74,74,40,1054,3,3,3,0.645
