30,-0.041399,0.7957,0.85705,-0.37701,0.63051,-0.57084,0.51413,1.0577,4.0216,0.20203,3.1845,0.00033078,4.0425,3.6201,1.2446,4.7313,0.0045146,0.37705,6.8779,3.7558,2.1138,1.5393,0.02534,0.023299,0.065755,0.084532,0.11247,0.073704,0.6149,0.15819,2.5992,0.66355,0.10584,0.0030311,0.08423,0.040202,3.6543,0.17727,0.51193,0.51193,0.50104,0.5169,0.23187,1.742,1.5187,67,23.552,1013,15199,7.5875,60.534,27351,3510,2646,0.90955,0.93887,0.095248,0.08236,0.0095305,0.23698,18395,10427,0.0009093,0.00034654,2,0.41853,0,0.081409,0.23917,0.62096,0.30924,0.80764,0.98027,3.0516,2.1864,0.24804,0.28503,0.23295,0.33699,0.24688,0.12079,0.31039,0.20851,0.16104,19.915,6.2897,26155,97565,97361,0.17228,0.14587,0.044209,0.44264,0.39465,0.05957,0.63461,0.63221,0.060593,0.74139,0.78139,0.056734,0.805,0.84534,0.052821,0.0038262,0.0021518,0.018425,0.0038807,0.0082298,-0.030787,0.0086376,0.0049184,0.019714,0.0061699,0.01161,-0.041459,0.015835,0.0091645,0.021405,0.0093611,0.015027,-0.052952,4.559e-05,2.3907e-05,0.00054643,-0.0045273,-0.0081243,-0.0081571,0.00026262,0.00014103,0.001445,-0.0055593,-0.010426,-0.010819,0.00086172,0.00048105,0.0027476,-0.0061087,-0.01175,-0.015151,0.0026716,0.0015084,0.023741,0.0051379,0.012899,-0.024372,0.0056048,0.0032285,0.024595,0.0071742,0.017332,-0.032689,0.010677,0.006282,0.02842,0.011526,0.021895,-0.043102,0.001109,0.00061952,0.094794,0.015399,0.019519,-0.018839,0.0028288,0.0015808,0.075826,0.016539,0.025552,-0.024016,0.0045163,0.0025209,0.060675,0.016278,0.030214,-0.027756,0.49247,74,74,40,1054,3,3,3,0.645
30,-0.030051,0.72613,0.73072,-0.51825,0.63521,-0.70562,0.36153,0.53504,2.6524,0.17679,3.2959,0.00031725,3.9306,4.0028,0.96243,5.3587,0.0051133,0.51829,8.2638,3.4958,1.5038,1.08,0.023677,0.02316,0.047035,0.11629,0.17975,0.082669,0.52742,0.27174,3.0127,2.5663,4.5412e-05,0.15318,0.032427,0.0007411,6.0372,0.076148,0.25525,0.25525,0.2703,0.31034,0.17295,1.4288,1.0179,90,25.011,1433,22579,9.0502,84.523,38691,3753,2565,0.9083,0.93537,0.096356,0.0722,0.032194,0.35576,15740,10702,0.00073006,0.00033827,0,0.092982,0,0.054933,0.0081004,0.14606,0.0012751,0.24257,1.0033,2.4786,1.5849,0.24828,0.30514,0.22372,0.32175,0.27691,0.13453,0.32767,0.25071,0.12906,14.533,6.0405,22157,50593,49963,0.17209,0.15127,0.059658,0.37808,0.35618,0.068742,0.56166,0.55176,0.072451,0.68161,0.67619,0.070468,0.76654,0.76438,0.067952,0.0012663,0.0008789,0.0082384,-0.0042303,0.0033894,-0.029855,0.0031948,0.0022648,0.0098511,-0.0044728,0.0068435,-0.039085,0.0063569,0.0046188,0.011609,-0.0040415,0.010995,-0.050747,7.1098e-05,4.7055e-05,0.0011513,-0.0051334,-0.011698,-0.013408,0.00029184,0.00019525,0.0021694,-0.0063775,-0.014987,-0.01506,0.00068143,0.00045712,0.0029354,-0.0075549,-0.016961,-0.019526,0.00075577,0.00052788,0.0090734,-0.0027359,0.0083056,-0.022447,0.0017905,0.0012801,0.010615,-0.0027993,0.013235,-0.028145,0.0036589,0.002706,0.013158,-0.0019014,0.018824,-0.037392,0.00043947,0.00030396,0.050747,0.0055296,0.02404,-0.022226,0.0013815,0.00097002,0.050027,0.0075446,0.032147,-0.026878,0.0025319,0.0018035,0.045955,0.0085641,0.039588,-0.031928,0.56478,74,74,40,1054,3,3,3,0.645
30,-0.060543,1.0031,0.97441,-0.15705,0.85119,-0.21289,0.35561,0.61903,3.5854,0.15883,3.3067,3.1639e-06,7.1628,5.5146,1.6839,6.9272,0.0066099,0.15708,5.3013,3.8941,3.1618,2.5347,0.034233,0.040355,0.079298,0.045891,0.036156,0.042877,0.72119,8.8779e-05,0.23868,0.24128,1.998,3.2498,1.3404,0.10871,7.1769,0.21631,0.6542,0.6542,0.61267,0.74621,0.27139,2.3827,2.795,55,116.55,6280,7.145e+05,7.2112,53.007,1.6956e+05,1350,1080,0.90358,0.9262,0.22885,0.17093,0.14448,0.57192,32378,19233,0.0014714,0.00057404,0,0.073797,0,0.052267,0.044466,0.035874,0.060117,0.046424,0.060521,0.095448,0.0053387,0.24425,0.31991,0.2409,0.25879,0.32363,0.22475,0.28655,0.33576,0.21039,20.035,6.5044,18046,64715,63835,0.15934,0.14348,0.1096,0.44554,0.46441,0.16072,0.59203,0.6089,0.15152,0.69275,0.70611,0.1421,0.79898,0.81199,0.14053,0.0035196,0.0031992,0.045429,0.0049313,0.011868,-0.01751,0.0090065,0.0087376,0.055099,0.011329,0.020848,-0.0079707,0.016826,0.016764,0.060962,0.017704,0.029453,-0.0012589,1.6291e-05,1.0237e-05,0.00052336,-0.0077177,-0.013049,-0.0096961,9.1481e-05,6.1039e-05,0.0013492,-0.010012,-0.016723,-0.011846,0.00043298,0.00032355,0.0037004,-0.011589,-0.018598,-0.019503,0.0022755,0.0017975,0.054202,0.0059391,0.015817,-0.029874,0.0049639,0.0039857,0.058387,0.009206,0.022028,-0.037569,0.0086936,0.0070878,0.06203,0.012916,0.027335,-0.044243,0.0012278,0.0013915,0.28129,0.028599,0.043981,0.01896,0.0041063,0.0048039,0.29503,0.042052,0.063232,0.032177,0.0080753,0.009622,0.2908,0.053412,0.080901,0.046092,0.61468,74,74,40,1054,3,3,3,0.645
30,-0.021712,0.29709,0.28619,-0.84471,0.25742,-1.1125,0.31702,0.024194,2.1049,0.074004,3.3615,0.0011967,2.9908,5.3646,0.31022,6.8142,0.0065021,0.84474,2.1308,0.94636,0.75992,0.60946,0.042107,0.079493,0.1939,0.19549,0.054739,0.053425,0.38085,0.16735,0.070603,0.0020038,0.00089883,4.731,3.85,1.3673,10.189,0.081089,0.14317,0.14317,0.48771,0.64876,0.25048,0.7259,0.26297,26,166.12,3517,4.7012e+05,4.6802,23.27,94959,10071,7587,0.8995,0.92108,0.37928,0.34011,0.081196,0.80275,1.3058e+05,31128,0.0012197,0.00053634,1,0.15076,0,0.06757,0.010609,0.023433,0.011897,0.024691,0.63523,0.38136,0.62335,0.18688,0.38062,0.31949,0.1879,0.46486,0.32096,0.14576,0.44912,0.39191,67.677,8.6262,39498,2.7718e+05,2.7692e+05,0.028363,0.015424,0.013214,0.18248,0.15601,0.044588,0.38957,0.39382,0.067534,0.59896,0.61867,0.083217,0.77205,0.79184,0.091977,0.0023841,0.0011948,0.020844,-0.00047582,0.0035068,-0.038327,0.0053562,0.0032184,0.022195,0.00018291,0.0062336,-0.043259,0.0098418,0.006771,0.024153,0.0016899,0.0096582,-0.0446,2.4945e-05,9.8978e-06,0.00054283,-0.0062626,-0.0077961,-0.010383,0.00011204,4.452e-05,0.0011193,-0.0081161,-0.0099731,-0.011817,0.00030447,0.00012281,0.0017626,-0.0098511,-0.011614,-0.016288,0.0015309,0.00062615,0.0247,0.00092135,0.0065215,-0.032431,0.0025319,0.0010402,0.020173,-0.00073336,0.0083708,-0.040157,0.0038611,0.001598,0.018661,-0.0016971,0.0097867,-0.049352,0.00082825,0.00055877,0.12853,0.014804,0.018771,-0.019853,0.0027288,0.0021402,0.1328,0.021456,0.028244,-0.018256,0.0057923,0.0050967,0.14128,0.029817,0.039853,-0.013763,0.36868,74,74,40,1054,3,3,3,0.645
30,-0.055737,0.93075,0.95435,-0.21153,0.75725,-0.30766,0.45445,-0.36754,2.6094,-0.15037,3.3358,0.00026495,4.8839,3.8875,1.5754,4.7306,0.0045139,0.21154,5.6151,4.0061,3.0933,2.4435,0.032929,0.048849,0.066564,0.048747,0.044695,0.046255,0.71196,0.00083424,0.054781,0.60833,1.5753,1.6645,0.95425,0.10431,4.9623,0.28114,0.69431,0.69431,0.66811,0.69614,0.26619,2.1858,2.3719,79,33.848,1533,30403,8.0391,68.913,41391,4860,4806,0.91055,0.93828,0.11664,0.081942,0.065847,0.51908,19943,12329,0.0011345,0.00050916,0,0.092284,0,0.063483,0.0022963,0.0016517,0.0071595,0.0099532,0.52937,0.059168,0.80606,0.25248,0.30187,0.21343,0.34699,0.28079,0.090071,0.35341,0.26651,0.074893,21.155,5.7627,14934,30646,29295,0.21134,0.20807,0.07569,0.61367,0.63887,0.11527,0.78486,0.80884,0.10459,0.85486,0.87431,0.091302,0.89691,0.91237,0.082139,0.0037092,0.0032612,0.024929,0.0041893,0.0080734,-0.024173,0.0077381,0.0066609,0.02465,0.0053477,0.010789,-0.038019,0.014664,0.012648,0.027664,0.0092077,0.015478,-0.051494,0.00053007,0.00045846,0.0088672,-0.0026567,-0.0088384,-0.011437,0.0013672,0.0012228,0.010499,-0.0028133,-0.011893,-0.012648,0.0029688,0.002706,0.013211,-0.0020135,-0.013083,-0.015421,0.0030465,0.002702,0.037784,0.0078195,0.012903,-0.021871,0.0067312,0.005847,0.041226,0.011846,0.018644,-0.033446,0.012264,0.01063,0.045563,0.017175,0.02468,-0.044686,0.00013271,0.00010077,0.015831,-0.00015742,0.021065,-0.017516,0.00067342,0.00052755,0.025193,0.001841,0.029736,-0.022426,0.0018896,0.0015243,0.03543,0.005285,0.03925,-0.02952,0.46301,74,74,40,1054,3,3,3,0.645
30,-0.027324,0.49015,0.52148,-0.69139,0.39777,-1.0281,0.48706,0.31874,2.1507,0.075387,3.3042,0.0014108,2.5734,3.2746,0.61644,4.1077,0.0039196,0.69146,4.9301,2.3341,0.9008,0.62119,0.041219,0.03791,0.065045,0.13516,0.23282,0.093408,0.39444,2.9939e-05,0.81407,1.4146,0.0004157,0.22743,0.027609,0.21749,2.7017,0.10061,0.16549,0.16549,0.36072,0.36741,0.19703,1.0684,0.56639,84,33.214,1246,19816,7.5422,63.958,33642,7938,5589,0.90931,0.93403,0.10367,0.07561,0.028057,0.3943,17800,11349,0.0009105,0.00040765,0,0.086122,0,0.070329,0.013008,0.03565,0.021311,0.07087,0.4585,0.69767,0.24856,0.24838,0.30488,0.21702,0.31068,0.29126,0.12385,0.31566,0.27544,0.11174,14.609,5.8596,19881,47263,46343,0.18068,0.17141,0.074135,0.41771,0.40132,0.08989,0.57282,0.55999,0.087455,0.67298,0.675,0.082348,0.77173,0.78563,0.080971,0.0052639,0.0043736,0.040532,0.01028,0.012383,-0.037465,0.011698,0.0096527,0.042694,0.014975,0.018778,-0.050791,0.020707,0.017176,0.044755,0.02025,0.025166,-0.063847,9.054e-08,5.8585e-08,1.7352e-06,-0.0060181,-0.013573,-0.012683,8.6488e-05,6.5948e-05,0.00076093,-0.0077,-0.017061,-0.028182,0.0010818,0.00086495,0.0055153,-0.0071686,-0.017965,-0.033964,0.0045807,0.0038587,0.065089,0.015989,0.021012,-0.031908,0.0096778,0.0081035,0.067908,0.022085,0.029303,-0.042215,0.016211,0.01367,0.069002,0.027799,0.036794,-0.050592,0.00068309,0.00051486,0.093361,0.010944,0.027391,-0.023557,0.0020673,0.0015815,0.088608,0.014272,0.035253,-0.030984,0.0039132,0.0030174,0.084064,0.017217,0.041959,-0.037515,0.58752,74,74,40,1054,3,3,3,0.645
30,-0.057524,0.76371,0.70243,-0.54488,0.67089,-0.66036,0.21192,0.061114,1.9272,0.007312,3.354,0.0018176,2.7333,2.8637,0.9093,3.4901,0.0033302,0.5449,8.1935,3.2267,1.2294,0.88763,0.018886,0.027608,0.057337,0.12853,0.21314,0.081657,0.47284,1.0237,2.0011,1.6102,0.0035811,0.22681,0.057154,0.017994,4.9405,0.069103,0.073206,0.073206,0.22905,0.39342,0.11997,1.3729,0.93941,72,50.375,2588,93288,8.0361,66.895,69876,9180,3294,0.90607,0.92912,0.19276,0.15302,0.067084,0.56844,27242,15349,0.0011304,0.00048467,0,0.098463,0,0.070072,0.0075355,0.048588,0.013261,0.070796,0.24506,0.32613,0.53523,0.26198,0.29784,0.21868,0.32067,0.29339,0.15542,0.33475,0.25875,0.14403,18.023,5.9045,22593,74530,73992,0.1539,0.14238,0.0685,0.34818,0.34478,0.081278,0.50426,0.51107,0.083514,0.62519,0.63402,0.082986,0.72539,0.7371,0.082561,0.0039916,0.0032854,0.033341,0.0057761,0.0074197,-0.026215,0.0086053,0.0068426,0.034068,0.008084,0.011128,-0.038076,0.013705,0.01081,0.032134,0.0085701,0.013955,-0.047365,1.145e-06,7.7584e-07,2.3804e-05,-0.0062667,-0.011383,-0.0080071,7.0816e-05,4.9826e-05,0.00067587,-0.0080862,-0.014777,-0.015636,0.00063945,0.0004826,0.0035365,-0.0086968,-0.016587,-0.02122,0.0026222,0.0023285,0.040419,0.0065419,0.0118,-0.013151,0.0053353,0.0045987,0.040611,0.0085961,0.015315,-0.020039,0.0082102,0.0070085,0.037909,0.0091305,0.0177,-0.024956,0.0013682,0.00095615,0.20285,0.025828,0.030599,-0.029391,0.0035906,0.0024768,0.16695,0.028888,0.038554,-0.038299,0.0057188,0.0039261,0.13327,0.028692,0.045082,-0.044904,0.53891,74,74,40,1054,3,3,3,0.645
30,-0.050566,0.92351,0.95503,-0.20992,0.75653,-0.30563,0.4559,0.15419,2.6847,0.019862,3.374,0.00022299,4.2735,3.3983,1.5784,4.31,0.0041126,0.20995,6.4009,4.3219,2.9702,2.2654,0.037385,0.035416,0.056352,0.053147,0.064418,0.054741,0.69854,0.0035455,0.42964,1.1878,1.1893,0.34892,0.47187,0.092963,3.724,0.49956,0.66777,0.66777,0.47445,0.87821,0.26511,2.1945,2.347,86,24.384,1612,29800,8.9868,82.505,43524,2295,1728,0.91035,0.94055,0.20706,0.1398,0.14809,0.66814,20227,13714,0.0013103,0.00055502,0,0.068019,0,0.080942,0.0018742,0.075486,0.010504,0.14938,0.56562,2.57,1.9389,0.26474,0.28454,0.20976,0.38599,0.20628,0.070976,0.39328,0.1934,0.06199,18.44,5.6635,8219.2,14231,12533,0.24162,0.23271,0.07773,0.69556,0.72193,0.11736,0.82452,0.83908,0.098698,0.89157,0.89842,0.085535,0.91694,0.91997,0.07543,0.0015999,0.0012757,0.0096588,-0.0029749,0.0096607,-0.037281,0.0034427,0.0028133,0.0098509,-0.0037949,0.014455,-0.046315,0.0067707,0.0057364,0.011474,-0.0032627,0.019821,-0.054254,0.00057231,0.00044662,0.0085998,-0.0022925,-0.0092384,-0.024332,0.0010593,0.00083918,0.0073074,-0.003659,-0.01297,-0.026654,0.0021073,0.0018363,0.0084237,-0.003928,-0.014402,-0.026601,0.00062772,0.00049336,0.0069933,-0.0031951,0.011686,-0.031179,0.0016476,0.0013044,0.0090643,-0.0030974,0.018124,-0.037938,0.0032225,0.0026021,0.010754,-0.0027482,0.023616,-0.046547,0.00039987,0.00033569,0.042849,0.0046172,0.035973,-0.022128,0.0013378,0.0011294,0.044955,0.0069228,0.048084,-0.026226,0.0024782,0.0020916,0.041741,0.0079741,0.059594,-0.031256,0.46131,74,74,40,1054,3,3,3,0.645
30,-0.038114,0.5843,0.60531,-0.62779,0.4696,-0.92504,0.4735,-0.096561,1.6215,-0.08112,3.2309,0.0034236,2.9641,3.4338,0.74372,4.7702,0.0045517,0.62779,8.1451,3.1775,1.1634,0.81475,0.020743,0.0264,0.056205,0.1309,0.22437,0.089394,0.45198,0.74067,2.6817,2.0904,0.0017652,0.23798,0.032838,0.051896,5.8372,0.079083,0.082927,0.082927,0.23394,0.31654,0.13875,1.2007,0.71824,82,37.89,1848,41961,8.382,73.885,49896,6183,5292,0.91026,0.93345,0.11827,0.086699,0.067427,0.4235,17265,11599,0.00080355,0.00034448,0,0.090704,0,0.09052,0.065563,0.054503,0.096984,0.10184,0.9776,1.4797,0.43277,0.23294,0.30936,0.22948,0.27291,0.30016,0.15222,0.26189,0.28774,0.13554,13.398,6.196,25410,63801,63085,0.19815,0.23176,0.085503,0.41094,0.44328,0.092998,0.551,0.57272,0.088467,0.66021,0.68141,0.084956,0.75771,0.77767,0.083605,0.0056425,0.0056017,0.04569,0.011994,0.01198,-0.0015032,0.010942,0.010988,0.041996,0.013554,0.015059,0.0010947,0.017555,0.018106,0.039901,0.015221,0.019186,0.010165,0.00058052,0.00041921,0.0117,-0.0026116,-0.010598,-0.016731,0.00091539,0.00066224,0.0084694,-0.0047891,-0.014507,-0.019332,0.0014813,0.0011119,0.0079421,-0.0062666,-0.016729,-0.024147,0.0047574,0.0049362,0.07109,0.017305,0.020211,0.0072618,0.0092181,0.0095634,0.068022,0.021157,0.025855,0.0090022,0.014135,0.015077,0.06327,0.023453,0.030776,0.018928,0.00030453,0.00024633,0.043769,0.0033863,0.018429,-0.013711,0.0012388,0.0010772,0.055839,0.0071431,0.026524,-0.014088,0.0027913,0.0025456,0.063059,0.011093,0.035783,-0.012414,0.60744,74,74,40,1054,3,3,3,0.645
30,-0.011512,0.62983,0.61701,-0.61839,0.61651,-0.6007,-0.028604,-1.4727,7.6995,-0.12877,3.1678,0.0031772,6.6199,7.5745,0.76239,12.014,0.011464,0.61842,2.363,1.7183,1.3455,1.0501,0.081756,0.085154,0.1233,0.071232,0.059067,0.062072,0.51742,0.30858,0.07148,0.00046117,0.35792,0.64958,0.32876,0.0005373,1.7173,0.36206,0.33667,0.36206,0.93423,1.3269,0.35949,1.2198,0.66693,65,63.862,1769,58274,5.7898,39.281,47763,19224,11664,0.90724,0.93214,0.10557,0.076511,0.058044,0.30081,25269,15497,0.0012855,0.0005429,0,0.12694,0,0.068911,0.023961,0.13135,0.039142,0.23112,0.50018,1.2198,0.70808,0.24816,0.30149,0.22283,0.28475,0.2905,0.15267,0.31359,0.27214,0.1346,18.456,6.0165,18337,47465,46703,0.22535,0.22487,0.11057,0.59842,0.63864,0.154,0.7705,0.80296,0.14067,0.8499,0.87386,0.12436,0.90653,0.92133,0.11374,0.011157,0.012014,0.10273,0.035312,0.03064,0.023816,0.020233,0.021181,0.088304,0.038235,0.035326,0.017962,0.03103,0.031854,0.080202,0.04162,0.040789,0.01236,0.0015415,0.0015693,0.035328,0.0035105,-0.0056066,0.0022016,0.0034329,0.0036735,0.036118,0.0049763,-0.0063106,0.011675,0.0065037,0.0070265,0.039652,0.0079197,-0.0048685,0.017921,0.0092341,0.01014,0.15691,0.042806,0.04105,0.027695,0.016613,0.01755,0.1394,0.048412,0.0485,0.019511,0.024954,0.025674,0.12702,0.053255,0.055012,0.011927,0.00038128,0.0003049,0.062316,0.0053142,0.017905,-0.016184,0.0013725,0.0011713,0.070347,0.0089201,0.027061,-0.017439,0.0030719,0.0027773,0.078913,0.013601,0.03671,-0.015787,0.53753,74,74,40,1054,3,3,3,0.645
30,-0.017358,0.54784,0.51573,-0.69554,0.5156,-0.70634,0.015525,-0.055687,3.179,-0.017964,3.3671,4.6986e-05,5.9544,7.6271,0.60831,10.299,0.0098269,0.69555,1.9283,1.2987,1.0334,0.87652,0.054637,0.097509,0.17618,0.095407,0.057899,0.041928,0.47644,0.078036,0.083409,0.062415,0.090114,1.0031,2.2838,0.023291,3.6241,0.10608,0.34743,0.34743,0.36962,0.44629,0.21853,1.0626,0.56421,54,66.074,3157,1.8247e+05,7.1144,51.751,85239,2727,2133,0.90551,0.93105,0.33656,0.26425,0.16402,0.86612,34315,16462,0.0015091,0.000608,0,0.10464,0,0.075935,0.0065623,0.069784,0.0045559,0.092024,1.1698,0.69037,0.76144,0.23643,0.335,0.23719,0.27332,0.35083,0.16877,0.27683,0.39808,0.13637,32.222,6.4041,21294,59708,58820,0.16224,0.14654,0.069957,0.48761,0.48999,0.11027,0.67733,0.71226,0.10868,0.76701,0.81709,0.098632,0.8301,0.87548,0.09153,0.0017958,0.001738,0.014531,-0.002705,0.0026732,-0.0050926,0.0069147,0.0066579,0.02652,0.0039069,0.010528,-0.0086885,0.016833,0.01654,0.038235,0.013944,0.02114,-0.0058474,8.9067e-05,6.8132e-05,0.0017939,-0.0056265,-0.010802,-0.012952,0.00052629,0.00043631,0.0048661,-0.0062474,-0.0132,-0.012694,0.0018261,0.0016337,0.0097844,-0.0053253,-0.013507,-0.012571,0.00020377,0.00014297,0.0030428,-0.0058655,0.0026831,-0.027125,0.0015462,0.001257,0.011402,-0.0039269,0.0078014,-0.027258,0.0058567,0.0053856,0.026198,0.0032394,0.01619,-0.017801,0.0015029,0.0015269,0.21587,0.028202,0.040022,0.0021762,0.0048521,0.0049712,0.21856,0.039841,0.05606,0.004451,0.0093307,0.009659,0.21065,0.049381,0.070621,0.0081447,0.43059,74,74,40,1054,3,3,3,0.645
30,-0.059549,0.79794,0.8346,-0.40572,0.63234,-0.60545,0.49228,0.21298,3.1756,0.090615,3.3175,3.2741e-06,2.9569,2.7111,1.1873,3.2279,0.0030801,0.40575,3.9702,2.6668,2.016,1.5123,0.042126,0.060541,0.090552,0.072233,0.059441,0.06713,0.60798,0.017187,6.0154e-05,0.12515,0.3783,0.65813,0.19894,0.028172,1.4059,0.47715,0.50183,0.50183,1.4821,1.8469,0.42359,1.6697,1.3854,39,66.974,2115,1.1358e+05,5.8639,35.909,57105,5184,4536,0.91088,0.93801,0.1997,0.14891,0.10188,0.72627,29964,14363,0.0013916,0.00060003,0,0.081368,0,0.068634,0.0067176,0.028236,0.0021523,0.029674,0.56874,1.3822,0.70521,0.24426,0.30077,0.21999,0.31366,0.27609,0.10031,0.30925,0.25702,0.079654,23.957,5.9397,15542,33368,32524,0.23416,0.23316,0.073261,0.66087,0.71594,0.10844,0.84099,0.88418,0.097903,0.90217,0.93028,0.084174,0.93447,0.95266,0.07476,0.032063,0.051761,0.18825,0.095913,0.1094,0.30706,0.064551,0.099782,0.17963,0.12052,0.13264,0.35694,0.10401,0.1555,0.17142,0.14233,0.1532,0.39915,0.0034817,0.005223,0.05088,0.012904,0.0061916,0.08281,0.0079971,0.011981,0.053648,0.018503,0.0096297,0.11531,0.014981,0.022138,0.058237,0.025906,0.015537,0.14498,0.025645,0.042971,0.27785,0.10494,0.12769,0.31056,0.054626,0.087963,0.29227,0.14403,0.16832,0.36973,0.089731,0.13989,0.29122,0.17664,0.2002,0.41763,0.002936,0.0035676,0.30596,0.049162,0.052321,0.037142,0.0081189,0.0097278,0.26534,0.058952,0.065566,0.047713,0.015393,0.018476,0.25213,0.072093,0.08281,0.062181,0.40304,74,74,40,1054,3,3,3,0.645
30,-0.03595,0.91358,0.90377,-0.30883,0.8233,-0.40098,0.29839,0.22969,2.6958,0.060427,3.3542,0.00013944,3.5238,2.9959,1.3808,3.7114,0.0035414,0.30886,4.7123,3.0201,2.2592,1.7338,0.042913,0.042245,0.084622,0.074164,0.058444,0.059347,0.63827,0.050978,0.12504,0.10299,0.19793,0.44977,0.23968,0.073657,1.24,0.33079,0.56821,0.56821,0.33998,0.74911,0.18845,1.9067,1.813,30,234.4,6932,1.5951e+06,5.1987,28.029,1.8716e+05,1566,1053,0.88861,0.90453,0.503,0.41415,0.25299,0.93672,92386,50700,0.0010475,0.00055254,0,0.085881,0,0.064616,0.00032013,0.030358,0.00066426,0.035938,0.39592,1.7902,1.0951,0.24272,0.3679,0.26661,0.26196,0.40341,0.28909,0.27176,0.42045,0.27504,92.692,7.1984,21695,96901,96334,0.020688,0.012117,0.014963,0.19103,0.15653,0.072462,0.45795,0.4453,0.12325,0.67477,0.68585,0.14554,0.82644,0.84379,0.15285,3.538e-07,1.9534e-07,4.8022e-06,-0.012474,-0.0046653,-0.011706,3.799e-05,2.1077e-05,0.00024439,-0.016376,-0.0061349,-0.026979,0.00029824,0.00016522,0.0011363,-0.019816,-0.0073501,-0.036436,0,0,0,-0.0080514,-0.01094,0,1.9654e-06,9.976e-07,3.0481e-05,-0.010714,-0.014389,-0.013283,3.6845e-05,1.9649e-05,0.00033113,-0.013302,-0.01701,-0.018253,3.538e-07,1.9534e-07,8.8618e-06,-0.0089998,0.00099213,-0.011706,3.5112e-05,1.9551e-05,0.00043429,-0.011564,0.0016571,-0.02503,0.00023767,0.00013184,0.0017832,-0.013663,0.0017529,-0.031068,0,0,0,-0.0038101,0.0075914,0,9.1274e-07,5.2804e-07,6.896e-05,-0.0052987,0.011041,-0.010881,2.3725e-05,1.3725e-05,0.0008984,-0.006673,0.014044,-0.010881,0.4136,74,74,40,1054,3,3,3,0.645
30,-0.032431,0.92675,0.88943,-0.33125,0.88479,-0.35518,0.072263,-0.85378,5.4807,-0.10112,3.2674,0.00072924,7.2341,6.2532,1.3358,8.3367,0.0079549,0.33132,3.6785,2.6839,2.1186,1.7347,0.055593,0.06595,0.089161,0.057931,0.049391,0.045197,0.63678,0.17975,0.019638,0.06233,0.69885,0.93263,0.91367,0.073646,2.8805,0.45945,0.46563,0.46563,0.69944,1.0897,0.35176,1.8179,1.5238,70,59.743,3309,1.5632e+05,8.0131,66.05,89343,10179,2754,0.90591,0.92999,0.11902,0.087414,0.057698,0.38268,24116,13750,0.0012495,0.00055682,1,0.16076,0,0.073882,0.053473,0.18641,0.084036,0.28915,0.35414,1.5302,1.1785,0.26936,0.29619,0.21062,0.34427,0.27787,0.12109,0.37738,0.27021,0.10425,18.827,5.6867,16446,43877,42844,0.2228,0.21587,0.11281,0.57417,0.61951,0.15247,0.7513,0.78837,0.14154,0.8413,0.86766,0.12703,0.90462,0.92264,0.11712,0.0017514,0.0015746,0.016641,-0.0031203,0.002602,-0.013855,0.0048042,0.0044926,0.021635,-0.0012436,0.0076169,-0.012522,0.0093326,0.0087223,0.024891,0.00078928,0.012924,-0.016455,0.00037055,0.00028804,0.0087632,-0.0042328,-0.011111,-0.013552,0.00088996,0.00070324,0.0096618,-0.0053006,-0.014364,-0.016849,0.0018775,0.0015171,0.011812,-0.0056291,-0.01589,-0.022534,0.00078772,0.00062221,0.013812,-0.0031426,0.0056576,-0.018043,0.0020163,0.001636,0.017458,-0.0025947,0.011043,-0.023544,0.0038346,0.0031067,0.02014,-0.0018412,0.016174,-0.03003,0.00059313,0.00066433,0.10003,0.010163,0.02857,0.012222,0.002191,0.0023834,0.11588,0.017105,0.04009,0.012257,0.0045064,0.004793,0.11946,0.02294,0.050594,0.011389,0.54744,74,74,40,1054,3,3,3,0.645
30,-0.016563,0.59395,0.57777,-0.64937,0.57241,-0.71192,0.096316,3.8117,39.778,0.10847,3.1332,0.0072983,13.923,16.62,0.70053,26.024,0.024832,0.64939,2.3503,1.6754,1.2773,0.98747,0.08962,0.085183,0.12006,0.075684,0.065682,0.06436,0.49941,0.35144,0.059973,0.00076141,0.29255,0.42811,0.27668,0.00077287,1.4103,0.39155,0.48978,0.48978,0.38281,2.1241,0.40066,1.2148,0.6732,50,83.96,2528,1.3399e+05,6.1328,40.818,68256,18333,5886,0.90649,0.93299,0.26617,0.19407,0.17057,0.72186,35490,18966,0.0016236,0.00070262,0,0.049081,0,0.050536,0.013667,0.0061492,0.026454,0.0026518,0.75355,0.82083,0.15717,0.25295,0.31124,0.2119,0.32508,0.29662,0.11737,0.34758,0.30478,0.10497,18.538,5.7214,11877,28576,27076,0.28177,0.29022,0.13272,0.69534,0.73766,0.17178,0.85066,0.87828,0.1491,0.91481,0.9312,0.12851,0.95276,0.96245,0.11476,0.0047765,0.0047139,0.042223,0.009083,0.013129,-0.0028946,0.009589,0.0090777,0.040175,0.010785,0.016931,-0.015911,0.016049,0.014945,0.039822,0.013142,0.020844,-0.025307,0.00092296,0.0009003,0.020307,-0.00053283,-0.008273,-0.0023487,0.0017055,0.0017247,0.017226,-0.0019069,-0.01144,0.0013534,0.0025598,0.0026353,0.014982,-0.0034809,-0.013694,0.0041952,0.003489,0.0035493,0.056915,0.011347,0.01867,0.0035718,0.0078711,0.0077111,0.063405,0.01752,0.026622,-0.0055857,0.01311,0.012672,0.064062,0.021911,0.032519,-0.010955,0.00036453,0.00026429,0.057195,0.0048414,0.023084,-0.027681,0.001504,0.0011208,0.074005,0.009981,0.033084,-0.035277,0.003353,0.0025948,0.082691,0.015042,0.043292,-0.041871,0.48216,74,74,40,1054,3,3,3,0.645
30,-0.0034934,0.45058,0.45239,-0.73972,0.4383,-0.60918,-0.17647,-0.18453,4.2411,-0.042317,3.3047,0.00020731,3.5044,4.8564,0.51974,6.5733,0.0062722,0.73984,1.913,1.1871,0.93341,0.75445,0.083839,0.09705,0.13635,0.11847,0.06237,0.05485,0.44708,0.26969,0.074009,6.2354e-05,0.0095121,0.84969,0.95099,0.075179,2.2291,0.24141,0.1953,0.24141,0.35285,0.45219,0.18869,0.97684,0.4756,23,205.26,4584,9.064e+05,4.4751,21.033,1.2377e+05,1674,1323,0.90232,0.92661,0.40199,0.32004,0.21955,0.93483,88903,34482,0.00087036,0.00042986,0,0.10225,0,0.083481,0.0058746,0.011557,0.0063554,0.0050601,0.63061,2.2362,0.9424,0.20488,0.37495,0.30743,0.18097,0.46773,0.34044,0.17248,0.47074,0.34988,72.163,8.3005,21526,67369,66627,0.0092757,0.0058917,0.0045667,0.14071,0.13606,0.036333,0.35662,0.37603,0.065329,0.55299,0.58391,0.081189,0.69588,0.72221,0.087605,0.0002056,0.00014463,0.0018996,-0.009395,-0.0081217,-0.034483,0.0013541,0.00098237,0.0059295,-0.010064,-0.0075642,-0.044522,0.0042551,0.0031893,0.011035,-0.0087962,-0.0055084,-0.052633,0,0,0,-0.0066057,-0.013023,0,0,0,0,-0.0087983,-0.016985,0,0,0,0,-0.01102,-0.020272,0,0,0,0,-0.0073858,-0.0042691,0,0,0,0,-0.0096102,-0.0050848,0,0,0,0,-0.011831,-0.0054915,0,0.0002056,0.00014463,0.033717,0.0014302,0.017302,-0.034483,0.0013541,0.00098237,0.069638,0.0087573,0.027618,-0.044522,0.0042551,0.0031893,0.10968,0.021039,0.040977,-0.052633,0.36167,74,74,40,1054,3,3,3,0.645
30,-0.030313,0.65329,0.65965,-0.58285,0.57097,-0.79657,0.36667,-0.18979,1.8716,-0.17117,3.2974,0.0022343,2.9575,3.2365,0.83341,4.4438,0.0042403,0.58288,7.4347,3.1265,1.3083,0.92256,0.026786,0.026569,0.059862,0.12453,0.19205,0.087439,0.48277,0.14214,1.9942,1.1996,0.0032197,0.18658,0.014905,0.0060358,3.5467,0.10616,0.063411,0.10616,0.46375,0.48236,0.18105,1.2927,0.83379,78,39.179,1395,26658,7.3646,60.366,37665,9504,5940,0.90725,0.93384,0.17786,0.13354,0.10796,0.59639,18469,11548,0.00096554,0.00038546,0,0.1329,0,0.085494,0.047839,0.0113,0.089742,0.029142,0.49469,0.56509,0.1204,0.2353,0.30205,0.22756,0.2719,0.27307,0.15814,0.26425,0.25685,0.13929,14.445,6.1441,29904,75924,75349,0.23032,0.2712,0.095803,0.46298,0.51346,0.101,0.60827,0.64767,0.094143,0.69843,0.7289,0.086637,0.77132,0.79436,0.082039,0.0047411,0.0048919,0.037008,0.0083913,0.011652,0.0057883,0.011274,0.011447,0.041711,0.014082,0.018149,0.0039089,0.021173,0.021346,0.046392,0.021198,0.025262,0.0027102,7.4046e-06,5.2355e-06,0.00014386,-0.006016,-0.011506,-0.0085193,0.00012757,9.7231e-05,0.0011378,-0.0076024,-0.015096,-0.013345,0.00087771,0.0006984,0.0045364,-0.0077643,-0.017116,-0.021746,0.0044233,0.0046437,0.063717,0.015315,0.020514,0.0085603,0.0098355,0.010311,0.069963,0.022746,0.030283,0.011163,0.017306,0.018259,0.074672,0.030616,0.039347,0.01603,0.00031039,0.00024294,0.043005,0.0034428,0.018484,-0.018806,0.0013758,0.0010853,0.05978,0.0082278,0.026749,-0.022958,0.0031913,0.0025313,0.069498,0.013187,0.035372,-0.028048,0.57366,74,74,40,1054,3,3,3,0.645
30,-0.067354,0.7531,0.7852,-0.46266,0.59605,-0.68974,0.4908,0.51678,3.4418,0.073406,3.3243,6.8777e-06,3.584,3.4556,1.0736,4.2037,0.0040111,0.46268,3.5012,2.4162,1.8985,1.4472,0.057307,0.056696,0.10354,0.070984,0.052583,0.064005,0.59488,0.11328,0.017132,0.041316,0.48744,1.1896,0.33513,0.01462,2.1985,0.50338,0.47912,0.50338,0.67018,0.85827,0.28251,1.5796,1.2304,75,45.387,1118,27096,5.1038,30.174,30186,22410,9369,0.90961,0.93853,0.13535,0.089648,0.10967,0.42536,24237,14389,0.0011987,0.00052933,0,0.050017,0,0.058585,0.0093163,0.032126,0.027154,0.048283,1.4752,2.7416,1.1147,0.238,0.31499,0.21419,0.29271,0.30464,0.11248,0.29373,0.3097,0.10902,17.239,5.7831,7161.6,15143,13101,0.26864,0.26461,0.12252,0.6487,0.66955,0.15517,0.83447,0.8498,0.14161,0.91287,0.92324,0.12416,0.94695,0.95373,0.11044,0.0027364,0.0029258,0.02342,0.0009143,0.0061195,0.019934,0.0069178,0.0072319,0.028063,0.004028,0.011977,0.018624,0.014199,0.014823,0.034112,0.0095722,0.019283,0.025004,0.00015788,0.00014657,0.0033634,-0.0053554,-0.012721,-0.0077754,0.00070834,0.00067924,0.0069271,-0.005726,-0.015404,-0.0065505,0.0024967,0.0024443,0.014149,-0.0036006,-0.014923,-0.0060299,0.0021194,0.0023362,0.033475,0.0039922,0.012679,0.027321,0.0056066,0.0059813,0.043729,0.0096164,0.02141,0.024643,0.010809,0.011588,0.05114,0.015772,0.02989,0.034613,0.00045908,0.0004431,0.069742,0.0067771,0.024489,-0.0050615,0.0015653,0.0015308,0.074575,0.010389,0.034872,-0.0046177,0.0031206,0.0030102,0.074515,0.013396,0.043765,-0.0092235,0.54398,74,74,40,1054,3,3,3,0.645
30,-0.05535,0.8673,0.85745,-0.37648,0.74861,-0.51061,0.35629,0.33382,3.1033,0.064236,3.3222,1.3311e-07,4.0451,3.6207,1.2458,4.3646,0.0041647,0.37649,4.0206,2.8523,2.2189,1.7551,0.064122,0.050916,0.074857,0.061109,0.05167,0.052903,0.64442,0.19744,0.043813,0.3814,0.77747,1.0491,0.61298,0.052861,3.115,0.46439,0.60097,0.60097,0.44981,1.0422,0.31783,1.7437,1.5155,75,40.067,2224,65593,8.3311,71.233,60048,4941,3213,0.90994,0.93898,0.20332,0.13969,0.1455,0.64463,22486,14640,0.0013781,0.00054317,0,0.075315,0,0.081137,0.016548,0.079455,0.055526,0.16052,0.92291,2.4167,1.6032,0.26039,0.30034,0.21618,0.37412,0.25672,0.079311,0.385,0.23536,0.069398,15.19,5.8368,6873.2,13266,11852,0.24602,0.25107,0.091625,0.68562,0.72698,0.13392,0.82259,0.85083,0.11399,0.88442,0.90266,0.098227,0.91782,0.93039,0.087406,0.0051926,0.0051536,0.036291,0.0095324,0.011093,-0.0021295,0.0095799,0.0093598,0.031733,0.009547,0.0159,-0.0082621,0.015842,0.015443,0.031079,0.01132,0.022217,-0.011708,0.00096789,0.00094105,0.016837,-0.00021677,-0.0099198,-0.0033505,0.0018725,0.0019004,0.014953,-0.00111,-0.012837,0.0024179,0.0040021,0.0040467,0.01852,0.00055752,-0.01304,0.0029034,0.0039614,0.0039961,0.051091,0.012296,0.01812,0.002281,0.0079726,0.0079529,0.050776,0.015849,0.026348,-0.00082167,0.012544,0.012514,0.04846,0.018153,0.03344,-0.00092612,0.00026331,0.00021646,0.032663,0.0023493,0.019843,-0.01559,0.00095203,0.0008015,0.037037,0.004218,0.029308,-0.021342,0.0020126,0.0017363,0.039242,0.0060598,0.039247,-0.024698,0.4989,74,74,40,1054,3,3,3,0.645
30,-0.005753,0.27694,0.27129,-0.8535,0.26513,-0.98204,0.15061,-0.057069,2.8507,-0.0013529,3.3471,5.0985e-05,2.314,4.2731,0.2927,5.4871,0.0052358,0.85351,1.3976,0.80021,0.6259,0.51399,0.086238,0.10196,0.22223,0.13999,0.060232,0.045982,0.34337,0.20753,0.044263,0.090645,0.0010112,1.5192,2.884,0.7698,5.5165,0.099014,0.11165,0.11165,0.39977,0.41926,0.1911,0.7016,0.23793,25,354.88,5440,1.3432e+06,3.723,16.222,1.4688e+05,60156,27459,0.89038,0.9077,0.48699,0.40012,0.27575,0.84904,84905,45156,0.0017149,0.00069787,0,0.092359,0,0.059472,0.0014193,0.018855,5.512e-05,0.019124,0.64642,2.0499,0.89929,0.25022,0.39001,0.23584,0.27346,0.44193,0.21929,0.28703,0.46282,0.20281,55.499,6.3676,20390,1.1277e+05,1.1166e+05,0.048443,0.03297,0.043529,0.30623,0.30445,0.14431,0.57634,0.60483,0.1927,0.77087,0.80045,0.20657,0.90019,0.91858,0.20684,0.0032041,0.002118,0.054029,0.0039057,0.0034077,-0.044847,0.0056056,0.0037542,0.044801,0.0011285,0.0027156,-0.054091,0.0083001,0.0056817,0.039287,-0.0015947,0.002481,-0.061257,0.00049747,0.00031998,0.020879,-0.0045556,-0.0091005,-0.021859,0.0011784,0.00076387,0.022704,-0.0055488,-0.011845,-0.028491,0.001937,0.0012652,0.021626,-0.0073343,-0.013725,-0.032858,0.0022708,0.0014633,0.070663,0.0067883,0.0086224,-0.039323,0.0037621,0.0023965,0.05781,0.0048414,0.0094417,-0.047328,0.0051451,0.0032753,0.047958,0.0021936,0.0095497,-0.054202,0.00043579,0.00033475,0.13043,0.008911,0.014082,-0.015562,0.0012828,0.0010051,0.1204,0.011006,0.019391,-0.019526,0.0026043,0.002068,0.12252,0.014592,0.025639,-0.024619,0.46264,74,74,40,1054,3,3,3,0.645
30,-0.0048855,0.37822,0.36784,-0.79486,0.36784,-0.79503,0.00020726,0.37366,3.6528,0.0078435,3.3017,8.9014e-05,4.3322,6.7615,0.40974,9.5043,0.009069,0.79492,1.6672,1.0071,0.8105,0.65385,0.054254,0.136,0.17665,0.12489,0.054798,0.052986,0.40042,0.056232,0.23195,0.038327,0.0044716,1.6914,1.2737,0.22437,3.5204,0.099149,0.17993,0.17993,0.52302,0.53168,0.1866,0.85829,0.36271,44,144.75,5623,7.1214e+05,6.3751,41.771,1.5182e+05,5832,5481,0.89766,0.91839,0.4683,0.37447,0.26884,0.8976,60883,35226,0.0015463,0.0005621,0,0.088036,0,0.069702,0.00061723,0.040984,0.0010737,0.048147,0.38078,1.5606,0.57074,0.2366,0.38007,0.2609,0.26152,0.44224,0.23988,0.27881,0.45314,0.22578,68.206,7.0442,17018,64948,64203,0.041737,0.030991,0.028857,0.23272,0.23831,0.084386,0.47147,0.51232,0.12129,0.66821,0.71082,0.13778,0.79384,0.82554,0.14035,4.9059e-06,2.8308e-06,6.3654e-05,-0.012164,-0.0077314,-0.018458,0.00011189,6.6449e-05,0.00068807,-0.015774,-0.0089617,-0.02955,0.0006369,0.00038653,0.0023196,-0.018599,-0.0090725,-0.040995,2.7415e-06,1.5543e-06,8.8536e-05,-0.0078445,-0.011282,-0.011549,4.4894e-05,2.6427e-05,0.00066556,-0.010262,-0.0144,-0.016813,0.00030766,0.0001898,0.0026432,-0.012055,-0.016226,-0.028877,0,0,0,-0.0087948,-0.0035322,0,0,0,0,-0.011444,-0.0043524,0,0,0,0,-0.014088,-0.0053729,0,2.1644e-06,1.2765e-06,0.00049846,-0.0036653,0.010542,-0.019494,6.6993e-05,4.0022e-05,0.0048385,-0.0044146,0.016443,-0.025049,0.00032924,0.00019673,0.011918,-0.0042397,0.023831,-0.029136,0.38012,74,74,40,1054,3,3,3,0.645
30,-0.009909,1.0078,0.99427,0.069201,0.98436,0.076109,0.099816,-0.44122,14.422,-0.016439,3.0015,0.011811,10.411,7.1165,2.1363,12.758,0.012174,-0.069202,7.0146,4.4836,3.3874,2.639,0.017781,0.032617,0.068117,0.058,0.045892,0.047206,0.73039,0.53108,0.39253,0.25596,0.49362,0.94196,0.49865,0.16901,3.2828,0.08857,0.18409,0.18409,0.19454,0.26606,0.12373,4.2654,8.7977,22,543,5230,2.0048e+06,2.6149,8.3513,1.4121e+05,1.1561e+05,44010,0.89475,0.90922,0.66487,0.55929,0.41759,0.96933,89371,50501,0.0010849,0.00055937,0,0.13092,0,0.10117,0.020743,0.038068,0.029199,0.047174,1.7923,0.96362,0.21207,0.19115,0.34783,0.37912,0.18368,0.37233,0.42834,0.17307,0.36552,0.45078,127.98,10.236,17738,1.0528e+05,1.0434e+05,0.0060329,0.0040296,0.0071901,0.10672,0.096924,0.066704,0.28559,0.28418,0.12664,0.45524,0.46585,0.1618,0.59995,0.62151,0.18284,0.0015093,0.0011349,0.033756,-0.0064347,-0.0034421,-0.034182,0.0045766,0.0035076,0.048514,-0.0028629,-0.00071346,-0.046232,0.0092719,0.0072468,0.058208,0.0010502,0.0022666,-0.056176,1.4799e-05,8.403e-06,0.00082382,-0.010301,-0.013091,-0.0087922,7.5824e-05,4.8341e-05,0.0019377,-0.013444,-0.016869,-0.011842,0.00025673,0.00017603,0.0038018,-0.016258,-0.020009,-0.016963,0.00025416,0.00018142,0.01049,-0.0095,-0.0017111,-0.019428,0.0010758,0.00078235,0.021926,-0.0092548,-0.00060587,-0.029225,0.0027483,0.0020685,0.033977,-0.0073634,0.0009452,-0.037101,0.0012403,0.0009451,0.49239,0.038556,0.032486,-0.030599,0.0037298,0.0028945,0.46434,0.050275,0.044369,-0.039581,0.0072087,0.0056991,0.4498,0.06259,0.056957,-0.046912,0.48702,74,74,40,1054,3,3,3,0.645
30,-0.014335,0.42205,0.406,-0.77046,0.40334,-0.83286,0.080983,0.4081,3.1736,0.095554,3.3271,4.0701e-07,3.0891,4.5578,0.4585,5.8261,0.0055593,0.77052,1.7863,1.1982,0.93265,0.77624,0.10977,0.10984,0.13295,0.09697,0.063122,0.046014,0.44133,0.3731,0.11897,0.0050732,0.16227,0.88513,2.068,0.10786,3.7204,0.28502,0.34871,0.34871,0.49488,0.71607,0.28723,0.89433,0.37056,42,115.76,2165,2.0415e+05,4.2011,18.808,58455,56214,4023,0.90621,0.93153,0.37614,0.27942,0.25412,0.84622,50185,26127,0.00089932,0.00046577,0,0.06717,0,0.060222,8.4661e-05,0.0030272,0.0035586,0.0014339,1.2566,2.5502,1.0492,0.23701,0.37799,0.22518,0.27716,0.46182,0.16973,0.28035,0.48569,0.15868,38.128,6.0798,18793,50767,49574,0.05085,0.039091,0.028469,0.28879,0.25823,0.084794,0.53124,0.4958,0.11067,0.67997,0.65289,0.11353,0.77074,0.75684,0.11034,0.0058403,0.0049592,0.061359,0.014568,0.014757,-0.03568,0.010053,0.0084085,0.050061,0.013054,0.016261,-0.047432,0.014523,0.012185,0.04283,0.011285,0.018025,-0.054865,0.001482,0.0011952,0.038755,0.0033391,-0.0062832,-0.024461,0.002877,0.0023633,0.034536,0.0029403,-0.0088715,-0.028494,0.0043738,0.0036339,0.030426,0.0018437,-0.010499,-0.031384,0.003582,0.0031116,0.069448,0.012938,0.019655,-0.024246,0.0059301,0.0049937,0.056775,0.01189,0.022112,-0.034248,0.0079853,0.0065217,0.046376,0.0096409,0.02305,-0.044681,0.00077626,0.00065239,0.14476,0.015035,0.021183,-0.021217,0.0026633,0.002303,0.15575,0.022896,0.033346,-0.024069,0.0054648,0.0048812,0.16018,0.030568,0.045788,-0.025067,0.45345,74,74,40,1054,3,3,3,0.645
30,-0.024127,0.96699,0.93358,-0.256,0.92677,-0.23414,-0.085387,-0.050982,6.9806,-0.047452,3.2295,0.0023511,7.0587,5.7852,1.4859,8.4155,0.0080301,0.25609,4.2235,2.8698,2.1699,1.7334,0.056872,0.056016,0.0659,0.068017,0.057947,0.051169,0.64408,0.17231,1.1605e-06,0.43571,0.2644,0.4464,0.49088,0.084071,1.8938,0.20281,0.40617,0.40617,0.3799,0.41533,0.20456,2.1098,2.1214,48,110.48,4962,5.0982e+05,6.6896,45.84,1.3397e+05,5751,1836,0.90652,0.93267,0.44302,0.3282,0.316,0.9136,51546,27475,0.00085728,0.00041114,0,0.084327,0,0.081704,0.0043101,0.025996,0.014756,0.027972,0.17874,0.47408,0.19847,0.25086,0.35129,0.26749,0.30376,0.40067,0.24845,0.3158,0.4032,0.24222,48.197,7.2223,13291,33974,32779,0.024394,0.018846,0.014186,0.19432,0.19441,0.059264,0.42473,0.44983,0.091902,0.60835,0.64,0.1055,0.71479,0.7432,0.10629,0.00060133,0.00049326,0.0065622,-0.0084707,-0.0051378,-0.022571,0.0021385,0.0018355,0.011061,-0.008773,-0.0042184,-0.024843,0.0046966,0.0041575,0.014387,-0.0086739,-0.0024814,-0.02732,2.8967e-09,2.0344e-09,7.868e-08,-0.0071946,-0.014345,-0.010617,1.9028e-06,1.3364e-06,2.3726e-05,-0.0095744,-0.019187,-0.010617,3.018e-05,2.1227e-05,0.00021807,-0.011907,-0.023153,-0.011021,0.00013167,9.5404e-05,0.0026516,-0.0072636,0.00037039,-0.013818,0.00031283,0.00023969,0.003111,-0.0092753,0.0012675,-0.014658,0.00062685,0.00050447,0.0037814,-0.011102,0.0020841,-0.016833,0.00046966,0.00039786,0.090972,0.0079309,0.019049,-0.017921,0.0018238,0.0015945,0.11078,0.014492,0.028354,-0.02059,0.0040395,0.0036318,0.12299,0.021443,0.038799,-0.022226,0.4179,74,74,40,1054,3,3,3,0.645
30,-0.013254,0.85424,0.84764,-0.38931,0.82783,-0.32979,-0.15288,0.22399,10.975,0.0047104,3.0041,0.010442,9.935,8.9855,1.2202,18.547,0.017698,0.38932,3.3214,2.2954,1.8559,1.4406,0.066006,0.062405,0.098253,0.07249,0.046982,0.05995,0.59391,0.24975,0.0063635,0.017835,0.22783,1.1805,0.21522,0.049954,1.9474,0.047638,0.10932,0.10932,0.3649,0.43086,0.18909,1.9544,1.7678,29,243.24,6800,1.584e+06,5.0996,27.016,1.836e+05,2862,2025,0.90077,0.92342,0.42846,0.31638,0.25356,0.90552,49683,35512,0.00069859,0.00042669,0,0.073158,0,0.074236,0.002515,0.0096901,0.0025359,0.0094044,2.8393,2.2019,0.15318,0.16722,0.30675,0.42271,0.10013,0.27742,0.61195,0.088238,0.26423,0.63954,82.361,11.413,14152,40492,39186,0.0023904,0.0016765,0.0017489,0.057902,0.047906,0.022218,0.2158,0.20321,0.058749,0.41023,0.40949,0.089505,0.59031,0.59733,0.11044,0.0006864,0.00049523,0.0094242,-0.0091095,-0.0019427,-0.039289,0.0019209,0.001413,0.0125,-0.01056,0.00022481,-0.053033,0.0038571,0.0028583,0.014865,-0.011706,0.0027533,-0.068189,0,0,0,-0.0080994,-0.013305,0,1.195e-05,8.3422e-06,0.00018747,-0.010729,-0.017538,-0.015461,8.3075e-05,5.7712e-05,0.00075523,-0.013216,-0.020786,-0.018386,0.00045429,0.000325,0.01151,-0.0060237,0.004488,-0.030706,0.001113,0.00082459,0.013925,-0.0070103,0.0076905,-0.038193,0.0021158,0.0015946,0.016058,-0.0077299,0.010491,-0.046613,0.00023211,0.00017023,0.056564,0.0024737,0.016099,-0.025339,0.00079597,0.00058004,0.060833,0.0041103,0.024808,-0.036597,0.0016655,0.0012109,0.063798,0.0059009,0.034179,-0.048378,0.37076,74,74,40,1054,3,3,3,0.645
30,-0.02452,0.77498,0.76137,-0.48776,0.72865,-0.58887,0.2073,0.23427,3.1649,0.02841,3.3344,4.542e-08,3.2515,3.211,1.0234,4.103,0.0039151,0.48777,3.4068,2.2538,1.5251,1.2285,0.051528,0.04925,0.10137,0.08299,0.091536,0.0544,0.56892,0.10828,0.068953,0.024848,0.12407,0.021463,0.54667,0.018348,0.91263,0.37754,0.52469,0.52469,0.44553,0.45126,0.19468,1.4973,1.1114,68,21.338,348,3588,3.2473,14.381,9396,5859,5400,0.91301,0.94526,0.17941,0.11293,0.14556,0.68997,20974,14124,0.00063524,0.00033975,0,0.046355,0,0.087394,0.0074327,0.068471,0.034432,0.17896,0.61643,1.4844,1.1897,0.22054,0.32929,0.27145,0.22892,0.39018,0.26527,0.22382,0.39416,0.27161,21.532,7.3292,5145.1,7732.3,5633.8,0.086234,0.081537,0.021667,0.30781,0.29983,0.040563,0.53248,0.52769,0.049783,0.69799,0.69788,0.052301,0.81825,0.82018,0.052573,0.00012455,0.00010708,0.00058727,-0.0069085,0.0037388,-0.032859,0.00073465,0.00063569,0.0016418,-0.0082757,0.0061415,-0.035923,0.0016076,0.0013972,0.0021278,-0.0097937,0.0082549,-0.036969,0,0,0,-0.004692,-0.013226,0,2.1593e-08,1.8468e-08,1.1634e-07,-0.0062493,-0.016944,-0.016594,1.1231e-05,9.9783e-06,3.5063e-05,-0.0078045,-0.019166,-0.020366,0.00012455,0.00010708,0.0010837,-0.0047645,0.0097562,-0.032859,0.00073463,0.00063567,0.0031566,-0.0050009,0.015113,-0.035921,0.0015964,0.0013872,0.004161,-0.0054414,0.01934,-0.036751,0,0,0,-0.0022204,0.025184,0,0,0,0,-0.0030941,0.03126,0,0,0,0,-0.0039943,0.037828,0,0.45383,74,74,40,1054,3,3,3,0.645
30,-0.0043472,1.0041,0.99864,-0.020306,0.99373,-0.018882,-0.070134,0.13682,6.1234,0.063553,3.2116,0.0024022,8.0908,5.7776,1.9573,8.4591,0.0080716,0.020308,6.295,3.8913,2.6894,1.992,0.028623,0.037907,0.066848,0.067655,0.066883,0.063452,0.66863,0.0063249,0.1425,0.31713,0.19939,0.13765,0.088718,0.12516,1.0169,0.092186,0.3535,0.3535,0.29297,0.43413,0.15813,3.8903,7.9456,32,209.09,2883,3.7184e+05,3.4908,14.385,77841,53595,16497,0.90367,0.92676,0.46233,0.34558,0.30011,0.91525,48843,30617,0.00074678,0.00040953,0,0.092621,0,0.082135,0.0051182,0.010026,0.014682,0.0084279,1.5798,1.1161,0.094644,0.19696,0.34189,0.34274,0.17312,0.37279,0.41538,0.16035,0.37388,0.43504,61.373,9.254,13366,38826,36910,0.019773,0.014825,0.013894,0.16192,0.15108,0.059672,0.40086,0.40675,0.10481,0.60108,0.62468,0.12596,0.7388,0.76833,0.13275,0.0012418,0.00093977,0.016375,-0.0061951,-0.00020917,-0.040929,0.0037937,0.002988,0.023711,-0.0045804,0.0035855,-0.052681,0.0084045,0.0069728,0.031109,-0.0011672,0.0088088,-0.058987,0,0,0,-0.007932,-0.013538,0,6.7049e-07,4.9618e-07,1.0102e-05,-0.010562,-0.017883,-0.012965,3.1253e-05,2.3068e-05,0.00027287,-0.013124,-0.021074,-0.016363,0.0010834,0.00082118,0.026364,-0.001787,0.0058344,-0.03646,0.003008,0.0023875,0.036146,0.0010935,0.011295,-0.043908,0.0061486,0.0051934,0.044819,0.005078,0.017191,-0.04491,0.00015835,0.0001186,0.037064,0.00046007,0.020801,-0.028784,0.00095214,0.00073041,0.069888,0.0058414,0.030654,-0.037606,0.0028684,0.0022745,0.10552,0.014829,0.042572,-0.046862,0.43593,74,74,40,1054,3,3,3,0.645
30,-0.022175,0.80024,0.83027,-0.41103,0.71327,-0.56532,0.37538,0.10515,2.832,0.032866,3.3409,1.7605e-05,3.1099,2.8642,1.1767,3.6529,0.0034856,0.41105,5.0315,3.1415,1.9589,1.4656,0.031891,0.035677,0.0889,0.076509,0.097589,0.068372,0.60106,0.0026366,0.40391,0.07476,0.15423,0.00010024,0.095749,0.045344,0.77672,0.20363,0.34537,0.34537,0.41605,0.42424,0.25173,1.6603,1.3747,103,27.631,668,7918,4.8206,29.395,18036,10503,9180,0.90992,0.93836,0.023196,0.01581,0.0020609,0.080594,18513,11888,0.00087365,0.00044727,0,0.06388,0,0.057002,0.041853,0.079562,0.081616,0.1505,0.36195,0.30181,0.17894,0.23356,0.31418,0.21479,0.25733,0.30425,0.12104,0.25716,0.29609,0.10919,16.015,5.7992,8306,17675,16391,0.23622,0.25053,0.097843,0.51536,0.53275,0.11195,0.66127,0.67141,0.10192,0.74689,0.75421,0.092258,0.82501,0.83,0.087381,0.006422,0.0064233,0.049918,0.014664,0.01639,6.5559e-05,0.013413,0.013203,0.049416,0.019069,0.02232,-0.0064484,0.023118,0.02288,0.050441,0.024511,0.029043,-0.0054248,5.0661e-08,4.4194e-08,9.8013e-07,-0.0060473,-0.013845,-0.0069235,0.00012608,0.00011445,0.0011198,-0.0075916,-0.017698,-0.014314,0.001301,0.0012164,0.0066959,-0.0066182,-0.018535,-0.014987,0.005817,0.0059009,0.083439,0.022228,0.02646,0.0042652,0.011467,0.011468,0.081228,0.027922,0.03388,3.4586e-05,0.018524,0.018682,0.079592,0.033463,0.041016,0.0039204,0.00060494,0.00052235,0.083463,0.0094112,0.027849,-0.017613,0.0019569,0.0017459,0.084671,0.013362,0.037249,-0.018627,0.0037458,0.0033804,0.08123,0.01634,0.044824,-0.020864,0.54995,74,74,40,1054,3,3,3,0.645
30,-0.0037625,0.55055,0.549,-0.67117,0.54486,-0.61287,-0.086876,0.48697,4.3707,0.015331,3.3059,0.00041238,3.5422,4.369,0.65606,5.713,0.0054513,0.6715,2.5548,1.7212,1.1912,0.93291,0.093129,0.080387,0.098361,0.087303,0.090054,0.061784,0.48898,0.35313,0.033838,0.078261,0.14782,0.055101,0.3984,0.0061145,1.0727,0.12326,0.19971,0.19971,0.68665,0.7498,0.25415,1.1043,0.58004,60,17.8,258,2203.1,3.1228,13.197,6966,5022,4212,0.91346,0.94635,0.15096,0.09455,0.13501,2.4299,19447,12501,0.00075517,0.00038888,0,0.037933,0,0.058017,0.012227,0.029329,0.073664,0.075082,0.84455,1.0415,0.035231,0.23982,0.30787,0.24282,0.36129,0.28481,0.095992,0.36214,0.27737,0.09037,21.152,6.5562,6064.8,8040.9,5777,0.18091,0.18099,0.033327,0.54641,0.56128,0.052792,0.72785,0.73638,0.049892,0.79008,0.79406,0.043405,0.82068,0.82378,0.038659,0.00045123,0.00039879,0.0015599,-0.0050952,0.0033749,-0.027253,0.0015392,0.0013569,0.002522,-0.0058233,0.0077345,-0.032295,0.0030961,0.002742,0.0030044,-0.0066684,0.012491,-0.041605,0,0,0,-0.0040111,-0.01496,0,6.1152e-06,5.6968e-06,2.4155e-05,-0.0053276,-0.019385,-0.011909,0.00017104,0.00016329,0.00039151,-0.0063892,-0.021828,-0.009837,0.00018484,0.000155,0.0011792,-0.0038738,0.010578,-0.026145,0.00066112,0.00055842,0.0020828,-0.0044314,0.015956,-0.028964,0.0013816,0.0011775,0.0026403,-0.0049925,0.020302,-0.035286,0.00026638,0.00024379,0.016346,0.0016863,0.025716,-0.014575,0.00087197,0.00079283,0.01678,0.0024825,0.038519,-0.018008,0.0015434,0.0014012,0.014886,0.0024577,0.05043,-0.022912,0.41825,74,74,40,1054,3,3,3,0.645
30,-0.0095922,0.72024,0.70533,-0.54222,0.70368,-0.51603,-0.048312,-1.7712,22.723,-0.0050517,3.2921,0.00086944,13.794,14.41,0.9146,23.648,0.022564,0.54225,3.2599,1.9735,1.4967,1.2068,0.057085,0.072264,0.10001,0.10227,0.064674,0.052987,0.55071,0.13475,0.019015,0.035699,0.0092164,0.39388,0.59075,0.0099544,1.1933,0.14588,0.3048,0.3048,0.31892,0.58509,0.23497,1.4,0.97662,41,132.59,4829,5.6661e+05,6.0888,38.37,1.3038e+05,12015,3132,0.90838,0.93488,0.25508,0.17762,0.19969,0.63403,36407,21929,0.0011311,0.00059992,0,0.068282,0,0.076711,0.0021373,0.026905,0.0013447,0.044392,0.62663,0.45227,0.50872,0.24462,0.32625,0.22397,0.28706,0.33847,0.16315,0.30503,0.33458,0.15155,19.083,6.0473,8731.5,23045,21587,0.18197,0.17574,0.10902,0.55125,0.57804,0.17321,0.75949,0.78409,0.16931,0.87253,0.88745,0.15589,0.93448,0.94376,0.14316,0.0016642,0.0013621,0.018711,-0.003796,0.00098832,-0.030416,0.0033959,0.0027439,0.018096,-0.005346,0.0031938,-0.04072,0.0056615,0.0045391,0.017867,-0.0067955,0.0053807,-0.052394,0,0,0,-0.0073057,-0.013636,0,9.7065e-06,8.6213e-06,0.00012469,-0.0096876,-0.018027,-0.0098996,0.00018829,0.0001612,0.0014017,-0.011581,-0.0209,-0.017198,0.0015733,0.0012921,0.032641,0.0013032,0.007884,-0.029075,0.0031972,0.0025897,0.032756,0.0017392,0.012334,-0.039182,0.0051353,0.0041175,0.031915,0.0017501,0.01576,-0.048879,9.0943e-05,7.0029e-05,0.018148,-0.0012284,0.019281,-0.0092168,0.00018928,0.00014582,0.011845,-0.0027905,0.02575,-0.010837,0.00035353,0.0002716,0.011089,-0.0037694,0.032109,-0.016905,0.54667,74,74,40,1054,3,3,3,0.645
