30,-0.09532,0.99893,0.97404,0.15823,0.84178,0.21654,0.36849,0.65123,2.9199,0.18274,3.2716,0.00010299,4.138,2.7176,2.3141,3.1839,0.0030381,-0.15825,7.6181,5.228,3.2839,2.2555,0.021414,0.020974,0.061031,0.045165,0.073906,0.074795,0.70272,0.59444,4.4393,1.1954,2.7424,0.29127,0.13056,0.062963,9.4564,0.28024,0.23721,0.28024,0.2115,0.38117,0.14139,3.3599,5.6361,72,36.028,1425,29505,7.3973,59.419,38475,8289,5076,0.91581,0.93997,0.038763,0.031028,0.04234,0.13553,19272,12151,0.00092569,0.00037719,2,0.21783,0,0.055604,0.076774,0.36698,0.1125,0.53795,0.41513,0.49285,0.043843,0.26142,0.29012,0.23398,0.31712,0.28902,0.1309,0.31338,0.24047,0.13738,20.896,6.3174,46110,1.2976e+05,1.2938e+05,0.16884,0.14843,0.053847,0.40342,0.37585,0.067634,0.55691,0.56684,0.066062,0.67825,0.7191,0.064233,0.77121,0.80656,0.062335,0.0073546,0.006697,0.052529,0.018561,0.01623,-0.012314,0.015525,0.014003,0.052502,0.024359,0.024391,-0.017804,0.025548,0.022829,0.05159,0.029351,0.032829,-0.023649,0.0067248,0.0062832,0.089535,0.027602,0.023408,-0.0085366,0.013745,0.012791,0.085475,0.034262,0.029113,-0.011742,0.022127,0.020437,0.081217,0.039909,0.034774,-0.01564,0.0005056,0.00032242,0.0090405,-0.002091,-0.0049041,-0.014095,0.0011309,0.00073122,0.010033,-0.002299,-0.0038765,-0.016827,0.0017508,0.0011318,0.0096005,-0.00301,-0.0024929,-0.019825,0.00012418,9.142e-05,0.013836,-0.00031597,0.012487,-0.0092939,0.00064894,0.00048072,0.022853,0.0016138,0.019823,-0.012596,0.00167,0.0012599,0.029437,0.0040064,0.02752,-0.015756,0.48627,74,74,40,1054,3,3,3,0.645
30,-0.026432,0.63955,0.66456,-0.57863,0.56335,-0.80443,0.39024,-0.20544,2.6129,-0.14257,3.3415,0.00037552,3.4692,3.7773,0.8419,5.3443,0.0050995,0.57864,5.146,2.8678,1.3743,0.74768,0.031466,0.040037,0.082496,0.096836,0.16432,0.15258,0.43226,0.016503,0.31364,0.21387,0.036805,0.11812,0.13668,0.02893,0.86454,0.79319,0.29199,0.79319,0.55372,1.1467,0.31442,1.3043,0.8475,50,97.76,4667,4.3264e+05,6.8489,47.946,1.2601e+05,2754,1647,0.91169,0.92578,0.16807,0.13148,0.057271,0.44852,33024,15494,0.0022858,0.00085081,0,0.074191,0,0.049418,0.0068517,0.091632,0.0002637,0.11727,1.4193,3.1188,1.6643,0.28061,0.26417,0.20465,0.35051,0.2072,0.09707,0.35122,0.20223,0.09481,18.116,5.5256,22460,77742,77162,0.32969,0.32335,0.17253,0.76227,0.81604,0.2097,0.89869,0.92993,0.17493,0.94529,0.96385,0.1469,0.96523,0.9774,0.12802,0.011024,0.012636,0.12921,0.040939,0.042072,0.038658,0.023868,0.027119,0.13245,0.055454,0.059016,0.049396,0.042682,0.048195,0.14143,0.074291,0.080172,0.060329,0.0060169,0.0073142,0.13145,0.030999,0.035527,0.040772,0.012051,0.0145,0.12297,0.037448,0.043773,0.051101,0.021016,0.025298,0.12657,0.048183,0.056841,0.066075,0.0033018,0.0036413,0.096877,0.017329,0.01377,0.01678,0.0092142,0.010492,0.13414,0.034081,0.030743,0.033156,0.018582,0.021223,0.1672,0.054158,0.049865,0.044386,0.0017057,0.0016801,0.31185,0.036772,0.037598,-0.0018151,0.0046921,0.0046346,0.27114,0.043813,0.047369,-0.0020166,0.0086409,0.0085391,0.24993,0.051519,0.058466,-0.0024184,0.4936,74,74,40,1054,3,3,3,0.645
30,-0.029832,0.93817,0.93039,-0.26216,0.86996,-0.32898,0.25486,0.99222,3.7454,0.22673,3.1605,0.00035143,4.3847,3.6079,1.4741,4.9999,0.0047709,0.26218,9.3487,5.9004,2.7826,1.538,0.025323,0.025794,0.041313,0.048514,0.12001,0.13024,0.60881,0.086525,1.4609,2.9397,1.3577,0.039667,0.10647,0.060989,6.052,0.41486,0.75674,0.75674,0.40623,0.94179,0.22061,2.0474,2.0909,92,27.891,1828,35976,9.1945,86.969,49356,4185,2457,0.91688,0.94127,0.13861,0.093865,0.098456,0.51685,25703,14855,0.0010673,0.00042758,0,0.08437,0,0.083333,0.034562,0.026138,0.068804,0.072612,0.82643,0.78146,0.43633,0.27798,0.28647,0.2326,0.36198,0.24905,0.14796,0.38681,0.24186,0.13521,20.368,6.2802,13159,25828,24849,0.18821,0.18249,0.073428,0.5419,0.57182,0.11114,0.74384,0.76884,0.10794,0.84564,0.86402,0.097968,0.8956,0.90862,0.088551,0.0057558,0.0054632,0.05029,0.014178,0.021458,-0.01588,0.011436,0.011286,0.047309,0.016831,0.03144,-0.0053308,0.019799,0.020092,0.048909,0.021983,0.043303,0.007852,0.0024915,0.002068,0.040579,0.0072167,0.016614,-0.033388,0.0044709,0.0037699,0.034011,0.006556,0.020981,-0.038664,0.0072964,0.0064608,0.032761,0.007443,0.026239,-0.036493,0.0031096,0.0032653,0.068016,0.013727,0.0077265,0.012059,0.0067098,0.0073256,0.072821,0.019452,0.015763,0.029112,0.011644,0.013008,0.078112,0.026021,0.025086,0.047002,0.00015475,0.00012987,0.021092,0.00026832,0.022387,-0.017851,0.00094158,0.0008253,0.040563,0.0043875,0.030794,-0.020955,0.0029676,0.0027024,0.063991,0.011865,0.041359,-0.021678,0.49856,74,74,40,1054,3,3,3,0.645
30,-0.11026,0.74682,0.88248,0.34159,0.40208,0.59362,0.73782,-0.021831,1.7275,0.085137,3.2969,0.00288,3.0592,1.8668,2.6805,2.1351,0.0020373,-0.34161,8.9395,6.7606,5.2367,4.0899,0.020555,0.025115,0.040983,0.028686,0.031974,0.036686,0.816,1.7288,4.8965,8.786,18.502,11.284,6.0485,0.035359,51.281,0.12957,0.10833,0.12957,0.27039,0.30225,0.17273,3.2097,5.1497,74,63.23,2999,1.3139e+05,7.4389,59.345,80973,25758,5616,0.91159,0.92862,0.21124,0.16116,0.1063,0.59464,24819,14833,0.00085439,0.0003804,0,0.092231,0,0.065666,0.021905,0.036445,0.030851,0.05331,0.15222,0.3557,0.034589,0.2661,0.30733,0.23044,0.30168,0.31456,0.16346,0.3057,0.30752,0.15061,16.287,6.222,15216,46114,45258,0.15869,0.15374,0.083033,0.34775,0.34624,0.09565,0.50556,0.50186,0.098389,0.6263,0.63222,0.097309,0.7368,0.75552,0.097704,0.0094436,0.0097963,0.11066,0.033596,0.031573,0.01019,0.020379,0.02166,0.11307,0.045377,0.047421,0.022598,0.034318,0.037242,0.11369,0.056468,0.063422,0.038354,0.0077281,0.0078889,0.16881,0.041972,0.036728,0.0050164,0.016021,0.016803,0.16345,0.053067,0.04889,0.015409,0.026557,0.028569,0.15992,0.064146,0.06224,0.029682,0.0010301,0.0014312,0.030219,0.0010631,7.203e-05,0.036878,0.0026245,0.0036561,0.0382,0.0038838,0.0050659,0.052963,0.0050855,0.0068206,0.045751,0.0076218,0.010563,0.060073,0.00068539,0.00047625,0.12529,0.012785,0.025016,-0.027244,0.0017341,0.001201,0.10019,0.013278,0.032357,-0.031271,0.0026758,0.0018526,0.077384,0.011847,0.037957,-0.037331,0.57779,74,74,40,1054,3,3,3,0.645
30,-0.021458,0.76181,0.76366,-0.4854,0.7202,-0.60119,0.23854,0.3077,2.7933,0.089898,3.3332,0.00028297,5.5861,5.5038,1.0282,8.1019,0.0077308,0.48542,5.4118,3.2677,1.6485,0.97352,0.035339,0.043628,0.073634,0.078668,0.14382,0.12966,0.49526,0.0029187,0.13204,0.34536,0.14351,0.088645,0.092503,0.0015733,0.80655,0.77332,0.55221,0.77332,0.33193,0.73453,0.19156,1.4941,1.1101,57,77.561,2905,1.5453e+05,6.6667,47.836,78435,16983,12555,0.91376,0.93492,0.113,0.080419,0.066414,0.367,28630,16818,0.0016199,0.00069286,0,0.093292,0,0.065234,0.006932,0.068957,0.0017706,0.13699,1.6207,3.8138,2.1422,0.29064,0.27316,0.19438,0.38688,0.20814,0.063348,0.38756,0.18755,0.051142,20.289,5.2482,11650,28107,26898,0.27828,0.28096,0.13633,0.67986,0.72076,0.17508,0.83314,0.8607,0.15181,0.90592,0.92218,0.13178,0.94382,0.9536,0.11718,0.003623,0.0031619,0.039748,0.0063549,0.0094637,-0.027977,0.0089801,0.0079622,0.046649,0.012054,0.019583,-0.036144,0.017678,0.015879,0.054835,0.020328,0.03279,-0.043451,0.0010679,0.00093324,0.021839,-0.00072024,0.0033143,-0.018495,0.0036163,0.0031908,0.034544,0.0041138,0.0086273,-0.025909,0.0081281,0.0073939,0.045827,0.010678,0.017129,-0.026951,0.0014871,0.0012399,0.040845,0.0041911,0.0019255,-0.023168,0.0036701,0.0031408,0.050016,0.0083869,0.0084384,-0.029515,0.0074939,0.0064598,0.063122,0.015397,0.016751,-0.038601,0.001068,0.00098873,0.18278,0.021056,0.029448,-0.010573,0.0029671,0.0027646,0.1605,0.025141,0.038484,-0.012344,0.0053059,0.0049206,0.14367,0.028363,0.047197,-0.016258,0.4756,74,74,40,1054,3,3,3,0.645
30,-0.01243,0.83221,0.82705,-0.41493,0.80112,-0.48839,0.17706,-0.12432,3.4596,-0.023462,3.3397,1.9229e-06,6.6652,6.1587,1.169,8.923,0.0085143,0.41493,5.4493,3.5307,1.909,1.1531,0.042258,0.045231,0.064759,0.065878,0.12346,0.12108,0.53734,0.048812,0.071022,0.55777,0.35586,0.046816,0.081438,0.021007,1.1827,0.74747,0.36664,0.74747,0.34837,0.77013,0.22177,1.6423,1.3096,61,79.918,3615,2.2133e+05,7.1164,53.39,97605,22221,3321,0.9121,0.93019,0.16955,0.12617,0.092406,0.47584,25097,14164,0.0015277,0.00064393,0,0.11647,0,0.068607,0.0052404,0.15854,0.014806,0.23887,0.70399,2.2623,1.5384,0.28612,0.27145,0.195,0.35793,0.22956,0.079002,0.37391,0.20854,0.06629,15.779,5.265,13204,37924,36882,0.28049,0.27695,0.14953,0.65904,0.69909,0.1847,0.84442,0.87815,0.16744,0.92654,0.94622,0.14668,0.96622,0.97635,0.13054,0.0075209,0.0072279,0.089793,0.024908,0.02621,-0.010399,0.016348,0.016046,0.092417,0.034065,0.038154,-0.0066561,0.028734,0.028564,0.096994,0.045006,0.051794,-0.0027301,0.0019443,0.0015658,0.043272,0.0049232,0.013,-0.025631,0.0043203,0.0037403,0.04491,0.0070933,0.017202,-0.025092,0.0081605,0.0073935,0.050069,0.011246,0.022931,-0.023592,0.0037183,0.0035974,0.11114,0.020505,0.012439,-0.0066517,0.0095212,0.0095021,0.1412,0.035827,0.026239,-0.00057419,0.018141,0.018512,0.16629,0.053141,0.042353,0.0076138,0.0018583,0.0020647,0.3461,0.040746,0.044222,0.016921,0.0050309,0.0054679,0.29615,0.047762,0.053099,0.018136,0.0090997,0.0098389,0.26813,0.055092,0.062781,0.020949,0.56459,74,74,40,1054,3,3,3,0.645
30,-0.10595,0.83226,0.91177,0.29557,0.55774,0.47975,0.62313,-0.024442,2.0233,-0.081567,3.3541,0.001363,3.9231,2.436,2.5887,2.763,0.0026364,-0.29557,8.6752,6.3746,4.3025,3.0547,0.022694,0.020974,0.044989,0.032773,0.053858,0.058986,0.76573,0.79949,6.7377,5.1593,10.057,1.809,0.88465,0.043135,25.49,0.17169,0.23861,0.23861,0.25639,0.35295,0.18017,3.2325,5.2117,71,36.282,809,15150,4.6494,26.068,21843,15579,7533,0.91586,0.93911,0.145,0.10245,0.082006,0.52303,19514,13015,0.00071124,0.00033208,0,0.052419,0,0.068975,0.0018699,0.067323,0.0050708,0.11171,1.0211,1.4398,0.3204,0.25948,0.31216,0.23614,0.30603,0.32347,0.16226,0.30247,0.31809,0.14973,17.875,6.3757,9854.7,19190,17689,0.17283,0.19489,0.060405,0.338,0.35633,0.062099,0.47648,0.48542,0.06194,0.62209,0.62985,0.064562,0.72278,0.73122,0.06402,0.013433,0.01744,0.10514,0.042408,0.046586,0.12424,0.028745,0.035917,0.10653,0.056575,0.062911,0.13517,0.046593,0.05639,0.10311,0.067225,0.076779,0.13786,0.012077,0.01575,0.1762,0.056847,0.059435,0.11744,0.024044,0.029891,0.16386,0.068874,0.069132,0.11733,0.036467,0.043431,0.14668,0.075432,0.07567,0.10787,0.0010313,0.0013512,0.020207,0.00087171,-0.0024824,0.04242,0.0031499,0.0044358,0.030624,0.0051192,0.0038951,0.078503,0.0062753,0.0090883,0.03771,0.0095401,0.011387,0.10994,0.00032506,0.00033894,0.03969,0.0035113,0.026196,0.0044251,0.0015503,0.00159,0.059831,0.0092612,0.035528,0.0040076,0.0038507,0.0038707,0.074384,0.015997,0.044525,0.0010819,0.49519,74,74,40,1054,3,3,3,0.645
30,-0.016847,0.80404,0.81398,-0.4304,0.75469,-0.54657,0.26989,-0.02175,2.6564,0.0097176,3.3698,0.00019754,6.9847,6.5415,1.138,9.223,0.0088005,0.43044,6.7582,3.9312,1.9885,1.159,0.032478,0.02578,0.065389,0.074338,0.13263,0.12932,0.54006,0.0034858,1.5003,0.58054,0.21361,0.059614,0.090873,0.014505,2.463,0.74126,0.39341,0.74126,0.35248,0.9414,0.28459,1.6127,1.2882,66,54.727,1815,78361,5.5644,32.58,49005,38637,3618,0.9158,0.9385,0.16047,0.1129,0.10355,0.60445,29474,15343,0.0010805,0.00052015,0,0.066372,0,0.070367,0.03806,0.10556,0.058535,0.15384,1.1227,2.5956,1.6225,0.26257,0.30547,0.23392,0.30354,0.29808,0.18182,0.31495,0.31113,0.17098,16.025,6.3158,10492,23069,21636,0.18553,0.17058,0.078415,0.5271,0.52222,0.11711,0.67767,0.67611,0.10653,0.77207,0.77773,0.096898,0.84222,0.85172,0.090213,0.0037445,0.0032346,0.035443,0.0063986,0.010694,-0.028907,0.0081064,0.0070729,0.036331,0.008916,0.019109,-0.039519,0.01662,0.014857,0.044476,0.016829,0.031854,-0.047186,0.0029426,0.0025795,0.051921,0.010111,0.014841,-0.022598,0.0058579,0.0051675,0.048276,0.011722,0.020175,-0.030244,0.011309,0.010216,0.055009,0.018118,0.028808,-0.034782,0.00079086,0.00064655,0.01874,-0.00058263,-0.0026315,-0.019723,0.0020853,0.0017786,0.024518,0.0012671,0.0019524,-0.024028,0.004473,0.0039763,0.032506,0.0049398,0.0083885,-0.025361,1.1074e-05,8.5916e-06,0.0016352,-0.0027481,0.0083956,-0.014413,0.00016409,0.00012758,0.0076578,-0.0026237,0.01405,-0.020111,0.00085451,0.00067752,0.019961,-0.00023728,0.021655,-0.027679,0.50241,74,74,40,1054,3,3,3,0.645
30,-0.00415,0.80687,0.8039,-0.44197,0.80057,-0.47042,0.064371,0.38082,2.7403,0.087892,3.3517,0.00030982,3.9334,3.7216,1.115,4.8372,0.0046157,0.44198,4.2028,2.5298,1.6792,1.2017,0.046776,0.05,0.092738,0.0914,0.090249,0.08121,0.54763,0.097945,0.025467,0.054886,0.020293,0.0036318,0.0068353,0.024396,0.23345,0.35169,0.50878,0.50878,0.32876,0.49369,0.17725,1.5921,1.2644,42,96.881,3674,3.1716e+05,6.221,39.812,99198,3699,2565,0.91145,0.93309,0.35712,0.275,0.19147,0.88978,71103,30270,0.00088235,0.00039748,0,0.099341,0,0.087369,0.00046395,0.010995,0.0045023,0.018931,0.58637,0.17134,1.0747,0.27037,0.33006,0.24756,0.3301,0.36158,0.22195,0.33923,0.37762,0.20039,55.847,6.684,26214,68958,68129,0.041969,0.029938,0.019211,0.22014,0.20259,0.052971,0.51433,0.52524,0.087567,0.72437,0.75025,0.098461,0.83031,0.86007,0.096323,5.8858e-05,3.7668e-05,0.00060337,-0.0093131,-0.0041337,-0.015365,0.00028591,0.00018797,0.0013878,-0.011796,-0.0025652,-0.018704,0.00081194,0.00055078,0.0023533,-0.013912,0.0012647,-0.02654,5.8858e-05,3.7668e-05,0.0011248,-0.0067385,-0.00043329,-0.015365,0.00028591,0.00018797,0.0025519,-0.0082642,0.00051521,-0.018704,0.00080675,0.00054756,0.0042501,-0.009385,0.0031622,-0.026344,0,0,0,-0.005894,-0.0075921,0,0,0,0,-0.0076025,-0.0079309,0,5.1842e-06,3.2202e-06,4.0802e-05,-0.0092384,-0.0076423,-0.01142,0,0,0,-0.0031056,0.0055851,0,0,0,0,-0.0043144,0.0092186,0,0,0,0,-0.0055533,0.014266,0,0.38947,74,74,40,1054,3,3,3,0.645
30,-0.0071667,0.93554,0.92371,-0.27461,0.91726,-0.29756,0.083588,0.045232,12.432,0.2088,3.1443,0.0016344,10.86,9.0126,1.4493,13.963,0.013323,0.27462,5.3288,3.9902,2.4148,1.4726,0.040043,0.047105,0.057627,0.04305,0.093906,0.11335,0.60492,0.036519,0.032579,0.75027,1.8418,0.00015632,0.053834,0.065172,2.7803,0.31869,0.59326,0.59326,0.26626,0.78069,0.22551,2.0054,2.0113,59,94.695,4415,3.2959e+05,7.3344,55.474,1.192e+05,12771,4374,0.91034,0.92848,0.12534,0.095142,0.049661,0.38498,30565,18420,0.0012532,0.00062344,1,0.18218,0,0.076407,0.065195,0.13317,0.087451,0.19198,1.0985,1.6168,0.16785,0.26006,0.31022,0.23728,0.29892,0.31295,0.18133,0.28481,0.33491,0.19687,20.149,6.4066,27657,91611,90881,0.20619,0.1878,0.12487,0.54934,0.54746,0.17489,0.71374,0.72125,0.16078,0.81455,0.82868,0.14649,0.8969,0.91267,0.13766,0.0043059,0.0033982,0.0584,0.010505,0.015881,-0.037699,0.010973,0.0089015,0.070466,0.019644,0.027152,-0.048548,0.021391,0.018039,0.082026,0.031194,0.041151,-0.053074,0.0022228,0.0017792,0.056198,0.0071826,0.013889,-0.026483,0.0059844,0.0048936,0.070669,0.014634,0.02103,-0.035171,0.012002,0.010174,0.083655,0.023942,0.030484,-0.038825,0.0011429,0.00086866,0.038805,0.0020162,0.0013529,-0.022862,0.0031724,0.0025624,0.053447,0.0068941,0.0076362,-0.027576,0.0065691,0.0055964,0.068405,0.013732,0.015639,-0.028002,0.00094024,0.0007503,0.19893,0.020242,0.025063,-0.017868,0.0024846,0.0019951,0.16615,0.022667,0.032219,-0.02326,0.0044863,0.0036288,0.15017,0.025752,0.040113,-0.028543,0.55701,74,74,40,1054,3,3,3,0.645
30,-0.099166,0.77198,0.85795,0.37581,0.49331,0.62081,0.65193,0.58017,2.1201,0.31202,3.2083,0.0012459,3.6826,2.219,2.7489,2.7913,0.0026635,-0.37582,9.7617,6.9119,5.6697,4.7061,0.024055,0.020417,0.032815,0.034046,0.023946,0.025755,0.83897,0.63605,7.453,11.716,9.0068,18.617,12.176,0.079072,59.684,0.060899,0.17479,0.17479,0.18233,0.22267,0.12731,3.1989,5.1027,67,81.463,5041,3.7688e+05,7.9836,64.831,1.3611e+05,3807,2673,0.90906,0.91983,0.058645,0.046872,0.033574,0.13061,24674,14202,0.0011236,0.00045468,0,0.10384,0,0.055556,0.020977,0.075885,0.030021,0.10354,0.24992,0.15196,0.35351,0.2583,0.29589,0.2289,0.28178,0.30994,0.17975,0.28168,0.28561,0.16309,16.17,6.1804,27003,1.152e+05,1.1467e+05,0.17652,0.18144,0.10594,0.37211,0.39429,0.1174,0.51647,0.53982,0.11529,0.63235,0.6518,0.1127,0.72822,0.74964,0.11077,0.0092859,0.012339,0.12481,0.035266,0.043404,0.074074,0.020477,0.025936,0.13032,0.048997,0.057938,0.079941,0.034708,0.041862,0.1319,0.061489,0.070987,0.076639,0.0082203,0.011562,0.20596,0.048427,0.059153,0.084423,0.017134,0.023369,0.20051,0.061647,0.072672,0.098005,0.027899,0.036478,0.1927,0.072983,0.083169,0.10074,0.00041111,0.00033105,0.013833,-0.003615,-0.0046384,-0.010616,0.0012754,0.0010187,0.021294,-0.0024655,-0.0031492,-0.016021,0.0026241,0.0020254,0.027079,-0.00092733,-0.00096332,-0.023852,0.00065449,0.00044583,0.13723,0.01294,0.018196,-0.02316,0.0020745,0.0015521,0.13748,0.018019,0.025566,-0.026124,0.0042501,0.0033943,0.14098,0.023947,0.034297,-0.027477,0.6667,74,74,40,1054,3,3,3,0.645
30,-0.016937,0.55518,0.53754,-0.67967,0.53693,-0.65673,-0.03374,0.065113,3.1376,0.013984,3.3427,7.5904e-07,5.5587,6.9414,0.64006,8.9562,0.008546,0.67967,2.1057,1.4553,1.1352,0.84842,0.077885,0.089309,0.14934,0.085984,0.061536,0.073257,0.46269,0.24366,0.069664,0.013352,0.21332,0.78342,0.18295,0.031736,1.5381,0.33021,0.33876,0.33876,0.46233,0.75114,0.25155,1.1004,0.6011,44,109.02,4097,3.7823e+05,6.3497,41.551,1.1062e+05,6426,5535,0.90722,0.92371,0.37696,0.31088,0.15957,0.86727,36073,18912,0.0023279,0.00072184,0,0.072092,0,0.056207,0.007671,0.096085,0.010652,0.11753,0.35103,1.3066,0.97265,0.26743,0.28365,0.2008,0.34017,0.24405,0.10161,0.30831,0.24711,0.077801,33.828,5.4216,24608,93957,93270,0.20597,0.20962,0.10391,0.57781,0.61921,0.15323,0.7576,0.79776,0.14216,0.83101,0.86406,0.12449,0.87129,0.89937,0.1114,0.010186,0.011215,0.11508,0.036353,0.035977,0.027211,0.02678,0.03274,0.14326,0.062672,0.06839,0.0856,0.05197,0.067424,0.16601,0.092324,0.10602,0.1521,0.0074336,0.0080326,0.15656,0.039339,0.036719,0.017474,0.018092,0.02258,0.17797,0.060085,0.063669,0.07661,0.035099,0.048095,0.20379,0.087114,0.10002,0.15359,0.00037236,0.00024111,0.010532,-0.0035785,-0.0036747,-0.021798,0.0012214,0.00079215,0.017141,-0.002498,-0.0021902,-0.029694,0.0026355,0.0017976,0.022861,-0.00080963,-4.2459e-05,-0.035301,0.0023795,0.002941,0.41938,0.051633,0.059647,0.03683,0.0074662,0.0093679,0.41591,0.071098,0.083899,0.052541,0.014237,0.017532,0.39697,0.087081,0.10228,0.060284,0.44846,74,74,40,1054,3,3,3,0.645
30,-0.011598,0.87005,0.869,-0.36079,0.84415,-0.42181,0.16911,3.5786,59.926,-0.021393,3.2233,0.0029901,16.451,14.544,1.2769,25.119,0.023968,0.36084,6.6227,3.8522,2.1407,1.278,0.032726,0.031205,0.060791,0.075465,0.11314,0.12148,0.56519,0.00019484,0.60816,0.61764,0.14379,0.026189,0.085962,0.040333,1.5223,0.57843,0.61681,0.61681,0.47388,0.54017,0.23493,1.7667,1.531,67,51.134,1394,34694,5.871,40.855,37638,13878,8640,0.91204,0.93412,0.19281,0.14742,0.10048,0.625,32033,15536,0.0010586,0.00052368,1,0.21014,0,0.09737,0.1117,0.30096,0.16644,0.4505,1.5266,2.8411,1.2468,0.24747,0.29802,0.26367,0.29672,0.28888,0.21574,0.26757,0.2893,0.27772,21.949,7.1191,13412,33604,32871,0.16751,0.13759,0.067055,0.50185,0.44159,0.1056,0.6719,0.61092,0.10004,0.78219,0.73833,0.092976,0.87263,0.84197,0.088528,0.0092451,0.0079386,0.082879,0.02849,0.024216,-0.03489,0.021077,0.019637,0.089465,0.041323,0.03969,-0.022621,0.037391,0.037569,0.094771,0.054946,0.058758,0.0020167,0.0025619,0.0020097,0.042813,0.0077057,0.011472,-0.025933,0.0051882,0.0040443,0.040495,0.0091037,0.015684,-0.035014,0.0093372,0.0072894,0.043016,0.012669,0.022196,-0.046773,0.0047956,0.0043894,0.10763,0.024434,0.01469,-0.016935,0.013072,0.01319,0.14556,0.045128,0.032671,0.0024623,0.024893,0.027409,0.17133,0.066191,0.054406,0.035295,0.0018875,0.0015395,0.26397,0.035788,0.032336,-0.021041,0.0044475,0.0037777,0.19658,0.035998,0.04106,-0.022467,0.007353,0.0065829,0.16268,0.03745,0.050706,-0.01907,0.47402,74,74,40,1054,3,3,3,0.645
30,-0.0011774,0.34927,0.34804,-0.80724,0.34721,-0.76779,-0.048864,0.41168,3.12,0.086734,3.3184,5.2791e-07,3.1089,5.0057,0.38499,6.7225,0.0064146,0.80731,1.5684,1.1162,0.80911,0.60847,0.097117,0.13427,0.15215,0.083977,0.080986,0.069607,0.38189,0.33302,0.21004,0.0036927,0.38992,0.28905,0.39547,0.31165,1.9328,0.22248,0.32533,0.32533,0.24041,0.24052,0.15782,0.81498,0.32867,33,229.85,6584,1.3034e+06,5.4027,30.462,1.7777e+05,14634,10314,0.89723,0.91096,0.43858,0.36238,0.22373,0.83418,1.0228e+05,42138,0.001773,0.00065748,0,0.079014,0,0.058122,0.0014762,0.011001,0.0034694,0.010173,0.73326,0.53983,0.61594,0.28159,0.36708,0.22465,0.30372,0.41985,0.19468,0.33198,0.42881,0.17321,69.024,6.0656,24391,1.2848e+05,1.28e+05,0.042056,0.031261,0.032881,0.28258,0.28211,0.11614,0.5492,0.57131,0.15971,0.7446,0.77055,0.17287,0.87891,0.90329,0.17415,0.001687,0.0011329,0.029539,-0.0029711,0.00046845,-0.03723,0.0047433,0.0033968,0.039324,0.00029076,0.0052078,-0.046061,0.0098606,0.0076093,0.048814,0.0053836,0.012457,-0.050391,0.00092525,0.00059591,0.0302,-0.0020422,0.0034767,-0.029569,0.0026313,0.0018049,0.040115,0.0004665,0.0057759,-0.038494,0.0057136,0.0043022,0.051412,0.0050304,0.01096,-0.041814,3.2562e-05,2.2948e-05,0.0014274,-0.00748,-0.008175,-0.010045,0.00020786,0.00015096,0.0045209,-0.0088463,-0.0079736,-0.012689,0.00072556,0.0005575,0.0097538,-0.0091178,-0.0065229,-0.015992,0.00072923,0.00051409,0.19918,0.017,0.01647,-0.021846,0.0019076,0.0014433,0.16469,0.018542,0.021595,-0.023909,0.0034791,0.0027884,0.15034,0.021151,0.026939,-0.025002,0.39895,74,74,40,1054,3,3,3,0.645
30,-0.0032915,0.67223,0.66823,-0.57545,0.66469,-0.53359,-0.072736,-0.76695,6.9426,-0.063517,3.1828,0.0031848,7.3965,8.0231,0.84829,11.661,0.011127,0.57545,2.8278,1.9791,1.3771,0.97085,0.080237,0.073613,0.10332,0.074832,0.085486,0.087187,0.49532,0.3254,0.030518,0.016352,0.22275,0.040218,0.0040921,0.00045006,0.63978,0.38126,0.51034,0.51034,0.45049,0.4508,0.21482,1.2726,0.60935,45,71.178,2827,1.7638e+05,6.4199,42.471,76329,6102,1323,0.91668,0.93761,0.1175,0.089467,0.021019,0.46653,27284,14150,0.0015838,0.00051938,0,0.074,0,0.061793,0.017368,0.045086,0.023456,0.050185,0.54426,2.1883,1.5248,0.26822,0.26445,0.21047,0.3279,0.18617,0.075993,0.3563,0.14385,0.056829,19.325,5.6826,31510,76803,76210,0.29897,0.29648,0.10502,0.66448,0.72917,0.12269,0.81357,0.86053,0.10629,0.93374,0.95304,0.097392,0.98291,0.98879,0.087498,0.0019663,0.0014118,0.015467,-0.00091226,0.0049676,-0.02911,0.0046868,0.0039783,0.017457,5.968e-05,0.010731,-0.023291,0.0093098,0.0091937,0.020705,0.0026121,0.01926,-0.002544,0.0019179,0.0013802,0.028124,0.0038399,0.0099872,-0.028271,0.00435,0.0037578,0.029794,0.0058267,0.013652,-0.01985,0.0083752,0.0085757,0.033857,0.0095912,0.020117,0.0045831,3.1067e-05,1.9659e-05,0.00061181,-0.0049678,-0.0068136,-0.01342,0.00026175,0.0001692,0.0025576,-0.0056634,-0.0053629,-0.018021,0.00080595,0.00053406,0.0048675,-0.0058188,-0.0028313,-0.023709,1.7289e-05,1.1965e-05,0.0021216,-0.0023816,0.01092,-0.0089204,9.8012e-05,6.7504e-05,0.0038015,-0.0029439,0.016223,-0.010202,0.00027121,0.00018526,0.0052653,-0.0033803,0.022186,-0.0122,0.44326,74,74,40,1054,3,3,3,0.645
30,-0.0034542,0.94308,0.94353,-0.23574,0.93579,-0.2571,0.090572,0.77457,3.9262,0.15767,3.2298,0.00030646,5.5406,4.4796,1.5269,6.1636,0.0058813,0.23576,5.0697,3.5907,2.3288,1.585,0.036744,0.040995,0.077061,0.053709,0.08356,0.087478,0.62045,0.022772,0.11166,0.14484,0.76409,0.012213,0.001698,0.083636,1.1409,0.23818,0.60875,0.60875,0.35558,0.3911,0.20783,2.1163,2.2395,37,172.68,6063,9.8797e+05,5.8261,34.973,1.637e+05,3969,2673,0.90926,0.92883,0.39929,0.28937,0.25091,0.91677,56599,31593,0.00065517,0.00035563,0,0.061421,0,0.062518,0.016318,0.012932,0.016646,0.010963,0.5421,1.4492,0.30364,0.26848,0.3377,0.2768,0.31975,0.3716,0.27359,0.3307,0.37287,0.26478,53.453,7.4735,15768,39417,37893,0.021326,0.017349,0.013485,0.12577,0.11747,0.041804,0.32486,0.32396,0.076402,0.51987,0.52984,0.097611,0.66214,0.67642,0.10611,0.0042805,0.0045943,0.060614,0.010611,0.021452,0.02673,0.011975,0.012873,0.080292,0.023276,0.037456,0.037983,0.022676,0.024221,0.090785,0.034913,0.053116,0.044184,0.0015359,0.0016642,0.040543,0.0024877,0.01672,0.0153,0.0032661,0.0036424,0.040268,0.0031714,0.020266,0.028281,0.0059456,0.0067449,0.043267,0.0052431,0.02529,0.043418,3.2431e-05,2.5099e-05,0.0011497,-0.0067021,-0.0062833,-0.013225,0.00019456,0.0001478,0.0034222,-0.0079923,-0.0046615,-0.020297,0.0005874,0.0004498,0.0063862,-0.0086934,-0.0020616,-0.028917,0.0027122,0.002905,0.59913,0.066613,0.067966,0.023403,0.0085192,0.0090857,0.59482,0.091839,0.093609,0.029031,0.016177,0.01705,0.56535,0.11203,0.11518,0.029444,0.40536,74,74,40,1054,3,3,3,0.645
30,-0.0017331,0.41289,0.41141,-0.76694,0.41104,-0.74395,-0.029974,-0.84862,8.2772,0.039663,3.2202,0.0025543,4.6589,6.8207,0.46567,9.289,0.0088635,0.76694,1.8009,1.2769,0.95973,0.70009,0.10995,0.09959,0.13969,0.083161,0.071942,0.078873,0.41679,0.40411,0.090709,0.00062325,0.28497,0.41827,0.1231,0.12641,1.4482,0.32291,0.26808,0.32291,0.42857,0.90528,0.27728,0.90292,0.35032,36,246.72,8712,2.0991e+06,5.7456,34.018,2.3522e+05,2133,2025,0.91129,0.93005,0.30274,0.21967,0.23785,0.64587,49921,29307,0.0014079,0.00078468,0,0.060295,0,0.052472,0.0060008,0.0099241,0.0069584,0.011056,1.0506,1.0825,0.15286,0.28192,0.30031,0.19661,0.33777,0.30258,0.11688,0.35227,0.29033,0.102,22.845,5.3086,10118,38517,37536,0.19198,0.18639,0.1693,0.53194,0.56901,0.2466,0.74958,0.7849,0.24587,0.88102,0.90355,0.23071,0.94648,0.95799,0.21154,0.0040927,0.0044004,0.08083,0.01147,0.01735,0.016956,0.0086632,0.0090095,0.081012,0.015137,0.024151,0.012054,0.014967,0.015365,0.083575,0.019984,0.033354,0.010137,0.0030838,0.0035355,0.11353,0.015965,0.020964,0.027755,0.006022,0.0066733,0.10355,0.017979,0.024185,0.026562,0.010019,0.010989,0.10169,0.02161,0.030561,0.029825,0.00027835,0.00021119,0.013762,-0.0056591,-0.0047112,-0.015361,0.00076609,0.00059805,0.018794,-0.0060681,-0.0026497,-0.021319,0.0017111,0.0013712,0.025946,-0.0052565,0.00024014,-0.027998,0.00073058,0.0006537,0.22508,0.018143,0.026482,-0.01355,0.0023562,0.002117,0.22944,0.02581,0.03656,-0.017563,0.0045398,0.004029,0.22128,0.031763,0.045592,-0.024126,0.56661,74,74,40,1054,3,3,3,0.645
30,-0.0045439,0.60183,0.59541,-0.63563,0.59541,-0.63507,-0.00087518,1.3944,9.9219,0.14318,3.2223,0.0012321,9.1322,10.693,0.728,16.444,0.015691,0.63564,2.6436,1.7959,1.2569,0.89352,0.074033,0.084087,0.10582,0.084423,0.086659,0.08626,0.47872,0.25447,0.069804,0.018531,0.14276,0.050247,0.017033,0.0029304,0.55578,0.51845,0.31576,0.51845,0.2996,0.68614,0.21844,1.1855,0.68938,85,21.247,569,5695.9,5.7256,37.794,15363,10854,3051,0.91823,0.94372,0.14457,0.096405,0.10184,0.61132,19253,13152,0.00095271,0.00046631,0,0.048631,0,0.066119,0.0049692,0.015491,0.022314,0.040459,0.91371,1.2449,0.087053,0.26693,0.29145,0.21355,0.34224,0.24118,0.078794,0.34976,0.22905,0.072249,18.624,5.7659,11382,17889,16197,0.29565,0.29833,0.079708,0.71531,0.73415,0.10138,0.88249,0.89568,0.088495,0.94827,0.95481,0.075917,0.97876,0.982,0.066876,0.005432,0.0052278,0.032798,0.010679,0.022119,-0.012556,0.011568,0.011099,0.03307,0.014221,0.034345,-0.018187,0.021259,0.020462,0.03629,0.020437,0.048546,-0.022416,0.004478,0.0044314,0.050401,0.015068,0.023201,-0.0030365,0.0084758,0.0083503,0.044557,0.016674,0.028919,-0.0054299,0.01344,0.013152,0.041703,0.018795,0.03636,-0.0096542,0.00075826,0.00063779,0.011462,-0.00062999,0.0015983,-0.032928,0.0031035,0.002766,0.023276,0.0043358,0.010109,-0.031193,0.0082664,0.0077175,0.03832,0.013258,0.020815,-0.027224,0.00019581,0.00015866,0.018443,0.00091085,0.021712,-0.012045,0.0003349,0.00027136,0.00997,-0.00082997,0.030057,-0.012045,0.00034984,0.00028331,0.0052131,-0.0025824,0.037712,-0.012327,0.4529,74,74,40,1054,3,3,3,0.645
30,-0.017103,0.32462,0.30389,-0.83416,0.29995,-0.92913,0.11385,-0.077044,2.2735,-0.001409,3.3696,0.00075752,2.7781,4.8222,0.33126,5.9931,0.0057186,0.8342,1.7777,0.92448,0.77486,0.64267,0.073301,0.10514,0.17822,0.16044,0.044035,0.045575,0.39329,0.076255,0.016352,0.00013919,0.0045315,6.437,4.3349,0.7728,11.642,0.1482,0.1196,0.1482,0.43941,0.45172,0.1922,0.74959,0.28037,33,85.636,2405,1.7249e+05,5.3375,29.965,64935,8397,2673,0.91382,0.93577,0.28291,0.23984,0.049597,0.79943,82047,20543,0.00088698,0.0004302,0,0.077659,0,0.067571,0.0013072,0.012809,0.0016537,0.014676,0.49308,0.31164,0.02277,0.24241,0.33414,0.29278,0.24794,0.40223,0.30274,0.22828,0.37999,0.35741,47.703,7.905,37276,1.4134e+05,1.409e+05,0.023677,0.014386,0.0082202,0.22719,0.22174,0.041464,0.49029,0.53354,0.063314,0.71482,0.77895,0.073695,0.87284,0.91972,0.076801,0.0020483,0.0019803,0.015926,-0.00059793,0.0050924,-0.0037211,0.0062487,0.0062073,0.023005,0.0037163,0.011233,-0.0010006,0.013975,0.014838,0.03072,0.010654,0.02116,0.012991,0.0014925,0.0017023,0.021633,0.0016048,0.0072864,0.013522,0.0044073,0.0052245,0.029836,0.005975,0.012334,0.023305,0.009799,0.012286,0.039155,0.012862,0.021309,0.044727,0.00030111,0.00015187,0.0058612,-0.0033706,-0.0045663,-0.027073,0.0011939,0.00059721,0.011531,-0.0021663,-0.0026516,-0.034956,0.0027529,0.0013739,0.016434,-0.00034072,-0.00017465,-0.045582,0.00025466,0.00012622,0.030889,0.0021575,0.014071,-0.019529,0.00091155,0.00052349,0.034946,0.0038831,0.019044,-0.026534,0.0024046,0.0016797,0.046143,0.0081448,0.026304,-0.028388,0.38287,74,74,40,1054,3,3,3,0.645
30,-0.017887,0.72399,0.70484,-0.54267,0.69125,-0.4673,-0.13888,-0.15611,2.8906,-0.041031,3.3474,3.0301e-05,3.4941,3.6519,0.91369,4.7129,0.0044971,0.5427,2.7925,1.7271,1.3686,1.0631,0.051055,0.068241,0.13568,0.10422,0.056157,0.063264,0.52138,0.070586,0.0033601,0.0073842,0.011356,0.83179,0.3203,0.00016257,1.2449,0.32976,0.29202,0.32976,0.29688,0.30134,0.17062,1.3746,0.94051,51,40.725,656,12822,3.6705,17.744,17712,10125,8235,0.91922,0.94716,0.12392,0.078275,0.10147,0.55503,25473,16291,0.00077246,0.0003849,0,0.051437,0,0.064018,0.0076086,0.036661,0.014664,0.048407,1.9215,0.54556,1.0665,0.25929,0.32201,0.26484,0.32009,0.40085,0.19829,0.32159,0.40381,0.19722,30.685,7.1506,6925.4,11100,8291.8,0.043336,0.040655,0.012192,0.2958,0.29561,0.043746,0.5023,0.50446,0.052561,0.6589,0.66351,0.055045,0.75345,0.7573,0.053721,0.0016097,0.0014304,0.010142,-0.0020216,0.011284,-0.029505,0.0033107,0.0030692,0.0098765,-0.0028421,0.017761,-0.026458,0.0060971,0.0057808,0.010861,-0.0026536,0.026228,-0.024459,0.0011523,0.0010305,0.013534,-0.0001481,0.012514,-0.023578,0.002167,0.0020386,0.011888,-0.0010552,0.015227,-0.016644,0.0037147,0.0036109,0.012028,-0.0012183,0.019673,-0.010136,0.00041956,0.00036664,0.0066178,-0.002411,-0.0031539,-0.016647,0.0007711,0.00069839,0.0060348,-0.0033587,-0.00058417,-0.016161,0.0011347,0.0010484,0.0054889,-0.0043723,0.0030528,-0.014022,3.7774e-05,3.3302e-05,0.0037127,-0.0017768,0.021627,-0.017329,0.00040744,0.00036141,0.012657,-0.00030242,0.029893,-0.023496,0.0013963,0.0012457,0.021711,0.0024327,0.038141,-0.028555,0.40494,74,74,40,1054,3,3,3,0.645
30,-0.0040336,0.67682,0.67749,-0.56733,0.66851,-0.50203,-0.1151,0.069472,3.1453,-0.01907,3.3399,4.2364e-06,3.4104,3.6646,0.86447,4.7196,0.0045034,0.56735,2.5957,1.7813,1.4033,1.063,0.067881,0.083682,0.11798,0.082405,0.057217,0.069458,0.52138,0.23688,0.084539,0.00018908,0.13047,0.73069,0.13469,0.0022264,1.3197,0.24432,0.28612,0.28612,0.38076,0.48517,0.22827,1.3264,0.86831,47,119.06,4354,4.0474e+05,6.4269,43.089,1.1756e+05,16902,4212,0.91187,0.93292,0.38113,0.28238,0.25905,0.84554,52725,29194,0.00095296,0.00042113,0,0.06582,0,0.06848,0.00071564,4.2615e-05,0.00088168,0.0020806,0.49855,1.2646,0.29626,0.27901,0.33327,0.22588,0.35189,0.38653,0.14866,0.36071,0.38842,0.13995,39.305,6.0987,18619,49575,48409,0.0582,0.046037,0.033989,0.26016,0.25353,0.07987,0.49027,0.50166,0.1065,0.70979,0.71992,0.12309,0.85434,0.86205,0.12645,2.7906e-06,2.2395e-06,3.6498e-05,-0.010829,-0.0028251,-0.0096894,0.00010141,7.7824e-05,0.00062802,-0.01393,-0.0001252,-0.019752,0.00074584,0.00055631,0.002758,-0.015913,0.0042143,-0.033715,1.0108e-06,8.9235e-07,2.4644e-05,-0.0080283,0.0011531,-0.0042609,5.8235e-05,4.5992e-05,0.00066315,-0.010313,0.0012583,-0.015827,0.00044782,0.00034235,0.0030099,-0.011729,0.0034553,-0.024392,0,0,0,-0.0066788,-0.0093244,0,3.9414e-07,2.5733e-07,6.4032e-06,-0.0086129,-0.0090764,-0.011126,1.6184e-05,1.1052e-05,0.00016251,-0.010428,-0.0084696,-0.013068,1.7798e-06,1.3471e-06,0.00036312,-0.0034748,0.012084,-0.0087183,4.2783e-05,3.1575e-05,0.002759,-0.0044216,0.016908,-0.012315,0.00028184,0.0002029,0.0090973,-0.0043096,0.021812,-0.022066,0.45287,74,74,40,1054,3,3,3,0.645
30,-0.0066157,0.64601,0.64986,-0.59121,0.62701,-0.48035,-0.18751,-0.099174,2.9136,-0.038138,3.3484,1.5443e-05,3.0843,3.4098,0.81663,4.4284,0.0042255,0.59126,2.6465,1.7345,1.3439,1.0338,0.078762,0.078849,0.10526,0.0929,0.061883,0.066078,0.51627,0.27335,0.031461,0.036689,0.08979,0.61893,0.24035,0.00034647,1.2909,0.21875,0.28749,0.28749,0.50051,0.52555,0.26003,1.2767,0.80942,40,136.82,4287,4.591e+05,5.9127,36.592,1.1575e+05,12879,10395,0.90776,0.92591,0.37826,0.29773,0.21053,0.85237,68915,31356,0.0009963,0.00049449,0,0.069783,0,0.063653,0.0023004,0.0020373,0.0035696,0.0026909,0.91339,0.34594,0.84328,0.22914,0.35571,0.28652,0.20758,0.43277,0.30779,0.19636,0.44252,0.32583,50.648,7.736,18826,60387,58849,0.03407,0.023092,0.018934,0.25361,0.22835,0.074092,0.48928,0.49186,0.10114,0.69786,0.71849,0.11516,0.85159,0.87688,0.11994,0.00048594,0.00031986,0.006048,-0.0082421,-0.0029508,-0.023475,0.0014029,0.0009343,0.0082675,-0.0097031,-0.00039269,-0.037052,0.0036382,0.0024753,0.012802,-0.0091577,0.0044253,-0.055585,0.00038841,0.00025913,0.0090114,-0.0052632,0.0016271,-0.018944,0.00087497,0.00058701,0.0094815,-0.0067377,0.0024083,-0.026773,0.0021592,0.0014564,0.01381,-0.0063473,0.0056496,-0.043481,0,0,0,-0.0065105,-0.0087711,0,1.8491e-06,1.2099e-06,2.8586e-05,-0.008389,-0.0089067,-0.0095242,2.9237e-05,1.913e-05,0.00027937,-0.010119,-0.0086235,-0.0095242,9.7527e-05,6.0737e-05,0.018935,-0.0010658,0.0078939,-0.019693,0.00052612,0.00034608,0.032286,0.00083551,0.012323,-0.026992,0.0014498,0.00099981,0.044533,0.0038103,0.017579,-0.03385,0.40517,74,74,40,1054,3,3,3,0.645
30,-0.0053996,0.78629,0.788,-0.45962,0.76863,-0.53168,0.15677,-0.12604,7.0045,0.10604,3.1763,0.0024941,6.5909,6.3372,1.0796,9.1583,0.0087388,0.45965,4.4219,2.726,1.6706,1.1084,0.03852,0.057713,0.081257,0.084659,0.10697,0.1007,0.53018,0.015073,0.00018983,0.14925,0.073422,0.008854,0.014113,0.015708,0.27661,0.32286,0.58755,0.58755,0.27571,0.31664,0.17122,1.5598,1.2165,54,56.019,2187,88241,6.8782,49.45,59049,6480,5211,0.91706,0.94174,0.0994,0.067084,0.067305,0.43575,20904,13958,0.0011081,0.00057792,0,0.06384,0,0.073189,0.0026578,0.040473,0.00078398,0.064791,0.49469,2.2777,1.2764,0.23677,0.29861,0.2382,0.2228,0.32387,0.15758,0.20939,0.33104,0.15753,27.595,6.4315,10358,19972,18431,0.24869,0.25488,0.092269,0.57356,0.58266,0.11187,0.7645,0.78212,0.1055,0.8815,0.89401,0.097117,0.94523,0.95359,0.088879,0.00426,0.0033123,0.035397,0.0079948,0.01737,-0.060225,0.0078431,0.006156,0.030857,0.0077052,0.026839,-0.071959,0.011831,0.0094333,0.027795,0.0071915,0.036637,-0.082489,0.002597,0.0020193,0.040224,0.0076018,0.013457,-0.043386,0.0039054,0.0030544,0.028253,0.0045237,0.016001,-0.04935,0.0055371,0.0043801,0.023644,0.0030025,0.01933,-0.057711,0.00075373,0.00056126,0.015678,-0.00076818,0.00033209,-0.031523,0.0017624,0.0013347,0.018189,-5.5746e-05,0.0065757,-0.042017,0.003318,0.0025915,0.021166,0.0012817,0.014222,-0.049166,0.00090933,0.0007318,0.11787,0.015141,0.037535,-0.032157,0.0024203,0.0019476,0.099154,0.017079,0.048594,-0.037772,0.0037446,0.0030324,0.076789,0.0159,0.057659,-0.043186,0.42859,74,74,40,1054,3,3,3,0.645
30,-0.013987,0.53327,0.53452,-0.68189,0.49198,-0.48952,-0.28212,0.58772,3.4591,0.10454,3.3033,3.9004e-06,3.3461,4.1937,0.63543,5.6069,0.0053501,0.68195,1.916,1.2754,1.1107,0.94023,0.08273,0.11289,0.13922,0.097727,0.034715,0.042148,0.49057,0.25809,0.15383,0.001483,0.083788,5.7934,2.3291,0.019779,8.6395,0.096678,0.43604,0.43604,0.242,0.53065,0.16537,1.084,0.55617,39,152.44,5246,7.0121e+05,5.9322,36.455,1.4164e+05,12474,2808,0.90544,0.9227,0.44017,0.34807,0.25832,0.90658,63101,31542,0.0017602,0.000577,0,0.069111,0,0.065041,0.0035396,0.042327,0.0071104,0.046647,0.50624,0.54493,0.44467,0.26745,0.33083,0.23604,0.30687,0.38581,0.18729,0.31666,0.37593,0.18267,65.789,6.373,20737,70053,69261,0.060606,0.053781,0.037868,0.29712,0.31128,0.097592,0.52757,0.56984,0.12261,0.70081,0.74592,0.13003,0.81729,0.8546,0.12942,0.0014748,0.00092426,0.020637,-0.0037251,0.0024292,-0.045333,0.0036386,0.0023977,0.024108,-0.0032352,0.0084718,-0.05808,0.007176,0.0050229,0.02839,-0.0014715,0.016982,-0.069289,0.00089137,0.00057621,0.023251,-0.0020563,0.0034512,-0.035851,0.0024781,0.0016888,0.030192,-0.00024523,0.0071704,-0.045997,0.0052781,0.0038454,0.037955,0.0031039,0.013432,-0.055452,0.00038505,0.00023354,0.013489,-0.0038952,-0.0040706,-0.021163,0.00076768,0.00047744,0.013344,-0.0050662,-0.0024054,-0.02902,0.0013439,0.00084222,0.014438,-0.0057827,-3.012e-05,-0.035272,0.00019836,0.00011452,0.0433,0.0014647,0.013016,-0.020338,0.00051068,0.00029864,0.035234,0.00071285,0.019459,-0.026042,0.00096293,0.00056997,0.033255,0.00049998,0.026566,-0.033593,0.38711,74,74,40,1054,3,3,3,0.645
30,-0.076232,0.74909,0.79599,0.45083,0.55843,0.69712,0.5463,0.37318,2.3348,0.11103,3.3423,0.00047657,4.4108,2.5882,2.8989,3.0841,0.0029429,-0.45084,11.019,7.1008,5.8292,4.854,0.021377,0.023097,0.032362,0.040524,0.023144,0.024563,0.83493,0.69296,3.8012,9.5038,4.5583,16.198,10.489,0.11884,45.362,0.038214,0.088523,0.088523,0.091689,0.13303,0.072325,3.1733,5.0228,63,103.1,5699,5.1308e+05,7.7,60.527,1.5387e+05,8208,4428,0.90673,0.91591,0.15655,0.12347,0.090546,0.41938,23926,14940,0.001133,0.00051997,0,0.08469,0,0.060349,0.030228,0.0076115,0.034355,0.0046882,1.2573,1.2508,0.075975,0.25637,0.29272,0.23328,0.26626,0.29449,0.19704,0.28018,0.2853,0.17908,14.029,6.2986,14732,65778,65227,0.20054,0.20674,0.1378,0.39503,0.40541,0.1427,0.5293,0.54095,0.13528,0.64422,0.65384,0.13146,0.73723,0.74711,0.12839,0.0095431,0.010058,0.14686,0.039194,0.037318,0.013452,0.020901,0.023073,0.1523,0.053952,0.055854,0.034731,0.035604,0.04042,0.15491,0.068136,0.074326,0.056668,0.0071202,0.0071263,0.20426,0.043814,0.038851,0.00017663,0.014072,0.01442,0.18855,0.052244,0.048242,0.0065849,0.022909,0.023947,0.18118,0.061722,0.058959,0.014899,0.0011296,0.001863,0.043521,0.0020432,0.0048318,0.061454,0.0030191,0.005376,0.057712,0.0065501,0.015228,0.10274,0.0059578,0.01044,0.070394,0.012232,0.025578,0.1305,0.0012933,0.0010686,0.31049,0.031159,0.030693,-0.020835,0.0038921,0.0033286,0.29533,0.040914,0.041967,-0.022026,0.0069362,0.0061555,0.26344,0.046237,0.051106,-0.020782,0.69543,74,74,40,1054,3,3,3,0.645
30,-0.0039564,0.72664,0.7293,-0.51962,0.71625,-0.45011,-0.13377,-0.6387,8.2509,-0.058852,3.316,0.00026045,8.1472,8.3083,0.95977,11.489,0.010963,0.51964,2.8154,1.9094,1.4485,1.0764,0.054441,0.08136,0.11656,0.082694,0.065556,0.074148,0.52524,0.14717,0.066664,0.00052095,0.10059,0.30667,0.056934,0.0082973,0.68685,0.28723,0.28134,0.28723,0.29708,0.44305,0.23226,1.4336,1.0232,58,75.017,1475,65536,4.4144,22.332,39825,33210,12582,0.91359,0.93743,0.31303,0.22479,0.21009,0.80442,49583,22366,0.0011585,0.00050221,0,0.059881,0,0.056421,0.0033597,0.030733,0.0083536,0.060492,0.43194,0.038639,0.31253,0.25289,0.3471,0.2456,0.27093,0.4107,0.21689,0.25895,0.43777,0.21783,36.218,6.6313,14242,33879,32199,0.077853,0.064462,0.039254,0.38927,0.40181,0.10318,0.63015,0.66388,0.11818,0.79172,0.82067,0.11854,0.90145,0.91928,0.11519,0.0012718,0.00098782,0.014361,-0.0042605,0.0058822,-0.042053,0.0044559,0.0035681,0.023824,-0.0005821,0.014305,-0.052716,0.010302,0.0084989,0.032888,0.0052148,0.024862,-0.06294,0.00069176,0.00049764,0.014561,-0.0030977,0.0084241,-0.036142,0.0020844,0.0015221,0.020493,-0.0017396,0.011853,-0.045886,0.0042655,0.0031613,0.024752,-8.3112e-05,0.016362,-0.057562,0.00032855,0.00027084,0.0092874,-0.0038853,-0.004433,-0.020584,0.001554,0.0013205,0.021797,-0.0010018,0.0008027,-0.026139,0.0041859,0.0036991,0.036289,0.0044353,0.008131,-0.027739,0.00025152,0.00021935,0.044305,0.0025378,0.013463,-0.01086,0.00085848,0.000755,0.047796,0.0041606,0.020463,-0.013832,0.0020216,0.0017723,0.056339,0.0073556,0.028658,-0.019587,0.43645,74,74,40,1054,3,3,3,0.645
30,-0.0015952,0.47416,0.47288,-0.72572,0.47077,-0.67725,-0.066791,-0.1272,3.6944,0.0315,3.3162,7.6072e-05,4.2799,5.7764,0.54793,7.6906,0.0073384,0.72576,2.0535,1.3358,0.97573,0.73623,0.089244,0.086916,0.13978,0.10236,0.079363,0.071019,0.43132,0.32409,0.063838,0.0049085,0.035866,0.19122,0.19577,0.060593,0.87629,0.22547,0.22006,0.22547,0.44255,0.4653,0.19863,0.9969,0.48693,51,116.98,3691,2.9101e+05,5.9865,39.096,99657,34236,7263,0.91015,0.92952,0.33919,0.25358,0.22249,0.79498,68635,33160,0.00082103,0.00046988,0,0.064437,0,0.062042,0.00095512,0.010963,0.0021359,0.011762,0.46747,0.9011,0.64601,0.2654,0.36401,0.23797,0.29378,0.44837,0.19801,0.30907,0.46256,0.18056,54.357,6.4253,19882,61258,60283,0.020681,0.014866,0.013023,0.18128,0.15285,0.060012,0.3963,0.35586,0.092824,0.58404,0.5555,0.10921,0.71517,0.70567,0.11414,0.00090098,0.00071447,0.012706,-0.0066705,-0.0017689,-0.02393,0.0026993,0.0022919,0.018024,-0.0062314,0.00179,-0.027158,0.0060251,0.005334,0.024024,-0.0041739,0.0078054,-0.028363,0.00058974,0.00043119,0.015504,-0.0041927,0.0033759,-0.021903,0.0011606,0.00085589,0.014251,-0.0059493,0.0028561,-0.026717,0.0020351,0.0015063,0.014749,-0.0071627,0.0041728,-0.033881,2.06e-07,1.4022e-07,7.2731e-06,-0.0069418,-0.010745,-0.0095081,1.7203e-05,1.1824e-05,0.00030136,-0.0088693,-0.011224,-0.014085,0.00014862,0.00010354,0.0016092,-0.010339,-0.010694,-0.019934,0.00031103,0.00028314,0.068427,0.0043842,0.013948,-0.0096197,0.001522,0.0014245,0.10584,0.012199,0.024223,-0.0099815,0.0038526,0.0037317,0.13409,0.02164,0.035638,-0.0064822,0.44229,74,74,40,1054,3,3,3,0.645
30,-0.030475,0.87372,0.86372,-0.36805,0.82313,-0.28826,-0.21678,-0.27195,4.2474,-0.043324,3.3185,0.00012061,5.5794,4.9605,1.2627,6.5569,0.0062566,0.36805,3.1079,2.1324,1.6996,1.3139,0.053142,0.063396,0.1012,0.078386,0.052909,0.063847,0.58712,0.11019,0.00064684,0.034003,0.193,0.87121,0.23496,0.021565,1.4656,0.28537,0.19762,0.28537,0.33582,0.42388,0.18295,1.7094,1.3212,51,33.196,856,15280,5.7781,37.896,23112,6345,3888,0.91831,0.9476,0.04244,0.026433,0.021951,0.42561,18159,13886,0.00095029,0.00045514,0,0.045231,0,0.053821,0.0068249,0.023097,0.050931,0.050589,1.6778,0.86185,0.68593,0.23969,0.27957,0.28397,0.27075,0.2424,0.29704,0.27068,0.24501,0.29719,28.437,7.6672,6807.7,9718,6240.7,0.13763,0.13462,0.030941,0.36319,0.35728,0.042921,0.47576,0.47353,0.039782,0.55834,0.55698,0.037273,0.65571,0.65535,0.037359,0.0099426,0.0094234,0.050058,0.023364,0.024087,-0.039158,0.018416,0.017695,0.043902,0.025834,0.03561,-0.037582,0.029445,0.028913,0.041913,0.029985,0.049539,-0.021758,0.0034711,0.0031458,0.032577,0.0095432,0.018422,-0.043056,0.0071335,0.006526,0.03127,0.011773,0.025086,-0.051706,0.011975,0.011064,0.030983,0.014397,0.03328,-0.057926,0.0057292,0.005578,0.072211,0.022579,0.0086197,-0.015577,0.010613,0.010326,0.066373,0.026341,0.016149,-0.0191,0.015046,0.014839,0.05816,0.027301,0.023012,-0.011149,0.00074229,0.00069962,0.058299,0.0091879,0.026137,-0.021866,0.0033491,0.0032742,0.083138,0.019483,0.040362,-0.012317,0.008452,0.0085526,0.10502,0.032696,0.057166,0.0088121,0.37449,74,74,40,1054,3,3,3,0.645
30,-0.016393,0.94483,0.93077,-0.26143,0.90106,-0.30814,0.17866,0.35104,3.6199,0.07221,3.2717,0.00034006,5.2797,4.3426,1.4754,5.7335,0.0054709,0.26148,6.3673,4.4236,2.5938,1.52,0.038189,0.036631,0.049352,0.049295,0.09513,0.12016,0.61124,0.018767,0.31577,1.4996,1.2963,0.00037838,0.07208,0.061363,3.2643,0.57785,0.53299,0.57785,0.36671,0.47063,0.1817,2.0544,2.0983,103,16.243,320,2110.7,4.1585,22.529,8640,6102,4752,0.91944,0.94765,0.032813,0.02062,0.030307,0.22664,17296,11487,0.00070502,0.00034125,0,0.054951,0,0.085996,0.015329,0.048183,0.065316,0.073219,0.60827,1.8903,0.98139,0.25503,0.28748,0.24225,0.32325,0.24031,0.11489,0.32928,0.23275,0.10708,12.275,6.5408,5178.6,8108,5455.6,0.26275,0.26938,0.071396,0.57512,0.59322,0.082152,0.7223,0.74099,0.073001,0.82053,0.83405,0.066208,0.87899,0.88813,0.060532,0.0028537,0.0025781,0.017366,0.0021495,0.0072481,-0.038003,0.0071594,0.0065726,0.020629,0.0051641,0.017042,-0.044752,0.014684,0.013802,0.025265,0.010491,0.02999,-0.046646,0.0019128,0.001716,0.021699,0.0033473,0.0090947,-0.030758,0.0042921,0.0039217,0.022741,0.0049514,0.013859,-0.035985,0.0093174,0.0088216,0.029138,0.010363,0.023216,-0.033792,0.0003951,0.00033164,0.0060191,-0.0024944,-0.005164,-0.026671,0.0010807,0.00093659,0.0081687,-0.0022844,-0.002675,-0.027946,0.0019806,0.0017642,0.0092538,-0.0022075,0.00063069,-0.028867,0.00054577,0.00053049,0.051811,0.0068052,0.020321,-0.0061746,0.0017866,0.0017143,0.053606,0.0098962,0.031082,-0.011368,0.0033864,0.0032162,0.050859,0.011867,0.040478,-0.01787,0.53801,74,74,40,1054,3,3,3,0.645
30,-0.0069497,0.535,0.53045,-0.68487,0.52169,-0.77287,0.12849,-5.5805,79.098,-0.040754,3.1173,0.0097475,11.802,14.859,0.62963,23.881,0.022787,0.68488,2.5271,1.4952,1.0407,0.75027,0.053781,0.10055,0.12484,0.11796,0.089804,0.081801,0.43126,0.10807,0.14511,0.0023332,0.0025589,0.029303,0.020926,0.022085,0.33039,0.17121,0.18046,0.18046,0.27529,0.46353,0.20948,1.1116,0.56861,46,99.826,2533,1.9916e+05,4.6736,23.728,68391,47034,7371,0.91349,0.93029,0.1595,0.12157,0.10012,0.5236,32843,16089,0.0011035,0.00051847,0,0.064583,0,0.065068,0.00036136,0.022517,0.0023054,0.03972,0.38484,0.3087,0.01709,0.23545,0.28173,0.22618,0.23021,0.27435,0.1602,0.21726,0.25181,0.13236,18.224,6.1068,16530,47852,47239,0.27245,0.32804,0.13226,0.57801,0.64027,0.1475,0.77264,0.82217,0.13951,0.89688,0.92473,0.12929,0.94121,0.95795,0.1158,0.0014826,0.0010805,0.016119,-0.0032368,0.0062505,-0.027453,0.0034277,0.0024631,0.017645,-0.0034276,0.011767,-0.040773,0.0068315,0.0049064,0.020999,-0.0019985,0.018271,-0.057087,0.00094988,0.00071894,0.019251,-0.0014451,0.0080032,-0.017562,0.001674,0.0012729,0.015845,-0.0032604,0.0083044,-0.022181,0.0029727,0.0022493,0.016609,-0.0036659,0.010039,-0.031274,0.00013164,8.3622e-05,0.0035828,-0.0051671,-0.0047022,-0.018563,0.00064792,0.00042605,0.0087498,-0.0049779,-0.0011535,-0.027634,0.0019935,0.001369,0.01664,-0.0029237,0.0036003,-0.038877,0.00040111,0.00027792,0.068027,0.0058728,0.017754,-0.022997,0.0012178,0.00083365,0.065278,0.0076493,0.024621,-0.028931,0.0021403,0.0014587,0.057429,0.0079737,0.029874,-0.03431,0.50963,74,74,40,1054,3,3,3,0.645
