30,-0.1119,0.87105,0.96983,0.17102,0.50632,0.28925,0.69133,0.60767,2.2366,0.289,3.2347,0.00086477,3.8567,2.519,2.3397,3.0234,0.002885,-0.17103,12.497,8.6762,7.016,5.6838,0.015652,0.017302,0.035032,0.029448,0.021545,0.025029,0.85599,3.0375,10.652,9.7877,13.042,24.791,12.999,0.092321,74.401,0.024402,0.17702,0.17702,0.57953,0.63204,0.24056,3.3341,5.5459,75,67.52,3582,1.7049e+05,8.2806,70.666,96714,7020,6777,0.91492,0.92959,0.040572,0.033435,0.087991,0.33785,22946,15114,0.00099436,0.0004398,2,0.27581,0,0.055112,0.14341,0.38407,0.18271,0.48718,1.3836,3.3254,1.9178,0.21703,0.27969,0.24897,0.24988,0.30202,0.19712,0.24092,0.26065,0.18871,17.607,6.7221,19005,85068,84801,0.12948,0.12509,0.080198,0.32911,0.32012,0.10583,0.48364,0.49525,0.10893,0.59605,0.62664,0.10642,0.68405,0.71191,0.10353,0.019135,0.018477,0.27417,0.088535,0.078344,-0.0072598,0.03657,0.034722,0.24479,0.10273,0.091627,-0.013418,0.055779,0.051819,0.22069,0.1132,0.10187,-0.022347,0.012248,0.012259,0.28834,0.073694,0.06411,0.00014921,0.023467,0.022997,0.25754,0.085175,0.073313,-0.0042215,0.035532,0.034336,0.2304,0.092855,0.080236,-0.0083236,0.0058607,0.0054261,0.26084,0.046005,0.040694,-0.0086474,0.011815,0.01103,0.2582,0.059114,0.050794,-0.0099861,0.01874,0.017101,0.24833,0.069828,0.058534,-0.015796,0.0010266,0.00079201,0.21181,0.022084,0.023691,-0.012885,0.0027243,0.0020958,0.17933,0.024963,0.030258,-0.017954,0.0051814,0.0039444,0.1723,0.030498,0.037776,-0.023833,0.62717,74,74,40,1054,3,3,3,0.645
30,-0.0010935,0.18788,0.18697,-0.90158,0.18646,-0.85439,-0.052347,3.1396,20.512,0.08108,2.9828,0.014284,2.6093,5.8791,0.19661,9.0497,0.0086352,0.9016,1.1423,0.82346,0.6448,0.50565,0.16325,0.12342,0.126,0.089902,0.065616,0.06189,0.36993,0.45322,0.05744,0.19229,0.8625,2.1589,1.781,1.1112,6.6166,0.42522,0.40522,0.42522,0.94141,2.5384,0.61722,0.54783,0.054971,35,152.34,4087,4.811e+05,5.4165,31.08,1.1035e+05,19224,3267,0.91446,0.92953,0.24607,0.19038,0.10473,0.6865,48565,20663,0.001638,0.00066622,0,0.094311,0,0.082659,0.008001,0.011531,0.014279,0.010157,1.4989,1.8872,0.085783,0.21984,0.2835,0.21869,0.25228,0.26382,0.11417,0.26273,0.28323,0.11476,35.032,5.9046,20869,66927,66195,0.2509,0.23759,0.14129,0.58361,0.59671,0.17063,0.78819,0.81227,0.16141,0.90305,0.91912,0.14658,0.95833,0.96765,0.13187,0.0050965,0.0035504,0.066393,0.015093,0.035019,-0.056511,0.0090682,0.0062924,0.055189,0.014309,0.039938,-0.069042,0.013107,0.0090637,0.047147,0.012774,0.044345,-0.081344,0.0044138,0.0031264,0.094475,0.020239,0.030954,-0.050336,0.0076843,0.005438,0.076673,0.019594,0.033801,-0.060233,0.010833,0.0076581,0.063869,0.018053,0.036078,-0.069786,0.00060859,0.0003806,0.024626,-0.00039194,0.015231,-0.023907,0.0011489,0.00071915,0.022828,-0.00099566,0.017587,-0.030418,0.0017932,0.0011275,0.021605,-0.0016372,0.019985,-0.037286,7.4075e-05,4.3388e-05,0.013896,-0.0015974,0.01038,-0.020735,0.00039612,0.00023634,0.023706,-0.00048831,0.0159,-0.027256,0.0009744,0.00058518,0.029459,0.00065789,0.021814,-0.03197,0.47403,74,74,40,1054,3,3,3,0.645
30,-0.0019703,0.21765,0.2157,-0.88549,0.21516,-0.84125,-0.049969,-3.7748,26.097,-0.091117,2.904,0.019557,5.243,10.955,0.22862,17.607,0.0168,0.88557,1.2447,0.9143,0.70195,0.53692,0.147,0.12367,0.11187,0.085625,0.072577,0.070252,0.389,0.41374,0.069067,0.36514,0.92778,1.2523,0.99747,0.78508,4.8106,0.30753,0.48702,0.48702,0.7758,1.0266,0.46969,0.58851,0.09179,52,88.212,4251,3.4524e+05,6.9896,49.91,1.1478e+05,3186,1809,0.91841,0.93207,0.014468,0.011698,0.088694,0.16162,42852,19023,0.0019059,0.00058689,0,0.11646,0,0.058474,0.0056941,0.024146,0.0088946,0.043055,0.38902,2.3187,1.6246,0.20101,0.25344,0.20813,0.19191,0.20725,0.13382,0.20219,0.18986,0.10405,28.368,5.6195,33100,1.2481e+05,1.2427e+05,0.30234,0.32184,0.15293,0.64609,0.71913,0.16967,0.80426,0.85344,0.14794,0.8936,0.9245,0.13029,0.95188,0.96846,0.11765,0.0031721,0.0020351,0.037117,0.0053053,0.021226,-0.038398,0.0059345,0.0038661,0.032441,0.0045362,0.026424,-0.045058,0.0089788,0.0058462,0.029011,0.0033903,0.031431,-0.054307,0.0028995,0.0018706,0.055746,0.01002,0.019556,-0.036571,0.0052719,0.0034487,0.04725,0.0096458,0.022887,-0.041572,0.0075194,0.0049165,0.03982,0.0081502,0.025402,-0.048411,0.00027259,0.00016444,0.0099076,-0.003047,0.0081442,-0.016839,0.0010092,0.00062667,0.018011,-0.0016525,0.012324,-0.024425,0.0022494,0.00141,0.024344,0.00018657,0.016622,-0.0321,0,0,0,-0.0031773,0.0063979,0,0,0,0,-0.0043684,0.0093898,0,5.7405e-07,3.1332e-07,1.5589e-05,-0.0055954,0.012671,-0.0091565,0.49852,74,74,40,1054,3,3,3,0.645
30,-0.12861,0.97839,0.95591,0.2078,0.64904,0.32554,0.56659,-0.51195,2.4527,-0.21823,3.2998,0.0004535,4.708,3.0278,2.4132,3.621,0.0034552,-0.2078,9.217,6.8741,5.7777,4.9393,0.025173,0.023775,0.033319,0.029627,0.020898,0.021189,0.84602,0.48148,4.1674,11.354,12.959,24.772,19.075,0.088901,72.898,0.092524,0.11694,0.11694,0.7389,1.1185,0.31401,3.3051,5.4438,69,89.159,5048,3.678e+05,8.0379,66.058,1.363e+05,9585,5778,0.91207,0.92252,0.10678,0.084225,0.011568,0.25516,28025,16031,0.0010634,0.00044652,1,0.16425,0,0.063865,0.084814,0.23294,0.10562,0.30094,0.5262,2.1059,1.3855,0.21541,0.28295,0.23463,0.25226,0.29567,0.18283,0.24048,0.26617,0.17229,16.163,6.3351,14458,58887,58455,0.14443,0.14994,0.10066,0.33755,0.35209,0.12214,0.48713,0.50672,0.12346,0.59121,0.60952,0.11877,0.67372,0.68758,0.11473,0.022434,0.026247,0.36171,0.11225,0.11993,0.057524,0.042961,0.049319,0.32359,0.13084,0.13919,0.063372,0.065507,0.073803,0.29164,0.14448,0.15372,0.064386,0.016764,0.020439,0.4441,0.11045,0.11675,0.06395,0.031879,0.038365,0.39368,0.12712,0.13305,0.074322,0.048196,0.057192,0.35167,0.13895,0.14501,0.080232,0.0047853,0.0050482,0.23965,0.038791,0.041018,0.0084644,0.0092513,0.0093296,0.22749,0.047456,0.048176,0.0016313,0.014005,0.013651,0.20884,0.052967,0.052986,-0.0057095,0.0008849,0.00076038,0.20545,0.019715,0.026978,-0.012128,0.00255,0.0022382,0.18888,0.024504,0.035343,-0.013945,0.0048236,0.004271,0.18049,0.029718,0.043467,-0.016275,0.6711,74,74,40,1054,3,3,3,0.645
30,-0.0057736,0.4488,0.45472,-0.73814,0.43018,-0.9096,0.23229,-2.8699,12.466,-0.22305,2.6938,0.015301,4.4454,6.1399,0.52322,12.544,0.011969,0.73814,2.2971,1.3015,0.92436,0.69005,0.048395,0.099269,0.15008,0.13224,0.085835,0.072619,0.41155,0.05864,0.1174,0.021154,0.01003,0.084625,0.13181,0.071741,0.4954,0.091303,0.18509,0.18509,1.8255,2.8756,0.82517,0.97883,0.43493,38,108.68,1976,1.5745e+05,4.0549,17.908,53352,41688,4536,0.91696,0.93376,0.043959,0.034758,0.0045984,0.17061,27999,15896,0.001192,0.0005934,0,0.069586,0,0.054491,0.0066685,0.018085,0.0067549,0.026758,0.38649,0.34491,0.59562,0.20734,0.27113,0.2111,0.24445,0.25975,0.089166,0.23476,0.23732,0.07245,23.774,5.6997,38072,1.15e+05,1.1454e+05,0.26147,0.29596,0.11773,0.64484,0.68495,0.15074,0.8109,0.85467,0.13277,0.902,0.93148,0.11706,0.95606,0.97051,0.10518,0.00056146,0.00035427,0.0058481,-0.0064786,0.021401,-0.031423,0.0026831,0.0017426,0.013056,-0.0045304,0.027141,-0.044764,0.0070236,0.004605,0.020201,-0.00068778,0.033295,-0.058399,0.00015478,9.5393e-05,0.002649,-0.0061603,0.013373,-0.015559,0.0007451,0.00046963,0.0059443,-0.0066447,0.016319,-0.02625,0.0021589,0.0013745,0.010176,-0.0059397,0.019651,-0.0358,0.00024729,0.00016368,0.0080009,-0.0030607,0.015374,-0.019656,0.0012535,0.00085445,0.019912,-0.00038734,0.018758,-0.02736,0.0031861,0.0021723,0.030692,0.0035336,0.022153,-0.035044,0.00015938,9.5202e-05,0.023906,0.00038263,0.0098829,-0.019447,0.00069953,0.00042811,0.033473,0.0023837,0.014664,-0.02471,0.0017728,0.0011182,0.042853,0.0053897,0.020519,-0.032006,0.42188,74,74,40,1054,3,3,3,0.645
30,-0.12413,0.98275,0.97022,0.16987,0.65414,0.26683,0.57077,-0.040127,2.1837,-0.089022,3.3279,0.00063087,3.4043,2.2246,2.3375,2.5823,0.002464,-0.16988,9.0104,6.6598,5.3967,4.5852,0.025728,0.024453,0.035096,0.031154,0.026198,0.023082,0.83429,0.41826,4.0591,9.9095,11.186,14.08,14.625,0.084849,54.362,0.086464,0.1261,0.1261,0.48873,0.69964,0.23445,3.344,5.5865,80,88.05,5444,3.7297e+05,8.5367,75.055,1.4699e+05,19872,4374,0.91193,0.92512,0.075221,0.056278,0.020196,0.21622,24007,15162,0.0010127,0.00050527,0,0.055732,0,0.055522,0.0091122,0.022895,0.01583,0.022207,0.30331,1.2205,0.68428,0.22546,0.28803,0.23656,0.25535,0.29807,0.19457,0.26376,0.2859,0.19241,14.114,6.387,9118.7,35203,34045,0.14431,0.13557,0.11695,0.32715,0.31282,0.13765,0.46644,0.45407,0.13746,0.57257,0.56477,0.13375,0.65574,0.65085,0.12985,0.015024,0.01662,0.28167,0.077286,0.092062,0.039476,0.030474,0.033462,0.26691,0.095719,0.11287,0.046302,0.048339,0.052721,0.25024,0.1101,0.12915,0.051539,0.010625,0.012085,0.3273,0.07221,0.082732,0.04227,0.020881,0.023639,0.29984,0.085721,0.097356,0.051003,0.032597,0.036739,0.27657,0.096618,0.10921,0.058505,0.0032394,0.0034488,0.18864,0.026245,0.035124,0.011167,0.0068869,0.0074976,0.19692,0.03599,0.046883,0.019854,0.011642,0.012827,0.20187,0.045811,0.057959,0.0283,0.0011595,0.001086,0.31302,0.029189,0.036108,-0.0073723,0.0031038,0.0027225,0.26732,0.03346,0.04165,-0.019147,0.0054859,0.004619,0.23869,0.037527,0.046944,-0.030423,0.76859,74,74,40,1054,3,3,3,0.645
30,-0.030453,0.63458,0.62394,-0.61276,0.57029,-0.79243,0.29322,-0.055564,5.8774,0.0071097,3.2697,0.0011729,4.4998,5.112,0.77334,6.9641,0.0066452,0.61288,2.7906,1.8083,1.2988,1.0063,0.064842,0.079766,0.11142,0.093256,0.07976,0.064075,0.50688,0.18262,0.033577,0.019899,0.070921,0.13532,0.29507,0.0011537,0.73856,0.11744,0.307,0.307,1.2614,1.6543,0.54985,1.2342,0.75755,46,116.96,4570,4.5206e+05,6.4716,43.242,1.2339e+05,10530,5886,0.91368,0.93078,0.30347,0.23537,0.15648,0.74559,33685,18195,0.0019798,0.00080284,0,0.076443,0,0.050289,0.005003,0.012535,0.0034702,0.0076951,1.1568,0.78708,2.1465,0.23791,0.2465,0.19136,0.29661,0.1871,0.059222,0.31791,0.16221,0.043903,17.223,5.1667,19000,57344,56681,0.30256,0.30258,0.17737,0.70769,0.7755,0.21539,0.83044,0.87586,0.17703,0.91166,0.9366,0.15405,0.95931,0.97148,0.13741,0.012806,0.012335,0.17366,0.054208,0.069218,-0.010711,0.025337,0.024813,0.16052,0.065041,0.083158,-0.0077138,0.040593,0.041199,0.15201,0.075519,0.098666,0.0068325,0.008674,0.0090394,0.19327,0.048382,0.057481,0.009913,0.016497,0.017426,0.17135,0.055066,0.06703,0.016669,0.026072,0.028499,0.16001,0.062749,0.078276,0.033716,0.0027652,0.0021933,0.11648,0.018127,0.030963,-0.027996,0.0059359,0.0050924,0.12277,0.025229,0.037829,-0.026641,0.010624,0.009805,0.13325,0.034572,0.047462,-0.018646,0.0013664,0.0011026,0.26684,0.02971,0.031888,-0.020852,0.0035949,0.0029256,0.22396,0.033527,0.040414,-0.02687,0.0062627,0.0051558,0.1971,0.037093,0.048967,-0.031476,0.50554,74,74,40,1054,3,3,3,0.645
30,-0.016921,0.14352,0.17248,-0.90959,0.077583,-1.5843,0.74174,-0.03903,1.9208,-0.038997,3.3508,0.001861,1.5044,3.5373,0.18053,4.1703,0.0039793,0.90964,1.2756,0.4608,0.37227,0.29731,0.08234,0.1337,0.21903,0.24702,0.044507,0.042435,0.23096,0.0066265,0.0032027,0.024551,0.0010487,15.626,13.553,12.409,41.624,0.071187,0.087227,0.087227,0.71519,1.5183,0.3635,0.54202,0.14606,41,95.707,3089,2.3085e+05,5.9818,37.484,83403,9828,4698,0.91223,0.9276,0.24721,0.21556,0.014368,0.61643,88889,23366,0.0011227,0.00049616,0,0.11811,0,0.062831,0.00066602,0.021149,0.002927,0.028954,1.2356,1.5186,0.41701,0.20657,0.35217,0.28742,0.22297,0.43615,0.26805,0.21757,0.42402,0.30078,60.684,7.7603,53459,2.8025e+05,2.7987e+05,0.016524,0.008819,0.0078549,0.21134,0.1778,0.05216,0.44655,0.43835,0.077194,0.64688,0.68851,0.088637,0.80987,0.86301,0.094071,0.006358,0.0070297,0.069918,0.01954,0.033944,0.014599,0.015523,0.018217,0.079749,0.031089,0.049648,0.033321,0.029131,0.036551,0.08846,0.044425,0.068697,0.063346,0.004838,0.0059661,0.087416,0.021035,0.0349,0.026654,0.010489,0.014275,0.08835,0.027987,0.047442,0.054946,0.018504,0.027149,0.092093,0.036589,0.062538,0.090057,4.085e-05,1.9642e-05,0.0013954,-0.0047397,0.003829,-0.019712,0.00044116,0.00021696,0.0073992,-0.0043979,0.0053388,-0.029306,0.0018835,0.0010371,0.019156,-0.0011683,0.0082728,-0.037529,0.0014791,0.001044,0.23423,0.029137,0.022678,-0.023839,0.0046828,0.0037689,0.23658,0.040503,0.034029,-0.021542,0.0092857,0.0087104,0.23698,0.052012,0.048993,-0.0087083,0.39995,74,74,40,1054,3,3,3,0.645
30,-0.12833,0.96415,0.96634,0.18094,0.62289,0.28881,0.59617,-0.34541,2.0491,-0.21041,3.3165,0.0011391,3.4646,2.2534,2.3594,2.6595,0.0025377,-0.18096,9.7147,6.8486,5.8185,4.9877,0.025878,0.019966,0.043387,0.034235,0.019337,0.02044,0.83676,0.39925,7.9294,6.0847,9.0481,30.276,21.645,0.075257,75.457,0.016646,0.19465,0.19465,0.7685,0.78429,0.29016,3.3156,5.5093,84,79.643,5004,3.0694e+05,8.5081,75.524,1.3511e+05,27378,6021,0.90947,0.91932,0.26835,0.21356,0.14034,0.62896,29654,16783,0.0010705,0.00047419,0,0.07244,0,0.055045,0.037007,0.03712,0.050458,0.049935,0.70881,0.93161,0.35292,0.21564,0.27862,0.23925,0.2447,0.28225,0.19323,0.23728,0.26251,0.18247,14.529,6.4597,19145,82299,81735,0.13997,0.13843,0.10628,0.33321,0.33227,0.13136,0.47599,0.47719,0.13143,0.58748,0.596,0.12858,0.67739,0.68689,0.12568,0.02199,0.029319,0.38627,0.11479,0.14123,0.11992,0.044023,0.060086,0.36126,0.14054,0.1759,0.1682,0.069045,0.095581,0.33489,0.16023,0.20396,0.21324,0.014224,0.021895,0.41051,0.096568,0.13293,0.1573,0.028597,0.044935,0.38474,0.11796,0.16419,0.21137,0.045447,0.072402,0.36128,0.13612,0.19182,0.26417,0.0059263,0.0052144,0.32335,0.051754,0.04587,-0.020463,0.010573,0.0092681,0.28326,0.057893,0.052704,-0.026215,0.01535,0.013422,0.24937,0.061678,0.057415,-0.030998,0.0018403,0.0022104,0.4655,0.047089,0.055582,0.025777,0.0054054,0.0063032,0.43619,0.060327,0.069425,0.028633,0.0099799,0.011099,0.40684,0.071653,0.07989,0.023919,0.72303,74,74,40,1054,3,3,3,0.645
30,-0.00061981,0.2282,0.22759,-0.87875,0.22718,-0.84146,-0.042431,1.8746,10.294,0.098799,3.0933,0.0063828,3.5034,7.1131,0.24212,10.068,0.0096067,0.87882,1.2242,0.89252,0.66414,0.51044,0.14741,0.097757,0.16012,0.08514,0.078353,0.066072,0.36514,0.43543,0.014282,0.0015685,0.71385,0.77151,1.0802,0.8276,3.8445,0.22011,0.32202,0.32202,0.8017,0.95269,0.35118,0.63053,0.065016,34,211.24,5961,1.0503e+06,5.3941,30.65,1.6095e+05,23949,4455,0.90817,0.92079,0.36048,0.29039,0.18659,0.77258,1.046e+05,44063,0.00076179,0.00045365,0,0.10513,0,0.06825,0.0024923,0.0027621,0.0055934,0.0079397,0.034972,1.6629,1.0035,0.20178,0.33706,0.30786,0.22707,0.38394,0.3127,0.21125,0.39773,0.3385,94.24,8.3123,29109,1.2267e+05,1.2198e+05,0.022836,0.014611,0.017067,0.12508,0.096784,0.048535,0.33035,0.30867,0.089784,0.53562,0.53528,0.11539,0.69755,0.70864,0.12739,0.00043675,0.00026344,0.0075513,-0.0091186,0.018826,-0.023784,0.0011978,0.00071643,0.0096746,-0.011099,0.022463,-0.032389,0.0022965,0.001372,0.010964,-0.013073,0.025704,-0.042636,7.0696e-05,4.3993e-05,0.0020083,-0.0086143,0.015273,-0.0090082,0.00024407,0.00014771,0.0032321,-0.010883,0.015804,-0.016133,0.00068185,0.00041406,0.0053352,-0.012577,0.016489,-0.027365,0.00033956,0.00020447,0.018236,-0.0030733,0.0075298,-0.020436,0.00080271,0.00048292,0.021167,-0.003304,0.010213,-0.024452,0.0012158,0.00072904,0.01944,-0.0045808,0.012386,-0.027771,2.6493e-05,1.4971e-05,0.006596,-0.0031566,0.012533,-0.014445,0.000151,8.5799e-05,0.011994,-0.0035205,0.01723,-0.01721,0.00039893,0.00022888,0.016007,-0.0037314,0.021537,-0.020584,0.39566,74,74,40,1054,3,3,3,0.645
30,-0.0032405,0.41689,0.42036,-0.76108,0.40736,-0.89494,0.17589,-0.49168,4.411,-0.066101,3.1948,0.0014224,3.8338,5.5504,0.47618,9.8573,0.0094058,0.76154,1.9918,1.2652,0.88947,0.65936,0.06955,0.1116,0.14409,0.10866,0.088978,0.074385,0.40273,0.1983,0.15302,0.010264,0.014042,0.07624,0.14967,0.1129,0.71444,0.0787,0.13382,0.13382,2.0432,2.4131,0.60539,0.92335,0.41218,47,70.83,1972,94719,5.4041,32.36,53244,22734,5967,0.91939,0.93764,0.03475,0.027123,0.025824,0.12429,26223,15038,0.0011221,0.00052017,0,0.071639,0,0.05497,0.0036479,0.0061233,0.0024475,0.0040199,0.020646,0.012041,0.089117,0.19615,0.26356,0.21418,0.22314,0.22666,0.080823,0.19675,0.1974,0.061715,25.195,5.7829,41010,1.104e+05,1.0994e+05,0.32329,0.38354,0.1249,0.67244,0.73227,0.13488,0.84739,0.88855,0.11905,0.93599,0.9566,0.10423,0.9759,0.98434,0.092128,0.0016544,0.0010799,0.014786,-0.0015479,0.031579,-0.032149,0.0039409,0.0026945,0.016455,-0.00104,0.035982,-0.039888,0.0070058,0.0048803,0.01729,-0.00066885,0.040685,-0.047275,0.0001433,8.6223e-05,0.0021043,-0.005758,0.017387,-0.014605,0.00045646,0.00027456,0.0031247,-0.0070735,0.018769,-0.019924,0.0011055,0.00067726,0.0044713,-0.0079688,0.020532,-0.027819,0.001337,0.00086909,0.037118,0.0047326,0.027468,-0.027418,0.0028996,0.0019952,0.039525,0.0069336,0.031874,-0.032547,0.0048407,0.0034291,0.040013,0.0087546,0.035643,-0.036735,0.00017407,0.00012459,0.022403,0.00064164,0.0098218,-0.013679,0.00060719,0.00043775,0.024931,0.0014111,0.015106,-0.015343,0.001182,0.00084584,0.024518,0.001698,0.020995,-0.018778,0.41666,74,74,40,1054,3,3,3,0.645
30,-0.0057754,0.14269,0.14138,-0.92655,0.12666,-1.2255,0.3227,0.79961,3.9342,0.15922,3.2867,5.3891e-05,1.3975,3.6448,0.14675,4.5398,0.0043319,0.92656,0.93038,0.49838,0.39961,0.33501,0.15192,0.13249,0.21839,0.15408,0.048584,0.035667,0.25888,0.38376,0.074383,0.012885,0.038318,6.2486,10.878,4.3531,21.989,0.14514,0.11387,0.14514,0.33715,1.1079,0.26412,0.48611,0.11506,56,100.77,1723,97444,4.0947,19.83,46521,40527,14688,0.91382,0.93066,0.28628,0.21647,0.16893,0.68409,55300,27366,0.0010062,0.00050569,0,0.063812,0,0.051078,0.0016621,0.03951,0.00014908,0.05292,0.79387,1.5037,0.47315,0.22589,0.35148,0.23879,0.25922,0.42196,0.19339,0.27338,0.43516,0.17798,48.291,6.4474,21773,69790,68600,0.03164,0.025188,0.021625,0.25043,0.23587,0.088863,0.49702,0.48469,0.12353,0.65806,0.64846,0.12964,0.76107,0.75152,0.1271,0.0038462,0.0032644,0.060813,0.0098659,0.033653,-0.032608,0.010286,0.0091314,0.075974,0.019894,0.045188,-0.032832,0.019579,0.017857,0.085483,0.030038,0.057055,-0.032673,0.0023016,0.0016689,0.059793,0.0074866,0.024144,-0.042113,0.0051522,0.0037868,0.062395,0.010745,0.028824,-0.052357,0.0092567,0.0069574,0.066237,0.014984,0.034532,-0.062103,0.00039847,0.00030439,0.01957,-0.0023868,0.013515,-0.017193,0.0011957,0.00092137,0.028833,-0.00082277,0.015023,-0.02386,0.0025327,0.0019363,0.037036,0.001476,0.016997,-0.032085,0.0011461,0.0012911,0.26096,0.026373,0.034021,0.018113,0.004011,0.0044842,0.29135,0.041077,0.049795,0.022664,0.0081087,0.0092277,0.29755,0.053908,0.065117,0.033301,0.42053,74,74,40,1054,3,3,3,0.645
30,-0.10895,1.0326,0.99666,-0.048924,0.77867,-0.071804,0.46768,0.025779,2.3519,0.0062262,3.3771,0.00063908,4.0912,2.9651,1.9003,3.5147,0.0033538,0.048926,5.2856,3.5116,2.7416,2.2488,0.027416,0.041797,0.086009,0.062846,0.045821,0.040729,0.69538,0.15664,0.33153,0.24689,0.92916,2.115,2.2499,0.052777,6.0819,0.076011,0.17166,0.17166,0.43026,0.55631,0.23277,3.1343,5.597,74,58.419,2581,97871,7.3256,58.087,69687,22491,7074,0.91718,0.9347,0.21528,0.1617,0.12308,0.66675,28413,15851,0.0012897,0.0004648,0,0.056742,0,0.052807,0.01065,0.030124,0.013893,0.046363,0.28055,0.2537,0.69018,0.21463,0.26492,0.2329,0.26404,0.23124,0.13711,0.24179,0.19807,0.11772,18.783,6.2882,14577,39955,38776,0.16713,0.19969,0.087471,0.46248,0.51958,0.12567,0.64332,0.69082,0.12244,0.72059,0.75933,0.10871,0.77562,0.80961,0.09919,0.033339,0.051387,0.40365,0.14864,0.19727,0.2743,0.065274,0.098807,0.3692,0.17816,0.23311,0.33447,0.10296,0.15288,0.34422,0.205,0.26394,0.38524,0.023232,0.040768,0.46217,0.13502,0.1926,0.31547,0.044545,0.076212,0.41308,0.15723,0.21948,0.37502,0.069154,0.11519,0.37892,0.17741,0.24215,0.42229,0.0075549,0.007625,0.28412,0.055922,0.060728,0.0021723,0.015594,0.01687,0.28795,0.073759,0.0799,0.025525,0.026382,0.030155,0.29542,0.09363,0.10101,0.055883,0.0025516,0.0029934,0.44487,0.055144,0.061309,0.028145,0.006572,0.0073834,0.36555,0.061507,0.071596,0.025919,0.011447,0.012628,0.32165,0.068682,0.083057,0.026138,0.55096,74,74,40,1054,3,3,3,0.645
30,-0.0018423,0.20114,0.2,-0.89432,0.1989,-0.82795,-0.074217,0.17463,3.3079,0.015061,3.3273,1.7125e-05,1.877,4.081,0.21114,5.1975,0.0049595,0.89433,1.1194,0.68075,0.54408,0.43582,0.13596,0.14936,0.16527,0.12809,0.054783,0.050794,0.31574,0.41694,0.18392,0.00019878,0.062022,2.7753,2.6176,1.4652,7.5212,0.11099,0.16284,0.16284,1.066,1.0763,0.32724,0.58934,0.17078,48,146.17,3578,3.4042e+05,5.0215,27.931,96606,54594,8613,0.90607,0.92045,0.28181,0.22395,0.11784,0.64316,84629,38906,0.0013905,0.00053684,0,0.10433,0,0.067417,0.00017168,0.00665,0.0024951,0.00051854,0.22199,0.061769,0.45515,0.23236,0.35249,0.24784,0.26797,0.42047,0.21888,0.27746,0.43236,0.21284,55.077,6.6916,23274,1.0043e+05,99596,0.025265,0.017253,0.018716,0.24139,0.24539,0.092841,0.49732,0.5308,0.13397,0.7014,0.74543,0.14977,0.84213,0.87996,0.15243,0.00042501,0.000258,0.0072834,-0.0091435,0.013895,-0.030907,0.0016066,0.00099299,0.012862,-0.0096177,0.018417,-0.041252,0.0038676,0.0024573,0.018302,-0.008983,0.023423,-0.054571,0.00016991,9.5639e-05,0.0047842,-0.0078464,0.010476,-0.023954,0.000663,0.00038454,0.0087024,-0.0089518,0.012747,-0.030622,0.0018699,0.0011477,0.014502,-0.0086208,0.016009,-0.042375,3.0811e-05,1.7513e-05,0.0016401,-0.0060522,0.0050685,-0.013835,0.00019804,0.00011222,0.0051762,-0.0070296,0.0063802,-0.018539,0.00058403,0.00033282,0.0092565,-0.0074852,0.0081708,-0.026137,0.00022429,0.00014485,0.055349,0.0022702,0.013598,-0.018375,0.00074684,0.00049695,0.058797,0.003647,0.017401,-0.023048,0.0014364,0.00098976,0.057127,0.004348,0.021066,-0.026307,0.43808,74,74,40,1054,3,3,3,0.645
30,-0.064337,0.86914,0.86538,-0.36579,0.69488,-0.52815,0.44387,-0.26081,3.215,-0.075366,3.3392,1.1269e-05,4.7438,4.2107,1.2668,5.1912,0.0049535,0.36586,4.1535,2.9957,2.3733,1.7805,0.050034,0.061125,0.072119,0.056975,0.046794,0.064053,0.6489,0.073934,0.0025526,0.50108,1.0887,1.7375,0.28167,0.044231,3.7296,0.15447,0.62618,0.62618,1.3501,2.1686,0.60753,1.7695,1.5602,50,95.78,4198,3.5028e+05,6.8213,47.692,1.1335e+05,6048,2160,0.91753,0.93858,0.20652,0.1426,0.13358,2.7623,45649,27369,0.00075417,0.00040228,0,0.093573,0,0.10509,6.6754e-05,0.048164,0.0099334,0.063927,2.229,3.2913,1.3235,0.23037,0.29123,0.26491,0.31056,0.30268,0.22856,0.32419,0.30477,0.23229,51.196,7.1526,15817,34277,32550,0.06155,0.050764,0.031808,0.2006,0.17241,0.053821,0.3526,0.31847,0.066262,0.53068,0.50512,0.07905,0.68737,0.68425,0.086797,0.0050148,0.0041622,0.059951,0.014057,0.05112,-0.055771,0.011028,0.0092499,0.061591,0.019386,0.061387,-0.072152,0.019734,0.016775,0.065145,0.026344,0.072169,-0.086662,0.0034827,0.0029258,0.06841,0.013688,0.043291,-0.044446,0.0075494,0.0064587,0.069127,0.018246,0.049638,-0.052771,0.012891,0.011248,0.069743,0.022883,0.055763,-0.058584,0.0011345,0.00092451,0.042127,0.0038595,0.022321,-0.02546,0.001988,0.0015941,0.036248,0.0033595,0.024832,-0.03561,0.0033164,0.0026444,0.036668,0.0042931,0.028542,-0.046822,0.0003976,0.00031187,0.068447,0.0058253,0.021965,-0.028128,0.0015977,0.0012804,0.08775,0.011513,0.032031,-0.039839,0.0039045,0.0031734,0.10833,0.019545,0.043907,-0.051278,0.4028,74,74,40,1054,3,3,3,0.645
30,-0.013444,0.81491,0.79293,-0.45422,0.79118,-0.43289,-0.046952,-0.24433,9.3511,0.014818,3.1746,0.0045532,6.0313,5.771,1.0902,7.9443,0.0075804,0.4543,3.2159,2.0681,1.4856,1.1214,0.045952,0.074695,0.10935,0.089578,0.077099,0.069717,0.53361,0.084387,0.055134,0.00027948,0.030374,0.06644,0.066157,0.018578,0.32135,0.073076,0.081506,0.081506,1.6184,2.8306,0.63209,1.5679,1.1863,53,81.887,4120,3.1806e+05,7.0662,50.961,1.1124e+05,1836,1647,0.91892,0.93305,0.13343,0.10103,0.050916,0.45968,26132,15039,0.0011101,0.00054072,0,0.10259,0,0.086655,0.0020818,0.031165,0.014162,0.045376,1.4219,1.0698,0.23577,0.20473,0.28122,0.26358,0.21971,0.29189,0.22685,0.22682,0.30585,0.21031,30.334,7.1166,23286,63829,63185,0.14495,0.14569,0.070888,0.37795,0.39933,0.095962,0.54571,0.58332,0.097048,0.66171,0.69862,0.093277,0.7561,0.79111,0.090351,0.0082765,0.0062494,0.093634,0.028624,0.050695,-0.059864,0.015163,0.011434,0.08014,0.030527,0.058308,-0.071904,0.021623,0.016287,0.06755,0.029523,0.063421,-0.080957,0.0054599,0.0042375,0.10149,0.02503,0.041823,-0.044743,0.0099866,0.0076471,0.086536,0.026574,0.046356,-0.055619,0.014309,0.010868,0.07326,0.026004,0.04913,-0.063799,0.0021967,0.0015228,0.077193,0.012067,0.024184,-0.035991,0.0035895,0.0025297,0.061935,0.011267,0.027125,-0.040115,0.0046379,0.0033127,0.048527,0.0091156,0.028379,-0.041695,0.00061989,0.00048905,0.10099,0.010575,0.020129,-0.017209,0.0015869,0.0012568,0.082477,0.011088,0.026018,-0.020846,0.0026766,0.0021062,0.070276,0.011295,0.032013,-0.025952,0.45972,74,74,40,1054,3,3,3,0.645
30,-0.0022246,0.26131,0.25721,-0.86171,0.25648,-0.90748,0.053117,0.5202,3.4406,0.10411,3.2946,4.5214e-05,2.1369,4.0635,0.27601,5.2248,0.0049855,0.86185,1.3221,0.82735,0.68122,0.54352,0.12709,0.10413,0.1735,0.12191,0.049731,0.055477,0.36816,0.37262,0.030231,0.00087467,0.086057,3.7816,1.8879,0.80448,6.9638,0.21,0.16775,0.21,2.4537,2.694,0.61379,0.67933,0.22064,52,137.25,5610,6.0633e+05,6.8042,48.114,1.5147e+05,18333,11070,0.90705,0.92053,0.35556,0.2823,0.18966,0.75528,86865,34676,0.0021354,0.00066317,0,0.06994,0,0.054336,0.001467,0.010003,0.00054877,0.017436,0.13961,0.37749,0.86026,0.23162,0.29649,0.21754,0.26465,0.31001,0.15585,0.27844,0.29399,0.14793,41.956,5.8735,25960,1.097e+05,1.0915e+05,0.085749,0.065079,0.068561,0.36228,0.371,0.15039,0.59151,0.62466,0.17199,0.76774,0.79709,0.17694,0.88017,0.89896,0.17196,0.0063803,0.004875,0.11801,0.025673,0.03729,-0.048141,0.013496,0.010556,0.11662,0.033263,0.045835,-0.058944,0.023481,0.018878,0.11993,0.042993,0.056413,-0.067973,0.0047393,0.0037449,0.14403,0.026741,0.033974,-0.037375,0.010074,0.0081877,0.14272,0.034643,0.041934,-0.043832,0.017729,0.014823,0.14841,0.04518,0.051838,-0.049303,0.0012763,0.00089543,0.073329,0.0062645,0.014494,-0.024252,0.0022036,0.0015485,0.062165,0.0055953,0.015513,-0.030195,0.0033778,0.0023551,0.057782,0.0056725,0.017604,-0.038214,0.0003647,0.00023468,0.097139,0.0063593,0.012145,-0.025592,0.0013384,0.00089427,0.11373,0.011182,0.017154,-0.032374,0.0028147,0.0019719,0.12082,0.015668,0.022923,-0.037665,0.50398,74,74,40,1054,3,3,3,0.645
30,-0.0039415,0.62524,0.62238,-0.61403,0.6176,-0.56024,-0.08761,0.64318,5.6344,0.057581,3.2738,0.00081448,4.6227,5.2592,0.77115,7.2947,0.0069605,0.61405,2.417,1.6795,1.2792,0.96557,0.075214,0.075779,0.11712,0.08335,0.067813,0.072438,0.50828,0.26302,0.034068,0.00063196,0.15507,0.31625,0.11868,7.1362e-05,0.8878,0.12552,0.24794,0.24794,0.85607,1.2009,0.3296,1.2534,0.77028,23,295.35,6715,1.9514e+06,4.4762,21.039,1.813e+05,2349,756,0.90212,0.90847,0.43014,0.35853,0.18691,0.86541,1.2637e+05,53041,0.00086826,0.0004425,0,0.12625,0,0.085032,0.0031321,0.0043623,0.0014942,0.0028102,0.01041,1.926,1.5158,0.20382,0.33501,0.31935,0.21349,0.36585,0.348,0.21154,0.39441,0.34565,124.4,8.6225,32282,1.4855e+05,1.479e+05,0.021926,0.014042,0.015128,0.13535,0.12061,0.048485,0.34673,0.36247,0.086998,0.58201,0.62683,0.11575,0.7643,0.81527,0.12886,0.00075909,0.00040013,0.012116,-0.0069847,0.0081974,-0.032109,0.0016285,0.00087669,0.012143,-0.0091967,0.010371,-0.041707,0.0027057,0.0014655,0.011925,-0.011531,0.013073,-0.050704,3.8163e-06,1.8448e-06,0.00010008,-0.0087386,0.0028351,-0.011417,8.8131e-05,4.5133e-05,0.0010774,-0.011116,0.00321,-0.022079,0.00045261,0.00023935,0.0032694,-0.012793,0.0046257,-0.034782,0.00020328,0.00010772,0.010079,-0.0042222,0.0047501,-0.022333,0.00067246,0.0003619,0.01637,-0.0039468,0.0059768,-0.029389,0.0012789,0.00069334,0.018879,-0.0041135,0.0072595,-0.036087,0.00055199,0.00029056,0.12687,0.010832,0.015523,-0.029332,0.0012179,0.00065518,0.089305,0.0089649,0.018515,-0.036391,0.0018324,0.00099221,0.067879,0.0071577,0.02123,-0.040086,0.38426,74,74,40,1054,3,3,3,0.645
30,-0.010967,0.21741,0.22537,-0.88001,0.17952,-1.2769,0.45103,-0.16822,2.6299,-0.030726,3.3395,0.00019921,1.7462,3.5629,0.23974,4.4895,0.0042839,0.88001,1.4824,0.68568,0.54483,0.44264,0.077269,0.12673,0.18577,0.19456,0.055271,0.046856,0.31354,0.071689,0.0522,0.0012316,0.0037752,4.0202,4.8254,2.2906,11.265,0.058515,0.1458,0.1458,1.2026,1.7432,0.43255,0.62924,0.19772,48,105.92,4207,3.6637e+05,6.6185,45.195,1.1359e+05,9207,4752,0.90883,0.92071,0.31692,0.27567,0.058842,0.7058,84589,28333,0.0014793,0.00063617,0,0.10467,0,0.074914,0.00016775,0.0015377,0.00031619,0.0072324,0.010468,0.23385,0.52236,0.21082,0.34153,0.26881,0.22818,0.38505,0.25344,0.22935,0.40294,0.26911,50.751,7.2579,36063,2.0793e+05,2.0759e+05,0.07354,0.046361,0.041505,0.32371,0.33067,0.094854,0.57199,0.64227,0.1174,0.77457,0.83644,0.12601,0.90034,0.93414,0.12416,0.0014781,0.00086188,0.019298,-0.0027491,0.012508,-0.039013,0.0057974,0.003625,0.035361,0.0043814,0.019317,-0.054599,0.014671,0.010067,0.052893,0.016276,0.029129,-0.065121,0.00086899,0.00052008,0.018642,-0.0023585,0.009541,-0.026472,0.0029627,0.0018774,0.029627,0.0011928,0.012915,-0.036462,0.0070507,0.0047692,0.041661,0.0072843,0.018077,-0.044909,0.0001397,8.5096e-05,0.0056655,-0.0043428,0.004756,-0.019631,0.0010411,0.00073602,0.020731,-0.0015767,0.008391,-0.0223,0.0035211,0.0028606,0.042518,0.0053156,0.01469,-0.020845,0.00046941,0.0002567,0.088255,0.0078026,0.011283,-0.025777,0.0018344,0.0010358,0.11003,0.014515,0.016476,-0.035005,0.0043291,0.0025971,0.13118,0.023317,0.023227,-0.044361,0.41391,74,74,40,1054,3,3,3,0.645
30,-0.045883,0.71667,0.67026,-0.57367,0.66967,-0.55663,-0.029706,1.5244,11.443,0.080333,3.2432,0.0016491,8.0189,8.6802,0.85182,11.41,0.010887,0.57368,2.3949,1.7726,1.4907,1.1985,0.098431,0.075657,0.081988,0.069724,0.043048,0.056271,0.57488,0.34046,0.0050146,0.42802,0.65426,2.9848,0.85612,0.00043559,5.2691,0.29952,0.36514,0.36514,0.72364,1.1284,0.42458,1.2777,0.66477,87,59.759,1996,58968,6.5177,48.997,53892,27135,9639,0.92112,0.94346,0.26914,0.17957,0.21157,0.72609,32095,20852,0.0010759,0.00049398,0,0.065391,0,0.069111,0.0084306,0.030556,0.018552,0.047699,1.1314,1.626,0.070628,0.21735,0.2919,0.2293,0.27237,0.29431,0.12647,0.2741,0.28564,0.11855,25.862,6.1911,6493.4,14626,12747,0.14888,0.14598,0.092126,0.44664,0.47023,0.14349,0.66447,0.68386,0.14952,0.81555,0.83061,0.14546,0.89359,0.90236,0.13511,0.0097244,0.010032,0.1392,0.039792,0.064538,0.017362,0.021615,0.022557,0.14455,0.055012,0.081563,0.031755,0.036661,0.03828,0.14491,0.068461,0.097086,0.039946,0.0061639,0.0065601,0.14498,0.032953,0.05028,0.027318,0.012632,0.013526,0.1385,0.04081,0.060301,0.038446,0.020149,0.021425,0.13053,0.046809,0.068638,0.041489,0.0022359,0.0022226,0.099418,0.013963,0.030513,-0.0016225,0.0059375,0.0060642,0.12963,0.02595,0.040964,0.0084687,0.011678,0.012068,0.1546,0.039993,0.052682,0.017459,0.0013246,0.0012489,0.27305,0.029505,0.037449,-0.012431,0.0033772,0.0032733,0.22209,0.032091,0.046053,-0.0089678,0.0059772,0.0058498,0.19857,0.036118,0.055271,-0.0077317,0.52336,74,74,40,1054,3,3,3,0.645
30,-0.0029787,0.14939,0.145,-0.92459,0.14497,-0.93614,0.012493,0.40421,2.8008,0.1071,3.3205,5.8675e-05,1.6579,4.2746,0.15014,5.4369,0.0051879,0.92484,0.88467,0.56136,0.4463,0.38269,0.15584,0.18158,0.18001,0.11295,0.052378,0.032703,0.28453,0.43109,0.24795,0.00042094,0.276,4.4615,11.969,2.8282,20.214,0.12889,0.083391,0.12889,1.2013,2.3899,0.63145,0.49574,0.12258,40,180.53,4127,5.6859e+05,4.4683,21.989,1.1143e+05,68958,6345,0.90525,0.9179,0.39012,0.31458,0.20448,0.81596,71620,35167,0.0019008,0.00061133,0,0.078282,0,0.06625,0.0062609,0.0075621,0.0056926,0.017225,0.19025,0.38919,0.46198,0.22336,0.35011,0.25156,0.24793,0.41292,0.21404,0.25713,0.4257,0.20619,56.259,6.7922,24200,1.0378e+05,1.0297e+05,0.062683,0.056188,0.047711,0.30972,0.34248,0.12239,0.57918,0.62759,0.16031,0.76659,0.80537,0.16819,0.87948,0.90239,0.16357,0.0050553,0.0037651,0.089014,0.017395,0.03191,-0.045548,0.010213,0.0075325,0.084012,0.020777,0.038041,-0.059984,0.016768,0.012264,0.081528,0.024446,0.044495,-0.075827,0.0047721,0.0035821,0.13806,0.026311,0.034583,-0.042451,0.009045,0.006763,0.12199,0.029085,0.038321,-0.053033,0.01413,0.010505,0.1126,0.032061,0.042261,-0.065238,7.1583e-05,4.8833e-05,0.0039152,-0.005737,0.005898,-0.0117,0.00031586,0.00022836,0.0084825,-0.0063899,0.0077106,-0.013606,0.00078921,0.00058946,0.012852,-0.0066276,0.010035,-0.016819,0.0002116,0.00013417,0.053653,0.0019502,0.0082189,-0.02107,0.00085225,0.00054119,0.06894,0.0049817,0.013498,-0.029648,0.0018817,0.001194,0.076894,0.0079191,0.019372,-0.038408,0.42087,74,74,40,1054,3,3,3,0.645
30,-0.0067857,0.29479,0.28619,-0.84471,0.28441,-0.77816,-0.078792,0.53124,3.1484,0.11075,3.3123,2.107e-07,2.0343,3.6492,0.31019,4.5731,0.0043637,0.84475,1.2973,0.7964,0.61078,0.48244,0.10673,0.11777,0.19052,0.12574,0.06645,0.05568,0.33712,0.33268,0.1143,0.043614,0.023716,0.99944,1.2667,0.76522,3.5457,0.15438,0.20103,0.20103,0.56006,0.5638,0.25146,0.7237,0.25891,43,141.79,1724,1.3045e+05,3.1485,12.607,46548,38664,19386,0.91385,0.93095,0.30123,0.22573,0.19833,0.71721,58557,29824,0.001086,0.00047273,0,0.054723,0,0.049404,0.0068577,0.01358,0.0049888,0.00055652,1.3261,2.9034,1.1561,0.21755,0.35175,0.26603,0.26109,0.4432,0.21959,0.26083,0.46373,0.21449,46.737,7.1829,15935,48938,47187,0.023984,0.017235,0.016195,0.23768,0.23646,0.083325,0.48643,0.51215,0.11944,0.68835,0.72059,0.13398,0.83355,0.8608,0.13753,0.0003399,0.00022809,0.0053094,-0.0091764,0.015005,-0.021413,0.0010472,0.00072544,0.0076419,-0.011033,0.018142,-0.031785,0.0026024,0.0018368,0.011225,-0.011656,0.02318,-0.046399,1.1528e-05,7.3511e-06,0.00029588,-0.0085877,0.0086867,-0.014781,0.00011755,7.5994e-05,0.0014063,-0.010867,0.01059,-0.02103,0.00056624,0.00037728,0.0040029,-0.012296,0.01389,-0.031573,0.00027585,0.00018503,0.013385,-0.0035048,0.0112,-0.018229,0.00074187,0.00051799,0.017674,-0.0034937,0.013264,-0.024773,0.0015602,0.0011183,0.02254,-0.002826,0.015903,-0.032526,5.2516e-05,3.5708e-05,0.011813,-0.0023163,0.0083101,-0.012026,0.0002408,0.00016693,0.01728,-0.0023131,0.010858,-0.018064,0.00068211,0.00048356,0.024728,-0.0014428,0.015095,-0.025298,0.42866,74,74,40,1054,3,3,3,0.645
30,-0.008607,0.28124,0.27225,-0.85293,0.27074,-0.78931,-0.074588,0.1762,3.239,0.046877,3.3223,3.0703e-05,2.7873,5.1376,0.29379,6.5705,0.0062695,0.85296,1.284,0.7916,0.60973,0.5091,0.096336,0.13788,0.19829,0.12147,0.063658,0.041814,0.34055,0.26357,0.18259,0.044884,0.052381,1.2362,3.7795,0.79058,6.3497,0.092095,0.084449,0.092095,1.6582,2.3285,0.68129,0.70247,0.24294,49,112.29,1926,1.4032e+05,4.0764,18.792,52002,47088,17793,0.91631,0.93491,0.34717,0.25326,0.2311,0.86047,48049,27065,0.00095168,0.0004114,0,0.054868,0,0.052408,0.0026345,0.022562,0.0044356,0.031313,0.18233,1.1857,0.87996,0.21471,0.3475,0.27378,0.24913,0.44334,0.23418,0.25127,0.46112,0.22669,44.049,7.3919,12531,32963,31071,0.019673,0.015227,0.012122,0.20349,0.19283,0.065099,0.42398,0.42106,0.095003,0.61835,0.6304,0.10983,0.78344,0.8016,0.11796,0.00052974,0.00038704,0.0075511,-0.0077731,0.015708,-0.033023,0.0019194,0.0014263,0.012781,-0.0077502,0.020402,-0.044343,0.004515,0.0034783,0.017771,-0.0066583,0.026238,-0.054546,0.00044196,0.00032795,0.010351,-0.0053183,0.012164,-0.02844,0.0015359,0.0011626,0.016768,-0.0045764,0.015759,-0.037372,0.0035893,0.0028201,0.023154,-0.0027079,0.020193,-0.045284,6.5753e-05,4.3785e-05,0.0029113,-0.005195,0.0078894,-0.014803,0.00027722,0.00019012,0.0060268,-0.0059464,0.0085932,-0.020041,0.00069539,0.00049826,0.0091675,-0.0063371,0.0094775,-0.026315,2.2026e-05,1.5304e-05,0.0045211,-0.0029681,0.0080808,-0.010494,0.00010626,7.364e-05,0.0069582,-0.0036747,0.012154,-0.014421,0.00023027,0.00015991,0.0076175,-0.0045691,0.016963,-0.016819,0.4299,74,74,40,1054,3,3,3,0.645
30,-0.054942,0.98864,0.92791,-0.26685,0.88065,-0.32707,0.22568,0.25675,3.7376,0.0038971,3.3102,7.235e-05,6.5829,5.4338,1.4649,6.8112,0.0064992,0.26685,4.5399,3.0863,2.4704,1.9466,0.042312,0.056502,0.075134,0.064728,0.043777,0.051628,0.66592,0.028675,0.0023647,0.28994,0.46402,1.777,0.60979,0.075282,3.247,0.25139,0.55493,0.55493,1.0681,1.3073,0.43828,2.0309,2.0016,77,73.052,4249,2.3382e+05,8.4627,73.377,1.1472e+05,8721,6642,0.91665,0.93496,0.247,0.17746,0.1692,0.66107,37778,17932,0.0019217,0.00092177,0,0.056601,0,0.043649,0.020687,0.010936,0.030222,0.0015192,0.48211,2.7402,2.3629,0.20925,0.2355,0.19435,0.22761,0.14937,0.050295,0.22647,0.13342,0.039445,16.96,5.2476,10887,29691,28359,0.32805,0.30759,0.21063,0.74656,0.77836,0.24887,0.86603,0.88822,0.20221,0.91497,0.93128,0.16934,0.94638,0.95786,0.14848,0.010802,0.009928,0.16045,0.046242,0.064044,-0.030456,0.022347,0.020752,0.15506,0.058445,0.080418,-0.03522,0.037497,0.035276,0.15379,0.071766,0.097683,-0.036514,0.0069271,0.0064719,0.16905,0.03879,0.054304,-0.020704,0.015165,0.014421,0.17252,0.052153,0.068074,-0.020052,0.02563,0.024685,0.17228,0.064412,0.081024,-0.018619,0.0035682,0.0032,0.16463,0.026226,0.032068,-0.021969,0.0072408,0.0064957,0.16403,0.033937,0.042002,-0.028238,0.01194,0.010865,0.16402,0.041889,0.052316,-0.030679,0.00030713,0.00025606,0.065692,0.0042138,0.015681,-0.014676,0.00099187,0.00082056,0.067681,0.0061185,0.02221,-0.02021,0.0020061,0.0016349,0.069152,0.00815,0.030037,-0.026938,0.5418,74,74,40,1054,3,3,3,0.645
30,-0.016697,0.89573,0.87917,-0.34641,0.85506,-0.28904,-0.1656,0.55045,4.1752,0.062866,3.3137,6.8545e-05,4.9476,4.3258,1.3057,5.6508,0.005392,0.34646,3.408,2.3418,1.7675,1.401,0.059253,0.055355,0.10145,0.073391,0.062963,0.055936,0.59165,0.19711,0.0012352,0.0091047,0.20788,0.30631,0.31979,0.049401,1.0908,0.15739,0.30442,0.30442,0.38961,0.5299,0.28229,1.8324,1.6786,30,232.8,6648,1.4613e+06,5.1924,27.987,1.795e+05,4293,3294,0.9016,0.9123,0.45015,0.37518,0.21127,0.88388,1.0033e+05,47249,0.0011594,0.00058469,0,0.072041,0,0.046824,0.0039443,0.028234,0.0038124,0.036766,0.24972,1.0263,0.42714,0.25164,0.32908,0.2609,0.30185,0.36683,0.24753,0.32362,0.36859,0.23942,77.755,7.0442,28361,1.3183e+05,1.3119e+05,0.02157,0.012677,0.015904,0.2036,0.17878,0.077938,0.45232,0.45759,0.12128,0.6504,0.68318,0.13823,0.78758,0.82639,0.14189,0.0016423,0.0010942,0.028012,-0.0022248,0.014029,-0.036417,0.004374,0.0031018,0.034853,6.2408e-05,0.019213,-0.046335,0.0092642,0.0072276,0.043632,0.0048467,0.026863,-0.048632,0.0011976,0.00084749,0.033562,-0.00030028,0.0085852,-0.025764,0.0029599,0.0022936,0.038668,0.0013568,0.011553,-0.028859,0.0062918,0.0054818,0.048566,0.0058763,0.017454,-0.023417,0.00013012,6.4853e-05,0.0068937,-0.0050771,0.0080053,-0.015673,0.00028245,0.00014204,0.0073475,-0.0064915,0.0099335,-0.018431,0.00052921,0.00027494,0.0083481,-0.0077201,0.012049,-0.024081,0.00031464,0.00018184,0.077279,0.0047309,0.013003,-0.026602,0.001134,0.00066746,0.088853,0.008273,0.017903,-0.036262,0.0025083,0.0015084,0.09929,0.012648,0.023945,-0.046751,0.40238,74,74,40,1054,3,3,3,0.645
30,-0.03341,0.64947,0.61702,-0.61838,0.60617,-0.70036,0.13257,-0.9159,6.6215,-0.04626,3.2754,0.00080884,3.247,3.7151,0.76245,4.6205,0.0044089,0.6184,2.3535,1.6109,1.3224,1.0743,0.064201,0.094112,0.11121,0.088287,0.049526,0.053592,0.53907,0.15881,0.068641,0.031913,0.17622,1.8684,0.94507,0.00036666,3.2494,0.331,0.38588,0.38588,1.2256,1.9087,0.53119,1.1987,0.62082,82,27.061,1574,29935,8.6893,77.622,42498,3672,2187,0.92311,0.94805,0.12857,0.082922,0.1086,0.48301,26104,17283,0.00076803,0.00035617,0,0.054586,0,0.048984,0.02272,0.016815,0.083651,0.081057,0.42759,0.63437,0.058744,0.2048,0.29357,0.26048,0.26105,0.30376,0.17264,0.25304,0.29208,0.16301,19.694,7.0329,4097.5,6747.7,5072.8,0.1141,0.11096,0.037044,0.35036,0.35257,0.059057,0.55944,0.57434,0.066051,0.71057,0.72687,0.066499,0.81422,0.82918,0.064594,0.010963,0.011092,0.082344,0.033232,0.061692,0.0059883,0.02279,0.02317,0.079966,0.04226,0.076868,0.010614,0.036054,0.036683,0.074774,0.048219,0.089775,0.013262,0.0084019,0.0087617,0.10369,0.034471,0.054402,0.019248,0.017195,0.018001,0.098921,0.042778,0.064953,0.025921,0.027317,0.028611,0.092852,0.049083,0.074377,0.031317,0.0021036,0.0018585,0.049076,0.0092021,0.025586,-0.024521,0.0043527,0.0038859,0.049861,0.012239,0.031415,-0.028981,0.0069063,0.0061955,0.047974,0.014283,0.036515,-0.033234,0.00045795,0.00047153,0.049531,0.0056785,0.02228,0.0037235,0.001242,0.0012829,0.042855,0.0062855,0.031381,0.0048159,0.0018435,0.0018872,0.032134,0.0049233,0.038981,0.0038644,0.46659,74,74,40,1054,3,3,3,0.645
30,-0.050696,0.77549,0.69701,-0.54984,0.69509,-0.52094,-0.052562,-0.097367,4.1145,-0.024227,3.3367,4.4739e-05,3.4292,3.6125,0.89938,4.5778,0.0043682,0.54986,2.272,1.5494,1.2403,1.0292,0.054404,0.10028,0.13463,0.088668,0.055394,0.047518,0.51911,0.08921,0.12746,0.0017301,0.13167,1.09,1.2995,0.0007715,2.7404,0.083671,0.18274,0.18274,0.57215,0.70807,0.26844,1.3611,0.9257,69,62.667,1584,56065,4.9248,28.233,42768,23490,23031,0.92113,0.9433,0.040614,0.026974,0.014685,0.25361,24483,16561,0.0011691,0.0005484,0,0.04392,0,0.054105,0.0045039,0.011583,0.0060552,0.033393,0.49334,1.0501,0.7199,0.21674,0.28452,0.23103,0.27221,0.26639,0.11065,0.27446,0.26155,0.10368,22.074,6.2378,9643,21154,18464,0.16401,0.1594,0.084659,0.53898,0.56102,0.14445,0.74338,0.766,0.13954,0.83975,0.85663,0.12495,0.88916,0.90037,0.11215,0.013205,0.01431,0.15769,0.052666,0.075888,0.04625,0.027495,0.030483,0.15338,0.067195,0.095531,0.078723,0.045927,0.051573,0.15144,0.082104,0.11547,0.11021,0.0087719,0.0094464,0.17211,0.045921,0.064529,0.034313,0.018398,0.020279,0.16828,0.058672,0.079563,0.060404,0.031045,0.034933,0.16777,0.072332,0.095048,0.091495,0.0027186,0.0029789,0.10084,0.016606,0.030095,0.027079,0.0067064,0.0078367,0.12214,0.027592,0.043239,0.061823,0.012139,0.014659,0.13406,0.038209,0.057064,0.097125,0.0017147,0.0018851,0.29486,0.035743,0.04021,0.022736,0.0045049,0.0049774,0.24713,0.040475,0.050541,0.032072,0.0082126,0.0092185,0.2276,0.04733,0.063633,0.046479,0.51038,74,74,40,1054,3,3,3,0.645
30,-0.041231,0.9457,0.94116,-0.24073,0.82679,-0.32464,0.34859,1.1455,16.048,-0.036099,3.2843,0.0009908,15.518,12.587,1.5171,18.052,0.017225,0.24073,5.8284,4.0051,3.0657,2.1076,0.030853,0.040987,0.069278,0.053683,0.046453,0.076299,0.68245,0.0073292,0.17823,0.39993,0.96602,1.1612,0.029651,0.094566,2.837,0.29549,0.35613,0.35613,2.3654,2.726,0.76542,2.1358,2.2536,46,112.85,2947,2.299e+05,5.1026,28.821,79569,40473,5940,0.91619,0.93129,0.2261,0.17178,0.10998,0.641,36460,21768,0.0014596,0.00055797,1,0.20262,0,0.11297,0.098491,0.24649,0.13646,0.33509,0.052909,0.22101,0.060227,0.20374,0.27684,0.25006,0.22031,0.24795,0.21536,0.20521,0.2602,0.21769,22.749,6.7517,5696.7,16522,15667,0.15563,0.14697,0.088441,0.40802,0.39311,0.12038,0.57065,0.55721,0.11793,0.69266,0.68767,0.11346,0.79966,0.80172,0.11104,0.0085462,0.0086775,0.11235,0.032251,0.052094,0.0039266,0.017397,0.019029,0.10685,0.039787,0.067367,0.031686,0.029625,0.034014,0.10754,0.049786,0.084637,0.0636,0.0031873,0.0033231,0.068846,0.01248,0.031406,0.0068262,0.0062578,0.0064175,0.06301,0.014099,0.037017,0.0051722,0.010586,0.010426,0.062981,0.017429,0.04324,-0.0038778,0.005048,0.0051326,0.20613,0.03714,0.041888,0.0032619,0.010407,0.012043,0.20866,0.048955,0.058519,0.040316,0.017333,0.02212,0.21074,0.061121,0.077189,0.088557,0.00031084,0.00022173,0.058845,0.0040458,0.015719,-0.021075,0.0013722,0.0010642,0.082871,0.0097273,0.024151,-0.027037,0.0033658,0.0028651,0.10269,0.01687,0.034597,-0.023683,0.46675,74,74,40,1054,3,3,3,0.645
30,-0.0027772,0.15051,0.14651,-0.92377,0.14516,-1.0124,0.095993,0.42252,3.0327,0.050321,3.3282,1.52e-05,1.9543,5.0063,0.15209,6.5295,0.0062305,0.92387,0.90855,0.57401,0.4506,0.38503,0.14308,0.17021,0.20047,0.11375,0.055206,0.033335,0.28395,0.38895,0.20321,0.011072,0.2644,3.4975,10.944,2.7087,18.018,0.10566,0.094354,0.10566,1.0957,1.3873,0.42405,0.49593,0.12271,49,61.796,1274,50940,4.5332,22.606,34398,26433,7128,0.91741,0.93853,0.20517,0.16942,0.052628,0.68584,59257,18438,0.0011031,0.00045261,0,0.10936,0,0.070295,0.0025244,0.0030938,0.00026514,0.0020215,0.37835,0.11261,0.19804,0.20886,0.32335,0.26733,0.22702,0.36844,0.22702,0.23429,0.37131,0.27201,47.641,7.2179,33775,1.0783e+05,1.0726e+05,0.1012,0.071794,0.035881,0.33972,0.32582,0.062531,0.54048,0.54726,0.069683,0.68271,0.70985,0.069769,0.79732,0.82984,0.069073,0.0078973,0.0047913,0.064772,0.022818,0.031532,-0.062791,0.01404,0.0084155,0.053797,0.023217,0.037142,-0.077337,0.020798,0.012324,0.047103,0.023606,0.043064,-0.093389,0.0077659,0.0047188,0.10465,0.032847,0.03292,-0.06183,0.013538,0.0081254,0.085047,0.033482,0.036863,-0.075304,0.019392,0.011479,0.071978,0.033503,0.040246,-0.089082,4.3372e-05,2.3253e-05,0.0011049,-0.0040646,0.0059029,-0.01793,0.0003096,0.00016713,0.0038727,-0.0043449,0.0072958,-0.020388,0.000808,0.00044549,0.006129,-0.0044194,0.0091493,-0.024726,8.8021e-05,4.932e-05,0.010396,-0.00099962,0.012583,-0.01709,0.00058934,0.00033882,0.022206,0.001204,0.019374,-0.024496,0.0019044,0.0011211,0.03625,0.005473,0.027942,-0.035715,0.383,74,74,40,1054,3,3,3,0.645
30,-0.005054,0.61929,0.61934,-0.6165,0.60586,-0.52556,-0.14752,0.77425,4.4127,0.088669,3.2759,0.00036581,5.474,6.2474,0.76626,8.596,0.0082023,0.6165,2.506,1.6626,1.2116,0.96873,0.078805,0.081595,0.10885,0.092374,0.078293,0.057026,0.50306,0.27814,0.045347,0.015893,0.062909,0.14893,0.4816,0.00025204,1.0331,0.1863,0.29034,0.29034,2.0733,3.9228,0.92538,1.2284,0.75093,54,89.074,2500,1.8289e+05,4.9861,26.289,67500,53784,3375,0.9176,0.9361,0.20466,0.14361,0.12506,0.6807,47290,20324,0.00094211,0.00045704,0,0.071036,0,0.059628,0.015462,0.039598,0.022515,0.072372,0.29565,0.24439,0.61351,0.21221,0.28304,0.23828,0.2578,0.28464,0.12785,0.25671,0.27556,0.11419,30.021,6.4336,10155,23942,21970,0.21221,0.23535,0.11734,0.45493,0.47559,0.1306,0.65258,0.66998,0.13122,0.78937,0.81054,0.12581,0.8818,0.89851,0.11914,0.0036235,0.0029415,0.04635,0.0077579,0.040165,-0.047833,0.007291,0.0060573,0.04357,0.0088288,0.0464,-0.054911,0.011801,0.0099483,0.041682,0.0097739,0.052562,-0.063028,0.0016285,0.0012203,0.034226,0.0024619,0.028001,-0.040267,0.0026831,0.0020255,0.026288,0.00010083,0.0306,-0.045298,0.0038687,0.0030039,0.022396,-0.0017728,0.033065,-0.050517,0.0016193,0.0014186,0.064341,0.008038,0.025053,-0.02223,0.0037567,0.0033676,0.073291,0.012888,0.030681,-0.024964,0.006574,0.0059026,0.077773,0.017419,0.036098,-0.03111,0.00037569,0.0003026,0.069203,0.0055155,0.018449,-0.024809,0.0013925,0.0011462,0.081828,0.0098009,0.025961,-0.029871,0.002785,0.0023273,0.082677,0.012753,0.033425,-0.033419,0.47855,74,74,40,1054,3,3,3,0.645
