30,-0.088659,0.72322,0.72768,0.52118,0.45804,0.83844,0.60873,0.25203,1.8589,0.16782,3.278,0.0018637,3.1606,1.8112,3.0395,1.9937,0.0019023,-0.52119,14.459,9.4723,6.2811,4.8515,0.015373,0.014496,0.028899,0.030999,0.042117,0.033767,0.83435,4.1808,20.687,19.859,14.258,5.4503,7.4075,0.048994,71.891,0.12258,0.17037,0.17037,0.25537,0.36294,0.12868,3.1528,4.9743,69,61.449,1874,95514,5.5743,32.248,50598,48897,3375,0.91344,0.92796,0.11569,0.10431,0.0029804,0.18925,24104,12231,0.0015779,0.00047046,2,0.3693,0,0.051182,0.15851,0.58413,0.17848,0.65925,0.80501,1.8454,0.86149,0.22065,0.25444,0.18226,0.26509,0.22934,0.09201,0.24726,0.16949,0.07472,16.246,4.921,39968,3.0071e+05,3.0057e+05,0.27037,0.24268,0.13066,0.53643,0.50949,0.13493,0.69252,0.71852,0.1228,0.78844,0.83981,0.11158,0.84724,0.88854,0.10225,0.022246,0.024049,0.21148,0.082034,0.060987,0.013328,0.046372,0.050613,0.21077,0.10735,0.080281,0.019933,0.077463,0.08587,0.21009,0.1323,0.10063,0.029548,0.012869,0.014485,0.28246,0.0754,0.052486,0.015393,0.026665,0.031673,0.27075,0.095864,0.070763,0.030725,0.045825,0.056409,0.27042,0.11977,0.092385,0.047952,0.0078136,0.0082531,0.146,0.037371,0.0305,0.0054084,0.015962,0.015904,0.14904,0.049278,0.037528,-0.00044421,0.025496,0.024802,0.14761,0.05922,0.043622,-0.0040412,0.001564,0.0013108,0.25579,0.031895,0.02555,-0.0098168,0.0045282,0.0038174,0.2389,0.040249,0.032271,-0.011102,0.0080164,0.0067003,0.20604,0.044367,0.037474,-0.013665,0.61123,74,74,40,1054,3,3,3,0.645
30,-0.0045357,0.088773,0.086435,-0.95576,0.075375,-1.2977,0.35771,0.3758,2.6047,0.07108,3.3472,0.00017557,0.95777,3.2192,0.088347,4.0127,0.0038289,0.95578,0.52554,0.34603,0.30399,0.26965,0.16645,0.21639,0.26955,0.088211,0.024168,0.020926,0.2143,0.39391,0.24616,0.047834,1.6484,46.095,49.312,9.7335,107.48,0.24242,0.11049,0.24242,0.48347,0.59748,0.26373,0.37528,0.070141,29,231.41,5813,1.1583e+06,5.0326,26.552,1.5695e+05,14958,2619,0.90234,0.91635,0.4219,0.34978,0.20602,0.86604,75419,36788,0.0024063,0.00055952,0,0.071877,0,0.064502,0.0040713,0.0052428,0.0051514,0.012391,0.10802,0.51972,0.019267,0.2403,0.34612,0.22504,0.27918,0.40565,0.18222,0.30413,0.37889,0.16041,57.68,6.076,27411,1.2397e+05,1.2357e+05,0.068596,0.060867,0.045884,0.28963,0.33769,0.10083,0.5163,0.59334,0.12671,0.68666,0.75306,0.1345,0.80522,0.85231,0.13451,0.0016003,0.00094639,0.021056,-0.004204,0.0058059,-0.0431,0.0046475,0.0028861,0.029237,-0.0015205,0.011744,-0.059763,0.0099538,0.0064036,0.037364,0.0030365,0.018844,-0.077082,0.00036534,0.00022984,0.011099,-0.0052799,0.0012272,-0.024811,0.0015125,0.0010048,0.021256,-0.0036697,0.0049961,-0.03567,0.0040909,0.0028109,0.033413,0.00044171,0.011046,-0.046703,0.00017026,9.6478e-05,0.0044032,-0.0072718,0.0010558,-0.017091,0.00072929,0.00042887,0.0094246,-0.0076754,0.0031014,-0.030333,0.0020824,0.0012395,0.016687,-0.0063736,0.0052565,-0.044695,0.0010647,0.00062007,0.24102,0.024453,0.022959,-0.03401,0.0027292,0.0016393,0.19929,0.026622,0.028591,-0.045143,0.0049658,0.0030471,0.17665,0.02993,0.034245,-0.055845,0.37363,74,74,40,1054,3,3,3,0.645
30,-0.10551,0.90025,0.88238,-0.34174,0.57944,-0.54198,0.58594,-0.27069,1.9614,-0.14561,3.3039,0.0019407,3.6877,3.2126,1.3151,4.0394,0.0038544,0.34176,5.4107,4.0314,3.2388,2.3419,0.047752,0.044995,0.053939,0.043233,0.037574,0.064012,0.70849,0.0094662,0.44277,3.0093,4.8216,5.5897,0.64474,0.022162,14.54,0.7426,0.39313,0.7426,0.47993,0.76641,0.21433,1.8311,1.675,59,121.41,3948,3.6255e+05,5.4986,32.599,1.066e+05,67959,8370,0.90965,0.92305,0.20567,0.15533,0.12098,0.49687,32891,20025,0.002151,0.0008321,0,0.092106,0,0.057615,0.052374,0.14856,0.064955,0.19673,0.17386,3.6014,3.4544,0.24049,0.28098,0.19013,0.28001,0.2524,0.10666,0.30048,0.23333,0.092961,13.747,5.1336,11729,45336,44796,0.2447,0.22904,0.18325,0.62847,0.66773,0.24494,0.78732,0.81028,0.21632,0.86031,0.87366,0.18866,0.9115,0.92082,0.17046,0.0091943,0.0088626,0.13544,0.034992,0.037046,-0.0098434,0.018097,0.017707,0.12746,0.042268,0.048975,-0.0076303,0.029862,0.02936,0.1255,0.051157,0.062328,-0.0074735,0.0021236,0.0019972,0.072229,0.0084761,0.01249,-0.0081435,0.0047356,0.00436,0.074508,0.012001,0.018169,-0.015013,0.0090133,0.0080818,0.082418,0.018114,0.026707,-0.026432,0.0063993,0.0062883,0.18528,0.036737,0.034097,-0.0040228,0.012848,0.013032,0.18588,0.047462,0.046407,0.0042486,0.020449,0.021157,0.18345,0.056753,0.057018,0.01242,0.00067142,0.00057708,0.17015,0.014864,0.022287,-0.012112,0.0017591,0.0015598,0.14381,0.016248,0.028925,-0.013251,0.0033551,0.0030295,0.13362,0.019132,0.036723,-0.014796,0.61416,74,74,40,1054,3,3,3,0.645
30,-0.10153,0.99726,0.92282,-0.27622,0.73208,-0.40181,0.45464,-0.33455,2.2154,-0.23017,3.3027,0.0010309,3.8989,3.2392,1.4461,4.1217,0.003933,0.27624,5.2951,4.0646,3.3343,2.5454,0.036685,0.038543,0.064624,0.039467,0.034021,0.052501,0.73416,0.012215,0.62793,1.3281,5.2856,6.2889,1.1443,0.051665,14.739,0.56825,0.82349,0.82349,0.39343,0.60779,0.1742,1.9939,1.9851,79,43.101,1656,40641,6.7972,52.62,44712,15336,10476,0.91638,0.93417,0.094585,0.072646,0.004637,0.35212,29565,14071,0.0014214,0.0004521,1,0.17082,0,0.085063,0.046481,0.011625,0.077506,0.021883,1.0405,2.9136,1.8306,0.2244,0.28225,0.20098,0.26978,0.24971,0.076625,0.28181,0.22389,0.05833,14.981,5.4265,18832,50062,49343,0.2618,0.24368,0.10838,0.64652,0.69232,0.1393,0.84675,0.88144,0.12862,0.90946,0.93666,0.11025,0.94367,0.9617,0.097562,0.0061719,0.0044735,0.05026,0.014225,0.026978,-0.051574,0.012815,0.0096016,0.049894,0.018458,0.036271,-0.062545,0.022257,0.017275,0.051709,0.024218,0.046892,-0.071532,0.0025788,0.0020006,0.048488,0.008936,0.013535,-0.029303,0.0062888,0.005132,0.0547,0.014496,0.020752,-0.034084,0.012418,0.010507,0.062771,0.022355,0.030791,-0.038219,0.002702,0.0018815,0.043248,0.0076354,0.018203,-0.035967,0.005258,0.0036995,0.042054,0.00932,0.023197,-0.045656,0.0082378,0.0058307,0.040855,0.010712,0.026858,-0.054597,0.00089116,0.0005914,0.12485,0.015517,0.026753,-0.029284,0.0024035,0.0016206,0.10862,0.017846,0.033848,-0.036346,0.0042721,0.0029221,0.094058,0.019396,0.041609,-0.043629,0.55293,74,74,40,1054,3,3,3,0.645
30,-0.13572,0.93242,0.83156,0.40945,0.81251,0.47143,0.15137,-0.20282,1.937,-0.15591,3.3386,0.0017794,3.2096,1.9108,2.8161,2.1279,0.0020304,-0.40947,4.443,3.3401,2.9064,2.5509,0.041072,0.046499,0.091195,0.046971,0.025732,0.025784,0.72275,0.016872,0.60175,0.60769,4.8651,19.79,14.881,0.0074826,40.769,0.11733,0.17636,0.17636,0.21482,0.2393,0.12066,3.1856,5.0642,67,68.851,2375,98866,6.3002,44.587,64125,25785,14850,0.91315,0.93022,0.11088,0.085651,0.051694,0.357,25120,14103,0.001173,0.00048759,0,0.086299,0,0.039667,0.03346,0.039421,0.040463,0.059588,0.077709,0.1505,0.0082159,0.23416,0.30203,0.19907,0.28546,0.28918,0.098636,0.28163,0.2829,0.091395,16.639,5.3748,42016,1.3525e+05,1.3484e+05,0.21215,0.22558,0.1131,0.48929,0.5173,0.13576,0.66177,0.69727,0.12945,0.76253,0.78943,0.11905,0.82291,0.84306,0.10956,0.017447,0.022,0.18297,0.065344,0.07613,0.081947,0.037404,0.046889,0.18755,0.088335,0.10176,0.10525,0.063474,0.080127,0.18991,0.11086,0.12852,0.13624,0.011675,0.016266,0.28269,0.071271,0.077602,0.097302,0.023335,0.032348,0.26138,0.087033,0.095523,0.12279,0.03813,0.053308,0.24822,0.1028,0.11664,0.15613,0.0042033,0.004059,0.086639,0.01768,0.023901,-0.0054104,0.0098298,0.010241,0.10125,0.028211,0.036041,0.0089899,0.01777,0.019923,0.11349,0.039854,0.049608,0.033138,0.0015689,0.0016745,0.28306,0.033658,0.045289,0.0084091,0.004896,0.0052326,0.28495,0.046136,0.059356,0.011034,0.0094991,0.010017,0.26933,0.056391,0.070826,0.010829,0.58326,74,74,40,1054,3,3,3,0.645
30,-0.098482,0.77666,0.7324,0.51663,0.6191,0.71983,0.39332,-0.21954,1.853,-0.010745,3.2803,0.002129,3.1393,1.8017,3.0302,2.0196,0.0019271,-0.51668,8.4352,5.9982,4.3486,3.1825,0.030932,0.021905,0.037698,0.037546,0.04483,0.053029,0.77406,0.26007,7.3445,10.609,8.8456,4.25,1.729,0.024936,33.063,0.17547,0.28723,0.28723,0.38636,0.54555,0.20109,3.154,4.9768,82,28.915,524,7191.6,3.8461,18.881,14148,10530,9909,0.91811,0.93852,0.16954,0.12859,0.045007,0.63371,22370,14463,0.00097146,0.00035948,0,0.10165,0,0.071079,0.01955,0.083609,0.023099,0.16308,1.1744,1.5593,0.2689,0.2151,0.30778,0.22517,0.27247,0.30492,0.12954,0.25055,0.29678,0.11178,20.28,6.0797,27449,64346,64040,0.1813,0.23323,0.066465,0.43909,0.50134,0.083776,0.61576,0.66048,0.082822,0.76204,0.78885,0.081806,0.84394,0.86906,0.077262,0.01613,0.019484,0.11632,0.049223,0.055602,0.060975,0.03443,0.042513,0.11871,0.066224,0.077263,0.088841,0.055625,0.068938,0.11444,0.078449,0.095685,0.10861,0.010565,0.013256,0.1759,0.0527,0.054733,0.057917,0.02128,0.027877,0.16391,0.064852,0.071217,0.089649,0.033346,0.044322,0.14927,0.073005,0.085059,0.11294,0.0036041,0.0044996,0.051082,0.011638,0.01868,0.03389,0.0074824,0.0093317,0.052995,0.015833,0.026138,0.042561,0.0119,0.014573,0.052259,0.018844,0.031399,0.045958,0.0019616,0.0017284,0.24336,0.035449,0.035083,-0.016157,0.0058669,0.005459,0.23479,0.046408,0.048944,-0.011648,0.010932,0.010484,0.21314,0.054337,0.062406,-0.0082689,0.48483,74,74,40,1054,3,3,3,0.645
30,-0.11109,0.74121,0.71033,0.53758,0.6074,0.74222,0.38066,0.086656,1.8793,0.064526,3.3267,0.00196,3.1193,1.778,3.0721,1.9845,0.0018936,-0.53762,6.3785,4.635,3.6741,3.0779,0.035695,0.028923,0.049583,0.042968,0.037386,0.032046,0.7734,0.19264,4.4759,6.486,7.8486,9.2203,10.679,0.0039288,38.907,0.13053,0.15245,0.15245,0.47355,0.59104,0.18992,3.1514,4.9634,59,78.678,1754,1.0042e+05,4.358,20.829,47358,39528,27405,0.91479,0.93054,0.16642,0.12535,0.080764,0.5221,24173,15248,0.0010566,0.0004588,0,0.047602,0,0.055626,0.01397,0.020501,0.016954,0.021312,1.3364,1.5373,0.034793,0.22942,0.3012,0.20079,0.2898,0.2898,0.097939,0.28259,0.26918,0.083051,15.312,5.4213,14340,40430,39614,0.21065,0.23546,0.10904,0.46507,0.50664,0.12529,0.63524,0.67766,0.12065,0.73992,0.76886,0.11216,0.80321,0.82482,0.10383,0.015898,0.021551,0.16188,0.057714,0.075684,0.13076,0.035171,0.049707,0.17123,0.080986,0.10909,0.20478,0.061232,0.087227,0.17788,0.10473,0.1411,0.2642,0.010342,0.015993,0.24315,0.061384,0.07915,0.15951,0.022793,0.036609,0.2479,0.083518,0.11217,0.23959,0.040427,0.064928,0.25553,0.10806,0.14585,0.30521,0.0038275,0.003199,0.076603,0.015199,0.020985,-0.028598,0.0080067,0.0072458,0.080074,0.020873,0.028901,-0.0218,0.013545,0.013152,0.083999,0.027181,0.036638,-0.0082073,0.0017288,0.0023595,0.30285,0.036869,0.048931,0.059494,0.0051703,0.0068573,0.29217,0.048243,0.064027,0.06395,0.0092646,0.011909,0.25506,0.054028,0.074554,0.065699,0.56136,74,74,40,1054,3,3,3,0.645
30,-0.010557,0.23642,0.21797,-0.88421,0.21445,-0.99661,0.12712,-0.38389,2.6408,-0.11036,3.3354,0.00013301,1.6489,3.425,0.23134,4.3739,0.0041736,0.88422,0.95802,0.60761,0.51432,0.45494,0.10522,0.1409,0.26102,0.11214,0.038599,0.027151,0.31498,0.25771,0.1497,0.11239,0.21147,8.4759,16.09,1.6163,26.913,0.31556,0.23075,0.31556,0.53602,0.68384,0.2425,0.61857,0.19017,34,109.62,3062,2.7232e+05,5.5011,31.516,82674,6372,3942,0.91352,0.93447,0.24952,0.19925,0.044816,0.75817,61255,21429,0.00073284,0.00037913,0,0.12356,0,0.063158,0.0062347,0.016753,0.006868,0.0246,0.11202,0.16154,0.88027,0.20793,0.37122,0.27084,0.22703,0.45263,0.27057,0.223,0.4617,0.28,59.628,7.3127,41084,1.1515e+05,1.145e+05,0.014115,0.0096536,0.0055702,0.16053,0.12306,0.03297,0.37488,0.306,0.05428,0.51675,0.43964,0.059716,0.61938,0.5596,0.061041,0.0046821,0.0036696,0.036345,0.0083123,0.017331,-0.033553,0.011374,0.0095184,0.042215,0.014631,0.027595,-0.034537,0.021605,0.019507,0.047848,0.022504,0.040749,-0.027162,0.00085328,0.0010673,0.015294,-0.0012177,0.0069879,0.018672,0.002575,0.0034482,0.02135,0.00097013,0.01254,0.037009,0.0062956,0.0086384,0.030337,0.0060238,0.02186,0.061406,0.0015042,0.0010393,0.02295,0.0013011,0.0068954,-0.023892,0.0028565,0.0019336,0.021779,0.0011673,0.0092133,-0.031281,0.0042905,0.0028623,0.020284,0.00063191,0.011562,-0.037902,0.0023246,0.001563,0.31045,0.044152,0.042095,-0.040366,0.0067346,0.0046725,0.29013,0.05589,0.055473,-0.051963,0.013255,0.0095035,0.27819,0.069491,0.070644,-0.061865,0.36663,74,74,40,1054,3,3,3,0.645
30,-0.12734,1.016,0.89297,-0.32586,0.8072,-0.22487,-0.30991,0.1169,2.6069,0.032514,3.3596,0.00015976,2.8198,2.4275,1.3468,2.7321,0.0026069,0.32589,1.976,1.3276,1.1467,1.0372,0.053053,0.092792,0.1821,0.094742,0.036638,0.025343,0.51533,0.04869,0.038456,0.03659,0.17473,5.5702,11.996,0.023609,17.888,0.055196,0.12136,0.12136,0.24806,0.26991,0.1341,1.8569,1.7081,79,48.696,2710,92439,8.5542,75.087,73170,4563,4293,0.91457,0.9331,0.13704,0.10721,0.027796,0.46908,28426,16570,0.0012967,0.00047854,0,0.055855,0,0.041649,0.002353,0.041749,0.0014747,0.055141,0.44686,0.83632,1.5902,0.24199,0.29943,0.19882,0.3175,0.28715,0.090414,0.31766,0.26681,0.070167,21.735,5.3682,29939,89975,89480,0.18606,0.19769,0.083931,0.49205,0.54595,0.11552,0.6982,0.74929,0.11556,0.81017,0.84167,0.10702,0.8627,0.88412,0.097185,0.021796,0.030744,0.1934,0.077389,0.09476,0.14001,0.047767,0.069142,0.20265,0.10714,0.1333,0.20626,0.082474,0.12002,0.20878,0.13701,0.17073,0.26488,0.013947,0.022904,0.28574,0.079436,0.10095,0.16684,0.028224,0.048297,0.26749,0.098463,0.13245,0.24346,0.047423,0.081377,0.26121,0.12003,0.16398,0.30654,0.0052171,0.0041539,0.090989,0.021803,0.022873,-0.033892,0.01194,0.010217,0.10406,0.033356,0.033029,-0.032817,0.021366,0.019805,0.11546,0.046166,0.044712,-0.021049,0.002632,0.0036869,0.40178,0.05393,0.068156,0.061876,0.0079071,0.01086,0.38938,0.07099,0.088711,0.072458,0.014682,0.019646,0.35223,0.083001,0.10434,0.079672,0.49563,74,74,40,1054,3,3,3,0.645
30,-0.11008,1.1381,0.99279,0.079189,0.92264,0.10024,0.2658,0.65122,2.7837,0.20267,3.2633,2.5715e-05,2.932,1.9948,2.1563,2.4489,0.0023368,-0.079192,4.9515,3.6243,2.7502,2.2439,0.032386,0.042965,0.09044,0.048351,0.050538,0.041735,0.69358,0.03681,0.29412,0.1739,2.2529,1.5425,2.2068,0.05107,6.5581,0.11789,0.17558,0.17558,0.25437,0.3589,0.11866,3.5375,6.2614,68,80.324,2490,1.3277e+05,5.5576,33.942,67230,45630,14337,0.90978,0.92009,0.015295,0.012677,0.036118,0.052155,28590,15724,0.0013227,0.00048852,0,0.092804,0,0.05159,0.00071823,0.022933,0.0017975,0.028297,0.85639,0.98012,0.10745,0.23125,0.29081,0.18683,0.27789,0.27743,0.10227,0.26489,0.26614,0.088573,15.059,5.0443,51371,2.5661e+05,2.5629e+05,0.22751,0.25059,0.14114,0.49368,0.53753,0.15939,0.67083,0.72055,0.15269,0.76898,0.80928,0.1397,0.83671,0.86819,0.12963,0.017827,0.02376,0.21754,0.072432,0.081789,0.079278,0.037176,0.050867,0.21691,0.094821,0.11069,0.11693,0.062194,0.087066,0.21652,0.11704,0.14093,0.1581,0.010773,0.015784,0.30354,0.070499,0.079184,0.085408,0.022246,0.032554,0.28996,0.089216,0.1011,0.11257,0.037504,0.055022,0.2841,0.10909,0.12559,0.14159,0.005167,0.0061541,0.12393,0.025352,0.031472,0.023624,0.010434,0.01414,0.12506,0.033014,0.045745,0.057776,0.017259,0.025279,0.12827,0.041484,0.060626,0.094434,0.0018871,0.0018224,0.39618,0.044505,0.040522,-0.0036937,0.0055904,0.0053567,0.3786,0.057654,0.053355,-0.0054037,0.0099234,0.0093973,0.3274,0.063972,0.062223,-0.0080412,0.66744,74,74,40,1054,3,3,3,0.645
30,-0.042659,0.80613,0.72307,-0.52558,0.72125,-0.49922,-0.050169,0.54842,8.1296,0.076596,3.2863,0.00068679,8.3999,8.6197,0.94785,12.01,0.01146,0.52561,2.4487,1.7856,1.4507,1.1681,0.072743,0.07189,0.12446,0.071046,0.050502,0.054756,0.55461,0.23231,0.0059027,0.00026643,0.4502,1.4307,0.70605,0.0027458,2.8282,0.21788,0.45362,0.45362,0.23555,0.42341,0.15733,1.4291,1.0061,35,141.89,3850,4.1694e+05,5.5106,31.913,1.0395e+05,8586,7830,0.90746,0.92409,0.33676,0.27482,0.14625,0.76831,1.4661e+05,41353,0.00086655,0.00042723,0,0.087695,0,0.065731,0.0067676,0.049723,0.0037557,0.056928,1.2296,1.357,0.15821,0.24007,0.37362,0.24705,0.28505,0.44476,0.21751,0.30444,0.4569,0.1964,83.167,6.6704,31719,1.2177e+05,1.2116e+05,0.014699,0.0090605,0.0084026,0.16796,0.13533,0.049971,0.44641,0.42279,0.09363,0.65797,0.66274,0.11014,0.79604,0.81575,0.11364,0.0014605,0.00089911,0.016423,-0.0045091,0.0094724,-0.030084,0.0025696,0.0015891,0.013815,-0.0072993,0.011918,-0.038137,0.0045629,0.0028622,0.014638,-0.0084911,0.014733,-0.052073,6.2553e-06,3.4987e-06,0.00016241,-0.0073694,-0.00015088,-0.013032,8.1811e-05,4.8763e-05,0.00098259,-0.0095202,-0.00019973,-0.017958,0.00050006,0.0003477,0.0034905,-0.010789,0.00069416,-0.02236,0.0013905,0.00085848,0.030731,0.00086717,0.009212,-0.028644,0.0021444,0.0013356,0.023684,-0.0014307,0.010634,-0.032724,0.0031677,0.0019701,0.021693,-0.0026136,0.011335,-0.04121,6.3751e-05,3.7135e-05,0.012333,-0.0019361,0.015504,-0.014698,0.00035528,0.00021154,0.022171,-0.00094167,0.021513,-0.020926,0.0010491,0.00063606,0.031896,0.00095174,0.028019,-0.03055,0.35593,74,74,40,1054,3,3,3,0.645
30,-0.017059,0.21512,0.20141,-0.89353,0.18261,-1.1665,0.30551,-0.36454,2.8673,-0.023701,3.3379,5.8403e-05,1.4264,3.0901,0.21268,3.7963,0.0036224,0.89355,1.08,0.52024,0.44004,0.36846,0.11805,0.13122,0.22174,0.18035,0.037324,0.037008,0.27431,0.24461,0.05862,0.0097687,0.002958,13.704,10.729,4.0255,28.775,0.24218,0.13236,0.24218,0.42965,0.47975,0.18815,0.59115,0.17324,37,127.11,3166,2.7936e+05,5.328,30.772,85482,20979,7560,0.90939,0.92477,0.19109,0.16264,0.013517,0.47379,95417,27923,0.0010434,0.00050955,0,0.087071,0,0.055833,0.0034596,0.011262,0.0038725,0.016927,1.5226,1.5385,0.37624,0.21322,0.35533,0.27769,0.25844,0.43381,0.2287,0.23248,0.39853,0.31646,51.103,7.4976,49687,2.2864e+05,2.2824e+05,0.036262,0.022325,0.017844,0.26746,0.24362,0.068494,0.53396,0.5284,0.096401,0.72583,0.73626,0.10459,0.86147,0.8781,0.10586,0.0018782,0.0022611,0.018179,-0.0024274,0.0080524,0.018268,0.0057715,0.0071731,0.026709,0.001655,0.016727,0.032213,0.013406,0.017118,0.03702,0.0092886,0.029434,0.052399,0.0010745,0.0017501,0.024015,6.346e-05,0.0067879,0.039095,0.0028654,0.0051686,0.029624,0.0022391,0.014315,0.073492,0.0063929,0.011749,0.038411,0.0070238,0.025639,0.10921,0.00019644,0.00011531,0.0037373,-0.0060591,0.00057449,-0.01755,0.00090047,0.00053577,0.0085604,-0.0059216,0.0022351,-0.022835,0.0023336,0.001435,0.013756,-0.0047431,0.0041635,-0.030865,0.00060718,0.0003957,0.10111,0.010517,0.01748,-0.019749,0.0021038,0.0015224,0.11301,0.016515,0.024025,-0.022369,0.0049762,0.0040984,0.13023,0.025624,0.034214,-0.019973,0.39035,74,74,40,1054,3,3,3,0.645
30,-0.017565,0.24668,0.21611,-0.88526,0.21253,-0.77144,-0.12858,0.14487,2.7123,0.045233,3.3476,8.2606e-05,1.4747,3.0783,0.22906,3.8593,0.0036826,0.88535,0.81573,0.60015,0.51182,0.44524,0.12261,0.17066,0.24596,0.0761,0.037453,0.031253,0.31597,0.32133,0.21567,0.074836,1.5646,10.031,12.4,1.8296,26.437,0.27134,0.21278,0.27134,0.33958,0.37511,0.18223,0.61417,0.18808,58,53.034,1860,62244,6.6603,47.836,50220,13500,4563,0.91763,0.94072,0.24279,0.1703,0.16513,0.75592,37704,21404,0.00078491,0.00037257,0,0.058401,0,0.067652,0.0032023,0.0051405,0.00089827,0.01913,0.26142,1.5549,1.5833,0.21596,0.34002,0.25903,0.2676,0.41092,0.21974,0.27409,0.41357,0.22625,37.98,6.9938,15911,30352,28970,0.060887,0.04986,0.022942,0.26009,0.24622,0.051002,0.47883,0.47906,0.066196,0.6447,0.65555,0.071134,0.76998,0.78582,0.072452,0.0031335,0.0025143,0.023225,0.0024652,0.020485,-0.048969,0.0075804,0.0061246,0.026862,0.0055918,0.029463,-0.062943,0.013637,0.011184,0.028835,0.0084952,0.039207,-0.073101,0.0023587,0.0019239,0.040365,0.0072792,0.01549,-0.037098,0.0053122,0.0043756,0.042054,0.010432,0.020936,-0.047019,0.0091551,0.0076238,0.042121,0.013088,0.027837,-0.054947,0.00059619,0.0004568,0.0086851,-0.0032824,0.0085323,-0.031882,0.0016233,0.0012641,0.011817,-0.0028364,0.011957,-0.034801,0.0031067,0.0025202,0.014023,-0.0022599,0.014904,-0.036676,0.00017867,0.00013358,0.022783,0.00070724,0.022844,-0.022858,0.00064484,0.00048494,0.026524,0.0017515,0.029754,-0.027214,0.0013791,0.0010433,0.027635,0.002583,0.037336,-0.03304,0.4006,74,74,40,1054,3,3,3,0.645
30,-0.038861,0.86473,0.80561,-0.44003,0.78353,-0.3672,-0.16553,0.054396,2.7905,0.0063351,3.3519,4.866e-05,3.3857,3.1979,1.1187,4.0423,0.0038571,0.44007,2.7128,1.998,1.6881,1.434,0.074435,0.086762,0.097734,0.06513,0.039,0.039394,0.59754,0.2734,0.075702,0.069874,0.65783,3.1006,2.2159,0.01929,6.4126,0.39507,0.56866,0.56866,0.50541,0.5975,0.21025,1.5845,1.2328,34,196.29,6334,1.1733e+06,5.5659,31.997,1.7102e+05,3618,1782,0.90444,0.91857,0.4335,0.34981,0.22902,0.87555,87206,38756,0.0010655,0.00046661,0,0.077067,0,0.050049,0.0030524,0.0081701,0.0010208,0.015139,0.45148,1.8019,1.7926,0.20907,0.35843,0.29561,0.22839,0.40575,0.31806,0.21942,0.41787,0.33042,61.632,7.9815,24117,91888,91270,0.017764,0.011231,0.011896,0.17341,0.16083,0.060436,0.40011,0.42095,0.098306,0.62216,0.66265,0.122,0.78951,0.82634,0.13203,0.0011028,0.0006918,0.014527,-0.0066456,0.0072638,-0.039756,0.0035213,0.0023088,0.022177,-0.0049891,0.01342,-0.058152,0.0083068,0.0058,0.031217,-0.00070439,0.021497,-0.072468,0.00031975,0.0002008,0.009725,-0.0056274,-0.00059367,-0.023094,0.0010395,0.00068777,0.014625,-0.005873,0.0013604,-0.031422,0.0026815,0.0019973,0.021926,-0.0043261,0.0056701,-0.036314,0.00049611,0.00031348,0.012845,-0.0050817,0.0055641,-0.022608,0.0012699,0.00084697,0.016429,-0.0053392,0.0078494,-0.031712,0.0026014,0.0017898,0.020869,-0.0046835,0.010013,-0.040352,0.00028695,0.00017752,0.065029,0.0038237,0.01948,-0.028201,0.0012445,0.00079304,0.09098,0.0093393,0.028855,-0.039157,0.0031957,0.0021206,0.11381,0.01688,0.039613,-0.050498,0.43092,74,74,40,1054,3,3,3,0.645
30,-0.024262,0.4762,0.44593,-0.74408,0.42091,-0.56784,-0.23686,-0.036887,2.8301,0.00056205,3.3471,2.2492e-05,2.0836,2.9111,0.51133,3.6548,0.0034874,0.74409,1.5434,0.99731,0.85413,0.74224,0.089465,0.11658,0.18322,0.10819,0.038913,0.03486,0.42877,0.25503,0.10918,0.033418,0.09497,5.7061,5.8521,0.20503,12.256,0.27863,0.24215,0.27863,0.37099,0.44935,0.20445,0.95783,0.45612,43,130.21,4634,4.9533e+05,6.2499,40.373,1.2512e+05,9801,4374,0.90736,0.92313,0.40851,0.32798,0.21192,0.88001,79882,37292,0.0013368,0.00050195,0,0.082209,0,0.066126,0.0033316,0.018976,0.0037619,0.021729,0.34731,0.70969,0.93273,0.24969,0.36449,0.22506,0.30409,0.43348,0.17946,0.32358,0.44042,0.16556,50.782,6.0765,17811,61886,60684,0.034017,0.023758,0.020204,0.28008,0.2807,0.086576,0.56509,0.58756,0.12314,0.76522,0.78802,0.13309,0.89143,0.90737,0.13222,0.00060909,0.0003777,0.0071161,-0.0085221,0.0047636,-0.038231,0.0024169,0.0015653,0.013501,-0.0078863,0.00826,-0.052727,0.0058979,0.0039723,0.019658,-0.005808,0.01324,-0.064992,6.7447e-05,3.8437e-05,0.0018194,-0.0070813,-0.0025512,-0.015477,0.00029821,0.00017003,0.0037213,-0.0087628,-0.0009915,-0.023567,0.00075533,0.00043679,0.0054779,-0.010192,0.0022001,-0.030192,0.00034427,0.00020736,0.0079054,-0.005738,0.0042235,-0.031047,0.0012443,0.0007814,0.014278,-0.0051228,0.0057814,-0.039138,0.0030119,0.0019725,0.02143,-0.0031432,0.0071748,-0.048838,0.00019738,0.00013189,0.039672,0.0013594,0.018107,-0.019209,0.001005,0.00069631,0.065161,0.0061553,0.023709,-0.031894,0.0026374,0.0018848,0.083309,0.011993,0.03083,-0.039929,0.40741,74,74,40,1054,3,3,3,0.645
30,-0.094759,1.0972,0.97288,0.16184,0.92012,0.19953,0.23289,0.021715,2.6145,0.035438,3.3574,7.4325e-05,2.9514,1.9353,2.3213,2.1927,0.0020923,-0.16185,5.3501,3.7168,2.8956,2.3934,0.023289,0.035151,0.08289,0.055576,0.045547,0.038718,0.71883,0.39481,0.79431,0.31368,1.4435,2.1796,2.6668,0.064651,7.8574,0.14411,0.1408,0.14411,0.33009,0.53451,0.18057,3.356,5.6331,68,82.735,4738,3.2869e+05,7.9862,65.177,1.2793e+05,8316,5427,0.90971,0.91936,0.082538,0.066795,0.0078271,0.22311,26061,14747,0.001304,0.00046671,0,0.051298,0,0.044052,0.010674,0.037113,0.016246,0.049655,0.88902,0.48118,0.66269,0.22935,0.27896,0.18451,0.2721,0.25697,0.093947,0.2663,0.23704,0.08323,12.095,4.9819,23711,1.075e+05,1.0693e+05,0.24708,0.25238,0.15568,0.51139,0.53749,0.1677,0.66617,0.69424,0.15401,0.75936,0.77758,0.14011,0.83338,0.8469,0.13114,0.015514,0.020958,0.19229,0.062029,0.076236,0.092187,0.032957,0.045155,0.1953,0.082995,0.10372,0.13029,0.056564,0.078432,0.20001,0.10559,0.13353,0.17179,0.011338,0.016988,0.32447,0.075205,0.089665,0.10937,0.02306,0.034957,0.30528,0.093604,0.11416,0.1492,0.038971,0.059248,0.29983,0.11478,0.14186,0.18942,0.0030679,0.0025416,0.074738,0.011858,0.016357,-0.020087,0.006859,0.0064115,0.083497,0.018278,0.025291,-0.010409,0.012111,0.012636,0.091422,0.025537,0.035264,0.0087295,0.0011084,0.001428,0.23635,0.024835,0.033211,0.028138,0.0034786,0.0043182,0.23927,0.034274,0.045234,0.029471,0.0067152,0.0081138,0.22503,0.041536,0.056108,0.031273,0.70745,74,74,40,1054,3,3,3,0.645
30,-0.01181,0.26665,0.2439,-0.86941,0.23836,-1.0004,0.15062,-0.16943,3.2997,-0.056702,3.3103,4.9232e-05,1.5032,2.9403,0.26086,3.6475,0.0034805,0.86944,1.0757,0.73914,0.61597,0.50978,0.10688,0.17858,0.19213,0.093989,0.044179,0.043875,0.34037,0.28631,0.2668,0.014521,0.46736,5.4138,4.0509,1.1221,11.622,0.24872,0.2641,0.2641,0.30241,0.31699,0.14442,0.65797,0.20129,48,83.896,3158,2.0584e+05,6.6126,45.148,85266,6696,3240,0.91389,0.93316,0.22312,0.17683,0.085433,0.65344,64217,24689,0.0010641,0.00047935,0,0.10313,0,0.066211,7.8513e-05,0.010529,0.001771,0.0071671,0.28262,0.010228,0.094065,0.21545,0.34205,0.25369,0.26249,0.39235,0.22277,0.24279,0.3935,0.27182,42.872,6.8497,26205,79419,78547,0.059376,0.040805,0.026246,0.35113,0.33054,0.080778,0.64097,0.66372,0.10395,0.82678,0.8609,0.10702,0.92546,0.94747,0.10216,0.0011373,0.00073686,0.0098889,-0.0052322,0.01055,-0.031338,0.0038712,0.002622,0.016094,-0.0031602,0.017692,-0.048614,0.010313,0.0071495,0.025582,0.0031139,0.027512,-0.071263,0.00061176,0.00041838,0.012282,-0.0027642,0.0074179,-0.023287,0.0022403,0.001589,0.020806,-0.00023034,0.011591,-0.033831,0.0056834,0.0041253,0.030676,0.0047098,0.017812,-0.045984,0.00041024,0.00024022,0.007011,-0.0045726,0.0046021,-0.018133,0.00085766,0.00051102,0.0073244,-0.0057553,0.0070151,-0.024065,0.0019317,0.0012058,0.010229,-0.0055494,0.0095965,-0.036104,0.00011532,7.825e-05,0.01725,-0.00059125,0.012915,-0.014329,0.00077325,0.00052193,0.037313,0.0031088,0.021545,-0.027208,0.0027228,0.0018336,0.064008,0.010816,0.032995,-0.042379,0.41164,74,74,40,1054,3,3,3,0.645
30,-0.0069685,0.33199,0.31637,-0.82664,0.31572,-0.86405,0.045258,-0.39489,3.4375,-0.10001,3.3086,9.6646e-05,4.458,7.5683,0.34631,10.512,0.010031,0.82667,1.2643,0.88859,0.72764,0.59833,0.093342,0.11866,0.22247,0.08898,0.049962,0.047432,0.37915,0.26761,0.12934,0.11312,0.36661,2.5847,2.3255,0.40267,6.1895,0.35167,0.23568,0.35167,0.41702,0.48438,0.21898,0.76541,0.26182,44,132.18,4071,3.7791e+05,6.1236,39.546,1.0992e+05,15984,8397,0.90998,0.92572,0.34433,0.26713,0.20063,0.7769,83857,33617,0.0011405,0.00048137,0,0.061882,0,0.060545,0.0050256,0.011791,0.0074775,0.010273,0.1829,0.15725,0.65075,0.22883,0.36173,0.23182,0.27746,0.42752,0.18749,0.2766,0.44404,0.17884,46.925,6.2591,19800,64252,63175,0.05161,0.03786,0.031628,0.3243,0.31974,0.10343,0.5976,0.62126,0.13437,0.76999,0.79509,0.13818,0.87059,0.88899,0.13323,0.0003048,0.00020788,0.0036741,-0.010086,0.0045413,-0.022659,0.0013717,0.00093876,0.0079059,-0.011089,0.008997,-0.039484,0.0039015,0.0026993,0.013418,-0.010236,0.014621,-0.055919,8.1029e-06,5.2673e-06,0.00022553,-0.0076246,-0.00083749,-0.01093,9.3862e-05,5.9948e-05,0.0012085,-0.0098135,-0.00017918,-0.01553,0.0003982,0.00025823,0.0029797,-0.011512,0.0014747,-0.022391,0.00024595,0.00016741,0.0058272,-0.0064637,0.0030471,-0.018981,0.00094767,0.00065085,0.01122,-0.006433,0.0050635,-0.030012,0.0024776,0.0017329,0.018189,-0.0048601,0.0073752,-0.041522,5.0747e-05,3.5203e-05,0.010524,-0.0023364,0.015519,-0.014736,0.00034,0.00023664,0.022746,-0.001146,0.022435,-0.024594,0.0011326,0.00079888,0.036912,0.001575,0.030904,-0.032671,0.42841,74,74,40,1054,3,3,3,0.645
30,-0.019549,0.45497,0.41294,-0.76594,0.41284,-0.75438,-0.015093,-0.088055,2.7704,-0.040269,3.3418,8.0379e-05,2.0163,2.9457,0.46765,3.7407,0.0035693,0.76595,1.5409,0.98217,0.87143,0.74809,0.089863,0.11944,0.17963,0.11178,0.030079,0.037989,0.43121,0.23937,0.11286,0.017329,0.10574,12.105,4.8328,0.23281,17.646,0.27092,0.29977,0.29977,0.45136,0.46677,0.19913,0.90888,0.40581,42,83.81,2377,1.3384e+05,5.9257,37.315,64179,8289,6777,0.91515,0.93507,0.12158,0.091105,0.052201,0.43299,38150,19397,0.0010556,0.00042909,0,0.080046,0,0.061706,0.013905,0.0056937,0.019461,0.0046741,0.27128,0.13688,0.070551,0.22086,0.35625,0.23645,0.2618,0.402,0.19533,0.25723,0.40871,0.20422,31.926,6.3842,22330,54225,53376,0.074183,0.066315,0.030872,0.35299,0.37295,0.076454,0.6554,0.69409,0.10007,0.83394,0.86642,0.10163,0.9172,0.93766,0.095322,0.0074949,0.0071688,0.061354,0.019344,0.027114,-0.010846,0.01843,0.018087,0.072134,0.032052,0.042054,-0.0065549,0.035163,0.03537,0.082121,0.047258,0.060108,0.0027114,0.0030362,0.0026431,0.057389,0.011667,0.014592,-0.01992,0.0071565,0.006518,0.062573,0.017697,0.021476,-0.019718,0.014135,0.013171,0.071828,0.026966,0.031705,-0.020074,0.0014139,0.0013211,0.022749,0.00086051,0.009926,-0.0085928,0.0048375,0.0048596,0.038894,0.0079185,0.018473,0.00089226,0.010723,0.011562,0.053462,0.017095,0.029248,0.020612,0.0030448,0.0032047,0.42881,0.060339,0.056399,0.0091879,0.0083079,0.0085517,0.37743,0.071785,0.070037,0.0068854,0.015031,0.015374,0.33268,0.081673,0.084019,0.006568,0.42615,74,74,40,1054,3,3,3,0.645
30,-0.083621,0.86552,0.8321,-0.40879,0.62609,-0.61219,0.49758,-0.12363,2.2666,-0.10453,3.3747,0.00061997,2.9406,2.7031,1.1812,3.3835,0.0032286,0.4088,3.9462,2.9136,2.3111,1.8288,0.053773,0.047194,0.091214,0.054014,0.047076,0.052132,0.6546,0.053744,0.25083,0.24812,1.8295,2.2894,1.1964,0.017854,5.8858,0.52853,0.78209,0.78209,0.25951,0.56572,0.17782,1.6672,1.3845,71,48.31,2235,71466,7.7522,63.358,60345,8775,7479,0.91733,0.94001,0.20454,0.14205,0.14946,0.61096,30198,15663,0.00092619,0.00050221,0,0.053439,0,0.044513,0.013366,0.032625,0.018518,0.029336,0.33584,2.6877,2.2008,0.22751,0.29853,0.20067,0.29022,0.27369,0.075143,0.29237,0.26387,0.070922,14.09,5.4182,8677,17584,16054,0.21904,0.20578,0.093844,0.60445,0.62634,0.13478,0.77942,0.80223,0.12252,0.87263,0.8896,0.10948,0.92706,0.93676,0.099189,0.0073343,0.0066227,0.06181,0.019007,0.037113,-0.03359,0.015029,0.013597,0.060556,0.024205,0.047455,-0.041913,0.024113,0.022065,0.057977,0.028,0.057927,-0.045289,0.0013839,0.0011568,0.026929,0.0019172,0.017816,-0.026405,0.0033892,0.0029423,0.030507,0.0040237,0.023096,-0.028839,0.0065939,0.00596,0.034495,0.0070842,0.031027,-0.028921,0.0043346,0.0040603,0.0718,0.016512,0.026048,-0.017025,0.0086896,0.0080276,0.071927,0.021299,0.0335,-0.025123,0.013261,0.012285,0.06806,0.023934,0.038696,-0.02842,0.0016158,0.0014056,0.23427,0.031083,0.035659,-0.026637,0.0044551,0.0038738,0.20837,0.037167,0.045597,-0.032727,0.0076573,0.0066445,0.17447,0.039609,0.054679,-0.039454,0.53355,74,74,40,1054,3,3,3,0.645
30,-0.024262,0.4251,0.38187,-0.78598,0.37739,-0.70076,-0.10842,-0.034576,2.7387,-0.049889,3.3552,3.3919e-05,3.2895,5.0258,0.4276,6.6285,0.006325,0.78599,1.3958,0.82635,0.67881,0.58555,0.060637,0.12208,0.22663,0.13195,0.048786,0.03552,0.3744,0.078813,0.15324,0.11521,0.0041104,2.9685,5.5037,0.43669,9.2603,0.27493,0.25543,0.27493,0.49022,0.51555,0.23947,0.86489,0.37359,38,232.47,3397,5.8867e+05,3.5946,14.592,91719,88425,33534,0.90218,0.9179,0.36786,0.28408,0.21182,0.72209,73268,41962,0.0011944,0.00050419,0,0.091306,0,0.075692,0.0034002,0.014186,0.0045717,0.017843,0.082574,0.64832,0.11475,0.2371,0.39267,0.23413,0.26694,0.46789,0.20684,0.28423,0.47796,0.19111,50.415,6.3216,11548,51711,50166,0.026539,0.01989,0.024264,0.21912,0.21185,0.10426,0.46138,0.46566,0.15477,0.66409,0.67815,0.17779,0.81629,0.83051,0.18638,0.00092908,0.00061754,0.016709,-0.0088144,0.0034383,-0.041156,0.0028452,0.001918,0.024465,-0.008313,0.0071568,-0.052478,0.0056061,0.003793,0.028764,-0.0080438,0.011205,-0.065365,5.7003e-05,3.502e-05,0.002367,-0.0089494,-0.00067636,-0.019792,0.00032574,0.00019917,0.006257,-0.010809,-0.00011494,-0.027785,0.00095892,0.0005967,0.010705,-0.011938,0.0016186,-0.036589,0.0002309,0.0001438,0.0081618,-0.0080741,-0.00055791,-0.020077,0.00075462,0.00049082,0.013329,-0.0088999,0.00055457,-0.030134,0.0017171,0.0011346,0.018807,-0.0088993,0.0018624,-0.040316,0.00064118,0.00043871,0.19838,0.015549,0.02319,-0.03324,0.0018214,0.0012625,0.18179,0.018882,0.027986,-0.038182,0.0031845,0.0022206,0.15484,0.019748,0.032364,-0.04405,0.48792,74,74,40,1054,3,3,3,0.645
30,-0.054702,0.55614,0.50801,-0.70108,0.44964,-0.93871,0.33896,-0.0694,2.8999,-0.008011,3.3437,2.1118e-05,2.1405,2.7676,0.59705,3.3665,0.0032123,0.70116,1.881,1.4047,1.2024,1.0207,0.12739,0.093574,0.11671,0.069738,0.038741,0.041423,0.51243,0.40354,0.020452,0.10796,1.3006,6.3932,3.7598,0.072249,12.058,0.45802,0.4301,0.45802,0.27598,0.29041,0.16991,1.0481,0.54494,55,92.691,3150,1.9221e+05,6.3629,44.014,85050,24624,9531,0.91646,0.93884,0.13167,0.090595,0.085739,0.44545,33761,19086,0.00099672,0.00049807,0,0.040191,0,0.051269,0.0079424,0.036294,0.0065161,0.052637,0.47022,0.085636,0.1773,0.2271,0.29534,0.20636,0.28372,0.2663,0.10735,0.28354,0.25979,0.098199,15.051,5.5717,9498.2,23496,21821,0.19429,0.18631,0.11056,0.53393,0.54526,0.15812,0.75212,0.77297,0.15702,0.87357,0.88972,0.14556,0.92169,0.93417,0.13097,0.014416,0.019363,0.16136,0.053907,0.070882,0.1668,0.028619,0.037113,0.15315,0.066468,0.08899,0.18593,0.045875,0.057023,0.14649,0.077854,0.10527,0.18673,0.0020715,0.0022689,0.053535,0.0069931,0.015693,0.017876,0.0050068,0.0056237,0.059855,0.011574,0.02367,0.034341,0.010218,0.0113,0.070994,0.019466,0.034665,0.041147,0.0099692,0.013653,0.21932,0.053984,0.064676,0.1521,0.020056,0.027147,0.22047,0.069882,0.083152,0.1836,0.030998,0.041115,0.2113,0.080904,0.095412,0.20113,0.0023758,0.0034411,0.45749,0.054495,0.073687,0.10655,0.0066501,0.0092719,0.41308,0.066497,0.092426,0.12877,0.012639,0.016849,0.38247,0.079623,0.1119,0.13861,0.58778,74,74,40,1054,3,3,3,0.645
30,-0.0022953,0.14083,0.13728,-0.92876,0.13486,-1.0522,0.13291,0.74822,4.8028,0.070148,3.3074,0.00035361,1.2086,3.2039,0.14202,3.9676,0.0037859,0.92891,0.80437,0.54789,0.4694,0.41952,0.16094,0.14745,0.217,0.097768,0.036737,0.025462,0.31464,0.40283,0.10783,0.0093687,0.83698,12.884,25.64,2.4473,42.329,0.20152,0.15621,0.20152,0.34501,0.47503,0.20873,0.47778,0.11227,43,125.14,2916,2.426e+05,4.751,25.698,78732,39339,15552,0.91318,0.93356,0.31681,0.22941,0.21677,0.77648,45153,26740,0.00082147,0.00042091,0,0.054827,0,0.05027,0.0059861,0.030455,0.0055747,0.032645,0.67598,0.0036949,0.25875,0.2162,0.36535,0.24672,0.25293,0.45465,0.21059,0.25251,0.47221,0.20736,35.801,6.6615,11646,30861,29134,0.042658,0.033577,0.025397,0.27577,0.25481,0.085446,0.55281,0.54655,0.12075,0.76292,0.77321,0.13301,0.90533,0.91857,0.1346,0.00067328,0.00046936,0.0078847,-0.0082364,0.0066941,-0.039838,0.0022557,0.001592,0.01263,-0.0083632,0.010838,-0.055438,0.0052066,0.0037376,0.017396,-0.0072936,0.016332,-0.072446,0.0004047,0.00028026,0.010943,-0.0046922,0.0036425,-0.029705,0.0010901,0.00076007,0.013635,-0.0053056,0.0052681,-0.036916,0.0021868,0.0015606,0.015897,-0.0056467,0.0085408,-0.045466,4.6345e-05,3.6511e-05,0.0010668,-0.0076332,0.0012966,-0.015682,0.00035056,0.00026376,0.0040321,-0.0087712,0.0023931,-0.026353,0.0011714,0.00086607,0.0083546,-0.0088001,0.0036616,-0.035784,0.00022223,0.00015258,0.044773,0.0019818,0.018332,-0.024309,0.00083681,0.00058435,0.054386,0.0043187,0.025334,-0.034891,0.0019895,0.0014113,0.062994,0.0075059,0.033083,-0.046607,0.45509,74,74,40,1054,3,3,3,0.645
30,-0.0093555,0.30156,0.28188,-0.84726,0.28171,-0.82673,-0.024231,0.64041,3.7716,0.11076,3.289,5.6345e-05,2.0373,3.6853,0.30504,4.6398,0.0044273,0.84732,1.2227,0.75681,0.64592,0.56852,0.11267,0.12759,0.20363,0.12061,0.038768,0.030308,0.36643,0.32494,0.12955,0.047335,0.059347,6.9234,10.122,0.66853,18.275,0.2913,0.21202,0.2913,0.25015,0.38249,0.14433,0.71668,0.25523,57,107,3471,2.2816e+05,6.2406,43.418,93717,24786,18981,0.90481,0.92242,0.36827,0.29349,0.18622,0.77387,64787,34731,0.00094368,0.00051074,0,0.088669,0,0.053721,0.0040336,0.015456,0.0014456,0.012649,1.1176,2.702,1.4203,0.22485,0.40637,0.23728,0.26925,0.48696,0.20152,0.25942,0.51259,0.19906,56.221,6.4064,16196,68141,67179,0.013751,0.0087747,0.010102,0.18391,0.16322,0.070312,0.40997,0.38752,0.1105,0.59581,0.56627,0.12817,0.72112,0.68099,0.13229,0.0013743,0.0014393,0.019859,-0.0055752,0.0055006,0.0067905,0.0049455,0.00524,0.034168,-0.00063375,0.01603,0.011475,0.011097,0.012037,0.045749,0.0059136,0.028577,0.021621,7.1829e-05,4.2775e-05,0.0023965,-0.0078683,-0.001733,-0.01499,0.00036777,0.00022263,0.0056763,-0.0094401,0.0006598,-0.022811,0.0011297,0.00069483,0.010134,-0.010046,0.0043668,-0.03476,5.721e-05,3.4444e-05,0.0016249,-0.0084318,-0.0012878,-0.016647,0.00033599,0.00020974,0.0047686,-0.0098433,7.814e-05,-0.021646,0.0010135,0.00066764,0.0089195,-0.01035,0.0018283,-0.028981,0.0012453,0.0013621,0.30958,0.030697,0.040945,0.012826,0.0043749,0.0048936,0.35084,0.04806,0.060861,0.021386,0.0094472,0.01101,0.36909,0.066125,0.083324,0.038526,0.44348,74,74,40,1054,3,3,3,0.645
30,-0.059105,0.98225,0.86328,-0.36864,0.86203,-0.38269,0.038087,0.41075,2.9363,0.094475,3.3381,2.13e-05,3.7222,3.3113,1.2611,4.4612,0.0042569,0.36871,3.0776,2.3206,1.9104,1.6144,0.047203,0.08831,0.10452,0.056294,0.042743,0.039159,0.62177,0.048894,0.076145,0.034763,1.2502,2.4135,2.2363,0.030332,6.0902,0.44222,0.54993,0.54993,0.27906,0.44661,0.17029,1.7582,1.5438,67,77.09,4094,2.5016e+05,7.8184,62.985,1.1054e+05,13257,3942,0.91448,0.93619,0.30539,0.2198,0.20892,0.77941,46871,26528,0.00091198,0.00039912,0,0.072038,0,0.065248,0.0052261,0.0387,0.009973,0.06561,0.082962,2.5492,2.2614,0.22562,0.35715,0.24675,0.26162,0.42419,0.22234,0.2729,0.43458,0.21542,32.584,6.6622,18409,49131,48076,0.053982,0.042971,0.032572,0.25911,0.25006,0.081368,0.53215,0.55969,0.11781,0.76952,0.80228,0.13597,0.90502,0.92417,0.13637,0.0024734,0.0022232,0.029356,6.9922e-05,0.018786,-0.017907,0.0054496,0.0048637,0.030925,0.00089849,0.026391,-0.025323,0.0098339,0.008651,0.033299,0.0026211,0.035063,-0.037312,0.00057746,0.00044731,0.015825,-0.003488,0.0070939,-0.018032,0.0012546,0.00096192,0.015904,-0.0046171,0.011091,-0.026819,0.0027249,0.0020969,0.020076,-0.0039605,0.017251,-0.040875,0.00057727,0.00048392,0.013467,-0.0042978,0.010471,-0.017789,0.0018176,0.0015742,0.021188,-0.0028122,0.014848,-0.019485,0.0034733,0.003062,0.025106,-0.0017419,0.018031,-0.021958,0.0013186,0.0012919,0.26926,0.029574,0.035512,-0.002892,0.0032751,0.0031547,0.21572,0.03127,0.04316,-0.006941,0.0058985,0.0055874,0.18928,0.034905,0.053059,-0.012548,0.51869,74,74,40,1054,3,3,3,0.645
30,-0.050988,1.0655,0.99634,0.05206,0.98254,0.058187,0.11768,-0.1317,2.4661,-0.12772,3.3383,0.00026685,3.1494,2.1704,2.1017,2.4695,0.0023564,-0.052072,6.2099,4.0926,2.8575,2.1203,0.044234,0.028486,0.056626,0.058293,0.063556,0.061905,0.6869,0.050682,1.3553,1.1122,0.82557,0.40585,0.26563,0.084151,4.0994,0.16344,0.15653,0.16344,0.28937,0.30624,0.14987,3.6451,6.6402,94,18.649,407,3771.2,4.4774,25.286,10989,10044,5238,0.91837,0.94171,0.098731,0.068654,0.054545,0.38699,18626,12674,0.00080203,0.00035024,0,0.066831,0,0.05652,0.05609,0.11851,0.13929,0.22883,0.27115,0.15433,0.18759,0.21317,0.30144,0.22726,0.26818,0.27142,0.10274,0.2581,0.2561,0.094693,15.968,6.136,6253.2,11271,10360,0.2199,0.23412,0.070525,0.49161,0.51844,0.082056,0.64704,0.66766,0.076137,0.74419,0.75737,0.06989,0.81248,0.82195,0.065073,0.020948,0.028021,0.13215,0.062192,0.077078,0.16944,0.044077,0.059756,0.13295,0.082251,0.10318,0.23421,0.072785,0.097613,0.131,0.10005,0.12642,0.27744,0.0088435,0.010789,0.12882,0.040316,0.045265,0.069936,0.018755,0.023914,0.12638,0.052529,0.061763,0.11664,0.032298,0.041256,0.12648,0.065775,0.079117,0.1494,0.010573,0.01559,0.1311,0.043071,0.057112,0.16543,0.021513,0.031797,0.13329,0.056472,0.074146,0.21469,0.034416,0.050109,0.13223,0.06802,0.087332,0.24562,0.001531,0.0016416,0.16617,0.025278,0.033142,0.012718,0.0042676,0.0044833,0.14941,0.030573,0.043882,0.01056,0.0074672,0.0076804,0.12736,0.033216,0.053415,0.0070932,0.49056,74,74,40,1054,3,3,3,0.645
30,-0.031109,0.46529,0.42384,-0.75879,0.39841,-0.57291,-0.24496,-0.037183,3.8837,0.003262,3.3165,0.0002106,2.8647,4.1264,0.48106,5.0673,0.004826,0.75913,1.5676,1.0881,0.89247,0.73442,0.14609,0.10111,0.1299,0.091247,0.050508,0.049125,0.43201,0.45911,0.045277,0.051163,0.40316,3.1241,2.4193,0.27525,6.7773,0.2924,0.1637,0.2924,0.47126,0.48262,0.22663,0.91302,0.33091,72,24.708,1077,16213,7.7226,63.407,29079,4374,2970,0.91915,0.94467,0.10716,0.071247,0.070548,0.46288,19998,12794,0.00096895,0.00044573,0,0.041154,0,0.053443,0.0025726,0.012753,0.0020308,0.029691,0.52703,1.5679,0.79907,0.22147,0.30059,0.23288,0.30832,0.28469,0.11031,0.32114,0.28637,0.10591,16.066,6.2878,11730,18549,17204,0.22302,0.21386,0.061461,0.67797,0.70767,0.097239,0.85406,0.87695,0.086356,0.91538,0.92993,0.073871,0.93354,0.94464,0.064248,0.0060144,0.0055582,0.032603,0.011076,0.031654,-0.026175,0.012084,0.011232,0.031319,0.013579,0.043188,-0.030478,0.01921,0.017808,0.029709,0.015293,0.054446,-0.038628,0.00054944,0.00046631,0.0068771,-0.0024727,0.016826,-0.021549,0.0019826,0.0017416,0.011479,-0.00094305,0.023289,-0.02682,0.0048781,0.0042761,0.016415,0.0019728,0.03168,-0.039493,0.004591,0.0043714,0.048916,0.01429,0.020568,-0.013888,0.0082935,0.0079744,0.044157,0.015928,0.027535,-0.013197,0.011473,0.011112,0.037878,0.015418,0.031918,-0.012092,0.00087395,0.00072049,0.081505,0.012327,0.031185,-0.03066,0.0023733,0.0019575,0.0714,0.014288,0.039528,-0.03461,0.0039806,0.0032986,0.058341,0.014405,0.048523,-0.04043,0.4587,74,74,40,1054,3,3,3,0.645
30,-0.031597,0.60665,0.56282,-0.66079,0.55052,-0.75849,0.14785,0.11782,3.0246,0.039641,3.3279,2.561e-07,2.8428,3.4498,0.67776,4.246,0.0040515,0.6608,2.1903,1.6477,1.3139,1.0522,0.10092,0.093411,0.10731,0.065345,0.055424,0.056053,0.52154,0.35775,0.059724,0.076205,0.9457,1.2288,0.86867,0.0094494,3.5463,0.36741,0.25288,0.36741,0.39692,0.63007,0.20529,1.1327,0.61872,73,49.479,1059,24143,4.5533,26.175,28593,13824,12501,0.91828,0.94425,0.1355,0.089273,0.12092,0.42573,28082,16918,0.00078423,0.00039264,0,0.045626,0,0.043534,0.0032343,0.020335,0.010829,0.038876,0.32021,1.0515,1.109,0.21009,0.32603,0.23493,0.24383,0.35492,0.15462,0.25324,0.3411,0.14459,25.014,6.3432,9584.3,19173,17894,0.13747,0.13769,0.060517,0.38537,0.40108,0.088296,0.57281,0.59078,0.092521,0.70062,0.71821,0.090321,0.79198,0.8061,0.08707,0.0070688,0.0068732,0.061214,0.018223,0.037658,-0.010142,0.013958,0.013704,0.05779,0.021884,0.046934,-0.0088446,0.023339,0.023333,0.057661,0.026973,0.058038,-0.00015313,0.0033577,0.0033347,0.067136,0.013965,0.021633,-0.0019352,0.0081099,0.0083085,0.075011,0.021789,0.03075,0.0094836,0.014842,0.01565,0.079786,0.029681,0.042446,0.026927,0.0036868,0.003517,0.062752,0.013225,0.028264,-0.012278,0.0069606,0.0064965,0.059202,0.015561,0.033375,-0.02209,0.010061,0.0092986,0.053061,0.015851,0.03588,-0.028665,2.4344e-05,2.1518e-05,0.0036267,-0.0025368,0.016465,-0.010703,0.00028162,0.00024861,0.013534,-0.0015156,0.023414,-0.015588,0.0012332,0.0010855,0.028874,0.0019283,0.033227,-0.022145,0.45629,74,74,40,1054,3,3,3,0.645
30,-0.0058541,0.27027,0.26098,-0.85952,0.26097,-0.8625,0.0034617,-0.40074,3.6165,-0.04551,3.3,0.00015521,1.9616,3.7,0.28055,4.6833,0.0044688,0.85958,1.2167,0.7276,0.58882,0.48144,0.095985,0.13458,0.20241,0.13194,0.052233,0.04713,0.33573,0.26203,0.15653,0.05241,0.018462,2.6878,2.7269,0.89695,6.8011,0.21535,0.17,0.21535,0.2841,0.38532,0.13685,0.68602,0.23409,49,116.12,2460,1.5177e+05,4.7768,27.772,66420,25164,18360,0.91335,0.93498,0.2932,0.21054,0.20403,0.75641,50693,25517,0.00098482,0.00047457,0,0.053499,0,0.043114,0.0048824,0.010396,0.0015906,0.016366,0.19646,0.24857,0.72132,0.22327,0.35284,0.23552,0.27078,0.42029,0.18331,0.27686,0.42157,0.17679,32.057,6.3592,12088,32194,31147,0.054435,0.046111,0.033138,0.3201,0.32615,0.10142,0.59553,0.60955,0.13301,0.77497,0.7898,0.13815,0.8795,0.89283,0.13371,0.0018215,0.0014316,0.021812,-0.0029721,0.0093026,-0.041,0.0053546,0.0043829,0.030657,0.00062416,0.016939,-0.049561,0.011335,0.0096978,0.038724,0.0058806,0.026206,-0.053076,0.00039643,0.00031779,0.010961,-0.0048059,-0.001412,-0.016433,0.0008238,0.00067545,0.010536,-0.0065465,-0.00056977,-0.017219,0.0015086,0.0012638,0.011214,-0.007896,0.0021248,-0.021015,0.00071436,0.00054653,0.016813,-0.0034387,0.0077852,-0.028085,0.0023833,0.0019421,0.02803,-0.00049326,0.012626,-0.035207,0.0055821,0.0048487,0.040709,0.0048018,0.018168,-0.035191,0.00071076,0.00056729,0.14642,0.014349,0.024639,-0.029533,0.0024807,0.0020264,0.16486,0.022602,0.035013,-0.035494,0.0052624,0.0044033,0.17037,0.030594,0.046298,-0.040453,0.48456,74,74,40,1054,3,3,3,0.645
30,-0.0071373,0.38281,0.37367,-0.79119,0.36703,-0.68569,-0.13334,-0.06551,3.1421,-0.0038175,3.3375,3.3114e-08,3.1875,4.9328,0.41676,6.4053,0.0061119,0.79137,1.5239,0.96381,0.80391,0.68785,0.092908,0.10124,0.18577,0.11605,0.046354,0.039149,0.41853,0.2639,0.053134,0.039831,0.043186,3.3843,3.9733,0.23158,7.9892,0.22071,0.14576,0.22071,0.2215,0.42872,0.13413,0.85131,0.35698,38,101.24,2689,1.9102e+05,5.5903,33.365,72603,11178,7317,0.91818,0.942,0.28202,0.18687,0.21128,0.78973,35421,23023,0.00055668,0.00031519,0,0.060607,0,0.084413,0.0035767,0.0010323,0.013588,0.021989,2.6672,2.7609,0.037246,0.20107,0.30598,0.33682,0.21795,0.29611,0.45444,0.22456,0.29296,0.45373,41.943,9.0941,9956.6,17557,14847,0.0044663,0.0037987,0.0018882,0.10429,0.098172,0.022946,0.25636,0.24469,0.039766,0.38834,0.37238,0.048077,0.51362,0.49363,0.054227,0.00034894,0.00033795,0.0029018,-0.0081668,0.0045301,-0.0054055,0.0012169,0.001201,0.0048386,-0.0095432,0.0089105,-0.003184,0.0028408,0.0028042,0.00674,-0.010366,0.014039,-0.0045,2.3774e-05,1.8636e-05,0.00045649,-0.0062096,0.0015424,-0.016774,0.0001768,0.00015117,0.0015704,-0.0078079,0.0033355,-0.019009,0.00080461,0.00072919,0.0041536,-0.0084308,0.0069285,-0.021566,0,0,0,-0.0066514,0.0013753,0,0,0,0,-0.0085585,0.0037768,0,8.0873e-07,6.5483e-07,4.0959e-06,-0.010401,0.0055708,-0.026043,0.00032517,0.00031931,0.046522,0.0038206,0.013685,-0.0029127,0.0010401,0.0010498,0.048004,0.0054944,0.018234,0.002007,0.0020359,0.0020747,0.045775,0.0065683,0.02326,0.0052787,0.38656,74,74,40,1054,3,3,3,0.645
