30,-0.027,0.99026,0.99637,-0.05176,0.92462,-0.06565,0.26835,0.85037,3.3146,0.23248,3.2017,2.4243e-05,4.4941,3.2621,1.8944,4.2975,0.0041006,0.051768,9.6636,5.7626,4.0924,2.6822,0.015224,0.019695,0.045831,0.054874,0.049194,0.076289,0.73889,1.2106,3.2032,1.8234,0.71091,0.90304,0.015706,0.15948,8.0263,0.069864,0.18013,0.18013,0.64189,0.65304,0.19965,2.9262,4.8459,100,46.46,2952,87130,9.5634,94.215,79704,5751,5076,0.91815,0.93118,0.075181,0.067112,0.050816,0.011765,25240,13026,0.0012499,0.00046326,2,0.36444,0,0.059665,0.11895,0.60926,0.13559,0.69751,1.3068,2.4027,1.1155,0.21361,0.30775,0.24027,0.26134,0.32988,0.1739,0.23125,0.24911,0.18563,23.329,6.4873,52373,3.8614e+05,3.8591e+05,0.18688,0.17614,0.10113,0.40253,0.42288,0.11348,0.54684,0.62114,0.10853,0.65861,0.74118,0.10413,0.75444,0.81873,0.10153,0.018605,0.017957,0.21323,0.074082,0.058421,-0.005042,0.037489,0.034257,0.20459,0.092645,0.071813,-0.015937,0.058905,0.051931,0.19331,0.10678,0.082476,-0.026336,0.014019,0.014822,0.32523,0.085057,0.065092,0.0069253,0.025945,0.026153,0.2781,0.094557,0.072825,0.0011931,0.038515,0.037402,0.24301,0.10087,0.078726,-0.0050394,0.0036051,0.0024148,0.092357,0.01677,0.015102,-0.023213,0.0086976,0.0059095,0.11193,0.028083,0.022669,-0.029465,0.01493,0.01026,0.12023,0.03734,0.028824,-0.034724,0.00098068,0.00072085,0.19182,0.020384,0.016485,-0.010712,0.0029978,0.0022794,0.18655,0.027301,0.022622,-0.013864,0.0059282,0.004576,0.18292,0.034536,0.028857,-0.016884,0.62597,74,74,40,1054,3,3,3,0.645
30,-0.0018359,0.24278,0.24314,-0.86985,0.23888,-0.98499,0.13238,-0.76255,13.346,0.010599,2.9625,0.012455,3.8813,7.607,0.25984,13.579,0.012957,0.86994,1.2334,0.87635,0.67553,0.50811,0.11171,0.12731,0.18518,0.088837,0.0666,0.069079,0.35128,0.35598,0.14246,0.030008,0.42074,1.1129,0.58781,0.6842,3.3341,0.35767,0.39301,0.39301,0.62436,0.87006,0.36628,0.64865,0.10818,52,97.731,3677,2.6469e+05,6.6013,46.016,99279,19359,6939,0.91885,0.93197,0.17718,0.13108,0.10128,0.51104,44501,17261,0.001397,0.00061772,0,0.063045,0,0.054869,0.0015582,0.011255,0.0021971,0.0051663,0.4827,0.45271,1.3559,0.22601,0.32431,0.21931,0.28654,0.30367,0.084693,0.30019,0.29889,0.081762,18.354,5.9213,22276,61253,60446,0.32213,0.30955,0.17389,0.72747,0.74369,0.20458,0.90344,0.92192,0.17887,0.96045,0.97121,0.15148,0.98105,0.98661,0.1317,0.0085524,0.006817,0.097779,0.028025,0.050771,-0.05929,0.018468,0.014793,0.10054,0.038208,0.066589,-0.076902,0.030884,0.024878,0.1011,0.047401,0.08143,-0.092812,0.0059429,0.0048733,0.13753,0.031442,0.045402,-0.043498,0.0128,0.01063,0.13687,0.041285,0.058311,-0.054671,0.021561,0.01803,0.13571,0.050673,0.071364,-0.065355,0.0025789,0.0019239,0.065904,0.0099305,0.025535,-0.040846,0.0055101,0.0040628,0.070735,0.014376,0.034538,-0.053876,0.0091043,0.0067422,0.073139,0.01837,0.042065,-0.065816,3.0683e-05,1.9831e-05,0.0059868,-0.0027023,0.0098989,-0.013547,0.00020965,0.00014029,0.013014,-0.0025294,0.013602,-0.020015,0.00071084,0.00049167,0.02188,-0.0012988,0.018918,-0.027066,0.53738,74,74,40,1054,3,3,3,0.645
30,-0.014133,0.77959,0.77105,-0.47773,0.73755,-0.5773,0.20843,0.020146,2.6793,-0.011027,3.3624,0.00013839,3.481,3.4043,1.0436,4.2964,0.0040996,0.47773,4.1462,2.1243,1.6117,1.2303,0.025467,0.039033,0.119,0.12745,0.063664,0.066355,0.55904,0.095564,0.23503,0.0017042,0.026093,0.28694,0.11917,0.027464,0.79196,0.19787,0.14037,0.19787,0.75425,0.90215,0.30235,1.5127,1.1446,90,40.933,2166,53867,8.5767,78.263,58482,8856,8856,0.91974,0.93484,0.22571,0.17758,0.11183,0.70342,34801,17530,0.0012341,0.00043151,0,0.060704,0,0.061325,0.029157,0.020501,0.041459,0.020455,0.070956,1.1606,1.2382,0.22316,0.32861,0.22781,0.28168,0.31173,0.12469,0.27979,0.28762,0.10131,21.444,6.1509,32150,93094,92554,0.19379,0.20047,0.084319,0.4352,0.48539,0.098652,0.57625,0.63724,0.091962,0.70155,0.74337,0.089187,0.79231,0.82658,0.085735,0.051835,0.097777,0.47769,0.20229,0.29831,0.4524,0.1013,0.17785,0.44455,0.24602,0.34293,0.50048,0.15558,0.25582,0.41052,0.27847,0.36945,0.51786,0.036889,0.076389,0.68814,0.21173,0.33328,0.45465,0.071889,0.1382,0.6196,0.2509,0.36927,0.50409,0.11054,0.19823,0.5608,0.28063,0.3891,0.52187,0.011416,0.016661,0.23515,0.061458,0.07689,0.10762,0.023223,0.034085,0.24031,0.080893,0.10317,0.14065,0.036198,0.052079,0.2344,0.095246,0.12044,0.15711,0.0035299,0.0047281,0.55516,0.073631,0.081676,0.053638,0.010225,0.013714,0.51161,0.093558,0.10619,0.074102,0.019702,0.02636,0.48881,0.11548,0.13215,0.093936,0.49046,74,74,40,1054,3,3,3,0.645
30,-0.005153,0.14542,0.15044,-0.92164,0.12881,-1.2711,0.3792,-0.032034,2.6156,-0.047147,3.3576,0.00017069,1.5158,3.8277,0.15653,4.8925,0.0046684,0.92166,0.9466,0.47934,0.37352,0.30523,0.12052,0.13197,0.25335,0.16489,0.052927,0.038707,0.23764,0.32941,0.11573,0.094849,2.1946e-05,3.3928,6.4431,4.0356,14.412,0.15746,0.090485,0.15746,1.1042,1.2149,0.4058,0.50289,0.12639,54,77.333,1506,62450,4.248,22.014,40662,21060,20520,0.91961,0.93728,0.24757,0.1835,0.14271,0.73745,42562,20567,0.0012137,0.00050956,0,0.051846,0,0.051376,0.0018924,0.0038963,0.0094094,0.015322,0.69011,1.2434,1.1964,0.22268,0.35645,0.24692,0.27992,0.41203,0.13028,0.30246,0.39803,0.10838,35.366,6.6668,25022,58465,57502,0.12987,0.11917,0.056657,0.46463,0.46763,0.1056,0.67645,0.69565,0.10824,0.80917,0.83174,0.10314,0.88196,0.90366,0.095689,0.038426,0.045169,0.35506,0.14759,0.15672,0.10371,0.078505,0.094579,0.34541,0.18797,0.20526,0.15894,0.12488,0.15379,0.33039,0.22066,0.24787,0.22102,0.026905,0.034336,0.50323,0.15271,0.16242,0.13104,0.050835,0.067262,0.4393,0.17491,0.1974,0.19282,0.076666,0.10486,0.38999,0.19133,0.22789,0.2617,0.0074083,0.0062177,0.15301,0.037671,0.043716,-0.042343,0.016731,0.01505,0.17359,0.056038,0.063838,-0.035403,0.028878,0.02752,0.18749,0.074055,0.083404,-0.020643,0.0041124,0.0046155,0.6485,0.086409,0.077167,0.028716,0.012043,0.013256,0.60421,0.11111,0.099384,0.031989,0.022132,0.024035,0.55056,0.13058,0.11874,0.03344,0.41035,74,74,40,1054,3,3,3,0.645
30,-0.0035855,0.15033,0.15617,-0.91852,0.1363,-1.2462,0.35671,0.97871,6.1276,0.092945,3.2826,0.00062119,2.87,7.109,0.16267,9.8567,0.0094052,0.91858,1.0134,0.55012,0.41252,0.33751,0.12638,0.13403,0.21536,0.15461,0.065451,0.041351,0.26282,0.35733,0.10575,0.030473,0.0044585,1.8129,5.3722,3.0687,10.752,0.3671,0.25595,0.3671,1.5752,1.8539,0.50075,0.51295,0.13,46,199.39,7815,1.3221e+06,6.4896,43.406,2.11e+05,16308,6291,0.90038,0.90555,0.46405,0.37974,0.23886,0.83076,82626,43854,0.0010896,0.00059997,0,0.073496,0,0.047706,0.002393,0.018005,0.0041212,0.022875,0.26927,1.4372,1.5074,0.17908,0.43204,0.29692,0.16849,0.4997,0.2976,0.16156,0.5162,0.29735,74.363,8.0167,20280,1.0383e+05,1.0316e+05,0.024868,0.016983,0.021791,0.17854,0.161,0.081507,0.3984,0.39572,0.12804,0.58648,0.58889,0.15015,0.73477,0.72995,0.16012,0.0082138,0.0073623,0.15244,0.034037,0.044717,-0.027018,0.019552,0.019061,0.17279,0.053098,0.068539,-0.0091107,0.035844,0.037307,0.19048,0.074416,0.095594,0.019084,0.0057513,0.0053201,0.21606,0.038789,0.045292,-0.015627,0.012298,0.012708,0.21347,0.050463,0.063393,0.0092421,0.020905,0.023674,0.21359,0.062652,0.083938,0.045619,0.0014022,0.0010679,0.058172,0.0027165,0.01129,-0.025935,0.0036158,0.0030246,0.07535,0.0080361,0.019291,-0.026002,0.0072916,0.0065754,0.095089,0.016047,0.029079,-0.021047,0.0010603,0.00097426,0.33583,0.028656,0.030201,-0.010044,0.0036675,0.0033447,0.36957,0.044253,0.043679,-0.01498,0.0077757,0.0071287,0.38852,0.060636,0.058441,-0.018515,0.43902,74,74,40,1054,3,3,3,0.645
30,-0.047525,0.84266,0.92468,-0.27283,0.64227,-0.42362,0.55265,0.032777,2.1053,0.042953,3.3776,0.00099697,3.3557,2.7814,1.4528,3.2585,0.0031092,0.27285,8.8914,4.8678,3.3412,2.0539,0.020168,0.022544,0.049502,0.070008,0.060521,0.098055,0.6792,0.51204,2.7908,1.9648,0.33516,0.4624,0.005266,0.083554,6.154,0.10871,0.089162,0.10871,0.23621,0.26879,0.089688,2.004,2.0067,99,56.939,2612,79121,7.8505,69.572,70524,20871,15012,0.91636,0.92883,0.20363,0.1532,0.10213,0.55463,25825,14248,0.0009179,0.00042684,0,0.078009,0,0.060991,0.01133,0.0013584,0.027018,0.0067885,0.4767,1.0739,0.66636,0.22761,0.33978,0.22741,0.27114,0.34644,0.14742,0.27638,0.33654,0.13871,14.145,6.14,15308,48042,47053,0.18095,0.17946,0.11136,0.3989,0.39948,0.12789,0.55066,0.5584,0.12429,0.66802,0.68447,0.12011,0.76051,0.77691,0.11639,0.023384,0.032965,0.30479,0.10254,0.14251,0.18538,0.04761,0.063637,0.29549,0.12992,0.17357,0.19519,0.074291,0.095386,0.27726,0.14889,0.19508,0.19683,0.017187,0.027244,0.45346,0.11334,0.16208,0.21908,0.032662,0.049635,0.39815,0.1301,0.18307,0.24286,0.049421,0.071938,0.35462,0.14224,0.1972,0.25206,0.0039351,0.0034688,0.11465,0.020265,0.030065,-0.023425,0.0092342,0.0080129,0.13514,0.032469,0.041669,-0.033832,0.015331,0.01331,0.14041,0.041293,0.050412,-0.040334,0.0022617,0.0022524,0.50308,0.055048,0.052887,-0.00067162,0.0063772,0.0064991,0.45131,0.067808,0.068715,0.00425,0.011422,0.011644,0.40082,0.077226,0.081134,0.0052579,0.66811,74,74,40,1054,3,3,3,0.645
30,-0.013399,0.1419,0.165,-0.9137,0.08972,-1.5309,0.67545,0.0043483,2.8786,0.013016,3.3597,0.00011397,1.8732,4.5067,0.17244,5.457,0.0052071,0.9137,1.0587,0.42962,0.334,0.26672,0.097003,0.10654,0.25569,0.22476,0.052723,0.041866,0.22142,0.1206,0.00182,0.023138,0.010835,6.3936,9.1647,9.218,24.933,0.14932,0.20946,0.20946,0.63205,0.84802,0.25465,0.52944,0.13683,33,264.09,8157,2.0034e+06,5.4612,30.895,2.2024e+05,9990,4185,0.90075,0.90633,0.37133,0.3126,0.1367,0.67758,98695,40362,0.0011712,0.00056128,0,0.077072,0,0.042332,0.00016855,0.010443,0.00039105,0.0088888,1.2353,0.37807,0.64846,0.18574,0.41947,0.30304,0.18926,0.48183,0.29097,0.17286,0.48387,0.31672,53.714,8.1821,29515,1.8694e+05,1.8597e+05,0.0284,0.017342,0.02357,0.22291,0.1862,0.096381,0.46662,0.44598,0.14204,0.66885,0.68283,0.16218,0.8162,0.84322,0.16846,0.0063721,0.0054963,0.11201,0.022561,0.035865,-0.024066,0.014663,0.014278,0.12273,0.034162,0.053981,-0.0063726,0.026838,0.028237,0.13508,0.048541,0.074575,0.016244,0.0060639,0.0053049,0.21576,0.040291,0.04444,-0.021063,0.013149,0.013221,0.21617,0.053349,0.063052,0.0012262,0.02234,0.024827,0.21619,0.066194,0.083593,0.030703,0.000199,0.00011037,0.0078189,-0.007349,0.0043702,-0.018699,0.00077084,0.00045479,0.015214,-0.0074363,0.007191,-0.027692,0.0022789,0.0014828,0.028148,-0.0047493,0.010841,-0.037459,0.00010923,8.103e-05,0.032767,-0.00099422,0.011615,-0.012706,0.00078072,0.00063391,0.074512,0.004465,0.018806,-0.015181,0.0025167,0.0021902,0.1191,0.013857,0.028604,-0.014495,0.49574,74,74,40,1054,3,3,3,0.645
30,-0.044016,0.97265,0.99299,-0.077907,0.86148,-0.10626,0.36392,0.55298,2.3637,0.094214,3.2031,0.00046327,3.5367,2.6031,1.8424,3.3355,0.0031828,0.077909,11.756,6.6134,4.5193,2.7789,0.019991,0.020296,0.034316,0.053173,0.05004,0.083788,0.73839,0.43434,2.9757,5.0058,0.94311,0.86804,0.0015725,0.14415,10.373,0.028035,0.10201,0.10201,0.16733,0.22715,0.10807,2.8158,3.9645,121,46.479,3901,1.2654e+05,10.563,114.53,1.0533e+05,10800,6264,0.91549,0.92613,0.10449,0.079701,0.022275,0.29976,22034,13166,0.0010135,0.00047204,0,0.080017,0,0.067638,0.020297,0.0185,0.017886,0.023946,0.023593,0.15297,0.24414,0.22413,0.32775,0.22719,0.26817,0.33007,0.14732,0.26424,0.31672,0.13433,14.983,6.1342,19935,68923,68012,0.20739,0.20294,0.13173,0.42977,0.429,0.14221,0.56057,0.57882,0.13059,0.67147,0.69798,0.12461,0.76306,0.7949,0.12053,0.020766,0.021823,0.27935,0.091205,0.10311,0.019308,0.038088,0.039584,0.24398,0.10248,0.12074,0.018154,0.055183,0.056522,0.21255,0.10741,0.13184,0.013031,0.014122,0.016297,0.38455,0.093125,0.10561,0.047748,0.025897,0.029545,0.32582,0.10249,0.11921,0.053516,0.037731,0.042238,0.27943,0.10703,0.1278,0.052635,0.0059634,0.004995,0.17932,0.035253,0.037192,-0.03261,0.010521,0.0086437,0.15892,0.039005,0.043951,-0.041458,0.014296,0.011588,0.13513,0.038316,0.046779,-0.049435,0.00067985,0.00053149,0.15608,0.014198,0.02459,-0.020196,0.0021719,0.0017427,0.15863,0.020052,0.033773,-0.024822,0.0044717,0.0036511,0.16195,0.026644,0.043208,-0.03021,0.68386,74,74,40,1054,3,3,3,0.645
30,-0.004625,0.4831,0.48348,-0.71838,0.47343,-0.82191,0.14411,1.5616,13.754,0.082121,3.0067,0.011695,6.8403,9.1107,0.56263,18.092,0.017264,0.71841,2.1774,1.4645,1.0354,0.74575,0.077654,0.078788,0.13254,0.094463,0.088751,0.084578,0.44323,0.27924,0.026068,0.00025268,0.067393,0.052236,0.034066,0.035334,0.49459,0.37224,0.32889,0.37224,0.83879,1.1585,0.41888,1.0085,0.48779,51,130.06,5704,6.3419e+05,6.8852,48.61,1.5401e+05,6507,6021,0.91665,0.93222,0.23746,0.17534,0.14287,0.63701,35760,16847,0.0017605,0.00077983,0,0.065813,0,0.053594,0.011626,0.039093,0.011901,0.047513,0.36095,0.29438,0.68638,0.22273,0.31554,0.21566,0.25519,0.27566,0.10719,0.27418,0.26238,0.096587,19.638,5.8227,16106,49914,48900,0.33091,0.31741,0.21418,0.75127,0.79154,0.25332,0.89089,0.91822,0.21149,0.93885,0.95508,0.17754,0.96633,0.97564,0.15554,0.013353,0.01499,0.18305,0.05488,0.079323,0.046687,0.029761,0.032241,0.19427,0.077371,0.10519,0.042594,0.05089,0.05396,0.19975,0.098498,0.12969,0.038275,0.0069119,0.009308,0.19179,0.041577,0.070433,0.09572,0.015709,0.019513,0.2014,0.058252,0.08891,0.090033,0.027048,0.031633,0.20413,0.073439,0.10585,0.077481,0.0053793,0.0048461,0.16483,0.031337,0.037915,-0.023716,0.012207,0.01129,0.18789,0.047327,0.054885,-0.024227,0.021613,0.020718,0.20818,0.064791,0.072798,-0.017043,0.001062,0.00083566,0.24845,0.024523,0.02453,-0.024712,0.0027077,0.0021482,0.20153,0.026537,0.030886,-0.032088,0.0048809,0.0039517,0.18014,0.029988,0.03884,-0.036471,0.5542,74,74,40,1054,3,3,3,0.645
30,-0.0047705,0.11485,0.12292,-0.93646,0.096799,-1.3682,0.46098,-0.040873,2.8241,-0.031386,3.3598,0.00014198,1.4614,4.0978,0.12694,5.1692,0.0049325,0.93647,0.90822,0.43886,0.33859,0.27179,0.15369,0.14451,0.2152,0.17477,0.053226,0.040119,0.21849,0.40517,0.11315,0.019095,1.6514e-06,4.3292,7.5176,6.5319,18.916,0.28581,0.12998,0.28581,0.45736,0.46595,0.22103,0.45099,0.096657,29,337.31,5378,1.2787e+06,3.6934,15.709,1.4521e+05,84348,22302,0.90187,0.91065,0.39083,0.31591,0.19744,0.72237,1.0061e+05,52094,0.0012862,0.000601,0,0.077322,0,0.055619,0.0065143,0.022742,0.0052949,0.028609,0.31966,0.93828,0.054081,0.21242,0.43193,0.25024,0.22727,0.49636,0.229,0.23317,0.51365,0.22053,56.865,6.7564,17180,95366,94358,0.035865,0.022845,0.033265,0.25566,0.23897,0.12353,0.52771,0.53218,0.17952,0.72286,0.74154,0.19589,0.85491,0.87943,0.1972,0.0047041,0.003088,0.092409,0.013811,0.028968,-0.059688,0.010151,0.0067302,0.094952,0.019144,0.037154,-0.080073,0.018092,0.012323,0.10177,0.026961,0.046952,-0.097081,0.0033311,0.0021532,0.13246,0.018725,0.031852,-0.050846,0.0068054,0.0044317,0.12503,0.022571,0.037626,-0.066831,0.011515,0.0077202,0.12453,0.027819,0.044618,-0.078614,0.0013663,0.00093104,0.059996,0.0024825,0.0093047,-0.030867,0.0032747,0.0022581,0.072231,0.0063414,0.014879,-0.042513,0.0063116,0.0044451,0.087121,0.012315,0.021002,-0.053532,6.6559e-06,3.7546e-06,0.0022314,-0.0043515,0.0030889,-0.011272,7.1043e-05,4.0713e-05,0.0075775,-0.0053119,0.004561,-0.015029,0.00029029,0.00017181,0.015353,-0.0055412,0.0077637,-0.021851,0.47477,74,74,40,1054,3,3,3,0.645
30,-0.0081281,0.10145,0.11541,-0.94047,0.068916,-1.5374,0.63472,0.25211,3.212,0.022384,3.3201,2.7663e-05,1.1648,3.376,0.11883,4.2405,0.0040463,0.94053,0.86964,0.3516,0.25162,0.20556,0.14999,0.13811,0.24407,0.20618,0.059446,0.030703,0.1715,0.37545,0.067234,0.04048,0.012656,3.5185,16.474,13.865,34.353,0.04383,0.049888,0.049888,0.50943,0.7574,0.3227,0.43568,0.090285,21,518.71,6722,2.8185e+06,3.0493,10.843,1.8149e+05,1.1148e+05,1323,0.89812,0.90739,0.38767,0.31855,0.17077,0.6689,98302,47269,0.0014909,0.00071384,0,0.074264,0,0.053302,0.0013184,0.013,0.0025349,0.015322,0.84042,1.6456,0.62556,0.21316,0.44304,0.23567,0.23555,0.50162,0.19697,0.22716,0.52822,0.19822,71.246,6.3632,18708,1.2166e+05,1.208e+05,0.05411,0.036471,0.053633,0.27845,0.24143,0.14378,0.50126,0.47296,0.18223,0.66269,0.63993,0.19191,0.77163,0.74556,0.19021,0.0077924,0.0053101,0.16359,0.03367,0.033243,-0.062561,0.014526,0.010295,0.14521,0.036962,0.041806,-0.071768,0.022328,0.016527,0.13421,0.040201,0.050028,-0.077046,0.0064575,0.0044122,0.27441,0.047799,0.038552,-0.055942,0.011455,0.0080438,0.2249,0.049158,0.044269,-0.063906,0.016784,0.012167,0.19397,0.050148,0.050032,-0.069334,0.00048139,0.00028047,0.02259,-0.005493,0.0039534,-0.019182,0.0009132,0.00053606,0.021526,-0.0073246,0.0057274,-0.025733,0.0015857,0.00096294,0.023392,-0.008301,0.0070861,-0.031615,0.00085347,0.00061745,0.30578,0.023686,0.020792,-0.021348,0.0023132,0.0018036,0.26367,0.027362,0.027496,-0.023985,0.0043864,0.0036516,0.24792,0.032801,0.034932,-0.02331,0.4345,74,74,40,1054,3,3,3,0.645
30,-0.003159,0.4876,0.4893,-0.71431,0.47937,-0.61257,-0.14243,0.50033,7.0562,0.097814,3.2279,0.0018717,6.8373,9.0479,0.56997,14.889,0.014207,0.71462,1.993,1.3748,1.0138,0.82661,0.088005,0.097171,0.12972,0.089479,0.077659,0.052369,0.46559,0.30478,0.10486,0.00031322,0.16329,0.2431,0.99249,0.028986,1.8378,0.44757,0.33044,0.44757,0.72262,1.013,0.35098,1.0205,0.52005,73,54.274,2122,63871,7.5577,61.69,57294,9801,8424,0.92129,0.93812,0.11942,0.084535,0.07417,0.38013,26733,15818,0.0012035,0.00058717,0,0.07942,0,0.061934,0.021061,0.040039,0.03915,0.078571,0.65436,0.40294,1.2551,0.23079,0.31908,0.219,0.30746,0.28092,0.080233,0.32093,0.26959,0.069127,12.837,5.913,9903,21418,19909,0.32576,0.30868,0.14409,0.74422,0.7762,0.17149,0.8697,0.89041,0.14109,0.92459,0.93926,0.11949,0.95596,0.96524,0.10516,0.010246,0.0090632,0.095986,0.032294,0.06137,-0.040356,0.02009,0.018251,0.089618,0.038679,0.077757,-0.041121,0.032393,0.030164,0.08689,0.045677,0.092795,-0.03815,0.0080086,0.0072321,0.15187,0.040746,0.060188,-0.030208,0.015531,0.014384,0.13608,0.047247,0.072771,-0.028928,0.024415,0.023228,0.12592,0.053361,0.085202,-0.023147,0.0020605,0.0017077,0.043148,0.0058567,0.022891,-0.028575,0.0047814,0.0040878,0.050295,0.010158,0.033004,-0.032508,0.0082208,0.0072048,0.054114,0.013995,0.040772,-0.03407,0.00017669,0.0001234,0.028249,0.00076024,0.021649,-0.022159,0.00063575,0.00044801,0.032338,0.0018275,0.026575,-0.027613,0.0013981,0.0010028,0.035263,0.0030844,0.032807,-0.034243,0.52131,74,74,40,1054,3,3,3,0.645
30,-0.032186,0.98644,0.99885,-0.014345,0.90862,-0.018657,0.30056,0.63791,2.414,0.24019,3.237,0.0004002,3.8368,2.7315,1.9693,3.5745,0.0034108,0.014347,10.727,6.8689,4.7471,2.955,0.018512,0.018273,0.040594,0.04217,0.047325,0.079525,0.7536,0.52903,4.0475,2.723,2.0901,0.97156,0.0048826,0.1649,10.531,0.12023,0.17882,0.17882,0.21993,0.23417,0.13082,3.8744,7.994,111,43.577,3245,96101,9.9642,102.81,87615,12096,6777,0.91662,0.93009,0.12481,0.095498,0.047167,0.39198,25409,13388,0.00090285,0.00041867,0,0.098211,0,0.067176,0.050992,0.20158,0.065613,0.27947,0.23896,0.70679,0.38537,0.21591,0.32916,0.24628,0.2486,0.31889,0.19857,0.23866,0.3091,0.20098,14.115,6.6495,16306,52727,51611,0.18999,0.19318,0.10842,0.40243,0.40729,0.11964,0.54208,0.53738,0.11346,0.64666,0.63527,0.10782,0.72522,0.71497,0.10292,0.023788,0.025647,0.28752,0.10053,0.10915,0.029865,0.045365,0.04856,0.26109,0.11836,0.13191,0.033983,0.068508,0.073229,0.23709,0.13063,0.1501,0.039547,0.01754,0.020026,0.42912,0.11142,0.1154,0.046131,0.032815,0.036693,0.37095,0.12577,0.13163,0.047888,0.0488,0.053782,0.32471,0.13492,0.14429,0.048603,0.0046469,0.0040717,0.12554,0.024358,0.032154,-0.020436,0.0089725,0.0082635,0.12177,0.030075,0.041765,-0.016457,0.01395,0.013656,0.11847,0.035101,0.050338,-0.0053275,0.0016015,0.0015489,0.33033,0.036455,0.039158,-0.004254,0.004773,0.0047589,0.31323,0.047578,0.05384,-0.00050398,0.0089966,0.0091947,0.29275,0.057154,0.068151,0.0047354,0.62666,74,74,40,1054,3,3,3,0.645
30,-0.0017997,0.25426,0.25376,-0.86371,0.24946,-0.97608,0.1301,-2.9869,21.517,-0.11973,3.0474,0.0097845,3.2672,6.2594,0.27193,9.3022,0.0088762,0.86388,1.2847,0.84101,0.6285,0.49463,0.10509,0.13103,0.17263,0.11092,0.074528,0.057833,0.34797,0.34317,0.16957,0.015072,0.092004,0.59387,1.161,0.65977,3.0345,0.40002,0.41888,0.41888,0.5449,1.0416,0.276,0.67015,0.1821,65,46.692,1451,38488,5.9719,40.956,39177,15714,10584,0.92361,0.94542,0.034268,0.022222,0.0056474,0.38814,37936,19744,0.00073165,0.00037197,0,0.049644,0,0.06719,0.0013253,0.030012,0.00088538,0.05779,0.22428,0.57129,0.093133,0.20219,0.36079,0.26269,0.2283,0.42325,0.18024,0.22702,0.42259,0.18098,29.542,7.0927,7554.8,13073,10175,0.1562,0.15671,0.056657,0.37886,0.37494,0.071591,0.60275,0.60436,0.080185,0.79279,0.80277,0.084015,0.89897,0.90966,0.08109,0.0095088,0.0089254,0.073049,0.026434,0.063916,-0.037451,0.017922,0.016634,0.065559,0.029901,0.080019,-0.053894,0.026984,0.025023,0.059355,0.031947,0.094105,-0.064333,0.0073293,0.0069559,0.11397,0.033149,0.066975,-0.026534,0.012698,0.011938,0.091232,0.033346,0.074489,-0.036789,0.017873,0.016805,0.075587,0.032457,0.080568,-0.041951,0.0017667,0.0016338,0.030337,0.0036998,0.020909,-0.02126,0.0039317,0.0035961,0.033914,0.0062058,0.031583,-0.030816,0.0065724,0.0060141,0.035478,0.0082781,0.0411,-0.037437,0.0004128,0.00033571,0.05412,0.0053633,0.017539,-0.029106,0.0012923,0.0010992,0.053905,0.0073764,0.026352,-0.033721,0.0025414,0.0022058,0.052562,0.0091862,0.035758,-0.038731,0.42469,74,74,40,1054,3,3,3,0.645
30,-0.0044394,0.092045,0.09917,-0.94907,0.075768,-1.4101,0.48577,-0.060804,2.9795,0.0065329,3.3504,8.6976e-06,1.304,4.0853,0.10169,5.1936,0.0049557,0.9491,0.70217,0.37663,0.2938,0.23697,0.12892,0.18963,0.26172,0.14135,0.047321,0.036131,0.19492,0.3113,0.22114,0.06956,0.083245,6.6883,10.532,9.6889,27.595,0.19601,0.087068,0.19601,0.51016,0.53804,0.27743,0.40239,0.080847,27,308.33,3871,9.859e+05,3.2069,11.414,1.0452e+05,98118,13446,0.90331,0.91063,0.40631,0.33796,0.17844,0.76418,94781,42293,0.0019278,0.00065272,0,0.081568,0,0.065369,0.00041423,0.014069,0.00056449,0.018713,0.61194,0.89345,0.25997,0.22219,0.4134,0.24628,0.24291,0.46591,0.205,0.25478,0.483,0.19752,67.275,6.6496,22555,1.2019e+05,1.1958e+05,0.075833,0.059965,0.059948,0.33945,0.343,0.1398,0.60419,0.63803,0.17518,0.78409,0.81848,0.1811,0.884,0.90755,0.17379,0.0064349,0.0042651,0.10774,0.022345,0.034515,-0.06005,0.013089,0.0086523,0.10435,0.02783,0.044213,-0.079218,0.021908,0.014803,0.10503,0.034626,0.054323,-0.093938,0.0060009,0.0040235,0.20338,0.038772,0.039737,-0.055614,0.011262,0.0075959,0.17635,0.042713,0.045564,-0.068441,0.017126,0.011954,0.15786,0.045774,0.051884,-0.074561,0.00041221,0.00022898,0.015427,-0.0054391,0.0079743,-0.027964,0.0015999,0.00092042,0.030079,-0.0029177,0.01334,-0.041683,0.0040243,0.0023815,0.047346,0.0022768,0.018909,-0.05623,2.177e-05,1.2647e-05,0.0062205,-0.0035556,0.00851,-0.018148,0.00022705,0.00013593,0.020641,-0.0028549,0.012176,-0.022378,0.00075801,0.00046827,0.034169,-0.0011881,0.016952,-0.027044,0.41894,74,74,40,1054,3,3,3,0.645
30,-0.0027761,0.4552,0.4611,-0.7338,0.44265,-0.58702,-0.20004,0.78749,7.4204,0.077203,3.2255,0.0020973,5.3038,7.2656,0.53188,11.588,0.011057,0.73381,1.873,1.2388,0.93714,0.76766,0.089186,0.11479,0.13436,0.10007,0.070602,0.050235,0.44076,0.3242,0.17099,0.00063927,0.056763,0.3818,1.1135,0.053675,2.1016,0.4467,0.30009,0.4467,0.68647,1.0517,0.36637,0.98023,0.48025,59,90.661,4497,3.3983e+05,7.4403,56.579,1.2142e+05,4482,4293,0.91765,0.93153,0.16016,0.11993,0.10247,0.49857,58401,22445,0.0017629,0.00070633,0,0.11717,0,0.064408,0.039618,0.0012636,0.056769,0.0045917,1.0606,0.12785,1.1953,0.24168,0.33155,0.2156,0.31886,0.3249,0.10544,0.34174,0.31892,0.087686,20.023,5.8211,15993,46167,45455,0.26034,0.25301,0.1456,0.65251,0.7001,0.19012,0.84749,0.87563,0.17384,0.9278,0.94305,0.15161,0.96263,0.97048,0.13389,0.0070124,0.0063877,0.083066,0.021369,0.044425,-0.02174,0.015926,0.015672,0.089827,0.031516,0.063645,-0.0052429,0.027288,0.027671,0.092554,0.040531,0.080407,0.0056698,0.0042334,0.003858,0.1015,0.020486,0.038935,-0.017473,0.010214,0.010334,0.11316,0.031393,0.05536,0.0031453,0.018132,0.0192,0.11824,0.041291,0.070033,0.019629,0.0026621,0.002448,0.070486,0.010676,0.021524,-0.011704,0.0056517,0.0053268,0.07517,0.015259,0.031284,-0.010851,0.0091632,0.00861,0.076268,0.018903,0.038731,-0.013639,0.00011698,8.1682e-05,0.023648,-0.00061863,0.014557,-0.012911,0.00051013,0.00037202,0.032809,0.00069417,0.021648,-0.019221,0.0015229,0.0012594,0.048566,0.0043506,0.031244,-0.019764,0.48618,74,74,40,1054,3,3,3,0.645
30,-0.0033315,0.17211,0.17668,-0.90728,0.16008,-1.1853,0.30645,-0.2991,3.359,-0.033491,3.3359,6.0946e-06,2.4357,5.658,0.18496,7.3679,0.0070304,0.90742,1.0956,0.63401,0.48311,0.3807,0.10813,0.13439,0.21997,0.13858,0.064022,0.051418,0.28349,0.2836,0.12005,0.047801,0.026071,1.7824,2.6077,2.2949,7.1625,0.25319,0.20879,0.25319,0.67537,0.88179,0.27878,0.54856,0.15059,47,183.85,4238,4.1685e+05,5.4564,34.089,1.1443e+05,29295,26028,0.91243,0.92441,0.32784,0.24833,0.20689,0.7028,90319,44052,0.0011018,0.00049044,0,0.077433,0,0.059791,0.0017475,0.012721,0.00024288,0.014345,0.65389,1.5391,0.42174,0.2133,0.41824,0.24662,0.23288,0.49948,0.2112,0.23661,0.5144,0.20541,48.253,6.6587,14831,59864,58709,0.047749,0.034433,0.040559,0.26429,0.24343,0.11695,0.50775,0.50928,0.15818,0.69267,0.70338,0.1719,0.81204,0.81727,0.17154,0.0046422,0.0034264,0.083516,0.012832,0.037508,-0.058058,0.010761,0.0080722,0.092188,0.020487,0.05,-0.076718,0.019455,0.014836,0.10021,0.029389,0.062791,-0.092995,0.0028904,0.0020534,0.10526,0.014188,0.033544,-0.050122,0.0067997,0.0049868,0.11441,0.021525,0.043662,-0.065519,0.012646,0.0095142,0.12525,0.030793,0.054842,-0.078655,0.0015158,0.0012193,0.060956,0.0036269,0.016051,-0.024558,0.0033336,0.0026698,0.067339,0.0063752,0.021692,-0.033266,0.0058264,0.0046647,0.073653,0.0097676,0.027074,-0.041838,0.00023602,0.00015373,0.072465,0.0028865,0.01758,-0.020724,0.00064351,0.00042483,0.062858,0.0026648,0.022613,-0.025233,0.0010617,0.00070469,0.051422,0.0014014,0.027473,-0.029588,0.49959,74,74,40,1054,3,3,3,0.645
30,-0.0050333,0.10856,0.11823,-0.93897,0.08791,-1.4145,0.50641,-0.18845,2.998,-0.019756,3.3464,6.477e-06,1.4127,4.0452,0.12174,5.1859,0.0049483,0.93907,0.83319,0.42695,0.31234,0.2564,0.1283,0.17483,0.23596,0.15749,0.062066,0.034403,0.20695,0.31448,0.20834,0.047272,0.018082,2.6416,11.248,7.5368,22.014,0.14333,0.082685,0.14333,0.62865,1.038,0.27247,0.44208,0.097136,38,204.39,3638,5.3637e+05,3.7817,16.354,98226,69876,35181,0.9135,0.92754,0.32732,0.24526,0.20916,0.73264,67377,31063,0.0014033,0.0006373,0,0.038527,0,0.042571,0.0053297,0.010995,0.006029,0.0098647,1.0573,1.0912,0.10692,0.21639,0.39783,0.23985,0.25199,0.46579,0.17135,0.25616,0.4805,0.16407,39.065,6.476,13781,47792,46747,0.09451,0.078334,0.070889,0.40899,0.40669,0.15982,0.66169,0.68881,0.18203,0.80991,0.83717,0.17749,0.89636,0.91727,0.1672,0.010499,0.0089725,0.1668,0.043773,0.058885,-0.050485,0.024235,0.021259,0.18333,0.064814,0.083429,-0.05827,0.042548,0.038049,0.19354,0.085417,0.10619,-0.06307,0.0040592,0.003216,0.13053,0.022477,0.038655,-0.042351,0.0084044,0.0067298,0.12487,0.027865,0.048719,-0.054068,0.014333,0.011674,0.12535,0.034764,0.059258,-0.063259,0.0048609,0.0044864,0.17261,0.029744,0.035386,-0.017912,0.011438,0.010943,0.20402,0.047176,0.054552,-0.014036,0.020773,0.020211,0.23188,0.066707,0.073007,-0.011242,0.0015794,0.00127,0.4282,0.04136,0.041694,-0.034666,0.0050124,0.0040652,0.43235,0.057841,0.056734,-0.042866,0.0095987,0.0078804,0.41053,0.070735,0.070595,-0.050494,0.46218,74,74,40,1054,3,3,3,0.645
30,-0.0041686,0.16693,0.1718,-0.90996,0.1518,-1.2205,0.34123,-0.0065218,3.3844,0.0048891,3.3088,7.8154e-05,1.8875,4.4483,0.17971,5.9007,0.0056305,0.91005,1.0138,0.55216,0.43968,0.35375,0.10245,0.12617,0.25833,0.15052,0.0513,0.044929,0.26631,0.27373,0.10952,0.12771,0.0022476,3.2226,3.5275,2.4172,9.6805,0.13604,0.1623,0.1623,0.46895,1.0049,0.27263,0.54041,0.14539,31,325.1,9366,2.8089e+06,5.2826,28.951,2.5288e+05,7263,6318,0.9087,0.91888,0.45788,0.35764,0.29299,0.82994,68677,40898,0.0016603,0.00069941,0,0.059975,0,0.054714,0.000132,0.031546,0.00078857,0.032458,0.043122,1.0591,0.50624,0.22382,0.40713,0.24169,0.25365,0.4667,0.19632,0.26342,0.48416,0.18728,50.57,6.5257,16897,73775,72768,0.08801,0.06876,0.083697,0.367,0.35919,0.18183,0.61962,0.63614,0.21612,0.79592,0.81947,0.22115,0.89964,0.91715,0.21277,0.0065273,0.005028,0.13147,0.025182,0.042969,-0.056053,0.012744,0.0099811,0.12222,0.029334,0.054157,-0.067781,0.020602,0.016453,0.11881,0.034436,0.065042,-0.078049,0.004643,0.0037065,0.1893,0.030636,0.042619,-0.040474,0.008521,0.0070441,0.16052,0.032179,0.049274,-0.043467,0.013306,0.011379,0.14754,0.035285,0.056713,-0.044557,0.0016509,0.0011746,0.074327,0.0050526,0.016039,-0.036571,0.0034433,0.0024376,0.077874,0.0073958,0.022239,-0.047661,0.0056935,0.0040124,0.08058,0.0097841,0.026878,-0.059897,0.00023344,0.00014696,0.080244,0.0029786,0.013366,-0.02502,0.00083355,0.00053411,0.091157,0.0055527,0.020273,-0.033957,0.0017591,0.001162,0.095388,0.007907,0.028138,-0.040156,0.48335,74,74,40,1054,3,3,3,0.645
30,-0.0089579,0.16516,0.17944,-0.90575,0.13031,-1.3797,0.52326,0.0050736,2.5409,0.015133,3.3796,0.0003782,2.1309,4.9063,0.18828,6.3028,0.0060141,0.90577,1.1501,0.53498,0.40802,0.3205,0.10188,0.12037,0.22797,0.19157,0.060377,0.04838,0.24946,0.20825,0.044504,0.03852,0.012227,2.6482,4.1016,4.196,11.249,0.17485,0.16795,0.17485,0.55055,0.64285,0.26627,0.55478,0.15222,28,286.04,7764,2.1398e+06,5.0005,26.016,2.0963e+05,3780,2160,0.90634,0.91431,0.34719,0.28025,0.16883,0.70333,87214,34628,0.0019472,0.00058364,0,0.082379,0,0.052582,0.00032789,0.014721,0.00060282,0.02276,0.55194,0.13634,0.081183,0.21976,0.39645,0.26871,0.24056,0.45148,0.23938,0.25624,0.45163,0.23632,52.385,7.2552,20859,96644,95645,0.054935,0.044403,0.041537,0.30314,0.324,0.11941,0.55123,0.59117,0.15287,0.7245,0.75507,0.16005,0.84249,0.86211,0.15842,0.0081541,0.0066909,0.13058,0.031191,0.042474,-0.042134,0.018779,0.015503,0.1432,0.046536,0.060359,-0.05589,0.033605,0.027664,0.15409,0.06327,0.077999,-0.072041,0.0073298,0.0061208,0.2376,0.048365,0.050801,-0.035736,0.01556,0.013164,0.23305,0.062427,0.065532,-0.043654,0.026099,0.021989,0.23009,0.076268,0.078975,-0.055148,0.00051366,0.00035853,0.018387,-0.0045122,0.0075258,-0.025795,0.0021172,0.0015721,0.038071,-0.00021001,0.01416,-0.032614,0.0050545,0.0039459,0.056876,0.0062078,0.021704,-0.036854,0.00031056,0.00021162,0.084877,0.0048704,0.011866,-0.01858,0.0011431,0.00079346,0.099393,0.008863,0.019154,-0.026682,0.0026473,0.0018527,0.11414,0.014267,0.027436,-0.036445,0.42964,74,74,40,1054,3,3,3,0.645
30,-0.0025918,0.1152,0.11433,-0.94104,0.11037,-1.1161,0.186,0.64913,4.4199,0.10424,3.2373,0.00087639,1.9176,5.5929,0.11733,7.4585,0.0071169,0.94126,0.73617,0.45751,0.36674,0.30654,0.12217,0.2025,0.23378,0.11467,0.047448,0.035104,0.24432,0.30359,0.29008,0.03787,0.29153,6.3567,10.616,4.8447,22.74,0.24004,0.13637,0.24004,0.85089,0.95208,0.37878,0.43329,0.093518,44,96.023,2891,1.9195e+05,6.02,38.639,78057,11232,9018,0.91721,0.93074,0.25644,0.22001,0.070916,0.64952,1.1659e+05,24321,0.001309,0.00051602,0,0.1319,0,0.064425,0.0084098,0.014349,0.010895,0.013194,0.69025,0.93728,0.67796,0.22422,0.37412,0.25643,0.26094,0.40721,0.2267,0.2734,0.42452,0.214,60.965,6.9237,48483,2.2422e+05,2.2383e+05,0.090154,0.060424,0.03958,0.2893,0.22814,0.066169,0.48481,0.43905,0.078065,0.6481,0.63429,0.083132,0.77208,0.77516,0.084297,0.0030709,0.0018971,0.028555,0.0026628,0.025723,-0.041108,0.0084242,0.0053498,0.0373,0.0085658,0.036438,-0.056472,0.017258,0.011933,0.045948,0.016723,0.04749,-0.063521,0.0025324,0.0016321,0.047665,0.0079566,0.027946,-0.033319,0.0065606,0.0044255,0.057054,0.014437,0.035796,-0.043954,0.013463,0.01002,0.068916,0.024067,0.045837,-0.046681,0.00010863,5.0481e-05,0.0022579,-0.00583,0.0036373,-0.015411,0.00040027,0.00018835,0.004179,-0.0067823,0.006495,-0.018161,0.00081502,0.00039556,0.0053251,-0.0076957,0.0085208,-0.022299,0.00042987,0.00021454,0.068215,0.006285,0.020878,-0.025248,0.0014633,0.00073604,0.073877,0.0097748,0.02709,-0.033052,0.0029802,0.0015172,0.074607,0.012835,0.032298,-0.040525,0.38849,74,74,40,1054,3,3,3,0.645
30,-0.005835,0.97154,0.96367,-0.18819,0.96033,-0.19928,0.058908,0.58319,3.174,0.083417,3.2995,1.2513e-07,4.2692,3.349,1.622,4.3732,0.0041729,0.1882,6.0441,3.5829,2.4739,1.7663,0.025361,0.03129,0.081385,0.076589,0.069978,0.073972,0.64143,0.053836,0.52327,0.079058,0.096464,0.098325,0.011391,0.10138,0.96372,0.067849,0.1851,0.1851,0.36817,0.70877,0.20401,2.2736,2.5865,109,31.872,830,10624,5.2128,35.185,22410,11772,10125,0.92003,0.93545,0.21046,0.15894,0.10027,0.6402,26797,14959,0.00087529,0.00040148,0,0.10186,0,0.0868,0.022716,0.089169,0.028576,0.12313,0.5082,0.42432,0.9969,0.21532,0.33815,0.2453,0.2594,0.355,0.1376,0.25736,0.3503,0.13099,16.396,6.6231,20206,50986,50100,0.1984,0.19497,0.088233,0.4512,0.45191,0.10454,0.584,0.57881,0.095257,0.6738,0.66664,0.08755,0.7444,0.73078,0.082329,0.026928,0.044162,0.25364,0.10145,0.1514,0.28194,0.051415,0.079458,0.2306,0.11978,0.17585,0.30251,0.078275,0.11495,0.2111,0.13363,0.19399,0.31027,0.024191,0.04193,0.46123,0.13793,0.19551,0.30226,0.045022,0.074072,0.39661,0.15535,0.21504,0.33056,0.067412,0.10568,0.34956,0.16847,0.22963,0.3446,0.0022346,0.0017911,0.047048,0.0069205,0.017962,-0.02586,0.0045269,0.003779,0.047876,0.0091976,0.02429,-0.026665,0.006888,0.0058861,0.045587,0.010114,0.028131,-0.027224,0.0005027,0.00044138,0.080808,0.0079274,0.021789,-0.011074,0.0018996,0.0016331,0.097146,0.014061,0.032318,-0.017657,0.0042157,0.0035745,0.1069,0.020593,0.043184,-0.024903,0.53563,74,74,40,1054,3,3,3,0.645
30,-0.00097785,0.47902,0.47742,-0.72258,0.47742,-0.72097,-0.0022251,0.51294,5.7991,0.00049859,3.2744,0.00098797,4.1238,5.5345,0.55414,7.3501,0.0070135,0.72264,2.0298,1.2536,0.98987,0.78031,0.083981,0.086214,0.14946,0.11545,0.059719,0.060073,0.44511,0.29971,0.066293,0.023195,0.0023305,0.68064,0.43741,0.029513,1.5391,0.38215,0.23604,0.38215,0.6074,1.1062,0.30627,1.0028,0.45929,69,30.812,1239,22939,7.3703,58.499,33453,5967,5049,0.92475,0.9485,0.06291,0.040643,0.042742,0.39762,22092,15512,0.00082164,0.00045144,0,0.052693,0,0.08046,0.014804,0.03573,0.028123,0.067414,0.19722,2,1.8734,0.19587,0.35518,0.26963,0.20318,0.39486,0.21264,0.19826,0.40644,0.21515,31.73,7.28,10503,15937,13489,0.1643,0.15932,0.043227,0.45605,0.4592,0.062509,0.63151,0.6457,0.060938,0.75693,0.77271,0.058185,0.86748,0.88078,0.056759,0.021433,0.020807,0.11943,0.060244,0.08067,-0.021716,0.035319,0.034116,0.093715,0.059836,0.094765,-0.029568,0.047448,0.045736,0.075705,0.057125,0.10577,-0.035113,0.020083,0.019552,0.22652,0.086723,0.089508,-0.018768,0.031864,0.030828,0.16606,0.082045,0.098269,-0.026389,0.040702,0.039177,0.12486,0.074298,0.10362,-0.033048,0.0013174,0.0012271,0.016409,0.0010739,0.023253,-0.015535,0.0030839,0.0029705,0.019295,0.0027514,0.030688,-0.010312,0.0056083,0.0055898,0.021959,0.0048614,0.037214,-0.0011828,3.2991e-05,2.8273e-05,0.0031373,-0.0018341,0.015364,-0.01842,0.00037104,0.0003179,0.011226,-0.00055778,0.022374,-0.022925,0.0011379,0.00096907,0.017071,0.0011303,0.030615,-0.027376,0.38219,74,74,40,1054,3,3,3,0.645
30,-0.020325,0.9799,0.94686,-0.22856,0.94144,-0.21126,-0.07569,-0.28778,2.7969,-0.091061,3.3547,0.000212,3.3112,2.6649,1.541,3.2341,0.0030801,0.22861,4.1482,3.0113,2.3099,1.7322,0.050803,0.052941,0.079384,0.055816,0.05355,0.064761,0.64274,0.13059,0.0010955,0.11841,0.63953,0.57848,0.096448,0.093649,1.6582,0.21109,0.11685,0.21109,0.46816,0.58605,0.18245,2.1221,2.2167,121,18.471,314,3080.8,3.366,14.678,8478,7749,7452,0.9243,0.94484,0.050619,0.034017,0.036369,0.25908,19079,12000,0.00068981,0.00033952,0,0.060154,0,0.06008,0.0046313,0.020707,0.025185,0.0079442,0.68273,1.2416,0.87539,0.21092,0.32901,0.25751,0.26219,0.30568,0.13675,0.2608,0.30218,0.13345,15.561,6.9529,12046,21947,21071,0.2187,0.21464,0.077381,0.48668,0.48522,0.089709,0.60231,0.60353,0.078163,0.70161,0.70317,0.072529,0.78054,0.78892,0.068681,0.028245,0.032912,0.21167,0.095125,0.11859,0.11876,0.055722,0.062832,0.19884,0.1165,0.14631,0.11724,0.085583,0.09399,0.18364,0.13136,0.16715,0.10735,0.016919,0.02092,0.25664,0.083918,0.10691,0.1293,0.033083,0.039078,0.23187,0.099341,0.12525,0.12663,0.051226,0.058331,0.21133,0.1114,0.14069,0.11567,0.0089045,0.0090235,0.14916,0.04186,0.050612,0.0054251,0.018456,0.019201,0.1553,0.056318,0.069711,0.020965,0.028857,0.030199,0.15195,0.066493,0.083478,0.028435,0.0024225,0.0029694,0.30981,0.044598,0.052949,0.054023,0.0065202,0.007404,0.26529,0.052294,0.062452,0.044313,0.011667,0.012724,0.23538,0.059506,0.073094,0.036433,0.53363,74,74,40,1054,3,3,3,0.645
30,-0.001794,0.39844,0.39502,-0.77756,0.39501,-0.77404,-0.0045382,0.76585,4.2243,0.097736,3.2669,0.0004348,3.3217,4.986,0.44299,6.6912,0.0063847,0.77814,1.7075,1.0852,0.86093,0.66458,0.056824,0.077574,0.22551,0.11187,0.058664,0.064337,0.40522,0.086853,0.010299,0.16045,0.026203,1.0571,0.42992,0.14541,1.9162,0.16154,0.19247,0.19247,0.638,0.65342,0.31019,0.88033,0.37339,40,117.78,3471,3.0758e+05,5.7017,34.647,93717,20304,3915,0.92195,0.94242,0.29741,0.20002,0.19357,0.86367,42024,26114,0.00067262,0.00035716,0,0.061517,0,0.073444,0.0041932,0.0015956,0.0049508,0.025216,2.3209,3.2606,1.159,0.19576,0.31447,0.36511,0.19361,0.25547,0.5143,0.19191,0.24894,0.52587,43.732,9.8579,10275,19874,17505,0.02336,0.019983,0.011118,0.14913,0.13881,0.036977,0.29714,0.28572,0.051869,0.42291,0.4056,0.058808,0.55242,0.53085,0.065385,0.0075622,0.0069842,0.07623,0.022026,0.056289,-0.041141,0.016982,0.016143,0.081513,0.031837,0.075696,-0.036472,0.030026,0.029316,0.086665,0.042733,0.094081,-0.022119,0.0032241,0.0029588,0.065787,0.012589,0.040754,-0.027883,0.0065874,0.0061885,0.062103,0.015148,0.049791,-0.026988,0.011026,0.01053,0.06119,0.018338,0.05903,-0.025053,0.0038215,0.0035675,0.086107,0.017048,0.032628,-0.025428,0.0090524,0.0087699,0.10246,0.027718,0.048536,-0.017,0.017101,0.017211,0.12113,0.04157,0.065326,0.0045927,0.00051656,0.00045785,0.088864,0.0085229,0.030303,-0.021531,0.0015207,0.0013412,0.083231,0.010763,0.037888,-0.026868,0.0026797,0.0023572,0.072722,0.011443,0.044281,-0.032039,0.40637,74,74,40,1054,3,3,3,0.645
30,-0.022943,0.97096,0.95153,-0.2181,0.91649,-0.25995,0.1919,-0.11045,2.5893,-0.062223,3.3628,0.00041254,4.2178,3.3713,1.5622,4.0631,0.003877,0.21811,5.0536,3.5898,2.6661,1.9611,0.032947,0.041866,0.070563,0.053935,0.056196,0.066486,0.67801,0.0020481,0.12347,0.26336,0.79771,0.48884,0.086973,0.11556,1.878,0.046512,0.15286,0.15286,0.27299,0.40652,0.14905,2.1343,2.2248,122,20.574,314,3346.4,3.2723,13.993,8478,8127,7830,0.92375,0.94231,0.041908,0.028616,0.022703,0.21737,17924,11955,0.00077442,0.0004015,0,0.084441,0,0.095666,0.053494,0.017512,0.1298,0.029899,0.0014922,0.33527,0.49652,0.22143,0.32492,0.23868,0.28049,0.30698,0.11947,0.28302,0.2983,0.11273,14.2,6.4444,8325,16260,15300,0.23916,0.24458,0.094726,0.52526,0.53222,0.10838,0.66315,0.67242,0.096333,0.74018,0.75355,0.085653,0.80103,0.81268,0.0789,0.020907,0.023756,0.17538,0.07212,0.09659,0.075884,0.039521,0.044157,0.15786,0.08391,0.118,0.081813,0.058736,0.064751,0.14108,0.090697,0.13505,0.083806,0.015271,0.017966,0.25931,0.079571,0.096878,0.081764,0.027602,0.031948,0.21655,0.086307,0.11079,0.090331,0.040113,0.045645,0.18525,0.089994,0.12257,0.091714,0.003962,0.0041407,0.07429,0.016316,0.032876,0.011815,0.0089115,0.0092258,0.083937,0.024717,0.044864,0.011842,0.014501,0.01496,0.085471,0.030634,0.054048,0.012784,0.0016737,0.00165,0.2396,0.031727,0.037718,-0.0024685,0.0039281,0.0038507,0.17891,0.031751,0.045916,-0.004403,0.0063013,0.0061863,0.14231,0.031619,0.054128,-0.0048044,0.55265,74,74,40,1054,3,3,3,0.645
30,-0.0039314,0.20467,0.20777,-0.88996,0.19269,-1.1297,0.2694,0.81562,3.9812,0.13182,3.2638,0.00031192,1.8068,3.8498,0.21985,4.8919,0.0046678,0.88997,1.2136,0.66077,0.51449,0.40616,0.10116,0.12224,0.22038,0.15256,0.059006,0.051605,0.29304,0.29032,0.12606,0.080727,0.00099026,1.8127,1.9864,1.5036,5.8008,0.14601,0.15307,0.15307,0.45623,0.46581,0.25947,0.60205,0.17985,45,73.733,1428,66713,4.2783,20.764,38556,27108,9072,0.92067,0.93897,0.1893,0.14889,0.049907,0.65634,48843,21576,0.00094111,0.00045691,0,0.080092,0,0.054844,0.001409,0.003357,0.0051802,0.010182,0.47372,0.63888,0.79337,0.20226,0.39196,0.26363,0.22219,0.46053,0.22655,0.21508,0.47816,0.24256,44.027,7.1181,26687,69306,68599,0.073808,0.053525,0.025616,0.36058,0.34863,0.065196,0.59534,0.6069,0.075781,0.73834,0.75706,0.074868,0.82086,0.84605,0.070849,0.013604,0.010614,0.099996,0.040784,0.050598,-0.057188,0.027192,0.02077,0.095178,0.050358,0.064789,-0.079133,0.043139,0.032087,0.090794,0.058485,0.078844,-0.10333,0.012904,0.010193,0.192,0.061877,0.061483,-0.0525,0.024719,0.019271,0.16994,0.071388,0.073925,-0.069459,0.03794,0.028907,0.15353,0.079014,0.08539,-0.08897,0.00057363,0.00034427,0.0094251,-0.0027063,0.0092941,-0.029894,0.0021526,0.0013105,0.017767,-1.962e-05,0.015365,-0.041977,0.0046146,0.0028316,0.023834,0.0030206,0.02172,-0.053711,0.00012623,7.6916e-05,0.015835,-0.00030553,0.0093956,-0.016935,0.00050047,0.00031274,0.019974,0.00046142,0.013559,-0.020279,0.0010705,0.00067871,0.021185,0.00093219,0.019489,-0.024783,0.37017,74,74,40,1054,3,3,3,0.645
30,-0.00077029,0.51284,0.51234,-0.69798,0.51082,-0.73598,0.054441,0.60397,6.3207,0.051613,3.2483,0.001422,4.4702,5.7502,0.60322,7.9364,0.0075729,0.69807,2.2268,1.3864,1.0603,0.79098,0.065365,0.082097,0.14952,0.11118,0.067573,0.074351,0.44992,0.19144,0.048677,0.02882,0.0025967,0.32234,0.10264,0.023393,0.71991,0.31668,0.25699,0.31668,1.5052,1.5742,0.44219,1.0531,0.54514,72,36.625,1563,37085,7.0785,54.892,42201,13851,6183,0.92439,0.94441,0.16503,0.11364,0.09812,0.62639,26447,15220,0.00085104,0.00042445,0,0.11588,0,0.11492,0.055806,0.12213,0.12602,0.26909,0.33618,0.85155,0.75024,0.20277,0.34782,0.25881,0.22932,0.36911,0.18063,0.21915,0.37085,0.18265,17.367,6.9878,10007,18175,17265,0.20052,0.2023,0.068131,0.53665,0.53722,0.094991,0.70393,0.70356,0.087721,0.80576,0.80621,0.079988,0.87592,0.87791,0.074012,0.026378,0.034608,0.18982,0.086444,0.11621,0.18293,0.051051,0.066274,0.17493,0.10359,0.14451,0.22299,0.078641,0.10107,0.16204,0.11709,0.16793,0.25648,0.0090686,0.0082392,0.1321,0.041159,0.059033,-0.031424,0.017616,0.01611,0.11856,0.04795,0.073515,-0.036729,0.026391,0.024059,0.10455,0.051248,0.085533,-0.044277,0.016957,0.026084,0.27276,0.08323,0.1037,0.24985,0.032833,0.049696,0.2653,0.10383,0.13077,0.30353,0.051079,0.076232,0.25828,0.1221,0.15324,0.35172,0.00035248,0.00028513,0.043288,0.0040322,0.021775,-0.022719,0.0019183,0.0016148,0.074953,0.012414,0.032125,-0.030919,0.0051478,0.0044827,0.099732,0.022997,0.044525,-0.033717,0.48803,74,74,40,1054,3,3,3,0.645
30,-0.00041999,0.98341,0.98258,-0.12839,0.98254,-0.12758,-0.0063384,-0.14532,2.7101,-0.04182,3.3535,5.4661e-05,3.5869,2.7155,1.7414,3.4038,0.0032479,0.1284,6.163,3.5741,2.4869,1.8281,0.022476,0.038139,0.075162,0.079368,0.068469,0.067102,0.64928,0.11938,0.14179,0.11582,0.047866,0.089814,0.040798,0.12261,0.67808,0.087455,0.12678,0.12678,0.28412,0.46016,0.13478,2.5289,3.1917,118,27.068,639,8390.8,4.5167,24.806,17253,13311,11421,0.92197,0.94183,0.12366,0.085508,0.074808,0.47409,24187,14957,0.00094516,0.00040518,0,0.056919,0,0.056792,0.00072523,0.077899,0.0015564,0.1326,0.18189,0.18669,0.15409,0.21439,0.34133,0.24838,0.26717,0.34641,0.14325,0.26892,0.3391,0.13256,19.201,6.7062,11559,25259,23915,0.20511,0.21576,0.09348,0.46351,0.48368,0.11005,0.59407,0.60718,0.099302,0.71526,0.72037,0.095242,0.81616,0.8176,0.092504,0.023083,0.03481,0.22281,0.086606,0.12844,0.28592,0.043855,0.06259,0.20157,0.1015,0.1514,0.30008,0.065095,0.088939,0.17991,0.10977,0.16678,0.30152,0.020689,0.032676,0.40425,0.1184,0.15788,0.3035,0.037629,0.056968,0.33971,0.1299,0.1731,0.32763,0.053253,0.078086,0.28299,0.13226,0.18032,0.33879,0.0019336,0.0017361,0.04172,0.0051741,0.020883,-0.018335,0.00472,0.0042717,0.051157,0.010073,0.030458,-0.023042,0.0084967,0.0077659,0.05763,0.015033,0.038862,-0.02623,0.00045967,0.00039761,0.075723,0.0070697,0.027123,-0.017821,0.0017923,0.0016048,0.093937,0.013188,0.038435,-0.01815,0.0041217,0.0037848,0.10711,0.020262,0.049728,-0.018765,0.52451,74,74,40,1054,3,3,3,0.645
30,-0.00052914,0.39611,0.39543,-0.7773,0.39476,-0.80929,0.041156,0.77062,7.2011,-0.0050121,3.2788,0.0010429,4.6834,7.0153,0.44485,10.082,0.0096199,0.77735,1.759,1.1637,0.86396,0.64723,0.077135,0.10909,0.16989,0.10071,0.075061,0.07129,0.39682,0.22695,0.13076,0.047357,0.059594,0.32221,0.22037,0.15726,1.1645,0.18704,0.31066,0.31066,0.68999,1.1121,0.34619,0.88815,0.3918,60,59.217,3124,1.6112e+05,7.5271,57.779,84348,2538,1809,0.9222,0.93987,0.12201,0.087317,0.068409,0.47146,35096,15901,0.0010079,0.00046674,0,0.052921,0,0.059705,0.011923,0.0055546,0.013181,0.0027813,0.018984,0.55923,0.82052,0.22429,0.3336,0.22425,0.29968,0.29322,0.082296,0.31198,0.28609,0.073519,13.553,6.0548,16421,34476,33566,0.30337,0.31014,0.11705,0.66621,0.69945,0.13391,0.8444,0.87324,0.1195,0.92001,0.93803,0.10371,0.96289,0.97233,0.092393,0.0023978,0.0018574,0.019595,-9.8753e-05,0.039073,-0.039062,0.0065057,0.0052435,0.025315,0.0034056,0.053994,-0.05122,0.01329,0.010931,0.031096,0.0085905,0.069003,-0.063705,0.0015589,0.0012188,0.025786,0.0020174,0.030835,-0.031478,0.0046796,0.0038831,0.035765,0.0071108,0.043242,-0.039831,0.010162,0.0086453,0.045715,0.014321,0.057346,-0.047602,0.00083491,0.00063587,0.015251,-0.0013947,0.022074,-0.022972,0.0016991,0.0012722,0.01559,-0.0016587,0.029043,-0.029596,0.002508,0.0018475,0.014401,-0.0025739,0.033839,-0.036333,4.0288e-06,2.7596e-06,0.00056188,-0.0028202,0.013806,-0.023732,0.00012827,8.9128e-05,0.0056912,-0.0028622,0.020196,-0.026814,0.00064823,0.00045865,0.014262,-0.0014553,0.027457,-0.031737,0.50392,74,74,40,1054,3,3,3,0.645
