%!PS-Adobe-3.0 EPSF-3.0
%%Creator: (MATLAB, The Mathworks, Inc. Version 9.2.0.538062 \(R2017a\). Operating System: Mac OS X)
%%Title: /Volumes/LNDG/Projects/StateSwitch/dynamic/data/mri/rest/analyses/C_PLS/C_figures/behavPLS_TotalPow.eps
%%CreationDate: 2018-09-03T16:59:14
%%Pages: (atend)
%%BoundingBox:     5     4   523   355
%%LanguageLevel: 3
%%EndComments
%%BeginProlog
%%BeginResource: procset (Apache XML Graphics Std ProcSet) 1.2 0
%%Version: 1.2 0
%%Copyright: (Copyright 2001-2003,2010 The Apache Software Foundation. License terms: http://www.apache.org/licenses/LICENSE-2.0)
/bd{bind def}bind def
/ld{load def}bd
/GR/grestore ld
/M/moveto ld
/LJ/setlinejoin ld
/C/curveto ld
/f/fill ld
/LW/setlinewidth ld
/GC/setgray ld
/t/show ld
/N/newpath ld
/CT/concat ld
/cp/closepath ld
/S/stroke ld
/L/lineto ld
/CC/setcmykcolor ld
/A/ashow ld
/GS/gsave ld
/RC/setrgbcolor ld
/RM/rmoveto ld
/ML/setmiterlimit ld
/re {4 2 roll M
1 index 0 rlineto
0 exch rlineto
neg 0 rlineto
cp } bd
/_ctm matrix def
/_tm matrix def
/BT { _ctm currentmatrix pop matrix _tm copy pop 0 0 moveto } bd
/ET { _ctm setmatrix } bd
/iTm { _ctm setmatrix _tm concat } bd
/Tm { _tm astore pop iTm 0 0 moveto } bd
/ux 0.0 def
/uy 0.0 def
/F {
  /Tp exch def
  /Tf exch def
  Tf findfont Tp scalefont setfont
  /cf Tf def  /cs Tp def
} bd
/ULS {currentpoint /uy exch def /ux exch def} bd
/ULE {
  /Tcx currentpoint pop def
  gsave
  newpath
  cf findfont cs scalefont dup
  /FontMatrix get 0 get /Ts exch def /FontInfo get dup
  /UnderlinePosition get Ts mul /To exch def
  /UnderlineThickness get Ts mul /Tt exch def
  ux uy To add moveto  Tcx uy To add lineto
  Tt setlinewidth stroke
  grestore
} bd
/OLE {
  /Tcx currentpoint pop def
  gsave
  newpath
  cf findfont cs scalefont dup
  /FontMatrix get 0 get /Ts exch def /FontInfo get dup
  /UnderlinePosition get Ts mul /To exch def
  /UnderlineThickness get Ts mul /Tt exch def
  ux uy To add cs add moveto Tcx uy To add cs add lineto
  Tt setlinewidth stroke
  grestore
} bd
/SOE {
  /Tcx currentpoint pop def
  gsave
  newpath
  cf findfont cs scalefont dup
  /FontMatrix get 0 get /Ts exch def /FontInfo get dup
  /UnderlinePosition get Ts mul /To exch def
  /UnderlineThickness get Ts mul /Tt exch def
  ux uy To add cs 10 mul 26 idiv add moveto Tcx uy To add cs 10 mul 26 idiv add lineto
  Tt setlinewidth stroke
  grestore
} bd
/QT {
/Y22 exch store
/X22 exch store
/Y21 exch store
/X21 exch store
currentpoint
/Y21 load 2 mul add 3 div exch
/X21 load 2 mul add 3 div exch
/X21 load 2 mul /X22 load add 3 div
/Y21 load 2 mul /Y22 load add 3 div
/X22 load /Y22 load curveto
} bd
/SSPD {
dup length /d exch dict def
{
/v exch def
/k exch def
currentpagedevice k known {
/cpdv currentpagedevice k get def
v cpdv ne {
/upd false def
/nullv v type /nulltype eq def
/nullcpdv cpdv type /nulltype eq def
nullv nullcpdv or
{
/upd true def
} {
/sametype v type cpdv type eq def
sametype {
v type /arraytype eq {
/vlen v length def
/cpdvlen cpdv length def
vlen cpdvlen eq {
0 1 vlen 1 sub {
/i exch def
/obj v i get def
/cpdobj cpdv i get def
obj cpdobj ne {
/upd true def
exit
} if
} for
} {
/upd true def
} ifelse
} {
v type /dicttype eq {
v {
/dv exch def
/dk exch def
/cpddv cpdv dk get def
dv cpddv ne {
/upd true def
exit
} if
} forall
} {
/upd true def
} ifelse
} ifelse
} if
} ifelse
upd true eq {
d k v put
} if
} if
} if
} forall
d length 0 gt {
d setpagedevice
} if
} bd
/RE { % /NewFontName [NewEncodingArray] /FontName RE -
  findfont dup length dict begin
  {
    1 index /FID ne
    {def} {pop pop} ifelse
  } forall
  /Encoding exch def
  /FontName 1 index def
  currentdict definefont pop
  end
} bind def
%%EndResource
%%BeginResource: procset (Apache XML Graphics EPS ProcSet) 1.0 0
%%Version: 1.0 0
%%Copyright: (Copyright 2002-2003 The Apache Software Foundation. License terms: http://www.apache.org/licenses/LICENSE-2.0)
/BeginEPSF { %def
/b4_Inc_state save def         % Save state for cleanup
/dict_count countdictstack def % Count objects on dict stack
/op_count count 1 sub def      % Count objects on operand stack
userdict begin                 % Push userdict on dict stack
/showpage { } def              % Redefine showpage, { } = null proc
0 setgray 0 setlinecap         % Prepare graphics state
1 setlinewidth 0 setlinejoin
10 setmiterlimit [ ] 0 setdash newpath
/languagelevel where           % If level not equal to 1 then
{pop languagelevel             % set strokeadjust and
1 ne                           % overprint to their defaults.
{false setstrokeadjust false setoverprint
} if
} if
} bd
/EndEPSF { %def
count op_count sub {pop} repeat            % Clean up stacks
countdictstack dict_count sub {end} repeat
b4_Inc_state restore
} bd
%%EndResource
%FOPBeginFontDict
%%IncludeResource: font Courier-Bold
%%IncludeResource: font Helvetica
%%IncludeResource: font Courier-BoldOblique
%%IncludeResource: font Courier-Oblique
%%IncludeResource: font Times-Roman
%%IncludeResource: font Helvetica-BoldOblique
%%IncludeResource: font Helvetica-Bold
%%IncludeResource: font Helvetica-Oblique
%%IncludeResource: font Times-BoldItalic
%%IncludeResource: font Courier
%%IncludeResource: font Times-Italic
%%IncludeResource: font Times-Bold
%%IncludeResource: font Symbol
%%IncludeResource: font ZapfDingbats
%FOPEndFontDict
%%BeginResource: encoding WinAnsiEncoding
/WinAnsiEncoding [
/.notdef /.notdef /.notdef /.notdef /.notdef
/.notdef /.notdef /.notdef /.notdef /.notdef
/.notdef /.notdef /.notdef /.notdef /.notdef
/.notdef /.notdef /.notdef /.notdef /.notdef
/.notdef /.notdef /.notdef /.notdef /.notdef
/.notdef /.notdef /.notdef /.notdef /.notdef
/.notdef /.notdef /space /exclam /quotedbl
/numbersign /dollar /percent /ampersand /quotesingle
/parenleft /parenright /asterisk /plus /comma
/hyphen /period /slash /zero /one
/two /three /four /five /six
/seven /eight /nine /colon /semicolon
/less /equal /greater /question /at
/A /B /C /D /E
/F /G /H /I /J
/K /L /M /N /O
/P /Q /R /S /T
/U /V /W /X /Y
/Z /bracketleft /backslash /bracketright /asciicircum
/underscore /quoteleft /a /b /c
/d /e /f /g /h
/i /j /k /l /m
/n /o /p /q /r
/s /t /u /v /w
/x /y /z /braceleft /bar
/braceright /asciitilde /bullet /Euro /bullet
/quotesinglbase /florin /quotedblbase /ellipsis /dagger
/daggerdbl /circumflex /perthousand /Scaron /guilsinglleft
/OE /bullet /Zcaron /bullet /bullet
/quoteleft /quoteright /quotedblleft /quotedblright /bullet
/endash /emdash /asciitilde /trademark /scaron
/guilsinglright /oe /bullet /zcaron /Ydieresis
/space /exclamdown /cent /sterling /currency
/yen /brokenbar /section /dieresis /copyright
/ordfeminine /guillemotleft /logicalnot /sfthyphen /registered
/macron /degree /plusminus /twosuperior /threesuperior
/acute /mu /paragraph /middot /cedilla
/onesuperior /ordmasculine /guillemotright /onequarter /onehalf
/threequarters /questiondown /Agrave /Aacute /Acircumflex
/Atilde /Adieresis /Aring /AE /Ccedilla
/Egrave /Eacute /Ecircumflex /Edieresis /Igrave
/Iacute /Icircumflex /Idieresis /Eth /Ntilde
/Ograve /Oacute /Ocircumflex /Otilde /Odieresis
/multiply /Oslash /Ugrave /Uacute /Ucircumflex
/Udieresis /Yacute /Thorn /germandbls /agrave
/aacute /acircumflex /atilde /adieresis /aring
/ae /ccedilla /egrave /eacute /ecircumflex
/edieresis /igrave /iacute /icircumflex /idieresis
/eth /ntilde /ograve /oacute /ocircumflex
/otilde /odieresis /divide /oslash /ugrave
/uacute /ucircumflex /udieresis /yacute /thorn
/ydieresis
] def
%%EndResource
%FOPBeginFontReencode
/Courier-Bold findfont
dup length dict begin
  {1 index /FID ne {def} {pop pop} ifelse} forall
  /Encoding WinAnsiEncoding def
  currentdict
end
/Courier-Bold exch definefont pop
/Helvetica findfont
dup length dict begin
  {1 index /FID ne {def} {pop pop} ifelse} forall
  /Encoding WinAnsiEncoding def
  currentdict
end
/Helvetica exch definefont pop
/Courier-BoldOblique findfont
dup length dict begin
  {1 index /FID ne {def} {pop pop} ifelse} forall
  /Encoding WinAnsiEncoding def
  currentdict
end
/Courier-BoldOblique exch definefont pop
/Courier-Oblique findfont
dup length dict begin
  {1 index /FID ne {def} {pop pop} ifelse} forall
  /Encoding WinAnsiEncoding def
  currentdict
end
/Courier-Oblique exch definefont pop
/Times-Roman findfont
dup length dict begin
  {1 index /FID ne {def} {pop pop} ifelse} forall
  /Encoding WinAnsiEncoding def
  currentdict
end
/Times-Roman exch definefont pop
/Helvetica-BoldOblique findfont
dup length dict begin
  {1 index /FID ne {def} {pop pop} ifelse} forall
  /Encoding WinAnsiEncoding def
  currentdict
end
/Helvetica-BoldOblique exch definefont pop
/Helvetica-Bold findfont
dup length dict begin
  {1 index /FID ne {def} {pop pop} ifelse} forall
  /Encoding WinAnsiEncoding def
  currentdict
end
/Helvetica-Bold exch definefont pop
/Helvetica-Oblique findfont
dup length dict begin
  {1 index /FID ne {def} {pop pop} ifelse} forall
  /Encoding WinAnsiEncoding def
  currentdict
end
/Helvetica-Oblique exch definefont pop
/Times-BoldItalic findfont
dup length dict begin
  {1 index /FID ne {def} {pop pop} ifelse} forall
  /Encoding WinAnsiEncoding def
  currentdict
end
/Times-BoldItalic exch definefont pop
/Courier findfont
dup length dict begin
  {1 index /FID ne {def} {pop pop} ifelse} forall
  /Encoding WinAnsiEncoding def
  currentdict
end
/Courier exch definefont pop
/Times-Italic findfont
dup length dict begin
  {1 index /FID ne {def} {pop pop} ifelse} forall
  /Encoding WinAnsiEncoding def
  currentdict
end
/Times-Italic exch definefont pop
/Times-Bold findfont
dup length dict begin
  {1 index /FID ne {def} {pop pop} ifelse} forall
  /Encoding WinAnsiEncoding def
  currentdict
end
/Times-Bold exch definefont pop
%FOPEndFontReencode
%%EndProlog
%%Page: 1 1
%%PageBoundingBox: 0 0 576 360
%%BeginPageSetup
[1 0 0 -1 0 360] CT
%%EndPageSetup
GS
1 GC
N
0 0 576 360 re
f
GR
GS
1 GC
N
0 0 576 360 re
f
GR
GS
1 GC
N
90 297 M
521 297 L
521 55 L
90 55 L
cp
f
GR
GS
0.149 GC
2 setlinecap
1 LJ
0.5 LW
N
90 297 M
521 297 L
S
GR
GS
0.149 GC
2 setlinecap
1 LJ
0.5 LW
N
90 297 M
90 292.69 L
S
GR
GS
0.149 GC
2 setlinecap
1 LJ
0.5 LW
N
176.2 297 M
176.2 292.69 L
S
GR
GS
0.149 GC
2 setlinecap
1 LJ
0.5 LW
N
262.4 297 M
262.4 292.69 L
S
GR
GS
0.149 GC
2 setlinecap
1 LJ
0.5 LW
N
348.6 297 M
348.6 292.69 L
S
GR
GS
0.149 GC
2 setlinecap
1 LJ
0.5 LW
N
434.8 297 M
434.8 292.69 L
S
GR
GS
0.149 GC
2 setlinecap
1 LJ
0.5 LW
N
521 297 M
521 292.69 L
S
GR
GS
[1 0 0 1 90 303] CT
0.149 GC
/Helvetica 20 F
GS
[1 0 0 1 0 0] CT
-6 20 moveto 
1 -1 scale
(0) t 
GR
GR
GS
[1 0 0 1 176.2 303] CT
0.149 GC
/Helvetica 20 F
GS
[1 0 0 1 0 0] CT
-14 20 moveto 
1 -1 scale
(0.2) t 
GR
GR
GS
[1 0 0 1 262.39999 303] CT
0.149 GC
/Helvetica 20 F
GS
[1 0 0 1 0 0] CT
-14 20 moveto 
1 -1 scale
(0.4) t 
GR
GR
GS
[1 0 0 1 348.60001 303] CT
0.149 GC
/Helvetica 20 F
GS
[1 0 0 1 0 0] CT
-14 20 moveto 
1 -1 scale
(0.6) t 
GR
GR
GS
[1 0 0 1 434.80002 303] CT
0.149 GC
/Helvetica 20 F
GS
[1 0 0 1 0 0] CT
-14 20 moveto 
1 -1 scale
(0.8) t 
GR
GR
GS
[1 0 0 1 521 303] CT
0.149 GC
/Helvetica 20 F
GS
[1 0 0 1 0 0] CT
-6 20 moveto 
1 -1 scale
(1) t 
GR
GR
GS
[1 0 0 1 305.50021 329] CT
0.149 GC
/Helvetica 20 F
GS
[1 0 0 1 0 0] CT
-76.5 20 moveto 
1 -1 scale
(Total EEG Power) t 
GR
GR
GS
[1 0 0 1 466 355] CT
0.149 GC
N
2.938 -0.578 M
2.938 -0.734 3.031 -0.859 QT
7.203 -5 L
3.031 -9.156 L
2.938 -9.266 2.938 -9.422 QT
2.938 -9.578 3.055 -9.703 QT
3.172 -9.828 3.344 -9.828 QT
3.484 -9.828 3.641 -9.703 QT
7.781 -5.563 L
11.906 -9.703 L
12.078 -9.828 12.203 -9.828 QT
12.359 -9.828 12.477 -9.711 QT
12.594 -9.594 12.594 -9.422 QT
12.594 -9.266 12.5 -9.156 QT
8.344 -5 L
12.5 -0.859 L
12.594 -0.734 12.594 -0.578 QT
12.594 -0.406 12.477 -0.289 QT
12.359 -0.172 12.203 -0.172 QT
12.047 -0.172 11.906 -0.328 QT
7.781 -4.438 L
3.641 -0.328 L
3.5 -0.172 3.344 -0.172 QT
3.172 -0.172 3.055 -0.305 QT
2.938 -0.438 2.938 -0.578 QT
cp
f
GR
GS
[1 0 0 1 482 355] CT
0.149 GC
/Helvetica 20 F
GS
[1 0 0 1 0 0] CT
0 0 moveto 
1 -1 scale
(10) t 
GR
GR
GS
[1 0 0 1 505 345] CT
0.149 GC
/Helvetica 16 F
GS
[1 0 0 1 0 0] CT
0 0 moveto 
1 -1 scale
(-8) t 
GR
GR
GS
0.149 GC
2 setlinecap
1 LJ
0.5 LW
N
90 297 M
90 55 L
S
GR
GS
0.149 GC
2 setlinecap
1 LJ
0.5 LW
N
90 297 M
94.31 297 L
S
GR
GS
0.149 GC
2 setlinecap
1 LJ
0.5 LW
N
90 236.5 M
94.31 236.5 L
S
GR
GS
0.149 GC
2 setlinecap
1 LJ
0.5 LW
N
90 176 M
94.31 176 L
S
GR
GS
0.149 GC
2 setlinecap
1 LJ
0.5 LW
N
90 115.5 M
94.31 115.5 L
S
GR
GS
0.149 GC
2 setlinecap
1 LJ
0.5 LW
N
90 55 M
94.31 55 L
S
GR
GS
[1 0 0 1 84 297] CT
0.149 GC
/Helvetica 20 F
GS
[1 0 0 1 0 0] CT
-45 7.5 moveto 
1 -1 scale
(4000) t 
GR
GR
GS
[1 0 0 1 84 236.5] CT
0.149 GC
/Helvetica 20 F
GS
[1 0 0 1 0 0] CT
-45 7.5 moveto 
1 -1 scale
(6000) t 
GR
GR
GS
[1 0 0 1 84 176] CT
0.149 GC
/Helvetica 20 F
GS
[1 0 0 1 0 0] CT
-45 7.5 moveto 
1 -1 scale
(8000) t 
GR
GR
GS
[1 0 0 1 84 115.5] CT
0.149 GC
/Helvetica 20 F
GS
[1 0 0 1 0 0] CT
-56 7.5 moveto 
1 -1 scale
(10000) t 
GR
GR
GS
[1 0 0 1 84 55] CT
0.149 GC
/Helvetica 20 F
GS
[1 0 0 1 0 0] CT
-56 7.5 moveto 
1 -1 scale
(12000) t 
GR
GR
GS
[0 -1 1 0 25 175.99988] CT
0.149 GC
/Helvetica 20 F
GS
[1 0 0 1 0 0] CT
-94.5 -5 moveto 
1 -1 scale
(BOLD SD Brainscore) t 
GR
GR
GS
[1 0 0 1 305.50027 50.00001] CT
/Helvetica-Bold 20 F
GS
[1 0 0 1 0 0] CT
-153 -30 moveto 
1 -1 scale
(Higher BOLD variance is related) t 
GR
GR
GS
[1 0 0 1 305.50027 50.00001] CT
/Helvetica-Bold 20 F
GS
[1 0 0 1 0 0] CT
-126 -5 moveto 
1 -1 scale
( to higher total EEG power) t 
GR
GR
GS
[1 0 0 1 265.49866 125.69511] CT
0 0.447 0.741 RC
N
3.036 -0.5 M
3.036 -2.453 1.453 -4.036 -0.5 -4.036 C
-2.453 -4.036 -4.036 -2.453 -4.036 -0.5 C
-4.036 1.453 -2.453 3.036 -0.5 3.036 C
1.453 3.036 3.036 1.453 3.036 -0.5 C
f
GR
GS
[1 0 0 1 182.41682 270.80844] CT
0 0.447 0.741 RC
N
/f626426221{3.036 -0.5 M
3.036 -2.453 1.453 -4.036 -0.5 -4.036 C
-2.453 -4.036 -4.036 -2.453 -4.036 -0.5 C
-4.036 1.453 -2.453 3.036 -0.5 3.036 C
1.453 3.036 3.036 1.453 3.036 -0.5 C}def
f626426221
f
GR
GS
[1 0 0 1 189.57126 165.02588] CT
0 0.447 0.741 RC
N
f626426221
f
GR
GS
[1 0 0 1 245.40111 248.11162] CT
0 0.447 0.741 RC
N
f626426221
f
GR
GS
[1 0 0 1 199.06766 144.41301] CT
0 0.447 0.741 RC
N
f626426221
f
GR
GS
[1 0 0 1 160.79736 269.76959] CT
0 0.447 0.741 RC
N
f626426221
f
GR
GS
[1 0 0 1 225.92003 231.39474] CT
0 0.447 0.741 RC
N
f626426221
f
GR
GS
[1 0 0 1 379.37473 70.77408] CT
0 0.447 0.741 RC
N
f626426221
f
GR
GS
[1 0 0 1 203.57178 203.23555] CT
0 0.447 0.741 RC
N
f626426221
f
GR
GS
[1 0 0 1 226.27573 210.95763] CT
0 0.447 0.741 RC
N
f626426221
f
GR
GS
[1 0 0 1 483.17795 77.28701] CT
0 0.447 0.741 RC
N
f626426221
f
GR
GS
[1 0 0 1 272.44852 172.18614] CT
0 0.447 0.741 RC
N
f626426221
f
GR
GS
[1 0 0 1 383.2933 212.88527] CT
0 0.447 0.741 RC
N
f626426221
f
GR
GS
[1 0 0 1 224.19435 168.78104] CT
0 0.447 0.741 RC
N
f626426221
f
GR
GS
[1 0 0 1 267.89224 224.42302] CT
0 0.447 0.741 RC
N
f626426221
f
GR
GS
[1 0 0 1 162.43649 220.68546] CT
0 0.447 0.741 RC
N
f626426221
f
GR
GS
[1 0 0 1 275.25751 227.30589] CT
0 0.447 0.741 RC
N
f626426221
f
GR
GS
[1 0 0 1 188.98453 279.16461] CT
0 0.447 0.741 RC
N
f626426221
f
GR
GS
[1 0 0 1 219.1039 292.50516] CT
0 0.447 0.741 RC
N
f626426221
f
GR
GS
[1 0 0 1 377.1973 162.36719] CT
0 0.447 0.741 RC
N
f626426221
f
GR
GS
[1 0 0 1 207.00232 167.57668] CT
0 0.447 0.741 RC
N
f626426221
f
GR
GS
[1 0 0 1 248.85535 74.60097] CT
0 0.447 0.741 RC
N
f626426221
f
GR
GS
[1 0 0 1 202.92403 242.66669] CT
0 0.447 0.741 RC
N
f626426221
f
GR
GS
[1 0 0 1 304.12805 274.22498] CT
0 0.447 0.741 RC
N
f626426221
f
GR
GS
[1 0 0 1 207.97414 243.9324] CT
0 0.447 0.741 RC
N
f626426221
f
GR
GS
[1 0 0 1 129.91241 259.96338] CT
0 0.447 0.741 RC
N
f626426221
f
GR
GS
[1 0 0 1 198.96465 232.49475] CT
0 0.447 0.741 RC
N
f626426221
f
GR
GS
[1 0 0 1 354.07718 256.35864] CT
0 0.447 0.741 RC
N
f626426221
f
GR
GS
[1 0 0 1 302.31613 160.78519] CT
0 0.447 0.741 RC
N
f626426221
f
GR
GS
[1 0 0 1 232.78999 211.60918] CT
0 0.447 0.741 RC
N
f626426221
f
GR
GS
[1 0 0 1 179.65381 248.96104] CT
0 0.447 0.741 RC
N
f626426221
f
GR
GS
[1 0 0 1 247.14687 150.66185] CT
0 0.447 0.741 RC
N
f626426221
f
GR
GS
[1 0 0 1 254.28935 198.49139] CT
0 0.447 0.741 RC
N
f626426221
f
GR
GS
[1 0 0 1 210.59642 226.756] CT
0 0.447 0.741 RC
N
f626426221
f
GR
GS
[1 0 0 1 145.27257 261.94238] CT
0 0.447 0.741 RC
N
f626426221
f
GR
GS
[1 0 0 1 208.77045 282.47833] CT
0 0.447 0.741 RC
N
f626426221
f
GR
GS
[1 0 0 1 135.513 257.22559] CT
0 0.447 0.741 RC
N
f626426221
f
GR
GS
[1 0 0 1 205.63605 248.92004] CT
0 0.447 0.741 RC
N
f626426221
f
GR
GS
[1 0 0 1 235.17622 257.26187] CT
0 0.447 0.741 RC
N
f626426221
f
GR
GS
[1 0 0 1 225.28746 275.16168] CT
0 0.447 0.741 RC
N
f626426221
f
GR
GS
0.749 GC
1 LJ
0.5 LW
N
90 275.34 M
521 94.528 L
S
GR
GS
[1 0 0 1 438 272.5] CT
/Helvetica 20 F
GS
[1 0 0 1 0 0] CT
0 7.5 moveto 
1 -1 scale
(r = 0.53) t 
GR
GR
GS
0.749 GC
1 LJ
0.5 LW
N
405 272.5 M
435 272.5 L
S
GR
%%Trailer
%%Pages: 1
%%EOF
