%!PS-Adobe-3.0 EPSF-3.0
%%Creator: (MATLAB, The Mathworks, Inc. Version 9.2.0.538062 \(R2017a\). Operating System: Mac OS X)
%%Title: /Volumes/LNDG/Projects/StateSwitch/dynamic/data/mri/rest/analyses/C_PLS/C_figures/behavPLS_TotalPow_YA_OA.eps
%%CreationDate: 2018-09-03T17:22:54
%%Pages: (atend)
%%BoundingBox:     5    33   535   812
%%LanguageLevel: 3
%%EndComments
%%BeginProlog
%%BeginResource: procset (Apache XML Graphics Std ProcSet) 1.2 0
%%Version: 1.2 0
%%Copyright: (Copyright 2001-2003,2010 The Apache Software Foundation. License terms: http://www.apache.org/licenses/LICENSE-2.0)
/bd{bind def}bind def
/ld{load def}bd
/GR/grestore ld
/M/moveto ld
/LJ/setlinejoin ld
/C/curveto ld
/f/fill ld
/LW/setlinewidth ld
/GC/setgray ld
/t/show ld
/N/newpath ld
/CT/concat ld
/cp/closepath ld
/S/stroke ld
/L/lineto ld
/CC/setcmykcolor ld
/A/ashow ld
/GS/gsave ld
/RC/setrgbcolor ld
/RM/rmoveto ld
/ML/setmiterlimit ld
/re {4 2 roll M
1 index 0 rlineto
0 exch rlineto
neg 0 rlineto
cp } bd
/_ctm matrix def
/_tm matrix def
/BT { _ctm currentmatrix pop matrix _tm copy pop 0 0 moveto } bd
/ET { _ctm setmatrix } bd
/iTm { _ctm setmatrix _tm concat } bd
/Tm { _tm astore pop iTm 0 0 moveto } bd
/ux 0.0 def
/uy 0.0 def
/F {
  /Tp exch def
  /Tf exch def
  Tf findfont Tp scalefont setfont
  /cf Tf def  /cs Tp def
} bd
/ULS {currentpoint /uy exch def /ux exch def} bd
/ULE {
  /Tcx currentpoint pop def
  gsave
  newpath
  cf findfont cs scalefont dup
  /FontMatrix get 0 get /Ts exch def /FontInfo get dup
  /UnderlinePosition get Ts mul /To exch def
  /UnderlineThickness get Ts mul /Tt exch def
  ux uy To add moveto  Tcx uy To add lineto
  Tt setlinewidth stroke
  grestore
} bd
/OLE {
  /Tcx currentpoint pop def
  gsave
  newpath
  cf findfont cs scalefont dup
  /FontMatrix get 0 get /Ts exch def /FontInfo get dup
  /UnderlinePosition get Ts mul /To exch def
  /UnderlineThickness get Ts mul /Tt exch def
  ux uy To add cs add moveto Tcx uy To add cs add lineto
  Tt setlinewidth stroke
  grestore
} bd
/SOE {
  /Tcx currentpoint pop def
  gsave
  newpath
  cf findfont cs scalefont dup
  /FontMatrix get 0 get /Ts exch def /FontInfo get dup
  /UnderlinePosition get Ts mul /To exch def
  /UnderlineThickness get Ts mul /Tt exch def
  ux uy To add cs 10 mul 26 idiv add moveto Tcx uy To add cs 10 mul 26 idiv add lineto
  Tt setlinewidth stroke
  grestore
} bd
/QT {
/Y22 exch store
/X22 exch store
/Y21 exch store
/X21 exch store
currentpoint
/Y21 load 2 mul add 3 div exch
/X21 load 2 mul add 3 div exch
/X21 load 2 mul /X22 load add 3 div
/Y21 load 2 mul /Y22 load add 3 div
/X22 load /Y22 load curveto
} bd
/SSPD {
dup length /d exch dict def
{
/v exch def
/k exch def
currentpagedevice k known {
/cpdv currentpagedevice k get def
v cpdv ne {
/upd false def
/nullv v type /nulltype eq def
/nullcpdv cpdv type /nulltype eq def
nullv nullcpdv or
{
/upd true def
} {
/sametype v type cpdv type eq def
sametype {
v type /arraytype eq {
/vlen v length def
/cpdvlen cpdv length def
vlen cpdvlen eq {
0 1 vlen 1 sub {
/i exch def
/obj v i get def
/cpdobj cpdv i get def
obj cpdobj ne {
/upd true def
exit
} if
} for
} {
/upd true def
} ifelse
} {
v type /dicttype eq {
v {
/dv exch def
/dk exch def
/cpddv cpdv dk get def
dv cpddv ne {
/upd true def
exit
} if
} forall
} {
/upd true def
} ifelse
} ifelse
} if
} ifelse
upd true eq {
d k v put
} if
} if
} if
} forall
d length 0 gt {
d setpagedevice
} if
} bd
/RE { % /NewFontName [NewEncodingArray] /FontName RE -
  findfont dup length dict begin
  {
    1 index /FID ne
    {def} {pop pop} ifelse
  } forall
  /Encoding exch def
  /FontName 1 index def
  currentdict definefont pop
  end
} bind def
%%EndResource
%%BeginResource: procset (Apache XML Graphics EPS ProcSet) 1.0 0
%%Version: 1.0 0
%%Copyright: (Copyright 2002-2003 The Apache Software Foundation. License terms: http://www.apache.org/licenses/LICENSE-2.0)
/BeginEPSF { %def
/b4_Inc_state save def         % Save state for cleanup
/dict_count countdictstack def % Count objects on dict stack
/op_count count 1 sub def      % Count objects on operand stack
userdict begin                 % Push userdict on dict stack
/showpage { } def              % Redefine showpage, { } = null proc
0 setgray 0 setlinecap         % Prepare graphics state
1 setlinewidth 0 setlinejoin
10 setmiterlimit [ ] 0 setdash newpath
/languagelevel where           % If level not equal to 1 then
{pop languagelevel             % set strokeadjust and
1 ne                           % overprint to their defaults.
{false setstrokeadjust false setoverprint
} if
} if
} bd
/EndEPSF { %def
count op_count sub {pop} repeat            % Clean up stacks
countdictstack dict_count sub {end} repeat
b4_Inc_state restore
} bd
%%EndResource
%FOPBeginFontDict
%%IncludeResource: font Courier-Bold
%%IncludeResource: font Helvetica
%%IncludeResource: font Courier-BoldOblique
%%IncludeResource: font Courier-Oblique
%%IncludeResource: font Times-Roman
%%IncludeResource: font Helvetica-BoldOblique
%%IncludeResource: font Helvetica-Bold
%%IncludeResource: font Helvetica-Oblique
%%IncludeResource: font Times-BoldItalic
%%IncludeResource: font Courier
%%IncludeResource: font Times-Italic
%%IncludeResource: font Times-Bold
%%IncludeResource: font Symbol
%%IncludeResource: font ZapfDingbats
%FOPEndFontDict
%%BeginResource: encoding WinAnsiEncoding
/WinAnsiEncoding [
/.notdef /.notdef /.notdef /.notdef /.notdef
/.notdef /.notdef /.notdef /.notdef /.notdef
/.notdef /.notdef /.notdef /.notdef /.notdef
/.notdef /.notdef /.notdef /.notdef /.notdef
/.notdef /.notdef /.notdef /.notdef /.notdef
/.notdef /.notdef /.notdef /.notdef /.notdef
/.notdef /.notdef /space /exclam /quotedbl
/numbersign /dollar /percent /ampersand /quotesingle
/parenleft /parenright /asterisk /plus /comma
/hyphen /period /slash /zero /one
/two /three /four /five /six
/seven /eight /nine /colon /semicolon
/less /equal /greater /question /at
/A /B /C /D /E
/F /G /H /I /J
/K /L /M /N /O
/P /Q /R /S /T
/U /V /W /X /Y
/Z /bracketleft /backslash /bracketright /asciicircum
/underscore /quoteleft /a /b /c
/d /e /f /g /h
/i /j /k /l /m
/n /o /p /q /r
/s /t /u /v /w
/x /y /z /braceleft /bar
/braceright /asciitilde /bullet /Euro /bullet
/quotesinglbase /florin /quotedblbase /ellipsis /dagger
/daggerdbl /circumflex /perthousand /Scaron /guilsinglleft
/OE /bullet /Zcaron /bullet /bullet
/quoteleft /quoteright /quotedblleft /quotedblright /bullet
/endash /emdash /asciitilde /trademark /scaron
/guilsinglright /oe /bullet /zcaron /Ydieresis
/space /exclamdown /cent /sterling /currency
/yen /brokenbar /section /dieresis /copyright
/ordfeminine /guillemotleft /logicalnot /sfthyphen /registered
/macron /degree /plusminus /twosuperior /threesuperior
/acute /mu /paragraph /middot /cedilla
/onesuperior /ordmasculine /guillemotright /onequarter /onehalf
/threequarters /questiondown /Agrave /Aacute /Acircumflex
/Atilde /Adieresis /Aring /AE /Ccedilla
/Egrave /Eacute /Ecircumflex /Edieresis /Igrave
/Iacute /Icircumflex /Idieresis /Eth /Ntilde
/Ograve /Oacute /Ocircumflex /Otilde /Odieresis
/multiply /Oslash /Ugrave /Uacute /Ucircumflex
/Udieresis /Yacute /Thorn /germandbls /agrave
/aacute /acircumflex /atilde /adieresis /aring
/ae /ccedilla /egrave /eacute /ecircumflex
/edieresis /igrave /iacute /icircumflex /idieresis
/eth /ntilde /ograve /oacute /ocircumflex
/otilde /odieresis /divide /oslash /ugrave
/uacute /ucircumflex /udieresis /yacute /thorn
/ydieresis
] def
%%EndResource
%FOPBeginFontReencode
/Courier-Bold findfont
dup length dict begin
  {1 index /FID ne {def} {pop pop} ifelse} forall
  /Encoding WinAnsiEncoding def
  currentdict
end
/Courier-Bold exch definefont pop
/Helvetica findfont
dup length dict begin
  {1 index /FID ne {def} {pop pop} ifelse} forall
  /Encoding WinAnsiEncoding def
  currentdict
end
/Helvetica exch definefont pop
/Courier-BoldOblique findfont
dup length dict begin
  {1 index /FID ne {def} {pop pop} ifelse} forall
  /Encoding WinAnsiEncoding def
  currentdict
end
/Courier-BoldOblique exch definefont pop
/Courier-Oblique findfont
dup length dict begin
  {1 index /FID ne {def} {pop pop} ifelse} forall
  /Encoding WinAnsiEncoding def
  currentdict
end
/Courier-Oblique exch definefont pop
/Times-Roman findfont
dup length dict begin
  {1 index /FID ne {def} {pop pop} ifelse} forall
  /Encoding WinAnsiEncoding def
  currentdict
end
/Times-Roman exch definefont pop
/Helvetica-BoldOblique findfont
dup length dict begin
  {1 index /FID ne {def} {pop pop} ifelse} forall
  /Encoding WinAnsiEncoding def
  currentdict
end
/Helvetica-BoldOblique exch definefont pop
/Helvetica-Bold findfont
dup length dict begin
  {1 index /FID ne {def} {pop pop} ifelse} forall
  /Encoding WinAnsiEncoding def
  currentdict
end
/Helvetica-Bold exch definefont pop
/Helvetica-Oblique findfont
dup length dict begin
  {1 index /FID ne {def} {pop pop} ifelse} forall
  /Encoding WinAnsiEncoding def
  currentdict
end
/Helvetica-Oblique exch definefont pop
/Times-BoldItalic findfont
dup length dict begin
  {1 index /FID ne {def} {pop pop} ifelse} forall
  /Encoding WinAnsiEncoding def
  currentdict
end
/Times-BoldItalic exch definefont pop
/Courier findfont
dup length dict begin
  {1 index /FID ne {def} {pop pop} ifelse} forall
  /Encoding WinAnsiEncoding def
  currentdict
end
/Courier exch definefont pop
/Times-Italic findfont
dup length dict begin
  {1 index /FID ne {def} {pop pop} ifelse} forall
  /Encoding WinAnsiEncoding def
  currentdict
end
/Times-Italic exch definefont pop
/Times-Bold findfont
dup length dict begin
  {1 index /FID ne {def} {pop pop} ifelse} forall
  /Encoding WinAnsiEncoding def
  currentdict
end
/Times-Bold exch definefont pop
%FOPEndFontReencode
%%EndProlog
%%Page: 1 1
%%PageBoundingBox: 0 0 576 840
%%BeginPageSetup
[1 0 0 -1 0 840] CT
%%EndPageSetup
GS
1 GC
N
0 0 576 840 re
f
GR
GS
1 GC
N
0 0 576 840 re
f
GR
GS
1 GC
N
90 350 M
521 350 L
521 78 L
90 78 L
cp
f
GR
GS
0.149 GC
2 setlinecap
1 LJ
0.5 LW
N
90 350 M
521 350 L
S
GR
GS
0.149 GC
2 setlinecap
1 LJ
0.5 LW
N
90 350 M
90 345.69 L
S
GR
GS
0.149 GC
2 setlinecap
1 LJ
0.5 LW
N
176.2 350 M
176.2 345.69 L
S
GR
GS
0.149 GC
2 setlinecap
1 LJ
0.5 LW
N
262.4 350 M
262.4 345.69 L
S
GR
GS
0.149 GC
2 setlinecap
1 LJ
0.5 LW
N
348.6 350 M
348.6 345.69 L
S
GR
GS
0.149 GC
2 setlinecap
1 LJ
0.5 LW
N
434.8 350 M
434.8 345.69 L
S
GR
GS
0.149 GC
2 setlinecap
1 LJ
0.5 LW
N
521 350 M
521 345.69 L
S
GR
GS
[1 0 0 1 90 356] CT
0.149 GC
/Helvetica 20 F
GS
[1 0 0 1 0 0] CT
-6 20 moveto 
1 -1 scale
(0) t 
GR
GR
GS
[1 0 0 1 176.2 356] CT
0.149 GC
/Helvetica 20 F
GS
[1 0 0 1 0 0] CT
-14 20 moveto 
1 -1 scale
(0.2) t 
GR
GR
GS
[1 0 0 1 262.39999 356] CT
0.149 GC
/Helvetica 20 F
GS
[1 0 0 1 0 0] CT
-14 20 moveto 
1 -1 scale
(0.4) t 
GR
GR
GS
[1 0 0 1 348.60001 356] CT
0.149 GC
/Helvetica 20 F
GS
[1 0 0 1 0 0] CT
-14 20 moveto 
1 -1 scale
(0.6) t 
GR
GR
GS
[1 0 0 1 434.80002 356] CT
0.149 GC
/Helvetica 20 F
GS
[1 0 0 1 0 0] CT
-14 20 moveto 
1 -1 scale
(0.8) t 
GR
GR
GS
[1 0 0 1 521 356] CT
0.149 GC
/Helvetica 20 F
GS
[1 0 0 1 0 0] CT
-6 20 moveto 
1 -1 scale
(1) t 
GR
GR
GS
[1 0 0 1 305.50021 382] CT
0.149 GC
/Helvetica 20 F
GS
[1 0 0 1 0 0] CT
-76.5 20 moveto 
1 -1 scale
(Total EEG Power) t 
GR
GR
GS
[1 0 0 1 466 408] CT
0.149 GC
N
2.938 -0.578 M
2.938 -0.734 3.031 -0.859 QT
7.203 -5 L
3.031 -9.156 L
2.938 -9.266 2.938 -9.422 QT
2.938 -9.578 3.055 -9.703 QT
3.172 -9.828 3.344 -9.828 QT
3.484 -9.828 3.641 -9.703 QT
7.781 -5.563 L
11.906 -9.703 L
12.078 -9.828 12.203 -9.828 QT
12.359 -9.828 12.477 -9.711 QT
12.594 -9.594 12.594 -9.422 QT
12.594 -9.266 12.5 -9.156 QT
8.344 -5 L
12.5 -0.859 L
12.594 -0.734 12.594 -0.578 QT
12.594 -0.406 12.477 -0.289 QT
12.359 -0.172 12.203 -0.172 QT
12.047 -0.172 11.906 -0.328 QT
7.781 -4.438 L
3.641 -0.328 L
3.5 -0.172 3.344 -0.172 QT
3.172 -0.172 3.055 -0.305 QT
2.938 -0.438 2.938 -0.578 QT
cp
f
GR
GS
[1 0 0 1 482 408] CT
0.149 GC
/Helvetica 20 F
GS
[1 0 0 1 0 0] CT
0 0 moveto 
1 -1 scale
(10) t 
GR
GR
GS
[1 0 0 1 505 398] CT
0.149 GC
/Helvetica 16 F
GS
[1 0 0 1 0 0] CT
0 0 moveto 
1 -1 scale
(-8) t 
GR
GR
GS
0.149 GC
2 setlinecap
1 LJ
0.5 LW
N
90 350 M
90 78 L
S
GR
GS
0.149 GC
2 setlinecap
1 LJ
0.5 LW
N
90 350 M
94.31 350 L
S
GR
GS
0.149 GC
2 setlinecap
1 LJ
0.5 LW
N
90 295.6 M
94.31 295.6 L
S
GR
GS
0.149 GC
2 setlinecap
1 LJ
0.5 LW
N
90 241.2 M
94.31 241.2 L
S
GR
GS
0.149 GC
2 setlinecap
1 LJ
0.5 LW
N
90 186.8 M
94.31 186.8 L
S
GR
GS
0.149 GC
2 setlinecap
1 LJ
0.5 LW
N
90 132.4 M
94.31 132.4 L
S
GR
GS
0.149 GC
2 setlinecap
1 LJ
0.5 LW
N
90 78 M
94.31 78 L
S
GR
GS
[1 0 0 1 84 350] CT
0.149 GC
/Helvetica 20 F
GS
[1 0 0 1 0 0] CT
-45 7.5 moveto 
1 -1 scale
(4000) t 
GR
GR
GS
[1 0 0 1 84 295.60001] CT
0.149 GC
/Helvetica 20 F
GS
[1 0 0 1 0 0] CT
-45 7.5 moveto 
1 -1 scale
(6000) t 
GR
GR
GS
[1 0 0 1 84 241.2] CT
0.149 GC
/Helvetica 20 F
GS
[1 0 0 1 0 0] CT
-45 7.5 moveto 
1 -1 scale
(8000) t 
GR
GR
GS
[1 0 0 1 84 186.79999] CT
0.149 GC
/Helvetica 20 F
GS
[1 0 0 1 0 0] CT
-56 7.5 moveto 
1 -1 scale
(10000) t 
GR
GR
GS
[1 0 0 1 84 132.39999] CT
0.149 GC
/Helvetica 20 F
GS
[1 0 0 1 0 0] CT
-56 7.5 moveto 
1 -1 scale
(12000) t 
GR
GR
GS
[1 0 0 1 84 78] CT
0.149 GC
/Helvetica 20 F
GS
[1 0 0 1 0 0] CT
-56 7.5 moveto 
1 -1 scale
(14000) t 
GR
GR
GS
[0 -1 1 0 25 213.99988] CT
0.149 GC
/Helvetica 20 F
GS
[1 0 0 1 0 0] CT
-94.5 -5 moveto 
1 -1 scale
(BOLD SD Brainscore) t 
GR
GR
GS
[1 0 0 1 305.50027 73.00002] CT
/Helvetica-Bold 20 F
GS
[1 0 0 1 0 0] CT
-172 -30 moveto 
1 -1 scale
(YA: Higher BOLD variance is related) t 
GR
GR
GS
[1 0 0 1 305.50027 73.00002] CT
/Helvetica-Bold 20 F
GS
[1 0 0 1 0 0] CT
-126 -5 moveto 
1 -1 scale
( to higher total EEG power) t 
GR
GR
GS
[1 0 0 1 265.49866 186.57709] CT
0 0.447 0.741 RC
N
3.036 -0.5 M
3.036 -2.453 1.453 -4.036 -0.5 -4.036 C
-2.453 -4.036 -4.036 -2.453 -4.036 -0.5 C
-4.036 1.453 -2.453 3.036 -0.5 3.036 C
1.453 3.036 3.036 1.453 3.036 -0.5 C
f
GR
GS
[1 0 0 1 182.41682 320.19989] CT
0 0.447 0.741 RC
N
/f626426221{3.036 -0.5 M
3.036 -2.453 1.453 -4.036 -0.5 -4.036 C
-2.453 -4.036 -4.036 -2.453 -4.036 -0.5 C
-4.036 1.453 -2.453 3.036 -0.5 3.036 C
1.453 3.036 3.036 1.453 3.036 -0.5 C}def
f626426221
f
GR
GS
[1 0 0 1 189.57126 220.97319] CT
0 0.447 0.741 RC
N
f626426221
f
GR
GS
[1 0 0 1 245.40111 299.80414] CT
0 0.447 0.741 RC
N
f626426221
f
GR
GS
[1 0 0 1 199.06766 199.64948] CT
0 0.447 0.741 RC
N
f626426221
f
GR
GS
[1 0 0 1 160.79736 319.12888] CT
0 0.447 0.741 RC
N
f626426221
f
GR
GS
[1 0 0 1 225.92003 285.10886] CT
0 0.447 0.741 RC
N
f626426221
f
GR
GS
[1 0 0 1 379.37473 138.38072] CT
0 0.447 0.741 RC
N
f626426221
f
GR
GS
[1 0 0 1 203.57178 255.31172] CT
0 0.447 0.741 RC
N
f626426221
f
GR
GS
[1 0 0 1 226.27573 264.90305] CT
0 0.447 0.741 RC
N
f626426221
f
GR
GS
[1 0 0 1 483.17795 149.12218] CT
0 0.447 0.741 RC
N
f626426221
f
GR
GS
[1 0 0 1 272.44852 230.39029] CT
0 0.447 0.741 RC
N
f626426221
f
GR
GS
[1 0 0 1 383.2933 269.72906] CT
0 0.447 0.741 RC
N
f626426221
f
GR
GS
[1 0 0 1 224.19435 222.90651] CT
0 0.447 0.741 RC
N
f626426221
f
GR
GS
[1 0 0 1 267.89224 278.26825] CT
0 0.447 0.741 RC
N
f626426221
f
GR
GS
[1 0 0 1 162.43649 272.42694] CT
0 0.447 0.741 RC
N
f626426221
f
GR
GS
[1 0 0 1 275.25751 280.53796] CT
0 0.447 0.741 RC
N
f626426221
f
GR
GS
[1 0 0 1 188.98453 328.45078] CT
0 0.447 0.741 RC
N
f626426221
f
GR
GS
[1 0 0 1 219.1039 339.78903] CT
0 0.447 0.741 RC
N
f626426221
f
GR
GS
[1 0 0 1 377.1973 222.62949] CT
0 0.447 0.741 RC
N
f626426221
f
GR
GS
[1 0 0 1 207.00232 221.78853] CT
0 0.447 0.741 RC
N
f626426221
f
GR
GS
[1 0 0 1 248.85535 132.39471] CT
0 0.447 0.741 RC
N
f626426221
f
GR
GS
[1 0 0 1 202.92403 294.16946] CT
0 0.447 0.741 RC
N
f626426221
f
GR
GS
[1 0 0 1 304.12805 325.11313] CT
0 0.447 0.741 RC
N
f626426221
f
GR
GS
[1 0 0 1 207.97414 294.6152] CT
0 0.447 0.741 RC
N
f626426221
f
GR
GS
[1 0 0 1 129.91241 309.07999] CT
0 0.447 0.741 RC
N
f626426221
f
GR
GS
[1 0 0 1 198.96465 283.47784] CT
0 0.447 0.741 RC
N
f626426221
f
GR
GS
[1 0 0 1 354.07718 308.26337] CT
0 0.447 0.741 RC
N
f626426221
f
GR
GS
[1 0 0 1 302.31613 218.73364] CT
0 0.447 0.741 RC
N
f626426221
f
GR
GS
[1 0 0 1 232.78999 265.41614] CT
0 0.447 0.741 RC
N
f626426221
f
GR
GS
[1 0 0 1 179.65381 298.63138] CT
0 0.447 0.741 RC
N
f626426221
f
GR
GS
[1 0 0 1 247.14687 207.39638] CT
0 0.447 0.741 RC
N
f626426221
f
GR
GS
[1 0 0 1 254.28935 252.60013] CT
0 0.447 0.741 RC
N
f626426221
f
GR
GS
[1 0 0 1 210.59642 279.04279] CT
0 0.447 0.741 RC
N
f626426221
f
GR
GS
[1 0 0 1 145.27257 310.04688] CT
0 0.447 0.741 RC
N
f626426221
f
GR
GS
[1 0 0 1 208.77045 332.49316] CT
0 0.447 0.741 RC
N
f626426221
f
GR
GS
[1 0 0 1 135.513 306.20786] CT
0 0.447 0.741 RC
N
f626426221
f
GR
GS
[1 0 0 1 205.63605 299.38013] CT
0 0.447 0.741 RC
N
f626426221
f
GR
GS
[1 0 0 1 235.17622 308.12183] CT
0 0.447 0.741 RC
N
f626426221
f
GR
GS
[1 0 0 1 225.28746 324.51752] CT
0 0.447 0.741 RC
N
f626426221
f
GR
GS
0.749 GC
1 LJ
0.5 LW
N
90 321.026 M
521 163.214 L
S
GR
GS
[1 0 0 1 449 325.5] CT
/Helvetica 20 F
GS
[1 0 0 1 0 0] CT
0 7.5 moveto 
1 -1 scale
(r = 0.5) t 
GR
GR
GS
0.749 GC
1 LJ
0.5 LW
N
416 325.5 M
446 325.5 L
S
GR
GS
1 GC
N
/f-2128339184{90 748 M
521 748 L
521 476 L
90 476 L
cp}def
f-2128339184
f
GR
GS
0.149 GC
2 setlinecap
1 LJ
0.5 LW
N
90 748 M
521 748 L
S
GR
GS
0.149 GC
2 setlinecap
1 LJ
0.5 LW
N
90 748 M
90 743.69 L
S
GR
GS
0.149 GC
2 setlinecap
1 LJ
0.5 LW
N
161.833 748 M
161.833 743.69 L
S
GR
GS
0.149 GC
2 setlinecap
1 LJ
0.5 LW
N
233.667 748 M
233.667 743.69 L
S
GR
GS
0.149 GC
2 setlinecap
1 LJ
0.5 LW
N
305.5 748 M
305.5 743.69 L
S
GR
GS
0.149 GC
2 setlinecap
1 LJ
0.5 LW
N
377.333 748 M
377.333 743.69 L
S
GR
GS
0.149 GC
2 setlinecap
1 LJ
0.5 LW
N
449.167 748 M
449.167 743.69 L
S
GR
GS
0.149 GC
2 setlinecap
1 LJ
0.5 LW
N
521 748 M
521 743.69 L
S
GR
GS
[1 0 0 1 90 754] CT
0.149 GC
/Helvetica 20 F
GS
[1 0 0 1 0 0] CT
-6 20 moveto 
1 -1 scale
(0) t 
GR
GR
GS
[1 0 0 1 161.83333 754] CT
0.149 GC
/Helvetica 20 F
GS
[1 0 0 1 0 0] CT
-14 20 moveto 
1 -1 scale
(0.2) t 
GR
GR
GS
[1 0 0 1 233.66667 754] CT
0.149 GC
/Helvetica 20 F
GS
[1 0 0 1 0 0] CT
-14 20 moveto 
1 -1 scale
(0.4) t 
GR
GR
GS
[1 0 0 1 305.5 754] CT
0.149 GC
/Helvetica 20 F
GS
[1 0 0 1 0 0] CT
-14 20 moveto 
1 -1 scale
(0.6) t 
GR
GR
GS
[1 0 0 1 377.33334 754] CT
0.149 GC
/Helvetica 20 F
GS
[1 0 0 1 0 0] CT
-14 20 moveto 
1 -1 scale
(0.8) t 
GR
GR
GS
[1 0 0 1 449.16666 754] CT
0.149 GC
/Helvetica 20 F
GS
[1 0 0 1 0 0] CT
-6 20 moveto 
1 -1 scale
(1) t 
GR
GR
GS
[1 0 0 1 521 754] CT
0.149 GC
/Helvetica 20 F
GS
[1 0 0 1 0 0] CT
-14 20 moveto 
1 -1 scale
(1.2) t 
GR
GR
GS
[1 0 0 1 305.50021 780] CT
0.149 GC
/Helvetica 20 F
GS
[1 0 0 1 0 0] CT
-76.5 20 moveto 
1 -1 scale
(Total EEG Power) t 
GR
GR
GS
[1 0 0 1 466 806] CT
0.149 GC
N
/f682067884{2.938 -0.578 M
2.938 -0.734 3.031 -0.859 QT
7.203 -5 L
3.031 -9.156 L
2.938 -9.266 2.938 -9.422 QT
2.938 -9.578 3.055 -9.703 QT
3.172 -9.828 3.344 -9.828 QT
3.484 -9.828 3.641 -9.703 QT
7.781 -5.563 L
11.906 -9.703 L
12.078 -9.828 12.203 -9.828 QT
12.359 -9.828 12.477 -9.711 QT
12.594 -9.594 12.594 -9.422 QT
12.594 -9.266 12.5 -9.156 QT
8.344 -5 L
12.5 -0.859 L
12.594 -0.734 12.594 -0.578 QT
12.594 -0.406 12.477 -0.289 QT
12.359 -0.172 12.203 -0.172 QT
12.047 -0.172 11.906 -0.328 QT
7.781 -4.438 L
3.641 -0.328 L
3.5 -0.172 3.344 -0.172 QT
3.172 -0.172 3.055 -0.305 QT
2.938 -0.438 2.938 -0.578 QT
cp}def
f682067884
f
GR
GS
[1 0 0 1 482 806] CT
0.149 GC
/Helvetica 20 F
GS
[1 0 0 1 0 0] CT
0 0 moveto 
1 -1 scale
(10) t 
GR
GR
GS
[1 0 0 1 505 796] CT
0.149 GC
/Helvetica 16 F
GS
[1 0 0 1 0 0] CT
0 0 moveto 
1 -1 scale
(-8) t 
GR
GR
GS
0.149 GC
2 setlinecap
1 LJ
0.5 LW
N
90 748 M
90 476 L
S
GR
GS
0.149 GC
2 setlinecap
1 LJ
0.5 LW
N
90 748 M
94.31 748 L
S
GR
GS
0.149 GC
2 setlinecap
1 LJ
0.5 LW
N
90 680 M
94.31 680 L
S
GR
GS
0.149 GC
2 setlinecap
1 LJ
0.5 LW
N
90 612 M
94.31 612 L
S
GR
GS
0.149 GC
2 setlinecap
1 LJ
0.5 LW
N
90 544 M
94.31 544 L
S
GR
GS
0.149 GC
2 setlinecap
1 LJ
0.5 LW
N
90 476 M
94.31 476 L
S
GR
GS
[1 0 0 1 84 748] CT
0.149 GC
/Helvetica 20 F
GS
[1 0 0 1 0 0] CT
-45 7.5 moveto 
1 -1 scale
(2000) t 
GR
GR
GS
[1 0 0 1 84 680] CT
0.149 GC
/Helvetica 20 F
GS
[1 0 0 1 0 0] CT
-45 7.5 moveto 
1 -1 scale
(4000) t 
GR
GR
GS
[1 0 0 1 84 612] CT
0.149 GC
/Helvetica 20 F
GS
[1 0 0 1 0 0] CT
-45 7.5 moveto 
1 -1 scale
(6000) t 
GR
GR
GS
[1 0 0 1 84 544] CT
0.149 GC
/Helvetica 20 F
GS
[1 0 0 1 0 0] CT
-45 7.5 moveto 
1 -1 scale
(8000) t 
GR
GR
GS
[1 0 0 1 84 476] CT
0.149 GC
/Helvetica 20 F
GS
[1 0 0 1 0 0] CT
-56 7.5 moveto 
1 -1 scale
(10000) t 
GR
GR
GS
[0 -1 1 0 25 611.99988] CT
0.149 GC
/Helvetica 20 F
GS
[1 0 0 1 0 0] CT
-94.5 -5 moveto 
1 -1 scale
(BOLD SD Brainscore) t 
GR
GR
GS
[1 0 0 1 305.50027 471] CT
/Helvetica-Bold 20 F
GS
[1 0 0 1 0 0] CT
-173 -30 moveto 
1 -1 scale
(OA: Higher BOLD variance is related) t 
GR
GR
GS
[1 0 0 1 305.50027 471] CT
/Helvetica-Bold 20 F
GS
[1 0 0 1 0 0] CT
-122.5 -5 moveto 
1 -1 scale
( to lower total EEG power) t 
GR
GR
GS
[1 0 0 1 168.81827 523.28363] CT
0 0.447 0.741 RC
N
f626426221
f
GR
GS
[1 0 0 1 206.86821 629.35498] CT
0 0.447 0.741 RC
N
f626426221
f
GR
GS
[1 0 0 1 188.02325 542.63257] CT
0 0.447 0.741 RC
N
f626426221
f
GR
GS
[1 0 0 1 145.00264 603.9458] CT
0 0.447 0.741 RC
N
f626426221
f
GR
GS
[1 0 0 1 142.33784 487.62067] CT
0 0.447 0.741 RC
N
f626426221
f
GR
GS
[1 0 0 1 149.4239 639.63007] CT
0 0.447 0.741 RC
N
f626426221
f
GR
GS
[1 0 0 1 167.18176 645.37317] CT
0 0.447 0.741 RC
N
f626426221
f
GR
GS
[1 0 0 1 195.69507 721.37891] CT
0 0.447 0.741 RC
N
f626426221
f
GR
GS
[1 0 0 1 160.43825 594.39502] CT
0 0.447 0.741 RC
N
f626426221
f
GR
GS
[1 0 0 1 138.86427 593.901] CT
0 0.447 0.741 RC
N
f626426221
f
GR
GS
[1 0 0 1 379.09149 659.49036] CT
0 0.447 0.741 RC
N
f626426221
f
GR
GS
[1 0 0 1 142.91354 576.5553] CT
0 0.447 0.741 RC
N
f626426221
f
GR
GS
[1 0 0 1 161.0134 613.92609] CT
0 0.447 0.741 RC
N
f626426221
f
GR
GS
[1 0 0 1 214.72501 610.70557] CT
0 0.447 0.741 RC
N
f626426221
f
GR
GS
[1 0 0 1 200.42758 580.48206] CT
0 0.447 0.741 RC
N
f626426221
f
GR
GS
[1 0 0 1 166.36511 638.44446] CT
0 0.447 0.741 RC
N
f626426221
f
GR
GS
[1 0 0 1 121.48193 633.72876] CT
0 0.447 0.741 RC
N
f626426221
f
GR
GS
[1 0 0 1 159.23196 601.48047] CT
0 0.447 0.741 RC
N
f626426221
f
GR
GS
[1 0 0 1 479.62329 655.36761] CT
0 0.447 0.741 RC
N
f626426221
f
GR
GS
[1 0 0 1 319.47888 666.89661] CT
0 0.447 0.741 RC
N
f626426221
f
GR
GS
[1 0 0 1 232.22684 567.04291] CT
0 0.447 0.741 RC
N
f626426221
f
GR
GS
[1 0 0 1 146.76672 642.02887] CT
0 0.447 0.741 RC
N
f626426221
f
GR
GS
[1 0 0 1 222.49252 658.93958] CT
0 0.447 0.741 RC
N
f626426221
f
GR
GS
[1 0 0 1 160.71906 615.93774] CT
0 0.447 0.741 RC
N
f626426221
f
GR
GS
[1 0 0 1 162.46968 643.89832] CT
0 0.447 0.741 RC
N
f626426221
f
GR
GS
[1 0 0 1 150.50981 684.44037] CT
0 0.447 0.741 RC
N
f626426221
f
GR
GS
[1 0 0 1 242.89111 627.74176] CT
0 0.447 0.741 RC
N
f626426221
f
GR
GS
[1 0 0 1 159.34456 604.12653] CT
0 0.447 0.741 RC
N
f626426221
f
GR
GS
[1 0 0 1 164.60423 611.04657] CT
0 0.447 0.741 RC
N
f626426221
f
GR
GS
[1 0 0 1 225.48485 593.68689] CT
0 0.447 0.741 RC
N
f626426221
f
GR
GS
[1 0 0 1 191.35521 562.08411] CT
0 0.447 0.741 RC
N
f626426221
f
GR
GS
[1 0 0 1 197.84802 595.02069] CT
0 0.447 0.741 RC
N
f626426221
f
GR
GS
[1 0 0 1 295.03055 682.23004] CT
0 0.447 0.741 RC
N
f626426221
f
GR
GS
[1 0 0 1 209.66571 707.09259] CT
0 0.447 0.741 RC
N
f626426221
f
GR
GS
[1 0 0 1 235.91103 586.80646] CT
0 0.447 0.741 RC
N
f626426221
f
GR
GS
[1 0 0 1 269.04272 695.11597] CT
0 0.447 0.741 RC
N
f626426221
f
GR
GS
[1 0 0 1 120.80911 605.28485] CT
0 0.447 0.741 RC
N
f626426221
f
GR
GS
[1 0 0 1 200.84598 631.61871] CT
0 0.447 0.741 RC
N
f626426221
f
GR
GS
[1 0 0 1 302.20636 692.17712] CT
0 0.447 0.741 RC
N
f626426221
f
GR
GS
[1 0 0 1 166.80309 682.83551] CT
0 0.447 0.741 RC
N
f626426221
f
GR
GS
[1 0 0 1 196.98088 657.3797] CT
0 0.447 0.741 RC
N
f626426221
f
GR
GS
[1 0 0 1 176.30257 661.31293] CT
0 0.447 0.741 RC
N
f626426221
f
GR
GS
[1 0 0 1 127.68668 710.09308] CT
0 0.447 0.741 RC
N
f626426221
f
GR
GS
[1 0 0 1 107.96248 570.70184] CT
0 0.447 0.741 RC
N
f626426221
f
GR
GS
[1 0 0 1 177.13664 632.98798] CT
0 0.447 0.741 RC
N
f626426221
f
GR
GS
[1 0 0 1 151.4675 657.604] CT
0 0.447 0.741 RC
N
f626426221
f
GR
GS
[1 0 0 1 290.29764 657.97711] CT
0 0.447 0.741 RC
N
f626426221
f
GR
GS
[1 0 0 1 212.53995 638.07642] CT
0 0.447 0.741 RC
N
f626426221
f
GR
GS
[1 0 0 1 179.93753 623.76556] CT
0 0.447 0.741 RC
N
f626426221
f
GR
GS
[1 0 0 1 420.62994 687.15643] CT
0 0.447 0.741 RC
N
f626426221
f
GR
GS
[1 0 0 1 126.35488 667.53961] CT
0 0.447 0.741 RC
N
f626426221
f
GR
GS
0.749 GC
1 LJ
0.5 LW
N
90 605.843 M
521 695.564 L
S
GR
GS
[1 0 0 1 430 723.5] CT
/Helvetica 20 F
GS
[1 0 0 1 0 0] CT
0 7.5 moveto 
1 -1 scale
(r = -0.32) t 
GR
GR
GS
0.749 GC
1 LJ
0.5 LW
N
397 723.5 M
427 723.5 L
S
GR
%%Trailer
%%Pages: 1
%%EOF
